##TITLE=1H_LR-758-R4-KAO-CR4-MeOH
 CDCl3
 8 sc, 
 4.10.2023
##JCAMPDX= 6.0         $$ Bruker NMR JCAMP-DX V2.0
##DATA TYPE= NMR FID
##DATA CLASS= NTUPLES
##ORIGIN= UXNMR, Bruker Analytische Messtechnik GmbH
##OWNER= root
$$ XWIN-NMR		Version 3.5
$$ Wed Oct  4 14:19:20 2023 Russian Standard Time (UT+4h)  she@DPX200
##.OBSERVE FREQUENCY= 200.13135
##.OBSERVE NUCLEUS= ^1H
##.DELAY= (6, 6)
##.ACQUISITION MODE= SIMULTANEOUS
##.ACQUISITION SCHEME= undefined
##.AVERAGES= 8
##.DIGITISER RES= 18
##SPECTROMETER/DATA SYSTEM= spect
##.PULSE SEQUENCE= zg30
##.SOLVENT NAME= D2O
##.SHIFT REFERENCE= (INTERNAL, D2O, 0, 15.7039)
##AUDIT TRAIL= $$ (NUMBER, WHEN, WHO, WHERE, WHAT)
$$ ##TITLE= Audit trail, XWIN-NMR		Version 3.5
$$ ##JCAMPDX= 5.01
$$ ##ORIGIN= Bruker BioSpin GmbH
$$ ##OWNER= she
$$ F:/spectra/data/she/nmr/H-F/1/audita.txt
$$ ##AUDIT TRAIL=  $$ (NUMBER, WHEN, WHO, WHERE, WHAT)
(   1,<2023-10-04 14:18:09.62 +0400>,<she>,<DPX200>,
      <created by zg, POWCHK disabled, PULCHK disabled
       configuration hash MD5:
       00 E9 B6 7A A2 85 ED C7 34 08 36 98 17 FE 4E 26
       data hash MD5: 16K
       FE B9 23 0B 0B 4C 8F 8D 92 91 23 4F 00 F0 F5 6B>)
$$ ##END=
$$ 
$$ hash MD5
$$ 5A 83 CF 9D 6D 63 50 4F 88 41 93 0E A1 1C CD 9B
##$RELAX= 
##$RELAX= 
##$RELAX= 
##$RELAX= 
##$RELAX= 
##$RELAX= 
$$ Bruker specific parameters
$$ --------------------------
##$DU= <F:/spectra>
##$EXPNO= 1
##$NAME= <H-F>
##$PROCNO= 1
##$TYPE= <nmr>
##$USER= <she>
##$AMP= (0..31)
100 100 100 100 100 100 100 100 100 100 100 100 100 100 100 100 100 100 
100 100 100 100 100 100 100 100 100 100 100 100 100 100 
##$AQSEQ= 0
##$AQ_mod= 1
##$AUNM= <au_zg>
##$AUTOPOS= <>
##$BF1= 200.13
##$BF2= 200.13
##$BF3= 200.13
##$BF4= 200.13
##$BF5= 200.13
##$BF6= 200.13
##$BF7= 200.13
##$BF8= 200.13
##$BYTORDA= 1
##$CFDGTYP= 0
##$CFRGTYP= 5
##$CHEMSTR= <none>
##$CNST= (0..31)
1 1 145 1 1 1 1 1 1 1 1 1 1 1 1 1 1 1 1 1 1 1 1 1 1 1 1 1 1 1 1 1 
##$CPDPRG= <>
##$CPDPRG1= <>
##$CPDPRG2= <>
##$CPDPRG3= <>
##$CPDPRG4= <mlev>
##$CPDPRG5= <mlev>
##$CPDPRG6= <mlev>
##$CPDPRG7= <mlev>
##$CPDPRG8= <mlev>
##$CPDPRGB= <>
##$CPDPRGT= <>
##$D= (0..31)
0 1.2 0 0 0 0 0 0 0 0.06 0 0.03 0 0 0 0 0.0002 0 0 0 0 0 0 0 0 0 0 0 0 
0 0 0 
##$DATE= 1696414689
##$DBL= (0..7)
120 120 120 120 120 120 120 120 
##$DBP= (0..7)
150 150 150 150 150 150 150 150 
##$DBP07= 0
##$DBPNAM0= <>
##$DBPNAM1= <>
##$DBPNAM2= <>
##$DBPNAM3= <>
##$DBPNAM4= <>
##$DBPNAM5= <>
##$DBPNAM6= <>
##$DBPNAM7= <>
##$DBPOAL= (0..7)
0.5 0.5 0.5 0.5 0.5 0.5 0.5 0.5 
##$DBPOFFS= (0..7)
0 0 0 0 0 0 0 0 
##$DE= 6
##$DECBNUC= <off>
##$DECIM= 32
##$DECNUC= <off>
##$DECSTAT= 4
##$DIGMOD= 1
##$DIGTYP= 9
##$DL= (0..7)
0 120 120 120 120 120 120 120 
##$DP= (0..7)
150 150 150 150 150 150 150 150 
##$DP07= 0
##$DPNAME0= <>
##$DPNAME1= <>
##$DPNAME2= <>
##$DPNAME3= <>
##$DPNAME4= <>
##$DPNAME5= <>
##$DPNAME6= <>
##$DPNAME7= <>
##$DPOAL= (0..7)
0.5 0.5 0.5 0.5 0.5 0.5 0.5 0.5 
##$DPOFFS= (0..7)
0 0 0 0 0 0 0 0 
##$DQDMODE= 0
##$DR= 18
##$DS= 0
$$ [...]
##$SUBNAM2= <"">
##$SUBNAM3= <"">
##$SUBNAM4= <"">
##$SUBNAM5= <"">
##$SUBNAM6= <"">
##$SUBNAM7= <"">
##$SUBNAM8= <"">
##$SUBNAM9= <"">
##$SW= 18.05172834244
##$SWIBOX= (0..15)
0 0 2 0 0 0 0 0 0 0 0 0 0 0 0 0 
##$SW_h= 3612.71676300578
##$TD= 16384
##$TD0= 1
##$TE= 0
##$TE2= 300
##$TE3= 300
##$TEG= 300
##$TL= (0..7)
0 120 120 120 120 120 120 120 
##$TP= (0..7)
150 150 150 150 150 150 150 150 
##$TP07= 0
##$TPNAME0= <>
##$TPNAME1= <>
##$TPNAME2= <>
##$TPNAME3= <>
##$TPNAME4= <>
##$TPNAME5= <>
##$TPNAME6= <>
##$TPNAME7= <>
##$TPOAL= (0..7)
0.5 0.5 0.5 0.5 0.5 0.5 0.5 0.5 
##$TPOFFS= (0..7)
0 0 0 0 0 0 0 0 
##$TUNHIN= 0
##$TUNHOUT= 0
##$TUNXOUT= 0
##$USERA1= <user>
##$USERA2= <user>
##$USERA3= <user>
##$USERA4= <user>
##$USERA5= <user>
##$V9= 5
##$VALIST= <valist>
##$VCLIST= <CCCCCCCCCCCCCCC>
##$VD= 0
##$VDLIST= <DDDDDDDDDDDDDDD>
##$VPLIST= <PPPPPPPPPPPPPPP>
##$VTLIST= <TTTTTTTTTTTTTTT>
##$WBST= 1024
##$WBSW= 4
##$XGAIN= (0..3)
0 0 0 0 
##$XL= 0
##$YL= 0
##$YMAX_a= 58679
##$YMIN_a= -68943
##$ZGOPTNS= <>
##$ZL1= 120
##$ZL2= 120
##$ZL3= 120
##$ZL4= 120
##$ABSF1= 10
##$ABSF2= 0
##$ABSG= 5
##$ABSL= 3
##$ALPHA= 0
##$AQORDER= 0
##$ASSFAC= 0
##$ASSFACI= 0
##$ASSFACX= 0
##$ASSWID= 0
##$AUNMP= <proc_1d>
##$AZFE= 0.1
##$AZFW= 0.1
##$BCFW= 1
##$BC_mod= 2
##$BYTORDP= 1
##$COROFFS= 0
##$CY= 11.3945322036743
##$DATMOD= 1
##$DC= 2
##$DFILT= <>
##$DTYPP= 0
##$F1P= 15.7292609196834
##$F2P= 12.9074282941183
##$FCOR= 0.5
##$FTSIZE= 0
##$FT_mod= 4
##$GAMMA= 1
##$GB= 0.15
##$INTBC= 1
##$INTSCL= 1
##$ISEN= 128
##$LB= 0.24
##$LEV0= 0
##$LPBIN= 0
##$MAXI= 10000
##$MC2= 0
##$MEAN= 0
##$ME_mod= 0
##$MI= 1.114404
##$NCOEF= 0
##$NC_proc= 0
##$NLEV= 6
##$NOISF1= 3.799351
##$NOISF2= 2.8
##$NSP= 1
##$NTH_PI= 0
##$NZP= 0
##$OFFSET= 15.70392
##$PC= 1
##$PHC0= -21709.13
##$PHC1= 9.252709
##$PH_mod= 1
##$PKNL= yes
##$PPARMOD= 0
##$PSCAL= 0
##$PSIGN= 0
##$REVERSE= no
##$SF= 200.130013532006
##$SI= 16384
##$SIGF1= 3
##$SIGF2= 2
##$SINO= 400
##$SIOLD= 16384
##$SREGLST= <1H.CDCl3>
##$SSB= 0
##$STSI= 0
##$STSR= 0
##$SW_p= 3612.71676300578
##$SYMM= 0
##$S_DEV= 0
##$TDeff= 0
##$TDoff= 0
##$TI= <>
##$TILT= no
##$TM1= 0
##$TM2= 0
##$TOPLEV= 0
##$USERP1= <user>
##$USERP2= <user>
##$USERP3= <user>
##$USERP4= <user>
##$USERP5= <user>
##$WDW= 1
##$XDIM= 8192
##$YMAX_p= 0
##$YMIN_p= 0
$$ End of Bruker specific parameters
$$ ---------------------------------
##NTUPLES= NMR FID
##VAR_NAME=  TIME,          FID/REAL,        FID/IMAG
##SYMBOL=    X,             R,               I
##VAR_TYPE=  INDEPENDENT,   DEPENDENT,       DEPENDENT
##VAR_FORM=  AFFN,          ASDF,            ASDF
##VAR_DIM=   8192,          8192,            8192
##UNITS=     SECONDS,       ARBITRARY UNITS, ARBITRARY UNITS
##FACTOR=    0.0002768,     1,               1
##FIRST=     0,             0,               0
##LAST=      2.2672688,     0,               0
##MIN=       0,             -68943,          0
##MAX=       2.2672688,     58679,           0
$$ Real data points
##PAGE= N=1
##DATA TABLE= (X++(R..R)), XYDATA
0@%%%%%%%%%%%%%%%%%%%%%%Kj0J6j6J6j6J6j6K1k9L2l2L7m5M8n3O0o4P1q0Q8r9
44e3J09j18J31j45J60j76J93k12K35k60K87l18L54l96M46n05N77o68P85r42J163
65F47j498K054l135N925k4871m8065Q3331J2494m8257N1507K8547p3919j764N3305
79C6301k0069j4095L9627r254l1804J5274R103j9892M941J2880j2358j1737M342
92C259K268m963r93L059n794j0636M370Q150m235m189j978m890N010O497m040
107i105N155M149j5387J350J8609j1455j0491K3324M15j9229J3745P845j9650
120a0725R144J7620j6317l968J1301j2027J01J9877p747j1863J0601m302p899
133f204J4903R84j3551N071k74q405J0910N674j1975M909M067j6193K581J4687
$$ y = [0, 0, 0, 0, 0, 0, 0, 0, 0, 0, 0, 0, 0, 0, 0, 0, 0, 0, 0, 0, 0, 0, 0, 2, -8, 8, -8, 8, -8, 8, -8, 13, -16, 16, -16, 21, -24, 24, -29, 31, -33, 38, -42, 46, -53, 56, -62, 69, -76, 84, -92, 101, -111, 124, -136, 151, -167, 187, -209, 237, -268, 309, -359, 426, -516, 647, -851, 1203, -1932, 3993, -20878, -68943, 14388, 26882, -21375, 30132, 58679, -15240, -17004, 36301, 16232, 2137, 41764, 32510, 706, 15980, 25083, 5191, 10132, 23012, 10654, -1083, 3259, 5527, 564, -429, 2630, -3164, -13800, -9430, -1280, -5515, -9704, -11682, -16572, -11562, -5065, -9105, -3950, 199, -15188, -13838, 4771, -6684, -17175, 6149, 6564, -12665, 1080, 8925, -10725, -1581, 16039, -278, -4246, 7055, -4972, -4871, 15006, 7259, -4604, 5997, 1695, -6204, 8699, 9683, -3868, 1203, 929, -7476, 3434, 9108, -2867, 2042, 6109, -10084, -7503, 7184]
147G184q632n088J1204p481r873J2544M855p815J883K79p583K974P484j707k741
162b513O34r73RM064L685j801n637J211L094k146J120O674l331n099N764q34n340
179a419N463J566p001L174J251p475N106O074q391J594P253j0705l532J2094m590
194D62p046J2041o52j2817P869O620j0251L756R813j0150o484R200j849m467Q833
209D878J970q808L4L253k873L71L432j590l727m53R13J612N82J90j08k165j790
226d279J948J554o62n35m28K17N18R62J455O60j962r06K071j963k013M197J702
243B536l266K789J501n943K0N285j712j629M352k032m641L552J695k406K290K947
259E338k624j212N9k591K21L161N95N06P21m053p46K642k243j373L412j592l321
$$ y = [7184, -1448, -6536, 4668, -2813, -12686, -142, 4713, -3102, -1219, -940, -8523, -5549, 1935, 228, -2513, -1879, -2852, -2843, 1221, 4906, 3105, -2532, -1321, 1773, -373, 747, 7421, 4090, -1009, 4755, 3921, -1419, 4044, 5610, -1391, 1783, 3034, -4441, 665, 6739, -1652, -58, 7195, -3510, -7042, 5052, 462, -6584, 5457, 4805, -8012, -143, 6477, -3774, -18, 9795, -355, -6839, 2361, 512, -3955, 4878, 6848, -1960, -1926, 1327, -1546, -1175, 2257, 667, -3060, -3513, -2600, -988, -406, -216, -324, -2489, -4279, -2331, -777, -1439, -1974, -2402, -2185, -1667, -705, 750, 1410, -552, -1458, 613, -1350, -3363, 834, 2536, -730, 2059, 3560, -2383, -2363, 2922, 1210, -419, 3933, 1901, -2740, 812, 2507, 101, 2391, 5338, 2714, 1502, 1561, -1030, -809, 2352, 2947, 3453, 4174, 121, -625, 2017, -226, -1599, 1813, 221, -3100]
276c100K995L1n551J900M432k597j106L253l546l829M147K435k866P38L853j367
292a78k35K768j512m023K333M225k26m2J173j836k090K666J164j439O81O44k316
309A757j216O9j750L52L375Q9k287o86k148k114K717J565k444O65J279k518L87
326b908K654j923j555L968N15l473R05N71k349K691M598k088k713J227n98q49
342a327J648P79j634l01J461j80n84K28P40O61O2o19j381r50O47K885Q80j181
360A834o51l21k28O76J365o62j715J41O29m80q21N94Q05l49Q7o39k735r21K075
379a316R19o66M02k82j677J076J876j060n19P59j69o6N07n9J76J441M60j96p5
398A531j234m80J490P23j675l04P01p93Q97J177k129k392Q33M67q46P56K17k075
$$ y = [-3100, -105, -74, -5625, -3725, 707, -1890, -2996, 257, -3289, -7118, -2971, -536, -3402, -2664, 1189, -178, -413, 2355, 843, -3180, -847, 3378, 3152, 3110, 4283, 2447, 357, 3023, 4187, 2748, 3429, 4073, 1757, 541, 610, -1140, -788, 2587, 2676, 389, -297, -2445, -4559, -1842, -277, -2721, -2056, -777, -3295, -2908, -254, -2177, -3732, 236, 751, -2722, -1817, -1246, -3595, -904, 3694, 1606, -1107, 120, -478, -1327, 321, 1100, -534, -835, 626, 446, -138, 90, 830, 1491, 1553, 934, -447, -1397, -750, 2135, 3015, 1834, 1183, 862, 634, 1310, 2675, 2013, 298, 439, 1068, 588, -233, 361, 1166, 817, 904, 265, -2470, -3391, -1316, -397, -1063, -661, -943, -2620, -1544, 332, -728, -1247, -488, -657, -723, -216, -275, -99, 1342, 1802, 1606, 1531, 297, -183, 1307, 2030, 355, 51, 752, -41, 856, 2033, -96, -2488, -1655, -1188, -2034, -1278, -1061, -3136]
416c136Q3J739N05p41J099J8j410m06P64L35J175J892n2k025o38L89N88J700J311
435C190k126k331j125K1J976K412l83j690j151k085p01K364J181m01O77j090k338
452c600Q51K688M40q4P88j907j407K076J583l43N53J40j277R68J551l55j599n89
470D77m68m08J635J460n88j881q14l08r5J344L71o85j167m03k70J212J186q5l33
489A80l00m46p00J155M74j608j7K91q79J078J196j100r70n61j880n6K473L99j126
508b397O29r85k280J489L033M87n58J90j905j035J488K523J822J159n10j469q27
525H54N26J578K029k08j015j624q95J482J507j89q88j617k400j31K063K91j374
542a1j542r69Q7J593k42L52o78k144n92K161N43l59J550N07k033M03K051J26M22
$$ y = [-3136, -3053, -1314, -809, -1550, -451, -433, -1843, -2249, -1485, -1150, 25, 1917, 1865, -160, -798, -409, 179, 1879, 3190, 1064, -1267, -2392, -2371, -395, 2017, 1634, -56, -1207, -3292, -3993, -1629, -448, -849, -172, -1262, -3600, -2749, -61, 379, 295, 1083, -824, -2231, -155, 1428, 1085, 1638, 1778, 501, 1469, 3020, 2665, 1066, 477, 9, -399, 1236, 2696, 2108, 227, -587, -895, -990, 354, 725, 40, -1127, -1530, -1800, -588, 598, 513, 180, -120, -566, -1266, -111, 363, -1245, -1262, -971, -1850, -772, 424, -676, -1646, -2207, -4087, -4143, -1670, -1271, -2397, -1768, -2753, -5033, -3544, -511, -24, -582, -392, -2297, -3332, -1844, 679, 2501, 3660, 3150, 1681, 854, 1380, 2958, 4987, 4779, 3764, 2140, 1245, 2727, 4234, 4045, 3157, 1540, -860, -991, 1072, 1363, -11, -1553, -2522, -2435, -842, -1084, -732, -1410, -3554, -4146, -1985, -1442, -1801, -251, 256, -1777, -1374, 677, 803, 1225]
561A225Q77j196p74R11K06J034J571j183j509Q37J50o99K66J82q88M3J49j76O1
580A087k04J88P86m88j484j087N30M66J318L96j318j260n31L86J218M24j719o96
598a988K78q24N84J649p31p44K93m01J55P00n39J02R39m91j76K209J070j122O32
617A595m36p73J665J859n55o98m51q76J996J815q26j603p50j311K78J508k29j401
635H07m62r43l29J134q40m05N92r00j122O59j33n7J464R81p10n38L83q59J040
654b38Q89m40P9O70m06K59O65n30J14K46p60m41j15p90P05N31r50p36R17k73K21
675c83Q79j632k192R44J389O58J757q9k485n45J141M70J448Q36j409j114P6P8
693a73N54J331p5o84m04r02o98M26L62l44M28m9p47M57k56j72l10K55L54P26N0
$$ y = [1225, 2102, 906, 132, 1043, 1249, 2283, 3854, 2671, 1162, 1999, 2149, 1450, 1716, 1898, 1010, 1053, 1202, 1026, 1087, 883, 1071, 1857, 1369, -115, -1202, -672, -206, 1112, 1508, 190, -1070, -1601, -1215, 3, 427, -1292, -1988, -1710, -2534, -1950, -301, -1032, -1776, -1483, -1884, -1729, -1029, -1568, -1466, -527, -1018, -1194, 1015, 2085, 963, 1595, 1159, 386, 2051, 3910, 3355, 2657, 2206, 1330, 3326, 5141, 4315, 2712, 1962, 651, 929, 2437, 2208, 807, 345, -598, -927, 207, -633, -1038, -446, -1346, -2468, -1809, -1942, -1999, -535, 446, -264, -802, -419, -1278, -238, 651, 211, 290, 960, 554, 813, 1478, 948, 1062, 1308, 548, 107, -8, -798, -93, 438, -512, -1248, -331, -604, -383, 496, -1136, -3328, -2384, -995, -337, 1420, 1331, -1154, -1699, -558, -88, 1360, 2196, 787, -327, -251, -173, 381, 1712, 1637, 953, 549, -353, -1051, -625, -263, -607, -179, -228, -975, -518, -774, -946, -1256, -1001, -647, 79, 129]
714A29m92j34L26L20J309M54j006k25R6o03J104N27j325k58J142r02L2Q07j296
733Ej096O88j71q96Q08Q6p73N24M86r14L77P31p33K75O88p6l28N25M59K84L50
754A299K69j51n06p21k15M13K8L39n5p66o17K22o7l0k50m66p82J31J75J72O27
775i51J69l66K36J05l08P20M15k45J03O90J71M56P95p59m92P13l73j23L93o03
795G46m14M71j53j68q5o04l30M18j37o75K23J00k86N83M51p69M47N57k53p9M20
816D63p15j18N43L55j00L62L99o29j91n15m9n7J23J01k96m35j35K96J12K4K2o43
838a083m91L91P88K24J47J28L7P99N85j88k77Jm9K51N74n6m18K98k60j19K06k14
860A274q48m42j5q64J25P18p41Lk88j092r2M86P03J1j09q37p87Q44J187J066N25
$$ y = [129, -363, -497, -171, 149, 1458, 1912, 906, 681, 777, 174, 1278, 1805, 480, 222, 1364, 462, 494, 1301, 5, -1091, -403, -574, -1470, -662, -576, -1349, -825, -339, -1253, -876, -145, -878, -603, 85, 9, -319, 206, 665, 949, 1299, 1568, 1417, 911, 190, -25, 388, 416, 755, 700, -66, -683, -461, -528, -558, -808, -1274, -2056, -1925, -1750, -1578, -951, -782, -1148, -912, -807, -1115, -395, 20, -225, -122, 568, 739, 1195, 1990, 1231, 739, 1452, 1079, 956, 1349, 746, 332, 803, 650, 482, 397, -207, -537, -119, -256, -931, -708, -608, -894, -311, 140, -629, -182, 375, 122, 43, 463, -252, -370, 173, 528, 428, 790, 1189, 560, 369, -146, -195, -252, -129, -28, -324, -759, -894, -598, -486, -462, -440, -1083, -1574, -1183, -395, -171, -24, 104, 141, 940, 1525, 1337, 1060, 1061, 1012, 1263, 1837, 1781, 1363, 1661, 1401, 1282, 1488, 1274, 426, -16, -31, -895, -770, -52, -793, -790, -1078, -2170, -2262, -1776, -1073, -1062, -1171, -2008, -2795, -1951, -764, 302, 827]
881H27o91p80J88n0L17J087L16n68J90m55n94N53P94K79k17o18j084r2P54N9K24
902D39K0l93J8L38lm49n4J46J54R78m14J94j71j06j36M44j69o4k6j73n15l22K8
925b36l4P74j18j014p94pm24N41O82o95m93O02l01M36O80p4m02M2P23j39O08K92
947F49k84M55M27l47j74N00m70j02l18n44L24O7l3K42l98r18j09L30l6j98M1q74
969a770K65Q72l96M29J84k13k37P62m9rN86m4k13L88N9n73N81M85p82ml63q36
991h78J90P41n54K05p3q95m92R25k51N3N08m53m41O04K99O12P75O8m45N3P1j51
1013D71O55M07m86K24j08l34L43K70o96J3l18q82K58M68n10m29L84n59o80P20
1033g89l79n18O67j68o44O31K27N6M30L21q10N89pk95Q28l9l76M33k7m75L68L54
$$ y = [827, 136, -644, -456, -506, -189, 898, 1214, 646, 836, 381, -213, 340, 1134, 1413, 1196, 578, -506, -598, 156, 215, 439, 459, 66, 84, 422, 419, -30, -84, 62, 216, 1194, 780, 974, 803, 697, 561, 1005, 836, 772, 746, 573, 58, -264, -236, -270, 504, 386, -628, -1422, -1429, -1853, -1312, -630, -1325, -1818, -1216, -1517, -1081, -401, -475, -877, -835, -112, -251, 357, 649, 365, 820, 1247, 900, 726, 1226, 756, 654, 336, -208, 116, 183, 150, 392, -6, -924, -1033, -703, -739, -937, -896, -1770, -1505, -633, -1029, -600, -416, -629, -866, -104, -153, -162, 424, 380, 167, 555, 614, 41, 622, 1107, 325, 321, -42, -878, -688, 53, -501, -296, -369, -1264, -1756, -831, -1082, -1029, -521, -974, -1415, -811, -512, 100, 875, 943, 498, 551, 622, 471, 1126, 1533, 1047, 1271, 1163, 829, 1172, 1442, 746, 759, 441, -441, -183, 285, -225, -654, -270, -829, -1509, -789, -1168, -1686, -1019, -1187, -1831, -1200, -973, -917, -487, -166, -976, -387, -394, -689, 139, 100, -276, 157, 130, -345, 23, 377]
1055C77k1o08K59o77l29Q85L5j71O57n86m82O43K11k97Q08m55o30R93L92k04L15
1076A115L50l15n8N96l91K25Q3j379K01P30k72R5j87r74p06M93l06K9J47p89l15
1097a628K79J94l65Q50k11l87O39K97o69Q56J41l25R83K60l36Q40J68q00J90J45
1117A121k03r0P38m43m64L53m68n94O34l42m56L06k03q08K01L73k72P17K64p12
1137c48l10n36j6R17Q04m47p8r7o09M58Q58j84j74j85m46K47L08J56m35L80l45
1158h2q5R7k29J34j6J05k67L51N00m11M39M32o56Q7L76j64L14n0n50K33O11o4
1180A105n2l94n29j87O05j49n93L33p76r9K97N6n22K44k43l28Q40l20l98L12N95
1201b03j88N32K09n48J94L17p6K23K33j55j91L19m08J1O85l01m56o6l51k26K53
$$ y = [377, 356, -252, 7, -670, -999, -114, -79, -250, 407, -179, -661, -18, 193, -104, 704, 249, -381, 612, 1004, 800, 1115, 1465, 1150, 1092, 1688, 1297, 1522, 1605, 226, 427, 1157, 885, 980, 793, -181, -887, -394, -700, -671, -524, -1313, -1628, -1349, -1155, -1520, -670, -881, -1268, -629, -332, -1001, -145, -4, -329, 654, 914, 578, 1418, 1586, 786, 976, 1121, 918, 828, 1566, 1123, 659, 1012, 544, -50, 584, 242, -214, 92, -111, -919, -718, -345, -617, 100, 364, -348, -658, -1194, -1210, -293, 511, 64, -14, -111, -720, -262, 596, 412, 238, 53, -393, -146, 162, 318, -117, 263, -82, -167, -70, -299, -165, -181, -76, -343, 8, 508, 97, 536, 968, 312, 399, 775, 611, 925, 875, 325, 558, 1169, 1105, 1053, 659, 130, -57, 548, 399, -194, 139, -637, -736, -439, -383, -905, -661, -904, -1232, -392, -712, -1110, -798, -203, -391, 141, 350, -198, -4, 313, 237, 460, 693, 538, 347, 666, 258, 269, 954, 653, 197, 131, -220, -446, -193]
1222a93N6k08k8k14k90O17Q4o29m8J55L2M00L35l15l98O14Q6L98N29l39m20n8
1244A66L36k15P45m6n57O5m24r9Q8L64m16L8l86k22j26M27j20J07K15n68J71J78
1266b79j78K66P6N7J49K44K1o9J10J75r0l26J7q5R1r2L7N02l12l73J20k16j90
1289c45K6L1M8l8J53M20k87J68m42M47N8nJ89r4N7J5K28J00j89J38n4n49M36l18
1313A93j0N9k00n62K9K30k50M21n79o38Q2K26n4J54M16l80n6K41K11M77j6L66
1335C60m21M5R1O48N4J96K9j65J82j62J8j49j93q9j8K3J25j28j74k87k63R5m5
1358b28K10k44m6K59m19M0K24J61r8J87j59k21K26O2J44M8J51j25R5j14j51J8
1380B0q4J88m55%qK7L11O4N5k57R1l13J02N51r6n3j4J11p3L76K8j74l4j77J78
$$ y = [-193, -137, -345, -373, -587, -877, -260, -176, -805, -853, -698, -666, -266, 69, -246, -644, -30, 56, 454, 983, 644, 224, 166, 502, 287, 1032, 986, 429, 494, 70, -29, 59, 423, 7, 45, -341, -563, -689, -262, -382, -275, -60, -628, -457, -279, -457, -191, -115, -58, 91, 335, 356, 287, 397, 572, 482, 156, 173, 88, 179, 87, 124, 626, 314, -59, 61, -155, -345, -319, -288, -240, -278, -125, 295, 8, 176, -266, 181, 239, 234, 423, 329, 386, 401, 629, 729, 540, 678, 624, 75, 511, 193, 183, 242, 42, -520, -491, -261, -511, -90, -669, -1307, -1225, -999, -1053, -899, -483, -863, -919, -678, -467, 10, -6, 360, -61, -16, 75, 723, 777, 973, 1002, 837, 1019, 857, 875, 726, 533, 444, 426, 449, 574, 446, 272, -15, -278, -183, -228, -18, -262, -308, -49, -468, -428, -204, -43, -141, 46, -113, -334, -108, -46, 98, 146, 297, 172, 267, 153, 2, 20, -64, 124, -331, -331, -339, -312, -1, 63, 118, -139, -48, -361, -259, 292, 196, 143, 129, 240, 167, 543, 571, 397, 363, 186, 364]
1405C64k4l8M6k61O0J31k31j7k95k64Q2j56L10j1l25J36L70m15JJ24p9J72K21
1428i9j53R8K24J89J21K19k18M1K0K6K15j11j31R1M3M8l04n7k6l04L79j70o76
1451e35K40J39j56L4K42m35K34p6K25Q6j30J98m3n0J81L80k61L1L14j87P2k02
1473C01R9j44P8q1j58M6Q6k0l50L1j82L5Q7k82J96P2k64k28K97J23K98J99n12
1496b73j38J34N5L50K19j92K59m1n23N7K41J05q9R1l42n8j05L01j15M88j15o25
1518c16l7j4KJ4K35L13M4J9k42M6N6K29k12L2J29l36L66q1L2R2k93q1J39j77k57
1543b98K8n5O1K57j07q4k72J14k17J06K89k83L41J73l26J40K24j46L76n1m23M24
1565B71mqj5J5j53l9P3J53l38L33j20m32K62l22R7j89J93L9j87nm04M89R8l16
$$ y = [364, 340, 302, 348, 87, 147, 278, 47, 30, -265, -529, -447, -603, -293, -304, -629, -493, -123, -538, -537, -413, -492, -320, -99, -252, -154, 70, 259, 380, 599, 381, 422, 442, 468, 683, 572, 441, 532, 575, 623, 319, 262, 236, -68, 311, 141, -535, -295, -156, -312, -278, -36, -471, -237, -313, -88, -2, -132, 66, 23, -27, 154, 534, 273, 304, 618, 431, 503, 301, 400, 256, 334, 253, 95, 141, 227, 207, -143, -112, -294, -259, -172, -454, -258, -186, -450, -678, -381, -258, 40, 239, -273, -411, -277, -222, 128, 347, 155, 414, 373, -150, -93, 148, 253, 164, 255, -87, -145, -250, 51, -64, 424, 309, -316, -353, -367, -365, -351, -116, 197, 241, 260, 18, 64, 120, 349, 137, 169, 298, -38, 328, 247, 279, 371, 78, -3, 136, -41, -298, -270, -325, -264, -7, -114, -198, -470, -356, -573, -467, -178, -461, -120, 53, -273, -133, 91, -55, 321, 270, -153, 271, 267, 259, 244, 259, 106, 67, 140, 293, -45, 288, 168, -264, -2, -324, -227, -416, -223, -184, -371, -376, -780, -291, -193, -509]
1589e09L61P4k73R4M09j72m8J82J64l78L07j60r7M70On47K97pL0J4j79l46L85
1612G7l29oL88M2m65K32j50O6J76P0j14K43l45M5K15J92k87J85j45m19K39l3J10
1635a3k73J84o7l40M76N6k37L27o43J36L27p1k63L36j3J2J60K38l37J32J08k48
1657a3M59P0m20M5L75j18O1J23l67l41M55j20l17J45j10j94m1J8j18N3l65n7M10
1680c67j55j02K00Kl25L26K90q3J23J07k63J06J36J68k31N37m40J5L17r9j06K48
1702D04j65m00J72J68k66L53p7l17k3J91o3j62J83k59K3K63j92L99p1q8P6J05
1724B54k97Q5K90k58k64J11J50mL26l40m33L12j28OK45j34k18k82K19j01L50K94
1746A83l54k40K62j00J67J81l51J62J74K89m79L63j68l6J82j08o1M3R3m36K04
$$ y = [-509, -148, -74, -347, -253, 156, -16, -64, 118, 282, -96, 211, 51, -46, 424, 430, -117, 180, 173, 203, 217, 38, -308, 77, -252, -258, 130, 172, -293, -61, -211, -145, 31, 101, -13, 230, -115, -70, 145, 337, 50, 235, 90, -329, -90, -123, -13, -286, -102, -169, -509, -33, 23, -214, 113, -530, -394, -67, -138, -401, -65, -78, -66, 94, 332, -5, 127, 235, -13, 446, 516, 96, 141, 516, 398, 459, 582, 215, -126, 329, 209, -108, 37, -73, -267, -308, -290, -408, -355, -720, -777, -367, -522, -624, -424, -422, -747, -421, -131, -214, -91, 16, -247, -141, -5, 163, -68, 469, 29, 44, 361, 262, 156, 404, 239, -161, 11, 179, -87, 266, 189, -128, -151, 40, -23, -185, -2, -261, -238, 25, -167, 232, 161, 73, 149, 254, -43, 42, 332, 74, -190, -79, 71, 67, 393, 53, -380, -68, -196, -190, 55, -79, -297, -579, -360, -461, -111, 183, -171, -411, -149, -249, -82, 99, -252, -90, 84, 373, -106, 257, 89, 53, 235, 127, 66, 109, 202, -234, -30]
1767c0p5R7j4j37m84L04r4j0J43N3mJ00J69k75K49J51j69j30M53p1J87J01k49
1790B65Q7M7L9k60L22k11m46K91k0j75K8o3j14n9J93j83Q3J61j20l01O2l9K62
1813a51R7n9j00K48JL3p3j91J59K14K61k53J32Q1q4r1P5m9K10m49l95L54L25k75
1837B0j52J77l24j57N73q4k58L44j91N5K30o2j79K12m04K77K61k7l73Q5j92K68
1859I9k19L62l62K30k23k91K7J10J63m10L0Q6R0J30r0o2K99o6J03O0n4J25J66
1882C03j95J35j5N6J93k06J24l06K45J78l80J66K11m90J83O9n11JJ47j51jJ24
1904a20Mj59J32llJ66m68L20p7P8J4J14J68n1J61J87k49R0K05m71Q3P1k90K18
1928A20j21j19K28m3j31k24J20j73j04J26L80j66J80j67L9j18K65k05N0K56j19
$$ y = [-30, -105, -8, -22, -159, -643, -339, -433, -443, -300, -247, -251, -151, 18, -257, -8, 143, -26, -156, 297, 226, 413, 514, 265, 352, 399, 438, 178, 500, 289, -157, 134, 114, -61, -33, -96, -210, -269, -76, -259, -176, -15, -135, -436, -374, -413, -151, -54, -113, -213, 35, 36, 69, -4, -195, -36, 178, 439, 186, 318, 399, 315, 224, 299, 250, 460, 11, -384, -30, 295, 20, -132, 45, -279, -436, 137, 53, -205, 139, -52, 3, 233, 171, -8, 204, -200, 77, 338, 311, -62, 23, -169, 99, -120, 242, -120, 110, -113, -404, -377, -267, -104, -514, -484, -398, -308, -178, -268, -330, -31, -97, 6, 66, 12, 137, 303, 108, 243, 228, 284, 477, 271, 395, 89, 334, 512, 132, 298, 509, 19, 202, 271, -240, -239, -92, -243, -244, -120, -116, -275, -143, -146, -149, 17, -451, -131, -208, -130, -116, -2, 166, 115, 276, 463, 214, 304, 509, 38, 121, 192, -98, 120, -1, -120, 108, 65, -66, -290, -170, -343, -447, -321, 59, -107, 73, -94, -55, -173, 92, -113, -63, 193, 74]
1949G4J00q4l2M22p5j40j49l2Nm3J38k97n0J68K5k15K67Jl74J76k61j5M77k49
1973a63k98L05Q8O2J09J57l12J30R0M3J32J56n0k65N05n43J30j90o3O2K52n54
1995b17M8J40k49J30Q9j13M1L9j39k02L25K44q4J95lk67J26O2M4j47n7m5K31j0
2019A81l6N3j02K4J09J18k12j90R7q7k39J33J02m10L73j25j8j24Mo9K85p0R1L77
2043B65j82M9J79N9k24J3j20J01ro1L0n2J00j09J03q8o3j07n5K46m44L17r5j15
2067b62J11j01r8J96J00K8QL2J65n6PJ17j98K47k49J09L66j53l28L5M7l14K22
2090C1k83L41m51K04l6j32L4l12K97J63j67J8J20o3L15P4NL0k26K39M2K14j09
2113C48J10j67J03k82j71R6R9j43q2P6O5l0j57m60O4L13k53P8j07J76l1j60K67
$$ y = [74, 174, 90, 58, 480, 405, 265, 116, 84, 89, 46, 184, -113, -163, 5, 30, -185, 82, 83, -291, -115, -376, -391, 86, -163, -461, -156, -68, -6, 103, 260, -52, 78, 168, 211, 343, 499, 449, 184, 689, 146, 276, 86, 23, 85, 337, -217, -169, -29, -278, -148, -59, -172, -131, -92, -231, -433, -108, 136, 52, 247, 244, -23, 103, 165, 209, 62, 5, -40, 191, 181, 145, 198, 96, 120, 229, 347, 135, -55, 42, -45, -284, -151, -49, -459, -86, -211, -229, -353, -349, -418, -133, -203, -112, 265, 83, 132, 311, 370, 146, 159, 39, 140, 131, 70, 100, 48, 148, 39, 142, 54, -9, -116, -171, 75, -369, -52, -147, -262, -151, -252, -350, -154, -54, -26, -18, 14, 179, 123, 130, 247, 49, 296, 47, 156, 522, 369, 41, 76, 123, -191, 31, -252, 89, -362, -158, -194, -326, -292, -604, -307, -144, -311, -293, -173, -236, 79, 153, 158, 188, -38, 201, 243, 457, 348, 458, 291, 394, 112, -59, 37, 136, -7, -89, -13, 52, 22, -135, -595, -531, -218, -471, -393, -500, -324, -355, -515, -248]
2136b48m9L73k15M4N0K1R1O9J7J10j80J87j03J11j37J49j91m21K55J95j85Rl33
2159c81K59j9J40l23J10J19l62J4J97j73L04j24K35K64k55K54k00R1J1k7j20K08
2181B22L5pn8k26K90j10n55M77k92N8n4Q4r5q3J55Ml6J04j23j6J84q6P6K39k89
2206a02K46k9q0J51J89Qm64Q6Q2J00J9j68J54k26J92j09l58M30n22n7K45j37L09
2229d1k84K23p9J53l15K47P7p3K38j97l7J21K04Q4l2j15j87K06L5r6J6j08K93
2252C33k22P2k73k3j62j02n1L22k50K90P5l74K72M7n8K9o2J87l59L28K49j28k11
2275g1K61K30l39N18O1m91j22N7Np1j3l2j08o9q1L2K19l88L41j06r5j3L52j77
2299a00j05NK07PJ7P1j47J73K0J33J00j84j09J30j10k27J61J2k47Pl2P2J58j75
$$ y = [-248, -297, 76, -139, -95, -45, -24, 67, 136, 153, 263, 83, 270, 167, 278, 141, 290, 99, -322, -67, 128, -57, -48, -381, -122, -141, -1, -324, -214, -95, -457, -443, -246, -419, -115, -239, -4, 260, 5, 259, 59, 150, 161, 134, 14, 222, 257, 250, 192, -34, 256, 146, -409, 68, -224, -166, -220, -136, -231, -314, -159, -155, -191, -87, -210, -226, -42, -128, -52, 187, -102, 144, 115, 35, 186, 375, 383, -81, 5, 87, 187, 206, 38, 192, -34, 158, 49, -309, 121, -401, -458, -213, -350, -41, -325, -102, -181, -28, -343, -96, -19, -92, 146, -51, -88, 33, 237, 321, 289, 174, -13, 193, 228, 132, 148, 40, 333, 111, 183, -90, -113, -275, -377, -428, -106, -356, -66, 9, -365, -93, -46, -104, -75, -137, 50, -309, 19, 268, 140, -71, 190, 420, 81, 599, 660, 169, 47, 104, 109, 38, 25, -7, -115, -184, -265, -233, -14, -402, -61, -167, -262, -275, 77, -100, -205, -200, 7, 14, 31, 102, -45, 128, 148, 281, 381, 197, 88, 218, 108, -119, 42, 54, -193, -186, -218, -146, 12, -163]
2323a63j93J22M18l58J66k41L35j70O5J49j03L3K64j59K92j87J11J93k08j13R2
2344C45R5j31J77m86J4K56m5m12L06l33N1j95L11j42k69J12j27J22N0P9J99k7
2366e0n5J62m2K08J20l1k42k27L14J52n2Q1j92Q6q2M0k19N4n9j81L3k26L97k31
2390b42R3J19k59J22L9J45j90J23J57j96L70k05R6J08jj17J40j77j39J35J07J4
2412B42j91m7l0k56L60kk17k3j13K80n45K22o6O3p4J25L08Jq5K25Nn0K8K31j66
2437B25MJ85n3l93J15J28Lj07P3j57r8J06l45K58k26R9j65J16Pl4K16j81j8J56
2461h6k3o7J09L00l49l8K91o3J83K45j95j30m6J82k13J8j77q0L83k45j03rr5o7
2485b75J46k13J50j56J72l80M85k07Q8r9O2k15L13J30J46k94%J47K58j75J45j16
$$ y = [-163, -356, -234, 184, -174, -8, -249, 86, -84, -19, 130, 27, 60, 324, 165, 457, 270, 381, 574, 366, 253, 345, 440, 309, 486, 0, 14, 270, 225, -187, 119, -214, -163, -358, -47, -189, -458, -346, -473, -351, -301, -222, -23, -50, -105, 57, 15, 223, 343, 312, 70, -157, 157, 309, 257, 338, 146, 232, 150, 190, -29, 25, -34, -215, -182, -408, -11, -242, -149, -30, -289, -167, -128, 17, -173, -50, 107, -89, 281, 76, 172, 280, 279, 162, 302, 125, -14, 121, 228, 242, 51, 4, -26, -282, 78, 76, -141, -164, -277, 3, -542, -320, -386, -323, -397, -272, 36, 37, -48, 177, 182, 132, 160, 391, 225, 229, 414, 361, -32, 83, 211, 214, 107, 180, 23, -75, 31, -314, -56, -282, -183, -348, -232, -225, -259, -43, -224, -242, -86, -109, -176, -67, 233, -116, -154, 137, 74, 257, 502, 307, 177, 131, 313, 100, 118, -59, -139, 244, -1, -104, -113, -208, -275, -129, -342, -192, -348, -176, -556, -71, -278, -190, -289, -227, -442, -129, 1, 147, -147, -147, 0, 258, 83, 228, 112]
2507A12J25l17L5n2Ok18K10J84k07jp5j6N3j46K1J23P7pk8J36j62J11JK8M7J36
2533A76N9k69K25r3K23j1j07j48k0J54k57J96j91j2j04p1K08j95o3K63j42L2k2
2556a69j24R6OL56l56K11J57j18j07J35K87l6k97M47k22l75N32k70K45m14K70
2577B54k14k35K68j12l4p6j12n1m6J58j12Q3o4R1J71j84K45j91K46k85L98k93
2599i5L00n2j37K17Q7j27l1j30P6j63J15j94k4J82l3r9j71J60j18j0O4K39J70
2622B26k58K9l75J15L91j9J0j74P4J74J9J36j65J3n2k53L61m08J86m9p9J30j03
2645g1Kj10J61k07J79o8Q1j40j17K11j85J07k3M3K79J24l45L65l3j55N3j45K13
2668B19l7M0k31J95j26j13j07J35R1p4oK1k44K17k01l8l0K8L49l85J43j10J48
$$ y = [112, 237, -80, -45, -97, -91, -309, -99, 85, -122, -123, -198, -214, -161, -307, -286, -163, -86, -93, -121, 15, -147, -36, -35, -7, 40, 176, 235, -34, 191, 98, 321, 310, 203, 55, 35, 189, -68, 128, -63, -75, -179, -250, -42, -237, -300, -37, -179, -147, -169, -293, -197, -191, 165, -191, 20, 177, 59, -48, 87, 374, 338, 41, 488, 266, -109, 423, 153, 398, -16, 254, 40, -195, 73, -39, -73, -149, -261, -312, -358, -200, -312, -229, -293, -202, -31, -215, 30, -161, 85, -200, 198, -95, 205, 153, 16, 233, 320, 193, 162, 32, 108, -55, 60, -134, -158, 24, -9, -108, -279, -119, -237, -247, -183, 56, 226, -32, -3, -378, -263, 128, 109, 119, -55, 19, 193, 212, 348, 183, 196, 144, -109, 252, -156, 30, -19, -98, 32, -71, -69, -179, -18, -225, -46, -114, -33, -173, -290, -79, -264, -157, -180, -137, 142, 266, -79, 286, 253, 98, 151, 6, 219, 182, 222, -9, 186, 60, -53, -160, -25, 66, -8, -14, 7, -237, -20, -221, -259, -289, -261, 88, -297, -154, -264, -116]
2691a16K18j09J44J10rk02Q3L65m88L90k84J44L38l49p5J04l13%J57m90KJ94K05
2714A9j29R1j68l6N7J6k52K35j75L48L6nk8K71l75K88j48j1L8K34k24j0j7k67
2738b12K94j19N6K7Q7j29J35j26k77l5L84n0p4r3J53q3l0K50k96J63L52k60Q4
2761B01P2l30K88OJ77m24J67j35J19j4j25K5p3l9m8J91m24K3P1K18k04Q2j5M1
2785a50M4J69j29J11m3n2L06j28J48N7k8j72J51k43k3J63n5M6l76N62n67R0K2
2808i7l4M9J07n3j01q1L7M24m96K14P6j23J38k42O4K4K57p4qJ95j11P4q2q2J8
2833I3J26j4m40L65m35L26L42m31j38L60k77R2N8N1k04m7R0j31J21MJ55k61K58
2856F3o9N9K22k61K09l00N0J60j24K61l83L52qk06j53J18j78q3J29j33K69j12
$$ y = [-116, 102, -7, 137, 247, 238, 36, 119, 484, -4, 386, 102, 246, 584, 235, 160, 264, -49, -49, 108, -382, -380, -186, 19, -110, -19, -187, -223, -166, -150, -402, -167, -342, 6, 42, 37, 9, 280, -95, 193, 45, 34, 72, 306, 82, 72, 55, -212, 82, -37, 19, 46, 133, 4, 139, 13, -264, -299, 85, 35, -39, -132, 21, -62, -92, 158, -138, 25, 377, 117, 201, 273, -57, 231, 237, 414, -10, 157, 22, 141, 127, 2, 27, -46, -85, -133, 58, -366, -343, -272, -54, -258, -176, -191, -150, -106, 63, -66, 45, 2, -50, 256, 128, 276, 333, 305, 133, 284, 41, 18, 181, 126, 172, -204, 358, -209, -119, -97, -131, -82, 25, -28, -129, -210, -173, 251, -245, -31, 45, -78, 60, -182, -118, -94, 163, 89, 81, 276, 165, 239, 157, 75, 93, 219, 205, -235, 130, -305, 21, 363, -68, -206, 154, -123, -31, 27, 78, -126, -173, -83, -214, -93, -89, 66, -195, 63, -6, 53, 275, 14, 223, -77, -27, 133, 9, 270, -113, 239, 231, 25, -128, -10, -188, -271, -142, -275, -6, -118]
2878a18j23J95JL4J00r2j13L9J38k44L41k5j81J03l2L5J06lK11j06j72n5nM6j96
2903a16O7j15J82j4j35Q9k44q7M05j16P2O0j00J16n8n4J2P6J61r3P3l9K02k70
2927G4K05k94onK04j53J90l10J69J16k34n0j3N0k01K83n0k34K38K5O6j5j88J27
2951fM2l49L33J92n7k91L60k16j59K49k39L7j31K93n0K46k96R5k90J73j3l1M6
2974f2m2L4k8K29k35onJ65k1R2k89J71j93J29j1L36l03K64j06k52J54k7J97Pq2
2999A16m47L13k04K93j78N3j66J49P4n1NJ72m7k44J03r4J89J65j55k1J0L9K73
3022C47l32N3R1R3j40p1K54j81j71J67j15l80L55o3J36l46L07k54K31J52jl55
3044b23K05n2K98j65M7k09R4J10n9J82k61j2J07J1l45M81j02k75J25K0k60K25
$$ y = [-118, -241, -46, -45, -11, 89, -3, -116, -77, 61, -183, 158, 133, -48, 55, 23, 58, 164, 161, 372, 266, 94, 39, 34, 80, -116, -49, -164, 18, 4, -131, -42, -286, -373, 32, -84, -12, 48, -52, 64, 6, -48, -36, 40, 201, 108, 181, 142, 344, 74, 279, -15, -21, -26, 178, 25, 215, -95, 74, 190, -44, -94, -107, -57, -258, 25, -25, -259, -21, 4, 70, 55, -133, -6, 36, -313, 20, 212, 155, -136, 224, 8, -151, 98, -141, -104, -235, 58, 8, 254, -42, 53, -237, -64, -77, -108, -62, -104, -70, -98, 131, -104, -110, -115, 50, 29, 121, -168, 3, -190, -61, -72, 264, -39, 225, 119, -133, 21, -6, 191, 198, 116, -331, -18, -222, 71, -107, -54, -220, -71, 3, -48, -43, 129, 82, -162, -59, -153, 36, 201, 46, 25, 35, 74, 347, 15, 68, 159, 252, 112, 41, 295, 114, -57, 110, -5, -385, -30, -93, 43, -303, 4, -250, -19, 133, 132, -223, -18, -70, 228, 63, 110, -99, -5, 105, 46, 228, -33, -45, 62, 73, -272, 209, 107, -168, -43, -23, -283, -58]
3066e8L0k30K5P3l02K57J62o5P0l5P4k22K60k08J26P6j21j20L64k43L29l08J39
3089G3j46J96J03k08L1M8r2M9K4j54p2K7J1J88k69O2N0J1jK6m8j43R2N3L31k04
3115C8j52J5R8N5L3k61K67l06L64P1j52o9j63J87j67Pk08M30p8j2p0k25K30j13
3139a81p5J72K1qk27J96K23q0j78J08n0L59k36J19m06J79K86k30P2J9k45L50k01
3162a3pK45k59L1k5K3pm9K81r5q8j7j9J72k87K51j01k33K17j09P9J1Q6k74L65
3187A78k72j74L78j32J22j33J39J04k35J34P7m80M5M9j2Q6L4J00Q8l23K28L7o5
3210b7J23K39k25qk88K73j83OM91n52K01j2P3j39O0R9M6p6q5j22K39k85J24J22
3234I4%j95O7P2j85M3L30j35j57o0L9o8K53j3O3Kj23j59J8K90Q8k07q7j7J3K03
$$ y = [-58, -28, -258, -233, -160, -462, -205, -43, -108, -38, -73, 1, -221, 39, -169, -43, 33, -88, -208, 156, -87, 242, -66, 73, -73, 123, 226, 18, 49, 97, 5, 54, 78, -76, -148, -121, -110, 78, -191, -129, -79, -68, -69, -43, -91, -234, -142, -89, 242, 38, -114, -99, -1, 54, 87, -174, 93, -213, 151, 222, 70, 1, -162, 25, -142, -135, -343, 87, 9, -3, -73, -298, -68, -181, -256, -84, -63, -71, -298, -102, 121, 41, -137, -29, -79, 280, 44, 163, -243, -64, 222, -8, 64, 83, -162, 188, -13, -20, 225, -34, -3, -28, -5, -12, -61, 220, 125, 37, 20, 1, 173, -114, 137, 36, -197, 20, -89, -10, 1, 87, -187, 178, -94, -268, 110, -22, 100, -33, 106, 210, -25, 109, 186, -294, -249, -200, -212, -126, -92, 8, 96, -227, 1, 38, -27, 96, 335, 110, 102, -186, 87, -96, -90, 401, -151, 50, 38, 111, -28, 32, 131, 177, 101, 16, -106, 133, -152, -28, 94, 94, -101, -34, 38, -147, -104, 226, 91, -66, -126, -87, -155, 98, 85, 148, 150, 27, -132, -114, 176, 264, 57, -30, -47, -34, 169]
3260A69m97M58j31j19K0j38L39j97O5L0j43Q0O8p1k60J18J43Q0J05J30n9l84J53
3283d1M15j83j29j3p3J00p7J99k64k03K66J49l87J77P6p5k65L13J44j39j35l8
3305a83K52J51l06J6L0K89l93RK07l1L21k83r1R9k87K9J54J97k35k7p1K05r7M9
3329Dm2k14K36K4n9k32J01J60J64k15Q2r1L9J81j78K72n5q3j67M4K51j11L8j59
3353a0M4k10N9lq9K6N7K14j72K8m1p8L6J00J5j20L08l6k50rJ91p4K95N1k60L0
3379A02K5L5k7j07K15m02J07J49j31m3k4O9j20J17k7J56j79M7l7J92k17N1N1M0
3403D2j32J02R8k76L89n5k07K23l43L13k33L75k76O3j17n8M01j99p0j05P6N4k18
3426a53k1J28R7J1J86j76L2j07J09L7J1L1k59L4Q9J69p8j43M12l03lj21K62m87
$$ y = [169, -328, 130, -1, -120, -100, -238, 101, -96, -31, -1, -144, -64, 4, -67, -327, -209, -66, 14, 119, 249, 190, -194, -41, 374, 191, 62, 49, -24, 76, -1, 198, -66, -269, -3, 146, -241, -64, 12, -63, -328, -15, 129, -10, -145, -183, 69, 220, -86, -70, -40, 249, -144, -135, 72, 41, 362, 79, -12, 87, -200, -171, -17, 180, -55, -82, -153, 52, -45, 4, -38, -252, -16, 8, -51, -283, -182, -22, 142, -73, 9, -82, -43, 138, -40, 232, 177, 94, -73, -29, 222, 111, 149, -10, 34, -176, -117, -120, -209, -183, -126, 88, -84, -56, -97, -175, -139, -39, -24, -144, 164, 128, -122, -131, 60, -14, 281, 332, 72, 102, 127, 162, 135, 28, 243, -159, -52, 97, -34, -77, -101, -32, -152, -35, -62, 94, -85, -38, -75, 117, -100, -49, 2, 42, -90, 12, 110, -166, 223, 168, -39, 184, -159, 154, -79, 296, 20, 83, -34, -92, 309, 110, 40, -65, 11, 65, -153, -174, -46, 51, 62, 248, 72, 104, -3, 106, 143, 154, 185, -74, -40, 49, 218, 140, -3, 409, 106, 103, -18, 244, -243]
3450b43L59l39K05N1R7m33L70k76O5J54jQ5k72K48n6J20j81J26P6r1l5K07k46
3473a0K81k75K8P9l00L13Kj83K87r4j28m0J7r2R4jr3j02L87k13l3J25k29R4J0
3498g6L6q2J43J72J52l90J15kl5J89l26L57K2O9k97K9j16M2j45R9m0R5r8j75K26
3523c6J27j88j26K9L20l85L46k7j05j41L33j81l1L46l10K52k30J38k1o7q9j32
3545a78N8M69n75K93k11J52J40l13J03j75L68l01J4K49j5j41j86M46r1j94K49
3566A61k97J88k2R3j67K10k34J66J33j89J6qj23q3J98k35K2J49j17L21k32k94
3588c44K49M3j5K4N7J40k01j68K80LLn7k0nrJ71K4k38N9k9L8j02J20J72m07L18
3614A06o4o5R6k33joL3J11k02K31k39K33J13j16j21%K17n4J91j19j61L10l15Q5
$$ y = [-243, 116, -223, -18, 33, 130, -303, 67, -209, -144, 10, 9, 94, -178, 70, 14, 134, -47, 79, 155, 64, 29, 236, -10, 271, -4, 24, 103, -197, 116, 118, -65, 222, 128, 0, -40, -23, -115, -21, -22, -115, -217, 170, -43, -76, 49, -180, -86, -76, -40, -122, 21, 193, 345, -45, 70, 68, 33, 222, -104, 253, 275, 344, 47, 76, -40, 2, -143, -44, -84, 11, -87, -262, -36, 91, -97, -223, -194, 126, -259, 87, 60, -45, -186, 147, -34, -65, 281, -29, 223, -7, 131, 110, 43, -46, -178, -120, 349, -226, 67, -144, 8, 148, -165, -62, -237, 131, -170, -156, 93, 78, -63, -249, 197, 106, -88, 161, -136, 52, 30, 123, -44, 166, -68, 98, 231, 42, 58, 50, -73, -156, 42, -193, -171, -22, -139, 182, -50, -344, -95, -52, -67, -43, 14, 154, -47, -215, 65, 68, 71, 14, -6, -11, -20, 151, 175, -63, -4, -33, 5, -97, 23, 195, -212, 106, 42, -23, 73, -160, -161, -167, -134, -23, -225, 6, -233, 0, 113, -3, -124, -124, 93, 39, 230, 111, -50, 260, -55, 30]
3638C0J17l5j5k1m1L0j47j70K69j22K88l03q4J07J9K84l13L0J81k04Q8J6k8J96
3662A72r4m9J7j89J96p4M7r0J79j38L78j96j39o0Q4ql18J05K45Q2o2l93L36j15
3686h4Po3M09l73K81k85P3J86q8p0kK74l02N5J65R7k69l4k7mJ71J34m21M4J0L4
3712h2o3M7l7P8j03J62K2j68l8o6K70l52K95J4k33K57K47m19J47J53K35k42k01
3735g7j29K97k26J79J23j03QJ77m74mK61k04J79n0K2j86K55l2Q5Q4o9k32K79j06
3759E7j26l0J34K08K3k98K00Q3k43J95j34n3O8K6j39J20k20j42K36Q6j68r4L74
3782A63k01N0rk11J06K10k54O7J24j26j01L66j01q6O8k21L13j07Q6k61J85m2K3
3805D1j06q9J91l7r5J68m2rj09J81m95MM55j50j67l3K50J68k38N3M4J54k47K66
$$ y = [30, 147, 112, 97, 76, 35, 65, -82, -252, 17, -105, 183, -120, -204, -97, -78, 206, -107, -77, 104, -100, -12, 4, -24, 172, 78, 29, 46, -143, 53, -21, 26, -64, 115, -23, 355, 159, 20, -40, 44, 36, -282, -177, 68, 150, 88, -305, 31, -84, -77, -140, 269, -104, 177, -108, -35, 151, 63, -7, -9, 265, -37, 18, 183, 280, 11, -23, -50, -54, 117, 251, -170, -126, -116, -82, -145, -98, -135, -57, -160, 2, 24, -144, -182, -248, 22, -330, -35, -21, -254, 3, 250, -169, -22, 131, 366, 124, -77, -206, 91, -135, 44, 167, 64, 72, 249, -225, -229, 32, -172, 7, -43, -21, -207, 48, 16, 101, 185, 116, -116, 163, 57, -69, -99, 35, 243, 266, -32, 168, 251, 8, 203, 69, 16, 84, 110, -29, 91, -129, -271, -35, 51, -117, -211, 163, -38, 12, 3, -208, -102, 108, -146, -79, 45, -81, -182, 184, 83, -3, 65, -156, 157, 50, 136, -125, 60, 18, 41, -65, -154, 37, 0, -95, 73, 31, 22, -87, 94, -401, -397, 58, -92, -259, -292, -42, 126, -112, -59, -15, 139, -108, 158]
3829A58K4M9j07J0j99K83o4J3j40j95J86k07R2k7kJ31q1J31j5Kj6N6jl8k03R9
3855f1K15r9j09L8k55K29n8K70J71j94j35J60q1J47k75j71P7r9N8K29j55N5O5
3878B2j03k0K65k30r9J72n8o6K03j23J20j14J20M3k66J04p7J72J5mk13J50j11
3901i8K49j39K9m4J58k0O3k69J18j29N8m1J2O7k6k47j27M36j43K18J08k06J38
3924A65J7m4O8j72J78j87%M07j71m05K49pm42L32j36K63j79m5q2M5L9q9M21n6
3948A69j68k44O22n08PJ42j36K71n9j43J68n5j6M5j40K35o4l07L25j68J21o9J65
3971A93j3k12Q8k27K66j40j06k18J38K24J8j43J53j02K73k13O8o8L7O8J64j86
3993F2N0L3q4J36k10N4o3J47k65J50j14J37m9k60N4K73Kk10Q7p0J46P5q5k47K34
$$ y = [158, 182, 231, 124, 134, -65, 218, 154, 167, 27, -168, 18, -189, -97, -124, -126, 5, -76, 55, 40, 42, 26, 82, 81, 43, -160, -61, 154, 55, -54, -16, -271, -42, -100, 170, 341, 147, 12, 172, 91, 238, -37, -208, -131, -230, -172, 57, -98, -43, 22, -81, -101, 164, -66, -165, 7, -51, -117, 86, -37, 83, -31, 89, 132, -134, -30, -107, 65, 80, 76, -137, 13, -98, 151, 12, 41, -3, 155, 135, 198, -71, 47, -82, -24, -65, -53, 14, -12, -259, -386, 50, -93, 125, 233, 27, 165, 182, 138, 206, 34, 212, 25, 25, 432, 261, -144, 105, 98, -344, -12, -148, 115, -64, -109, -191, -146, -107, -196, 225, 169, 1, -243, 379, -129, -122, 20, -116, 155, 96, -47, 121, 66, 50, 95, -45, 190, 126, -181, 144, -24, 97, 28, 193, 180, -32, 56, -171, 95, -45, -151, -369, -231, -7, 11, -132, 21, -81, 192, -21, 47, -21, 16, 84, 248, 62, 112, 145, 61, 197, -13, 41, -22, 125, -140, 10, -104, 33, -16, -276, -222, 51, 53, -157, -70, -140, 6, 81, -4, -251, -17]
4018a7K3k28K74q4j8Q9N1r1K64l06J39J4J67k79P6O7j11J14j99O7j72K18j13k46
4042c01K93J02j39o8R0J90k45j09K06j30m3m3J78L79j74p6J09j68J19J26l17k80
4064c01M72j50J87m87J21j9J5O5k9J91l04L29k28Q9n4N8k34K41P5J0r4o6J06k66
4088b73K73J32k06K53n2p0m47K96J08j19Q4j9j41qK15j08P4j17Q3l09K88j5n3
4111a31R6J68k40Q3K44j37k02K76J13l61K63k58J60k51J99M8P5r3r0J67l90K15
4133d6K06k23R7q3j44PJ43k53K08J71J24l61RJ47j42M17k46O4k9q2jj7J61N4k17
4158c6q3L60k73J82j48N6j52j64J60N6j63J79k17j23O4L48j15q5L99j13l53J55
4180f6k6L01p3j26J66o8R1j73L3J60l14J66J70k34j57K85k73M67k92J37k47j72
$$ y = [-17, 6, -222, 52, -32, -50, 39, 90, -1, 263, -43, 96, 110, 277, -2, 74, 141, 30, 144, -55, 12, -160, 58, -55, -301, -8, 94, -45, -113, -23, 167, -78, -187, 19, -111, -154, -197, -19, 360, 186, 110, 219, 51, 170, 296, -21, -301, 171, 21, 208, -279, -158, -177, -162, -97, -126, 65, -239, 90, -138, -49, -103, -45, -279, -38, 37, 47, -47, -113, -7, -273, 0, 132, -74, 179, 127, 57, -390, -94, 14, -105, -21, -40, -181, -189, 26, -82, -8, -125, -42, -351, -63, -78, -131, -35, 133, -107, -24, 220, 83, -119, 157, 270, -91, 172, -86, 74, -177, 22, 70, 145, 52, -38, 129, -261, -46, 160, -63, 34, -49, -193, -186, -43, -296, -88, 83, 207, -154, -145, 2, -140, 277, 31, 95, 66, -16, -17, -34, 127, 181, -36, -119, 241, -32, 150, 2, 58, -94, -258, -98, -42, -205, -26, -243, -366, -302, 46, -69, -154, 245, 132, -221, -66, -92, 209, 136, 10, 176, 108, 199, 26, 59, 219, -95, 71, 241, 7, -150, 135, -138, 329, 37, 174, -73, -245]
4202b45m5K95k32J15K35k62m3J90j2j57J88l3J11j10P9K01j82Lj50J84l1J11p1
4225A39j31j20O6j66K70j04K0m0K21M8r5K6P1l30P2K03j47%l4J91j38J5J63j25
4249G5QJ37r3J04j3k76k17K70L7O4k23M9J29l42J79J98l24p3N18k45k11J8J83
4272d8K47j59j63J65j30K29l72L13J77j69J8J46j55r9k5j68M18O5m36KJ36r1j7
4295a16K17k47J34j02K64l0l31J41q5OK67L7k03K00j07j89J30J80m89L86k2J6
4317E7N2j00R9j39P1k6J69k09k1o4K1J78mN0l85j28L93k04K83J17k45l4JJ72M9
4342A53j84r3L00j38k13K25j2L8K6k55M91l83K02j18j20K22O6l71J77o8j41l5
4364b31O8K17k83M40j89j66K65J8k80p1K38J57j72p7K79O4m64M09j3J25j60q9
$$ y = [-245, -290, 5, -227, -112, 123, -139, -182, 8, -4, -161, 27, -6, 105, -5, 74, 275, 93, 96, -54, 130, 99, 210, 139, 8, -112, -46, -212, 58, -46, -26, -66, 155, 203, 108, 134, 205, -125, -53, 150, 3, 3, -31, 160, 22, 37, 200, 75, 83, 220, 127, 231, 218, -58, -275, -5, 32, 96, -127, -78, 51, -291, -112, 86, -238, -311, 207, -38, -249, -231, -48, 199, 40, -123, 42, -88, 141, -231, 82, 259, 90, 108, 254, 99, 0, -25, -193, 225, 290, -146, -144, -8, -99, -116, 101, -146, -12, -114, 150, 120, -211, -70, -155, -149, 118, 155, -48, 152, 45, -144, -14, 166, -323, 63, 41, 57, 109, 9, 108, -31, 40, 14, 183, -26, -47, -111, -90, 88, 84, 134, -251, -379, 14, -190, 93, 210, -35, -69, -68, 104, 153, -31, -124, 176, 38, -175, 50, 38, 76, 102, -153, 338, -45, 157, 39, -81, 141, 207, -164, 13, -55, -196, -231, -163, 54, -229, 211, 22, -144, 121, 139, -141, -212, 26, 183, 11, -66, 213, 277, -187, 222, 209, 334, 174, 85]
4386H5r5L3K5R8J05m21K26l8l9j58R8L54l72l1J45J01k77o9L00l7j30N3J74j89
4410e9j29J49K75k65p1L81l56k1J13O4J36k5k11J76Ll51L09k56J75j52M7j24J50
4433d2J3P1J0j96o5K66j97%J07J6j28J13L71k7k37j1j19J57j32R1R8R4l58J04
4457aJ3k6k33P5J93q5M3N1l11J10L3J58m54O30j53p4Q5NK12l92K46r6o8J77J30
4482B68m70K78N5j40o6k9J80m17K18%N2J56j01K06jl80K45P5j31r2J44j39J16
4505B7p1J28L1j19J65j90J95k06J49k88n6K75J90j60j84K54j90M0M7l86N49m03
4527b03j21K83K3r9P7q6K8O7k42L10K22L2l81J85K12k75J04j90M04l80R4P3J79
4550C16k33j4J5j67K01N8j67rj59j59K87K2j65K34M5j44j55L31j83R3r3K4n6k5
$$ y = [85, -10, 23, 48, 146, 251, -170, 56, 18, -21, -179, -81, 273, -99, -130, 15, 116, -161, -230, 70, 33, -97, -44, 130, -59, -188, -39, 236, -29, -100, 281, -75, -96, 17, 81, 217, 192, -19, 157, 160, -191, 118, -138, 37, -115, -68, -192, -42, -29, 42, 52, -144, -209, 57, -140, -140, -33, -17, -145, -32, 339, 312, 75, 64, -55, 102, -30, 61, 159, 253, -105, -1, 12, -14, -247, -172, 21, -64, -21, 30, -281, -171, -138, 20, -434, 196, 43, -31, 54, 59, 271, -121, 125, 29, -39, 138, 268, -202, 76, 131, -9, -75, -104, 76, -341, -123, -123, -71, 85, -16, 190, 189, -191, 54, 129, -2, -94, 50, -89, 27, -44, 84, 115, -4, 161, -29, 166, -40, 109, -179, -235, 40, 230, 70, -114, 140, -50, -10, 37, -349, 200, -203, -324, -41, -18, -117, -40, -126, -98, -31, -273, 37, 259, 291, -90, 95, 307, 32, 136, -54, 350, -30, 64, 137, 316, 83, 69, 84, -83, 118, 176, 9, 0, -159, -318, -31, -9, -174, 60, 105, -39, -194, 137, -46, 47, -46, -22, -78, -103]
4574a03J81Q4k47R8J04j05K13j85N5j19m19L44L48k12q6n3j53j10K52K16q3J88
4596B08m60J31R7nN3j52L25K0k95j19K03r4lM4J22J44n04J83j0K42Q6j37n6o7
4620d4J04j88M5o3R3J72k32k2K05r5R2k62j5L86k83K8j4O6P1R3m18M73l40J23
4644b5J97l02O0j34j6K84L08k41k00K22j11j94L17j39O7l0r4K79k98Kj35K62J08
4667A87k56K18k17J75M8l35L69j04n6k45M60o6l79K76k8k93M51n8j06J1p8k5j74
4690b25J16q4O6J48J39l4n4j82MJ04N5P2j26j32M6L33k80j25M7J06j69J65j18
4713a28J12q7J57P9j24j82J71m4J74j63m8KJ22j91K26k07L8J37Mj5j06J55j32
4736e0oN4J80M3n4k04j9p7o0L01k97J7L10mj45k63K54J65j96j0K58m24R4j10L62
$$ y = [-103, 78, 162, -85, 13, 117, 12, 225, 40, 95, -24, -443, -99, 249, 37, -49, -102, -255, -365, -113, 103, 20, 208, -252, -121, -24, -29, 24, -128, 197, 217, -78, -197, 6, -88, -91, -47, 75, 219, -285, -102, -112, 130, 216, 79, 23, -44, 60, -128, -83, -146, -53, 119, -113, -135, 70, -25, 67, -195, -210, 176, -107, -79, -93, -27, 44, 137, -281, 192, -148, -25, 172, -130, -70, -204, -220, 64, 372, 131, -69, 153, 42, -152, 165, 26, 93, 63, -31, 248, -50, -48, -183, 79, 187, -69, 149, -68, 107, 155, -180, 189, 85, 29, -216, 244, 178, -201, 75, 47, -246, 205, 147, 41, 52, -26, -51, -225, -109, -193, -127, 21, 160, 126, 72, -110, -106, -2, 53, 125, -1, -133, -87, 246, -34, -159, -112, -6, -175, -10, -128, -16, -103, 54, 133, 9, -173, -2, -46, 128, -35, -83, -81, 41, -150, 76, -131, -93, 44, 48, 33, -73, 82, -50, -56, -2, 178, 221, 167, -37, -56, -133, -193, 108, -189, -172, 138, 134, -11, -274, -20, 145, -51, -61, 197, -227, -133, -243, 119]
4761A19K2r3k66L51m35L93J11k79K35%l1j51O7J82l12K27l2j52L39l54j71K02
4783b8k29K40j55J10Q8k89Q1K0J38mJ5r1r1J47L8J73k59K65j18p7oJ02j50L4J53
4808A07K3l55K77j0k90J73OJ64j06JL6M4n1n0J06J14K2k76r1K19j58M36n08K86
4832A19j35L30j8k58J8m7J58p8J7Q7k36o0J66P1k66J90j67l1l3N3J51O5j31J95
4856A60r2J70k93k9R3k72K22N0j48L72r0k5l01J63J8j71L01P6l3k5r9k15J57j29
4880a40R8O9J73j69J49l95K14k5kJ05r6j43N6P6J67K27n69J40K50l13M3K64L8
4903B17l31K94Nk22K59q0j25J18l07M25j41m87N06j05K4m5o3J04j8j9R8K00n16
4926b09M5L66j01j69R1j44L04o8r1O1J09k21J35j6m9o3Rn9M00n72K46J14j38J13
$$ y = [119, 141, 48, -218, 133, -302, 91, 202, -77, 158, 158, 127, -24, 43, 225, -87, 140, 108, -44, 295, -59, -230, -28, -257, -17, -172, -62, 26, -263, -182, -162, -24, -28, -13, -104, -195, -48, -10, 163, -96, 169, 51, -26, -32, 70, -80, -46, 107, 130, -225, 52, 42, -248, -75, -69, 95, -11, -10, 26, 70, 19, -31, 75, 189, 211, -65, -156, 63, -95, 341, -167, 119, -16, 314, 296, 38, 56, 9, 167, 89, 106, 193, -43, -103, 63, 134, -132, 58, -109, -140, -173, -120, 31, 96, -35, 160, 68, 238, -55, -84, 9, -263, -41, 9, -139, 233, 143, 118, -183, -20, -2, -173, 128, 204, 171, 146, 47, -168, -11, -140, -42, 27, 200, 31, 180, -215, -1, -26, -28, 77, -19, -162, -106, -30, 137, 364, -205, -65, 185, -128, -85, 179, 217, -114, 180, 185, -37, 222, 142, 17, 135, -172, 253, 112, -375, 131, 26, 50, 5, -58, 46, 28, 9, 107, 307, -209, -164, 202, 101, -68, 23, -121, 183, 115, 24, 85, 194, -27, 108, 92, 43, -20, -11, -70, 330, -242, 4, 118, -20, 93]
4950I3j62K44j09q6J51k66J31Q2M5m1j20R1K2J32k48J76Q2k84J32J02k46J46q8
4973b1J73j64K42l84N9n5L5N9J25j07j49P2L7L60l62K91N1k45K07k76L3j2K4m2
4997d9l5J33O4N5o8K31m04R0J1k33K90J00k11Q4R7J50m39J44o2L9N4k01N9M5K51
5022A95l49J06K8q5L42p6K5p4k9L4j8p2l6j0Rn1L7Rl2J50j61Jn1K99k54K5j57
5049a95J16Q7q3n8J96J56k10J56j55j20K06J82j41J71l07j99L07m8j48j1j5K01
5071H8r0J54o2j2m9k66Q4K06j29J3k69M59j62K17l72q0R9K0K13q5L2P4J64j05
5095A42k06J6J58j72Q5m3R9k94J52p4N4J46pO7l2k58R1ON8j21J56N4N3l57L91
5120A64k67K57m5J4k11J50j43K9J37J92m64K58l0k07Q7J0o0K33%rq3l2j5j65K95
$$ y = [93, -69, 175, 66, -20, 131, -135, -4, 78, 123, 82, -38, 53, 75, 207, -41, 135, 217, -67, 65, 167, -79, 67, -21, 152, -12, 230, -154, -95, -150, -115, -56, 69, -38, -187, -115, -78, 282, -80, 211, 262, 17, 224, -52, -19, -31, -7, -49, -84, 49, 113, 168, 100, 331, -73, 17, 28, -205, 85, 185, -26, 58, 155, 305, -134, 10, -52, -13, 41, -160, -101, -56, 195, -154, -48, -20, -105, 237, 161, 186, 112, 83, 117, 99, 27, -9, -19, -10, -61, -24, -15, -47, 103, -58, -57, -108, 191, -63, -38, -195, -79, 8, -75, -133, 63, 219, 9, 165, 10, -110, 96, 278, 137, 308, 1, -198, 109, 61, -87, -98, -113, 88, -2, 152, 90, 78, 29, -237, -153, 53, -76, -63, -332, 127, -35, 182, -190, -270, -171, -151, 62, -23, 9, 83, 247, 142, -64, -48, 110, -62, 23, -20, 79, -215, -63, -137, -83, 63, 56, 123, 91, -167, -76, -70, -12, -133, 23, 77, 130, -227, 164, -103, 154, 109, 123, -88, 62, -81, -52, 85, 277, -187, 71, 41, -166, -79, -69, -129, 104, 104, 95, 12, -20, -35, -200, 95]
5145I5r8J24l17M39k49j8M15j18l65j13N8O6J45J08j99Q8J90j64j79M82l39k47
5167a96K11j47L32l73J07J43j66J32K9j76O2K27k47m7q2Q3J01J92l23L56k79K95
5189B34p5j85m4K31J55l20K82j8k72J50Rk70J16Q1Pmj55l8p0N2K55p4j3m7P2k14
5215a55J57K66k8k67J23L2o0R4o2p6l20L81o3M5mk85K45N5K9j10K9r2m6j08K29
5240IJ24j11J15j53L0J97k64k0J76k3j80J34k15K22m4k12K31Q4P7k51r4K63l81
5263b86N26j85o6MJ26L9j31J97j97j37J32j39J03r0J48J18j97j68J60J78k08m3
5285a16N5L88j84L0R6k66rQ8k56J43o3J13l73M42L7j78O4k63K51J9j01J36j0l
5309D0k8O3Nj1Q0k26M09l35J07J24r1o0l1J07j24j25K04J14j13L9J03j36l57L21
$$ y = [95, -3, 121, -196, 243, -6, -24, 391, 273, -92, -205, -147, -81, 64, 172, -27, 61, 251, 87, -92, 390, 51, -196, 15, -132, 200, -173, -66, 77, -89, 43, 72, -104, -42, 185, -62, -109, -191, -108, -7, 185, -138, 218, -61, 234, 159, -26, -70, 161, 316, -4, 278, 260, -12, 138, 147, -123, -7, 74, 81, 77, -78, -116, -186, -134, 121, 47, 34, -13, 59, -155, 2, 268, 240, -27, 96, 128, 68, 162, 100, 24, -296, 85, 22, 67, 63, -222, 23, 78, 107, -3, 26, -66, -112, -220, 9, 133, 22, 137, -16, 14, 211, -53, -73, 103, 80, -100, 34, -181, 41, -3, -215, 16, 100, 177, -74, -168, 95, -286, 240, 55, -11, -7, 119, 158, 27, 224, 27, -110, 22, -117, -14, -104, 44, 162, -35, -203, -43, 135, -73, -116, -61, 327, 143, 173, 269, 3, -6, 82, -174, -31, -94, 19, -354, 88, 125, -53, 11, -252, -1, 18, -83, 53, 43, 40, 12, 75, 80, 69, 149, -77, 332, -3, 104, 228, 137, 77, 46, 153, 29, -96, 108, 222, 109, 148, 251, 115, -242, 79]
5333G9q6n0J26J4q5j91K29k51K18j74K50r9o4K02j32r8J32k6j21p2K98J0J65k13
5357F1k7J85l31m4m6J03L3P1j20K91j5j34j60K77k14MP2q7r7J63k2O8l68L60k57
5382b34J88J58j23J97O4j12p0J34k68L00k10k20L44j61J52l87N27k91J34l7j29
5403d4P1j41Nk0J34k2p6L3J5K96k33Q1Q1k62k6j38K99j05j34M59k07j07J08j04
5427c7k51O36l75M2m3n3nK3J34r9J67M5k3l15QR7J28j25M0J02J0k0k81K57j83
5452a21n5P1K76j9k50K45j89n4J50k17J26M4k07K30O4p5o3J05o1o8K32m0l3j15
5476b4J29o8p3j8J25Q8r0o6j73L21P1l93J66L8P2k37J31j26K29k85m4J78K22r2
5500H1j16K1jN1J3R1M1K8k00l5J96j99k67L85N8l97K58p2o6J72Q5j11l96K49K25
$$ y = [79, -7, -57, 69, 83, -2, -193, 36, -215, 3, -171, 79, -20, -84, 118, -14, -112, 20, -6, -127, -199, 99, 109, 274, 61, 34, 219, -112, -156, -202, -99, -66, 5, -115, 176, 161, 27, -133, 144, -70, -66, 6, -81, -178, -15, -37, 31, -337, 23, -234, -46, 112, -11, 186, 250, 138, 68, 202, -66, 234, 24, -196, 148, -13, 139, -248, 279, -12, 122, 85, -44, 27, -114, -109, -129, 5, -17, -93, -60, -45, 251, 18, 99, 180, -82, -108, -246, 53, -52, -186, 273, 66, -41, 67, -37, -288, 348, -27, 15, -28, -81, -86, -63, 71, -28, 139, 184, 161, -154, -146, -49, 79, -46, -6, 96, 106, 86, -195, 62, -121, -176, -105, 171, 152, -98, 147, -42, -96, 54, -163, -37, 7, -200, 30, 94, 19, -44, 61, 0, -68, 164, 124, 91, -24, 105, 37, -36, -54, 71, 159, 69, 3, -170, 151, 222, -171, -5, 33, 105, -132, -1, -127, 102, -183, -227, -49, 173, 81, -35, -14, -15, 36, 49, 140, 181, 209, 9, -26, 170, -29, -296, 89, 147, -250, 8, -64, -130, 42, 127, 16, -380, -131, 94]
5525I4j9j89o5pp2L67l86L13j74J40j45J90k27L47O8k16J00j7j4k14j7J73J11
5548A41j47mJ22k07J66Qk24K97j66MK8P7K0r0j72m7J96l4K50j91j06j9J37J46
5572A85J60l42o4NK96k61jK06j62J9O7j15J84k76j19J00LK78j93L01l07L26n40
5595b50K68j88M1M97m39J04J40o7l51M43k23n9L6J15N1q2p9K76k09k57L02J04
5617A73q7q6q4Q5k1J4l7P7P6J84l92oL85o06L24K66l65J22J51j00K4J63l23K01
5641A38J16o8q5K60m37J13j05K34j29k5j62P2J22r2m9N2O2j14L0J48r6o9K4l7
5665i7J53m4j7K35q2j30J25m0l0j7L2J67k82J45j07O0R9k88J76r6L44k85M9l15
5689b45L14j67j3R6R8l01K79O1j41J71k9L9n3q0o3o8L94j55P2j00j67K70k33l0
$$ y = [94, 75, -114, -179, -186, -258, 109, -277, 36, -138, 2, -143, 47, -180, 167, 235, 19, 119, 102, 88, -126, -143, 30, 141, -6, -10, 112, -95, 71, 79, -145, 152, -14, -10, 18, 95, 115, 25, -147, -194, 2, -32, 218, 27, -79, -98, 39, 185, 345, 3, -61, -56, 240, -21, -22, 184, 22, 41, 108, -7, 177, -99, -218, -118, -115, 163, -30, 271, -36, 290, -250, 18, -170, -129, 368, -71, 33, 173, 106, -245, 198, -25, -84, -48, 67, 118, 36, -43, 233, 24, -233, 69, 173, 86, 0, -84, 1, -20, -6, -43, 34, 110, 294, -98, -104, 281, -325, -1, 265, -100, 22, 173, 73, 97, 260, -63, 138, 254, 186, 101, 361, -76, 37, -68, 166, 37, 12, -150, -78, 44, -48, -97, -45, 17, -97, -67, 81, -15, -84, -60, -97, 56, 12, -5, 230, 148, 18, 143, 103, 73, 56, 88, 255, -27, 118, 11, 71, 170, -118, 58, -38, 306, 21, 70, -245, 69, -98, -111, -15, 83, -218, 61, 122, -19, 152, 123, 162, 109, 29, -34, -102, 292, 137, 209, 109, -58, 212, -21, -51]
5713e1J52jq0k3k3J35q7J1j20K9j99K43j11J88o2M7J3j48J00J28o4L7j14j82R1
5738i1L0L6j16K0J60K99k79n9pNM9J5k6Rqj67K80k87l6J15J19R4p2j60p0K75k99
5765a71L85l40J44J34qm7M4j6j60m8J70q0j04k0M4K00J18k08R0j16k18J82k15
5788b40M38k24j12j5J66j05R9J48l37K32k24L35j03%j23NR8J30k67J21J44r7J3
5811H2j05q5O7P9N1k48K44l54M9K59J9l54K42r8J91j30j6j50L07k3k80L02k7m3
5835b1L11k41q9K28j02n8j73K55o1m8J93j50j48R1p7J86l01J29J32K34n32K15
5857b7MM6J17k43J75j77J15j7j26N1J62J75o1j10j08Q4j45N70m47J54k63r1N9
5880a03J4K42j00M5N2j26k21J61j49J89j2Q8J43M9m10R1j2K01j17L61m64P5j06
$$ y = [-51, 101, 100, 20, -3, -26, 109, 22, 33, -87, -58, -257, -14, -125, 63, 1, 48, 61, -87, 13, 141, 77, 114, 0, -182, -91, -61, -25, -141, -121, 39, 338, 59, 0, -7, -2, 47, 62, 36, 45, 37, -130, 150, -137, -173, -58, 61, 155, 83, -77, -147, 128, -171, 214, -126, 18, 152, 144, 97, 141, 125, -35, -83, 87, 7, -97, -117, -73, 127, 245, 37, 127, 11, -207, -25, -240, 198, -26, -138, -153, 13, -92, 7, 155, -182, 50, -174, 161, 58, 58, -65, -60, 38, 168, -99, 22, 166, 69, 82, -23, -108, -41, 38, 89, -159, 85, -269, -220, 39, 58, -296, -54, -152, 39, -91, -107, -257, 50, 27, -253, 49, 22, -21, 290, 49, -40, 188, 86, 28, -145, 110, 49, 1, 194, 44, -104, -13, -90, 96, -205, -76, 56, 290, -242, -27, -23, 23, 140, -103, 72, -105, 10, -7, -133, -82, 80, 255, 194, 84, -24, 60, -85, 485, 38, 192, -71, -162, -103, -89, 153, 53, 98, 150, 24, -197, -36, -185, 4, -8, 80, 223, 272, -138, -47, -59, 142, 25, 386, -78, -3, -109]
5903a09Q0n4K20k38M77m68N9J21k79J51j69O1j94J71r9N05k95R9J7J45j06j81
5925h6j16J84q7k03J25L51l07N4Q7n1O5P3k5q6n2k9j2K87k58m5J09J81j86j26
5949a53j23J37N0N0j79K9M06k08J14j10LJ39j85o4M17m13O2J23N3J22j21j72o7
5972i0J00j70K78M2j15L6r9o4K0M2l90K84J03R8j49J05q8K43k2j29n9r8j12J87
5996d7j33R8kJ87k49K96j30L3K25k47J92l54m6K46J29j74k15K12j21J53j71J33
6018A5p7j22j2K74m1j71K46k02J34r6J12o8K94j68k67K04k3l01K83J44k76K61
6040A43k04L1k07K45J41k10R3O6k11J04o6K28k48N8k0J64j30j20Q3L38l12l5K46
6063A77q0j85L10j66K16j92k02L30l01J55N4j05L3N1k70P2j07K19M0o2J2r6J69
$$ y = [-109, -29, -83, 137, -101, 376, -92, -33, 88, -191, -40, -209, -148, -342, -171, -270, 235, -60, 39, 56, 201, 95, -86, -202, -18, -105, -308, -183, 168, -139, -85, 2, -49, 16, 89, 64, -22, -74, -103, -115, 172, -86, -131, -22, 159, -27, -153, -276, -139, -89, -39, -218, -189, 217, 9, 123, 13, 16, 155, -30, -94, 323, -90, -28, 95, 148, 270, 149, -23, -90, 10, -160, 118, 160, 45, 81, -18, -82, -62, -20, -410, -126, -23, 75, -74, 31, -57, 186, 164, 35, -24, -122, -234, -47, -180, -82, -84, 103, -146, 150, 20, 53, 278, 31, 223, -131, -177, 69, 198, 24, -191, 21, -100, 53, -118, 15, -62, -184, -196, 78, 37, -134, 112, -90, 44, -52, 60, -8, 286, 118, -149, 55, 32, -269, 14, 158, -118, 143, -61, -30, -237, 8, 149, -61, 32, 98, -113, -9, -75, 153, -95, -37, -57, 107, -23, -143, -60, 278, -34, -69, 177, 97, -88, 222, 56, 272, 80, -122, 208, -93, 62, 116, 11, 44, 95, -175, -103, -210, 9, 49, -13, -1, -97, 72]
6086G2p1%L4k9O9j69J33J20m7j75N0K36l23K13J81l94N8Jk06J35J24L4j67m3J81
6111A7r8J39kn66M29R1M7P3LJ12r1mk48L04j5l98K31p4Q8J4J8q1k55L39N4R0j23
6138I4j84O3k4J08J86j92j46K4j54L14j07k44L61j20L30m19L07Oj27k27J09O5
6160B3R5l0k67J13j3o4K56q7m4Q7m7j3r0k3L24l26J73j69j08L41k74oJ97K85l34
6185ak36N04m7k58J96p1j66N0O8Rj84K93j74J4J25o9J82m25k8J35l4j80K62k74
6209c09J61R7j09L06k20Q4j36J44k77K03J38M5L0p4Q0k94L61j92j2J14O4k73J93
6232A24l28N0J93n0k56J54J99p7k64q8L65N2kj13k73M28j02j11J56k88L87j40
6254A6L10n57M71k55J15K23m53L1J04L6K5M9Q5j01k12K8J01L5J83k04k09J26J26
$$ y = [72, 1, 1, 35, 6, 75, -94, 39, 159, 112, -63, -13, 223, -100, 113, 294, -100, -42, -41, -247, -112, 12, 46, -121, -164, 17, -81, 58, 56, -510, -81, 10, 57, 130, 133, 245, 154, 150, -98, 206, 191, -207, 24, -50, 38, 52, 70, -11, -266, 73, 127, 217, 94, -90, -27, -51, 57, 243, 51, -95, -71, -225, 89, -18, -262, 99, -21, 309, -110, 197, 203, 76, -151, -42, 23, 118, 88, -179, -66, -79, -143, 113, 26, -18, 69, 22, 9, -81, -104, 220, -106, 67, -102, -210, 131, -143, -149, 48, 333, -1, -237, 267, 220, -38, 158, 87, -79, -29, 39, 48, -136, 157, -17, -3, 122, 53, 235, -190, -218, -83, -117, -297, -35, -309, -148, -51, -160, 146, -74, 10, -126, 18, -259, -56, 82, 127, 157, 83, 163, -131, 230, 38, 26, 140, 204, -69, 124, -204, -154, 39, -11, -267, -113, 86, 9, -255, -343, 22, 74, 72, -41, -314, 114, 12, -99, 57, -231, 156, 16, 326, -231, 240, -15, 100, 323, -130, -99, 5, 41, 66, 115, 200, 99, -113, -85, 16, 51, 234, 30, -179, -53, 73]
6277G3q5l1K06mok06J57oj84J16o5J40k74J76K0r9pK59k75J37L36k57j05l5r8
6302a17L34m97M50l90O5J56jK28j15j93M7J60J4m08O2J70J66j23QR2j80K83k49
6325c8n4K7j1K74r4j52J71l5j67J92J80m80L73k29J88j03Q8j22O8j07J2j05J99
6348G5k9k6j03P7J36j96K14J22l98R4R3Q8k35j54K74L7J21J20k02%Rj83m8K37
6372A23j31l7j13L23ll08J81rj60J07Mq2L4J40k43O6N9J20j98J30K42m83L29N0
6396A41l03L26j58j40M0J68m04M75J0j67M0j26J05j02J40J56k63K60l39J96k4
6417C1J10k68O6l5m2L27l87J28J37j02q9J45l9K20l01K90j92qQ1k94J18o6P9M1
6441e0p0j11J59J50j55nK58k41J82J31n59L73K3k16p7K36K92m30M7L3LJ1J4j37
$$ y = [73, -12, -43, 163, 159, 153, -53, 104, 98, -86, 30, -35, 105, -169, 7, 27, -72, -79, 180, -95, 42, 378, 121, 16, -19, -117, 217, -280, 170, -220, -155, 1, 0, 228, 113, -80, -33, 127, 141, -267, -205, -35, 131, 8, 16, 108, -72, 211, -38, -92, -65, -76, 198, 104, -48, 123, 88, -79, 113, 293, -187, 186, -43, 145, 42, 130, 8, 76, -31, -19, -124, 75, 46, 20, -83, -6, 130, -66, 148, 270, -128, -34, 59, 147, -88, -242, 32, 69, 190, 310, 108, 108, 117, -66, -114, 123, -8, -45, -158, 165, 162, -146, 35, 26, -134, -27, -23, -105, -71, 69, -174, -108, -49, 71, -127, 3, 245, -238, 91, 141, -162, 164, 6, -134, -94, 74, -330, 145, 155, -12, 28, -98, 7, -95, 45, 201, -62, 198, -141, 55, 31, 141, -127, -61, -96, -138, 189, -198, -70, 67, -35, -124, 21, -18, 202, -99, 191, -1, -9, 72, -222, -104, -170, -91, -50, -120, -231, -72, 78, -77, -82, 176, -65, 117, 248, -311, 62, 85, -131, -208, 28, 320, -110, -63, -30, -27, -16, -2, -139]
6465a39J45J42j42J14O5j10j22q2K31p3m4lJ25lJ6R0o9k04J56M7K39k19k14m4
6489i8K05q1K34l05n7K82l55J69j9l5P5j02%J31k95K96p2R9n5N3Qj8O2r1j67J29
6515gJ04M8l4Mj30J19k57P0K76m05K72p5J9R3m59L73Q3o1Q2R7l32P9L08k41j27
6540a01J76K08k82N2R6k68J80J44j47k3j38L22k31q3L13l13J72l04L28l51J73
6561g7L4j01K61m6L7p6k5j07m8K07j04L14j06l04l3K72k69M41l2j09m3j82J4J58
6585G6j03k56M09O1o4j12j77K65L1j68j23J68L19l11j32N8p0J15R0k7k10R0NK10
6609A44jj57Q3k74K01j73J56j28L9k57M57j55L6k8o3O6l8K36m3r8N4l2j44R7M8
6634B6N4K5j72Q0q4j03L59o5l7K60j50j01J84j79l31J59o7L33m86M71j92j23N4
$$ y = [-139, 6, 148, 6, 120, 185, 75, -47, -129, 102, 29, -15, -18, 107, 104, 120, 210, 141, -63, 93, 140, 379, 160, -54, -98, 107, 26, 260, -45, -102, 180, -175, -6, -25, -60, 15, -87, -87, 44, -251, 45, -27, 72, 17, 70, 78, 60, 122, 31, -136, -7, 97, 145, 111, 115, -15, 104, -153, -83, 193, -212, 60, -15, 4, 97, -362, 11, 94, 33, 115, 212, -120, -41, 267, 26, -101, 75, 283, 1, 53, 149, -119, 61, 205, 58, 35, -103, 219, -12, -95, 218, -95, 77, -227, 101, -250, -77, -43, -144, 117, 71, 108, 32, 7, -100, -148, 59, -45, 269, 163, -141, -174, 98, -171, 270, 238, 129, 86, -96, -82, 76, -27, -283, 126, 187, 123, 11, -166, 99, 130, -38, -161, 7, 326, 15, -117, -59, -129, -14, 76, 49, -161, -71, -66, 144, 143, -14, 69, -205, -4, -177, -21, -149, -110, -367, 90, -65, -29, -57, -120, -54, -92, 144, 101, 3, 57, 25, -119, -22, 26, 80, 105, -67, 13, -71, -174, 185, 120, 83, 343, 193, 92, 276, 97, -234, -75, -142, 191, -295, 176, -16, -139, -85]
6657h5J31k0R3q4O1j40J23Jj55q1J36j50rJ92r0J3m2Q4l7J60k60K46p0L26n36
6682a93J68k0QM2J21m00L46Qj33J46M1k60J04P1K18j98N0j58p1K20q3j62L02L8
6706B05k18K0j20L35j24k83N82m37r9K33K76n47J34j6J44l07J48j65J72K62j96
6727aJ23m6q9k9J72m6K82m63K26m0k21j5K39J15J4k73L5P1j56K0K50l45K61q0
6751Dj82M73m25M6K69l64L12k62L1L20r6j62L14m51N2J6L11n7m3k21j4J10J23
6774A04N0k18q4J06J06o2k45N44m24P4k22J33L8O1L1J94m26K99J79k78L1K9j14
6797i4n2J26J57r9q8j02r9L32N7k03j25L45n2N6j03n9o3K41o8j20p9K80J0Lj51
6822E0r1M7r2K19j83K5J3m9jQ8O6r3j79M20j00QM1n5k68M0K8J55K5j78J31k1p9
$$ y = [-85, 46, 26, 119, 35, 96, -44, 79, 80, -75, -156, -20, -170, -179, 13, -77, -64, -106, -22, -59, 101, -159, 87, 17, 343, -193, -25, -45, -37, 5, 126, -274, 72, 80, -53, 93, 134, -126, -22, 49, 267, 69, 119, -39, -110, 110, 27, -135, 167, 205, -13, 7, -113, 222, 98, -185, 397, -40, -139, 94, 370, -177, -43, -59, 85, -222, -74, -239, -67, 195, -1, 122, 76, -13, -42, 130, 84, 366, -97, 129, 89, -132, -147, 92, 207, 221, -52, -17, 54, -102, -82, 168, -177, 84, 4, -178, 295, -130, -84, 185, -179, 133, -129, -98, 222, 126, -36, 278, -173, -121, -105, 206, 149, 106, -115, -129, -19, 104, 154, -64, -148, -42, 64, 2, -243, 301, -123, -49, -271, -138, -100, -39, -8, 186, -240, 59, 238, -40, -9, 20, -94, -146, -20, 137, 38, -50, -152, -251, 81, 138, -65, -190, 155, 103, 159, 56, -3, -66, 175, 107, -13, -92, 188, 198, 201, 50, -41, 6, -86, 133, -50, -25, -12, -61, -62, 26, 92, -1, -180, 240, 140, 148, 189, 134, -134, -94, -66, 89, 114, -64, 67, 46, -33]
6849c3Q5j79J75oJ02r2j3M7L6j57J4q2K2n4n8K80j22m5K14j64j17L74k56l1m2
6874a02p8M19k76P8j0mj86R3R9k47L4K95p0k06Q5j47L45k7j11R8m70L44K24k07
6898b7j1j04J27j14K87n1J32j67k76J84j0qk06K72j68Q0j9o7L32j82J21j29nO
6922cj17O0J17j1o4pJ46l34M2L54q9J28l41J44J51l1l59K60j07J48j63J72j72
6945g6J06qj11J57j38L4j3L05J16l86k8l1K37k46L16k40R0k3j64K32o2K29k47
6968D9j00J32k58J84o7Q3r9Q6k1J61J6n5O5r9Mj12J02m19J60P6M30j82k75J58
6992A9J6j72L10l11J29M0j95K64j6q7l01N17j29J55k47K0j25m7n7K47j08o8k6
7015a72J49J8NmJ14k21K12j17K9J45Q4j55L5J09k97N1j08L21r2k93K02j18O7O3
$$ y = [-33, 52, -127, 48, 42, 144, 52, 39, 86, 122, -35, -21, -103, -81, -135, -193, 87, -35, -80, 134, -30, -147, 227, -29, -60, -102, -180, 239, -37, 41, 31, 27, -159, -66, 33, -214, -180, 115, 45, -161, -76, -223, 122, 95, -16, 82, -388, -44, 180, -27, -38, -142, -15, -129, 158, 107, 239, 72, -204, -20, -30, -38, -244, 28, -140, -60, -79, -146, 186, 4, 125, -4, -9, -3, -120, -60, 57, 46, -18, -25, 121, -213, -171, 183, 94, 222, -119, 25, 176, 145, -214, 46, -61, 87, -76, 96, -76, 30, 22, -89, 68, -70, -36, -49, 256, 372, -14, -42, -73, 164, -82, 234, -6, 84, 61, -103, 129, 67, 296, 49, -51, 81, -177, 7, -60, 23, -76, 10, -11, 150, 166, 111, 176, 77, 81, -31, 71, -348, -188, -112, 318, 136, -139, 19, 35, -137, 173, -138, -9, 31, -164, 100, 84, -3, -304, 213, 84, 239, -8, 12, -113, -160, -217, 30, -78, -146, -172, -23, -5, 0, -4, 110, -111, 101, -16, 13, 158, 242, 87, 122, 231, -66, -15, -123, 198, 106, -187, 15, -103, -36, 27]
7039B7j13Q6J73j8k72K74j91NNl2l9qj13K50m5j10j12L58j7k28N5L2l4K40j99
7064b6j50J4K63j2k21L1J73K70m22M24m52L39j15M4k01J5M0l6o2R3PL4K5k14J95
7089E6P4K9j83R6O1j51M6K41l80K92j75j16r8J23P2J6k43L58J8J35l02M7j95K94
7113A15k47J50Kp4l2J06j66L06k02J99j91l9M9J53j73Q5n5l5l9n0J83l45K69P1
7137D0J67l93O13p54L12K4p7j0K22k23L9j2R2j4j09oJ12J26K4K00n71J00J35M3
7161H0K70k01j12k12J51n3J41l8K05j87J0J67o6j02n4L2O1j86J80k79K74j26p6
7184a21J33j40J07j4L4l61N7J45K13M8j36m3L9j24L6L24k37K63k86J04l6J86J2
7207B03k55o6M2R6j43P4l7K69l5k79MM81j96M3k25K1J70k09j52L13o5l2J01k4
$$ y = [27, -86, 0, 173, 155, -117, 157, -34, -29, -24, -56, -95, -103, -216, 34, -11, -121, -233, 125, 108, -120, -65, -33, -67, 173, -26, -176, -162, 101, 89, -132, -101, 72, 342, -80, 344, -108, 231, 116, 160, -41, -26, 14, -22, -84, 9, 16, 50, 75, -139, 56, 130, 159, -24, 72, 133, -18, 28, 269, -111, 181, 6, -110, -208, -85, -13, 3, -240, 118, 136, 271, -31, 16, -179, 115, -132, 18, 20, -54, -86, 20, -146, 160, -42, 157, -34, -73, -24, 129, -44, 41, -14, -49, -88, -138, 45, -300, -31, 40, 207, -186, 427, -327, -15, 9, -68, -78, 144, -79, -40, -52, 40, 26, -83, -89, 23, 149, 173, 373, -198, -98, 37, 80, 350, 149, 37, -175, -24, -77, 64, 26, 231, 44, 54, 221, 155, 53, -1, 31, 92, -94, 86, -193, 81, -45, -121, 12, -128, -21, -35, -1, -362, -305, -160, 53, 101, -35, -78, -39, -163, -127, 197, -40, 223, -63, 41, 5, 191, 203, -52, -118, -76, 20, -123, -49, -86, 183, 148, -131, -127, 354, 158, 201, -24, -3, 167, -42, -194, 119, 54, 22, 123, 99]
7231I9j73j32J30K7p4j2J08j12J64m75L21K28Mk4l43O0L7K41r3J21k78L61lp2
7255A10j17R9j6j15K29M5k00m6p6j10K20k8J1m0L8N2R8k11R0K3k00k51K67J12
7279a6lR5k2M4l8J62j39j6k85M78k01n1j23l5L33kk67J56j41J73j21k26J46K97
7303A98l02j37K10j3m3j6Q9J57m51M38N6j24k51L93k45j16K29j75N0k46J97J56
7325E4M7j08Q7jR0j75j58L9J1J16N6k65L27j52j05n6M41k29J47M3r0j64q8J57
7349B4R7k05R7j2j81R0L64j61j43J47n8k20Q7K25k10j05O7J95k02P1P8j13o0K44
7373A16p1Q8j71J54j81r9J14o7R5l7n0N6J31J61j49n9Q0l4om6j96K35j34j44K78
7398F4m2j53J09k0j73K32l18L55j39K20k56rJ51J14j51k3J20o9jJ26k60J26n9
$$ y = [99, -74, -206, -76, -49, -123, -135, -27, -139, 25, -450, -129, 99, 103, 79, -264, -204, -167, 74, -19, 102, -176, 185, 182, 110, -7, 92, 76, -39, 190, 235, 35, -11, -87, -197, 23, -5, 6, -34, 4, 56, 154, -57, 33, 56, -144, -395, -128, -16, -19, 76, 54, 98, 60, 222, 83, 67, -218, 260, 59, 8, -115, -150, 183, 181, -86, 70, -71, 102, -19, -245, -99, 198, -104, -241, -31, -44, -87, -103, -14, 143, -308, 130, 186, 62, -189, 204, -41, -157, 72, -103, -53, -299, -102, 54, 101, -7, 80, 79, 169, -6, -164, -125, -114, 2, 58, -207, 120, -32, -137, -193, 248, 19, 166, 209, 119, -45, -133, 24, 121, -84, 13, 1, -180, -90, 274, 113, -30, 117, 59, -161, -74, 151, -59, -164, -97, 98, -104, -33, 45, -68, -128, 116, 45, 133, -38, 116, -65, -164, -50, -117, -22, -59, -109, -53, 78, 239, 90, 31, 111, 77, 71, 25, -171, 64, -70, -214, 64, 22, -131, -22, -42, -215, 17, -301, 54, -85, 135, -121, -130, 21, 135, -16, -39, 81, 12, 11, 137, -123, 3, -56]
7421e6R1R6o9Q3%k44M9m6q5L69k69MJ08n6j04q0l5L02j41J37j09K44j60p2K8K0
7447EJ52l24M2K15j28l8m1J23k36M3N01l33j20M4L3R7m5J72j44n8J7j7K24k71
7471h7J6K50q8J8J97o59L45o0N0J39k23K12q4p3pR5j40J08L50n29J14p4k7N1J64
7496E8o6J62j42l25L10j81l7J59O8j89J58J82j69J01l07L06j13l6M5q2O2r3J73
7519D4J02l89j42L22m9j6L7q0J53L3N3j31R2o8j51m2K08j2j96M25l65R7P7m4J30
7544H8j80q2K16J20k72P8N3M0l6q2K33l22L63k19m7R1n6m7L46k37m1j90K39O4
7568A20l19J04m1J90m5pr7M24l63L35n04K02J46o5p6q7K6Q5Q8k53L31n1q0l1O1
7593I3K4K2n7k44J78L5K3k91M57k92k5j7K84j44o5Oj87J91K00No5L8L3k02M1J22
$$ y = [-56, 35, 131, 62, 145, 145, -99, -50, -96, -181, 188, -81, -77, 31, -25, -129, -209, -244, 58, -83, 54, -55, 189, 29, -43, -15, 5, 157, -167, -125, 90, -38, -76, -117, 6, -230, -187, 314, -19, -139, -95, -62, 35, -10, 162, 18, -40, -23, -40, 184, -87, -71, 179, 91, 109, 306, -353, -8, -68, -18, 121, -102, 110, 26, -47, -54, 41, -99, 9, 359, -170, -56, -130, -157, -106, 58, -8, 154, 12, -313, -3, -184, -221, -62, 6, -183, -25, 157, -12, 89, -218, 88, -25, -61, -16, -98, -36, -129, 44, 146, -243, -385, -63, -112, -128, -91, -171, -18, 15, 68, -63, 29, -39, -190, -232, -24, -36, -232, 193, -172, -75, 2, -42, 88, -92, -174, 42, 162, -110, -32, 21, 61, 25, -57, 176, -146, 217, -2, -49, 42, -14, -61, 285, 48, 7, -183, 56, 120, -199, -95, -136, 54, 9, 2, -95, 329, -34, 301, -203, -1, 145, 80, 4, -83, -57, 28, 116, -137, 194, 143, 63, 32, 93, 117, 139, 82, -162, 16, 51, 74, -217, 240, -52, -77, -94, 190, 46, -19, -13, -200, -9, 191, 196, 131, 169, 202, 0, 41, 163]
7619A63k56J79j92K25O0j88O6O7q4M1j69j7L31l05L02j99j20J22l1LP6l4P0o0
7643E0J18J9l73J64n7k0J26j0l5j45J71J09K8k21j01J89R8k09J05j6J41j78n5
7666a02J84l09RL72l3m7J38k61N0K5j01p4L17j75o2K70j19K43n15L57L4l09J73
7689F5Oj84K46J08j90j82J67m7P5r1l4lO3PJ91k40P7LQ5l2j74l1K82j22q2J37
7715A00l00M12j39J49l5j59N9l1j90R1j23Q4L21k51m9n5P6k5j82L9K30p9J58k50
7739a49M20k32k69K58R5r8q3K79k36J0K05l16K62J91k52P9K29m73K76j50m04M11
7761E3J44j78j98L45j68Q4m1P1k1l02K89QK20l50M0j94K77j82J2M46j52j58o5
7784b0O2N3l2K05m00L3P4J9J29J44k25j7j92O2M01l57M5p2j25L89oj67o0n6O2
$$ y = [163, -93, 86, -106, 119, 179, -9, 57, 124, 40, 81, -88, -105, 226, -79, 223, 24, -96, 26, -5, -2, 74, 40, 110, 50, 168, 187, -186, -22, -79, -99, 27, 17, -18, -163, 8, 117, 145, -76, -177, 12, 110, -99, 6, -10, 131, -47, -102, 82, -227, -218, 154, 121, 74, 212, -49, 1, 26, -75, -149, 168, -7, -69, 201, 82, 325, -190, 167, 201, -108, 65, 71, -113, 133, 241, 51, -131, 36, -11, 64, -27, -61, -64, -1, 6, 197, -43, 34, 37, 122, 90, -84, -115, 167, 45, -37, 100, -200, 212, 73, 222, 187, 28, 87, 56, -134, -43, -166, -82, 239, -12, -61, -116, -40, -65, -247, -208, 22, -57, 101, -149, 271, 39, -230, 28, 123, 25, -58, 221, -15, -5, 200, -116, 146, 337, 85, 164, 393, -80, 196, 46, -358, 53, 197, 19, -179, 166, -2, 82, 41, 112, 91, -211, 78, 86, 306, -44, -4, -198, 79, -103, -91, 355, 203, 45, -20, 42, 95, 63, 268, -132, -99, -25, -6, 123, 267, 42, 25, -167, -105, 296, -61, -16, -88, -213, 176, 170, 3, -57, -113, -51]
7809e1M0r2K41j04k07J32j87K13j50K07L9J97l82L10l34K35j12j38R4L7k07K26
7831Gk37O9K06j48j2J38J9l5q3J59j82K0m7J75j15J44q0l1J06k31Q1P7M0K5n6
7856In2P8P5l9k13K3KPP9k0J44k03K54k10K20j88l0J07q5J87j55J03j9o4k9j86
7882b05J72j25%J17j35J88J28K0k59k39J97L06Kk80j18K98Ok83P3l1J00j2J37
7905E7l7n5n0O1j92K38n9K24q9l9O0j60j37J17K17j69Kl1J19k12J80j34J26q5
7929d8P6r6K35j98o7k33J77L31k69J9J38j58J70j66K90k04J13j32n3L9j01J17
7951b0R4r6k60Q6J94J51n7K5k80M5N1M2j82R9K1Kj4R1P9rl67J52K7J30k44R8K44
7978A02o5O6j51m3J6J4l4m3J55j70Q5K5M5j06P2Q2k79K43P7J93n12%L37j71K10
$$ y = [-51, -11, -103, 138, 34, -173, -41, -228, -15, -165, 42, 81, 278, -104, 206, -128, 107, -5, -143, -49, -12, -219, 7, -230, -161, 45, -103, -115, 23, 42, 7, -76, 83, -99, -79, -126, 49, -66, 78, -2, -33, 73, -158, -77, 0, 40, 65, 9, -43, 35, 110, 71, -142, -119, -117, -110, -31, -51, 93, -110, 144, -66, 154, -34, -64, 43, -42, 145, -10, 93, 74, 10, -19, -205, -33, -158, -158, -41, -176, 12, 140, 160, -99, -338, -141, 165, 167, -113, -231, 67, 73, -210, -137, -168, -68, -80, 57, 20, -35, -85, -24, -216, 22, -37, 187, 98, 59, 119, -41, -178, -61, 156, -13, -11, -42, 77, -135, 45, -89, 37, -48, 28, -68, 167, -31, -98, -331, -154, 177, -92, -73, 65, -93, 77, -89, 201, -3, 110, -22, -75, -36, -137, -20, 74, -22, -282, -196, -2, 149, 92, 117, -163, -118, -67, -25, -207, -108, -87, -85, -99, -8, 71, 62, -305, -153, -126, 4, -240, -142, 102, 37, 103, -48, -91, -75, -61, -95, -138, 17, -153, -68, -43, 2, -104, -32, 50, -229, 14, 91, 284, -228, -228, 109, -62, 148]
8003A48k43n3N0K66j2n5j89N6j41J24K33k95p3l6K35M4k26K98k28K00k8j25K07
8026A57k72M97n51J87l58K06K95k38mk4J96l6j37L98k43j1o7O5j33J50j08j31
8048a62J89K8n1M6k74K81l4j7n7L0j54J46J32l40L85l56P8J52k5L91l52K08j56
8071H8Q0j92o5j95L33j45m7M51k80mn6n4J02J2N8j22J07P7P2k26k4mo9J86k06
8096a23P5rJ6o4LJ20j62K14p5N9K02j85J02j45J20l50L22l21J30K10k26R5j80
8119a72J31k9J72k10j2J74k35K24k12J45n5J55q3p3R8J37j07j37M20k54r0j55
8141a68M35l20K22l38K09j8j8KO5j08K79k15j74M12l0j63N6l68K30J60M1j13k9
8164D9j74R3O4p0L1k01J73k1J18l23L77P8nRJ51k36k92o9K37j3j6Q6K1k4l4j25
$$ y = [148, -95, -148, -98, 168, 156, 101, -88, -32, -173, -49, 184, -111, -184, -220, 15, 59, -167, 131, -97, 103, 75, -50, 157, -115, 382, -169, 18, -340, -134, 161, -77, -81, -105, 91, 55, -82, 316, 73, 62, -5, 60, -73, 77, -31, -162, 27, 55, 4, 50, -224, 57, 23, 6, -51, -21, -175, -29, 103, -237, 148, -208, -130, 22, -3, 388, 36, 244, 88, 168, -24, -89, -284, 49, -96, -143, 308, 28, 24, -32, -86, 16, 28, 86, -36, 71, 148, 220, -6, -30, -34, -103, 83, -123, -48, -57, -41, -105, -102, 18, -144, 70, -5, 54, 256, 71, 173, 28, 148, -202, 120, -201, -71, 139, -87, 8, -172, -41, -70, 102, -108, -120, 54, -181, 43, -169, -24, -79, 76, -7, -80, 18, 155, 48, -89, 331, 77, -13, -168, 267, -53, 169, -169, 40, 22, 4, 6, 71, -37, 242, 27, -147, 265, 235, 72, 128, -240, -10, 150, 191, 78, 49, -125, -32, 32, -38, -7, -208, -35, -56, 62, -261, 116, 194, 189, 198, 349, 113, -179, -248, -11, -24, -40, 46, 67, 43, 9, -116]
8190a16L55
$$ y = [-116, 239]
8191B39
$$ Imaginary data points
##PAGE= N=2
##DATA TABLE= (X++(I..I)), XYDATA
0@%%%%%%%%%%%%%%%qJ6j6J6j6K4l2L2m0M8n5O3p2Q7j00J12j28J47j65J86k10K36
37A25k66K98l31L68m11M58n06N57o15O81p52Q29r12J002j104J219j345J484j641
56h62J820k024K257k533K862l259L753m386N234o429Q258j1441J8561o8556K2411
71c4334N9550p7111L2494L3852o0310j6979P4653r771k7732L2633N338l7564J9660
84e621K2745j3078P02J9443r913j1577P813P172n893j374K462k300p629M903Q563
99A6418n994r730r33l347J841N437m835k742M475j0952k375J7982o138j6186J7428
114C49N210k3513P275J5800j6719K511K1062j3653j1592J4570m792o102J7087
127G493m605j7364J1056M824r103J1600N218j6279J800P203p797P053Q399j1725
$$ y = [0, 0, 0, 0, 0, 0, 0, 0, 0, 0, 0, 0, 0, 0, 0, 0, -8, 8, -8, 8, -8, 16, -16, 16, -24, 24, -31, 32, -40, 47, -53, 59, -69, 78, -87, 99, -111, 125, -141, 157, -174, 194, -217, 241, -265, 292, -323, 358, -394, 435, -477, 525, -579, 640, -705, 779, -862, 958, -1066, 1191, -1342, 1520, -1739, 2014, -2372, 2862, -3567, 4691, -6750, 11811, -56745, -34334, 25216, -51895, -19401, 14451, -45859, -62838, 11815, 2044, -25688, 6945, 12283, -25281, -5621, 17124, 4046, 4748, 24191, 14278, 2701, 10514, 17686, 11793, 10419, 12881, 10581, 2952, 7855, 16418, 10424, 694, -239, -3586, -1745, 3692, -1143, -3885, 590, -10362, -12737, 5245, -893, -17079, 349, 5559, -17954, -10679, 5121, -11598, -9087, 11975, -1678, -13270, 1300, -3492, -9594, 7493, 2888, -14476, -3420, 1404, -7699, 3901, 9119, -7160, -5360, 1843, -5954, 1099, 9498, -2227]
141b227r3R655j0228O9J7049o463j1471R559k252j1655J1052P743j0792j334L910
156B522o183J288P683m260o305m01M64o9L381K480l129m945J286M639j311j054
172c914M666k128n999N869L801m272M587M232o451L64M215o097J784P880o599
187A938k561Q066o293n505J1896j256j1341P750K586j4246M355J1124q926r57
201c370J0763p584q360J0227K360o613N587L264q951k62P269p62k80L366j538
216E116m205m66J975J048p12p10l33j217j068J982J217k473j916o56m80L14O13
233a971L40N02j316q91K146k23k403L328J747m064P53K636l606K29O493m13m117
250h30K908r05n555K902L613l129Q43L256k824j966J523j269J43L216j50j585
$$ y = [-2227, -2320, 7335, -2893, -2824, 14225, 7762, -3709, 5850, 3598, -8057, 2995, 10738, -54, -1388, 2522, -3661, -2373, 5310, 1050, -5255, -5656, -5192, -5261, -1880, 600, -2529, -7474, -6188, -1549, -2860, -3914, 752, -1376, -7375, -1506, 2295, -1977, 2610, 6842, 391, 755, 4970, -1127, 657, 8537, 1938, -623, 7443, 1150, -4355, 7541, 6285, -5056, 2694, 5280, -8966, -4611, 6513, -2413, -3370, 7393, -191, -8551, 1676, 4036, -2577, 3010, 6274, -2677, -2939, 4330, 3568, 3288, 6654, 5116, 911, 445, 2420, 3468, 2756, 2046, 1713, 496, -572, 1410, 2627, 154, -1762, -2418, -2898, -2584, -1971, -1631, -1129, -2445, -3336, -1190, -1413, -3816, -488, 1259, -2805, -2052, 584, -3022, -2793, 3700, 3287, -830, 2078, 1173, -4382, -1480, 2133, -996, -153, 3103, 279, -1687, -164, -1433, -1290, 1926, 1776, 191]
266A91K21k392n5M623N0j447L532k71m303J788J683m555J056N612k133k725K587
283C462j592m593K883K591m869j420L523j806k293J845l29l411K138M055j597
298a413k259M90j354q50L810K929r30L13J976j576o58J228L29L05L002M0k400
315B982p25K32o80K568J497l902j325O79k221q38K847j845j918L266O37m435m93
332c674J537j293Q87L431k051l262K050J527k05J440Q80k013o96J175k08n87O25
349d37J093K81l2p84j155k01M49J807l97k288q97O93J059Q35J093k46j820Q1J228
368C62p90l99J372J210L6J5J74j479l1K219P47j826n05o92j318R98J587p25j130
387a75N51o68j135L95o51q02J210O33n92J01K95Q2J162J163j683o29J494LL22
$$ y = [191, 412, -1980, -2035, 2588, 2638, 1191, 4723, 4452, 149, 1937, 3620, -935, 121, 5733, 3600, 875, 3462, 1870, -2723, 160, 2751, -2118, -3538, -15, -1821, -4114, -2269, -2598, -6009, -3871, 184, -1413, -3672, -3182, -4536, -5386, -1576, 1353, 423, 736, 2712, 1136, 478, 1706, 2035, 2340, 5342, 5382, 2982, 2257, 2489, 1809, 4377, 5874, 1972, 647, 1326, -895, -1733, 1114, -731, -2649, 617, 1254, -3181, -3674, -2137, -3430, -2543, 888, -1163, -4425, -2375, -848, -1053, 387, 1267, -746, -1442, -267, -475, -1062, -437, 656, 937, 905, 121, -1034, -1235, -786, 1021, 624, -1664, -2561, -1868, -809, 26, 1119, 873, -947, -866, 362, -428, -827, 545, 1755, 1791, 1806, 1980, 501, 470, 2689, 3436, 1610, 1105, 413, -905, 93, 1680, 955, -175, 376, -292, -1427, -1032, -1683, -2485, -1275, -642, -1234, -1133, -838, -756, 406, 1569, -114, -743, 751, 754, 1076]
406A076J251n88j603K231R41r31j31l32k146j75J357N20j427K25J7j522m06R80
424f63j13o01Q45n21k367j87K247J514J489M87k086k502O26J718J806J287o52
441B327j971p09P5P91K463N53j799j634q96j930N68K914J75j453j20j609j308
458c563J957J271j492n09L26n54R47K457k75j364K07M47M07J555Q45j143j574
475e5K47R99J021J107O12j117j552l07M42K24Q24p00r21N22j34l77R98K91j775
494C49m98O09k00M13J178j185r96N44l43N01J858j00k574r48k11j588J689L016
512A514m58k289p29j243j399J471K243p3j283j241j117L93J352K486R98r75j320
529a670j179N39K374K237J55r54k06k53J169K302L2j885j326l29Q29J408M8r06
$$ y = [1076, 2327, 1739, 136, 2367, 3308, 2377, 2246, 1914, -232, -407, 950, 1470, 43, 268, 285, -1237, -1643, -663, -776, -1377, -532, -1053, -3420, -3607, -1360, 154, 1643, 2130, 44, -2458, -1832, -114, 1692, 2979, 2327, 356, -353, -278, 513, 2976, 3529, 1730, 96, -800, -2730, -2162, 752, 927, -526, -646, -2255, -3563, -1606, -335, -1827, -2336, -2010, -2564, -1617, 840, 565, -799, -592, -145, 262, 1817, 2662, 1519, -55, 192, 1191, 2212, 3319, 3931, 2814, 1262, 955, 1397, 1621, 2445, 1745, 824, 1346, 1212, 835, 1833, 2124, 349, -149, 460, 260, 673, 1851, 666, -330, 214, -129, 372, 2230, 2130, -444, -1392, -1603, -3191, -1502, 1514, 1056, -1233, -1962, -3205, -4604, -3133, -890, -963, -2246, -3487, -4604, -4211, -2859, -373, 625, -350, -1670, -2849, -2310, 64, 2301, 2456, 1502, 1296, 1043, 2212, 4514, 4546, 2661, 1335, 1006, 1835, 3243, 3291, 2385]
547B385n30j927o79J830L43k491l24K26k490j97K253o6k6K47j542j100J106J035
565a947J94Q79n51j195J401J762l01M38K77m87R2M52k04P8Q86k28J112k88j468
584I02l79Q85P75j19n34j256j325O52R49J473p7k116p49R63r46K54O88q89j096
603a945Q18j17k82O35n27o84J69p91n27J237K71j622J85N50k7P17J618j346j213
622b881J54N20J767J729r71j316N89P43J074J216j84j613j85K55N03O23J83m8
640B158Q6p66j159J47J39o44P40K01j656o42M04m16R79N86r04o82K04m96J01R13
660g07P7K76J012l40p78O40OM5N06n89p40J114Q41n36R11j445j742J041J775n29
680H38N0q66k599P6K513N92P3M44k036j494J012O33K21J131j24r69N23j98k57
$$ y = [2385, 1855, -72, -751, 1079, 1422, -1069, -1393, -1167, -3657, -3854, -1601, -1667, -1693, -1446, -2988, -4088, -2982, -1947, -1753, -874, -1425, -2620, -1219, 543, 242, 680, 957, 470, 562, 1014, 810, 888, 1774, 1546, 2658, 2370, 902, 523, 1408, 2183, 2064, 1530, 274, -1051, -399, 550, 2023, 1946, -170, -919, 44, -902, -648, 40, -849, -1945, -1127, -1244, -1526, -891, -1418, -2102, -1933, -2724, -3251, -2014, -1743, -3365, -3180, -2630, -2657, -1940, -322, -1668, -2881, -2727, -2207, -440, 1289, 318, -998, -409, 334, 1408, 2624, 2440, 827, 642, 897, 1400, 2023, 2206, 2158, 2244, 1478, 319, 466, 605, -39, 701, 902, -754, -1396, -992, -1408, -429, 157, -747, -1429, -1225, -1721, -1620, -707, -630, -354, 658, 318, -460, 180, 186, 231, 737, 148, -592, 522, 1363, 827, 1738, 293, -1449, -408, 1367, 838, 888, 22, -2577, -2501, 12, 604, 677, 1121, -915, -2409, -1397, -764, -543, 588, 464, -505, 18, -180, -437]
699d37Q79P38n23l22l44l23J14M15m10K16J98j22K71l44j227J14q6K71Q93k8j014
720a071K16Q56m22O87O46j309l85J398m54j16J134k38j057J201L20j106L47J28
738G75j102M89L90r15K52J037o54l90K15l18n12L15j91K79O16k27m14L94r1j23
758a75R61J12k33Rp66l73R26P40q6Q7l74r38K17L99p09Q0qp08j95P68k87j76K24
781e05o58k10M57k31k0N15m17j97J043M79m77L64k44l41L11J79j68J64L19k25
801A38O11j05l23K2P5k25j54M38r36j33R29j42j55M62m07m97J43L83l30j87L62
822c1l51M22L85q3P1J65m73k85q5k93M55K47j21m03j1k65j7M83m60n96K35j67
844a178L99L45Q5n25M78J48M55k7jm08M00M47J34M39L76o23L60L81k62K17K3m67
$$ y = [-437, 442, 1180, 657, 335, -9, -332, -218, 197, -213, 3, 201, 79, 350, 6, -1221, -1107, -1193, -922, -29, -57, -1071, -855, 1, -421, 266, 912, -397, -782, 616, 162, 46, 1180, 942, -115, 1086, 1406, 300, 647, 775, -327, 162, 552, -363, -111, 926, 272, -118, 97, -221, -733, -418, -609, -330, 286, 59, -355, 39, -52, -175, 786, 898, 665, 674, -92, -465, 461, 1201, 1115, 1202, 828, -110, 107, 506, -203, -123, -131, -839, -1034, -266, -553, -729, -505, -1163, -1373, -916, -1147, -1167, -652, -1069, -1266, -223, 256, -221, 143, -101, -442, -131, 48, -120, 44, 363, 138, 749, 644, 321, 343, 418, 193, 39, 477, -459, -592, 337, 195, 40, 502, 95, -402, -259, 124, -206, -393, -31, -382, 40, 425, 342, 413, 578, 105, -180, -265, -558, -103, 144, 23, -380, -391, -656, -673, -190, -650, -1246, -1011, -1178, -779, -434, -349, -874, -396, -248, 207, 180, 179, -229, 171, 618, 752, 1191, 1567, 944, 1304, 1685, 1423, 1640, 1663, 1196]
866A196n43J66m64m9R72M44q49p94j269l69R38O55J37l86r42r26O80N72L61J22
886c48J06r04n38J03K2J084P16K77n94n83m00k46J402J40l04j61k92J11M31J60
906A82m49L26j72K38J48R1n48J29J35M56K93K10P8j25k03n10m6N28k00N91J87
927A339p11r12M62K77L77J03p94j093L9M07j51N04j30q02M70K38m75J78j74p7
947i25J03M18J86J15L80P9l26J29o17J81Q35j30j72K45o80Q4Q91m31l94p9o22
968g30j34P77k84m15N52l91%M07L80r96M94J18o15L04O24p22O94O69k08m84K22
989B62o73L10O68r3r93K53k98k56Q80J16m63n4l39n97K11q5l0P26J35q56N30N94
1011e2n10L27N99o57k19L62J10N55R25p21PN11k67j38M99l56n09O86n17j77O29
$$ y = [1196, 653, 819, 355, 306, 1278, 1722, 873, 79, -1190, -1559, -621, 34, 171, -215, -1157, -2083, -1403, -831, -470, -348, -242, -1146, -1684, -1581, -1559, -475, 241, 518, -76, -659, -1059, -1305, 97, 237, -67, -228, -520, -409, 22, 182, -267, 59, -113, 125, 273, 364, -184, -55, 80, 536, 829, 1039, 1117, 992, 789, 279, 233, 761, 561, 1152, 1339, 628, -284, 178, 455, 832, 935, 141, -952, -913, -506, -657, -153, -283, -1085, -615, -377, -852, -674, -848, -925, -822, -404, -218, -103, 277, 356, 30, 159, -458, -277, 558, 428, 256, 501, -179, -95, 796, 365, -29, -108, -730, -864, -87, -371, -786, -234, -625, -625, -218, 162, -834, -340, -222, -837, -533, 91, -631, 63, 732, 524, 40, 262, -411, -101, 567, 474, -519, -266, -564, -820, 60, 176, -287, -341, -680, -1277, -1066, -1151, -1181, -455, -320, -1176, -646, -52, -562, -235, 364, -293, -512, -150, -40, 515, 1440, 719, 726, 1237, 970, 832, 1331, 975, 466, 1152, 635, 458, 1087]
1032A087J51n60J15m44p85L85M39n89K25J09p12J39M82l30M25L15r63k81M13k84
1052f63K32P88m02o42M34l64n90R94J2n40J23n06n35J100K67n47L78P3j209P91
1072h06O99j64k5L09j65O0J190k93J82K00q15OR31K38l39K97o85k37Q07K95o86
1093I99J22q90n62J92L29l28j58L08p93J07K37n21N6K10n00K27N49n18O42L40
1113D8o82O1J013m77J22O22j26p97P14o2j15N99K15m49j71K73r46J91O33k79J2
1134C99M44o87j49J54l08O70M38q55n74R4j96L07J328m92o11J02m73J8N21k33
1154a03m23j30N5r9O30L6n90mJ96p30L08L36n16N48K97o08J85R08j53k9p2j89
1176a47J64Q74j63q3L21p2l64R07r1n38j19j73m21N25q1o42J60p7k60M7o0m36
$$ y = [1087, 1238, 678, 793, 349, -436, -51, 388, -201, 24, 133, -579, -440, 42, -288, 137, 452, -511, -792, -379, -663, -431, 357, -45, -687, -253, -617, -1207, -213, -201, -741, -618, -1124, -1659, -559, -292, -839, -461, -388, -1597, -806, -107, -271, -296, 13, -152, -92, 1098, 805, 987, 1187, 372, 378, 1309, 1547, 1208, 1505, 820, 583, 1390, 1685, 999, 1121, 231, -331, -139, 190, -138, -296, 12, -781, -674, -437, -958, -902, -692, -1192, -965, -416, -934, -292, 48, -634, -573, 440, -37, 85, 707, 581, -216, 498, 436, 321, 920, 1135, 686, 515, 788, -158, 33, 666, 387, 399, 843, 156, 7, 161, -147, 523, 961, 106, -468, -374, -570, -263, 1065, 573, -38, 64, -409, -391, 130, -103, -526, -656, -601, -700, -70, -34, -624, -628, -432, -1162, -854, -518, -1034, -486, -189, -797, -612, 296, 143, 114, 42, -147, 17, 891, 728, 645, 966, 894, 530, 1437, 1346, 808, 689, 516, 95, 620, 539, -103, 57, -20, -280, -233, -293, -729]
1198g29k74O94j66j49L18m67O2P13J50k12K78k78j93P13k34L0O45k65l96J82J35
1219E57q6L4K0m79j30p9Nm9M04q15K48J0l47J81L15o39l75M22O24K08L57k43o93
1242e50M05J49J02L03O7m75l80M65L00Q9M84o07j98j58l63J15M53m19J08k34J
1263c43k64M56p4J39m47J1M2K13J31r4N39k0r2J57j69j05K66j19k93K85J11l52
1285b2L08m20Q2L4k92k14O7K06k32k03L00k89J22M02j30O1k61O0L13L23L33q3
1307D65M6L10j60K02K33o7j92q0k11q1K28J73l36m0m81l38K60j5j77l29o69j41
1329a400N05J71J40j72j26j52K10J59M4N06k46j19m3M99J01J49K75k48j01J74
1349C26j7J02r8o7J79J7l02J1K73n48K4J9j87r0M11J12j92J15pO1k45L43J19k32
$$ y = [-729, -1003, -309, -475, -624, -306, -773, -711, 2, 152, -60, 218, -60, -253, 460, 226, 256, 901, 636, 240, 422, 557, 471, 505, 525, 46, -84, -163, -158, -207, 197, -618, -370, -360, -707, -526, -211, -850, -1225, -803, -179, 29, 386, 143, -550, -145, 4, 106, 409, 476, 1, -379, 86, 386, 475, 959, 352, 154, -4, -367, -252, 201, -218, -110, -344, -343, -607, -151, -225, -86, -533, -522, -480, -267, -136, -230, 309, 289, 197, 354, 185, 80, 346, 227, -66, 219, 330, -22, 286, -134, -52, -18, -310, -524, -457, -251, -483, -686, -386, -675, -553, -151, -281, -220, -481, -421, -108, 215, 548, 465, 511, 821, 661, 863, 1096, 1029, 837, 757, 546, 465, 693, 866, 530, 490, 9, -329, -69, -84, -261, -590, -1259, -1400, -895, -724, -584, -756, -882, -1034, -824, -665, -621, -115, -361, -480, -523, -24, 77, 226, 501, 253, 152, 326, 309, 411, 313, 246, 425, 442, 140, 151, 424, -124, -100, -81, -268, -358, 53, 165, -27, 88, 81, 142, -103, 240, 359, 127]
1373A27j12R3k01M15J08O5N4k08j10m43K11k83M9O5k13M4j14K83l53M08l91j48
1395f54N1n7O66OO6j4J51O1N28j22k70L48l0m7%q4m8K56k90J82l16m3K3n67L0
1420a74l61K42l85K64k52Q8j6l49K98j83M99k42J8j0J23J64J70K45J54j05J03
1441B91l2M9Q4o5J70Q4k4l67l5j3l09J92j42m56j4J78j5k27K94n4K2j97K23j86
1465e49O1J12L30j7J1K25O9K14m2L9q8j14O0P0J56j27L9l02L57k50q5l53j39l71
1489f94K93j84K74j43K18l56k3L25k20L78Q3J13k62j09K49P2K32K4L1Q3m73k41
1511c30K50K43j41nj50J0k79J42k11Kj14j02n7J06k2j04L80K41o6J64n1L88k4
1534B70k2P5Q6q9J72J44l7j14J21k42k90J06Rk22Q2l04J27L9Qn36m7J29k94J8
$$ y = [127, 15, 108, -93, 322, 430, 495, 549, 341, 231, -212, -1, -284, -235, -170, -383, -339, -453, -170, -523, -115, -506, -654, -603, -660, 6, 12, 78, 64, 215, 276, 804, 682, 412, 760, 730, 683, 683, 599, 551, 807, 517, 699, 383, 340, 363, -204, -174, -535, -293, -678, -414, -666, -578, -594, -943, -645, -828, -329, -571, -553, -563, -440, -276, -106, 139, 293, 188, 291, 259, 308, 392, 327, 497, 581, 557, 190, 155, 142, -167, 25, -117, -573, -587, -409, -424, -651, -357, -411, -389, -586, -363, -549, -488, -376, -46, -63, -52, 173, 242, 456, 414, 453, 365, 251, 311, 381, 537, 410, 449, 147, 504, 254, 169, -184, -323, -694, -401, -585, -311, -454, -236, -592, -615, -290, -510, -132, -49, 64, -198, -307, -58, 14, 246, 270, 301, 384, -89, -330, -80, 163, 22, 17, -133, -123, -402, -260, -471, -469, -583, -685, -742, -636, -658, -762, -382, -141, -207, -43, -94, 294, 270, 248, 323, 409, 320, 492, 636, 599, 485, 606, 364, 74, 180, 189, -33, 49, -255, -128, -89, -81, -617, -664, -535, -829, -811]
1558h11L5K74k03M76j07p7N66j28R6L94k95n8k80O83j06M59n0l20m1P1O5k93p7
1581B73j08k61N8q0J6q8j10J05k90k16o5N58l70J11J06m7J41M43j75J31K4J94
1603C50n03L6R9L01J25o4k17PL08m00J09j54l35j11N26m7n8q6L0m26M84k37K18
1626d5K10l72J76R0J11n2M68L3j37o5M4l25Q8P7J3k8o4j40k4J2k01j96j75q6k57
1651h45M67j47j61M02k73K18J70l57q8N38l4J85J39LP0L94J10r8L12l11k78K58
1673F74K43l51q8J45n71J69J72m45j50l9k39o0J29j97j4J91k80j33M32J68l27
1694e71K24j04K5K69J82L6K75N6n05K10M63J1j74l00l5k41K69Lr0M1k1m13N1L7
1718c02k69L59j5j86l4K52M2J84M6j72k7M22m7K54j63k88M1N56l23R3m3l47O3
$$ y = [-811, -776, -502, -705, -229, -336, -413, 153, 25, 121, 515, 220, 162, -118, 565, 459, 918, 868, 548, 507, 578, 643, 350, 273, 165, -96, -38, -118, -102, -190, -300, -195, -485, -701, -766, -208, -578, -467, -361, -408, -267, 176, 1, 132, 156, 350, -153, -117, -18, 283, 408, 344, 127, 134, 442, 42, 151, -3, -338, -449, 77, 30, -28, -114, -84, -510, -26, -263, -45, 165, -207, -31, 59, 170, 118, 586, 619, 482, 417, 461, 136, 224, 301, 314, 286, 222, 82, 58, 70, -131, -327, -502, -588, -845, -378, -525, -686, -284, -557, -339, -169, -526, -614, -76, -110, 75, 214, 217, 287, 681, 791, 693, 1005, 694, 416, 674, 917, 566, 478, 623, 52, 221, 393, -52, -202, -241, -480, -540, -411, -608, -622, -431, -711, -844, -412, -244, -571, -347, -451, -426, -157, 25, 61, 336, 392, -113, 97, 560, 571, 397, 97, 62, -179, 90, 93, 3, 44, 23, -390, -339, -302, -571, -212, -227, -413, -447, -195, -153, 31, 77, -95, -122, 300, 253, 507, 344, 56, 97, 653, 330, 423, 380, 33, 96]
1741I6j1j40n6K32l13k49K76q4K8o0j16k18L43j91j9j99K75Q6K81K45j4N1j7j71
1765E5J21K07J49n0M2k52r2L40n00n8L32p79K9M24k46j17J36l08M9K02j48K6j27
1788e65L16l70L67L95n01K65J04P5K15K37j11j07K0k58L63L07m7n03m7J99j11
1809B43k85K40n21j26J91k05J25j52R8O1r1j17L06K1k13L80j69OJ67J61j00K13
1831B33J8j57L37J5j51K76r9m85J45K31m9k63j23j1J16j95k51L53j18J01k91L86
1853A8j19j40L78j60M8o5L58l42J23K66j06J46j31J0k57J17j67K56k32J82l03
1874a20j85R5n1J77j14j62k50R7J77%j42M5L75k1l2M0P5J91j92J41J37Q4L37j43
1898E59R9j3j77k06J59j31kk18R7qo2L02p31J69j16r8j02K06l56L56j24M9L78
$$ y = [96, 85, -55, -111, 121, -192, -441, -165, -249, -221, -281, -397, -615, -272, -463, -482, -681, -406, -320, -39, 206, 192, 243, 226, 55, 176, 383, 532, 482, 524, 272, 180, 520, 20, -38, 294, -485, -456, -32, -278, -395, -259, -567, -518, -316, -464, -438, -565, -249, -619, -252, 143, -358, -93, 11, 86, 301, 538, 427, 320, 340, 82, 445, 752, 705, 202, 155, 354, 243, -42, 198, -323, -449, -258, -463, -338, -490, -392, -331, -422, -539, -233, -212, -425, -45, -214, -208, -41, 120, 20, 233, 251, 94, 431, 446, 295, 571, 472, -13, 132, 363, 314, 51, -72, -83, 33, -162, -413, -60, -178, -77, -368, 18, -101, -241, 137, -23, 25, -40, 318, -24, 99, 365, 259, 405, 274, 284, 27, 144, -23, 233, 1, 183, -120, -305, -210, -261, -84, -198, -360, -610, -513, -336, -336, -478, -433, -58, -79, -111, -71, 4, 195, 3, 144, 281, 365, 702, 559, 658, 645, 468, 262, 421, 290, 288, 70, 167, 159, 97, 399, -332, -163, -279, -377, -479, -273, -629, -273, -397, -348, 30]
1921C0L4k72K50K24r2L8j50K29j63J77L39m19Q3j6m39L15Q1j06k8k73r7K48j47
1944a54j96J82J59o31K10M25j52j61N16n3j00J32j66J1K62j88oJ70n6k10K21p8
1966A37J3M5l3j51J57k87j2J05j05l66K26R6j94J44l7k36J03L4nl45Q04l52R6
1989a63L52l6N1j56J64j47o3R3L70k32L7J81k99L38n77O0K53k02M9j45j36m8R8
2012a58k05P3J18k81J58J52J8J5J59n0K29J42j80J48j39Q3o0J65M2m01K14q0p3
2035H9K56j91k38r2K36l56j05K11j33J75j01l40J75M79j72o2L31j48j69J44K14
2056B03l89J78J75K23j53j0J58l82N05o26QJ71j42K47j74N4m25M49l69O1J1r9
2078c26J5J31R8m3L2L0P6K62j62l73L21J56m4j40K62k02L38m26J80j72p8J02j36
$$ y = [30, 64, -208, 42, 266, 174, 212, 62, 291, 128, 305, 644, 225, 308, 292, -147, 168, 249, 143, 115, -158, -255, -7, -154, -350, -168, -9, -640, -430, -5, -157, -318, 198, 145, 45, 177, 11, 22, 284, 96, 90, 260, 204, -6, 215, 137, 150, 195, 162, 11, 168, -119, -131, -26, -131, -497, -271, -175, -369, -225, -262, -498, -395, -361, -366, -711, 93, -259, -163, 189, 153, 204, 48, 212, 65, 2, 95, 465, 233, 270, 451, 152, 490, -87, -27, 226, 24, 73, -72, -208, -256, -158, -363, -290, -172, -453, -295, -143, -125, -110, 49, -1, 228, 370, 190, 338, 199, 282, 222, 387, 429, 28, 242, 162, 89, 345, 154, -84, -176, 60, -296, -401, -190, -323, -148, -249, -589, -414, 65, -107, -169, 162, 14, -155, -11, 203, -186, -8, 167, 390, 237, 227, 385, 3, 508, -118, -110, 61, -81, 166, -8, 46, -379, 70, -299, -238, -227, -326, -311, -180, -82, -125, -93, -63, 13, 275, 113, -260, 61, 217, 173, 33, 295, 93, 431, 5, 185, 13, -65, 37, -99]
2101i9p7K6l0K05l5j75l5l6J6L00j52j47q8K07o2L10j20m6R4J89l31K83J22j07
2125B12J09m4M9j33K97l51J16J6m4l26J87l20Q1j3k30M52m52J35r8N8P2o2J81
2148a08J52k54n2L18m6M9K39o9l98J95L84j92j11J87q0l8k72j09K72l46L42qj66
2171a11O5J31k92K73o6j90j33J98oj65L7K43k87L51K84r8l08J89j69L03j49j4
2193H6j50K4j04q1N02j99pl53j73K26j91L96l3o4k11J04lN7Q7J63K5m71M55p4
2217A1j89L39j54K22J06j54pJ16k25N1j81l0K7L0J42k30J10k10J4j75R5Ln7J10
2241b36LR8j11R3j22J81J8R6Q6l63M59R7p6J17k30R6j64K01l24M0J01l05l0J58
2265a17Q9j46M7j38J4L1Q2j18o0Q3M0k35L68J69k41K77o8Q5l1O9j59j99K84O5
$$ y = [-99, -176, -150, -180, 25, -10, -185, -220, -256, -240, 60, -92, -239, -327, -120, -182, 128, 8, -38, 56, 245, -86, 197, 319, 212, 321, 277, 326, 193, 490, 139, 255, 271, 227, -99, 88, -232, -151, -164, -394, 58, -394, -259, -357, -299, -227, -289, -108, 44, -210, -262, 56, 10, 59, 298, 229, -169, 26, 410, 218, 107, 294, 214, 176, -96, -205, 67, -279, 63, 55, -111, -46, 85, -207, 66, 0, -190, -323, -125, -131, -296, -259, -16, -303, 48, 332, 234, -74, 115, -54, 249, 100, 86, -64, -40, -144, -225, 277, 78, 71, -282, -455, -229, -420, -24, -57, -121, -332, -228, -231, -174, -87, 76, 101, -370, 85, 11, -178, 161, 7, 229, 335, 181, 174, 290, 65, 116, -65, -95, -68, -38, 104, -126, -16, -226, -212, -387, -292, -289, -346, -236, -233, -135, -246, -153, -275, -94, -76, 20, 106, -257, 202, 299, 223, 340, 110, 206, 42, 243, -81, -41, 60, -245, -275, -117, -28, -174, -127, -265, -251, -220, -138, -256, -316, -233, -193, -428, -60, 109, -132, 145, 77, 162, 131, 200, 41, -158, 126, 191]
2289A91m9M1q1J7j29P8J35l26JJ00R6j65o6J5r1J58j10P3o6m7J19O1J48L57k62
2314A98j05J6j12k05J43J75j20k53J60J03J5L9J40j02r9l89L47j48q1P2J26j90
2336b70j10L58m4J37m03K14K39j04l5J22m9J55J39M3k04L7l8K0j22J64k76J67
2358A40N4j69J81L7k16M0j87K4J19l46J59l9J65j89L65l00J39k3J82k30L80k21
2380F5ll4j1J76k4j7K3l94M15o3r0j9o0J85k85j08P6J43j1k71J42J28m08K52K6
2405a67K76O3j97j98K60J27m7Q1RO7k59j39K60k57K82R3j66KK4O0j14k37j2K01
2429A2j14M0L49m33O4J58k82J21J28P9N6j62J2L44o1k90j78L03l9j87K34J28k41
2452D1L2O5P9n0j3k91N0l0ml9joO3j18J58k12J39N7j28Q2L47k51J58L5p6j82L03
$$ y = [191, 142, 183, 102, 119, -10, 68, 203, -123, -122, -22, 74, -91, -157, -142, -233, -75, -185, -112, -178, -225, -106, -45, 103, 460, 198, 93, 109, -3, -208, -65, 110, -10, -263, -103, 0, 15, 54, 194, 92, -7, -396, -49, -197, -278, -206, -80, -270, -380, -22, -66, 71, -332, -118, 121, 17, -18, 104, 55, 210, 349, 392, 188, 225, 187, 207, 85, 249, -27, 140, 194, 25, 206, 243, 27, 67, -120, -96, 23, -323, -164, -203, -38, -227, 138, -162, -23, -46, 136, -94, 286, 65, 62, 28, 17, 193, 169, 152, 175, -219, 196, 133, 43, 24, -36, 149, -136, -244, -168, -25, -36, -307, -165, -37, -445, -193, -167, 109, 172, -25, -223, 37, 164, 117, 198, 207, 274, 15, -124, 136, -121, 161, 254, 88, 90, 114, 174, 60, -177, -189, 12, -102, -62, 287, -146, -82, 76, -206, -85, 43, 122, 178, 16, 28, 372, 311, 21, -157, 146, 107, -80, 154, 282, 41, 73, 138, 217, 167, 154, -137, -87, -117, -121, -160, -161, -167, -104, -222, -64, -276, -137, -80, -208, -126, 221, -30, 128, 163, 87, -95, 208]
2479B08j04jJ62j42k80M50o6j69J0Ljj86j3J03L2N9k20N0J12M5j93J31l57M86
2503A19k69J83k23J45M3L75m33K95nj54j92n6M0J01L2o1J04j15J26q5j80R6K12
2526I8j67Pl2O1k25K09P4j25J3L82k38k5p7J77K3m3J27k7j46P2rJ01j73K7m4k52
2552b12K96j09j81M31l01J62j92p8Q8P9k9k98M86j1n6j46P0l8K00Q5m0l56K06
2575E6K36j62K9k1J40j21R7m97L34j81k19M51L9p6k83O9J30k15K08j13q1P7Ko1
2599a62K08O8K34m60J27J08L1m6M9k8M3j1j30J76k81r4L74k80k24J59J31L8j09
2622g9j01PL05j77j02L1O7j74L1J77P1pk44L79k1j4o1j64M35j22l20J66J67j74
2646G6p8J16k7p3K1j75J36K43l63N7N4R0k52jMM4n0K3J80J1M6o6N8l07L36l8P8
$$ y = [208, 104, 103, 265, 123, -157, 293, 227, 58, 68, 71, 70, -116, -129, -26, 6, 65, -155, -105, 7, 52, -141, -10, -367, 119, -150, 33, -190, -45, -2, 373, -60, 235, 230, 76, -116, -172, -132, -31, 1, -60, 44, -71, 55, -30, -210, -114, 98, -69, -62, -94, -33, -258, -49, 25, -100, -87, 295, 57, 32, -45, 132, 155, 112, 239, 212, 66, 138, 129, 230, 57, 84, 40, -212, 84, -25, -206, 225, -76, 86, -106, -184, -96, -17, -46, -344, 142, 131, 75, -71, -1, -39, 161, 246, 206, -150, 56, 292, 130, 159, 138, 278, 157, 254, -243, 91, -90, -309, 142, 181, 105, -178, -109, 21, -194, 14, -99, -180, -103, -101, -162, 46, 114, 348, -112, 15, 123, 154, 108, 157, 129, 172, 161, 31, 207, -74, -168, 206, -74, -298, -139, -8, 30, -79, -180, -173, 132, -45, -147, -116, -49, -223, -192, -15, 56, 49, -195, 184, 163, 149, 88, -76, 359, 237, -83, 83, 250, 76, -2, 114, 87, 14, 35, -140, -4, 239, -124, -67, -13, 77, -175, -176, -172, -128, -178, -155, 25, 36, 82, 16, 74, -233, 103, 65, 143]
2673A43O4r1J90k92j8l7j24K00k9k39J97J40j03q9L1J7j78k43M23n1r2P6R8N4
2697D7m8j33N3L06k75K74k51N9J3L43l32m5k7L6m4J61q8j22K28l42J02P4j79l
2721a93j7m2J63Q0J1k65J57P6J14O2j58r6L99k99K73j78K28j01k99N1J33q1j02
2744h4J26J9k4k29J60l7L9k01J25j92J95o5P4jJ7R7P3n4J22J39k97m0O1J30K15
2769C68k49J6j7M5m0j29P3L4j88J4J31J32k61k64M07l67J49J06j24K4k6J6K06
2792E6j96jJ4J11K29j72K50M8m6j76l9Q7J55k18k8J72j55k87N6K19k49K88l45
2815b27J51L1K20l83j91K99J51m74N31j09j15j9o5J85R2J19No1o9O8J44j18%k27
2839f2J42r1J84j01R3k48j8J4P2J5m7m9N0l4k07M18k66k71K64k2j9K06K6Q8j30
$$ y = [143, 207, 116, 306, 14, -4, -41, -165, 35, 6, -233, -36, 104, 1, -88, -57, -40, -218, -461, -38, -89, -181, -105, -7, 47, -1, -134, -81, 225, -50, 224, -27, 32, 45, 388, 56, 11, -16, 20, -24, 137, 49, -73, 155, -187, -85, -11, -190, -193, -210, -252, -89, -9, 2, -263, -106, -30, 84, 146, -12, -108, 291, -8, 265, 87, 315, 214, -85, -34, 99, 18, -84, 42, 61, 37, -192, -32, -69, -30, -231, -106, -298, -103, -168, -94, -95, -78, 19, 92, 38, 160, 299, 2, -38, 23, 153, 368, 119, 135, 118, 163, 123, -6, 67, 101, -87, -73, 58, 190, -71, -335, 72, -295, -146, -40, -164, -140, -166, -150, 56, -140, -141, -127, -16, 213, 41, 291, 339, 293, 117, 78, 165, 320, 102, 74, 246, 91, -196, -140, 79, -170, 118, -227, -76, -45, 175, -208, -399, -100, 51, -423, 108, -1, -116, -135, -200, -15, 77, 196, 201, 140, 71, 139, 283, 165, 165, -62, 80, -11, 173, 72, 165, -83, -101, -87, -15, 0, -47, -96, -46, -80, -287, 131, -135, -406, -142, -164, -183, 23, 49, 137, 7]
2864Gkj22L16pP4P4l41N9q6K37n21M7M15k01J14j30K90k75M6j50OK33l7k80J14
2889a20J22K66l12K34k51j04J95K4p6L18k95J53M7n25M84l39K82Kk43L8j73J85
2911h8J40m22J13mP0J28k8j15P8j22K58O5k20O4K84j79j1O3LJ55j14J4r2J1K57
2936C08q5j59Q2o3P7p2k40J12J00j72Q5nj08k8NJ32j51L28m41L34J72k27o8K85
2960B01r9j89L54l50qK75k00M7R1L3j16r3j94K52K6l00L5R1J82n62K02N26m50
2983b46k1L75k57L05k37L42k02J29j39j65J69L7J3J10P8N5L9l43J76l24K94k60
3005g2J04k13K00p0j14l44N60k24J57l14M44nM2p0o1m3M2R2j15K50j98J24J54
3028C26k58P0l2J22n0j79N6Q7r0k46K34l4k36K23j64r1L11M3l74J27qP5O9J7J67
$$ y = [7, 5, -117, 199, 192, 266, 340, -1, 58, -28, 209, -312, -265, 150, -51, 63, -67, 223, -52, -6, -156, -150, 83, 46, -234, -120, 2, 268, -44, 190, -61, -165, 30, 54, -22, 296, 1, 154, 201, -324, 160, -179, 103, 105, -138, -100, -273, -88, 52, -370, -257, -261, -191, -63, -91, -206, -128, -250, 8, 73, -147, -83, 201, 22, 11, 74, 77, 232, 118, 132, 40, 51, 308, 223, 64, 146, 83, 160, 88, -152, -40, 60, -112, -27, -32, -140, -168, -163, -31, -182, 146, -295, 39, 211, -16, -84, 201, 102, -87, 267, -83, -91, 184, -16, 31, 122, 155, 39, -54, -248, 4, 30, -270, -235, -144, 38, -524, -322, 204, -246, -267, 108, -149, 156, -81, 261, 59, 188, 49, -116, 53, 90, 103, 213, 291, 346, 385, 42, 218, -106, 188, -72, 32, -181, 19, -51, -165, -509, 51, -173, -16, -330, 114, 109, 151, 81, 20, -23, 19, 111, -4, 246, 48, 172, 326, 68, 138, 106, 228, 178, -1, 55, 142, 52, -194, 40, 6, -230, -7, -171, -262, 49, 92, -282, -155, -163, -88, -19, -2, 165]
3053A65j39j87L0P9NP2J71O6n3p3p1j38L57q5j54k02L60n25K63O9l27N48l56J84
3077E9k41J34k36M29l39J2K37n9j62J93J14j33K60j9k72K12k90L41j91J05j25
3098B9kp9p4J63L04l71J1j92J41M4J85l90k54N36r8L3k9J16r5K4K7J7k7K08j45
3123H2J09j02J03m4j13P9J20m4j93K33k62j36K21J76j86k09R2k64P2K04r4l09
3145d65K33L9o4R2p3J36J56Q0k85K22N5KJ15k57K32k79K70j89K00P2j90m7M8k
3169A01k35J06J23n4j85J41J21m55L00j14K25j10J75k62j05K50p7K18j23l8M6
3190D8K36j27J95l23K43k47pr4O2J56k23M2o3p6J37J91j98o0L3J33l55L5K59k33
3214b36K12N6q2L7J18jq7J76l61N50k28j04km9m9K23j50o8j2K46j79j18J75l65
$$ y = [165, 26, -161, -131, -52, -47, 25, 196, 262, 209, 136, 65, -73, 284, 199, 45, -157, 203, -322, -59, 10, -317, 231, -125, 59, -182, -48, -284, 145, -194, -182, 55, -4, -166, 27, 141, 8, 268, 249, -23, 189, -101, 240, 49, 154, 29, 27, -52, -126, 37, 341, -30, -19, -211, -70, -26, 159, -231, -485, 51, -47, -14, -43, 73, -22, 2, 29, 46, 19, 227, 82, 191, 89, 192, 148, 35, 114, 234, 190, -3, 230, -32, -168, 53, 229, 43, -166, -74, -338, -266, -62, -156, -465, -232, -193, -257, -165, -238, -102, 54, 134, -151, 71, 126, 128, 243, -14, 218, -61, 209, 20, 220, 292, 102, 55, 103, 101, -134, -28, 95, 41, -144, -3, 118, -337, -37, -151, 74, -36, 139, -123, -228, 22, -55, 163, 40, 2, 48, 284, 157, 352, 29, 272, 25, 18, -76, -14, 142, -81, -39, -102, -178, -41, 150, -48, -108, -75, 58, -297, -262, -3, -236, -24, 32, -50, -13, 105, 104, 17, 193, -168, 382, 154, 50, 48, -1, -50, 173, 23, -45, -57, 189, 10, -108, 67, -298]
3238b98L30k10J28k3j70J0N8K08J9j00j60K93J21k07K21m5k22K0J87j20L81k02
3260B19rk93J51O6j71P2O6j40Q6j82l5J38nk29K11J22p9m5m0j07m1K58j1j39Q3
3285e4j33J48L05Mk85L05j28j10J18j03lo1m7k92K18P2j2J9q7m2k35L90k10M14
3309A91j46n2o8k59M12k49P0j04K18j22Q4L93j66j20J32k14o9L05M1l20J30q8
3331aP8n9mj76J6O7l24N87k30j65k5J82r0J61R7j98J83k51K00J57k73J32J22p2
3355A14L61k13j70j48r3J46M2M8N2r2k31J01k44J17K78j92l02J65K27j25j92M25
3377G4l05K11o7K0K0j6M15j88n9P3O6l7rj93K8o4R6rj03j00p5P0J44p9j46j0N4
3404a89J88P5j74J55k4O9k63J37J89j57J99l4m3J14r4o9O5r2Lj25P3P5j35J43
$$ y = [-298, 32, -178, -50, -73, -243, -233, -175, 33, 52, -48, -208, 85, 206, -1, 220, 175, -47, -27, 160, 40, 421, 219, 210, -83, 68, 134, -37, 35, 101, -39, 47, -135, -170, -32, -37, -266, -55, 67, -12, -57, -97, -204, -245, 13, 2, -137, -54, -187, -39, 266, 270, -15, 290, 162, 52, 170, 67, 64, 3, -44, -336, -118, -46, -58, -39, -126, -168, -403, -13, -223, 191, 45, -7, -75, -334, 78, -171, -101, -205, 13, -109, -25, 368, 202, 82, 214, 0, -69, 236, 277, -43, 87, -1, 77, 18, 14, -162, -146, -79, -403, 184, -46, -211, -236, -54, -144, 17, 114, -84, 99, -152, 48, 205, -68, 64, 186, 114, 475, 262, 92, -56, -149, -3, 39, 87, 139, 47, -184, -83, -327, -210, 68, -124, -426, -261, -34, -159, -351, 74, -231, -20, -87, -67, -47, -63, 352, 164, 105, 178, 244, 207, 198, 5, 33, -31, 65, 56, -47, -147, -222, -152, -8, -87, -233, -243, -189, -1, 74, -100, 55, 31, 100, -163, -26, 163, 6, 205, 171, 128, 242, 148, 79, 144, 52, 55, -70, 3, 78, -57, 86]
3428H6j17k50J32J06j07L36m57J14j24K28pr7J51K36l59Q2K24n7O1p6kJ58j72
3451H9k19L46q9J00j94J95p4nj3J70l81K2J00k6q8j62K32j9k14J10P8Q4k08N3
3475a13K15l8J22r7j46J53o1r5K80j35K4j81M01m19J91j64J43j77K67j87Q9K8
3497A00k7n9l03QL00p6n6J48jj68J69k15R6r3P1K52j55q3K82O0k51L8r4J62J2
3522A17o3l1j2J03Nj51j25L59m29J02P9K61k92n4N2qK58k24q0J89J64k0j87J10
3546A23k44K06K0J12J66j57j28J02k77R6j11K5J00k1J5k59J36l0k2K72j48j23
3568a47r6R9O7J09k01K35k22N5K27N7k2k14J03R2M0R0j63J07q8j72r5K67pr9k28
3593b06j45O00l94j77K66P3J2j82j62J76L05m75M89k76M1K20k64L14j67J61k05
$$ y = [86, -31, -281, -149, -43, -150, 186, -271, -157, -281, -53, -60, -157, -6, 230, -129, -47, 177, 120, 181, 105, 103, 261, 89, -130, 216, 127, 227, 33, 228, 154, 149, 136, 306, -75, -53, 47, 21, -67, -229, 3, -16, -230, -120, -42, 42, -166, -113, 102, 64, 186, 89, -57, 96, 35, -60, 220, 85, 109, -72, 329, -90, 101, -63, 80, -97, 170, -17, 72, 100, 73, 14, -289, -281, 19, -57, -113, 35, 34, -134, 35, -180, -84, -177, -106, 146, -9, -92, 190, 250, -1, 37, -57, 105, 117, 54, 23, 11, 114, 119, -32, -157, 202, -227, -125, -46, 215, -77, -131, -79, -87, 171, -53, -133, 56, 220, 200, 13, 123, -121, 85, 105, 217, 383, 226, 98, 200, -77, 19, -92, -67, 33, 12, 27, -232, -96, -126, -148, 124, -24, -147, -243, -144, -77, 32, -169, 66, -156, -101, 126, 183, 161, -53, 50, 142, 182, 272, 109, 216, 128, -44, -139, 128, 121, 22, -206, -351, 249, -145, -322, -56, 17, 29, -153, -315, -139, 166, -309, 180, -96, -55, 165, -99, 215, 48, 209, 4]
3614DJ0l5l1M24k80k00L15k44P5O1p9j40K01j71k17K88P6m08K86Nq6J29J01j12
3638b8K90k95J97o2j9Rj05J75k75J03Q5kR9j12R3j10OQ4l40J75J9k5l5k3J68r5
3664b3j02O4j07J42j5rj76K51n8j8MR0j8R7K1q2k2K7K41j92j69J31j3j63R4l5
3690d0jK36l07j96J07l1N1K02j85L8ol6Q7K32m04N18j83j27J59J68l23M4j7L11
3714B97j37k20J62L0J8n2n0J49k19j77P1j27K43l76L31q8ql3J90p4J50k03J23
3737@J35k05J07l49J99J83l1K7M9j57L86l71J95k46K90n2j00j6j68N1Q3J2n4J92
3761A60m40J73J6o2O0J28K10k10j30n8J94L27k42j97J49m1J42j44O2k32L29k24
3783c0j05K21r7L5j69L54j24pn4k52L91k60M8Mn%j06K41J10j64K8R5j63L4o0L39
$$ y = [4, 14, -21, -52, 372, 92, -108, 207, -37, 38, 99, 20, -120, 81, -90, -307, -19, 57, -351, -65, -60, -146, -17, 84, -28, 262, -33, 164, 102, 83, 92, -13, 162, -113, -10, 75, 73, 172, 60, 153, 43, 49, 133, -207, -32, -13, -38, -73, -96, 72, -23, -125, -61, -168, -26, -41, -50, -226, 25, -33, -51, -47, 43, 25, 122, 143, 61, 39, 66, 307, 115, -54, 77, 64, -99, -5, -40, -41, 195, -112, -308, -201, -232, -181, 21, -164, -126, -132, -168, -81, 151, -253, 265, 82, -45, 114, 282, -41, 3, -14, 297, 160, -60, 102, 132, 150, 98, 48, 197, -22, -199, -128, -255, -12, -388, -57, -145, -153, -186, 4, -70, 80, -123, 0, 135, -70, 37, -312, -113, 70, 39, 66, 115, -42, 344, -27, 168, -78, 212, 160, 60, 44, -124, -73, 10, 22, -32, 160, -280, -107, -91, -153, -93, 35, 245, 35, -95, -153, 41, 368, 126, -71, 78, 37, 179, 35, 97, -135, 194, -30, -135, 86, -11, 24, -145, 209, 85, 78, 24, -228, 163, -97, -49, -45, -50, -50, -156, 85, 195, 31, 59, 154, -9, 25, -35, 304]
3809C04q3k29K83j02J48k41J8r3M7j97J07lj85j1O3K85p4j02J55m1p6M6q5J28
3833F2L8o2J5R2j63K16k83l5J38O3R7j5n1q7J96j79p5lk00J19J55r9l5pj75n6
3859c34K82N9j63Q9j26J51m6K30j35J23k05J40j82Q1M4j25K06M1j12O9J78l12
3881d7jL2p0RJ26L2J5j62n9j43K13q2L14r8j86L5o2J99k46K90p1Lo3J6N7k1j70
3908a40K26m3j24J56j97J21j59M54l79L5k06J76m4J61N4p2k46l1L45j4k21j45
3930b93L40J21j99L61k96J03o6j7j01L71k83m9O0q0l2J45J63o5j58Q1OK12m24
3953a00M1l2o2JQ7oj54J55J35l47J71J06j09K38l36J1K94J52J6l79J46p1O9q3
3977e7j17J62J08R9j17p2j81o0K77n2kJ32j45l9K56l68K26J36l18J63O9j78Q9
$$ y = [304, 221, -8, 275, 173, 321, 80, 98, 5, 52, -145, -38, -41, -226, -237, -174, 111, 37, -65, 90, 49, -27, 19, -66, 62, 100, 38, 53, 145, -18, 198, -85, -120, 18, 81, 178, 163, 112, 25, 221, 42, -33, -36, -236, -117, 38, -61, -96, -103, -278, -334, -52, 7, -156, -67, -193, -42, -88, 142, 7, 130, -75, 65, -117, -36, 8, -117, 89, 130, 18, 87, 265, -47, -48, -16, -86, -77, 49, 81, 96, -66, -125, -268, -55, -137, 177, 79, -107, -72, -134, 65, -181, 109, 38, 41, -22, -6, 51, 30, -140, 86, 43, -81, 75, -122, -1, -160, 294, -85, -50, -256, -80, -124, 37, 91, 19, -227, -258, 87, 73, -148, -293, 47, 168, -31, 330, 34, 137, 71, 54, -47, 324, 41, -8, 52, -28, -60, 85, 248, 183, 25, 106, 112, 324, -100, -59, -91, -153, -152, -65, -71, -225, -70, 65, -282, -111, -5, -114, 124, -212, -201, 93, 245, 261, -118, 28, -43, 26, -57, -174, -12, 96, 195, 78, 6, -175, -235, 42, -10, -12, 120, -25, -64, 192, -176, 50, 186, -132, 31, 100, -78, 11]
4000A1M9J23j13L82l05q1j37J16k89L30j60J84n6j62j71L35l23L76Q4l23J68k32
4022a94K46j84q8L15k55p7K86qJ30M5K0m25K60k6m3Q5l84N11l51J76O0o9J17j25
4046B2L7p5k8j61L21k52J93k57J20m3J10J60l4k72Q6R4K32l40l6R3M0l8J4J17
4070A03k73J05K2J95J1n75K91Q8J52l75J69KJ97r3j42J00L08jk86J79j82j99J69
4093c5kj44J29J17k6j93L98j84J60k87m9J37k51J89J15n7j18K00k84J54j36K22
4115E5j66K0J31k96J13J80Rl9k7K90n75K78P7j62K74j03k33J21p6J06P1L5o7l05
4139b89L57r8J12j2j87N5j09L26k12j79J27J30k16M09j91K14l35K9P3N2k68K16
4161DK71l0L8j81q6J42j48k59J23J72m4L4P6m52J40K12L8k71K09M9m3KN5M8Qk49
$$ y = [11, 60, 183, 70, 452, 147, 66, -71, 45, -244, 86, -74, 110, 54, -108, -279, 56, -267, 109, 193, -130, 38, -194, 52, -132, -220, 95, -160, -237, 49, 41, 171, 216, 236, -189, 71, 45, 2, 87, -297, 214, -137, 39, 99, 30, 147, 22, 59, -16, -44, -205, 116, -136, 57, -200, -80, -123, -13, 147, 113, -159, -73, 21, 253, -87, -123, -30, 10, -28, -14, 103, -170, -65, -43, 152, 163, -412, -121, -33, 119, -256, -87, -85, 112, 19, -123, -23, 285, 284, -2, 177, -5, -204, -35, -37, -181, -52, 65, 39, -154, 244, 60, 220, -67, -116, 21, -230, -41, 74, 17, -101, 99, -185, -31, -167, 55, -111, -91, 40, -256, -143, 37, 46, 7, -20, 270, -305, -27, 50, -112, 162, 59, -174, -53, -129, -23, 48, 83, 16, -289, 68, -30, 82, 70, -117, -62, -171, 155, -57, -236, -109, 21, -195, 214, 23, 237, -98, -69, 4, 56, -212, 4, 275, 245, 283, 102, 16, 158, 10, -249, -126, 46, 2, 36, 112, -340, -200, 12, 50, -221, -12, 37, -6, -4, 51, 99, 107, -142]
$$ [...]
8191B0
##END NTUPLES=NMR FID
##END=
