##TITLE=1H_LR-758-R4-KAO-CR2-K6
 CDCl3
 8 sc, 
 4.10.2023
##JCAMPDX= 6.0         $$ Bruker NMR JCAMP-DX V2.0
##DATA TYPE= NMR FID
##DATA CLASS= NTUPLES
##ORIGIN= UXNMR, Bruker Analytische Messtechnik GmbH
##OWNER= root
$$ XWIN-NMR		Version 3.5
$$ Wed Oct  4 14:12:46 2023 Russian Standard Time (UT+4h)  she@DPX200
##.OBSERVE FREQUENCY= 200.13135
##.OBSERVE NUCLEUS= ^1H
##.DELAY= (6, 6)
##.ACQUISITION MODE= SIMULTANEOUS
##.ACQUISITION SCHEME= undefined
##.AVERAGES= 8
##.DIGITISER RES= 18
##SPECTROMETER/DATA SYSTEM= spect
##.PULSE SEQUENCE= zg30
##.SOLVENT NAME= D2O
##.SHIFT REFERENCE= (INTERNAL, D2O, 0, 15.7039)
##AUDIT TRAIL= $$ (NUMBER, WHEN, WHO, WHERE, WHAT)
$$ ##TITLE= Audit trail, XWIN-NMR		Version 3.5
$$ ##JCAMPDX= 5.01
$$ ##ORIGIN= Bruker BioSpin GmbH
$$ ##OWNER= she
$$ F:/spectra/data/she/nmr/H-F/1/audita.txt
$$ ##AUDIT TRAIL=  $$ (NUMBER, WHEN, WHO, WHERE, WHAT)
(   1,<2023-10-04 14:11:38.14 +0400>,<she>,<DPX200>,
      <created by zg, POWCHK disabled, PULCHK disabled
       configuration hash MD5:
       00 E9 B6 7A A2 85 ED C7 34 08 36 98 17 FE 4E 26
       data hash MD5: 16K
       6A 19 3E 78 20 44 15 35 8E 94 64 C2 BD 7C BB A7>)
$$ ##END=
$$ 
$$ hash MD5
$$ AA 2A 15 63 60 3F F5 B5 64 86 8B B3 B1 34 9E 37
##$RELAX= 
##$RELAX= 
##$RELAX= 
##$RELAX= 
##$RELAX= 
##$RELAX= 
$$ Bruker specific parameters
$$ --------------------------
##$DU= <F:/spectra>
##$EXPNO= 1
##$NAME= <H-F>
##$PROCNO= 1
##$TYPE= <nmr>
##$USER= <she>
##$AMP= (0..31)
100 100 100 100 100 100 100 100 100 100 100 100 100 100 100 100 100 100 
100 100 100 100 100 100 100 100 100 100 100 100 100 100 
##$AQSEQ= 0
##$AQ_mod= 1
##$AUNM= <au_zg>
##$AUTOPOS= <>
##$BF1= 200.13
##$BF2= 200.13
##$BF3= 200.13
##$BF4= 200.13
##$BF5= 200.13
##$BF6= 200.13
##$BF7= 200.13
##$BF8= 200.13
##$BYTORDA= 1
##$CFDGTYP= 0
##$CFRGTYP= 5
##$CHEMSTR= <none>
##$CNST= (0..31)
1 1 145 1 1 1 1 1 1 1 1 1 1 1 1 1 1 1 1 1 1 1 1 1 1 1 1 1 1 1 1 1 
##$CPDPRG= <>
##$CPDPRG1= <>
##$CPDPRG2= <>
##$CPDPRG3= <>
##$CPDPRG4= <mlev>
##$CPDPRG5= <mlev>
##$CPDPRG6= <mlev>
##$CPDPRG7= <mlev>
##$CPDPRG8= <mlev>
##$CPDPRGB= <>
##$CPDPRGT= <>
##$D= (0..31)
0 1.2 0 0 0 0 0 0 0 0.06 0 0.03 0 0 0 0 0.0002 0 0 0 0 0 0 0 0 0 0 0 0 
0 0 0 
##$DATE= 1696414297
##$DBL= (0..7)
120 120 120 120 120 120 120 120 
##$DBP= (0..7)
150 150 150 150 150 150 150 150 
##$DBP07= 0
##$DBPNAM0= <>
##$DBPNAM1= <>
##$DBPNAM2= <>
##$DBPNAM3= <>
##$DBPNAM4= <>
##$DBPNAM5= <>
##$DBPNAM6= <>
##$DBPNAM7= <>
##$DBPOAL= (0..7)
0.5 0.5 0.5 0.5 0.5 0.5 0.5 0.5 
##$DBPOFFS= (0..7)
0 0 0 0 0 0 0 0 
##$DE= 6
##$DECBNUC= <off>
##$DECIM= 32
##$DECNUC= <off>
##$DECSTAT= 4
##$DIGMOD= 1
##$DIGTYP= 9
##$DL= (0..7)
0 120 120 120 120 120 120 120 
##$DP= (0..7)
150 150 150 150 150 150 150 150 
##$DP07= 0
##$DPNAME0= <>
##$DPNAME1= <>
##$DPNAME2= <>
##$DPNAME3= <>
##$DPNAME4= <>
##$DPNAME5= <>
##$DPNAME6= <>
##$DPNAME7= <>
##$DPOAL= (0..7)
0.5 0.5 0.5 0.5 0.5 0.5 0.5 0.5 
##$DPOFFS= (0..7)
0 0 0 0 0 0 0 0 
##$DQDMODE= 0
##$DR= 18
##$DS= 0
##$DSLIST= <SSSSSSSSSSSSSSS>
$$ [...]
##$SUBNAM2= <"">
##$SUBNAM3= <"">
##$SUBNAM4= <"">
##$SUBNAM5= <"">
##$SUBNAM6= <"">
##$SUBNAM7= <"">
##$SUBNAM8= <"">
##$SUBNAM9= <"">
##$SW= 18.05172834244
##$SWIBOX= (0..15)
0 0 2 0 0 0 0 0 0 0 0 0 0 0 0 0 
##$SW_h= 3612.71676300578
##$TD= 16384
##$TD0= 1
##$TE= 0
##$TE2= 300
##$TE3= 300
##$TEG= 300
##$TL= (0..7)
0 120 120 120 120 120 120 120 
##$TP= (0..7)
150 150 150 150 150 150 150 150 
##$TP07= 0
##$TPNAME0= <>
##$TPNAME1= <>
##$TPNAME2= <>
##$TPNAME3= <>
##$TPNAME4= <>
##$TPNAME5= <>
##$TPNAME6= <>
##$TPNAME7= <>
##$TPOAL= (0..7)
0.5 0.5 0.5 0.5 0.5 0.5 0.5 0.5 
##$TPOFFS= (0..7)
0 0 0 0 0 0 0 0 
##$TUNHIN= 0
##$TUNHOUT= 0
##$TUNXOUT= 0
##$USERA1= <user>
##$USERA2= <user>
##$USERA3= <user>
##$USERA4= <user>
##$USERA5= <user>
##$V9= 5
##$VALIST= <valist>
##$VCLIST= <CCCCCCCCCCCCCCC>
##$VD= 0
##$VDLIST= <DDDDDDDDDDDDDDD>
##$VPLIST= <PPPPPPPPPPPPPPP>
##$VTLIST= <TTTTTTTTTTTTTTT>
##$WBST= 1024
##$WBSW= 4
##$XGAIN= (0..3)
0 0 0 0 
##$XL= 0
##$YL= 0
##$YMAX_a= 180610
##$YMIN_a= -218461
##$ZGOPTNS= <>
##$ZL1= 120
##$ZL2= 120
##$ZL3= 120
##$ZL4= 120
##$ABSF1= 10
##$ABSF2= 0
##$ABSG= 5
##$ABSL= 3
##$ALPHA= 0
##$AQORDER= 0
##$ASSFAC= 0
##$ASSFACI= 0
##$ASSFACX= 0
##$ASSWID= 0
##$AUNMP= <proc_1d>
##$AZFE= 0.1
##$AZFW= 0.1
##$BCFW= 1
##$BC_mod= 2
##$BYTORDP= 1
##$COROFFS= 0
##$CY= 11.3945322036743
##$DATMOD= 1
##$DC= 2
##$DFILT= <>
##$DTYPP= 0
##$F1P= 15.7292609196834
##$F2P= 12.9074282941183
##$FCOR= 0.5
##$FTSIZE= 0
##$FT_mod= 4
##$GAMMA= 1
##$GB= 0.15
##$INTBC= 1
##$INTSCL= 1
##$ISEN= 128
##$LB= 0.24
##$LEV0= 0
##$LPBIN= 0
##$MAXI= 10000
##$MC2= 0
##$MEAN= 0
##$ME_mod= 0
##$MI= 1.114404
##$NCOEF= 0
##$NC_proc= 0
##$NLEV= 6
##$NOISF1= 3.799351
##$NOISF2= 2.8
##$NSP= 1
##$NTH_PI= 0
##$NZP= 0
##$OFFSET= 15.70392
##$PC= 1
##$PHC0= -21709.75
##$PHC1= 10.05271
##$PH_mod= 1
##$PKNL= yes
##$PPARMOD= 0
##$PSCAL= 0
##$PSIGN= 0
##$REVERSE= no
##$SF= 200.130013532006
##$SI= 16384
##$SIGF1= 3
##$SIGF2= 2
##$SINO= 400
##$SIOLD= 16384
##$SREGLST= <1H.CDCl3>
##$SSB= 0
##$STSI= 0
##$STSR= 0
##$SW_p= 3612.71676300578
##$SYMM= 0
##$S_DEV= 0
##$TDeff= 0
##$TDoff= 0
##$TI= <>
##$TILT= no
##$TM1= 0
##$TM2= 0
##$TOPLEV= 0
##$USERP1= <user>
##$USERP2= <user>
##$USERP3= <user>
##$USERP4= <user>
##$USERP5= <user>
##$WDW= 1
##$XDIM= 8192
##$YMAX_p= 0
##$YMIN_p= 0
$$ End of Bruker specific parameters
$$ ---------------------------------
##NTUPLES= NMR FID
##VAR_NAME=  TIME,          FID/REAL,        FID/IMAG
##SYMBOL=    X,             R,               I
##VAR_TYPE=  INDEPENDENT,   DEPENDENT,       DEPENDENT
##VAR_FORM=  AFFN,          ASDF,            ASDF
##VAR_DIM=   8192,          8192,            8192
##UNITS=     SECONDS,       ARBITRARY UNITS, ARBITRARY UNITS
##FACTOR=    0.0002768,     1,               1
##FIRST=     0,             0,               0
##LAST=      2.2672688,     0,               0
##MIN=       0,             -218461,         0
##MAX=       2.2672688,     180610,          0
$$ Real data points
##PAGE= N=1
##DATA TABLE= (X++(R..R)), XYDATA
$$ [...]
1856d06o98K24R60K43r28m69J80R79J84o85o52Q0J042L63m34j93l58Q37Q59j38
1876I90q55K44N21O82j83n83k14P38O17j01q37m58M44N49N8o79r12R5O66m6q00
1897f4n72j90L21L58q46p28Q4P56N32p18p40O4P76Q13l67q41Q5O33P97P1r74J16
1919f34R66L36k05k05k22M97N06L49p98m16L07O56J48m25q40M44N11m4n05n57
1939a31j1Q50j39n02n70K10M09K87k28j114J11N88K39o36o55j14N20N56l73r71
1959a674n8M04M59M2n72l26N00P28n3k31o19O42Q00K13l89n51O61O98K26k22n14
1980A64K57J131J26p40q14J91M02N91n89n05l76J67M37n75q89m6K63M19o9j136
2000a591j15N14K70K03q01k40K35M38K34m43m07M76P42O9p47K26J96M86M90l69
$$ plain form
1856 -406 -1104 -880 80 323 -605 -1074 -894 85 269 -416 -1068 -988 54 417 -17 -210 -568 269 1128 990
1876 990 135 379 900 1582 1399 816 602 1340 1957 1856 1019 561 1005 1554 1612 933 21 116 782 736 -64
1897 -64 -636 -826 -505 -147 -993 -1721 -1637 -881 -349 -1067 -1807 -1743 -967 -154 -521 -1362 -1277 -644 153 224 -750 -634
1919 -634 332 668 463 258 36 533 1039 1388 590 174 481 1137 1285 860 20 464 975 931 426 -131
1939 -131 -142 708 569 67 -503 -293 116 403 175 -939 -828 -240 -1 -637 -1292 -1406 -886 -330 -703 -1674
1959 -1674 -1732 -1328 -869 -827 -1399 -1725 -1225 -497 -550 -781 -1400 -758 42 255 -134 -685 -24 674 900 678 164
1980 164 421 1552 1678 938 124 315 717 1308 719 214 -162 5 442 -133 -1022 -1068 -805 -386 -455 -1591
2000 -1591 -1706 -1192 -922 -719 -1520 -1760 -1525 -1087 -853 -1296 -1703 -1227 -485 -416 -1163 -937 -741 -255 235 -134
2020a34l61O71M99m9k42o51m6M62N48k00q21J0N14N62m98l39j09K01P48m57p87
2041d79l0N68M23l04n59l98M50K46K45q86l7J77N47j42l93l66o4O50L7o54k25
2062a194M52L25K40k30o14L13O33N05n51l97L8O89Q63l51m82j34O57M77m01l10
2082E28l42L30P54k46o36m14K34K22K80m10j040K50P88P6p13o67O37J92k2m22
2102f21K1j09N41N00l56p12J54O62J76k13M0m44P07L95r9n99o9M41Q1j7l94l14
2124b29L44N30n4o48l91M80M79O8o30l57L52P18j59n73l89K36O02M26p01l38o6
2145c00P43K27r14j22o6L19L43j79q30K33K63K30j38n86p8K89M67l7n80KO72j25
2167a67L46n98l42O72N10k00l85K15QM18J01l86k51L26L29p4m78j48l39O91Qk61
$$ plain form
2020 -134 -495 176 675 626 384 -267 -313 149 697 497 -324 -314 200 762 264 -75 -184 17 765 308 -479
2041 -479 -509 59 482 178 -381 -779 -329 -83 162 -724 -761 -584 -37 -179 -572 -938 -1002 -352 -315 -969 -1194
2062 -1194 -742 -417 -177 -407 -1021 -708 -75 430 -121 -518 -480 209 1072 721 239 105 762 1239 838 528
2082 528 186 516 1270 1024 388 -26 208 430 710 300 -740 -490 298 374 -339 -1006 -369 -177 -199 -621
2102 -621 -600 -709 -168 332 -24 -736 -582 80 256 43 83 -361 346 741 642 43 -26 415 496 479 85 -229
2124 -229 115 645 591 -57 -448 32 511 579 -51 -408 -56 662 503 -70 -459 -223 379 805 104 -234 -300
2145 -300 443 670 -244 -366 -432 -113 230 51 -779 -546 -283 -53 -191 -777 -855 -566 -99 -136 -716 -714 -42 -167
2167 -167 179 -419 -761 -89 421 221 -164 51 59 477 578 192 -59 267 596 522 44 -104 -443 248 256 -5
2189eo56J15L85J80l15o30J65K95L50q9o77K19L46K36k30l07P2K2O31j73m09j54
2211f29M12M63j88m76j2l84Q64pm17l01K89K68L16m12o95J68O30K5j78n54M65
2232c53K02J27J06q40L71L39M42k75k90k1L01Q6K03n52m4K30L65l84m08N0qK31
2254a22J42m74l51K16O82k08m78k52K48J47L95n82j95J56M13K30K2m79j08P33
2274A35L02n42k58L40M8M44p8l77l99N50K22np21J51O3K95J26l59k50L53J92J82
2296D14m24k39K06M83J95m71k35m6N10j14m61j7K22N1L52k50o40J81L0L54n42
2317d41r4m6L64J65k17o12K69N9N89j67l81r2L98L96j56l15L58p5M17K33k35k04
2339B13K19L62j83j40k42n5N28K16l67l25j01L48L23q20l97Q8M64J23l02o28K7
$$ plain form
2189 -5 -661 -546 -161 19 -296 -926 -761 -466 -116 -205 -882 -663 -317 -81 -311 -618 -546 -524 107 -66 -475 -629
2211 -629 -217 246 58 -418 -430 -814 50 43 -374 -675 -386 -118 198 -214 -909 -741 -111 -86 -264 -818 -353
2232 -353 -151 -24 82 -758 -387 -48 394 119 -171 -192 109 195 398 -154 -198 32 397 13 -395 -345 -353 -122
2254 -122 20 -454 -805 -589 93 -115 -593 -845 -597 -450 -55 -637 -832 -676 -263 -33 -11 -490 -598 135
2274 135 437 -105 -363 -23 25 469 391 14 -385 165 387 382 -339 -188 -125 170 296 -63 -313 40 232 414
2296 414 -10 -249 -43 440 635 164 -71 -117 393 279 -182 -199 23 74 426 176 -464 -283 -253 101 -441
2317 -441 -535 -581 -217 -52 -269 -881 -612 -553 36 -131 -512 -604 -206 190 34 -281 77 2 419 652 417 213
2339 213 432 794 611 471 229 174 702 918 551 226 125 473 796 -24 -421 -333 131 254 -48 -676 -649
2360f49M92K39k80m24j79L84N40k19k00l50K81L96q2k94j25J28N82j81m33k57
2380f31K59L85m9J74m28m8N64J92m82j47k6O48J12q2m66P6L35L02n1l88j80K65
2402C34M18k50j60l17J50K51K3m76l35R1M14j90o98k6o4M74L3l35j45L8M37k6
2424c59m08K6J47K21K0J22k86j67P41K45J5m52q2N13P5M4l61J3J34L28n5m43O4
2447I5J40K79m44j70j69L10o0O3k13l79J80M78l92K9m26M65K81p5j86k35J11K28
2469i0P3j16l78K14M27N9l04k40k5M79j6m27j20j93N79J41J06n49P6L35K43j37
2491A37l95K42L4L65L13o61r1K55M62k19k26j16%L31R8o51n3L55k42M12o02l56
2513f08J8M87j1k78j01n4M07K99r1m89q0K47J96L44o52J61K85J75j3l56k31M21
$$ plain form
2360 -649 -157 82 -198 -622 -801 -417 123 -96 -296 -646 -365 31 -51 -345 -470 -342 240 59 -374 -631
2380 -631 -372 13 -36 138 -290 -338 226 418 -64 -211 -237 411 523 441 -25 51 386 688 637 249 69 334
2402 334 752 502 342 25 175 426 449 -27 -362 -271 143 -47 -745 -771 -835 -361 -328 -663 -808 -770 -333 -359
2424 -359 -767 -741 -594 -373 -353 -231 -517 -684 57 302 317 -135 -217 296 371 415 54 67 201 529 474 31 95
2447 95 235 514 70 -100 -269 41 -19 44 -169 -548 -368 110 -282 -253 -679 -214 67 -8 -194 -429 -318 -90
2469 -90 -17 -133 -511 -297 130 189 -115 -355 -380 99 83 -344 -464 -657 -78 63 169 -380 -304 31 274 137
2491 137 -258 -16 18 383 696 35 -56 199 661 442 216 100 100 431 529 -122 -175 180 -62 350 -252 -608
2513 -608 -590 -103 -114 -392 -493 -547 -140 159 68 -421 -501 -254 -58 286 -366 -205 80 255 242 -114 -345 76
2535G6O68l81l49K13L13q9J19m56k89J86M01l59Kq9k31K20K63k58n98L78L57P6
2557A73k83j92n4M04K56l30l02J05L68Q0rl29l27L53L85k18j02k07K04J13j26
2578c8j06m31M82K46n4J2m80M62K17k44j68l44L34M24L43k86o48O32k1M0J62q40
2600c06J54M06pk57J5l54J89O04m21o33K7L30M71m60q6m08J55K73n6k52o6L83
2622b99L42j44j97k55M92L86r1k82j52m0L19K64l28L7k79M08M4j02k61L4J24L07
2644C27j01o59O0J41J63j76K31l60K05K22l10k02J79O04r5j92j2m11M63p8L43
2665C42m46l21N33j23L60o79k45J81K37J06m18N1J38QK63l08n4n0Q3L40j25l31
2687d58L65J28O6J05k76j19K58M32j78n02L4J44M12k96j60j18K22K69k94o5k90
$$ plain form
2535 76 744 363 14 227 540 451 570 114 -175 11 412 53 55 -34 -265 -45 218 -40 -638 -260 97 173
2557 173 -110 -302 -356 48 304 -26 -328 -223 145 225 216 -113 -440 -87 298 80 -22 -229 -25 88 -38
2578 -38 -144 -575 -93 153 99 111 -369 93 310 66 -102 -446 -112 312 655 369 -279 353 332 372 534 -306
2600 -306 -152 254 247 -10 5 -349 -160 444 23 -610 -583 -253 218 -242 -328 -736 -581 -308 -364 -616 -682 -299
2622 -299 43 -101 -298 -553 -61 325 234 -48 -200 -240 79 343 15 52 -227 181 225 123 -138 -104 20 327
2644 327 226 -433 -373 -232 -69 -245 -14 -374 -169 53 -257 -459 -280 324 229 37 25 -386 77 -1 342
2665 342 -104 -425 108 -15 345 -334 -579 -398 -161 -55 -473 -422 -284 -276 -13 -321 -375 -425 -342 -2 -127 -458
2687 -458 -93 35 101 206 -70 -189 69 501 323 -179 -145 -1 411 115 -45 -163 59 328 34 -31 -321
2708c21L58l06M14l71o7kK36k4p1j6j56L03J79k51k08j23N40r7L21l63j88K75
2730F2J86k38k45K4L02J57k14l32o3J37K24k38P4jJ8K20N4p1k19q2N24P5m53K70
2754A71k0P4J01o5l99K51J66L40l64j06P6J82K23k92l56k34L93k78K97m94J99
2775a35K35r7j91L2m0K09k07K38k89k0J41L24j62nl69K48L79o6J61l57j9J94K87
2798D91j30m48K26O6R0k20j62M3J63K98l11k00M1L0K17j32l9R1o2M7l5K20l99
2821a15J61K71J06n95J56J46J20J57m98N4M1K13k87J74l96QL02P4l91o2K31J1
2843a19L37k68j84q7N84j41r0L1j50L35R2k95O7p4M72m3Q2l00J01N6j47j06r0
2866F3j30%J89Ql97l3J12M9J38j20j01j5K65k34j40Q0p8K12J02J05n00K89j5M23
$$ plain form
2708 -321 37 -269 145 -226 -293 -295 -59 -83 -154 -170 -326 -23 156 -95 -303 -426 114 17 338 -25 -213 62
2730 62 248 10 -235 -211 91 248 34 -298 -361 -224 0 -238 -164 -165 -147 73 127 56 -163 -245 279 354 -99 171
2754 171 151 225 326 261 -138 113 279 619 255 149 225 407 630 338 -18 -252 141 -137 160 -334 -135
2775 -135 100 3 -188 -156 -196 13 -194 44 -245 -265 -124 200 38 33 -336 -88 291 225 386 29 10 204 491
2798 491 361 -87 139 205 295 75 -87 -44 119 417 106 -94 -53 -23 194 62 23 114 52 99 64 284 -115
2821 -115 46 317 423 -172 -16 130 250 407 -91 -37 4 217 -70 104 -292 -284 18 92 -299 -361 -130 -119
2843 -119 218 -50 -234 -321 263 122 32 63 -87 248 340 45 112 38 510 467 549 249 350 406 259 153 63
2866 63 -67 -67 122 130 -267 -300 -188 -139 -1 -121 -222 -237 28 -206 -346 -266 -344 -132 -30 75 -425 -136 -151 272
2890B72l22J68j91L93j44o4j64k21L44K47l33k19P8J34L23k47Q0l58pM19j65k92
2912b69o5M35K11j66L6l73J93L39l05K52m12K6L70k48J70l60R0o4M0J22l44K53
2934f9j65K29j80r6j15K64L06p5l30j42L45K7K12l20o5K10L8L39l17kL29k50j7
2957A56j50j65M57o5q6j63j63K31N8OM4l33j8J0M31n09K63m99M28J62j95J0l41
2980d31J83M08j30k84J66J13J69Ln7n44N26k70K51k10m0l8K41K51j66k70L23j2
3002A82Mj59k49K7L54R7k69p7j79N06q7K04k4l28P9M88l79%k52J06K35l96j2p2
3026b01K98O4l36k76O50l80K28k58K4k85Q4M16j70k0k88K97K22J05j16k2N0J24
3048B10R6k19j25Q7J83J32k89q6J07J22k8l48K69k03J85j49L82l63j23R5K06m13
$$ plain form
2890 272 -50 118 -73 320 176 112 -52 -273 71 318 -15 -234 -156 -22 301 54 134 -224 -231 188 23 -269
2912 -269 -334 101 312 146 182 -191 2 341 36 288 -124 -98 272 24 194 -166 -76 -140 -100 22 -322 -69
2934 -69 -234 -5 -185 -281 -396 -132 174 99 -231 -373 -28 -1 211 -109 -174 36 74 413 96 94 423 173 156
2957 156 6 -159 298 233 147 -16 -179 52 110 116 160 -173 -191 -181 250 -259 4 -495 -67 95 -100 -90 -431
2980 -431 -248 160 30 -254 -88 25 194 197 140 -404 122 -148 103 -107 -147 -185 56 307 141 -129 194 182
3002 182 186 27 -222 -195 159 256 -13 -90 -269 237 150 354 330 2 81 569 190 190 -62 44 279 -117 -129 -201
3026 -201 97 161 -175 -451 199 -181 47 -211 -187 -472 -388 28 -142 -162 -450 -153 69 174 58 36 86 210
3048 210 306 87 -38 49 232 364 75 -11 96 218 190 -158 111 -92 93 -56 326 -37 -160 -65 141 -272
3070b72J0J05j97L57k72K81l60L6L64j80J79l45R8K85j36M1j05L03k78J32K2j60
3092i2l08N30l23K01M3l52J66L78k17j56j3M20k27J20j72j70K00K14Q7m22j1K12
3114A08K42k24P3l12K00j03J14k32L93l45J27j83R1j56J40m1J97k21o0K6j97J63
3136b00L62l53J11oJ45Q6j68O3J60q2n3O9m2J11q1J13j57J39k04J22R5m18J32
3159e6Q5J68J62j88j70k9J89p1R4l82K19j3P1j8K9j44K3K95j94K97P9l99J04K3
3183A74m9j72j50N03q5j78R9j94J82k66o9K4OJ85o3m0M5j53R2K90j83l4J44l7
3207G1J13K40m26J62K67q6q3j06j49K14rJ05m5j19j37L2K44m18K12J48j47m2l1
3230A0j9R6J25Rl0m45K64p2L62k24K13j19L3k74L01j22j75L79j24J69m12J74j92
$$ plain form
3070 -272 -262 -157 -354 3 -269 12 -348 -312 52 -128 51 -294 -196 89 -47 -6 -111 192 -86 46 68 -92
3092 -92 -400 130 -193 8 51 -301 -135 243 26 -130 -143 277 50 170 -2 -172 28 242 329 -93 -104 108
3114 108 350 126 199 -113 87 -16 98 -134 259 -86 41 -142 -51 -207 -67 -108 89 -132 -192 -166 -363 -200
3136 -200 162 -191 -80 -86 59 145 -23 40 200 118 65 134 92 203 122 235 78 217 13 135 230 -188 -56
3159 -56 29 197 359 171 1 -28 161 90 184 -198 21 8 79 61 90 -54 -31 264 70 367 446 47 151 174
3183 174 125 -47 -197 306 221 43 142 -52 130 -136 -205 -181 -175 10 -53 -93 -48 -201 -109 181 -2 -36 108 71
3207 71 184 424 -2 160 427 341 258 152 3 217 208 313 268 149 12 44 288 -130 82 230 83 41 10
3230 10 -9 87 212 221 191 -254 10 -62 300 76 289 170 203 -71 230 108 -67 312 188 357 -55 119 -73
3253g3N3L36k53j21Q6J0Kl6J82j97n8K56N1k61M1L6Q4p2k09n8M70j9k63K15j73
3278B9L51k9m43J66l08N10k96j5J20j04M7j86J4J87j84O1J5j6O0o7J8J06p7l2
3302g3K58k89O5mJ59j21N1J66j89R0k94K90N8J6jj12k4J0J26j80o3j37m4K46L4
3327C8m41J02j9L03o7m2J18K2l0j82O0R9J04L0O0j15Q3j92J04N2n20K91J99R1
3351A48L5n12Ko4N58j27m1k61N0M02j31j14N8J44q9k19J91J10m38L94J53m32J01
3374h2r2K29J21N1J44l07L9j32l8J47j80K77k47j84j6K79k35J28Mj62J07r1J47
3397i3J87q8k5j6K8K59j51l0R7N0j49k7K78j74j37K30l85N9J43k1m1n4j42P2K08
3422G8K04k8m51r8K36K04k18j49LK61J89k31L3nn9L08j61m2m05L96K25j89n7j63
$$ plain form
3253 -73 -20 316 63 -58 28 38 40 4 186 -11 -69 187 238 -23 18 54 138 66 -143 -201 269 250 -13 202 29
3278 29 380 351 -92 74 -234 276 -20 -35 85 -19 28 -158 -144 43 -141 -80 -65 -81 -21 -88 -70 36 -41 -73
3302 -73 185 -104 -39 -43 116 -5 46 212 23 113 -181 109 167 183 182 70 46 56 182 2 -61 -198 -242 4 38
3327 38 -403 -301 -320 -17 -84 -126 -8 14 -16 -198 -138 -39 65 95 155 40 123 -69 35 87 -433 -142 57 148
3351 148 183 -329 -327 -391 167 40 -1 -262 -212 190 59 -55 3 147 58 -161 30 140 -298 96 249 -183 -82
3374 -82 -174 55 176 227 371 64 103 -29 -67 80 -100 177 -70 -254 -270 9 -226 -98 -94 -256 -149 -240 -93
3397 -93 94 6 -19 -35 -7 252 101 71 168 218 69 42 320 146 9 239 -146 -87 56 35 -6 -60 -202 -130 78
3422 78 282 254 -197 -295 -59 145 -73 -222 -219 42 231 0 33 28 -31 277 116 74 -331 65 290 101 44 -119
3446a19K32J51m76k6K44p1k05L28j51k49J25J73J19q8j32J50L6R0L05n56K16m6
3468E0J33l54J23J14K92j40j27q3K39o3O2j05j27k90K39m4L4j50K3J78k84L60
3490H0k09R4j22Q8%j85J2K97Oj8l8j85KK31j10J87q6J8J7J78q6m90M14j89L56
3515B62n06K49k93K89j1j23q2K06J63l4k13j48J29J04R9J01j14j25LM05j71k29
3537c9O1R8n5j65J37j65J9m6L44m60R8J7p1L86k79M8Q8j44L81l16j09j81r2N31
3561H6k96Q6L12m00K95J50j32k2KQ0j5j49j33J70R1lk91J97J42j34j11J18l58
3584c15L12n7l7l2j33K14O7j6P5j99j22K69K70l98J37L2J51p3O5k93L55k56Q1
3607I7J31l15K36j22K96k96Q5k54P1K5P2k26L70k13m0K26Kl44K74j3K66j09j14
$$ plain form
3446 -119 113 264 -212 -238 6 -65 -270 58 -93 -342 -217 -44 75 -13 -145 5 41 131 436 -120 96 50
3468 50 183 -171 -48 66 358 218 91 8 247 184 246 141 14 -276 -37 -81 -47 -197 -174 4 -280 80
3490 80 -129 -35 -157 -69 -69 -254 -242 55 61 43 5 -180 -178 53 -57 130 44 62 79 257 171 -319 95 -94 262
3515 262 -244 5 -288 1 -10 -133 -215 -9 154 120 -93 -241 -112 -8 91 192 78 -47 -44 361 190 -39
3537 -39 22 120 65 -100 37 -128 -109 -155 189 -271 -173 -156 -227 159 -120 -72 16 -128 253 -63 -172 -353 -445 86
3561 86 -210 -124 188 -212 83 233 101 79 81 161 146 -3 -136 34 125 122 -169 28 170 36 -75 43 -315
3584 -315 -3 -60 -97 -129 -262 -48 19 3 78 -121 -243 26 296 -102 35 67 218 145 210 -83 272 16 97
3607 97 228 -87 149 27 323 27 112 -142 -71 -46 26 -200 170 -43 -83 143 145 -199 75 62 328 219 105
3630A05J19k26K50r6J63l11Q2J20j33J36p5o8q5j42J02O8m5l6j20K76j30O8J45
3653A67j06m22M76LK1l9L3k78N7M85p5j92k8J8j10j7L17k78N4Qj27J40l3j59k7
3678a12j12Q0K32j2K0r0J65k07j75L27k38l5J75J49k11mL17j13l15j22N70Nj82
3701A12j5j31R9K13m60J93r0k5K06k50n7J65J43J4j78n9P8o3J42q9O2j08J47m
3725D5m3M0k8J54k5P9j53j70p4L13J17l77K7J59m3O5j4j58j4k66K43K8mk2j54
3750b75K44J32j64QO5N1j70K8L4J25j25o0J31j86K0J71k34K79k5K80l66k7J45
3773H1j44j8O8j01o4J83k43K13k51J26R1j39J29P3J06k06O9K42j71l4J38j14j34
3796a00j8J30n5R4j03K50Rj18j17j33K02l31K8O2K02J73k48j94J97O3Mj15j55
$$ plain form
3630 105 224 -2 248 152 315 4 86 206 73 209 134 66 -19 -161 -59 9 -36 -72 -192 84 -46 22 167
3653 167 61 -361 115 118 139 100 133 -145 -88 397 322 130 102 120 10 -7 310 32 86 94 -33 107 74 -85 -112
3678 -112 -224 -144 88 76 96 6 171 -36 -211 116 -122 -157 18 167 -44 -48 269 156 -159 -281 289 294 112
3701 112 97 -34 65 278 -182 11 -79 -104 102 -148 -205 -40 103 117 -61 -120 -42 -105 37 -52 10 -98 49 45
3725 45 2 42 14 168 143 222 69 -101 -175 138 255 -122 -95 64 21 86 72 -86 -100 -366 -123 -95 -99 -121 -275
3750 -275 -31 101 -63 -55 10 61 -109 -81 -47 78 -47 -107 24 -162 -142 29 -205 74 49 329 -37 -64 81
3773 81 -63 -81 -13 -114 -178 5 -238 -25 -276 -150 -59 -198 -69 4 110 -96 -27 215 44 10 148 34 -100
3796 -100 -118 12 -43 51 -52 198 207 89 -28 -161 41 -290 -262 -200 2 175 -73 -267 -70 -7 -3 -118 -273
3819b73J97K39rj04j10R7K61j05l30L24j84k30K77K0k2q8M8j56Q1K08l12L9K53
3842A21j99k10L14j21k05M61l06j97J35L59j20K4J21k25l3J10m5J03J36k34M1
3863C0K08k89j4K65l31J21j32M6M8J39J03j79J06j42oQ5k04J66p5j1R7O9l36J95
3887d1P8j09L6K18m1k80K77j44R0J90p1N4k20r9N1q6l5P2j79J54Q0K0k73J92m8
3912a14Q1J67n9K06j76k23J76n6j58K32l3j08K47j15J99j62J2j86J15j35P3J16
3934I9j22nR9r9j21J62o7K36j75l40N22l88K4K45m08K49K60k98J95j34k8L09j60
3957E5p5l4J09j27j21m0J98J80j72K02l64K75j56j5K45J3l69K43j5J35k8k13R3
3980A9p3R0k20J12%J5K78l7j71m4M48k09m57P5L7M08j56k27J24Q3K8J55l64q3
$$ plain form
3819 -273 -76 163 154 50 -60 37 298 193 -137 187 3 -227 50 70 48 -40 8 -148 -67 141 -171 -132 121
3842 121 -78 -288 26 -95 -300 161 -145 -342 -207 152 32 56 177 -48 -81 29 -16 87 223 -11 30
3863 30 238 -51 -65 200 -131 -10 -142 -96 -48 91 194 15 121 -21 -27 58 -146 20 -55 -66 31 100 -236 -41
3887 -41 37 -72 -36 182 141 -139 138 -6 84 274 203 257 37 -62 -11 -97 -132 -60 -239 -85 -5 15 -258 -66 -114
3912 -114 -33 134 75 281 105 -118 58 2 -156 76 43 -65 182 67 266 104 116 -70 45 -90 -17 99
3934 99 -23 -28 71 -28 -149 13 -54 182 7 -333 189 -199 -175 70 -338 -89 171 -127 68 -66 -94 215 55
3957 55 -20 -54 55 -72 -193 -233 -35 145 -27 175 -189 86 -70 -85 160 173 -196 47 32 167 139 -74 19
3980 19 -54 36 -184 -72 -72 -57 221 184 13 -31 417 208 -249 -174 -137 271 115 -112 12 95 123 278 -86 -169
4004a69K31j03P3J15J51k59l53J52J70j62p2P6K41p2j3lo5J57l36K89j58K38j12
4027A6lJ27m3l62K97N9l00K89j42J25N7O8n59N87m33L22k84M91l84M6o3K85l88
4050a92L77Jm7j23J21k28K13j52K31j11P1j93L00l52O4M7p7K49j39j35j11j10
4072b96J68M5O8m7K2J50Q4j32J40q7K08m24J02J91j72K85j47k25J14j22P0n2m7
4095a04r8K66O5j78K77m03N3p6J27K12m23M46k91L16o1j74k6K23j4j07J57o7j24
4118dQ2m0P2l8J40o1j76l1o9J6J46m3oJ52l19m8N8K86k5k79J15r9O2J66k92K76
4144D1J9K6J29q6k38J90Rl89L33J31j53Q9n3j57Q4j10J31j00L0J70k42K84j76
4167c8J62n3k6J95j16j08j33J40j00q2L98l12M32l75J12m0k04K80l2k2L4j06M8
$$ plain form
4004 -169 62 -41 32 147 298 39 -314 -162 8 -154 -226 -150 91 19 6 3 -62 95 -241 48 -110 128 16
4027 16 13 140 97 -265 32 91 -209 80 -62 63 120 188 -371 216 -217 105 -179 312 -72 -26 -89 196 -192
4050 -192 185 186 139 16 137 -91 122 -30 201 90 161 -32 268 -84 -20 27 -50 199 60 -75 -186 -296
4072 -296 -128 -83 -15 -62 -40 110 194 62 202 115 323 -101 1 192 20 305 158 -67 47 -75 -5 -57 -104
4095 -104 -202 64 129 -49 228 -175 -122 -198 -71 141 -282 164 -127 189 128 -46 -72 151 137 30 187 120 -4
4118 -4 78 38 110 72 212 151 -25 -56 -125 -109 37 -6 -12 140 -179 -227 -169 117 92 -187 -72 -171 -109 57 -235 41
4144 41 60 86 215 129 -109 81 90 -299 34 165 12 101 48 -109 -25 -135 -4 -104 -74 96 -146 138 -38
4167 -38 124 71 45 240 124 16 -117 23 -77 -159 239 -73 359 -16 96 56 -148 132 100 78 112 6 54
4190E4K6j61j83L03P7m23K08L8j32p5J83M6o9k25J73L79j77r3l1Qm2jR9n2O7J30
4216A27j70k1J69j77M6k18M49k72j73J19j1P2rk10K85L8j66J07kj17J61M2j15
4239d6R0k9K09j18L0k38K4J94j04K89m29K14p9o8r5j66L51Q8o4j05j58K44k21
4262a87J74Q5j97q7L2L1O0O4j50J22RP4O6lN0k49L96j63J79l78J54pj7k70K65
4287E3j04l9K01k19J07L0J53M4j58j74q0J81k67J06K81K33l71L8R0J67k02n2R0
4310A08k85K23j12j15J98j28L3L20k56R9l42J40K48j35o9J52j27p2P0J64k54J36
4332dO7j61L62l81J35p2O4J9r9J4O5n9M7J17j02R0j54P8n3n3N5j05j3R0m7l73
4358d73K15L01j3j84J95l9k0J83l06l9J5K82Jj39M8J66j73k07J49P0j10M11l70
$$ plain form
4190 54 80 -81 -264 39 116 -307 -99 -61 -193 -268 -85 -39 -108 -333 -160 219 42 -51 -82 -74 -116 -117 -18 -70 -3 127
4216 127 -43 -64 105 -72 -26 -244 205 -67 -240 -121 -132 -60 -69 -279 6 44 -122 -15 -17 -134 27 69 -46
4239 -46 44 15 224 106 136 -102 -78 116 12 301 -128 86 7 -61 -156 -322 29 117 53 -52 -210 34 -187
4262 -187 -13 72 -125 -212 -180 -149 -89 -25 -175 -53 -44 30 96 93 143 -106 290 127 306 -72 82 75 58 -212 53
4287 53 -51 -90 111 -108 -1 29 182 226 68 -106 -186 -5 -272 -166 115 348 -23 15 105 272 70 18 108
4310 108 -177 46 -66 -181 17 -111 -78 242 -14 85 -257 -117 131 -4 -73 79 -48 -120 -50 114 -140 -4
4332 -4 63 -98 264 -117 18 -54 10 29 -70 -56 9 -50 -3 114 12 102 -52 26 -27 -80 -25 -130 -143 -53 -100 -473
4358 -473 -258 43 30 -154 41 2 -18 165 -141 -180 -165 117 118 -21 27 193 20 -187 -38 32 -78 333 -37
4381c7J85Kj31k18J23L3k31M69l48L07k51N2j6J69M8K5j86j40j3L04j88J96l45
4404a91J27L03l15R6k9j9J68J58k73MJ34j4k61M07l55j92N01m28j53k9J77n5K58
4427A9J37J01l67j1R6K36j57r0J14J18j50N8j26p5M9K33j01j10J18Q6k3j85k40
4450b70K45J23J27k62l68L36RJ32qKN8r6j25J57L3l62L36J7j18K28k31l8K34J3
4474A72k38j81N51j46j85K71N3l35M2LK7J9M6k0k15J62j50J67j36j60J99j35J3
4497a76J66o1M0J45j27K27l6p7k0J11l27M9K49k80J36n3R4QK05o40L99k87K19
4520c6L05k23J7j43K08k95K51j17J69k11j96J63J00J35l75K44J64q0r7n9K93l97
4542a80N03l45j09J39j21j46L76J53m12J04k05o7K25K00j8j34R4p4K82k06K67
$$ plain form
4381 -37 148 150 19 -199 -76 -43 -274 195 -153 154 -97 -45 -61 108 156 181 -5 -145 -158 146 -42 154 -191
4404 -191 -64 239 -76 20 -9 -28 140 298 25 29 163 149 -112 295 -60 -252 249 -179 -332 -361 -184 -239 19
4427 19 156 257 -110 -121 -25 211 54 -36 78 196 46 104 -22 -97 -48 185 84 -26 92 178 155 -30 -270
4450 -270 -25 98 225 -37 -405 -69 -60 72 64 66 124 28 -97 60 93 -269 67 84 -34 194 -37 -75 159 172
4474 172 -66 -247 304 158 -27 244 297 -38 4 7 34 53 99 79 -136 26 -124 43 -93 -253 -54 -189 -176
4497 -176 -10 -71 -31 114 -13 214 178 101 81 192 -135 -86 163 -117 19 -34 60 68 273 -367 32 -255 -36
4520 -36 269 46 63 -80 128 -167 84 -33 136 -75 -271 -108 -8 127 -248 -4 160 80 -17 -76 217 -180
4542 -180 323 -22 -131 8 -113 -259 117 270 -142 -38 -243 -310 -85 115 97 -37 57 -17 265 59 326
4563C26m10p7J69j98mN72j91k4l0j36K5m4N7K2k23K67N9l11K52m0p0j7J22l11
4587b15K74j69j3K34J5j81jJ12j14N8K42k98o5K82k24L72l29lJ49j72j51M25m04
4610a76J17m0L20l41K5j03m2O7P7p6J36j96L50j93Q4p7M8Q3j67L27n20L61j39
4633g5j3P9J44Mj10O2J39k61o1%R5j74oK24R4k07j99K8j76N07j60L61l19lqJ33
4659I8l4m43M82o0j15J46k67J50m0o0J07K67j50L1j32m2K62k31K66l79K94j53
4681cl2O2j44J96k70K7J80k54J93k53J99N9M88k42j95O8N2l27R6p5J09Jj03K68
4705A00k94K34j16j1k7l2l4K48L4k71K12Q0k33K9j13k2J07K71k42R2P3p6J64k34
4729f1O3l2kL6J19j07o4m2J58Pj67j53J63k01L93j43Ll41M13j57O4J36nk01P1
$$ plain form
4563 326 -84 -161 8 -190 -194 378 187 163 133 -3 22 -22 35 57 -166 101 160 -151 101 61 -9 -26 96 -215
4587 -215 59 -110 -123 111 126 -55 -56 56 -58 0 242 -56 -121 161 -63 309 -20 -23 126 -46 -197 228 -176
4610 -176 -59 -99 221 -120 -95 -198 -240 -173 -96 -172 -36 -232 118 -75 9 -68 -20 63 -104 223 -297 64 -75
4633 -75 -88 -9 135 139 29 91 230 -31 -92 -92 3 -171 -177 47 141 -66 -265 -237 -413 94 -66 295 -24 -27 -35 98
4659 98 64 -379 103 43 -72 74 -193 -43 -83 -143 -36 231 81 112 -20 -62 200 -31 235 -144 150 -3
4681 -3 -35 27 -117 79 -191 -164 16 -238 -45 -298 -99 -40 448 206 11 79 131 -196 -100 -175 -66 -65 -168 100
4705 100 -194 40 -76 -87 -114 -146 -180 68 102 -169 43 123 -110 -81 -194 -216 -109 162 -80 12 85 9 173 -61
4729 -61 2 -30 -32 4 123 16 -48 -90 68 75 -92 -245 -82 -283 110 -33 -30 -371 42 -115 -51 85 80 -121 -50
4754e0J04l26K40J22k48L90J21l55L7J77L2k52p7O0j84J07N7k2O0j13j31K95J1
4777E5j82k3J39m2p7K02L6k10Q3k26J05l4K08j21L38l24J20q3j24L54j31K8j11
4800b0o1N8O2K37l92J29j57j86Q5K14qK1j62J24j34O1K63j66r7K85j65j16J84
4823E9j51j2J57J7N9j95m2J5j6j25L08j40L20j34q5J14p1n0R2l59L12k97L89k19
4847e4k97K83K3n0M4P9l2N0K22k22M5k45M42l85o9K65k54N6J20P8k84J13J9L6
4871a7J77l35K19l2j3l56L11R0j76K75k53K98k18j23J19O9J39j61R4k16P9o3K11
4894A18k39J8K56n8k73J13K38k41M40m15j98K5N8L52l18pP9k88L16n7K98k30P2
4917E9q8J37j47L09k95n7n3M3O3n5l4k4J48OK8r4J00l11M85k53j27N8Q4n3j5R5
$$ plain form
4754 -50 54 -272 -32 90 -158 232 353 -2 35 212 244 -8 -85 -25 -209 -102 -45 -67 -7 -120 -251 44 55
4777 55 -127 -150 -11 -53 -130 72 108 -102 -19 -245 -140 -174 34 -87 251 -73 47 -36 -160 194 63 91 -20
4800 -20 -81 -23 39 276 -116 13 -144 -330 -245 -31 -39 -18 -180 -56 -190 -129 134 -32 -129 156 -9 -125 59
4823 59 -92 -104 53 70 129 -66 -108 -93 -109 -234 74 -66 254 120 35 149 78 28 120 -239 73 -224 165 -54
4847 -54 -351 -68 -45 -95 -51 28 -4 46 268 46 91 -154 288 -97 -166 99 -155 -99 21 99 -185 -72 -53 -17
4871 -17 160 -175 44 12 -1 -357 -46 44 -132 143 -110 188 -30 -153 -34 35 174 13 107 -109 -30 -93 118
4894 118 -121 -103 153 95 -178 -65 173 -68 372 -43 -241 -216 -158 194 -124 -131 -52 -340 -24 -81 217 -13 59
4917 59 -29 108 -39 270 -25 -82 -135 -92 -29 -84 -118 -142 6 12 40 -54 46 -265 220 -33 -160 -102 -18 -71 -86 9
4943IJ86jo6m15O9K49p9M5J80j54J28p6k46KJ17J60J77j47Q5l76K85nr9K7l70
4968c15L60J61j59j81J38q2K47l85O3N1J92J10l01j68L02K15j21j39JJ0j32J30
4990cr0L42j45j46P5q7m8%P9l07M28j33K03k06J12q8j0M6j90Q1j27K99j19k3J
5015e6LM6L3o3n4K61k38l2L76m30O9M7M6j17J25N4k7j06O2j0K57p7l18K43M9j36
5041Gk00L00Q4j14p9j4n2Q8l63J29J63K29j33K11j91J08j30l40N09L1l33jj05
5064a96K21L2P2k59P0l32L63j8J5j46J37J37m1k06K60j44J11K20l17K07k46j9
5086g9P5K02o36L39K5J40j28L8J81l4k12K96l28Q7q7K21j97J37J38k04k5J25o
5109F8j65J32j69j29L22j48J76j6J08n5P7j92N9o7J74j51N9L3L3j70krr1J92J29
$$ plain form
4943 9 195 194 128 -287 -218 31 -48 -3 177 23 151 75 -171 -169 -52 108 285 138 223 -153 132 127 28 55 -315
4968 -315 45 206 47 -134 4 -78 169 -216 -153 -102 90 200 -101 -269 33 248 127 -12 -11 -1 -133 -3
4990 -3 -93 249 104 -42 33 -54 -102 -102 -23 -330 98 -35 168 -38 74 -14 -24 22 -168 -87 -214 85 -34 -57 -56
5015 -56 -53 -7 26 -37 -91 170 -68 -100 276 -154 -85 -38 8 -109 16 70 43 -63 -1 -11 246 169 -149 94 143 7
5041 7 -193 107 191 77 -2 -16 -68 20 -343 -214 -51 178 45 256 65 173 43 -297 212 243 -90 -91 -196
5064 -196 25 57 129 -130 -60 -392 -29 -47 -32 -178 -41 96 55 -151 109 -35 76 296 -21 186 -60 -79
5086 -79 -4 198 -438 -99 -74 66 -62 -24 157 123 -89 207 -121 -34 -121 100 -97 40 178 -26 -51 74 68
5109 68 -97 35 -134 -263 59 -89 87 71 179 124 201 9 68 1 175 24 83 116 149 -21 -23 -32 -123 69 198
5134A98k73n5l9J20J2n2J31o9P9j50J31j17l48M05K77k04K9j32K80k26K07k29
5156b5j15J93l29L09l8l9J08k34K14J29j69L02k07k12m4L77l92M4j84L00J36j18
5178Fm6M2K3j46K30m03K20K04K4o1o1l8J7j8m1J38O5m51M85k68J66q2k7j97J62
5203e7r1K48j18j43K03k3p0o4K63k14jJ63O8j09r4J08n6j37L93j79j01J91o4j98
5227h2L9j34J36k9m4J92k43J30K8j80K51r7N9J36p4m80J90K17J8p4K4J01M6j08
5251B2j02L05k45j22K14J43k17K41k59k06K00p7L22k31qj79J4K15k68M90k36n5
5273c9J52j23n2n3J04P1k80L46L6k89L3M0O6J8j16o8K37Nq3K30l10J54j34J66
5297A11J08k99m4LJ60j12rM6J84M6j19L8o6j03j28K32J3j91n7R3m4M23j88k41
$$ plain form
5134 198 -75 -130 -169 -49 -37 -89 42 -27 52 -98 33 -84 -432 -27 250 46 75 -57 223 -3 204 -25
5156 -25 -140 53 -276 33 -5 -44 64 -170 44 173 4 306 99 -113 -157 220 -172 -128 -312 -12 124 6
5178 6 -40 2 25 -121 109 -294 -74 130 154 93 32 -6 11 -7 -48 90 155 -296 189 -79 87 5 -22 -219 -57
5203 -57 -148 100 -18 -161 42 19 -51 -115 148 -66 -67 96 164 55 -39 69 13 -124 269 90 -11 180 116 -82
5227 -82 -43 -177 -41 -70 -114 78 -165 -35 -7 -187 64 -33 26 162 88 -392 -202 15 33 -41 -17 84 130 22
5251 22 -80 225 -20 -142 72 215 -2 239 -20 -226 -26 -103 219 -12 -20 -199 -185 30 -238 252 16 -39
5273 -39 113 -10 -62 -115 -11 60 -220 126 162 -127 -94 -54 12 30 -86 -154 83 88 5 235 -75 79 -55 111
5297 111 219 -80 -124 -121 39 -73 -82 -36 148 194 75 113 47 -56 -184 48 61 -130 -187 -94 -138 285 97 -144
5321a44K06L13k76M9o9M4j04J32m38N4K72j79qL26l16J26j55J65J97l36n2L20
5343A27m0j60J06R9j9l25L02j10j1J2mO2k65L12j33m5J99k37j18J04K75k5l08
5366b02J09P2R7J9O7J3K78n27P4j21J85k07L33k64J43q9o1K63l71K96N1j18NJ45
5390A90k16m3Q5o5K7J01k33j27J69Q1J15R0j63j64J39M2j4NOQ8j74j4j79J67L54
5415B67p9j69K01n52K40J9L44k42o0J90q4k28K0P0K66Mj14k18KK56j2k08O1J9
5439gK6J02p6Kp3P6K33l37j37j2nJ11m1J62m4M2L0l31J85J32O1n99M13K4p9K69
5465A27n9j02J91l19K33L5l05L40j43J06L7J54j54l14J27p8K83J57m78J02J73
5486A13j9rl63M34j91P3J22jk8j51p1K7K34K0k33Q5J7j18M6n3p2K10qJ77r5q3
$$ plain form
5321 -144 62 375 99 148 79 123 19 151 -287 -233 39 -140 -148 178 -138 -12 -167 -2 195 -141 -193 127
5343 127 87 -73 33 132 113 -212 90 -20 -31 -19 -23 39 -226 86 -47 -92 107 -130 -248 -144 131 106 -202
5366 -202 -93 -21 76 95 162 175 453 -74 0 -121 64 -143 190 -74 69 -20 -81 182 -189 107 158 40 45 190
5390 190 -26 -69 16 -49 -22 79 -154 -281 -112 -31 84 174 11 -153 -14 28 14 19 25 113 -61 -75 -254 -87 267
5415 267 188 19 220 -332 -92 -73 271 29 -31 159 75 -153 -133 -63 203 207 93 -125 -123 133 121 -87 -26 -7
5439 -7 19 121 45 47 -26 50 283 -54 -191 -203 -208 -97 -138 24 -20 22 52 -279 -94 38 99 -500 -87 -63 -142 127
5465 127 68 -34 157 -162 71 106 -199 141 -2 104 141 295 141 -173 -46 -124 159 316 -162 -60 113
5486 113 94 85 -278 156 -35 38 160 159 131 -20 -91 -64 170 190 -43 42 59 -59 -13 -66 -138 72 64 241 146 63
5512F3J46j38l6J33j16k8J60k91j35J19J75j60k8M1J30j96j5M3K44M9k56J96q6
5535A4Q9k58K41m38L34J62l18K1K26j49J20k75K31N9J6JL1j19K8k20J44J77j26
5558im3n8M4L41n91N7J52L25j80LN2j3P1k97J67j24P7K28j52r5k5J61j00j3p8
5583a00J36J10r8J43k80J6j36L64k04j35L16k62P3P5p6K14j57K22j99M8l17K51
5605Dp8j55K36K02k32j08K52P7j38k43q0M34k49j26K37j18P9j6j10k76L61O3m8
5628c2j46K19j00J52k00K12P3l67R3K36j08jl8l9o6N6O7J14j69o0L9L32k59J11
5652A19L5rJ19k97J38j51j57L18j56N4R4m9k2q0R5l7m17L74P7L3j20K64k09N2
5676F8k59M02l81K30lm1j85J05l8Rn4j8K11j21J21j40K72J17k50r3J83l6p3k81
$$ plain form
5512 63 209 71 35 168 52 24 184 -107 -242 -123 52 -108 -136 -95 35 -161 -176 -133 111 160 -96 100 14
5535 14 103 -155 86 -352 -18 144 -174 -153 73 -76 44 -231 0 59 75 76 107 -12 16 -204 -60 117 -9
5558 -9 -52 -110 -66 275 -316 -259 -107 218 38 41 93 80 151 -146 21 -103 -26 202 50 -45 -70 91 -9 -22 -100
5583 -100 36 146 48 191 -89 -73 -209 155 -49 -184 132 -130 -57 18 -58 156 -1 221 22 70 -247 4
5605 4 -74 -229 7 209 -23 -131 121 198 60 -183 -263 171 -78 -204 33 -85 -6 -22 -132 -408 -47 16 -32
5628 -32 -178 41 -59 93 -107 105 178 -189 -96 140 32 31 -7 -46 -112 -56 11 125 -44 -104 -65 267 8 119
5652 119 154 145 264 -33 105 -46 -203 115 -41 13 107 58 36 -44 51 14 -403 -29 48 81 -39 225 16 68
5676 68 -191 211 -170 60 57 16 -169 -64 -102 -93 -147 -165 46 -75 46 -94 178 295 45 -48 135 99 26 -255
5700b55K46Q3K3J04l57J1J48p6K41j68n0o1k10L51k2M0j88J59j45L4L34k06P0
5723A06l68R6K62j66mq5L98j22n5l34N47k09P2r6k2J15j58j06K54Q8j77o1rJ32
5747I8M2q8k4j25p0M25o38L85kQ9k2k06J86nm7k01l1L19o5k74L88k35k7k10K00
5772a38J81r1k8K58k34M8J29m2K41n05r3K48K07k19J23j17J14J1K9k16Q2Lj5O4
5796D0Q2K40l14j00K07k13q2M3J71j85K5P6J42P4j88J77k74N7o3Q3K76k68k07
5819b01K72q5pM4j09L79m19K57j64J91j76k1K27k00k47J59k8K26RM8j73J3j17
5842a22J59r8R6j77J35j6j19J70J0J31k93J54p3K00Pk14lo1L79j29j75R3k22J09
5866e9k7J29m22M56K8j73j02K07j1l1l5j89L03k38J04Q1O4k71J50Q3j33k28K80
$$ plain form
5700 -255 -9 74 97 201 -156 -145 3 -73 168 0 -50 -111 -321 30 8 48 -140 19 -126 -92 242 36 106
5723 106 -262 -166 96 -70 -74 -159 239 117 62 -272 275 66 138 42 20 135 -23 -129 125 213 36 -25 -34 98
5747 98 140 52 28 -97 -167 258 -380 5 3 92 70 -136 50 45 -2 -203 -234 85 20 -254 134 -101 -128 -338 -138
5772 -138 43 -48 -76 182 -52 -4 125 83 324 -181 -274 -26 181 -38 85 -32 82 93 122 -94 -12 -9 -24 40
5796 40 122 362 48 -52 155 -58 -140 -97 74 -111 -86 -10 132 206 18 195 -79 -22 -85 -2 274 6 -201
5819 -201 71 -14 -21 23 -86 293 -126 131 -33 158 -18 -39 188 -12 -259 -100 -128 98 107 155 -18 -5 -122
5842 -122 37 -61 35 -142 -7 -23 -142 28 38 169 -124 30 -43 157 164 -50 -53 -114 265 136 -39 54 -168 -59
5866 -59 -86 43 -379 77 105 -68 -170 37 26 -5 -40 -229 74 -164 -60 21 85 -186 -36 47 -86 -314 -34
5889c4Q2m1JM34m34M5J13j52J03l8p9Nr0Q7M8o9j1j96K47o0l1k99L01k01L44K70
5915C45l30j35Q2L5M6j57J00J39m8R0k18j68J66K78m6j59j63M7J69j14l01M25
5937H3j15J15J4J42k80J00l0q1O7K14n33K63J18m5J01k75L53j63m7N4q7j83K85
5960G0m34K57m8K39j30k8Q3or8K4j8J94k71N4L92n57J66q9K9L79j54Kj88n8K00
5985A0J6k97K05K00j25k07K47l4QJ65j79n1P5q4K8K32j35r5P6j14k2j33L3K42
6009F1j45K78j51j68M9r0J36J24q2k09K27O3J69j34k74P2j31N91k71j56j32J46
6031b7M2qP0k9j31J00p0k16M77k18K31r2L2k10Q2j12K27j52p7K65j5o4k30K04
6055G9Oj53N8K04k63K32q6n5k14O0L16q4r8m9P0j29n5K99R0k13m0P7j54ooJ6J85
$$ plain form
5889 -34 48 7 8 442 8 53 166 14 117 79 0 5 -85 2 50 -19 -30 -226 21 -39 -70 -369 -68 -269 75 345
5915 345 15 -120 -38 -3 43 -114 -14 125 77 167 -51 -219 -53 225 179 20 -143 -96 73 -41 -342 83
5937 83 -32 83 97 239 -41 59 29 -52 15 229 -304 -41 77 32 133 -142 211 48 1 55 -32 -215 70
5960 70 -364 -107 -155 84 -46 -74 9 3 -95 -71 -89 105 -166 -112 280 -277 -111 -200 -171 208 54 56 -132 -190 10
5985 10 26 -271 -66 134 9 -198 49 15 23 188 9 -42 33 -51 -23 209 74 -21 55 -59 -81 -214 -181 61
6009 61 -84 194 43 -125 -76 -166 -30 94 12 -197 30 93 262 128 -146 -74 -205 386 115 -41 -173 -27
6031 -27 15 7 77 48 -83 17 -53 -269 208 -10 221 129 161 -49 33 -79 148 -4 -81 184 169 105 -125 79
6055 79 85 -68 -10 194 -69 163 77 22 -192 -132 184 100 2 -47 23 -106 -161 138 228 15 -25 52 -102 -108 -114 -98 87
6082H7k51K85p4j1J85j49M1j51L13k60m8L3L1m2l6p3K05K7k33K34k04J15j77J62
6106Ij70Q2J46j63j3K11j13j91J08j62L0p7O38l27o6n0J98K4n4N9j15K50k7l54
6130a27J49k27K11J56Qk44N5j78J43J39ok08P4r4M3J9J98k29K28j06k01J23K14
6153A40j10j29K71l78K11J57j30R3j73J05j8RJ08k10J94j03MQj65K70o6j82J76
6176H2K4n8J46l03K34n4j90R1r1K77Qq6j12L7j35K00J89m23LK25q9j04M13l35
6200e1L2M9k5k6L7J3J26j94N8J32k25p0J64R4j27m09K39Q1k13J62K16j13L59m25
6224a16J85k02K77j6j63J17r3J2K1M5o2L63l81jk47J83K82J6j23m4m2J04k05P9
6248a1r8R5K61l76L4L6K10j10k69L63k50k0K51P5j62N9l86M33k02J0J44j32K39
$$ plain form
6082 87 -164 121 47 36 221 72 113 -38 275 15 -33 0 31 -11 -47 -120 85 112 -121 113 -91 24 -153 9
6106 9 -161 -79 67 -96 -109 102 -11 -202 -94 -256 -226 -303 335 8 -58 -108 90 114 60 119 4 254 227 -127
6130 -127 22 -205 6 162 170 -74 -19 -197 -54 85 79 -129 -55 -149 -106 -87 111 -118 110 4 -197 -74 140
6153 140 30 -99 172 -206 5 162 32 125 -48 57 39 48 156 -54 140 37 41 49 -116 154 88 -94 82
6176 82 106 48 194 -109 125 71 -119 -28 -119 158 166 80 -32 5 -130 70 259 -164 -161 64 -25 -129 284 -51
6200 -51 -19 30 5 -21 16 29 155 -39 19 151 -74 -144 20 114 -13 -422 -183 -102 -315 -153 63 -50 309 -116
6224 -116 69 -133 144 128 -35 82 -11 1 22 67 5 368 -13 -14 -261 -78 204 220 97 53 11 115 -90 -11
6248 -11 -109 -14 247 -129 -95 -59 151 41 -228 135 -115 -135 116 191 29 88 -298 135 -67 -57 87 -45 194
6271A94r8r3J2j13O7l3o8lj4K52j29o5J26j82K59ol89L34j30k9R3P9j92n9J65
6296b2j56L25r4l0M4N2j66j80qL28l14Q5J44Jl5R1O9j62j74L12k78J17Q8J66j82
6321B1L9k46K2J72q7J07k40L19l6J18k26q4Q5o0LJ89j23r9N2K34l35L01j35j56
6345a65K90k38O1j63O6J91k78J64ro4J31O6j0K35j23j57n9P4q4Jj61L97j40J4
6369C9Oj67J36p8k61L93k12R4J14j45J31j62m6J45m18N12P3k20L7j6Q6K14k8j83
6393D4M0j70J77K0l32J99l1j34J71o2J35N9j84J75k15JJ30J27k14m7K79j04N9
6416A23n4J27j70R7L5j32n3q6J66j14O9nR2J08ol94Q4L11k18k42K52J05k5j46
6440g6R7J66j46j30J41m9l03J58K28p7k4R4J08l95K23J61q6kj04p7K36k99J76
$$ plain form
6271 194 96 3 15 -98 -31 -64 -132 -135 -149 103 -26 -91 35 -147 112 106 -283 51 -79 -108 -15 64 -128 -187 -22
6296 -22 -178 147 53 23 67 119 -47 -227 -235 93 -221 -136 8 9 -26 65 134 -28 -202 110 -168 -51 37 203 21
6321 21 60 -186 -164 8 -79 28 -212 107 71 189 -37 -121 -36 -96 -93 96 -27 -126 -74 160 -175 126 -9 -165
6345 -165 125 -113 -52 -215 -149 42 -236 -72 -81 -145 -14 52 42 277 154 -3 -62 12 -72 -71 -232 165 25 39
6369 39 45 -122 14 -64 -325 68 -144 -50 64 -81 50 -112 -158 -13 -431 81 154 -66 -29 -45 41 255 227 44
6393 44 84 -86 91 111 -221 -22 -53 -187 -16 -78 57 116 -68 107 -108 -107 23 150 -64 -111 168 64 123
6416 123 69 196 26 123 158 26 -27 -113 53 -61 8 3 95 203 197 -197 -113 198 -20 -262 -10 95 70 -76
6440 -76 21 187 41 -89 52 3 -300 -142 86 9 -15 79 187 -208 15 176 90 88 -16 -93 143 -156 20
6463B0j18L07j38r0M7J75l65J61j71j39L47lq2k25J87j14K94J99l02J07R8j97
6485bL1r1l2L8P6L7N6j80Q6j10O9J79j81K7J05l99P3J16K65j56j72K67o9p8Jj45
6511a89J08J14Ok2L2J36l05j8%J26L9k01N1J07j38K95o4l0l37L26o5Q2O6j04L4
6536D9q2K09r8j45M3O5K89l23j49J64j53J37J48k72J14j85L22o4Kj68J08m0k53
6559b82L91j74j90L30J02k19J42j56J73m8oj55q4Q5K5j35M67m8O9k73K1k52L48
6582A31j67L1L0l1M6N7J1Lq7k4R0k6j78O1M9k3r5K53j02j48P7K23M0j33p6O5J03
6609A80l23JL80l95L20k32OK8Q0k3j55J1j15J24R4j2M9P5M9l3n0j23n0P1k8JJ55
6636H5j19J79k81K15l69L79k70p1M55l19K01k19K48lj14P5K41k69L00n77J10L6
$$ plain form
6463 20 -98 209 71 -19 28 203 -162 -1 -172 -311 36 33 -49 -274 -87 -201 93 292 -10 97 195 -2
6485 -2 29 -62 -94 -56 20 57 113 -67 19 -91 -22 157 -24 3 108 -291 -218 -102 163 7 -165 102 33 -45 -44 -189
6511 -189 -81 33 39 17 49 185 -120 -138 -138 -12 27 -174 -123 -16 -154 141 77 47 -290 36 -29 53 119 15 49
6536 49 -33 176 78 -67 -24 41 330 7 -142 22 -131 6 154 -118 -4 -189 133 69 71 -97 11 -29 -282
6559 -282 109 -65 -255 75 177 -42 100 -56 117 69 63 -92 -176 -91 -66 -201 266 218 287 14 35 -217 131
6582 131 -36 -5 25 -6 40 97 108 111 24 0 90 64 -114 -53 -4 -27 -122 131 29 -119 -42 181 221 88 12 77 180
6609 180 -143 -142 238 -157 163 -69 -63 -35 45 22 -133 -122 -237 -113 -19 -31 18 93 142 109 59 -64 -114 -43 -71 -70 85
6636 85 -34 145 -136 79 -290 89 -181 -252 203 -116 85 -134 114 111 -3 72 313 44 344 -233 -123 -87
6658h7pQ4O2N6m53L17M4O7K28n07P7N66l55j58l1Q8J16R5l93J43M11m23K17ml55
6683b02J45Q1k48L70K18l67pm4P2k53K19r0qo1L09j10j09L11k87K60k88J3K4K06
6707A54j50r6j92N54k82N4j9L2mj10Q8P5J61j60k96L02J00n35K33K41k75N3O6
6730fpO7m52L74j48r4K82J29k77J38o5J75k76N07l14LJ60j83k9J87l93O4L29j62
6754Ir6Q6R1j02k5r3J71l12J32L3O0J8j04J76k2J57k87J72k09K04j27M8j37r8
6778b55K60J24k76J16o5N1n9Q1j15K89J43l08j2J8j26K41j73K17O3l30p5k2K03
6801a0J03k87L06k32j85M00k34j04L71o0k64J95j21K42r5J85k77M1J5L8J24j6
6823A35m1k44J87j0J30l54j23L42K27j84k99J30K87j49l5L2k70K08O6J46q9k41
$$ plain form
6658 -87 -94 -10 52 108 -345 -28 16 83 311 -196 -119 447 92 -66 -97 -9 107 202 -191 -48 363 -60 157 153 -202
6683 -202 -57 24 -224 146 364 -3 -10 -54 18 -235 -16 -106 -114 -175 134 24 -85 226 -61 199 -89 -76 -52 154
6707 154 4 -92 -284 270 -12 42 23 55 51 -59 29 104 265 105 -191 111 211 -324 -91 150 -125 -72 -6
6730 -6 -13 54 -398 -24 -172 -266 16 145 -132 6 -59 116 -160 347 33 36 196 13 -16 171 -222 -158 171 9
6754 9 -87 -1 90 -12 -37 -130 41 -271 -139 -106 -46 -28 -132 44 22 179 -108 64 -145 59 -68 -20 -157 -255
6778 -255 5 129 -147 -31 -96 -45 -104 -23 -138 151 294 -14 -26 -8 -134 107 -66 151 214 -116 -191 -213 -10
6801 -10 93 -194 112 -120 -305 95 -139 -243 128 68 -196 -1 -122 120 25 210 -67 -26 -11 27 151 135
6823 135 94 -150 37 27 157 -197 -320 22 249 65 -234 -104 183 34 -1 31 -239 -31 35 181 92 -149
6845a49J65Ql67K74oj5L33k70Rk54J99L4n8p7K66k84J8K95k08K8O6K9Q2k05j0
6870i7K37j58J23O9j70j72L1K07o3N6j79J0P3O5k8J21j77p7J93p4j15l3J58jJ65
6895A64j3o0q4L6J33j08j77J72n4J67p0j81M5k62J82J39j11OPl1kj05R7K48j92
6920e4P2m3K51k63k5M23o2k09q5j17J37O0J39j85j65Q1K23l33L5K4J91m0k81K99
6944G3j45j40J72n7o3L43j08M8j70O4kj10k7j00M18l23OJ13J1o7K37j18r8J23
6968H0J52j49l7Jk42J33P0l4J19q1R9l66K21N0mo2N8J30K2j34n5j44J8J13p7L23
6994B04l94J08k01L85R7P1J9k56j11O3Q0j35P0k2n6j50K39m5J12k1l6J36m38K53
7018b8R1l50M63m1n0j65K60j42o5k8J54j06k26K37k00j4K80o1J63k38l3J64j55
$$ plain form
6845 -149 16 24 -343 -69 -75 -90 243 -27 -18 -272 -73 -39 -97 -174 92 -192 -174 121 -87 -59 7 36 118 -87 -97
6870 -97 140 -18 105 174 4 -168 -137 70 7 63 -116 -106 -33 32 4 125 -52 -129 64 -10 -125 -158 0 -1 164
6895 164 151 91 7 43 176 68 -109 63 9 176 106 -75 -30 -292 -110 29 -82 -76 -69 -100 -102 -207 -110 138 -54
6920 -54 18 -25 226 -37 -62 361 299 90 5 -112 25 85 224 39 -126 -45 178 -155 -120 -96 95 55 -226 73
6944 73 -72 -212 -40 -97 -160 183 75 123 -47 17 15 -95 -122 -222 196 -127 -121 -8 3 -64 173 55 -43 80
6968 80 232 83 46 47 -195 -62 8 -26 93 12 111 -255 -34 16 12 -50 8 138 160 26 -29 -173 -155 -42 -119 204
6994 204 -190 -82 -283 102 199 270 289 33 -78 -15 65 -70 0 -22 -78 -228 11 -34 78 57 21 157 -281 -28
7018 -28 63 -287 176 135 85 -80 180 38 -27 -55 99 -7 -233 4 -196 -210 70 9 172 -66 -99 65 -90
7041i0R4k58K7K17N8l5j71J59j4K63l32J38J05k31J57R6L5j19J21k76K87k97J37
7064G1J43k03k41K97l1N5o3k43M92m09J85K4l8m1J9o7J45k4j64L89k87PQk2J7
7089A9k56J6L07n6M6O5k36QK87q8j90J44L5lO9p7o5J01j18j34K55m39N08n2k43
7114i7K58k08j70K45j00j02L09j24Q0l3j3j73R6K9K01p1J77n0m31K7J22K19k58
7137f7l4%K01p0j46J13j19N6j3j60K21J3J24K5r0ok36O2K46k75M03j77k7j37J30
7162C7o4m0m7k4P3L9M8k92J45KK21j09P6P6j69j23M10j76jk39K29J64l09J95J1
7187A33j94j08J40P0O1R5l38K1J24n1L7j28K36m3j97J5K95k36J75l60K3K51j47
7210a26L57m74l9R5j5L91l09P2L3j10N7K14l27mK16j85J84J8K40k48k67j2K82
$$ plain form
7041 -90 4 -254 -227 -10 48 13 -158 1 -13 250 -82 56 161 -70 87 183 218 99 220 -56 231 -66 71
7064 71 214 11 -230 67 36 91 28 -215 277 -132 53 77 39 -2 17 -50 95 71 -93 296 9 16 24 2 19
7089 19 -237 -221 86 30 76 141 -95 -87 200 112 -78 66 101 98 167 90 25 126 8 -126 129 -310 198 146 -97
7114 -97 161 -47 -217 28 -72 -174 135 11 91 58 45 -128 -32 -3 198 127 304 254 -177 -150 -28 191 -67
7137 -67 -101 -101 100 30 -116 -3 -122 -66 -79 -239 -18 -5 119 144 54 48 -188 -126 120 -155 248 71 44 -93 37
7162 37 -27 -67 -114 -138 -65 -26 22 -270 -125 -123 98 -11 65 141 -28 -151 259 83 82 -157 72 236 -73 122 133
7187 133 -61 -169 -29 41 102 197 -141 -120 4 -47 -10 -138 98 55 -142 -127 168 -68 107 -253 -230 21 -126
7210 -126 231 -243 -282 -187 -202 189 -120 -48 -15 -125 -68 146 -181 -185 31 -154 30 48 288 40 -227 -239 43
7233D3Q6k46L85j65o2m0k10j30K15K25p4j45r8K80p2O4j66J32o7K5k8JK04k23
7257f6J30o1L20k86j44o1K90q1l8J09j80j09L57m63L42k15J24j16L19K1j62k07
7279a77R2RJ6N8j66kJ44p5o3L11j44M5j33k83K81O3j61K09j79J04n2K32p5n04
7303d50N12J53j84m6j16J06J8M2p7L27p8k77K41j0j95RK35rm2n07L27J58k05l5
7327a03J6oL36n74M01R6k28j71J65J27k73K01m7l18N38Ok19M8J62o1j33J1O2K48
7351B84j93j98J17mj09J56o8K33l12L79k73l4k92M11l06J19J36j23L2P9k4M6l78
7374c22J75jM75m22j02J36j4k5J01P1j69J50m8M2r4k49M45k00m1K28m4n6OJ73
7398B15l40L83l43L7J9N5J8n6j17j19M28n31M52j26j28J40lj91K24J02l08J91
$$ plain form
7233 43 129 -117 268 103 41 1 -209 -339 -124 101 27 -118 -216 64 -8 56 -110 22 -45 -20 -48 -47 157 -66
7257 -66 64 3 323 37 -107 -168 122 41 3 112 -68 -177 180 -283 59 -156 -32 -148 171 192 30 -177
7279 -177 -85 -76 -60 -2 -168 -170 -26 -101 -164 147 3 48 -85 -368 -87 -24 -185 24 -155 -51 -103 129 54 -450
7303 -450 62 215 31 -15 -131 -25 -7 35 -42 285 207 -70 171 161 -34 -25 210 201 159 -348 -21 137 -68 -103
7327 -103 -87 -93 243 -331 70 166 -62 -233 -68 59 -214 -13 -60 -378 160 166 -53 -5 157 96 -37 -26 36 284
7351 284 91 -107 10 6 -103 53 -15 218 -94 285 12 -22 -314 97 -209 -90 46 -77 -45 34 10 56 -322
7374 -322 -147 -148 327 -95 -197 -61 -75 -100 1 72 -97 53 5 47 -47 -296 149 -51 -92 136 92 36 42 215
7398 215 -125 258 -85 -48 -29 26 44 -12 -129 -248 180 -351 101 -25 -153 -13 -16 -207 17 119 -189 2
7420BL05m62K05Q2p3j15L1J03j9p3n1P4J6O0j94J95j43n4J0K00L6j65P2k9J00
7445A13j58J03K51k09nk67J84k06J82p6j42J87R4j95K1K93j75j9J06ok98K43k1
7468@j4L3R1n9j32%K4J80j42L7j61L19n0k16J61J1l87L39r0J88k68J25M0k90O8
7493a93K76n32N25l71L64J26m71M20o5k3p0K95m81J28l5O5Q2j85P9l9K33j83M2
7516a3N1m7l79J14L00J2J34k82K98j61K10l31J38m3n7k72K03L30m62M23j33M4
7538G7K8L9p3K09j64q9j11J0M7l65N41l0k30Q7On0L2O4O4J51j84Qj84K94m8m86
7564c57M66L1O9j49k38K50Nj15J36R1j35k76J12j7k0P8J95l2P4j57lk38K91q1
7588b0O7o1n4R6J46k98J91m7o3J59m1j75m2K35J68j46j64M94k25k2l39J6J87j72
$$ plain form
7420 2 307 -155 50 132 59 -56 -25 78 59 -14 -65 9 25 85 -109 86 -57 -111 -101 99 135 -30 42 13 113
7445 113 -45 58 309 100 95 -172 12 -194 -12 -88 -230 -43 51 -144 -123 170 -5 -24 82 76 -222 21 0
7468 0 -14 19 110 51 -81 -81 -57 123 -19 18 -143 176 126 -90 71 82 -305 34 -56 132 -136 -11 29 -261 -193
7493 -193 83 -449 76 -295 69 195 -276 144 79 56 -14 281 -200 -72 -107 -42 40 -145 -66 -105 128 -55 -13
7516 -13 38 -9 -388 -274 26 38 172 -110 188 27 237 -94 44 1 -56 -328 -125 205 -257 166 33 77
7538 77 105 144 71 280 116 27 -84 -74 -27 -392 149 119 -111 -24 -18 -68 -36 28 92 243 59 67 -117 177 129 -357
7564 -357 109 140 209 60 -178 72 77 -38 98 189 54 -222 -110 -127 -147 -69 126 94 168 11 8 -230 61 -20
7588 -20 47 -14 -68 28 174 -124 67 20 -43 116 75 -100 -142 93 261 115 -49 445 220 198 -141 -125 62 -110
7612a10Q1P5N0J25m09K16N7O7j06J91j75K10l40L8P6r1K8N0K46k49k12K21j8K36
7636B57j1j98J03j23J25k66K72l96L01K37l30J70l33J63l9O1K02o6n7k9Q2k37
7658a12j48J78k0L30j05l16k0L88k53p1K33j08J26j3j6qL8K7L9j34O0k26N1l7
7682a17J83J4j13J62j72J2K7p3Q6J6k22K80o0K8N0n6M0j8J0j40K19j18n4J61p6
7707F9q9j80J18mK06j26j41K38P3k38J08j18O5k40K57O6j80K8J67J32j47k66P8
7730a24J85k60J0K82O6j15j21K70l50K21k79J98J80k78K32j49p7m3R5K71l74J10
7752e0L10n08L76K04m49J64Rj52J24j95K42N3j24J06j76J11J47k97K49j26n1p8
7774a11O6n6j03K64n5J72p2L52n48J84l1j91j79K62K01Pm0n8j70j24K05Q9m9m3
$$ plain form
7612 -110 -29 46 96 221 -188 28 85 152 46 237 62 272 -68 -30 46 -45 -17 33 279 30 -182 39 21 257
7636 257 246 48 151 28 153 -113 159 -237 64 301 -29 141 -192 -29 -68 -7 195 129 72 43 125 -112
7658 -112 -260 -82 -102 228 123 -193 -213 175 -78 -149 84 -24 102 89 73 65 103 130 169 35 95 -131 -80 -117
7682 -117 66 80 -33 129 -43 -31 -4 -77 9 25 -197 83 23 51 101 45 85 67 77 -63 156 38 -16 145 69
7707 69 -20 -200 -82 -86 120 -6 -147 91 164 -74 34 -84 -19 -259 -2 64 -116 -88 79 211 64 -202 -124
7730 -124 61 -199 -189 93 159 44 -77 193 -157 64 -215 -17 163 -115 117 -32 -109 -152 -57 214 -160 -50
7752 -50 260 -248 128 332 -117 47 56 -96 28 -167 75 128 4 110 -66 45 192 -105 144 18 -33 -111
7774 -111 -45 -101 -204 60 5 177 105 457 -91 93 62 -129 -308 -46 155 162 122 64 -106 -230 -25 64 15 -28
7798b8k1K37j85P9k53%K03M0J82k17n2K54j69P5j14l5n4J34P3j34Q6M0K9j96J15
7823H9q9m8J59n3N2o7m1K22n5o4J41l59K58j04m1%J73k81K24mJ2k37J73K2r2k09
7849b19L92k05N3K06j92j77J7R4N5j47P8m4o9p5K29P8l00K68PJ5J29o8j37O2p5
7874b5nL8J3j16O2r7J24Q8j45J23k47K38k01m6J09j64P4J29j05K95J25j79Jm5
7898D4p1K9l7J14qN1j15k4j82O03n28O7L67l38q0J35j20L1j10J06o5%p7j67J10
7923b65lM11l48J27L04rj44j13m7O4K99m11L09Jk93O4RJ11J6K5n0M8l22O9k66
7948d14M01J94k87J88j49J21j07O2k19K20j02K27k91K44k3l4j88J76J9m4kL3J20
7971A45l0k35m1Q9J55k7n9k65J98J38j8j70L36j92j08N4j14K23j75N9j93K81J42
$$ plain form
7798 -28 -49 188 3 82 -171 -171 32 72 254 37 -15 239 70 145 31 -4 -58 76 149 15 101 141 170 -26 89
7823 89 0 -48 111 58 110 43 2 224 169 105 246 -113 145 41 0 0 173 -108 116 112 124 -113 60 82 -10 -219
7849 -219 173 -32 21 227 35 -142 -125 -31 24 -123 -45 -89 -158 -233 -4 74 -226 42 49 64 193 125 -12 50 -25
7874 -25 -30 8 21 -95 -33 -130 -6 82 -63 60 -187 51 -150 -196 -87 -251 -177 -48 -153 142 267 88 89 44
7898 44 -27 2 -35 79 71 122 7 -17 -199 404 -124 -57 310 -28 -108 27 -93 -62 -172 -66 -131 -131 -208 -375 -265
7923 -265 -268 143 -205 -78 226 217 73 -40 -87 -23 276 -135 174 175 -118 -54 -45 66 82 107 57 105 -217 -148 -414
7948 -414 -13 181 -106 82 -67 54 -53 9 -210 10 -92 135 -156 88 65 31 -157 19 38 -6 -8 25 145
7971 145 115 -120 -161 -72 83 56 -3 -268 -70 68 50 -120 216 24 -84 -30 -144 79 -96 -37 -230 51 193
7994A93m69K38o6N09l14oR3l23L12k13J94k48L28k47p8J30Q0n3l86J97K63k8j46
8017d0J10n6j28J92j68J91n6J36j57J57q4L0l91L86j14J65j51n3J87q4p4j21K13
8040I0m9J04j15J36k14K0l2O3K66k74K33j59j47l3J63nJ28j06j45K08q1r0J75
8063A36k23J88p9k42L6Q8P3j9K09l11J8l1K24n6l34L30J61j20Krj66j6J48p2L14
8088B49j99Ko8P9L3O7j62J03k93N8J65o3j24K23k66K39j14K02k67N9J01j01R8
8111B1M1ll00M24k20J16j36J50J8j22l3L75l40R0K52m29o3L29r5m4J80k02J59
8134A68k39j88L34J83l91M61n00J14K9N4mj16M2j20L93k71j12L47l07L7K97j57
8156E4J6k3M8J44k59J17K92l57N2q8L01l66L31j44j57J31k87O3M06l42K4J34k86
$$ plain form
7994 193 -276 -38 -104 405 91 85 178 -145 167 -46 148 -100 228 -19 -97 33 113 60 -326 -129 134 106 -40
8017 -40 70 14 -114 78 -90 101 45 181 24 181 97 127 -264 122 8 173 22 -31 156 72 -2 -123 90
8040 90 41 145 30 166 -48 -28 -60 3 269 -5 228 69 -78 -111 52 47 175 69 -76 132 51 -39 136
8063 136 -87 101 22 -220 -184 -96 -23 -42 167 -144 -126 -157 67 11 -323 7 168 48 50 41 -125 -141 7 -65 249
8088 249 50 52 -16 63 96 163 1 104 -189 -131 34 -29 -153 70 -196 43 -71 131 -136 -77 24 -77 21
8111 21 62 59 -241 183 -37 79 -57 93 111 -11 -44 331 -9 81 333 -96 -159 170 75 31 211 9 168
8134 168 -71 -259 75 258 -133 328 -172 -58 -29 25 21 -95 -53 -173 220 -51 -163 184 -123 -86 211 54
8156 54 70 47 95 239 -20 97 389 32 84 -4 297 -69 262 118 -39 92 -195 -132 274 -68 -44 90 -196
8179a96J66k6Q1J9l2m6J16O4j89J89p6k13
$$ plain form
8179 -196 -30 -56 25 44 12 -34 82 146 -43 146 70 -143
8191a43
$$ Imaginary data points
##PAGE= N=2
##DATA TABLE= (X++(I..I)), XYDATA
0@%%%%%%%%%%Qj6J6j6K4l2L2m0N6o4P2q8J05j29J53j77K08k41K80l21L66m21M80
33B55n44O14o91P77q72R76j089J213j350J501j662J837k031K243k475K728l004
50a574L310l648M020m434M895n413O002o674P450q361R443j0756J2391j4490J7298
65I459k1268K7351l7965O1779k15158K0886K37147k17324N0944N0976j73013p771
77b13957K55137n1765j32280R5952P0278q3377M4295M0729p3352R782J24541r074
89G6909q0652J7881N2940l8610j3805N3385q734m8253N9213J4391j20623p149
101d3107J13922l0652n4681N8594n0664r7770J01680N3773j34161J096J00072
112A8102o1329l4985O5481o5087n4888J15656J7633j00474K5625L7471n2273L8479
$$ plain form
0 0 0 0 0 0 0 0 0 0 0 0 8 -8 8 -8 16 -16 16 -24 32 -32 40 -48 57 -72 81 -96 112 -129 151 -170 196 -225 255
33 255 -289 325 -366 411 -461 515 -574 639 -711 790 -872 965 -1066 1177 -1298 1430 -1574
50 -1574 1736 -1912 2108 -2326 2569 -2844 3158 -3516 3934 -4427 5016 -5740 6651 -7839 9459
65 9459 -11809 15542 -22423 39356 -175802 -154916 82231 -135093 -84149 -33173 -206186 -213957
77 -213957 41180 -10585 -142865 -46913 23365 -60012 -15717 25012 -48340 -38558 85983 76909
89 76909 -3743 14138 67078 28468 14663 68048 59314 11061 70274 84665 -35958 -43107
101 -43107 70815 40163 -14518 44076 -6588 -104358 -2678 51095 -83066 -81970 18102
112 18102 -43227 -78212 -12731 -77818 -132706 -17050 583 -99891 -74266 -36795 -89068 -50589
124e0589N8854q0914l7097R5760K3829n7917O447K9082j5711Q174M1347j0259
136A1006m5760K3427O0644j7574m0468L1442J4844k9938K9583K2167n8681N238
148E930O7027l5177m8433M4042L197l5884L5777n156p1839K7677N9688m2340k9346
161b4837K3122k8406r545N3827j3900o1102J8566L9368j2188q986J098j5706L547
174c5142K7518N709j7289n607J8556J5201j2033j0030J1301O562R738J5407k2510
187G381k5161L5264K6766k5902p832N438j7253J7374L4981l0334l3984K7162J2939
200B6839j6490N763n379k2506J8991K2202k4748j7269J2804M279N05M75j6671
213a1205o485K0355J0483j3622j4035k306J1461J3333m109j5570n914R571J8723
$$ plain form
124 -50589 8265 -72649 -109746 -13986 9843 -48074 -41627 -12545 -28256 -20082 21265 11006
136 11006 -34754 -11327 49317 31743 -8725 22717 37561 7623 37206 59373 692 5930
148 5930 72957 37780 -10653 33389 36586 702 36479 31323 -40516 -12839 46849 4509 -24837
161 -24837 -1715 -30121 -39666 14161 261 -60841 -42275 -2907 -15095 -24081 -22983 -38689 -35142
174 -35142 -7624 -1915 -19204 -24811 -6255 8946 -3087 -13117 -1816 4746 14484 29891 7381
187 7381 -17780 17484 44250 18348 10516 15954 -1299 16075 51056 20722 -13262 13900 26839
200 26839 10349 16112 10733 -11773 7218 29420 4672 -12597 207 4486 4991 5466 -11205
213 -11205 -17690 2665 13148 -474 -14509 -16815 -5354 7979 3870 -11700 -17614 -8043 10680
226A0680K786k1711q364J6279P772j478J218j1408k695K5737M989k6711l234J7148
240A1008J184L661K474k0316l364K7078L361k3602o941O273N467J0012l755k3113
254a0573m634J9319Q737j1434j4417l985J0171J2995j887j4527q427R769J5622
267F729k179j6528l819J2841J1886K868j1623j4805Q221K1591R66j5086o770K621
281c087J1959J1952j1174k1021L949J8372K703q346j0427o651J0706J6735q105
294G565k0617r16J2767P246j812j0796q705R569J6754j632j6969q482R975J4524
308H471L182r583r689K065J2025N814j0828j2058N938J3860K496q273j0504k971
322a0055J0507J0257p778j3157J535R573M312l553j0009m679J1259J0899o039
$$ plain form
226 10680 13466 -8245 -16609 -330 7442 5964 7182 -4226 -6921 18816 23805 -2906 -6140 11008
240 11008 12192 15853 18327 -1989 -5353 21725 25086 1484 -5457 816 6283 16295 12540 -10573
254 -10573 -15207 4112 12849 1415 -13002 -16987 -6816 6179 4292 -10235 -18662 -8893 6729
267 6729 4550 -11978 -15797 -2956 8930 11798 175 -14630 -6409 15182 16148 1062 -5708 -3087
281 -3087 8872 20824 9650 -11371 -7422 10950 13653 5307 -5120 -11771 -1065 15670 7565
294 7565 -13052 -13968 -1201 6045 4233 -6563 -15268 -5699 11055 9423 -7546 -16028 -6053 8471
308 8471 11653 2070 -7619 -5554 6471 12285 1457 -10601 -4663 9197 11693 3420 -7084 -10055
322 -10055 452 10709 2931 -10226 -8691 882 5194 1641 -8368 -13047 -1788 9111 3072
335C072j1547k117O707R589J611r687o380P678Q896k657q284l687O581J0548J492
350A1815j0210q772L127J0676L618p396n140M231O541R18o141q695J708J3241
364I521N579r516q551J806N644M383k430j0033j363J1484M607r716r161j162O744
379b164Q041k271j2686n554P735P687l362q100l846O331Q885j025j0621n656P753
394h853J3047K819p874o056L548R526M809n420o857O344J2091K387q492p304p66
409B949R747R881o304j3095L05Q090J373m602q063n747O385Q561o461j3551k688
424a3220N685M556j600q794p127N629Q902k167r960m735O430R400J780q405p408
439b1034L249J2116N649o205o037L734O824L187j816n773J156J1780N179q485
$$ plain form
335 3072 -8475 -10592 -3885 5704 7315 -2372 -8752 -1074 7822 5165 -3119 -6806 -225 10323 11815
350 11815 1605 -7167 -4040 6636 10254 2858 -2282 1949 8490 9408 3267 -5428 -3720 9521
364 9521 15100 5584 -2967 -1161 4483 8866 6436 -3597 -4960 6524 11131 1415 -7746 -8908 -2164
379 -2164 5877 3606 -9080 -14634 -6899 788 -2574 -10674 -14520 -8189 696 -329 -10950 -16606 -8853
394 -8853 4194 7013 -861 -6917 -3369 6157 10966 5546 -1311 5033 17124 19511 11019 3715 2949
409 2949 12696 22577 16273 3178 3483 11573 12946 8344 281 -5466 919 9480 3019 -10532 -13220
424 -13220 -7535 -2979 -4579 -13373 -20500 -14871 -5969 -8136 -18096 -22831 -16401 -7001 -5221 -13626 -21034
439 -21034 -17785 -5669 -20 -6225 -12262 -8528 -1704 1483 -333 -6106 -4950 6830 12009 3524
453C524o120M059O730N335k626j0766j427J2762N509p137q236m166L914R389m05
468A0339j3015n775N601M434k503p447p394J099O300j519r868n655M371O459j829
483a6402r911n524M338R193M613o832r985L678J3561N993m483n503L98J0469J1391
498D994k857p733K161Q649O207J475n429n640P691J0493m335q677j158L146M027
513A3014o23j0620p802O098O732l713r005q520r64P447K001r540p920K429N473
528a5513K605n166r050j61Q962O458l136o130n89P839N043k225k192J745M977
543f533O493K86p558L42R774O271j983m431l621N433R937o21q664j197M499L864
559A2291K809m780r569K302R007p85n722k274j677P63K566n803o554L891N699
$$ plain form
453 3524 -2596 1463 8193 13528 10902 136 -1291 11471 16980 9843 1607 -2559 1355 10744 10339
468 10339 -2676 -8451 -2850 1584 -919 -8366 -15760 -14661 -8361 -9880 -19748 -25403 -21032 -14573 -16402
483 -16402 -26313 -31837 -27499 -18306 -13693 -20525 -30510 -26832 -13271 -7278 -11761 -17264 -16866 -6397 4994
498 4994 2137 -5596 -3435 5214 11421 12896 7467 1827 9518 20011 15676 6999 5841 8987 13014
513 13014 12391 1771 -6031 67 6799 3086 -5919 -14439 -15403 -7956 -5955 -15495 -23415 -20986 -15513
528 -15513 -12908 -18074 -27124 -27285 -18323 -11865 -15001 -21131 -21720 -13881 -8838 -11063 -13255 -11510 -6533
543 -6533 -40 246 -7312 -6970 2804 9075 7092 2661 -960 4473 14410 13789 5125 3928 8427 12291
559 12291 15100 10320 751 3053 12060 11275 5553 3279 1602 2365 4931 -872 -7426 -3535 2164
574B164k336o850o190m44P533L817o773p616R65O550N157k798p456j813O928Q137
590a025O77o284k766P209O194n29j156l07J523P086K827p503k615R178N157k843
606A4823l308n176M89J0167K315j0383n267K884L217K885l178j0746k242Q726
620E206K855n561n003k585J709M597q35o753j558N365L157k867n001n49M790M427
636A394p77n018l187N584P988p66p174j878L539O043M480m352o965L200Q000M73
652A0584k098k338k176M318O041m315o014L512M247j763j877l270k439M528M193
667A1133n803p401N06M332K684k382p807l908M848N386j717n406l263K025M933
682a840K51l849k818K763O333R81m798j511L860M164J645k030l799J870Q356J619
$$ plain form
574 2164 -172 -7022 -13212 -13656 -6123 -2306 -9079 -16695 -15730 -9180 -4023 -6821 -14277 -16090 -9162 -1025
590 -1025 -348 -6632 -9398 -2189 4005 3476 2320 2013 3536 10622 13449 5946 3331 12509 17666 14823
606 14823 11515 6339 6828 16995 19310 8927 3660 6544 9761 12646 9468 -1278 -3520 5206
620 5206 8061 2500 -2503 -5088 -3379 1218 383 -6370 -7928 -2563 594 -2273 -7274 -7823 -3033 1394
636 1394 617 -4401 -7588 -2004 5984 5218 -1956 -3834 -295 5748 10228 5876 -1089 2111 10111 10584
652 10584 8486 6148 3972 8290 14331 10016 4002 7514 11761 9998 8121 4851 2412 6940 11133
667 11133 5330 -2071 -1565 2767 5451 3069 -4738 -8646 -3798 1588 -129 -5535 -8798 -6773 -1840
682 -1840 -1589 -5438 -8256 -5493 840 1821 -2977 -4488 -628 3536 5181 3151 -648 1222 9578 11197
698A1197o437l244J921M801L715k733p626m84O339J986l499m414l298K777N560
713F561k387p322j907M538K470j048m731l385K626N566m90n095l301L763N447
728A305k6n128l541K730N542K956m664n450J498O204K008k685m560j176N624M401
744E038l417n251P75L519L081p85m218k067M927M377k640l999p49L250L982l74
760E449n284k315L981M548n52m960m443K052N331R32m937l673R35M107J109l763
776a483m234R97L982J955l025m382L86N028K469l477l574O95M028L330j989n317
792d611j16N460L787j845m429k431L327N388o37n082j748K637L592K7m738k583
808d002K746N317M85m526l879J851N108J648l720k793J596M367K499l901m881
$$ plain form
698 11197 4760 1516 3437 8238 11953 9220 1594 1110 7449 9435 5936 1522 -1776 1001 6561
713 6561 4174 -3148 -5055 -517 1953 905 -3826 -7211 -4585 981 491 -4604 -7905 -4142 1305
728 1305 1279 -3849 -7390 -4660 882 3838 -826 -6276 -4778 1426 3434 749 -3811 -4987 637 5038
744 5038 1621 -3630 -2855 664 3745 2960 -1258 -3325 1602 5979 3339 -660 -1409 1841 5823 5449
760 5449 165 -2150 1831 6379 5827 867 -3576 -1524 3807 4739 -198 -3871 -2936 1171 2280 -1483
776 -1483 -5717 -4720 -738 1217 -1808 -6190 -5804 -776 1693 -1784 -5358 -4663 -635 2695 706 -4611
792 -4611 -4727 733 4520 2675 -1754 -4185 -858 4530 3893 -1189 -2937 -300 3292 3319 -1419 -4002
808 -4002 -1256 4061 4546 20 -3859 -2008 3100 4748 1028 -1765 -169 4198 6697 2796 -2085
823b085J142N843K454k648m749j226L536L798k279n180q06L154K283j927m916
838c606k551L311M291j300m855k564J982L750J87l721k239K665M416L85l856k882
854f587K271N461K425k797l074O66L905K509k232k770J212L955J972k580m224
869A12l43M274K878k869l588o39J945K705j388m677j624M226K433j917m349k200
885e021J747M312k62m749j903J814K757p97l270k798K367M134k28l917l170J586
901g398L810J796k428l143J413L819J705k323l247J391N115K734j953l370j11
916b190M290M087j596m063K54L873K464q60m450k113L273M105k064m731j991O64
932a048K851L95n092l989K263L100r77m027l513M64M671J459l953m015J254L799
$$ plain form
823 -2085 -943 4900 7354 4706 -43 -1269 2267 6065 3786 -1394 -2200 954 3237 1310 -3606
838 -3606 -6157 -2846 1445 145 -4710 -7274 -5292 -1542 -1355 -5076 -7315 -4650 -234 151 -3705 -6587
854 -6587 -4316 1145 3570 773 -2301 -1635 2270 4779 2547 -223 989 4944 6916 4336 112
869 112 -231 4043 6921 4052 464 -175 1770 4475 3087 -1590 -3214 1012 3445 1528 -2821 -5021
885 -5021 -3274 1038 776 -3973 -5876 -4062 -1305 -2102 -5372 -8170 -5803 -1669 -1897 -5814 -8984 -7398
901 -7398 -3588 -1792 -4220 -7363 -5950 -2131 -426 -2749 -5996 -4605 510 3244 1291 -2079 -2190
916 -2190 2100 6187 4591 528 782 4655 7119 6259 1809 -304 2969 7074 5010 279 -1712 -1048
932 -1048 1803 2198 -2894 -6883 -4620 -1520 -2497 -6524 -10037 -9573 -4902 -3443 -7396 -11411 -10157 -6358
948f358K285j412l617R66M376L311j358l539N96L863L940o29l096k65L098L890
964F051l73l988j614M208K993q38l254k742R79M608M95n145k499J939K241R41
980D002k579m622N41L882J69l588j968m29K314K399k583m325Q62L420Q95k000
996c610k702r40L799L640j877l389l33L061L327M96l264j259L578L627M54k263
1012B345j861K322M170N45k287j244Q39L040J365l127k724J724L046l83k211l190
1028B369o86L342J137l817l720K06J817J677j365m886j518L739J729j798k105
1043c879j755J415L781K15l376m59K518K103L10j335j465K349M007q0k431o47
1059A271J369L368J448k472k556J714K890J257j679k882K67K884J279k128j863
$$ plain form
948 -6358 -4073 -5485 -9102 -8136 -3760 -449 -1807 -5346 -4750 -887 3053 2424 -672 -937 2161 6051
964 6051 5678 1690 76 4284 7277 6439 3185 443 1422 6030 6525 1380 -1119 820 3061 4002
980 4002 1423 -3199 -2658 1224 1393 -2195 -4163 -4592 -2278 121 -2462 -6787 -5925 -2505 -1610 -3610
996 -3610 -6312 -7252 -3453 187 -1690 -5079 -5412 -2351 976 1472 -1792 -3051 527 4154 4608 2345
1012 2345 484 2806 6976 7521 5234 3990 4829 7869 9234 6107 3383 5107 8153 7770 5559 2369
1028 2369 1683 5025 6162 2345 -1375 -1169 648 2325 960 -3926 -5444 -1705 24 -1774 -3879
1043 -3879 -5634 -4219 -438 -223 -3599 -4058 -1540 563 873 -462 -1927 422 4429 4349 1918 1271
1059 1271 2640 6008 7456 4984 2428 4142 7032 8289 6610 3728 3995 6879 8158 6030 4167
1074D167j201J440K680j895l637K41J968j33q17k589j852K424K332k684l292k00
1090c048M53K616L64l736k454L107K570j383j320j444M61M128J581l018j125K134
1106a14K103J697m93j891N25L848R48j853j095O02K713J746k185k962K46K030
1122E865J579j089m634p82K423J274k059k442k608R44L335o45m762j457J819Q61
1138b378P99j253l201J697L848j059k460j22J152K267K389k184l020J860L744
1153B079M15r47j817q34L360K901k031k913o53K418K611m46l093j162J800J753
1169C441n02j954j763K060J969j069k565r24R03K269J202l829k490K131K379n68
1185F90j484k374p66L688J555l243k551Q02J333J688n8k939q01L092Q71j465n44
$$ plain form
1074 4167 2966 4406 7086 5191 1554 1795 3763 3630 2813 224 -1628 796 3128 444 -2848 -3048
1090 -3048 -2595 21 385 -3351 -5805 -2698 -128 -1511 -2831 -4275 -3814 314 1895 -1123 -2248 -114
1106 -114 1989 3686 3193 1302 1827 5675 6623 4770 3675 4277 6990 8736 6551 3589 3835 5865
1122 5865 7444 6355 1721 939 3362 4636 2577 135 -2473 -1529 1806 1161 -3601 -5058 -3239 -2378
1138 -2378 -1579 -2832 -6033 -4336 -488 -1547 -4007 -4129 -2977 -710 1679 -505 -3525 -1665 2079
1153 2079 2494 1547 -270 -1104 2256 5157 3126 213 -440 1978 4589 4143 1050 -112 1688 3441
1169 3441 2939 985 -778 1282 3251 2182 -383 -1307 -404 1865 3067 -762 -3252 -1121 1258 690
1185 690 -794 -3168 -3934 -246 1309 -1934 -4485 -3683 -2350 -662 -720 -3659 -4460 -1368 -497 -1962 -2506
1202b506m7J600K348m73k757J6K766J756k67j764j190K148K341n35k677n72O95
1219H82K555Q26k924j992J003J501P66j450k374j8K286o6k050j132m5J960J475
1236A203j640k883O54K452Q02o83j718j119K569K383j596k078N8J469J805M31
1252B109k698j618K455J570q77r09j381N41K206O33k625j398J484J547O62j347
1268C54j819N97K797N96j701j520P12J747J697j327k449O34J933J485j273k047
1284D16o10K000R99j031j680n36M99J980n96k806l14J599Q00j53j786j720J629
1301a310K694q50k255l85J58J951J144j516k317J315K498l1j148j216m13K392
1317G11J612k016j602L57J694J177p23k163Q8J689J337j035j488p53J971K105
$$ plain form
1202 -2506 -2553 -953 1395 922 -1835 -1819 947 2703 2436 672 -518 1630 3971 3436 759 187 882
1219 882 3437 4263 1339 -653 350 1851 2617 1167 -1207 -1225 1061 995 -1055 -2187 -2232 -272 1203
1236 1203 -437 -3320 -2666 -214 588 -95 -1813 -2932 -363 2020 424 -1654 -1596 -127 1678 2109
1252 2109 -589 -2207 248 1818 941 32 -1349 -808 1398 2031 -594 -1992 -508 1039 1701 354
1268 354 -1465 -868 1929 2525 824 -696 16 1763 3460 2133 -316 318 2251 3736 2463 416
1284 416 -194 1806 2805 1774 94 -442 57 2037 1441 -1365 -1679 -80 720 567 -1219 -2939 -1310
1301 -1310 1384 534 -1721 -2106 -1948 3 1147 -369 -2686 -1371 1127 1096 -52 -1268 -1681 711
1317 711 2323 307 -1295 -938 756 1933 1210 -953 -865 824 2161 1126 -362 -1115 856 2961
1333B961r15k057o25J408J907J38k154j598J937J832n14j618j477J55J999P03
1349B082k396j765P34J005K68j132k169K0K021P99k287p70l18J800J566r41k314
1366c797N64J840J448J1j575p28K161K410m89j585k53J124J501P55j982q17J419
1383B007J121m3j005j749L56J984M99k356j450N6J310J048j733k215L24J488L49
1400ij094j489l53J802J033j053j612j06J088J462m74j540n87J814J335n03q35
1417a121j091J115K381k60j698k96J235J286M92p34j431R28K110N0j263o90M87
1434A500J450J218j343j751N44J497K51r72j543m71J384O95j195j686n75J201
1450B04O21j102j955k50J240Q66m01j662p74J321J270k35j153l43O97J608P67
$$ plain form
1333 2961 2046 -11 -636 772 2679 2817 663 -935 1002 2834 2320 702 -775 -620 1379 2082
1349 2082 -314 -2079 -1345 -340 -72 -1204 -3373 -3353 -1332 -533 -2820 -3590 -3908 -2108 -542 -1483 -3797
1366 -3797 -3233 -1393 55 66 -1509 -2237 -76 2334 1845 260 7 1131 2632 3387 1405 588 2007
1383 2007 3128 3085 2080 331 687 2671 3170 814 -636 -580 730 1778 45 -2170 -1846 -358 -9
1400 -9 -1103 -2592 -2945 -1143 -110 -1163 -2775 -2881 -1793 -331 -805 -2345 -2932 -1118 217 -286 -1121
1417 -1121 -2212 -1097 1284 1024 -674 -970 265 1551 2043 1309 -122 806 2916 2966 1703 1013 1500
1434 1500 2950 4168 2825 1074 1618 3115 3366 2394 851 380 1764 2459 1264 -422 -997 204
1450 204 825 -277 -2232 -2482 -1242 -376 -777 -2439 -3213 -1892 -622 -857 -2010 -2353 -1656 -48 719
1467G19j255o10J727J536J48m98p24M83J883P80j280r32J050R09N22n00j815m04
1485A739J801N55j264j144j98N12J035r03k007l79R73N83m30j611n75Q48J160
1502F95k76j448j004O74J632m3j705l74P53R25P39j072j065O99J738M37q86n42
1520a23j01J542J476r29j209M61J588K59J30p41o78J567J160j016j290L62O24
1537C082O67l29j611j042J308P15q53j633r86L60J319m73j772j073K32J328Qr94
1555a747j432N34J299J67p85n31L06J389R30n65q14O35J146J064%j384K92J666
1573B170P97n54o47p35P09J703l76j659o12Q43K39K56j036j336L91J108l10j288
1591c37p74L37P10J51q89j273M75J041J14p14q20j9J324O37j111r34k15J251J085
$$ plain form
1467 719 -536 -1146 581 2117 2265 1767 1043 1526 3409 4189 2909 1977 3027 3936 4458 3958 2143 1739
1485 1739 3540 4095 2831 1687 1489 2001 3036 2133 126 -253 720 1303 873 -738 -1313 -465 695
1502 695 419 -1029 -2033 -1359 273 230 -1475 -1849 -1096 -171 568 -504 -1569 -870 868 1305 419 -123
1520 -123 -224 1318 2794 1865 656 1117 2705 2964 3094 2353 1675 3242 4402 3386 2096 2458 3082
1537 3082 3749 3420 1809 767 2075 2790 1937 304 -682 -322 997 524 -1248 -2321 -2089 -761 -753 -1747
1555 -1747 -3179 -2645 -1346 -1179 -1964 -2495 -2189 -800 130 -435 -1249 -614 532 1596 1596 212 504 2170
1573 2170 2967 2413 1766 1031 1740 3443 3067 1408 796 1639 1878 2134 1098 -238 153 1261 951 -337
1591 -337 -1111 -774 -64 87 -802 -2075 -1600 -559 -445 -1159 -1979 -1998 -674 -37 -1148 -2082 -2297 -1046 39
1610C9m35j314j45J158P49j88r30m46Q72J575n78p40k28N17J292M31j312o54J491
1629A154Q28l67p34n97K98J389Q6j459j050P28P56J89p35j540MJ318J43j000p43
1648a332m95O46O64r51r35R6J158N68k93j117l17J432R24o25n99l09J029J546
1666A090J86j356m39O75J024N77j075q36N70J283j48q65m53j58J101M72r51j139
1684d42N50P41P3k91q04l60J199O92r03j078J95Q12M38p3j152k42Q89R81p35p07
1704b17m54K52J028K61j156q07O46R82l81n22p15L80J064Q6p42o13M41J134N27
1723A194j251l36L92R58O37n47j078l5J485K72l35q78j34L11J234o51j203n6P08
1742F87N05q0j133m60N65R05l52j020k23O47O08N0q32j057R21R65j68l53j065
$$ plain form
1610 39 -396 -1710 -1855 -697 52 -136 -1066 -1512 -640 935 357 -383 -611 -94 1198 1629 317 -337 1154
1629 1154 1982 1615 881 284 582 1971 2057 598 -452 276 1032 1221 486 -1054 -1050 268 411 -589 -1332
1648 -1332 -1827 -1181 -517 -1468 -2403 -2307 -1149 -581 -874 -1991 -2308 -876 48 -577 -1176 -1485 -456 1090
1666 1090 1276 -80 -519 156 1180 1757 682 -154 416 1699 1551 686 233 75 1176 1648 697 -442
1684 -442 108 849 922 631 -173 -533 666 1358 455 -623 -428 384 822 749 -403 -645 244 1225 490 -217
1704 -217 -671 -419 609 870 -286 -1093 -447 535 154 -368 -1083 -703 361 447 -295 -908 -467 667 1194
1723 1194 -57 -393 -1 957 1594 1047 -31 -66 1419 1691 1356 478 344 655 1889 1238 35 -21 687
1742 687 1192 1112 -21 -481 84 989 637 -383 -606 41 649 699 -133 -1190 -269 696 528 175 -890
1761h90M89J096L12q74r87K52R35L68n05q36j47Q28M21o00r07q2R19P58o06q73
1781i29j51O82Q97K4j328j26J237N94j69n67n00O11J173M1r89m03L90Q70M25q23
1801I59r23J90J213j95q74p36L3O26N46r23j084q3R22J82m34p42m04J018M04l41
1821f46q53K52P87L71r3n65m25O68J045o8p26p51P62O66J45q47j82J98J243J37
1841A118r02q65P33R66j49m16q38L58P44L58o94o04K28Q59K66o50q70qR59K32
1861H25k04q44k44N31N20n21p59m38O31M76k73o88k94M99O14n5r18k30J55J130
1881h7K32n58n04K93J126K82r1q68L33R46N83n27l57M6N55N64n99p02K65M16L24
1902A672m87r64m56O92O87o12r01j79L67K72J59j121l02P76M35m85j67m06K41
$$ plain form
1761 -890 -401 695 1007 133 -854 -602 333 701 196 -640 -787 41 462 -138 -1045 -1127 -208 550 -56 -929
1781 -929 -1080 -398 499 523 -805 -931 306 900 731 164 -336 275 1448 1489 500 97 487 1357 1782 959
1801 959 36 226 1439 1244 370 -366 -333 293 839 -84 -1168 -1251 -329 -147 -581 -1323 -1727 -709 -305 -646
1821 -646 -1499 -1247 -460 -89 -182 -747 -1172 -504 541 473 -253 -1004 -242 424 569 -278 -460 -262 981 1118
1841 1118 216 -649 84 1050 901 485 -353 5 749 1107 413 -191 37 896 1162 512 -358 -366 593 825
1861 825 621 -223 -467 64 584 63 -696 -1134 -503 -27 -300 -988 -1282 -783 -169 -224 -1142 -1372 -1217 -87
1881 -87 145 -413 -917 -624 502 784 693 -175 158 1104 1687 1160 803 849 1404 1968 1369 667 932 1348 1672
1902 1672 1185 221 -235 457 1144 532 -369 -548 -181 91 250 -871 -1173 -397 38 -447 -614 -1020 -779
1921g79P97L15n32m90K6J030L17n40m87J95J052J69m77l10K7M50N17l28n23j17
1941C12O16M51j86n61k63N51K17M9o11O0J22M77l5o12n15L34N43M7q50o00L29
1962a25P65j60q60o21L98L83K64p22m53K78N27K7l86m34L46M61L64k99l81M19
1982b09N34O38k79j51j71P73N19K0q89k85P63M09j0n61l41J81N01j13p49o58K36
2003A58M88Mq96p26L05L55l8k44p33K22L96J82l40n32K32O19J95k66m66q5Q52
2024c18M83l74n43m3O43N04j27m33l07L85J008k63l36m85L63M99k18k09n09M83
2044B03N25J99n92q15M93O06J14m62l80J24K81K14m56m13j66M40K46j79j130J81
2064i67M13L13o07l73l14O08L87J53r78k51O26O24m2n07PM70O27o3k53l22O18
$$ plain form
1921 -779 18 333 -199 -689 -663 367 684 144 -343 -148 904 1073 596 286 313 763 1280 952 429 312
1941 312 928 1379 1193 632 369 920 1137 1186 575 635 757 1234 1199 587 72 406 949 996 146 -454 -125
1962 -125 640 480 -380 -1001 -603 -220 44 -678 -1131 -853 -326 -299 -685 -1119 -773 -312 52 -247 -628 -209
1982 -209 325 963 684 533 362 1135 1654 1674 785 500 1263 1672 1662 1101 760 941 1442 1329 580 -78 158
2003 158 646 650 -246 -972 -667 -312 -350 -594 -1327 -1105 -709 -527 -867 -1399 -1167 -548 -353 -619 -1085 -1170 -318
2024 -318 165 -209 -752 -795 -152 352 225 -208 -515 -130 878 615 279 -206 157 656 438 229 -280 203
2044 203 728 927 335 -480 13 619 733 271 -109 15 296 510 54 -359 -525 -85 161 -18 -1148 -967
2064 -967 -554 -241 -848 -1221 -1535 -927 -540 -387 -1365 -1616 -990 -366 -408 -915 -908 -438 189 126 -127 -449 169
2085A69M37L16n08l65K64N50K98l92m91j89O83k5rp74k40P07J61m06l37k10M53
2106I2J06j99n06j71M07L60l06l38j66J94N34L11q80l43K47Q93j64k92l55J14
2126d62O31L16n03n41K19P14O1m21l89L35K88L42k81n82K16L59M09j56m57r2P50
2147G56P3n0n63m0N84N40k34o98l47J49O92J58r35k50J76L14J8m84l85J34O20
2168B28j8o39j92J21L72J29j87n50M12M95J29l36k32r9M53R48m78p28O9L33M45
2189F75k10m53j13N5J021m85m47k95K71O29k05n98j96L94K28J17n42K4J19L06
2209B95L44l36n98j15P63K53m15l57J39L20M36j84o17J8M59l49j85k33j68M07
2229a23L10m32l22k92O41M5R8m23k37M90M06l02k99j69L07P82l50l66k05K93M59
$$ plain form
2085 169 606 922 414 49 313 863 1161 769 278 89 772 747 738 -36 -276 431 592 186 -151 -361 92
2106 92 198 -1 -507 -678 -271 89 -217 -555 -721 -527 7 318 -562 -905 -658 235 71 -221 -576 -462
2126 -462 169 485 -18 -559 -340 374 435 14 -375 -40 248 590 309 -273 -57 302 711 555 98 6 756
2147 756 829 779 216 176 760 1300 1066 368 21 170 862 1020 85 -165 11 325 343 -141 -526 -392 228
2168 228 210 -429 -621 -500 -128 1 -186 -736 -324 171 300 -36 -268 -367 86 1034 556 -172 -103 230 675
2189 675 465 12 -101 -46 975 490 43 -252 19 648 443 -155 -351 43 271 388 -154 -130 -11 295
2209 295 639 303 -295 -410 353 606 191 -166 -27 293 729 545 -72 -54 405 56 -129 -362 -530 -123
2229 -123 187 -245 -567 -859 -218 -173 -75 -498 -735 -245 161 -141 -440 -609 -302 480 130 -236 -441 -148 311
2250C11l7k05j22J3O64L6n39k02j30L49L59n89l20J26M44J09l88l66mM64L70n69
2272b26l62PK55M06Q4m93k14J99L07j4k00j02K27K36J03m24l62J73M48Jm76j43
2294e70k1M87N2k78l02qL02L19j15k14o1L70M16k65l15j17P26p0j37k63l5L03
2316B04L46k29n50J42J56J61j33k40n90N33K02k13l40J14k25L12K41m94k29L5
2336g97N04n6K44n16n5P56J28m67O5J51J65K72L0p21K47M04L75l61j80K2J00L05
2358F15r7m77k95J57N00p1o08m06O15L09L0l76k36K89J37K97p12OJ37J20L75j35
2380A74l16m43O67K60k45l66j36M17J23j89k35M1M66k20n2j73k64M52N6L08m03
2401g8K56J20M79k10k76L8J6M08K4l53m25J63M43J82n91n18K40K86K11j66o23
$$ plain form
2250 311 274 69 -53 -40 624 660 121 -81 -211 138 497 -92 -412 -286 158 267 -121 -487 -491 -27 343 -226
2272 -226 -588 -581 -326 80 164 -329 -543 -344 -37 -51 -251 -353 -126 110 213 -211 -573 -400 48 49 -427 -570
2294 -570 -591 -104 -52 -330 -632 -640 -338 -19 -134 -348 -409 -39 377 112 -203 -320 406 336 199 -64 -99 204
2316 204 550 321 -229 -87 69 230 97 -143 -733 -200 2 -211 -551 -437 -662 -350 -109 -603 -832 -797
2336 -797 -293 -349 -105 -621 -676 80 208 -259 -194 -43 122 394 424 -297 -50 354 729 368 188 210 310 615
2358 615 518 41 -254 -97 403 332 -276 -682 -67 242 272 -104 -340 -51 86 383 -329 -323 -186 -66 309 174
2380 174 -142 -585 82 342 97 -269 -405 12 135 -54 -289 -248 218 -2 -54 -227 -491 -39 17 325 -78
2401 -78 178 298 777 567 291 329 345 753 777 424 -1 162 605 787 196 -322 -82 204 415 249 -374
2422c74L49q1J31l64k37m10N19K71k62l61j11M42L23J64o44K8N79K85j94k95N4
2443a88O8O27j0l46l01M94J06M8j28k18L41l1P2k89j36j74K00Q9k6n29K14N2j7
2466h2O0n00K76K38M0R5n67j45J95N28k96m18k54M70K68J06k52l71L1N07j02m46
2488f19J03m1N81o0l01m41O03K06k00J73l02j65Q83%l28j48K16K21K04m4n54M31
2510D18J65j47j53l68o1K00L18j6p10J7M03q8nl59l36L07rJ87k91k82P0O80m5
2533a05m40R1L54J10Mm7l84K76K87j91K14J7j91R3M45m64j32mJ12M72o99n5R0
2556a47M30L10k13m27J83j37L32j50m79J20N11p7n3k3j80L02qLl62j43J01L53
2578B46j43j58l08J5K77oj07k55K0M08K6m68K6J27J49M20j48n14K21M75J46k74
$$ plain form
2422 -374 -25 -106 25 -339 -576 -986 -467 -196 -458 -819 -930 -488 -165 -1 -645 -617 -38 247 53 -242 -188
2443 -188 -120 507 497 151 -150 344 450 498 370 152 493 462 534 245 109 -65 135 224 198 -331 -117 -65 -82
2466 -82 -22 -522 -246 -8 32 127 -440 -585 -390 138 -158 -576 -830 -360 -92 14 -238 -609 -578 -71 -173 -619
2488 -619 -516 -557 24 -36 -337 -778 -175 31 -169 4 -298 -463 420 420 92 -56 160 381 585 541 -13 418
2510 418 583 436 283 -85 -146 54 372 356 -354 -337 66 -22 -27 -386 -722 -415 -424 -237 -528 -810 -740 -60 -105
2533 -105 -545 -454 -100 10 14 -33 -417 -141 146 -45 169 186 -5 88 533 69 -63 -67 45 517 -182 -237 -147
2556 -147 283 593 380 -47 136 -1 331 181 -298 -178 333 256 203 180 0 302 294 297 -65 -208 -107 246
2578 246 103 -55 -363 -348 -71 -77 -184 -439 -419 -11 15 -453 -427 -300 -151 269 121 -393 -172 303 449 175
2600A75n6j88K29M76j3n52J26K25J05R5k09m76N58n1k16J5l66N14j33p4j96l66
2622c78J47J45J41Q7m86p1M95j03j63k68P4L22L29j28l30L0J76L14l21k1j56L46
2644A81L1q3j60k59j8N81q4k96m54M09p4K05n1j21o1K23L7l24K42R4R1J79j35
2667A53l52NL55n5j09j98J46J00M04o90p8M0M45k10J88n82O3J20J11J5l5k65J3
2690d16K46rl00K7L99l40M77M6p90N37K83Pk16k11n3L45K20m42q7Q1L21l52K84
2713E7n18j08N18J46o46J21j41K17M01l40J37m39O38K0k13j52J06n2M85k34j45
2734a42k95M42J26j39p8j40K95r8j20L4l70K14L56k8m82O5N8k80N29k1n80K34
2756d20K2J68J32j35j74p4N44R8l94J73j2M03j09j83k11K83K10k79j59j05K49
$$ plain form
2600 175 119 -69 160 636 623 71 197 422 527 622 413 -63 495 444 228 243 -123 391 258 184 -12 -378
2622 -378 -231 -86 55 142 -344 -415 80 -23 -186 -454 -380 -58 271 143 -187 -157 19 333 12 -9 -165 181
2644 181 212 129 -31 -290 -308 273 189 -107 -561 -152 -226 -21 -72 -193 -254 -31 6 -318 -76 18 109 288 153
2667 153 -199 -194 161 106 -3 -201 -55 45 449 -241 -319 -279 166 -44 144 -438 -375 -255 -144 -129 -164 -429 -416
2690 -416 -170 -179 -479 -452 -53 -393 84 130 -660 -123 160 167 -49 -260 -313 32 252 -190 -277 -196 125 -227 57
2713 57 -461 -569 -51 95 -551 -430 -571 -354 47 -293 -156 -595 43 63 -150 -302 -196 -248 237 3 -142
2734 -142 -437 5 131 -8 -86 -226 69 -29 -149 -115 -485 -271 85 57 -425 -360 -302 -582 -53 -74 -654 -420
2756 -420 -398 -230 -98 -233 -407 -481 63 161 -233 -60 -72 331 222 39 -172 111 321 42 -117 -222 27
2777B7m0J63k17L4l13J77%m8j17J99m2K48m27o7K85K89j91J51l14l4P2L02K4l52
2801a91O6L3K62j20MK21r3J21k05k55J14J02J92q8m68j44M7O78on39P6O5K72k1
2825A23Q8l36j8M04J65j07n36J21L91L5j47l31J35J71J20j23j62j6j16K34k49
2846a54k60J3O1N82k98j43j36J67J89L6k83M9M52k14R6m6LP6J00K53n07J22Q8
2869B46K21L4j59m27p6M71r2j97j13P8n3M10m52j9j54K17p3Q0l99J30n4N86l75
2892a70j21M8J75k2j1N1j73L07R1m1l15r8J60K61j83l8N1l12K63J59jk45P2K44
2916A52j12j64O7j76K65J59O6k39j26K94L8p5J94o51L71L31j88k31k84J48K00
2937C9Q9o18J74J46J63j5l03j35J6L43j13j3j06R2J73Q3l21k13L79J21J07L3l96
$$ plain form
2777 27 -13 150 -67 -33 -346 -169 -169 -217 -334 -135 -177 71 -356 -423 -138 151 -40 111 -203 -237 -165 137 161 -191
2801 -191 -125 -92 170 50 54 275 182 303 98 -157 -43 59 251 163 -305 -449 -402 276 270 -269 -193 -128 144 123
2825 123 211 -125 -143 261 426 319 -217 -96 295 330 183 -148 -13 158 278 155 -7 -23 -139 95 -154
2846 -154 -414 -401 -340 242 -56 -199 -335 -168 21 57 -226 -177 275 61 157 111 114 190 290 543 36 158 246
2869 246 467 501 342 -85 -161 310 218 21 -92 -14 -67 343 -109 -128 -282 -65 -138 -58 -457 -327 -381 205 -170
2892 -170 -291 -243 -68 -90 -101 -50 -223 84 175 134 -181 -279 -119 142 -41 -79 -28 -340 -77 82 81 -164 -92 152
2916 152 40 -124 -57 -233 32 191 257 18 -108 186 224 149 343 -308 63 394 206 -25 -309 -161 39
2937 39 128 -490 -316 -170 -7 -22 -325 -460 -444 -101 -214 -227 -333 -241 -68 15 -306 -519 -140 -19 88 121 -275
2960b75O6O09k13r7J5l0J36j69J13p6j48J33r0J80k67J25j0r1k93K16k13R6K57
2983b6j35j27J68o3O8K34n8j59j07N26k35j46j93J36J32M10m76n9p1J42K97k85
3005b7k10K59R3j50n1m7k14K93J50P9m98J28L96J06l8j77k13K16J58P7k86j02
3027e8K69L8n6r8j33kK11J2j73j41J43Q0o3R5n32R8K69Q3j62l1j30J80L0J61m02
3052c12M10N5p5k53j10K77n6K83p9M6k52QJ00Q1r3l44M58j87J36m26K13K5J48
3075E3l20R3k9K5M13j97K55n64L52m65L43j38n6L20k3j57J70r4l4J73N4m7k09
3098h2M2j53K32k61P8r3K17m9k0k62R8O1o3K92m91K79J09r6K65l57J97K34l17
3121a40L15j84j63K72N2M9k14r5P4J80m1j43J0k14L11J17j97l87J15l1J52k5j45
$$ plain form
2960 -275 -209 400 187 90 105 75 211 42 155 79 -69 64 -26 154 -113 12 2 -89 -382 -166 -379 -283 -26
2983 -26 -161 -288 -120 -183 -115 119 61 -98 -205 321 86 -60 -253 -117 15 425 -51 -110 -181 -39 258 -27
3005 -27 -237 22 115 -35 -86 -133 -347 -54 96 175 -323 -195 201 307 269 92 -121 95 253 330 44 -58
3027 -58 211 249 193 95 -38 -40 171 183 10 -131 12 92 29 124 -408 -310 -41 42 -120 -151 -281 -101 -71 90 -312
3052 -312 98 153 78 -175 -285 -8 -64 219 140 186 -66 -58 42 123 30 -314 144 -43 93 -333 -120 -95 53
3075 53 -267 -174 -203 -178 235 38 293 -271 81 -384 -41 -179 -235 85 62 -95 75 -19 -53 120 174 127 -82
3098 -82 -40 -193 39 -222 -144 -237 -20 -69 -89 -351 -253 -192 -255 37 -454 -175 -66 -162 103 -254 -57 177 -140
3121 -140 175 -9 -172 100 152 201 -13 -108 -34 146 105 -38 -28 -242 69 186 -11 -398 -283 -314 -162 -187 -332
3144c32k14L78J05q4p9j14K98Q6q4k7R0j9O5j97J27k35k8L56j82K35n59K69L09
3167A64m07J54j91J03j24L93l00j75J54J40L54l89J33l89J74L79j11j13j45N6
3187a40J25J54k48N1k25M51k40J20j05nm8K6J03j73j53N1L42m17K51k80K71J60
3209G1j87J08r8j99K19m2K69l79J59K90k87J30N1o2M3K57l55N5j12L9K10k36r3
3232a49j45J27J56o8j23k5K05P4k60L2k5K58k0j05o2J20J76j23j44K21L4N9Q4
3255B97k58k17N7L04j27M4j31j31N4J19J49j95q3J36k68K8N6P4j49L07LJ0m2J17
3279A54p4k9M3O4o5L15n0n24L74J84k85M72l98k88J72J45l79O9j38K3K82k37P9
3302i1K8j68N52m98J73K5r3j60K49K0K06j83q3o7k2J56k50J9K49Q8k9m3j9J42
$$ plain form
3144 -332 -546 -168 -63 -147 -226 -340 -42 44 -40 -67 23 4 69 -128 -1 -236 -264 92 -90 145 -414 -145 164
3167 164 -243 -89 -280 -177 -301 92 -208 -383 -229 -89 265 -124 9 -380 -206 173 62 -51 -196 -140
3187 -140 -15 139 -109 -58 -283 168 -72 48 -57 -62 -110 -84 19 -154 -307 -256 86 -331 -80 -360 -89 71
3209 71 -116 -8 -106 -305 -86 -128 141 -238 -79 211 -76 54 105 43 86 343 -12 43 -69 -30 180 -56 -149
3232 -149 -294 -167 -11 -79 -202 -227 -22 52 -208 -176 -201 57 37 -68 -130 -10 166 43 -101 120 154 213 297
3255 297 39 -178 -121 183 56 100 -31 -162 -108 11 160 -35 -118 18 -250 -222 -166 -92 -241 66 69 79 37 154
3279 154 80 51 94 158 93 408 358 -166 208 392 107 579 181 -107 65 210 -169 -100 -238 -215 67 -170 -91
3302 -91 -63 -231 321 -177 -4 21 -72 -232 17 37 243 60 -23 -90 -112 44 -206 -187 62 150 121 78 59 201
3326B01k1k23J01j85J77J04J26j15j19J86k18q6n7j6K0J94L37l80j92L51l01P
3348a09q1J74R7N6j65O0o4q8j38M48j45l69J15L31j11k51j56K32M2J42k26J28
3370g8M7J25l9m9k38O7N3K5J64O3J67k42J28J70o6j74J81j28J04k3k37k61M74
3393B33j29l02j72L86P4k23Mr0j90L20Q0j15k4M7L73m84K97k44J19j10L94k90
3415d6k5K00r9Ml7j58J21Q6J76j25j38K9j34L52j39k12K26l44J34L62l41K54l04
3438a58L30L9j52k22J77J47kM0j60N7J10n4K56m24K8K9l4j65J47L0K7j40J69j54
3462g9k34K57J02j08M8j51K41j31P0N7m33O75k05l5j2j5j53M56q2n2k92o1K14
3485G7P2O1k09J14l1J6j51k28J68k13K55L28l19N3L5J16k03J24j03j9M5k9O1l25
$$ plain form
3326 201 180 -43 58 -127 50 154 280 165 46 232 14 -72 -129 -145 -125 69 406 26 -166 185 -116 -109
3348 -109 -190 -16 81 137 -28 32 -32 -120 -258 190 45 -324 -209 122 11 -240 -396 -164 -122 20 -206 -78
3370 -78 -31 94 55 6 -232 -165 -112 -87 77 140 307 65 193 363 297 123 304 176 280 257 20 -241 233
3393 233 104 -198 -370 16 90 -133 -129 -219 -409 -89 -9 -124 -148 -101 272 -212 85 -159 -40 -150 244 -46
3415 -46 -71 129 30 34 -3 -161 -40 46 222 97 -41 -12 -146 206 67 -145 81 -263 -129 233 -108 146 -158
3438 -158 172 211 59 -163 14 161 159 199 39 96 206 152 408 -16 12 41 7 -158 -11 19 46 -94 75 -79
3462 -79 -313 -56 46 -62 -14 -165 76 -55 15 72 -361 314 109 74 62 47 -106 350 268 216 -76 -137 77
3485 77 149 210 1 115 84 100 -51 -279 -111 -324 -69 259 -60 -7 28 144 -59 65 -38 -57 -12 -41 20 -305
3509c05N08j3J3r9j59p2P6L67l80NM7R8K32r1m59k0K71M7m91K97l27K70P2n8N9
3534a12J25N2P5j54o3o4J80N4l6j29N0k7J53j40k6j36M18j54J4l93J66J96l85
3557c36N7N1K70j97n0J16l6j58J97J42j57Q3NM6j59N7o1J42jk99K91K49k04l02
3581b54L42l3J9l83M24j03J53j29j51l1J69L4q2n3j92L51r2j69j52P8l6K49j31
3604a72n2K26j9%lj06K10l00J47K48k33J07k12K82j80l9J30N9r6k82K21j76K10
3627c0n0K19m5k17M7p2J15P3j91L6R2rJ2L16l00L9J15Qj21n6N8j7J59l52J10Q
3653e3N7J07k17j97P3N0J60Mo0Lq6K17k8k66K33J54L27j97l76Q1L31j69j18M9
3677G9l6J28k05j10J12J7q7J7L05l41L2J65Pk39K35nJ99l23Q4M1p8J50k9j13p0
$$ plain form
3509 -305 203 190 203 104 -55 -127 -51 316 -64 -59 -12 86 318 227 -232 -252 19 66 -425 -128 -455 -185 -113 -171 -112
3534 -112 13 65 140 -14 -77 -141 39 93 57 -72 -22 -49 104 -36 -62 -198 220 66 80 -313 -147 49 -336
3557 -336 -279 -228 42 -155 -205 -89 -125 -283 -86 56 -101 -18 -13 33 -126 -69 -130 12 11 -288 3 252 48 -254
3581 -254 88 55 74 -309 115 12 165 36 -115 -146 23 57 -25 -78 -270 81 -11 -180 -332 -254 -290 -41 -172
3604 -172 -224 2 -17 -17 -20 -126 84 -216 -69 179 -54 53 -159 123 -57 -96 34 93 -3 -285 -64 -240 -30
3627 -30 -80 139 94 -123 -76 -148 -33 40 -151 -115 -23 -32 -20 296 -4 35 150 158 37 -19 39 22 181 -171 -61 -53
3653 -53 4 111 -106 -303 -230 -180 -20 -16 -76 -73 -159 58 30 -236 -3 151 478 281 -95 -14 317 148 30 79
3677 79 43 171 -34 -144 -32 -15 -102 -85 220 -121 -89 76 83 -156 79 74 273 -50 34 75 -3 147 118 5 -65
3702f5R8k62N06m1l69L07o6J09j72K0l8J8j38K16j87k8j51M10lp5J0Kj78Q8m9
3727c8jj1M1l9J91K08l72J80P8j39p4l8J10K14k5J17m62J56K4K5j86k21K11K91
3751B40k16k54J58n1K30k28K11j21K86j47k43n1J94k79K64K70O2k69k09J02o2
3772a13J46P4Q2k26J82k58L22k48O1L34m07J00j25l0K34k18ML8o8K36K1j98o5
3795a22Q6m9K83Ll09N6J87j0Q6r3j44J31p6J64k47j07J37oq0O0j43k02M27j41
3819a09k95J73L37j73K26m26K29K4J49L3j68O8k27Q9J92J63n36J98L11j50j29
3840b1J19k89K34j43K92k63m2K28j64J8J11l02J79M9l1K3J55j63M1K01k19J58
3862A71J50l65j0K99k22p9Q4l2N1k59J58K3KJ22n4o2L9J55r4j15j6K1l4J29j40
$$ plain form
3702 -65 33 -229 277 236 -133 174 108 217 45 65 27 45 -93 123 -64 -92 -243 167 164 89 99 101 -77 11 -38
3727 -38 -39 -50 -9 -48 143 351 -21 159 237 98 24 -14 96 310 285 402 -60 96 120 145 -41 -262 -51 240
3751 240 24 -230 -72 -123 107 -121 90 -31 255 108 -135 -186 8 -271 -7 263 325 56 -153 -51 -113
3772 -113 33 107 189 -37 145 -113 209 -39 22 356 -51 49 -76 -106 128 -90 -86 -48 -116 120 141 -57 -122
3795 -122 -36 -85 198 201 -108 -52 135 125 211 118 -26 105 29 193 -54 -161 -24 -30 -110 -50 -193 -395 32 -109
3819 -109 -404 -231 106 -67 159 -267 -38 -14 135 168 0 68 -159 -70 122 285 -251 -53 258 108 -21
3840 -21 98 -191 43 -100 192 -71 -113 115 -49 -31 80 -222 -43 6 -25 -2 153 -10 31 232 13 171
3862 171 321 -44 -54 245 23 -56 28 -4 47 -212 -54 -31 -29 93 39 -23 16 171 77 -38 -54 -33 -67 62 -78
3887g8J19R4l95L29j91l3K51j58K14l6j43l3L06l20K01k26Q5K83j16j36j64J12
3909c5O6j85J99n8k70J99Or1J48l16L17k03L09k03J27J07o1J33q7r2l1P9J99l63
3933a06K70k14J04L55o04N2J08J67N4J4m72J03J11j2J11j19l4K47r3N9k25J02
3955b2j3M9k73K70j59l5N38m36K37J5K2k43K96l07j37L06k47K94Q3l20j50J05
3977a27oJ53k0j83J25r9k1J21J65p4N4k66j28P0J68J17j06K18J12J57j98j9l10
4000i7J67j1j69j60K47K83l03M6J45j4k17jJ79Q5l06Q4j76K70J94k67P0P1r6k22
4024a98L99k50k6K74J5j32j17j01nJ29q7J02r0K29K7r5L9k32J39K2K2L0k90R9
4048i7j02K07j36J68J37lRl37r3K3N09p9R7l11R3J26j61j17j68j26M00q1N4n2
$$ plain form
3887 -78 41 135 -260 69 -122 -155 96 -62 152 116 -27 -60 246 -74 127 -99 -14 269 153 17 -147 -35
3909 -35 31 -154 45 -13 -283 -84 -78 -169 -21 -337 -20 -223 86 -117 10 117 56 189 102 10 -21 58 257 -106
3933 -106 164 -50 54 409 -195 -143 -35 132 186 200 -272 -169 -58 -70 41 -78 -112 135 42 101 -124 -22
3955 -22 -35 14 -259 11 -148 -183 355 -81 156 171 193 -50 246 -61 -198 108 -139 155 238 -82 -232 -127
3977 -127 -133 20 0 -183 -58 -157 -178 -57 108 34 88 -178 -306 -236 -68 49 -57 161 273 430 232 213 -97
4000 -97 70 59 -110 -270 -23 260 -43 3 148 134 -83 -84 95 180 -126 -42 -218 52 246 -21 49 120 24 -198
4024 -198 201 -49 -75 199 214 82 -35 -136 -141 -12 -99 3 -87 142 169 74 113 -119 20 42 64 94 -196 -97
4048 -97 -199 8 -128 40 177 174 183 -154 -247 -224 285 206 303 -8 85 211 50 -67 -235 -361 39 -42 12 -40
4072d0R8rr7P2j12N5l8R7j81K8r2N9K26j4J88k21j2K39k92J55J4Q7k65J07J95
4097B47j97MJ78j73J40k11m5L2L21k69j28K3j06m5K09R8k87K50J12J16m65K05
4119Ij78O0N9j1J89N5l0j13J04m0n7k5K12k53M2KK0K2j57O4m4R8K15k49k06J75
4145c7JJ11j64K53j80K63l06l8J35P5l8j32J43kj77K61J32l70Q8J59L1j35k0J53
4169B06k30lK85j47j67J64j28n4O5j17K35M2%j80r7M4j1O8J45P9j70r7K94k75
4193d9J79%M8l38J32j14p3L81l00K64l02K63n6m9k9P1q7j83J81Q7p5L13j90k58
4217a84L14K07m02O0K10P3l08K48j76Q7k56j4L29j72k3P7k6L1j82pr0J05m5J79
4241C5j73n7K54k28J79j87R5k6Q6P0r2j48M14j89l8j27K66O6j50J7j62m5J51j73
$$ plain form
4072 -40 58 49 -48 24 -88 -33 -71 26 -155 -127 -219 -160 66 52 240 19 7 246 -46 109 123 210 -55 52 247
4097 247 50 54 232 59 199 -12 -57 -25 296 27 -101 -78 -184 -229 -20 78 -209 41 153 269 -196 9
4119 9 -169 -109 -50 -61 128 183 153 40 144 104 47 22 234 -19 23 25 45 67 -90 -26 -70 28 243 -6 -212 -37
4145 -37 -36 75 -89 164 -16 247 -59 -97 38 113 75 -57 86 84 -93 168 300 -70 18 177 208 73 53 206
4169 206 -24 -27 258 111 -56 108 -20 -74 -9 -126 109 151 151 -29 -126 -82 -93 -25 120 199 29 -68 226 -49
4193 -49 130 130 178 -160 -28 -142 -215 166 -134 130 -172 91 35 -14 -43 28 -59 -242 -61 26 -49 264 74 -184
4217 -184 130 337 -65 -5 205 278 -30 218 42 129 -127 -141 188 16 -7 70 44 75 -107 -114 -204 -99 -144 35
4241 35 -138 -195 59 -169 10 -177 -82 -108 -22 48 -44 -192 222 33 -5 -132 134 200 50 67 -95 -140 11 -162
4265a62J92J80k44L05p5j78J05l52M7J23J02k3k3l9K72l35J8J48j66Q1j00k0J36
4288hrK20K06l62J17Q1m9k06j89K58j76l6L23m12N4K89k64R3n5J27j89L42k66
4311a11K25j68O2j08J20J92k96J30n4j58P6J63r4j29K20j53J36p4K8l0K4j17J1
4334a05J45r6nJ4L6J4J14m21J01K88p3j03r4K61M4p4J41k25L4J66k72m2K23J3
4358H4j63L41j85k01L5J27k29N5n1J82K3Q2j64r6K14j57J38M7J79n69L12K1R6
4381A21j61J59k20J08L2J19k4j00j48J14K27l39K16l6n5l50K58j25J33l6K56J09
4403B58l08q2J03j74O5L33q6k7o3J33l20J91l58L47j03o3K08jL59q9k08L2l09
4426a62K19j68Q8o8n6J07j52R9J69j35J67K36m45R4j43L27j76l7n1J22J86k59
$$ plain form
4265 -162 30 210 -34 271 196 18 123 -229 -182 -59 43 20 -3 -42 230 -105 -87 61 -105 -24 -124 -144 -8
4288 -8 -17 203 409 47 164 245 196 -10 -199 59 -117 -153 170 -242 -188 101 -163 -70 -125 2 -187 155 -111
4311 -111 114 -54 8 -100 20 212 -84 46 -8 -166 -90 73 -21 -150 70 -83 53 -21 7 -23 1 -116 -105
4334 -105 40 -56 -61 -47 -11 3 117 -304 -203 85 12 -91 -185 76 120 46 187 -38 -4 162 -110 -152 71 84
4358 84 -79 262 77 -124 -89 38 -191 -136 -187 -5 18 100 -64 -160 54 -103 35 82 261 -308 4 25 121
4381 121 -40 119 -101 7 39 158 134 34 -114 0 227 -112 104 68 13 -337 -79 -204 -71 -107 149 258
4403 258 -50 -132 -29 -203 -138 195 109 82 19 152 -168 23 -335 12 -91 -154 54 53 412 323 115 147 -162
4426 -162 57 -111 -23 -91 -147 -40 -192 -93 76 -59 108 344 -101 -7 -150 177 1 -36 -87 35 221 -38
4448c8o1L23k82j31K30RN0k72P2J40k93L81k72l5K67k79J86j94M7J96j58K08k65
4471a71R0J62K57j75k01k6k10L76M6j87M0j80M57k07k3J08k98J62Rn6p3J42k7
4494A5p1J2j04Rj85N73m68K84L3J10k07Q6J59l24J42k22L11j60K11k7j86L24r5
4517B20m19N0M50l19Q5j77J92Q0j67P2l04N5J53k47K82J04J0j07qo4L8J12L2j08
4541A5J30k28J67r2r4K20lM3r5m0R4j0k10K17P0j62j25k3J59k1J98k49jJ32n4
4566C8k54K17j17nR8J7R8j28J18m4j03M0J44p2O2j25Oj35M60m03M4M5j23K24k35
4591a33J10j89K20O9p2j79J57o9R4K9r4J15r8K14j69J35J47k20j8K3n6J09k47
4614a22J36O3k00L06Ll5rj90K31k78K4j28J25K84j20j75L22k91J13r9K39l12J60
$$ plain form
4448 -38 -99 224 -58 -189 41 50 100 -172 -100 40 -253 128 -144 -179 88 -191 -5 -199 -152 44 -114 94 -171
4471 -171 -81 81 338 163 -38 -64 -274 102 148 -39 1 -179 278 71 48 156 -142 20 29 -27 -100 42 15
4494 15 -56 -44 -148 -139 -324 249 -219 65 98 208 1 87 246 -78 64 -158 153 -7 204 177 -9 315 220
4517 220 -199 -149 301 -18 67 -110 82 162 -5 67 -237 -182 -29 -276 6 110 120 13 5 -59 -21 91 123 15
4541 15 145 -83 84 -8 -102 118 115 158 63 23 117 107 -103 114 184 22 -103 -126 33 12 210 -39 -40 92 38
4566 38 -216 1 -116 -121 -23 -6 92 -36 82 38 -65 -25 119 47 109 -16 -10 -145 315 -88 -44 1 -122 102 -133
4591 -133 -23 -212 8 77 5 -174 -17 -86 8 37 -57 58 -40 174 5 140 287 67 49 72 16 125 -122
4614 -122 14 77 -123 183 186 151 142 -48 183 -95 -71 -199 -74 210 90 -85 237 -54 59 -40 199 -113 47
4637D7n2J05K20k59j8J97p5r3J04k32M86k34m0k7n7o2j66J25k26N18k54m2j7J
4661e1K46k88J53Q3r2j5o9j02K19pj66j2n6L65k17L3r0J35J74k79j59J16M1O9
4685C1l00J55n5n1M27j73O3k08L19o8k80K83q7j1mJ49l54l6K06o1K13p9j50N4
4709a7K7m0K09o0j31l6k23J16J80N2J04k89O7O1j69Q4J7k52J70K26j55JL7j83
4733b04L94j11k20J97l02M94l20K02o1J34k73j45J87j50N8K22l53K04K10n2l02
4754a91J39J41K1j89k22K86N4J08k87L59k77M1R5r8J71r7n7R9j2N7l64L19J74
4777B70l43KJ96j78J56M0k23l8L4l7m2J59q6L91k58K18j42l53K39mJ83k97P5n8
4801i6L76k98l11M28k50L26j44J02l20K42jO4j70J71j49N7K44j91k29K54K0j45
$$ plain form
4637 47 -5 100 320 61 43 240 165 72 176 -56 430 196 156 129 72 10 -156 -31 -257 261 7 -35 -52 -51
4661 -51 195 -93 60 143 51 36 -33 -135 84 77 -89 -101 -157 208 -9 24 -66 69 243 -36 -195 -79 -38 31
4685 31 -269 -114 -169 -220 207 34 97 -111 208 140 -140 143 56 45 41 190 -164 -200 6 -55 158 79 -71 -17
4709 -17 10 -30 179 119 -12 -48 -271 -155 25 77 181 -108 -41 20 -149 -65 -48 -300 -130 96 -59 -58 -21 -204
4733 -204 190 79 -141 56 -246 248 -72 130 69 203 -70 -215 -28 -178 -120 102 -251 -47 163 111 -191
4754 -191 -52 89 110 -79 -301 -15 39 147 -140 219 -58 -17 78 -20 151 54 -3 96 84 141 -223 96 270
4777 270 -73 -71 125 -53 103 143 -80 -118 -84 -121 -163 -4 -90 301 43 261 119 -234 5 1 184 -113 -38 -96
4801 -96 280 -18 -329 99 -151 175 31 133 -187 55 54 118 -52 119 -30 27 271 80 -149 105 125 -20
4823b0m0KJ24m7P1J23j40k25J79j6J08j89j09K82p0K03k21k4l18N69j00j70Lo1
4847h6j1R4k0J06K78l50k3Ok39L92l01J90P1o8j12J82L4l8M0j61k41L37O8k10
4871f2OL38l20J63o7J37k15J2J01j99K0j9K30Rk11j15L68k40p1j36m9L01j19K92
4895A54J0k79n4J18p9Q1k2Q3J25k51K5O5J90k18J55K30j05j67q6Q4o3j38n2K01
4919GQ6r2j3k16K13K10nr1m9j13O3J41n3m3J7J7J00j84j9K31j2k15K3J50j15j12
4945g4J00p9r9K1M2K84l96K22k94K46n0K82m5j63j63M10q4l7k21N9Q5J27k26J84
4969A31J17m20J68j03J06j71J33L9j41o5J88o5K18k21p0J71j55J84n5k37m6L49
4991E5PJ70m45L30l22M1L34k59J23K10j84q6J35k34K52k57J89k07k50K07L99l77
$$ plain form
4823 -20 -60 -58 66 19 90 213 73 -152 27 11 119 -70 -179 103 33 236 15 -9 -327 242 142 -28 -25 -86
4847 -86 -97 -3 -23 83 361 11 -12 -6 -245 147 -154 36 107 39 -73 109 143 105 145 -16 -257 80 148 -62
4871 -62 -56 282 -38 125 58 195 -20 -8 93 -106 -86 -105 125 134 -77 -192 176 -64 -135 -271 -320 -19 -138 154
4895 154 164 -115 -169 -51 -130 -49 -71 12 137 -114 -89 -24 166 -52 103 333 228 61 -25 59 -4 -142 -194 7
4919 7 93 1 -12 -228 -15 195 190 99 50 -63 0 141 88 45 62 79 179 -5 -24 207 195 -20 3 153 38 -74
4945 -74 26 -53 -152 -131 -89 195 -201 21 -273 -27 -77 205 160 -3 -166 244 160 123 -98 -39 46 173 -53 131
4969 131 248 -172 -4 -107 -1 -172 -39 0 -141 -206 -18 -83 135 -86 -156 15 -140 44 -11 -248 -294 55
4991 55 62 232 -213 117 -205 -164 170 -89 34 244 60 -26 109 -125 127 -130 59 -148 -398 -191 208 -169
5013a69n2K97k30J93j57J37k20N65k80k3J87l78J7L9j43K44J24k14p4L12L3k58
5035e0L5L34l77k8K72p9p2n9J20q7n0j25J56k99M59k68J00k8q5K3J28K21m32J52
5059c9N6k22m5J36M3L02j73q3r8J99J98l41p5Q7L29l06J15J9j19J19L0k19k1K9
5083g9J41q0q0K05k17J58RJ62k59J23j0l16O7o9J29l3M36p2j20M1J18l40j07M26
5107B33j45j95N2J59r1J17k49J55j55l6J89j09L4k8J37M9J62q5j98k36K18j48
5129a70L62l45L31jk30p2j55M16j14j9j57J98k27K40j09j17K54m5L1k08N6k5K32
5152A26j68q0j05J64J82j12K8k30M82q6j52lk81L72Kj12j12J20nJ76o8l53P1o4
5176b08J79N2J25j14K8o1o0k5K12k14n7J13O1p2kj06K7K65M0j88K38j15j90O0
$$ plain form
5013 -169 -221 76 -154 39 -118 19 -201 364 84 61 248 -130 -113 -74 -217 27 151 -63 -137 175 208 -50
5035 -50 -15 319 -58 -86 186 107 35 -24 96 9 -41 -166 -10 -309 150 -118 -18 -46 -131 -108 20 241 -191 -39
5059 -39 17 -205 -250 -114 -71 231 58 -25 -123 76 274 -67 -142 -55 274 -32 83 102 -17 102 132 -87 -108 -79
5083 -79 62 -18 -98 107 -110 48 57 219 -40 83 73 -243 -176 -245 -116 -149 287 215 95 136 254 -86 -193 233
5107 233 88 -107 -55 104 13 130 -119 36 -119 -155 34 -75 -41 -69 68 117 279 194 -4 -240 -22 -170
5129 -170 192 -153 178 177 -53 -125 -280 136 22 3 -154 44 -183 57 -52 -169 85 40 71 -137 -81 -106 126
5152 126 -42 -122 -227 -63 119 7 35 -195 287 201 49 46 -235 137 139 27 -85 35 30 206 138 -215 -144 -208
5176 -208 -29 23 148 34 62 1 -59 -84 128 -86 -143 -30 31 -41 -43 -149 -122 143 183 -5 233 118 -72 -12
5200a2N9o2j15L7K17k6k34K50j70O8j27J14m6Q4P9l2j52J22j8N8j19M79m53QJ09
5225A18p7l22L60k91K16j29N1q5Q0n1P7J98m94N2K44J62k40K04j96J21O8n7J19
5248A28j29Q4l69L41j20L04j68j96J82PK03l88J93k17J85K13k09P8j25j77R5p8
5270a63J30J48j23l2Q0j11J76j27j95j98K22L13j11O3K67j52k18J47m6j43N5O
5292a2m3K18j28p3lN5lj31LJ73o4L1j8j10J68q2j17k8oP5j08K69j35K88k40P9
5318E8n8M8J9R9l04J32P2m6p5L32l10L7j79L3J83j01j75J8K79n2J04K6n3m6J24
5343A65j00n1j34K71k67K49j51J2j91M67k06j17m1J81k9q7j54K68P1Nj83l9k5
5366h6J52M2nk41L50m90O1L75k26k2n8J0J42K01k06m7R0J41m71M06l2n4k8R0M5
$$ plain form
5200 -12 47 -15 -130 -93 124 98 -136 114 -56 12 -115 -1 -47 37 116 84 -68 54 36 94 -25 454 1 9 118
5225 118 41 -281 79 -212 4 -125 -74 -159 -79 -130 -53 145 -349 -297 -53 109 -131 73 -123 -2 66 9 128
5248 128 -1 83 -286 55 -65 239 71 -125 57 64 267 -121 72 -145 40 253 44 122 -3 -180 -85 -163
5270 -163 -33 115 -8 -40 40 -71 105 -22 -217 -415 -193 120 9 72 339 187 -31 116 70 -73 -18 -12
5292 -12 -55 163 35 -38 -41 14 11 -120 -117 56 -8 23 5 -105 63 -19 -136 -164 -170 -95 -203 66 -69 219 -21 58
5318 58 0 48 67 166 -138 -6 66 20 -55 277 -33 4 -175 -142 41 -60 -235 -217 62 10 114 140 87 41 165
5343 165 65 14 -120 151 -116 133 -18 -6 -197 270 64 -53 -94 87 58 -29 -183 85 156 161 -22 -61 -86
5366 -86 66 108 103 -138 212 -278 -217 158 -68 -90 -148 -138 4 205 -1 -48 42 183 -288 118 86 32 4 94 139
5391A39j95l0o7K3K93l18J59n0Q6J4K2j49J05j60L0J68k49j62M32j67L6L32j66
5414A26k95K01Qj05nK13l0k47K63l55M02l7l93K38j37O2j92K37J70k21O6j85J17
5437i9J16k44L02k20L05j55l2J94Nj30n8J19k13L9J1P1l4P1k24K35k1J73k61p3
5461a23%L27l04K44j86p5N2J5R2J9M9l3j81K49j23j47J28r9K29j52lJ11K11k37
5485F3j72R1J84l07K96j40J44l04q3RN60l83k6l5J62j91L19j66n2L76j83p0j30
5508c8Q0J64j53P1j54L29l76O6O8J28j32qj45J32j36J41q2L9j1j9o8n3K37l39
5532b59K44K10m00J80o8N2J96k03k9mK21j04m0p0k8K4M2k0K11j81qJ4m2K75j82
5557C1k7l17N51k48J22j58o0L5K79j65K15o0l13K6J3LlJ05%J26J62l01M3k04J23
$$ plain form
5391 139 -56 -86 -153 -130 163 -155 4 -46 40 54 76 -73 32 -128 -98 70 -179 -341 91 -76 -40 292 126
5414 126 -169 32 40 -65 -70 143 113 -134 129 -226 176 139 -254 -16 -153 -91 -283 -46 124 -97 -31 -216 -99
5437 -99 17 -227 75 -145 160 5 -27 167 172 42 -16 103 -110 -71 -60 11 -23 48 -176 59 38 211 -50 -123
5461 -123 -123 204 -100 144 -42 -117 -65 -50 42 61 110 77 -104 145 22 -125 3 -96 133 -19 -22 89 300 63
5485 63 -109 -18 166 -141 155 15 159 -145 -228 -219 341 -42 -68 -103 59 -132 187 21 -31 345 162 92 -38
5508 -38 42 206 53 124 -30 299 -77 -11 57 185 53 45 -100 32 -104 37 -45 -6 -17 -36 -104 -157 80 -259
5532 -259 -15 195 -205 -25 -93 -41 155 -48 -77 -81 140 36 -4 -74 -102 -78 -36 -56 155 -26 -34 -20 -62 213 31
5557 31 4 -313 238 -10 112 -46 -106 -71 208 43 258 198 -115 -89 -76 -73 -76 29 29 155 317 16 59 -145 -22
5582b2K28q7K1p9j7j99K49m90N81k26K91j02j2n27J90J0l6M04p3m9k8J36l53P6
5606a14P6J63p6l15K80k13M25k87O2OK8p7R7j49J86n0q7K95j27l8j72J64j55M7
5630c1M4J3Kj57K95N9jk01rm8J7k02L64j45k11J83P7j48J45r5n1J24j67K50n0
5655E7j97q0K69l52K85j29J56j24j8L2O8o2J47J78m71L20k56J56K9MJ30r5k24
5678a77J34p9J17j33L7m6Q7M4j87J08jP9o0R6j7L08k84m0Q8k24j7M85k96j89K15
5703D8j72K67l51M08j80l3J46n6k03L51n04K18P9j9j88J56P2l5K05j01k69K99
$$ plain form
5582 -22 206 119 140 61 44 -155 94 -396 185 -41 250 148 136 -391 -201 -191 -227 177 104 55 27 163 -190 -114
5606 -114 -38 125 49 -266 14 -199 226 -61 1 7 35 -42 55 -94 92 42 -45 250 123 85 -87 77 -78 -31
5630 -31 13 26 28 -129 166 225 224 23 14 -34 -17 -219 145 0 -211 -28 49 -99 46 -49 -100 24 -143 107 57
5655 57 -140 -220 49 -303 -18 -147 9 -115 -133 -101 -33 -95 52 230 -241 79 -177 -21 8 12 142 47 -177
5678 -177 -43 -122 -5 -138 -101 -147 -60 -16 -203 -95 -96 -17 -77 19 2 310 26 -14 74 -150 -167 318 22 -167 48
5703 48 -124 143 -208 200 20 -13 133 77 -126 225 -279 -61 18 -1 -189 -33 39 4 209 108 -161 138
$$ [...]
8191G0
##END NTUPLES=NMR FID
##END=
