##TITLE=1H_LR-758-R4-KA5-M3
 CDCl3
 8 sc, 
 21.12.2023
##JCAMPDX= 6.0         $$ Bruker NMR JCAMP-DX V2.0
##DATA TYPE= NMR FID
##DATA CLASS= NTUPLES
##ORIGIN= UXNMR, Bruker Analytische Messtechnik GmbH
##OWNER= root
$$ XWIN-NMR		Version 3.5
$$ Thu Dec 21 12:42:53 2023 Russian Standard Time (UT+4h)  she@DPX200
##.OBSERVE FREQUENCY= 200.1313
##.OBSERVE NUCLEUS= ^1H
##.DELAY= (6, 6)
##.ACQUISITION MODE= SIMULTANEOUS
##.ACQUISITION SCHEME= undefined
##.AVERAGES= 8
##.DIGITISER RES= 18
##SPECTROMETER/DATA SYSTEM= spect
##.PULSE SEQUENCE= zg30
##.SOLVENT NAME= CDCl3
##.SHIFT REFERENCE= (INTERNAL, CDCl3, 0, 15.7039)
##AUDIT TRAIL= $$ (NUMBER, WHEN, WHO, WHERE, WHAT)
$$ ##TITLE= Audit trail, XWIN-NMR		Version 3.5
$$ ##JCAMPDX= 5.01
$$ ##ORIGIN= Bruker BioSpin GmbH
$$ ##OWNER= she
$$ F:/spectra/data/she/nmr/H-F/1/audita.txt
$$ ##AUDIT TRAIL=  $$ (NUMBER, WHEN, WHO, WHERE, WHAT)
(   1,<2023-12-21 12:41:13.32 +0400>,<she>,<DPX200>,
      <created by zg, POWCHK disabled, PULCHK disabled
       configuration hash MD5:
       00 E9 B6 7A A2 85 ED C7 34 08 36 98 17 FE 4E 26
       data hash MD5: 16K
       8F 1C E8 7A 52 08 05 74 2E 35 A1 D5 38 DB E3 80>)
$$ ##END=
$$ 
$$ hash MD5
$$ AA E3 FE 3C 7F DE 6E 76 B5 97 F9 D1 D6 68 2D 55
##$RELAX= 
##$RELAX= 
##$RELAX= 
##$RELAX= 
##$RELAX= 
##$RELAX= 
$$ Bruker specific parameters
$$ --------------------------
##$DU= <F:/spectra>
##$EXPNO= 1
##$NAME= <H-F>
##$PROCNO= 1
##$TYPE= <nmr>
##$USER= <she>
##$AMP= (0..31)
100 100 100 100 100 100 100 100 100 100 100 100 100 100 100 100 100 100 
100 100 100 100 100 100 100 100 100 100 100 100 100 100 
##$AQSEQ= 0
##$AQ_mod= 1
##$AUNM= <au_zg>
##$AUTOPOS= <>
##$BF1= 200.13
##$BF2= 200.13
##$BF3= 200.13
##$BF4= 200.13
##$BF5= 200.13
##$BF6= 200.13
##$BF7= 200.13
##$BF8= 200.13
##$BYTORDA= 1
##$CFDGTYP= 0
##$CFRGTYP= 5
##$CHEMSTR= <none>
##$CNST= (0..31)
1 1 145 1 1 1 1 1 1 1 1 1 1 1 1 1 1 1 1 1 1 1 1 1 1 1 1 1 1 1 1 1 
##$CPDPRG= <>
##$CPDPRG1= <>
##$CPDPRG2= <>
##$CPDPRG3= <>
##$CPDPRG4= <mlev>
##$CPDPRG5= <mlev>
##$CPDPRG6= <mlev>
##$CPDPRG7= <mlev>
##$CPDPRG8= <mlev>
##$CPDPRGB= <>
##$CPDPRGT= <>
##$D= (0..31)
0 1.2 0 0 0 0 0 0 0 0.06 0 0.03 0 0 0 0 0.0002 0 0 0 0 0 0 0 0 0 0 0 0 
0 0 0 
##$DATE= 1703148072
##$DBL= (0..7)
120 120 120 120 120 120 120 120 
##$DBP= (0..7)
150 150 150 150 150 150 150 150 
##$DBP07= 0
##$DBPNAM0= <>
##$DBPNAM1= <>
##$DBPNAM2= <>
##$DBPNAM3= <>
##$DBPNAM4= <>
##$DBPNAM5= <>
##$DBPNAM6= <>
##$DBPNAM7= <>
##$DBPOAL= (0..7)
0.5 0.5 0.5 0.5 0.5 0.5 0.5 0.5 
##$DBPOFFS= (0..7)
0 0 0 0 0 0 0 0 
##$DE= 6
##$DECBNUC= <off>
##$DECIM= 32
##$DECNUC= <off>
##$DECSTAT= 4
##$DIGMOD= 1
##$DIGTYP= 9
##$DL= (0..7)
0 120 120 120 120 120 120 120 
##$DP= (0..7)
150 150 150 150 150 150 150 150 
##$DP07= 0
##$DPNAME0= <>
##$DPNAME1= <>
##$DPNAME2= <>
##$DPNAME3= <>
##$DPNAME4= <>
##$DPNAME5= <>
##$DPNAME6= <>
##$DPNAME7= <>
##$DPOAL= (0..7)
0.5 0.5 0.5 0.5 0.5 0.5 0.5 0.5 
##$DPOFFS= (0..7)
0 0 0 0 0 0 0 0 
##$DQDMODE= 0
##$DR= 18
##$DS= 0
##$DSLIST= <SSSSSSSSSSSSSSS>
$$ [...]
##$SUBNAM2= <"">
##$SUBNAM3= <"">
##$SUBNAM4= <"">
##$SUBNAM5= <"">
##$SUBNAM6= <"">
##$SUBNAM7= <"">
##$SUBNAM8= <"">
##$SUBNAM9= <"">
##$SW= 18.0517328524113
##$SWIBOX= (0..15)
0 0 2 0 0 0 0 0 0 0 0 0 0 0 0 0 
##$SW_h= 3612.71676300578
##$TD= 16384
##$TD0= 1
##$TE= 0
##$TE2= 300
##$TE3= 300
##$TEG= 300
##$TL= (0..7)
0 120 120 120 120 120 120 120 
##$TP= (0..7)
150 150 150 150 150 150 150 150 
##$TP07= 0
##$TPNAME0= <>
##$TPNAME1= <>
##$TPNAME2= <>
##$TPNAME3= <>
##$TPNAME4= <>
##$TPNAME5= <>
##$TPNAME6= <>
##$TPNAME7= <>
##$TPOAL= (0..7)
0.5 0.5 0.5 0.5 0.5 0.5 0.5 0.5 
##$TPOFFS= (0..7)
0 0 0 0 0 0 0 0 
##$TUNHIN= 0
##$TUNHOUT= 0
##$TUNXOUT= 0
##$USERA1= <user>
##$USERA2= <user>
##$USERA3= <user>
##$USERA4= <user>
##$USERA5= <user>
##$V9= 5
##$VALIST= <valist>
##$VCLIST= <CCCCCCCCCCCCCCC>
##$VD= 0
##$VDLIST= <DDDDDDDDDDDDDDD>
##$VPLIST= <PPPPPPPPPPPPPPP>
##$VTLIST= <TTTTTTTTTTTTTTT>
##$WBST= 1024
##$WBSW= 4
##$XGAIN= (0..3)
0 0 0 0 
##$XL= 0
##$YL= 0
##$YMAX_a= 385425
##$YMIN_a= -407818
##$ZGOPTNS= <>
##$ZL1= 120
##$ZL2= 120
##$ZL3= 120
##$ZL4= 120
##$ABSF1= 10
##$ABSF2= 0
##$ABSG= 5
##$ABSL= 3
##$ALPHA= 0
##$AQORDER= 0
##$ASSFAC= 0
##$ASSFACI= 0
##$ASSFACX= 0
##$ASSWID= 0
##$AUNMP= <proc_1d>
##$AZFE= 0.1
##$AZFW= 0.1
##$BCFW= 1
##$BC_mod= 2
##$BYTORDP= 1
##$COROFFS= 0
##$CY= 11.3945322036743
##$DATMOD= 1
##$DC= 2
##$DFILT= <>
##$DTYPP= 0
##$F1P= 15.7292609196834
##$F2P= 12.9074282941183
##$FCOR= 0.5
##$FTSIZE= 0
##$FT_mod= 4
##$GAMMA= 1
##$GB= 0.15
##$INTBC= 1
##$INTSCL= 1
##$ISEN= 128
##$LB= 0.24
##$LEV0= 0
##$LPBIN= 0
##$MAXI= 10000
##$MC2= 0
##$MEAN= 0
##$ME_mod= 0
##$MI= 1.114404
##$NCOEF= 0
##$NC_proc= 0
##$NLEV= 6
##$NOISF1= 3.799351
##$NOISF2= 2.8
##$NSP= 1
##$NTH_PI= 0
##$NZP= 0
##$OFFSET= 15.70392
##$PC= 1
##$PHC0= -24590.24
##$PHC1= 10.05273
##$PH_mod= 1
##$PKNL= yes
##$PPARMOD= 0
##$PSCAL= 0
##$PSIGN= 0
##$REVERSE= no
##$SF= 200.130013532006
##$SI= 16384
##$SIGF1= 3
##$SIGF2= 2
##$SINO= 400
##$SIOLD= 16384
##$SREGLST= <1H.CDCl3>
##$SSB= 0
##$STSI= 0
##$STSR= 0
##$SW_p= 3612.71676300578
##$SYMM= 0
##$S_DEV= 0
##$TDeff= 0
##$TDoff= 0
##$TI= <>
##$TILT= no
##$TM1= 0
##$TM2= 0
##$TOPLEV= 0
##$USERP1= <user>
##$USERP2= <user>
##$USERP3= <user>
##$USERP4= <user>
##$USERP5= <user>
##$WDW= 1
##$XDIM= 8192
##$YMAX_p= 0
##$YMIN_p= 0
$$ End of Bruker specific parameters
$$ ---------------------------------
##NTUPLES= NMR FID
##VAR_NAME=  TIME,          FID/REAL,        FID/IMAG
##SYMBOL=    X,             R,               I
##VAR_TYPE=  INDEPENDENT,   DEPENDENT,       DEPENDENT
##VAR_FORM=  AFFN,          ASDF,            ASDF
##VAR_DIM=   8192,          8192,            8192
##UNITS=     SECONDS,       ARBITRARY UNITS, ARBITRARY UNITS
##FACTOR=    0.0002768,     1,               1
##FIRST=     0,             0,               0
##LAST=      2.2672688,     0,               0
##MIN=       0,             -407818,         0
##MAX=       2.2672688,     385425,          0
$$ Real data points
##PAGE= N=1
##DATA TABLE= (X++(R..R)), XYDATA
0@%%%%%%%%%%%%%%Qj6J6j6J6k3L1l2L7m5N3o1P1q1R2j07J22j38J54j74J98k21
$$ 0 0 0 0 0 0 0 0 0 0 0 0 0 0 0 8 -8 8 -8 8 -15 16 -16 21 -24 29 -32 39 -42 50 -57 65 -73 81 -93 105 -116
36a16K46k75L07l42L79m21M66n14N68o26O90p61Q39r22J013j117J235j364J508
$$ -116 130 -145 162 -180 199 -222 244 -270 298 -328 362 -399 440 -482 531 -586 649 -715 793
55G93j675J866k088K351k663L044l524M145m980O163p956J0953j6818L2114j38489
$$ 793 -882 984 -1104 1247 -1416 1628 -1896 2249 -2731 3432 -4524 6429 -10389 21725 -116764
70a16764k91054M97749J44643l66322J81192L35981l39834k35843L29935P2846
$$ -116764 -407818 89931 234574 -131748 49444 385425 45591 -190252 139683 212529
80B12529k59299R0121J67066j80291r9412J57816k6875j71529M3118J29309n3387
$$ 212529 -46770 43351 210417 30126 -69286 88530 61655 -109874 -66756 62553 9166
91I166r1436O2296O1650j04567m5583J51450K5413j71522L7306J70839r1948r5476
$$ 9166 -82270 -19974 41676 -62891 -108474 42976 68389 -103133 -65827 105012 13064 -82412
103h2412J80040J0718k29820O4355J91103j46923q6224K18181k7032k25590J17540
$$ -82412 97628 108346 -121474 -57119 133984 -12939 -99163 119018 91986 -133604 -16064
114a6064J43250k00784n7295K05789k8745j44249R9175O1513j37661j2604J04898
$$ -16064 127186 -73598 -130893 74896 46151 -98098 1077 62590 -75071 -87675 17223
125A7223k6104m0565N6816p32n3331J7157K8185n394Q001O047j324K190k1403
$$ 17223 -8881 -49446 7370 6638 -46693 -29536 -1351 -6745 1256 7303 5979 8169 -13234
138a3234J612M1116j9946l3334N7571J1864q5675J1137O5288o1199l5968R2726
$$ -13234 -11622 29494 9548 -23786 33785 45649 -40026 -28889 36399 -24800 -60768 31958
150C1958l086q4904M9855M2730r1626J3902J05809n6670o8863R1641J7508q6582
$$ 31958 28872 -56032 -6177 36553 -55073 -41171 64638 7968 -60895 30746 48254 -38328
162c8328M9925P4957q3346n2188P1189M255n1761L2700L5620m4323k7386J6096
$$ -38328 11597 86554 3208 -48980 22209 26464 -25297 7403 43023 -1300 -28686 -12590
174a2590j831o556N159M774J0019l282j2830J3899K397k4935K4301L7446l5204
$$ -12590 -14421 -20977 -15818 -11044 -1025 -4307 -17137 -3238 -841 -25776 -1475 35971 767
187G67j7289M4942j2604l9057M9150K7372o7146m361N6646l6662l9414O3702J0026
$$ 767 -16522 28420 15816 -23241 25909 53281 -13865 -18226 38420 1758 -37656 26046 36072
200C6072o5879K1177M0480n2729j5300N3156j6534l9827L9667K2887m2217l413
$$ 36072 -29807 -8630 31850 -20879 -36179 16977 443 -39384 283 23170 -19047 -22460
212b2460K8234j7075j5784K4821O177j4672O531Q518n608J283L349R20L750o856
$$ -22460 5774 -11301 -27085 -2264 3913 -10759 -4228 4290 -1318 -35 3314 4234 7984 1128
226A128k315J6057P99j1580J1042K226k2260M910J7149k1569j4333K6884J042
$$ 1128 -1187 14870 15669 4089 15131 17357 -4903 7 17156 -4413 -18746 8138 9180
239I180k5134J6684J6017l3480q436K8605j0313j3202L2160O615l0436O839K1040
$$ 9180 -15954 730 16747 -16733 -25169 3436 -6877 -20079 12081 18696 -11740 -4901 16139
252A6139j5922o906J8645o104j7169J5166J3181j3510k852P660j1314j0084P683
$$ 16139 217 -6689 11956 5852 -11317 3849 17030 3520 668 8328 -2986 -13070 -5387
265e387N627J339K637j386N11K24n614K90L796l854K445J4929j244j7015n44Q056
$$ -5387 240 1579 4216 2830 3341 3565 -2049 -1759 2037 -1817 628 15557 14313 -2702 -3246 4810
281D810o642k26J2953p698j6171R849J0279r978J271Q639j0688o964J4174O906
$$ 4810 -1832 -2058 10895 3197 -12974 -3125 7154 -2824 -1553 7086 -3602 -10566 3608 10514
295A0514o868m586j426k680M790J1087J82j0761q217k293M083O165l68n06L821
$$ 10514 3646 -940 -2366 -5046 -256 10831 11013 252 -7965 -10258 -6175 -10 -378 -884 2937
310B937l803l610N744k227q151O548J0876j70L218M976j0281j2484O017R145l148
$$ 2937 -866 -4476 1268 -959 -9110 -2562 8314 8144 11362 16338 6057 -6427 -410 8735 5587
325E587k613K136n248o33R575l768j4547m936J416M980J0580N391n370o563m502
$$ 5587 2974 5110 -138 -771 8804 5036 -9511 -14447 -13031 -8051 2529 7920 2550 -4013 -8515
340h515n52N612P545n21l226J952J643j482K506j715q726K757J0718k175o095
$$ -8515 -9067 -3455 4090 3569 343 2295 3938 2456 4962 3247 -5479 -2722 7996 5821 -274
355b74o68l949O8J0289M528p177m391k6k635P19N133j17l695L280K592m114j051
$$ -274 -942 -4891 -4823 5466 9994 2817 -1574 -1600 -4235 -3516 1617 1500 -2195 1085 3677 -437 -1488
372a488k839r502k63J1019O964L156m78p590p163K204M835L585K700K926J994
$$ -1488 -4327 -13829 -14092 -3073 3891 7047 6569 -1021 -8184 -5980 -1145 2440 5140 8066 10060
387A0060r92k352l553k804j761j290K701M596k423l937K73n439l447P315J582
$$ 10060 9068 6716 3163 359 -1402 -2692 9 4605 2182 -1755 -1482 -6921 -10368 -3053 -1471
402a471q052K211Q892N50O55L844n335q714M705R141j140j619K547o440q276K905
$$ -1471 -9523 -7312 1580 2130 2785 6629 1294 -7420 -2715 6426 5286 3667 6214 -226 -8502 -5597
418e597L663j313n79k806l635J256J278J310Q40j132K034P323J369o572k337K775
$$ -5597 -1934 -3247 -3826 -6632 -10267 -9011 -7733 -6423 -5583 -6715 -4681 2642 4011 -2561 -4898 -2123
434b123J237M543J0260J97j0060k205K19o780K604J0427p28l111K900k042n582
$$ -2123 -886 3657 13917 14114 4054 1849 2068 -4712 -2108 8319 7591 4480 7380 5338 -244
449b44q38j596k788M637O531j915m658j294l090r81K992j505l973L174J106j656
$$ -244 -1082 -2678 -5466 -829 5702 3787 -871 -2165 -5255 -6236 -3244 -4749 -8722 -5548 -4442 -6098
465f098P475M884n753n08L997m377P69J0744M147m617k90r9m929j792J033n626
$$ -6098 1377 6261 508 0 3997 -380 389 11133 15280 10663 10373 10274 5345 3553 4586 -1040
481a040k989K680m891o807L340l32o008M71kk606L749L368j593M940Q360N72q65
$$ -1040 -4029 -1349 -6240 -13047 -9707 -10039 -16047 -15576 -15578 -18184 -14435 -11067 -12660 -7720 640 1212 347
498C47L520k402n338R007J1475k863n141O49l903m923L372L032N51k243p489k144
$$ 347 3867 1465 -3873 5134 16609 13746 8605 9254 5351 428 3800 6832 7383 5140 -2349 -4493
514d493P092Q25m355J340J295m957K014N858n354n605P032M780k637K644j680
$$ -4493 2599 3424 -931 409 1704 -3253 -1239 4619 -735 -6340 692 5472 2835 5479 3799
529C799j1988k40J0479J072K73M670m206p955J918L088L44K343j149n647K848
$$ 3799 -8189 -8429 2050 3122 3395 8065 3859 -4096 -2178 910 1254 3597 2448 -3199 -351
544c51O416l550o208K909O07m393J093J427j612L703L019p44L510j613j0297L6
$$ -351 6065 2515 -3693 -784 -177 -4570 -3477 -2050 -3662 41 3060 2316 5826 4213 -6084 -6048
560f048J0615J623j408O887l0j2848o373N048K504k51%l775r89K073m830l190
$$ -6048 4567 6190 4782 11669 11639 -1209 -7582 -2534 -30 -281 -281 -4056 -5045 -2972 -7802 -10992
576a0992O683J368l436O577M618n984o55N293J810N312Q913m540j1682j913P89
$$ -10992 -4309 -2941 -6377 200 4818 -1166 -1821 3472 5282 10594 19507 14967 3285 1372 2161
591B161r45R138P597j2760j3416J496Q59k858J834n83m649J414L137j62K140p1
$$ 2161 1216 10354 17951 5191 -8225 -6729 -5870 -8728 -6894 -7477 -12126 -10712 -7575 -7737 -5597 -5668
607e668m217N34P075L113m67K453J542L70O055L41r492k168M273K064O503O775
$$ -5668 -9885 -9351 -2276 837 370 2823 4365 4735 10790 11131 1639 -529 3744 5808 12311 19086
623A9086r056j1970P4L745R82K912P58n544l077J779j118j280J679k766l877N527
$$ 19086 10030 -1940 -1866 1879 2861 5773 6531 987 -2090 -311 -1429 -2709 -1030 -3796 -7673 -2146
639b146L599m361j894R8k61O081N783l365m398o56l51L061Q198J104o699j986
$$ -2146 1453 -2908 -4802 -4704 -4965 1116 6899 3534 -864 -1520 -1871 1190 9388 10492 3793 1807
655A807J504l595j670L561k125m635K218R90l71J265l549n370J880M533qJ551
$$ 1807 3311 -284 -1954 1607 -518 -5153 -2935 -1945 -2316 -1051 -4600 -9970 -8090 -3557 -3565 -2014
671b014K379o65J140M617j497o136j337J878N67N092N963m944o945k156m010j500
$$ -2014 365 -300 840 5457 3960 -2176 -3513 -1635 -1068 4024 9987 5043 -1902 -4058 -8068 -9568
687i568P772L512l850j161Q19j017O22K348l38r63K983K107O7L53j12r61J923
$$ -9568 -1796 1716 -2134 -3295 -2476 -3493 -2871 -523 -861 -1824 1159 3266 3333 3686 3574 2613 4536
704D536Q17l388M35M07m475o3N262p54l625N09j323l334L142L338l407l466L625
$$ 4536 5353 1965 2400 2807 -1668 -1731 3531 2777 -848 -339 -1662 -4996 -1854 1484 -1923 -5389 -1764
721a764K353j229K138k06m745r09L525r9L03J933o55k45J4j589P0Q75j255l70
$$ -1764 589 -640 1498 1292 -3453 -4362 -837 -936 -633 1300 645 400 414 -1175 -1105 -230 -1485 -1855
739a855M123L710k120k268n95k308r87L688N64k374R67J67l166n34R76j913l4
$$ -1855 2268 5978 3858 1590 995 -1313 -2300 1388 1952 -422 545 712 -2454 -2988 -2012 -3925 -3959
756c959R64o27n20K537K236l88q59M04P6L08M82p64J652L449p84j832L20k440
$$ -3959 -2995 -3622 -4142 -1605 631 243 -616 -212 -136 172 654 -110 1542 4991 4207 2375 2695 255
774B55k872J699Q91j105J771J315k068j532J513L25j730L17P82o37K474L007j837
$$ 255 -2617 -918 -27 -1132 639 1954 -114 -1646 -133 192 -1538 -1221 -439 -1076 1398 4405 2568
791B568k508M21j290q84P87n78l72J775k99j624M61N27p14q40J495Q24l82K138
$$ 2568 60 481 -809 -1693 -906 -1484 -1856 -81 -380 -2004 -1543 -1016 -1730 -2570 -1075 -251 -633 1505
809A505R20k001P06K755j381k590k70r55m76J527N57j00r48r47o38j133j74J216
$$ 1505 2425 424 1130 3885 2504 -86 -356 -1311 -1787 -260 297 197 -751 -1698 -2336 -3469 -3643 -2427
827b427K068N38J09K665K532k557l173O43N45o34M297J916m844j887K006k203
$$ -2427 -359 179 288 2953 5485 2928 -245 398 943 309 4606 6522 1678 -209 1797 -406
843d06l489N99Q14j283J359L775l84l327Q4p95j567L748M244L0j320j030J05Q43
$$ -406 -3895 -3296 -2482 -3765 -2406 1369 985 -2342 -2258 -3053 -4620 -872 3372 3402 2082 1052 1157 2000
861B000p08j060L23M05O71R70j167l095q65K445J332p38L98r69l397l07L704R03
$$ 2000 1292 232 555 960 1631 2601 1434 -1661 -2526 -81 1251 513 911 -58 -3455 -3762 -58 845
879H45l14J114l170l112J433J422r12l12J788J146J767J171j698k912J055J820
$$ 845 531 1645 -1525 -4637 -3204 -1782 -2694 -3006 -1218 -72 1695 2866 1168 -1744 -689 1131
895A131J129K770K742k240p10J056k134k261O46j484j809J319K383j013l567k394
$$ 1131 2260 5030 7772 5532 4822 5878 3744 1483 2129 645 -1164 155 2538 1525 -2042 -4436
911d436j706r77J733K613q06Q3J432J183P8j215r92J895Q08O23K760M79l289r34
$$ -4436 -6142 -7119 -5386 -2773 -3579 -3496 -2064 -881 -803 -2018 -3010 -1115 -307 316 3076 3555 266 -668
929f68R32j841NL328p46m353P6L265p44o98K940o81k275K260J332k803N62K927
$$ -668 264 -1577 -1572 1756 1010 -3343 -3267 -2 -746 -1444 1496 815 -1460 800 2132 -671 -109 2818
947B818J83j67J169n18k399k153m77P55J879J589m47k167j500q15R78R18j821
$$ 2818 3001 2834 4003 3485 1086 -1067 -1544 -789 1090 2679 2232 65 -1435 -2250 -1272 -354 -2175
964b175M37K528J89k77Q00j576k354Q91P99r6J362K027r71j268J226K07k096J64
$$ -2175 -1738 790 979 702 1502 -74 -2428 -1537 -738 -834 528 2555 1584 316 1542 1749 -347 -183
982a83Q06J19K698K294k471k551K72j099j15K273j783l405R87M19j623j80J936
$$ -183 623 742 3440 5734 3263 712 984 -115 -230 2043 260 -3145 -2158 -1739 -3362 -3542 -1606
999a606j293k466L62J248l04J419K515L93Q46J461m29n86l06m07K071J947j069
$$ -1606 -2899 -5365 -5003 -3755 -4059 -2640 -125 268 1114 2575 2146 1560 1254 847 2918 4865 3796
1016C796n62q8k435j423L88r82k066J034J041k618J75L398j033l569J648N30j648
$$ 3796 3234 3146 711 -712 -324 -1306 -3372 -2338 -1297 -3915 -3740 -342 -1375 -4944 -3296 -2766 -4414
1033d414K712K762j473N03K449r08k567M09J011n99J358K236l62j106R0j526m18
$$ -4414 -1702 1060 -413 90 2539 1631 -936 -527 484 -115 1243 3479 3117 2011 2101 575 157
1050A57J060N63R17Q93k617j672K643Q04k280k18l54k904O82J616j04L50Q50j116
$$ 157 1217 1780 2697 3590 973 -699 1944 2748 468 250 -104 -3008 -2326 -710 -814 -464 386 -730
1068g30k529J102R44j597J395L328r03l38J944k208k785K292J458l5O18j377k931
$$ -730 -3259 -2157 -1213 -2810 -1415 1913 1010 672 2616 408 -2377 -85 1373 1338 1956 579 -2352
1085b352J087K439r49j358Q20p49k896K704L403p08k10J067j683k09K061o02j037
$$ -2352 -1265 1174 225 -1133 -313 -1062 -3958 -1254 2149 1441 1231 2298 615 406 2467 1865 828
1102H28M2j31J284J273j866k881o53n08j037J423N78k086m88K874m73j572J735
$$ 828 870 739 2023 3296 1430 -1451 -2104 -2612 -3649 -2226 -1648 -3734 -4222 -1348 -1821 -3393 -1658
1119a658k72k957J652M241O10J162J415k738k184J763J090j862L66K438L5o75
$$ -1658 -1930 -4887 -3235 1006 1616 2778 4193 1455 -729 1034 2124 262 628 3066 3101 2426
1135B426Q5k374l151N88J373J598J856j778k490J33Q0J62K857O47l448j520K472
$$ 2426 2511 137 -3014 -2426 -1053 545 2401 623 -1867 -1734 -1654 -1492 1365 2012 -1436 -2956 -484
1152d84J205k71R65n63k163J577K332j994o57J187l74M81K416q11j797K61o58
$$ -484 721 450 1415 852 -1311 266 2598 604 -53 1134 760 1241 3657 2846 1049 1310 652
1169F52o32J352K65k711l74J635k11n59O34k842l377K536K632k98J725P85l043
$$ 652 20 1372 1637 -1074 -1448 187 -24 -583 51 -2791 -6168 -3632 -1000 -1298 427 1212 -1831
1186a831L89J665j164n94K576J088o53J270N75k944j647k56l20J236K649j227
$$ -1831 -1442 223 -941 -1535 1041 2129 1476 2746 3321 377 -1270 -1526 -1846 -610 2039 812
1202H12k124K21j49o80K166Qk422J452K564o65M16J439j546j272R37M58j554N54
$$ 812 -1312 -1091 -1240 -1920 246 254 -2168 -716 1848 1183 1599 3038 1492 220 1157 1615 61 615
1220F15J203k179o81J646k65j860j99m43K64J952m74j300J147O61q3J812O34k743
$$ 615 1818 -361 -1042 604 339 -1521 -1720 -2163 -1899 53 -421 -1721 -574 87 4 1816 2450 -293
1238b93j225P74M67J42K541N13k750j324K61j462M14K338n76m60K522Jk086p14
$$ -293 -1518 -744 -277 -135 2406 2919 169 -1155 -894 -2356 -1942 396 -180 -640 1882 1883 -203 -917
1256i17M87k3P18Q82l8n14m84k23m79N47p81j271O13O17q55J626J509j744j012
$$ -917 -430 -453 265 1147 1109 595 111 -112 -591 -44 -825 -2096 -1483 -866 -1721 -95 1414 -330 -1342
1275a342J254n29N66J935k38r18J445N67j703n97L49l89n91Q28n05r73M77m8q85
$$ -1342 -88 -617 -51 1884 1646 728 2173 2740 1037 440 789 400 -191 637 132 -841 -364 -412 -1297
1294a297J030J60j665M72P73p95J421J821q68j291J67N9j356K48O86o18L69J733
$$ -1297 -267 -107 -1772 -1300 -527 -1322 99 1920 1052 -239 -72 -13 -1369 -1121 -435 -1053 -684 1049
1312A049r76k287J167J3r27J230R16J2R23P59j128L43M37p44l46M64P3l68J564
$$ 1049 73 -2214 -1047 -1034 -1961 -731 185 197 1120 1879 751 1094 1531 787 441 905 978 610 2174
1331B174m42k343l1P28k067k06J501m27l76J741k98r42Q75N35j435l0R43O52L26
$$ 2174 1732 -611 -642 86 -1981 -2187 -686 -1113 -1489 252 -46 -988 -113 422 -1013 -1043 -100 552 878
1350H78M71l51j125N2l16j179j8L22j83Q67J205j682j77J069j029p36J971P27
$$ 878 1349 998 -127 -75 -391 -1570 -1588 -1266 -1449 -582 623 -1059 -1236 -167 -1196 -1932 39 766
1368G66J55O22M24r17m55R37l23j420R10J75q13L21k3j071L34J79r86K22K19l82
$$ 766 921 1543 1967 1050 595 1532 1209 -211 699 874 61 382 359 -712 -378 -199 -1185 -963 -744 -1126
1388a126r3J039J94j06O16o72j786P05J412k92NQ44o85q14J479n68j201N74R75
$$ -1126 -1219 -180 14 -92 524 -148 -1934 -1229 183 -109 -104 740 55 -759 720 152 -1049 -475 500
1407E00m46J364J072o97n73l59o77M8O40m41m8r1M72o02j68j040j756K02K104
$$ 500 54 1418 2490 1793 1220 861 184 232 872 431 383 292 764 162 -6 -1046 -2802 -2600 -496
1426d96R1l80J559l00j072J156L47p06N86J044k79r2J305o15j175m70o93l20M57
$$ -496 -405 -785 774 474 -598 558 905 199 785 1829 1550 1458 2763 2148 973 503 -190 -510 -53
1445e3P3j823m65Q30j57O76L13j414n04Q73L55j31J265J042o73L36Q02p09j423
$$ -53 20 -1803 -2268 -1438 -1595 -919 -606 -2020 -2524 -1651 -1296 -1427 -162 880 207 543 1345 636 -787
1464g87J074o86p03J861J252j752m23N0j445M95J122m95k10P47P12j19K51o47
$$ -787 287 -399 -1102 759 2011 259 -164 -114 -1559 -1064 58 -437 -647 100 812 693 944 297
1482B97q66J14J055j76M14J170r55j587P20J25r84P88M33j043L87J380m87r80
$$ 297 -569 -455 600 424 838 2008 1053 -534 186 311 -673 115 548 -495 -108 1272 785 -195
1500a95O0j05l3R35J41j088K03K82q51K99J035q88k85L13j114N1K499l6o33L43
$$ -195 -135 -240 -273 662 803 -285 -82 200 -651 -352 683 -205 -490 -177 -1291 -1240 1259 1223 590 933
1520I33O32n76M36O01p70m56J639K51q82m46o28j529o86P99q48L23J62r76k84
$$ 933 1565 989 1425 2026 1256 800 2439 2690 1808 1362 734 -795 -1481 -682 -1530 -1207 -1045 -2021 -2305
1539b305P35m65o05K9J35Q5K417J183r75j11N04n92o68J037K79j070J296M79j533
$$ -2305 -1570 -2035 -2640 -2611 -2476 -2391 26 1209 234 123 627 35 -633 404 683 -387 909 1388 -145
1558a45o5M35j656m07J180M3j22P29k83r09J084R60n76k10L5k99K90J544m51k73
$$ -145 -210 225 -1431 -1838 -658 -615 -737 -8 -291 -1200 -116 844 268 58 93 -206 84 1628 1177 904
1578I04Q45j317j621J532L23j110N97P48r43P4J641p52j411N51P11n81O14O42
$$ 904 1749 432 -1189 343 666 -444 153 901 -42 32 1673 921 -490 61 772 191 805 1447
1596A447j335j5J153j207p42R28j224p43J553N00k79N54m80j735J04J702K66m00
$$ 1447 112 97 1250 43 -699 229 -995 -1738 -185 315 36 590 110 -1625 -1521 181 447 47
1614D7O89k7j179J106M12j482n96Q85o60l0O21j39r49N12k83l49R94k20m69N38
$$ 47 736 709 -470 636 1048 -434 -1030 -145 -805 -835 -214 -353 -1302 -790 -1073 -1422 -428 -648 -1117 -579
1634e79J099M25Q41N13k138r06J483L83p68J149n20j761N37R55j628p24P55r22
$$ -579 520 945 1786 2299 161 -745 738 1121 353 1502 982 -779 -242 713 -915 -1639 -884 -1806
1652a806j51J387Q09p05j72K5m33Q21J215r32r94J083M64N70N54r04j637N3Q79
$$ -1806 -1957 -570 239 -466 -638 -613 -1046 -225 990 58 -936 147 611 1181 1735 831 -806 -753 126
1671A26m92J059J10r47n0Q29r1L7Q01o93j569J079J403m18l27J66j455l86J275
$$ 126 -366 693 803 -144 -194 635 544 581 1382 689 -880 199 1602 1184 857 1023 -432 -818 457
1690D57j193j361R46LJ69J647r6j744j72P58m38J039J677m88j147N23O59j101
$$ 457 -736 -2097 -1151 -1148 -979 668 572 -1172 -1344 -586 -1024 15 1692 1204 57 580 1239 138
1708A38O64K16j783p1J589j54q87R5o26k71M12K47o77N60M11l11Q40Q92p90q79
$$ 138 802 1018 -765 -836 753 599 -288 -193 -819 -1090 -678 -431 -1108 -548 -137 -448 392 1284 494 -385
1728c85Q46l83m55J635K06j853j19O94p12L7R49j300o47J540M76p98M59J024j033
$$ -385 461 78 -377 1258 1464 -389 -508 186 -526 -489 460 -840 -1487 53 529 -269 190 1214 181
1747A81J7J180n42o21P52k40j20R45m3j438k98q49m23Q69J366o93o13M36k52k69
$$ 181 198 1378 836 215 967 727 607 1552 1509 71 -227 -1076 -1499 -630 736 43 -570 -134 -386 -655
1767f55K97K35o60M95J241n13j96O20o46p52L19o53j92N23k71l01P77J87k65m86
$$ -655 -358 -123 -783 -288 953 440 244 864 218 -534 -215 -868 -1060 -537 -808 -1109 -332 -145 -410 -896
1787h96j56l13P85J275k30k78Q49K84j017N86P65j101p6O37r21m32J276k51r91
$$ -896 -1052 -1365 -580 695 465 187 1036 1320 303 889 1654 553 477 1114 193 -239 1037 786 -205
1806b05j20J46m61K24M52l49J80R72J83q89J50Nq30R36L51o38N64j3j035n29R53
$$ -205 -325 -179 -640 -416 36 -313 -133 839 1022 133 283 288 -542 394 745 107 671 658 -377 -906 47
1827D7n06n16Q68k35k9M67N08n08p42R17l28m04O74k02k29Q47k6j151J7k35n65
$$ 47 -459 -975 -107 -342 -371 96 604 96 -646 271 -57 -461 213 11 -218 629 603 -548 -531 -766 -1331
1848a331N52L63l76Q5O59k30p59Q97Q91r23M44J203o17k10J069l66q65L33j63
$$ -1331 -779 -416 -792 -707 -48 -278 -1037 -140 751 -172 272 1475 858 648 1717 1351 486 819 656
1867F56q30L76k2K1l14K68o80k07k3M1k08O3P52K98N54j28r52N33L36o65j81Q76
$$ 656 -174 202 180 201 -113 155 -525 -732 -755 -714 -922 -859 -107 191 745 617 -335 198 534 -131 -312 564
1889E64n09j00O59n44q74L16J4n63j51M79K18l15P75M2q51P99J96p13P2N65K3
$$ 564 55 -45 614 70 -804 -488 -474 -1037 -1188 -709 -491 -806 -31 11 -840 -41 155 -558 -486 79 102
1910A02M4N03l78l92R3m42k31K47M72N0m3M37m85k10N58n49m80O29L55j85JK78
$$ 102 146 649 271 -121 -28 -470 -701 -454 18 68 25 462 -23 -233 325 -224 -704 -75 280 95 96 374
1932C74o92K17M3o85R5M84k24RO95k40l88L94m6m40P86Q33R5p34J045n12l20L06
$$ 374 -318 -101 -58 -743 -648 -164 -388 -379 316 76 -312 82 36 -404 382 1215 1310 576 1621 1109 789 1095
1954A095k50o76k4L37p25j18Kq3m53K17m07l4J55O15k58L96L40K57J8K3n09J98
$$ 1095 845 169 145 482 -243 -361 -359 -442 -895 -678 -1085 -1119 -964 -349 -607 -211 129 386 404 427 -82 116
1976A16P15p40O1M11m83m77K03j71o33k37L75k09k1P79J32m88j26M72p60L92O60
$$ 116 831 91 152 563 80 -397 -194 -365 -998 -1235 -860 -1069 -1090 -311 -179 -667 -793 -321 -1081 -689 -29
1997b9j8K85M91j03j77o53j33K44K38K93l35K05J56k75J1L05m53J21N73m23q3
$$ -29 -47 238 729 626 449 -204 -337 -93 145 438 103 308 464 189 200 505 52 173 746 323 240
2018B40O66Jn41m83K19Q6m6o2k66l26M19K74K4k61Q2p7K25L11m26P7O87j70m63
$$ 240 906 907 366 -117 102 188 142 80 -186 -512 -93 181 205 -56 26 -51 174 485 59 136 823 653 190
2041A90M94k84p20J57k50l64K56L82k14m25j92J60k08PM88R4Q06J0j67K50l3k09
$$ 190 684 400 -320 -163 -413 -777 -521 -139 -353 -778 -970 -810 -1018 -1011 -523 -429 377 387 220 470 437 228
2063B28M09R5j01K89L3j99n20m13K06m71j75k9j52J46M25J30n32K16N03m77L07
$$ 228 637 732 631 920 953 754 234 -179 27 -444 -619 -648 -800 -654 -229 -99 -631 -415 88 -389 -82
2084h2K07J06K31K33m50K26j8l62n00K13J53L4n7j75p9K1P98m43k49J92j08j28
$$ -82 125 231 462 695 245 471 453 91 -409 -196 -43 -9 -66 -241 -320 -299 499 56 -193 -1 -109 -237
2106b37Q28M67n57j14J32o05k55K60p1J20l75P03m10P8j16k95k51K20N94J62K45
$$ -237 591 1058 501 387 519 -86 -341 -81 -152 -32 -407 296 -114 -36 -152 -447 -698 -478 116 278 523
2127E23k97m77Q19l41J21L4k82j11k23K70k29M0j06k16m03J22L28J44k9P82j3
$$ 523 226 -251 568 227 348 382 100 -11 -234 36 -193 -153 -259 -475 -878 -756 -428 -284 -313 469 456
2148D56K15j71n3n50O84J67j73O6j90l04k08n9q6k46p8j16l67K29M96M1L41k5
$$ 456 671 500 447 -103 581 748 575 641 451 147 -61 -120 -206 -452 -530 -646 -1013 -784 -288 -247 94 69
2170F9m74J43P09j25K13K02k38L61l96j51k84k00p8L59j75L5k73n6j78J63j38
$$ 69 -405 -262 447 322 535 737 499 860 464 313 29 -171 -249 110 -65 -30 -303 -359 -537 -374 -512
2191e12O83k46o21N63N41k26M29j3n41n46K61K29l35j06P3m4P7m1L9m81P8K35
$$ -512 171 -75 -696 -133 408 182 611 598 57 -489 -228 1 -334 -440 -367 -411 -334 -375 -336 -817 -739 -504
2213e04K31O73J14l56K11k26K19L74k03o26J10l6K13K67j94m46m93p7N15k72K51
$$ -504 -273 400 514 158 369 143 362 736 533 -93 17 -19 194 461 267 -179 -672 -749 -234 -506 -255
2234b55N14j5j60Ok0p3K50m4K7J86K17n0l11k46N5j19J94m86l36N3P65l76K63
$$ -255 259 244 84 90 70 -3 247 203 230 416 633 583 272 26 81 -38 156 -330 -666 -613 152 -224 39
2257C9K64j93m86L52l52L18N40j35n9K0n4j76j44j95k11m3L80K20m40l55M51j5
$$ 39 303 110 -376 -24 -376 -58 482 347 288 308 254 78 -66 -261 -472 -515 -135 85 -355 -710 -259 -274
2279b74K92o7J30L33J01J02j10N01k76l13k98K14m71K30K36l64k20J70j03n48
$$ -274 18 -49 81 414 515 617 507 1008 732 419 121 335 -136 94 330 -34 -254 -84 -187 -735
2299g35L46K6p8M67J73q4k77L78J27k71L26PM7k18l24L24j69O5l11m51M16n36
$$ -735 -389 -363 -441 26 199 115 -162 216 343 72 398 405 452 234 -90 234 65 130 -181 -632 -216 -752
2321g52J92J54J5j30N13L02m38o8L64L01R0J06P2l45r3J99j07j45Pk53K3J69K8
$$ -752 -560 -406 -391 -521 -8 294 -144 -212 152 453 543 649 721 376 283 482 375 230 237 -16 7 176 204
2344B04j32M65m23k15L44l94J77L53r5J01k94K20k27n92K91K1k40L45n6Rj23J46
$$ 204 72 537 114 -101 243 -151 26 379 284 385 91 311 84 -508 -217 -196 -436 -91 -147 -138 -261 -115
2366a15k08k25O57n3J40j88M40P3Q2j55J15q0L2l38k24L06j07n43P0J11k62M00
$$ -115 -323 -548 109 56 196 8 448 521 603 448 563 483 515 177 -47 259 152 -391 -321 -210 -472 -72
2388g2k42l93M76J49L17K73n3j43j35K44J05j5j28j5p5P6O8n30k2j14j68l13L85
$$ -72 -314 -707 -231 -82 235 508 455 312 177 421 526 511 383 368 293 369 437 -93 -115 -229 -397 -710 -325
2411c25O7j34J28j15K34k46M06l3o0K60K13o6p7k3l77J9j27K19m17K93J74k39
$$ -325 -258 -392 -264 -379 -145 -391 15 -18 -78 182 395 329 252 229 -148 -129 -256 -37 -454 -161 13 -226
2433b26j4j03J30J65j66K34oJ52K24L5j86m03L46M0k15j85mJ5J56M8j27j40j70
$$ -226 -240 -343 -213 -48 -214 20 14 166 390 425 239 -164 182 222 7 -178 -182 -167 -11 37 -90 -230 -400
2456d00L77j05J08L00j21Q3J03K74k09k35K1Lk48N34l75l90J57L2m75k6J92n93
$$ -400 -23 -128 -20 280 159 242 345 619 410 175 196 199 -49 485 110 -280 -123 -91 -566 -592 -400 -993
2478i93N79J91M6l1K47L07k65R2l3L8jM73n43Q6nP7l85L5l60j66K57J72m02K01
$$ -993 -414 -223 -177 -208 39 346 81 173 140 178 177 650 107 193 188 265 -120 -85 -445 -611 -354 -182 -584 -383
2502c83K58l97L48Q7k02L15L29j00k16L50K17o55L4p9Q7k06L75j45j40J28r1j02
$$ -383 -125 -522 -174 -87 -289 26 355 255 39 389 606 -49 -15 -94 -7 -213 162 17 -123 5 -86 -188
2524a88r1K31j52O8L26pJ5J46O0j77l3k66P1j27J61j82J87J50m22k4J1O2j26K83
$$ -188 -279 -48 -200 -132 194 187 202 348 408 231 198 -68 3 -124 37 -145 42 192 -230 -254 -243 -181 -307 -24
2548b4k3R8L75j4k67p1K19K32p96M90j27m2Q5J70o65j54j02k2L72L29k56k72P63
$$ -24 -47 51 426 412 145 74 293 525 -271 219 92 50 135 305 -360 -514 -616 -638 -266 63 -193 -465 298
2571B98k49J53p%R3K0K99q8k88N71n93j89K03m1l46N0m51K02J65j7n1Q7j3K20
$$ 298 49 202 195 195 288 308 607 519 231 802 209 20 223 182 -164 -114 -565 -363 -198 -215 -266 -179 -192 28
2595B8k56M92n4P2K39l74o2J07K72m55j53K40k76j31M66l35j86j5M59l17K63j25
$$ 28 -228 264 210 282 521 147 85 192 464 9 -144 96 -180 -311 155 -180 -366 -381 78 -239 24 -101
2617a01J2r7P59k99q1M6p5k99J58j80J18r2R9j86l37O01j84l85M04J13j60N09
$$ -101 -89 -186 573 274 193 239 164 -135 23 -157 -39 -131 -32 -218 -555 46 -138 -523 -119 -6 -166 343
2639C43l4k86Q5L18j09m6J19m47o5O96k93j88r2k7l56j1M04k88M10l3j97K5L67
$$ 343 309 23 108 426 317 271 390 -57 -122 574 281 93 1 -26 -382 -393 11 -277 133 100 -97 -72 295
2662B95j56j77K22J90j35n5M76n25k65K51l22J05K08m25l52M19n2P0J79L7o23
$$ 295 139 -38 184 374 239 184 660 135 -130 121 -201 -96 112 -313 -665 -246 -298 -228 -49 -12 -635
2683f35J67O44j25L22Q9k42l61M8N95m60rq9k21O6M50l05k63J67q0oL43N7k93
$$ -635 -468 176 51 373 462 220 -141 -93 502 42 33 -56 -277 -211 239 -66 -329 -162 -242 -248 95 152 -141
2706a41k41L82K24J04O8j82k37K59Pk35K29Q1j85j16K7l50K5J29j85j3K22L85
$$ -141 -382 0 224 328 396 214 -23 236 243 8 237 318 133 17 44 -306 -281 -152 -337 -350 -128 257
2728B57j69J17K3l52J6M20n4k01Q9j57R9j88K14m52J03m7l45M71P6l16J76j69
$$ 257 88 205 228 -124 -108 312 258 57 146 -11 88 -100 114 -338 -235 -282 -627 -156 -80 -396 -220 -389
2750c89L83P4r2J33l7j7M04k92L7R7k56k86L66j67k20r3N22l44p1M04j64j33K44
$$ -389 -6 68 -24 109 72 55 459 167 204 301 45 -241 125 -42 -262 -355 167 -177 -248 156 -8 -141 103
2773A03J87k97M79K21l28k74LkJ47P4l39j11oJ67l54J32l3k0j49J39L02n6K97
$$ 103 290 -7 472 693 365 91 94 92 239 313 -26 -137 -143 24 -330 -198 -231 -251 -400 -261 41 -15 282
2796B82k35rK43j6O6k70O5l60J72J80l63J44q9j54j70M44k49l33M49K5K36l65
$$ 282 47 38 281 265 331 61 126 -234 -62 118 -245 -101 -190 -344 -514 -70 -319 -652 -203 -178 58 -307
2818c07M42j59PL46o8m8J20K4m05K82J35o38K9J31j34K4Q6Q6r1P6r0lJ85O3k14
$$ -307 135 -24 -17 329 261 213 333 357 -48 234 369 -269 -240 -109 -243 -219 -133 -47 -138 -62 -152 -155 30 93 -121
2843a21M51L3k23k32M46Ko90L98k48L6J15L2k86J2M55m19M7K02Pj87K08J18j14
$$ -121 330 363 140 -92 354 356 -334 64 -184 -148 -33 -1 -287 -275 180 -239 -192 10 17 -170 38 156 42
2866D2Q8K31l47J9J5J57j18L5j42j2k27N36n21M8J30o1K32n8kk0J21J23k90J87
$$ 42 130 361 14 33 48 205 87 122 -20 -32 -259 277 -244 -196 -66 -127 105 47 45 25 146 269 -21 166
2890A66j65p0N2L0l30N11P6n41L26k14O2k71k38N63j01j0M59j31p1L39k64n1J79
$$ 166 1 -69 -17 13 -317 194 270 -271 55 -159 -97 -368 -606 -43 -144 -154 305 174 103 442 178 127 306
2913C06K09l94K51p0j77m5j68j27k39J50K02l79K71J07l0l0M9K59j32n6L54J6
$$ 306 515 121 372 302 125 80 -88 -215 -454 -304 -102 -481 -210 -103 -133 -163 -114 145 13 -43 311 327
2935C27m5n3k59N9K2j01k49J87o9M8L00l75j1J9L3l41M62K10k18N7J43k22M8K70
$$ 327 282 229 -30 29 51 -50 -299 -112 -181 -133 167 -208 -219 -200 -167 -508 -46 164 -54 3 146 -76 -28 242
2959B42k16k7K54k82J37L0j19l55m3M97k46j08L02J01j16K98r8l23K65l6J63q9
$$ 242 26 -1 253 -29 108 138 19 -336 -379 118 -128 -236 66 167 51 349 251 -72 193 157 320 231
2981B31j24L4l5P8l53M4Nk53J42j2j70L07R2J85l19L00Q2j79j25N18P2m70L58
$$ 231 107 141 106 184 -169 -125 -120 -373 -231 -243 -413 -106 -14 171 -148 152 234 55 -70 448 520 50 408
3004D08j02l21k8J71r4k93K38j89l0J84k17J92K1j8j04K56L0J14r6M15m26l5K40
$$ 408 306 -15 -43 128 34 -259 -21 -210 -240 -56 -273 -81 -60 -78 -182 74 104 218 122 537 111 76 316
3027C16l58j50K76q4k70q7K35L9k20J57j36l1L69jP4L7q4Q3m44M91k89N4L54n10
$$ 316 -42 -192 84 0 -270 -357 -122 -83 -303 -146 -282 -313 56 55 129 166 82 165 -279 212 -77 -23 331 -179
3051a79M69j90J48m00j29J51j51m1R3K57k72M14j19j32L69n9l05Q7L60m45J62
$$ -179 290 100 248 -152 -281 -130 -281 -322 -229 28 -244 170 51 -81 288 229 -76 11 371 -74 88
3072H8L05m90P3j65j48O0j17K67k50J6P4L43k01K55q5k5r5J94K4J28Pj37j14K93
$$ 88 393 -97 -24 -189 -337 -277 -394 -127 -377 -361 -287 56 -145 110 25 0 -95 99 123 251 258 121 7 300
3096C00m05J47Mj24j14J54K2o9K7J49M6m96L39j07J11M54l02l0j2J32k30j17K1
$$ 300 -105 42 46 -78 -192 -38 -16 -85 -58 91 137 -359 -20 -127 -16 438 136 106 94 226 -4 -121 -100
3119a00o7Q4J42l29J00K6L52l09n4K81k65K28r4J78j83L79j81k58K77L5K7k22
$$ -100 -167 -83 59 -270 -170 -144 208 -101 -155 126 -139 89 -5 173 -10 369 188 -70 207 242 269 47
3141D7Jl0q5j13O6J62l05J33J00N3P6n6Kj51n7R3K50O7q5j5k44K74l81M9P2k70
$$ 47 48 18 -67 -180 -114 48 -257 -124 -24 29 105 49 51 -100 -157 -64 186 253 168 153 -91 183 -198 -149 -77 -347
3167c47J66RJ45L2p2k12K39Kq2M45J6l60N50l57J59j61o5m0k09L90p5l6j02J1
$$ -347 -181 -172 -27 5 -67 -279 -40 -38 -120 325 341 -19 531 174 333 172 107 67 -142 248 173 137 35 46
3191D6l25J58r3j75J87J20J28l5K52j7P4j92j75K1J42j27l31M64j42l11K83j60
$$ 46 -279 -121 -214 -389 -202 -82 46 11 263 246 320 128 -47 -26 116 -11 -342 122 -20 -331 -48 -208
3213b08j75P6J50K27m46M56P2j54N0K28k31l41M83j42j01K06Q3m86K21j32J43
$$ -208 -383 -307 -157 70 -376 80 152 -2 48 276 45 -296 187 45 -56 150 233 -253 -32 -164 -21
3234b1n0M9j75k16N32l22L91j82j0j44L92o6K25j24j27K0j18K0q6KN4k18K4j7
$$ -21 -71 -22 -197 -413 119 -203 188 6 -4 -148 244 178 403 279 152 172 54 74 -12 -10 44 -174 -150 -167
3258a67J47j30l8J08j79o4L70O4j71K27nk02J06J28k34k5O3k52kK91k05k60K60
$$ -167 -20 -150 -188 -80 -259 -323 47 111 -60 167 162 -40 66 194 -40 -65 -2 -254 -256 35 -170 -430 -170
3281a70j70J44R6pj57J78K58J03j26l9l9j89K59J80k2l12J5j94K01O3k8j51l1
$$ -170 -340 -196 -100 -107 -264 -86 172 275 149 110 71 -118 141 321 299 -13 2 -192 9 72 44 -107 -138
3304a38J54k27P5M48p4j63J47p7k4o8Q2j14L4K59r3j14l46L58j63j84J63J01m5
$$ -138 16 -211 -136 312 238 75 222 145 121 53 135 21 55 314 221 107 -239 119 -44 -228 -65 36 -9
3327ik15J78J19k28M1N2j65K52J20O7j04j12P2n9J97j96K9q8J33q4j15j78O19
$$ -9 -224 -46 73 -155 -114 -62 -227 25 145 212 108 -4 68 9 206 10 39 -49 84 0 -115 -293 326
3350C26n01j73M09m6P4j6L9J06n9P6o7j35J64j27j5J90l39J48l89M28j59j3K91
$$ 326 -175 -348 61 15 89 73 112 218 159 235 168 33 197 70 55 245 -94 54 -335 93 -66 -79 212
3373B12j12j7P2k54L14n9q4m4n4j25M4K39r1O2k4j85N9n3J9j09L8MJ74k3l6K34
$$ 212 100 83 155 -99 215 156 72 28 -26 -151 -107 132 41 103 79 -106 -47 -100 -81 -190 -152 -148 26 3 -33 201
3399B01k22O3K0J70k72L10o6pl86K62j06j11PO7j10J16m0k69J57K81j20j77K33
$$ 201 -21 42 62 232 -40 270 204 197 -189 73 -33 -144 -137 -70 -180 -64 -104 -373 -216 65 -55 -232 1
3422AJ32o0J00j51K60M2k50J19P7r8r4j94J07j85j19K01KL2k06J86L21l30P1Q0
$$ 1 133 73 173 22 282 324 74 193 270 172 78 -116 -9 -194 -313 -112 -110 -78 -284 -98 223 -107 -36 44
3446D4J25Nj37K3J76j67N6J2J5k69P5j08J64mj40j29j02K61J61j80J10l9L3L4
$$ 44 169 174 37 60 236 69 125 137 152 -117 -42 -150 14 10 -130 -259 -361 -100 61 -119 -9 -48 -15 19
3470A9nJ03k24J45L8k21Q4R8j16J6l43K77J07R3Q4j83J14k16O7O2J6j25J34L22
$$ 19 14 117 -107 38 76 -145 -61 37 -79 -63 -406 -129 -22 71 155 -28 86 -130 -63 -1 15 -110 24 346
3494C46k00k59J94rq5p4j96K75R4o5j9j16J72j8k19K38k06L78J43j10J04n8j70
$$ 346 146 -113 81 72 -13 -87 -283 -8 86 21 2 -114 58 40 -179 59 -147 231 374 264 368 310 140
3517A40nj05o4P8j26K34k36l65N08k09p6J58J28J14k7p5l9r6J54k57J94L51k66
$$ 140 135 30 -34 44 -82 152 -84 -449 59 -150 -226 -68 60 174 147 72 33 -63 91 -166 28 379 113
3540A13j60K47l60N40m68j48p8J78J65j38M2L6P8k40K72J61j64K3n4L9j9j83L36
$$ 113 -47 200 -160 380 -88 -236 -314 -136 29 -109 -67 -31 47 -193 79 240 76 99 45 84 65 -118 218
3563B18r8j45j48K40M8o3k73R8q6L76q5o5L2P1j77J78l55L85k56J87J96m19K97
$$ 218 120 -25 -173 67 115 52 -221 -123 -209 167 82 17 49 120 -57 121 -234 151 -105 82 278 -141 156
3586A56l75J38j2K6j85L45k37L45k49l64L38r7K80l51L57K1N3J05q1j66M0j33
$$ 156 -219 -81 -93 -67 -252 93 -144 201 -48 -412 -74 -171 109 -242 115 136 189 294 213 47 87 -46
3608d6L8J23N2k22k72K22J63j63K93l29J50P3l31L34j9O0p2nk26J11J2L47q0k69
$$ -46 -8 115 167 -55 -327 -105 58 -105 188 -141 9 82 -249 85 66 126 54 49 -177 -66 -54 293 213 -56
3632e6j03L27j2M3m52M3R1O7j22J71j74J18K60j08j41j24K24KJ60k0k13q1q4p3
$$ -56 -159 168 156 199 -253 -210 -119 -52 -174 -3 -177 -59 201 93 -48 -172 52 54 214 194 -19 -100 -184 -257
3656b57K78R4k50R4j16p4n9M8Q0J97n2n7j9K9R7P3m0j35L71m29K03l15K92j32
$$ -257 21 115 -135 -41 -157 -231 -290 -242 -162 35 -17 -74 -93 -64 33 106 66 -69 302 -127 76 -239 53 -79
3680g9J62j20n5p0O5K4j11j04L29m7J51j08M4m4K20j57p0n09M39K0P6k1j41Q7
$$ -79 83 -37 -92 -162 -97 -73 -184 -288 41 -6 145 37 81 37 257 100 30 -479 -40 -20 56 35 -106 -19
3704a9o9N6j56m3L18j35J43O9j30J01k26N5o5j43L86nk29K22k59J27O4M5k90l2
$$ -19 -88 -32 -188 -231 87 -48 95 164 34 135 -91 -36 -101 -244 142 137 -92 130 -129 -2 62 107 -183 -215
3728b15J72L4j41J28k73K05J37r6K17k65J88j09j46J41L56j28k72j45K16J5j85
$$ -215 -43 -9 -150 -22 -295 -90 47 -49 168 -97 91 -18 -164 -23 333 205 -67 -212 4 19 -166
3749a66J99j05j63K14n3R9r1j23R2L41n10O25k06m1j86L59l55J26j03j01N2j1
$$ -166 33 -72 -235 -21 -74 25 -66 -189 -97 244 -266 359 153 112 -74 285 -70 56 -47 -148 -96 -107
3771a07J49j32K42l30K21M5Ml5P2L6K4l08J75L46m57n1L25j83%j72J38p7P7m10
$$ -107 42 -90 152 -178 43 88 92 57 129 165 189 -119 56 402 -55 -106 219 36 36 -136 2 -75 2 -408
3795d08L55j01j16J91l0J53M1n4l11L14j93J59R8r5q5p8K52p3k04NM77n05L23
$$ -408 -53 -154 -270 -79 -109 44 85 31 -280 34 -159 0 98 3 -82 -160 92 19 -185 -180 297 -208 115
3818A15k04J1K07l44L02j82J38M6K7R0k46K3L77n8K5m80J67m3M1j18K9m9pK26
$$ 115 -89 -78 129 -215 87 -95 43 89 116 206 -40 -17 360 302 327 -153 14 -29 12 -106 -77 -126 -133 93
3842I3j15j79K17j61j2K26MJ81k08nl7l5K07n5K3k25j01qj74J92j04J85j71K34
$$ 93 -22 -201 16 -145 -157 69 73 254 46 41 4 -31 176 121 144 -81 -182 -190 -364 -172 -276 -91 -262 -28
3866b8j7N3j57L92l04KRJ11J42l11J98o7r4K4J79k54K04j92Q6L9Q1j12K6p4J2
$$ -28 -45 8 -149 243 -61 -59 -50 61 203 -108 90 23 -71 -47 132 -122 82 -110 -24 15 96 -16 10 -64 -52
3891e2J67Jj39M08m00J26R8k93J65O2n0j17J97k32P0Ql3k1nQ0j42N8RP1l6J50
$$ -52 115 116 -23 385 -15 111 209 -84 81 143 93 -24 173 -59 11 19 -14 -35 -40 40 -102 -44 -35 36 0 150
3917A50n4o6K34k93O9l56L18J74n82K25R4mj40Q9K7K8J38j16M7O1L93l40J3j9
$$ 150 96 30 264 -29 40 -316 2 176 -406 -181 -87 -91 -231 -142 -115 -87 51 -65 -18 43 436 96 109 90
3941I0m0k13J70k1J15j8n8K61n16L3J21Q8ON0oL0r1J82k98J44J97p0j89L08k33
$$ 90 50 -163 7 -14 101 83 25 286 -230 -197 -76 12 18 68 62 92 1 183 -115 29 226 156 -33 275 42
3966D2K1k62K90j40k18J72K66j03l6m82K70J95J5q9Q0J4j40L16k29n4O9M7R1j81
$$ 42 63 -199 91 -49 -267 -95 171 68 32 -450 -180 15 30 -59 21 35 -105 211 -18 -72 -3 44 135 -46
3990d6L5j16Q6J24k01O8m7J50o8%O1j07R2l0M0L4J76p8p1k9M9r4j49J28q5m6M1
$$ -46 -11 -127 -41 83 -118 -50 -97 53 -15 -15 46 -61 31 1 41 75 251 173 102 73 122 28 -121 7 -78 -124 -83
4017h3j20L20j22j39K33l3k38K40O4J25k41j03r2L30O8r6r7M8Q8j62j35r3J04
$$ -83 -203 117 -5 -144 89 56 -182 58 122 247 6 -97 -189 141 209 113 16 64 152 -10 -145 -238 -134
4040a34K18l13L63j77j09MK79o8N3j61L81k20N0k70o8L23l39R5J23O0k04J59k5
$$ -134 84 -229 134 -43 -152 -148 131 63 116 -45 336 116 166 -104 -172 151 -188 -93 30 90 -114 45 20
4063B0J07j34n4R4j73R7O8j19N02m29k04K51n7J40j66Q0OL7M8l60J63K4P9j87
$$ 20 127 -7 -61 33 -140 -43 25 -94 408 -21 -225 26 -31 109 -57 23 29 66 114 -246 -83 -59 20 -167
4087a67L48p9j49K18p7P0j71K69q4j40p2R4j21J57P4k93J88Q5k13p3J57Q5k72
$$ -167 181 102 -47 171 94 164 -7 262 178 38 -34 60 -61 96 170 -123 65 150 -63 -136 21 106 -166
4110a66K39M3q2J93k09M0kJ21l85K98j1L7N6km91M23J29m11Q2P3k4j64J51J14
$$ -166 73 116 34 227 18 58 56 177 -208 90 79 116 172 170 -321 102 231 -180 -98 -25 -49 -213 -62 52
4134E2k6J29k42K02k85K72R4j31Q2j56K06k65J11l92O04q3j77l37L69j45l6J95
$$ 52 26 155 -87 115 -170 102 196 65 147 -9 197 -68 43 -349 255 172 -5 -342 27 -118 -154 41
4156D1k38J09K53L1j75N4J94j41k1j78K68k03j59J80O4l7j77lJ66j29p0Q7O5k31
$$ 41 -197 -88 165 196 21 75 269 128 107 -71 197 -6 -165 15 79 42 -135 -138 28 -101 -171 -84 -19 -250
4180b50K8J49O6m1J71n1k07R9J58M2j23k51J21r8K45j43O4q8J21L2j79m7K41%
$$ -250 -222 -73 -7 -48 123 72 -135 -36 122 164 41 -210 -89 -187 58 -85 -21 -109 12 44 -135 -182 59 59
4204E9R7p9k50K84Q9j61J24k76L16J19j67l55J14O4j38J80l11J37K0J72K83l50
$$ 59 156 77 -173 111 200 39 163 -113 203 322 155 -200 -86 -22 -160 20 -291 -154 -134 38 321 -29
4226b9j49N24j68q3N5m44N29l15R0L7m7O4j26n2j24O0j45K57K92j60k21J55J26
$$ -29 -178 346 178 95 150 -294 235 -80 10 47 0 64 -62 -114 -238 -178 -323 -66 226 66 -155 0 126
4249A26q7j6o8q7K55J5l86L17n%j59K37m52q4M11j61Q7M5j41K98k40R8K48j45
$$ 126 39 23 -45 -132 123 138 -248 69 64 64 -95 142 -310 -394 17 -144 -57 -12 -153 145 -95 3 251 106
4273A06J30n58L69m6K2k00J63Q6N3k88K55o3M2l6J7o0l21L46m9K81o5j51j2k25
$$ 106 236 -322 47 1 23 -177 -14 72 125 -163 92 29 71 35 52 -8 -329 17 -32 249 184 33 21 -204
4297b04J07N8L6k2K0P9R6m51M61J7n8k97K41j47J8J46j63N1K32l70M23k85J27
$$ -204 -97 -39 -3 -25 -5 74 170 -281 180 197 139 -158 83 -64 -46 100 -63 -12 220 -150 273 -12 115
4320A15Q8k60N6k03J34jr8k8j66L19q3k43M45j34K27k56m8J0J28L71l46K25k1
$$ 115 203 -57 -1 -204 -70 -71 -169 -197 -363 -44 -127 -370 75 -59 168 -88 -136 -126 2 373 27 252 231
4343B31k79Q9J2J2j78L53j79j16k0R3J51l4j67J13j01k5K14k11j06K58KK56k58
$$ 231 -48 41 53 65 -113 240 61 -55 -75 18 169 135 -32 81 -20 -45 169 -42 -148 110 112 368 110
4366A10J01p0l20J68j7j8n1J86k30J00P0j92J65J55k08o6J30n9J44r5M4J33j45
$$ 110 211 141 -179 -11 -28 -46 -97 89 -141 -41 29 -163 2 157 -51 -117 13 -46 98 3 47 180 35
4389C5J08j62K00j29j98N3K3j09K41K53m67m1K82j93L4K37j27l13M87l76M06l37
$$ 35 143 -19 181 52 -146 -93 -70 -179 62 315 -152 -193 89 -104 -70 167 40 -273 214 -162 244 -93
4411i3J74L1k5K71l86Qq6J41j07L26o56L82k65M20Mk80J10P1k6J3K00l49K82n7
$$ -93 81 112 87 358 -28 -20 -106 35 -72 254 -402 -20 -285 135 139 -141 -31 40 14 27 227 -122 160 103
4435A03q9j47K01j27n1mJ23Q5j74J6L4Q6q6OJ23j8J57k89K14l28L45km14K65m1
$$ 103 14 -133 68 -59 -110 -114 9 94 -80 -64 -30 56 -30 -24 99 81 238 -51 163 -165 180 178 -236 29 -12
4460a2m0K77j95j84J34k18M55l56n0O5J08J04j9j39J49k12Q0J89j45K0l23L48
$$ -12 -52 225 30 -154 -20 -238 217 -139 -189 -124 -16 88 69 -70 79 -133 -53 136 -9 11 -312 36
4482C6k48J70Pl4J30j69L51j56N1rj36Q7R0j64PJ1K18k76J02j80o3L82k17mJ02
$$ 36 -212 -42 -35 -69 61 -108 243 87 138 129 -7 80 170 6 13 24 242 -34 68 -112 -175 207 -10 -14 88
4507H8j09K7j46r5J34j15K79r9L2O4q4Mjk79K79J82j34J67j50m3K38l29J23j03
$$ 88 -21 6 -140 -235 -101 -216 63 -36 -4 60 -24 -20 -21 -300 -21 161 27 194 44 1 239 -90 33 -70
4531g0j15J80j82L19k09K46l47L33K9j47Q1r2K54k4l60J43q1J80j20M9n80L54
$$ -70 -185 -5 -187 132 -77 169 -178 155 184 37 118 26 280 256 -104 39 -42 138 18 67 -513 -159
4553a59R1o3K1R3J16j11M2l33O36k83j05J84mj44K19k45J6k98K49R5k37m9M10
$$ -159 -68 -131 -110 -17 99 -12 30 -303 333 50 -55 129 125 -19 200 -45 -29 -327 -78 17 -220 -269 141
4576A41j93k7P1j38L7O2j24L60k43k44J75K70j52r8J59qJ34j61K05k40P7k06J54
$$ 141 -52 -79 -8 -146 -109 -47 -171 189 -54 -298 -123 147 -5 -103 56 48 182 21 226 -14 63 -143 11
4599A1K4l08K85j47L31m13M80j10j11M8l5o1j42L40M3j2q9k74p6L67j77J79k14
$$ 11 35 -273 12 -135 196 -217 263 153 42 90 55 -6 -148 192 235 223 134 -140 -216 151 -26 153 -61
4622f1K35j57J00n7NP1k73J50Q2J19k30K46k37K34J09l15L2k08O5J42k16PK54
$$ -61 174 17 117 60 65 136 -137 13 95 214 -16 230 -7 227 336 21 53 -155 -90 52 -164 -157 97
4645I7l27J22K14l23K67j4J2R3j22J76j42o6O0J95k02o2J71k31qK6l6P3J42j28
$$ 97 -230 -108 106 -217 50 36 48 141 19 195 53 -13 47 242 40 -22 149 -82 -90 -64 -100 -27 115 -13
4669a3q8J52M6m1K6k27K02K12j22J9n4j07L6j42K08j03J62J9l33kJ43m9J06n1
$$ -13 -101 51 97 56 82 -145 57 269 147 166 112 5 41 -101 107 4 166 185 -148 -150 -7 -56 50 -1
4693al07L20O0o4j59j16M28k76J04J26j21K9Q7r4Or3J38l11K28n0K13k23j49L28
$$ -1 -308 12 72 8 -151 -267 161 -115 -11 115 -6 23 110 16 22 -71 67 -244 -16 -66 147 -76 -225 103
4717A03j23j36L32j77j1J18K1l03K65j94J04j87L03m1pj81l02L67l2J29m9J5n0
$$ 103 -20 -156 176 -1 -12 106 127 -176 89 -105 -1 -188 115 74 67 -114 -416 -49 -81 48 -1 14 -36
4740c6J19J14k04R4lm7r1R5k25N0J97p7J26q1J62l62K29j80L5J73k43O7K49j28
$$ -36 83 197 -7 87 84 37 -54 41 -184 -134 63 -14 112 31 193 -169 60 -120 -85 88 -155 -88 161 33
4764C3J9J44l51J79j07j38J33l6K3O2p4R5j54J92P0K1O6k18K00k21J01k81M83
$$ 33 52 196 -155 24 -83 -221 -88 -124 -101 -39 -113 -18 -172 20 90 111 177 -41 159 -62 39 -242 241
4787B41k07Rp3P7k2r2J85k90J90L1k9m6J05m3rN5o0k22J95p5J90k70K37j61K05
$$ 241 34 43 -30 47 25 -67 118 -172 18 49 20 -26 79 36 27 82 22 -200 -5 -80 110 -160 77 -84 121
4812A21j26R2J7j9k09K71k17k7L64l85oj96M52Q6q9j56J54k38K45on7k38l1K06
$$ 121 -5 87 104 85 -124 147 -70 -97 267 -118 -124 -320 132 218 129 -27 127 -111 134 128 71 -167 -198 8
4836HJ18j30K5j21m2n3K18j76J63l04K25K8p4P4L8p0M8L01k4M6j16l3l69K14l
$$ 8 126 -4 21 -100 -142 -195 23 -153 10 -294 -69 -41 -115 -41 -3 -73 -25 276 252 298 182 149 -220 -6 -9
4861ij12L79r7k33K67l50K57PM3j72k6J33j59M8l8j57L66O9l13J05O2j16K57j94
$$ -9 -121 258 161 -72 195 -155 102 109 152 -20 -46 87 -72 -24 -62 -219 147 216 -97 8 70 -46 211 17
4885A7k1K2oj91KJ11n0Q1J3R2L20k75j10R1q0M71l22j82k3m9oPK2j87R6J86kr
$$ 17 -4 18 12 -179 -177 -66 -116 -35 -22 70 390 115 5 96 16 487 165 -17 -40 -89 -95 -88 -66 -253 -157 29 27 18
4913A8j85J23oN9O2n7O1P3j6M4m33P7Q9Q3j11J70k37K98k21p7K01j40K99o0Q7
$$ 18 -167 -44 -50 9 71 14 75 148 132 176 -257 -180 -91 -8 -119 51 -186 112 -109 -186 15 -125 174 114 201
4938B01l29o2J82J91r5k29K64o4j97K21m4M1k63M35n05J72K49j66PN8j49j17r
$$ 201 -128 -190 -8 183 88 -141 123 59 -138 83 39 80 -183 252 -253 -81 168 2 9 67 -82 -199 -208
4961b08Q2l7J78l11M49l9j28j09J85j07q2j06K56j69J40j05J12J87o2j25k48O
$$ -208 -126 -163 15 -296 153 114 -14 -123 62 -45 -127 -233 23 -146 -6 -111 1 188 126 1 -247 -241
4983b41M29k87k3L01k78P3o0m6L3O6k06O9J50j06j24N6K03L29m06k11K93k08K22
$$ -241 188 -99 -122 179 -99 -26 -86 -132 -99 -33 -239 -170 -20 -126 -250 -194 9 338 -68 -279 14 -194 28
5006B8J8J08j56P3K26k86K31J21l52j01K07k46K39k90K10P0k7N4r5q9J01J46k75
$$ 28 46 154 -2 71 297 11 242 363 11 -90 117 -129 110 -180 30 100 73 127 32 -57 44 190 -85
5029h5K10j03o7n0K11M9o3J12j98Q0j19n7j19K72j68M4j60K92k04J58j80K3P9
$$ -85 125 22 -45 -95 116 165 102 214 16 96 -23 -80 -199 73 -95 -51 -211 81 -123 35 -145 -122 -43
5052d3M9Q8j43L4Q2R2o0j18J28l7k34J94O7j86Mk0k1K30p2n8J68M0M8k7l38J03
$$ -43 6 94 -49 -15 67 159 99 -19 109 72 -162 32 99 -87 -83 -103 -124 106 34 -24 144 184 232 205 -133 -30
5078c0J87o0l11J81J14nj30K11k17K91n6j93n4J40j05j31R7O6J36n2j51J5P2J58
$$ -30 157 97 -214 -33 81 76 -54 157 -60 231 175 -18 -72 68 -37 -168 -71 -5 131 79 -72 -57 15 173
5102A73m3j91J36J40k74O8r7Qo0J45M1j61J13j19P6j88K77M2j90Q8N8K29k85j58
$$ 173 130 -61 75 215 -59 9 -88 -80 -140 5 46 -115 -2 -121 -45 -233 44 86 -104 -16 42 271 -14 -172
5126a72O8Q0J58j62n8J6K2j87J76o3j0K42k83P0M67m67R0j13j52K70J06k71K32
$$ -172 -104 -24 134 -28 -86 -70 -48 -235 -59 -122 -132 110 -173 -103 364 -103 -13 -126 -278 -8 98 -173 59
5149E9j07N2J74r2J15j02K06m55J34j23N2j89L3L09O2K00m54J45J26j1k85J84
$$ 59 -48 4 178 86 201 99 305 -150 -16 -139 -87 -276 -243 66 128 328 -126 19 145 134 -151 33
5171C3j97K75j42mm4m4J00J9l6J04k42J70j77Q3K80j45K7j88K81o5k08J60j03
$$ 33 -164 111 -31 -35 -79 -123 -23 -4 -40 64 -178 -8 -185 -102 178 33 60 -128 153 88 -120 40 -63
5194f3j16K48j00j32J30j24K10m31K26J67R6Ll18L55K13m16J43J10k2k10L2JJ01
$$ -63 -179 69 -31 -163 -33 -157 53 -378 -152 15 111 114 -204 151 364 -52 91 201 179 -31 1 2 103
5217A03M4O9l7j9k66O5o3Q1j08J71j78J37L34l84J13o4K14J11O7j74k46K14m01
$$ 103 147 216 179 160 -106 -41 -104 -23 -131 40 -138 -1 333 -51 62 -2 212 323 390 216 -30 184 -217
5240b17K66m2R8j46j59M9K80p6j76J78j19n4j08J64m4J68p8L5j21J7m8N5K06n8
$$ -217 49 7 105 -41 -200 -151 129 53 -123 55 -64 -118 -226 -62 -106 62 -16 19 -102 -85 -133 -78 128 70
5264G0M6O3k15j9J94k92J54J3p4j32K77pM2k2J17k3k93K93j68Ol4L41k99o3L42
$$ 70 116 179 -36 -55 139 -153 1 14 -60 -192 85 78 120 98 215 192 -101 192 24 30 -4 337 38 -25 317
5289C17n97J95K03j27K14j18k84J21j5J14j09J16o1J0m0O4j78OL75j07l96L22
$$ 317 -280 -85 118 -9 205 87 -197 -76 -91 23 -86 30 -31 -21 -61 3 -175 -169 206 99 -297 25
5311B5j25N9J03L2k09K83j00QR8k9k34j5o7J8M13l76J84K7q3q0o3o5Q2jK06k24
$$ 25 -100 -41 62 94 -115 168 68 76 174 145 -89 -104 -171 -153 260 -116 68 95 12 -68 -131 -196 -114 -115 91 -133
5337a33L8J37M3m5j86J89p7j31J95m1L0j0K81j98n5k69K82o5k44J83L4Ql00K42
$$ -133 -95 42 85 40 -146 43 -34 -165 30 -11 19 9 290 92 37 -232 50 -15 -259 -76 -42 -34 -334 -92
5361i2k7M6K17j80J69l79P1L46l0j09J08M5m1j11L2j2N2m17K67L5J20k80K13j78
$$ -92 -119 -73 144 -36 133 -246 -175 171 141 32 140 185 144 33 65 53 105 -312 -45 -10 110 -170 43 -135
5385a35K56r2O7L5k02K08L6j20J34N2l24K62j30J00j53J6j33M00m05N8K0N5l16
$$ -135 121 29 96 131 -71 137 173 53 187 239 -85 177 47 147 -6 10 -123 277 -128 -70 -50 5 -311
5408c11M62o1P8k71q0K48p4o2K27j09R6q7M7k85Q5J04m0p3k0K8P9J66j53K2p3
$$ -311 151 90 168 -103 -183 65 -9 -71 156 47 143 56 103 -182 -97 7 -33 -106 -126 -98 -19 147 -6 16 -57
5433e7K90k98K93k54K1M5r5J15J2o7j13J65j69M4J4M2K4l8P5j64J48j42R3J67
$$ -57 233 -65 228 -26 -5 40 -55 60 72 5 -108 57 -112 -68 -54 -12 12 -26 49 -115 33 -109 -16 151
5457A51j69M7j2l6j03K01j44J79J9k07K0L2LL66n19O4J74O7n2L1k15Q8J96P2j45
$$ 151 -18 29 17 -19 -122 79 -65 114 133 -74 -54 -22 -19 347 -172 -108 66 133 81 112 -103 -15 181 253 108
5482A08j4j17j0K7k2N08o50J13j59K61J49j42j38P6M8j02o3J96K3N9l31M0L41
$$ 108 94 -23 -33 -6 -28 480 -170 -57 -216 45 194 52 -86 -10 38 -64 -127 69 92 151 -180 -140 201
5505B01j45J71m52K20K6J99k79rL29m12O0K2J81j0k26M07l05n2R2Mk6p9L1J61
$$ 201 56 227 -225 -5 21 220 -59 -68 261 -151 -91 -69 112 102 -124 283 -22 -74 18 22 -4 -83 -52 109
5529A09N7m13P8K84qj36J05k9o3j41J54q7m1j76O3L66j46J63J2n5j2k19j23K87
$$ 109 166 -247 -169 115 107 -29 76 47 -16 -157 -3 -90 -131 -307 -244 122 -24 139 151 96 84 -135 -258 29
5553B9L0o5l5K6J33j28Qj31pq9K72J41j84J78l50L21p9j64J87k65M0J35K8J07
$$ 29 59 -6 -41 -15 118 -10 -2 -133 -140 -229 43 184 0 178 -172 149 70 -94 93 -172 -132 3 31 138
5577A38k12K1J38j69O7k41M42k35P2K48p3k21R2K55m88J37p5O6J06K7j08kj3K1
$$ 138 -74 -53 85 -84 -17 -258 184 -51 21 269 196 -25 67 322 -166 -29 -104 -38 68 95 -13 -15 -28 -7
5601gRK17l13k25K42J75r3R2j25p5K81P2j05J35l88K53j42j59L96O2l19j03L30
$$ -7 2 219 -94 -319 -77 98 5 97 -28 -103 178 250 145 280 -108 145 3 -156 240 302 -17 -120 210
5624B10j32l5j23j25L56j56o0q3K62q5K79j60oj49J68k19L42l96M61l80J92j30
$$ 210 78 43 -80 -205 151 -5 -65 -148 114 29 308 148 142 -7 161 -58 284 -112 349 -31 161 31
5646C1l8p4R3j54KL13o2r7r6K08j20P3j25j06jJ37j11K70j11k48J39n7J83lj20
$$ 31 -7 -81 12 -142 -140 173 111 14 -82 126 6 79 -46 -152 -153 -16 -127 143 32 -216 -77 -134 49 46 -74
5671g4j79L43j05k0R7ln6K1L24k10N7j26j70M5K99j18q6q8J11nj36O6q2j44K27
$$ -74 -253 90 -15 -35 62 59 3 24 348 138 195 69 -101 -56 243 125 39 -49 62 57 -79 -13 -95 -239 -12
5696a2m0rK65k17J46k8Pk13K26j89M15m11K55k37q2J50l11K53p7o1K21j2k77L67
$$ -12 -52 -61 204 -13 133 105 112 -101 125 -64 351 -60 195 -42 -124 26 -285 -32 -109 -170 51 39 -238 129
5720A29j04%j78Q1K6p7l1M0L95n6k55J15n7n7J05J35l28J74k48K35pL6j79J87
$$ 129 25 25 -153 -72 -46 -123 -154 -114 281 225 -30 85 28 -29 76 211 -117 57 -191 44 37 73 -106 81
5744H1Ln2J01j00j36L08k92O2O9J1p4j41j7L1O2K45j31O1j91kJ57j03nK09j35
$$ 81 84 32 133 33 -103 205 -87 -25 44 55 -19 -160 -177 -146 -84 161 30 91 -100 -102 55 -48 -53 156 21
5769B1J96j12l09J36n8K73j52m6j16J00J7J5m7k9L02l69P2lK07J05l79K4K52J69
$$ 21 217 105 -204 -68 -126 147 -5 -51 -167 -67 -50 -35 -82 -111 191 -178 -106 -109 98 203 -176 -152 100 269
5793B69m47K07jQL3l14J00J33k12K96K43m18j7J29N4m5r7P2j18K0K25j10J03k13
$$ 269 -178 29 28 36 69 -245 -145 -12 -224 72 315 -103 -120 9 63 18 -79 -7 -125 -105 120 10 113 -100
5817a00L5K7L53l70k0L66l27K25j07k1k63L09J0o1j74K8J68j30q1K9k0K02R2j79
$$ -100 -65 -38 315 -55 -75 291 -36 189 82 61 -202 107 117 56 -118 -90 78 -52 -133 -104 -124 78 170 -9
5841iK43o5m2j26j32J0q7J52J40J1r9k6J63o8J5k1M4q9J47K6r0k91Q8RJ57j16
$$ -9 234 169 127 1 -131 -121 -208 -56 84 95 -4 -30 133 65 80 59 103 14 161 187 97 -194 -106 -97 60 -56
5867e6J06j36o9J51J30p4j21k04J24K25J8k46J86P7j46J89K1l4j17J11k42j25
$$ -56 50 -86 -155 -4 126 52 -69 -273 -149 76 94 -152 34 111 -35 154 175 141 24 135 -107 -232
5889b32K63j75J42j93q2K41k84L53l07M98n00L46O9p3j6J47r0L2l71P3J50k14
$$ -232 31 -144 -2 -195 -277 -36 -320 33 -274 224 -276 70 139 66 50 197 107 139 -232 -159 -9 -223
5911b23J89J55l02N7r3k3K46n1l0M6K05j37pj40P8n0M22l23J78p9o4l4J17k18
$$ -223 -34 121 -181 -124 -217 -240 6 -45 -75 -29 176 39 32 -108 -30 -80 342 19 197 118 54 20 137 -81
5935h1O8j17l6K54l7r6RJ51p6J25k71p7J2K49j46K53l54J6L02j64L14k12q6N9
$$ -81 -13 -130 -166 88 51 -45 -36 115 39 164 -107 -184 -172 77 -69 184 -170 -154 148 -16 298 86 0 59
5959E9l11Q3K3K05l85M51j70J87k50O5R6l34N58k45p5j21L72k57k9N7K5J78k29
$$ 59 -252 -169 -146 59 -326 125 -45 142 -108 -43 53 -281 277 32 -43 -164 208 -49 -78 -21 4 182 -47
5982d7Q2O4r3mQQ3k32M43l6k04k36O7J14M4O9J00j06j92n1J42J25l50J11O9j20
$$ -47 35 99 6 2 10 93 -139 304 268 64 -172 -105 9 53 122 222 116 -76 -127 15 140 -210 -99 -30 -150
6007a50q1K15K3j21p1K6P5L6r3J50j2R7m6l86K76J07J26j03j39J01k74K81J13
$$ -150 -231 -16 7 -114 -185 -159 -84 -48 -141 9 -3 94 48 -338 -62 45 171 68 -71 30 -244 37 150
6030A50J04k57k38O5K73j18k61M76j65j87J76j6L9j16K05k0m5j67Q0J86k69J42
$$ 150 254 -3 -241 -176 97 -21 -282 194 29 -158 18 2 41 -75 130 110 65 -102 -22 164 -105 37
6052C7j35J07Q2j04K49k63L6l0J19o4N0l4j45N8L3j74j2J67j09J2M3J09P6n0R5
$$ 37 -98 9 91 -13 236 -27 9 -21 98 34 84 50 -95 -37 -4 -178 -190 -23 -132 -120 -77 32 108 58 153
6077A53j42j28P3k39K72K5n2K23j67n6R4r5L65m82P1P8k62L15o7J48j43j42J34
$$ 153 11 -117 -44 -283 -11 14 -38 185 18 -38 56 -39 326 -156 -85 -7 -269 46 -21 127 -16 -158 -24
6100b4J64j73R6l45K42nL35k19N6k31K53k24K80k52O3k26K49J47j94L66m93K10
$$ -24 140 -33 63 -282 -40 -45 290 71 127 -104 149 -75 205 -47 16 -210 39 186 -8 358 -135 75
6122G5j80J27l12Q9K42k06J50K4J83k06r6K98l51J52jL7K16k94j86K91n8mj34
$$ 75 -105 22 -290 -201 41 -165 -15 9 192 -14 -110 188 -163 -11 -12 25 241 -53 -239 52 -6 -10 -144
6145a44J54l1r1K53j80j76J05J87P0j45p3M3J99j70J5j67R8j12K75j33QN0K27
$$ -144 10 -21 -112 141 -39 -215 -110 77 147 2 -71 -28 171 1 16 -151 -53 -165 110 -23 -15 35 262
6168B62k88K34k62o9K73k42L96r3k67LQ7O1n4l0j78K45q1ko6j8j57L09j23q5K10
$$ 262 -26 208 -54 -123 150 -92 304 211 -56 -53 34 95 41 11 -167 78 -3 -5 -71 -89 -246 63 -60 -145 65
6193F5j07R9K9N0j53N7j55J38J3p5r8L60k42k3J65J42k49p0MJ00J45j21J60k40
$$ 65 -42 57 86 136 -17 40 -115 23 36 -39 -137 223 -19 -42 123 265 16 -54 -50 50 195 74 234 -6
6217fJ63k24j71J90J88j11p4j48KK82O3k01N0q2J34R5j99q3Q9J52Pk5r9K4K30
$$ -6 157 -67 -238 -48 140 29 -45 -193 -191 91 154 -47 3 -79 55 150 -49 -132 -43 109 116 91 -8 16 246
6242B46L7k77p7L97l10J77m33M54Ln44K12M8J4J93k1oj95l5J5L05p2K08o24K67
$$ 246 283 6 -71 326 16 193 -240 214 217 -327 -115 -67 -53 140 119 113 -82 -117 -102 203 131 339 -285 -18
6266a8K5jJ84k21k2j55J99j87J93j14j01J47m9O0Mnl8K20j57P6J04j63p1L32k75
$$ -18 7 6 190 -31 -53 -208 -9 -196 -3 -117 -218 -71 -120 -60 -56 -61 -99 121 -36 40 144 -19 -90 242 -33
6291c3PJ59q2k17J26J4K68l78J98l01J98j15J62R6k17L37l63K31m7l4j0j05N2
$$ -33 -26 133 51 -166 -40 -26 242 -136 62 -239 -41 -156 6 102 -115 222 -141 90 43 9 -1 -106 -54
6314e4K29p2r6J88j99j02j5J48m6P4k8m0j02L41n64J75K47k30K54M5r5k67L33
$$ -54 175 103 7 195 -4 -106 -121 27 -19 55 27 -13 -115 226 -338 -163 84 -146 108 153 58 -209 124
6337A24k5l7j25J41K75m00K8j02L01p5J55m56M12k48l21Q6J53L38k80M23l24j02
$$ 124 99 62 -63 78 353 -47 -19 -121 180 105 260 -196 216 -32 -353 -267 -114 224 -56 367 43 -59
6359e9J6J94k71n2o8N1M1L03J08o73M63KJ22j62k58J36M4J53k88R8J55j45Q1j17
$$ -59 -43 151 -120 -172 -240 -189 -148 155 263 -410 53 55 177 15 -243 -107 -63 90 -198 -100 55 -90 -9 -126
6383a26K39j81J51J23j98j77J13K61k84K62j53M4L16l26L9j19L9Q2j49j81K83
$$ -126 113 -68 83 206 8 -169 -56 205 -79 183 30 74 390 64 103 -16 23 105 -44 -225 58
6404E8J64m13K96k69q8L05j84J33r1M01l49pkj05J64j7n1J8K07r8k48K13p2J44
$$ 58 222 -191 105 -164 -252 53 -131 2 -89 312 -37 -44 -46 -151 13 -4 -55 -37 170 72 -176 37 -35 109
6428A09P9l22O4N9K8J56k36k37M49J27m50p8L53j41n5k8J70J66j72k01J87l2j89
$$ 109 188 -134 -70 -11 17 173 -63 -300 149 276 -174 -252 101 -40 -95 -123 47 213 41 -160 27 -5 -194
6451a94L51O4Jj80k16j68N01j4l00O26o63K00J1N0j29J33J28j83M4P2o8N1j53
$$ -194 157 221 222 42 -174 -342 159 145 -155 471 -192 8 19 69 -60 73 201 18 62 134 66 117 -36
6474c6J58j28j2J75l35J04PK5K17j88j09J75j12J99j08J5k94L18RM2k73K40K78
$$ -36 122 -6 -18 157 -178 -74 -67 -42 175 -13 -122 53 -59 140 32 47 -247 71 80 122 -151 89 367
6497C67n85R8l8J84q5r3K27J1N2j25K63k52K3Oj22K5K21k65j8K51J08m05L27l53
$$ 367 -218 -120 -158 26 -59 -152 75 86 138 13 276 24 47 53 -69 -44 177 -88 -106 145 253 -152 175 -178
6521a78m0K71m8k46K72j80K1n0N6J49K4m7J07l53L07q8J56J04j23J2j48J24j35
$$ -178 -218 53 5 -241 31 -149 -128 -178 -122 27 51 4 111 -242 65 -23 133 237 114 126 -22 102 -33
6544c3P4M2j17p8M9j04K66l13L15l3l8P0n9j9j72Q9J54j63J14O6j35Q2k24N1J86
$$ -33 41 83 -34 -112 -63 -167 99 -214 101 68 30 100 41 22 -150 -61 93 -70 44 110 -25 57 -167 -116 70
6569G0p5p9N0L26m99J50N7R0m5Rk2R3j41n9P2r2J60j41Q9J04m52M09l10J15RO9
$$ 70 -5 -84 -34 292 -207 -57 0 90 45 54 32 125 -16 -75 -3 -95 65 -76 13 117 -335 74 -236 -121 -112 -43
6595d3K23l26J29J48j77K18j17l2J88n3p3r9o1k0P3o4R2k69O79m03j68Q1J03J
$$ -43 180 -146 -17 131 -46 172 55 23 211 158 85 -14 -75 -95 -22 -86 6 -263 416 13 -155 -74 29 30
6619C0k9K91l26M5k10J28N4k16L8L10l45L33j71L4l1j1J94j62K11j50j55K16l23
$$ 30 1 292 -34 11 -199 -71 -17 -233 -195 115 -230 103 -68 -34 -65 -76 118 -44 167 17 -138 78 -245
6642b45Q5R8j24L67k94k0J83r1lR7j53J23j34J66m2R4j08J4j02J55k82M19k60
$$ -245 -160 -62 -186 181 -113 -133 50 -41 -44 53 -100 23 -111 55 13 107 -1 13 -89 66 -216 203 -57
6665e7J13l1J66j8r7M6k03j0J02k83P2M4N6J85n3J83k7l60J67k74L96j2j89M62
$$ -57 56 25 191 173 76 122 -81 -91 11 -272 -200 -156 -100 85 32 215 188 -172 -5 -279 117 105 -84 378
6689C78o08K94J31k9r7j72J43J98k27L4NQ4J07j64m8Pm25M33M9j64k16l1L86l7
$$ 378 -230 64 195 166 69 -103 40 238 11 45 50 134 241 77 29 36 -389 44 93 -71 -287 -318 68 31
6713C1J8k0K41m26K4K03N0l8k82K88j4r8j10L28k44J5J06k0Q2n7o6k56L71k03
$$ 31 49 29 270 -156 -132 71 121 83 -199 89 75 -23 -133 195 -49 -34 72 52 134 77 11 -245 126 -77
6737g7J52m2M6J9k29jJ43o8j41M17j39l58K51R7k2l7NR4k95J33o6j65K81Pj82
$$ -77 75 33 79 98 -131 -132 11 -57 -198 219 80 -278 -27 70 48 11 16 110 -185 -52 -118 -283 -2 5 -177
6762a77J73k27J54j56oK93j26q3K9p7M57k49L6K0k71M99n81K79j05K49k45J36
$$ -177 -4 -231 -77 -233 -239 54 -72 -155 -126 -203 254 5 41 61 -210 289 -292 -13 -118 131 -114 22
6784B2Q0r5m3P0R8l48R3K53j16l35L41m9O4k01lK86q7K9r0K50l99M10k77m2J07
$$ 22 102 7 -36 34 132 -216 -123 130 14 -321 20 -29 35 -166 -169 117 30 59 -31 219 -180 230 -47 -89 18
6809A8k01K38n0J30N5k94J7J50k67K90j1j28j86J83j17K34j10J75L8j83J50k24
$$ 18 -183 55 5 135 190 -104 -87 63 -204 86 75 -53 -239 -56 -173 61 -49 126 164 -19 131 -93
6831i3P6K79l75J31j18M5J96k22qL4O7j38J24k19K09Jr1L1j24J02J66j90P8R6
$$ -93 -17 262 -113 18 -100 -55 141 -81 -89 -55 12 -126 -2 -221 -12 -11 -102 -71 -195 -93 73 -117 -39 57
6855E7J89k07K14j51j47n5j59J01J06j2j1r8R9j29J96K83k07o2j1L5Rj06J17R4
$$ 57 246 39 253 102 -45 -100 -259 -158 -52 -64 -75 -173 -74 -203 -7 276 69 7 -4 31 40 -66 51 145
6879A45o3R9k08N3l1Q0j18J6J29j17k46J53j18J22m0L85j72k51PJ88j48j49M89
$$ 145 82 181 -27 26 -5 75 -43 -27 102 -15 -261 -108 -226 -104 -144 241 69 -182 -175 13 -135 -284 205
6902B05j28k8m59O51k91rk60K63P8j48J84m3p9OK77j71J49l03J47l31J77J86j09
$$ 205 77 49 -410 241 -50 -59 -319 -56 22 -126 58 15 -64 -58 219 48 197 -106 41 -290 -113 73 -36
6925c6j45jQ6J6j63O7K89r8j88M7M34k61n9jK0j1R2j93J96r5R4l67M34j20N3l5
$$ -36 -181 -182 -96 -80 -243 -176 113 15 -173 -126 308 47 -12 -13 7 -4 88 -105 91 -4 90 -277 157 37 90 55
6951E5j62M64k64Lr6j42R4j45P5P8J44N7l04J07j60J93K3j03K52n28K81N3K22
$$ 55 -107 357 93 96 0 -142 -48 -193 -118 -40 104 161 -143 -36 -196 -3 20 -83 169 -359 -78 -25 197
6974A97r7j9J9k04J57j58r1J92o6K55k83R3j07j9Q4K70l59J46K56k71K72k97K94
$$ 197 100 81 100 -104 53 -105 -196 -4 -70 185 -98 -5 -112 -131 -47 223 -136 10 266 -5 267 -30 264
6997B64j44j24k61k3O51l10k5k4J58R7k96Rp0K44j12j06nP5K0O5L5n4k57K86N6
$$ 264 120 -4 -265 -288 363 53 28 4 162 259 -37 -28 -98 146 34 -72 -77 -2 18 83 118 64 -193 93 149
7022A49P2k08Q4j49R6L3P2j23o5p0Q8j58K57k5j20O2m7p2K2r2K50J5r6J12k18
$$ 149 221 13 97 -52 44 77 149 26 -39 -109 -21 -179 78 53 -67 -5 -52 -124 -102 -194 56 71 -25 87 -131
7047a31K50j37N7q8J11n6RLK12k62lM5j00J38o2j54J55j4jk3j05K94j01k09J12
$$ -131 119 -18 39 -49 62 6 15 18 230 -32 -35 10 -90 48 -14 -168 -13 -27 -28 -51 -156 138 37 -172 -60
7072f0QL9L59l82o1J46j15K21j51k1j19K76j87j0l2M3j5k9K0l5K13J11j3k97p8
$$ -60 -52 -13 346 -36 -97 49 -66 155 4 -17 -136 140 -47 -57 -89 -46 -61 -90 -70 -105 108 219 206 -91 -169
7097a69K50l17L75n1N1l9m6p3K26j90j48L84l38L44k94J91j68K41k46J44j93j13
$$ -169 81 -236 139 88 139 100 54 -19 207 17 -131 253 -85 259 -35 156 -12 229 -17 127 -66 -179
7119a79k1L09j75R1j8k62K39J6Q1k68J18J59k39N6Q8q4R3j14K04q1j22J51J36
$$ -179 -200 109 -66 25 7 -255 -16 0 81 -187 -69 90 -149 -93 -5 -89 4 -110 94 13 -109 42 178
7142A78j42j3J98k79L7j56o6L59j38O6j10p1R9j67J36j8RK8P8n7j22L28m77L54
$$ 178 36 23 221 -58 -21 -177 -243 116 -22 44 -66 -137 -38 -205 -69 -87 -78 -50 28 -29 -151 177 -300 54
7166E4k24J03K9K4R9j60n2K70k04j41K74j26P7K1RJ8q1k54J00K71l10N0N43l47
$$ 54 -170 -67 -38 -14 85 -75 -127 143 -61 -202 72 -54 23 44 53 71 -10 -264 -164 107 -203 -153 390 43
7190D3l0J09L2k66O5n6l0J51J0k0l9L1n7J95j22J34j58M6q8M9J32n09L96J01j96
$$ 43 13 122 154 -112 -47 -103 -133 18 28 8 -31 0 -57 138 16 150 -8 38 -50 -1 131 -378 18 119 -77
7215g7J05O4P0j92l2K76k53P1k95J26O5J82m2k2n6j06K72k4j03J0J26l4j1J14
$$ -77 28 92 162 -30 -62 214 -39 32 -263 -137 -72 110 68 46 -10 -116 156 132 29 39 165 131 120 234
7239B34k42r7P6k55L24l62J29J0K12j16K65k67J13k7o6%Q8j27J03o0N7r6K33j20
$$ 234 -8 -105 -29 -284 40 -322 -193 -183 29 -87 178 -89 24 -3 -69 -69 19 -108 -5 -65 -8 -104 129 9
7263Ik41J66N1j51R0J32N2J2j34P4n0J05j51l27L54k1L3K7l9J8J4Q6M3j81J58
$$ 9 -232 -66 -15 -166 -76 56 108 120 -14 60 10 115 -36 -363 -9 -30 3 30 -9 9 23 109 152 -29 129
7288A29o4r3L0pp9J38j17P2k42K18k31J86J77k99Q5R0J87j3k09j37K56l03K92
$$ 129 65 -28 2 -5 -84 54 -63 9 -233 -15 -246 -60 117 -182 -97 -7 180 167 -42 -179 77 -226 66
7311F6n0r7K35l34J3Q1j33K67j72J28k9K28j63j36k8J36o7M6K24m44J77J37j04
$$ 66 16 -81 154 -180 -167 -86 -219 48 -124 4 -25 203 40 -96 -124 12 -55 -9 215 -229 -52 85 -19
7334a9J02jk56K0M1J28j16K8J61J6j48O2J13j94Q2J17m99L25K86l50lJ36l95M76
$$ -19 83 82 -174 -154 -113 15 -101 -73 88 104 -44 18 131 -63 19 136 -363 -38 248 -102 -105 31 -364 112
7358A12j78K26l20M8J55l2N0l23M17k10K06l5Qq9k0J07j89K52m41j17J84L42O6
$$ 112 -66 160 -160 -112 43 11 61 -262 155 -55 151 116 124 35 15 122 -67 185 -256 -373 -189 153 219
7381B19j64J0m3r0m0Q2k8j83L68n7k17j40L38J0p6K06o2j54J54j73J67J2p0P3
$$ 219 55 65 22 -68 -108 -26 -54 -237 131 74 -143 -283 55 65 -11 195 133 -21 133 -40 127 139 69 142
7405A42j87M0j26J51jj95J81j45R7p2K73q3n8K81l83Q9J6J69j68p2O5J67m21o1
$$ 142 -45 -5 -131 20 19 -176 5 -140 -43 -115 158 75 17 298 -85 4 20 189 21 -51 14 181 -240 -301
7429c01K98J44Lm8j67J46Q7j32p5K04j43n0k5J29Kj54m2K36O2k45P2n8J68k29
$$ -301 -3 141 144 96 -71 75 162 30 -45 159 16 -34 -59 70 72 -82 -124 112 174 -71 1 -57 111 -118
7453a18Q4n4K43r8j75nj6J71Q5o7r6Qk13J37Mj5O6N6l32M23j09j56K16L5l2J58
$$ -118 -34 -88 155 57 -118 -123 -139 32 117 50 -46 -38 -251 -114 -110 -125 -59 -3 -335 88 -21 -177 39 74 42 200
7479B00Rj59j14j01J83J68j83J70n2j38K71l25J86q2m3J03l41K5K41m1k04Q7J62
$$ 200 209 50 -64 -165 18 186 3 173 121 -17 254 -71 115 33 -10 93 -248 -223 18 -23 -227 -140 22
7502B2J66k16J49n6j19J13q6N2J53l01J23j30N6K59j65k20N06j45k68O5j0J9M4
$$ 22 188 -28 121 65 -54 59 -27 25 178 -123 0 -130 -74 185 20 -200 306 161 -107 -42 -52 -33 11
7525A1l1R7q4K09k01N8q4K4j16J16P9k23m0j1J46N8J32p8J00L2r7q4O5l63L85
$$ 11 -20 77 -7 202 1 59 -25 -1 -117 -1 78 -145 -185 -196 -50 8 140 62 162 194 97 13 78 -285 100
7550A00J50k65L6k4J9O7j68J00l9o9K3J57j8J92l25l1o4N0L79j55k52L30o5l58
$$ 100 250 -15 21 -3 16 83 -85 15 -24 -93 -70 87 69 261 -64 -95 -159 -109 270 115 -137 193 128 -230
7574b30M41p1nL0J3k41K84j85Q5k18o9J70k2o9J18j80J54J04j72j85J28K21k48
$$ -230 211 140 135 165 178 -63 221 36 121 -97 -166 4 -18 -87 31 -149 5 109 -63 -248 -120 101 -147
7597a47J4J16N1r2o7J73j25N23m64K58l15J00j50Q9J31l85K38p3P0K5K11k57J13
$$ -147 -133 -17 34 -58 -125 48 -77 446 -18 240 -75 25 -125 -36 95 -290 -52 -125 -55 -30 181 -76 37
7620C7j40O4J00j93K21L0R3j96J36J37j09j52K21k71l2P6m8K6j86J09n3J23O3
$$ 37 -103 -39 61 -132 89 119 212 16 152 289 180 28 249 -22 -54 22 -26 0 -186 -77 -130 -7 56
7643E6J4o6k24K89j66K87k43K68r7p8P8j23J07j10K25l25N9k5J90N1k49R8j26
$$ 56 70 4 -220 69 -97 190 -53 215 118 40 118 -5 102 -8 217 -108 -49 -74 116 167 -82 16 -110
7666a10%L11n3k73J25qQ4l2k6L4j66%K94j49J84j95k94K98L03o3l87J59r3J92
$$ -110 -110 201 148 -125 0 -8 76 44 18 52 -114 -114 180 31 215 20 -274 24 327 264 -123 36 -57 135
7690A35l32K18j23J79N5j03kK59j50k06K06O8l19J53J08j68MJ48j83k19K31o2
$$ 135 -197 21 -102 77 132 29 27 286 136 -70 136 204 -115 38 146 -22 -18 130 -53 -272 -41 -103
7712a03K20q4Qo0J09n3j83J67k6R8J06k37j5N7R2Lk25L03m30K82k33L6J09Q2J94
$$ -103 117 33 41 -19 90 37 -146 21 -5 93 199 -38 -53 4 96 99 -126 177 -253 29 -204 -168 -59 23 217
7737B17k67M13j75j92l2mo0o6R7j09K68lP9j71P5J1k68J72r2J06J50m24K36j09
$$ 217 -50 363 188 -4 -36 -40 -100 -166 -69 -178 90 87 166 -5 70 81 -187 -15 -107 -1 149 -275 -39 -148
7761a48N4K54k47O9l49M43k9j88mR7J05M9n6j47j64M39R2n98M74O5O2l85JK50
$$ -148 -94 160 -87 -18 -367 76 47 -141 -145 -48 57 106 50 -97 -261 178 270 -328 146 211 273 -112 -111 139
7785A39k45j12M25k04j10K51k95Q7K25l58J63J25j25L91m90LK37j95J31j69K1
$$ 139 -106 -218 207 3 -107 144 -151 -64 161 -197 -34 91 -34 357 -133 -130 107 -88 43 -126 -105
7806a05j05NK01R6l49L63l05J48p6K78j16p3j2Q0j0j3q5JK91j04m3J62l09K73
$$ -105 -210 -205 -4 92 -257 106 -199 -51 -127 151 35 -38 -50 30 20 7 -78 -77 214 110 67 229 -80 193
7830A93m56M00j18j26J82n7J47j39j85J26%P2R2l65J85L15N0l87LM1N9k07K45
$$ 193 -263 137 19 -107 75 18 165 26 -159 -33 -33 39 131 -234 -49 266 316 -71 -68 -27 32 -175 70
7853G0q7N5M4p3j16j56K69N0j75K50j52K5l9j92J21K52k37J33J38j55O6j17l8
$$ 70 -17 38 82 9 -107 -263 6 56 -119 131 -21 4 -35 -227 -106 146 -91 42 180 25 91 -26 -64
7876f4M4r1K31m9j00K8J42j34n8k48M87l92L69q5l59N12k99J27j59K81j70J62
$$ -64 -20 -111 120 71 -29 -1 141 7 -51 -299 188 -204 165 80 -279 233 -66 61 -98 183 13 175
7898A75l46K08o8J8j92K89j35p9K79J59o9j14J6l36J03K73k31J21l6J30k57N0
$$ 175 -171 37 -31 -13 -205 84 -51 -130 149 308 239 125 141 -195 -92 181 -50 71 35 165 -92 -42
7920d2J42k79L10l39K67r6q1k1J06j95K00j06J4K28m52L31R7p1M4k8j29j15M35
$$ -42 100 -179 131 -208 59 -37 -118 -139 -33 -228 -28 -134 -120 108 -344 -13 84 13 57 29 -100 -215 220
7943B20j87L28m37j15K6K71L7P0m05R8J0M3O5L0p3l19K26K25P6n4k06N1MJ79k61
$$ 220 33 361 -76 -191 -165 106 143 213 -192 -94 -84 -41 24 54 -19 -338 -112 113 189 135 -71 -20 -16 163 -98
7968i8P5M2j0K37l20R6j34L45j63J24j59j89J77L1j01k54N16j69r1P7J98l27k7
$$ -98 -23 19 9 246 -74 22 -112 233 70 194 35 -154 23 54 -47 -301 215 46 -45 32 230 -97 -124
7991a24J10k2K33j18mM7j72N1J55k03o3M27k26j45j5J84j18O0j95J90p8r4O0K03
$$ -124 -14 -36 197 79 75 122 -50 1 156 -47 -110 317 91 -54 -69 115 -3 57 -138 52 -26 -120 -60 143
8015A43J2j04L4l14M13m7k78L52k50L35n04J96o6J88KM4k69N9Q8R8j73j14J63
$$ 143 155 51 85 -229 184 137 -141 211 -39 296 -208 -12 -78 110 112 156 -113 -54 34 132 -41 -155 8
8038Hj00M0N4n6P1n4km1O8J22J43l54J62l5r1K0j09J36p1q2J26N1j07m4R3L7R4
$$ 8 -92 -52 2 -54 17 -37 -39 -80 -12 110 253 -101 61 26 -65 -45 -154 -18 -89 -171 -45 6 -101 -145 -52 -15 79
8065G9j45j23K48l54J64j02K82q8K8o2J08l18K60O4j20L32k70R1j83K5j2P7j02
$$ 79 -66 -189 59 -295 -131 -233 49 -39 -11 -73 35 -283 -23 41 -79 253 -17 74 -109 -84 -96 -19 -121
8088a21J62R2j45k14M82l04k27K68p1p4L87k58j88K20J12n5K19j90j24J31k5k09
$$ -121 41 133 -12 -226 256 -48 -275 -7 -78 -152 235 -23 -211 9 121 66 285 95 -29 102 77 -132
8110a32m2J25K77o8k60J58k52K75j83m4L11j97j47K04L4k9l1K18l41m3J20J05
$$ -132 -174 -49 228 160 -100 58 -194 81 -102 -146 165 -32 -179 25 59 30 -1 217 -124 -167 -47 58
8132E8J49m27J63j5Q0k00l0J55J26j33M34r0k57N3P9j14r2m1K12l60M4J15k9K47
$$ 58 207 -220 -57 -72 8 -192 -222 -67 59 -74 360 270 13 66 145 31 -61 -102 110 -250 -206 -91 -120 127
8156A27k73P5J83k45J99K62j56m63L97J56l29K19k46L5L13k38O9K8j06j15MK41
$$ 127 -146 -71 112 -133 66 328 172 -291 106 262 -67 152 -94 -59 254 16 85 113 7 -108 -104 137
8178A37k48p0L52k66p6K61K01n70K34K78q4k58J42
$$ 137 -111 -181 171 -95 -171 90 291 -279 -45 233 149 -109 33
8191C3
$$ Imaginary data points
##PAGE= N=2
##DATA TABLE= (X++(I..I)), XYDATA
0@%%%%%%%%%qJ6j6K4l2L2m0N6o5P3r0J14j37J61j92K25k65L12l61M16m79N49o26
$$ 0 0 0 0 0 0 0 0 0 0 -8 8 -8 16 -16 16 -24 32 -33 40 -50 64 -73 88 -104 121 -144 168 -193 223 -256 293 -333
32c33P10q05R13j029J156j298J452j622J809k011K231k473K739l027L342l687
$$ -333 377 -428 485 -544 612 -686 766 -856 953 -1058 1173 -1300 1439 -1588 1754 -1933
48a933M064m477M932n435N989o603P291q066Q942r942J1096j2449J4056j6006
$$ -1933 2131 -2346 2586 -2849 3140 -3463 3828 -4238 4704 -5238 5858 -6591 7465 -8541
62h541J8433k1543K5694l1551M0499n6007R0347l03153J15011L66653m73507P5873
$$ -8541 9892 -11651 14043 -17508 22991 -33016 57331 -245822 -130811 235842 -237665 -161792
74a61792L27507k41629k95790L86405J57740k67323K5356K48963j40153j16439
$$ -161792 165715 -75914 -371704 14701 172441 -94882 -69526 179437 39284 -77155
84g7155J72818M1873j78067L3800J32124n2788j17524N3791O0697q6035n9327
$$ -77155 95663 137536 -40531 -6731 125393 72605 -44919 8872 69569 -16466 -75793
95g5793J28087K6418j77114p832J82197n5071j29140J40874O0880k05554L2414
$$ -75793 52294 78712 -98402 -106234 75963 20892 -108248 32626 93506 -112048 -79634
106g9634K17445j09126j42286J95003L2973k30125P6367J98834j57771j01496
$$ -79634 137811 28685 -113601 81402 114375 -115750 -39383 159451 1680 -99816
116i9816K01813J054j84767O9664J03328j26993l5087J30231p469p9880L1439
$$ -99816 101997 103051 -81716 -12052 91276 -35717 -70804 59427 51958 -27922 3517
127C517M893o4051J2114M3970q912j152J0521r923q529j3607J00M0244l086l7267
$$ 3517 8410 -55641 -43527 443 -8469 -9621 900 -9023 -17552 -31159 -31059 9185 6099 -31168
141c1168M4259L4597o7233k989P0522m3348n3923Q1231J6175r7239K6597P0197
$$ -31168 13091 47688 -19545 -22534 47988 4640 -49283 31948 48123 -49116 -22519 47678
153D7678p3494k1455R4660m2187r1839P8497M5879q7614K8191R3549o7173o8129
$$ 47678 -25816 -47271 47389 5202 -86637 -8140 37739 -49875 -21684 71865 4692 -63437
165f3437P8496L1262n7443J9085M3287m0885k7089L4486J0149j7103j663j350
$$ -63437 15059 46321 -11122 7963 51250 10365 -16724 17762 27911 10808 9145 7795
177G795n521r905j5336J1431J5201j9235O053K9143l1421k8705M0155J803l9690
$$ 7795 2274 -7631 -22967 -11536 3665 -15570 -9517 19626 -11795 -40500 -345 1458 -38232
190c8232M2948M5952n7459j9953O0782j6360m8412N1760K4450o6021J1420N9137
$$ -38232 4716 50668 -6791 -26744 34038 17678 -30734 21026 45476 -20545 -9125 50012
202E0012l9439l2067N2602l734n2635K5145L0302l9001p772L6933j0935k6067
$$ 50012 10573 -21494 31108 27374 -25261 -116 30186 -8815 -16587 20346 9411 -16656
214a6656K0726Q119k5788m236J1334k683K773O489j987J06m050n728R189K761
$$ -16656 4070 12189 -13599 -17835 -6501 -9184 -6411 78 -1909 -1803 -5853 -11581 -2392 369
228C69q473J3242J2366j6775R66K2741j2558j9582J8999O089k3147J2756K1996
$$ 369 -8104 5138 17504 729 1695 24436 11878 -7704 11295 17384 -5763 6993 28989
241B8989k9805j7228L0464l405k6188J8171Q391l0350L792K8905j0069j1878J7999
$$ 28989 -816 -18044 12420 9015 -17173 998 9389 -20961 -17169 11736 1667 -10211 7788
254G788l219k2928J0866K0717r581o564R535m982p356J0621K996j0057l761M79
$$ 7788 4569 -18359 -7493 13224 3643 -2921 6614 1632 -5724 4897 7893 -2164 -5925 -5446
268e446J063K892k544J520P153l299n429O313r62j2665L867J4578k43m87J1031
$$ -5446 -4383 -1491 -4035 -2515 4638 1339 -4090 2223 1261 -11404 -7537 7041 6798 6311 17342
283A7342q110k2559M362J5405o524k903J0113n638o814J2586L684j5727p662M090
$$ 17342 9232 -13327 -8965 6440 -84 -2987 7126 1488 -5326 7260 10944 -4783 -12445 -8355
297h355L811P028J1291J592j0723r325k129L417O288M94m105mj505j556N852l611
$$ -8355 -4544 2484 13775 15367 4644 -4681 -6810 -3393 2895 3389 -716 -720 -2225 -3781 2071 -1540
313a540j3514K120J1287m75k471L906m065m642J0133R703o599n641L914q32j130
$$ -1540 -15054 -12934 -1647 -2122 -4593 -687 -4752 -9394 739 10442 3843 -1798 2116 1284 154
328A54R697K093j0927l811K981J573M261m94j1089q178K709O703P505K763o667
$$ 154 9851 11944 1017 -2794 187 1760 6021 5527 -5562 -13740 -11031 -4328 3177 5940 -727
343g27p210Q11J698k204L365O054o49K236N849n864r871J104K71p04J0496P643
$$ -727 -7937 -7126 -5428 -7632 -4267 1787 1138 3374 9223 3359 -6512 -5408 -5137 -5841 4655 12298
359A2298o076o170r30k220l14M603P56l585N163O602m001n064k245n926K6Q473
$$ 12298 6222 52 -878 -3098 -3412 1191 1947 -1638 3525 10127 6126 1062 -1183 -7109 -7083 1390
375A390J465l243q34m233n123J959N067J604j222j699q37J100L356L006P76O16
$$ 1390 2855 -388 -1222 -5455 -10578 -8619 -3552 -1948 -3170 -4869 -5706 -4606 -1250 1756 2532 3148
391C148J425K239O65n475n213M332K700k419L721o9r460j318M990m902m118O204
$$ 3148 4573 6812 7477 2002 -3211 1121 3821 1402 5123 5054 -4406 -5724 -734 -5636 -9754 -3550
407c550J320m170N940J0297k892p010J66k918k022R448Q659k601k749j820n312
$$ -3550 -2230 -6400 -460 9837 6945 -65 101 -2817 -4839 4609 13268 10667 7918 6098 786
422G86m010l102o20K670K131O5J902j848p291l009J516P63L267R801J609j0009
$$ 786 -3224 -6326 -6946 -4276 -2145 -2080 -178 -2026 -9317 -12326 -10810 -10047 -6780 3021 4630 -5379
438e379j279O643j601p4O994k083n205M711J000m685K181M224r05K75J631m426
$$ -5379 -6658 -15 -1616 -1690 5304 3221 -1984 2727 3727 -958 1223 5447 4542 4817 6448 2022
454B022l580K573K061J80L790n08p556k457p43l222M358L509p851k039P282j158
$$ 2022 -1558 1015 3076 3256 7046 6538 -1018 -3475 -4218 -7440 -3082 427 -7424 -9463 -2181 -3339
470c339m018N582K335l280L012N532j25L382Q696M3m440M77j877m696M897K714
$$ -3339 -7357 -1775 560 -2720 292 5824 5699 9081 17777 17820 13380 13857 11980 7284 12181 14895
486A4895o516o59O3q141n261j367m539m46L902k861k559M798j26n725M336R987
$$ 14895 8379 7720 7783 -358 -5619 -6986 -11525 -11971 -8069 -10930 -13489 -8691 -8817 -14542 -10206 -219
502b19k635o369L444L404J880Q746M173n113n328n237r94P631J751m280L612L861
$$ -219 -2854 -9223 -5779 -2375 -495 8251 12424 7311 1983 -3254 -4248 3383 5134 854 4466 8327
518H327p165l999L451l446m960O565O076k685J693O64j0140j984J1048O70n736
$$ 8327 1162 -2837 614 -2832 -7792 -1227 4849 2164 3857 4521 -5619 -7603 3445 4115 -1621
533a621J288p08l380N655M717k654j006o25m469K76O210L14k222M424P10p484
$$ -1621 -333 -1041 -4421 1234 5951 3297 2291 1666 -2803 -2527 3683 3997 1775 6199 6909 -575
549e75j470K675k321j59J903o10K667l59r173J02J1286J221n945K321K874o309
$$ -575 -2045 630 -1691 -1850 53 -557 2110 1751 -7422 -7320 3966 5187 -758 1563 4437 -1872
565a872K9J0279L542k561j950m445m553J051j038j182O098q7q595l51J294r971
$$ -1872 -1843 8436 11978 9417 7467 3022 -1531 -480 -1518 -2700 3398 3311 -5284 -5635 -4341 -14312
581a4312m451Q499O256M430M400n024r074L609Q173O76N387Q270o411r389O495
$$ -14312 -18763 -10264 -4008 422 4822 -202 -9276 -5667 2506 3182 8569 16839 10428 1039 7534
596G534N509l255k30k270q288j869L248o62r60k097n449j201L378j536n909J052
$$ 7534 13043 9788 9558 7288 -1000 -2869 379 -283 -1243 -3340 -8789 -9990 -6612 -8148 -14057 -13005
612a3005M597K077K765O05o116L56P303R26J182M732n294q011O144R748K185R1
$$ -13005 -8408 -6331 -3566 -2961 -9077 -8721 -1418 -492 690 5422 128 -7883 -1739 8009 10194 10285
628A0285k975p770k529N292K765j021J294L05k812J536j390r311l506M758K826
$$ 10285 7310 -460 -2989 2303 5068 4047 5341 5646 2834 4370 2980 -6331 -9837 -5079 -2253
643b253K861K852m819n647M2L12J317O588J458n545N29O550J316j731R95k149
$$ -2253 608 3460 -1359 -7006 -6964 -6652 -5335 1253 2711 -2834 -2305 4245 5561 3830 4825 2676
659B676l887M005L184k651n93n39l558K91J001m327j768K459j24J82L625J81m556
$$ 2676 -1211 2794 5978 3327 2734 2195 -1363 -1072 -71 -4398 -6166 -3707 -3831 -3649 -24 157 -4399
676d399o57L112J506L838L636n038o334L522L742J27L664r19p959l152J460o01
$$ -4399 -5056 -1944 -438 3400 7036 1998 -4336 -814 2928 3055 6719 5800 -2159 -5311 -3851 -4452
692d452L89L446L07k727m94m38j444p20J235J569M215L868j606k538N87k305O54
$$ -4452 -4063 -617 -310 -3037 -3531 -3969 -5413 -6133 -4898 -3329 886 4754 3148 610 1197 -1108 -454
709d54N053j660m441L210L783k429j070O51m633l686L675K688j038J624J827m527
$$ -454 4599 2939 -1502 1708 5491 3062 1992 2643 -1990 -5676 -2001 687 -351 1273 3100 -1427
725a427k326L664J0k456M71k75J432K634p17j900n07o96m34K150J207k101m96
$$ -1427 -3753 -89 -79 -2535 -2064 -2339 -907 1727 1010 -890 -1397 -2093 -2527 -377 830 -1271 -1767
742a767L340R74q69K628Q18m016j310J521m22K363L030k621k618O32j332k759
$$ -1767 1573 2547 1678 4306 5124 1108 -202 1319 897 3260 6290 3669 1051 1683 351 -2408
758b408r67M69O12R86J318r28j684K97l28J46J886J14o28K699L25j926K389J330
$$ -2408 -3375 -2906 -2294 -1308 10 -918 -2602 -2305 -2633 -2487 -601 -487 -1115 1584 1909 -17 2372 3702
776C702l073j626N18m93N39K591m98k672J63J260j903j458K537K76n61K580L57
$$ 3702 629 -997 -479 -972 -433 2158 1660 -1012 -849 411 -1492 -2950 -413 -137 -698 1882 2239
793B239k86J319j035k825R1L27j32J270Q01j388q16Q42r81l688R5K588O01J555
$$ 2239 1953 3272 2237 -588 -497 -170 -302 968 1769 381 -435 407 -574 -4262 -4167 -1579 -978 577
811E77K885q21j958O76q83j197J609K050K01r17o16J02p48k344k259j52P77J008
$$ 577 3462 2641 683 1359 476 -721 888 2938 3139 2222 1606 1708 960 -1384 -3643 -3795 -3018 -2010
829b010J091Q72j721j666K690J301k199J715L200k450p37L701M57k232J165m90
$$ -2010 -919 -47 -1768 -3434 -744 557 -1642 73 3273 823 86 3787 4244 2012 3177 2687
845B687l139J3K413j619m490M09K509N3Q25O61l107k149P05J397J756J723Q53
$$ 2687 -452 -439 1974 355 -4135 -3726 -1217 -1164 -339 322 -2785 -4934 -4229 -2832 -1076 647 1500
862A500J282m68j974m8q23j844O56L688L343j44k242k860l753R23M968O24j889
$$ 1500 2782 2314 340 292 -531 -2375 -1719 1969 5312 5168 2926 66 -3687 -2764 2204 2828 939
879I39P63L30j889R68n3l214r93J185Q81j13O38j405k533l18K130N21O74J036
$$ 939 1702 2032 143 1111 1058 -2156 -3149 -1964 -1083 -1196 -558 -1963 -4496 -4814 -2684 -2163 -1489 -453
897d53k357K97N246J601j836M64J54o0K282J563k030k042m9J332j053p25k1k205
$$ -453 -2810 -2513 2733 4334 2498 2962 3116 3056 5338 6901 4871 2829 2780 4112 3059 2334 2313 108
915A08k786p68K87R77L38q25Q49K71l60J521n26l981Q16N260J873j73Q03j907
$$ 108 -2678 -3446 -3159 -2182 -1844 -2669 -1820 -1549 -1909 -388 -914 -4895 -4079 1181 3054 2881 3684 1777
933A777m769r03K852k36p67L197N3l554P01K002l489j690K447J437J653L033o57
$$ 1777 -2992 -3895 -1043 -1279 -2046 1151 1204 -2350 -1649 353 -3136 -4826 -2379 -942 711 3744 3087
950C087k996r03J760J311o6o32p94m9M99M46m9M19j924j860Q10P3m40J976n62
$$ 3087 91 -812 948 2259 2193 1561 767 718 1217 1663 1614 2033 109 -1751 -941 -868 -1308 668 106
969A06k273J648K041j331j172q27j114J68K181Q66j511J60J762r98o49J221j464
$$ 106 -2167 -519 1522 191 -981 -1808 -2922 -2754 -573 293 -1218 -1058 704 -294 -943 278 -1186
986a186n29L105J373J242K930j609m981l30K138O3P12J155j587l185M96L46l051
$$ -1186 -1715 1390 2763 4005 6935 5326 345 15 2153 2216 2928 4083 2496 -689 -193 153 -2898
1003b898j969R60K07M97J649o86KJ70l50J058K064J07K71J328l65R99L043o16
$$ -2898 -4867 -3907 -3700 -3203 -1554 -2240 -2238 -2068 -2418 -1360 704 811 1082 2410 2045 3044 6087 5471
1021E471l477j136J096j014l79K170r91l641J230P34m021l40K555j371j260K523
$$ 5471 1994 858 1954 940 561 2731 1740 -1901 -671 63 -3958 -4298 -1743 -3114 -4374 -1851
1037a851K33j071R18O64j829k99K734l56j520M47Q77R15K127m00k085M2j167p94
$$ -1851 -1618 -2689 -1771 -1107 -2936 -3235 -501 -857 -2377 -1930 -1053 -138 1989 1589 -496 -454 -1621 -2415
1055b415L883L036j472k30k76k487m20K479j65j191j54L04p90J247N4l478l09
$$ -2415 1468 4504 3032 2802 2526 39 -381 2098 1933 742 588 892 102 1349 1403 -2075 -2384
1072b384K816j092k172J791L35m35K827J597k160p05p16k503J574M538L85k098
$$ -2384 432 -660 -2832 -1041 -706 -1141 1686 3283 1123 418 -298 -2801 -1227 3311 3696 1598
1088A598n08j389k944J686K652k221k004K222N27J03J541p41j665N89P26R90K031
$$ 1598 1090 -299 -3243 -1557 1095 -1126 -3130 -908 -381 -278 1263 522 -1143 -554 172 1162 3193
1105C193K5j105L62J99m70N19j58l193k163L460J130k423l81r00l976J394L634
$$ 3193 3218 2113 2475 2674 2204 2723 2565 -628 -2791 669 1799 -624 -1005 -1905 -5881 -4487 -853
1122h53j209j872J539j53q00K555J881j739k77J555Q4l22J244j51j767J433K180
$$ -853 -2062 -3934 -2395 -2548 -3348 -793 1088 -651 -928 627 711 389 1633 1482 -285 1148 3328
1139C328N54r45l742l211J839L244Q84J063q11l770j404J688N38r39J090P90j356
$$ 3328 3882 2937 -805 -4016 -2177 1067 1951 3014 2203 -1567 -2971 -1283 -745 -1684 -594 196 -1160
1156a160O96K401j762k355J63m94O27L356P72j987L07Q34K05L07m83k258N87L028
$$ -1160 -464 1937 175 -2180 -2017 -2511 -1884 1472 2244 257 564 1398 1603 1910 1427 -831 -244 2784
1174B784Q66p68J76k072l314Q81K284j256j7J58k682o06L456j51j820N77L92p70
$$ 2784 3650 2882 3058 986 -2328 -1447 837 -419 -436 -278 -2960 -3566 -110 -261 -2081 -1504 -1112 -1882
1192a882J799J387j778n82K083J225N9J71j959k310P32J084q16K023J117l768
$$ -1882 -83 1304 -474 -1056 1027 2252 2311 2482 523 -1787 -1055 29 -787 1236 2353 -1415
1208a415j076J371p20o3J669k94r51K693K115j776j287N48p41p25K565M85j330
$$ -1415 -2491 -1120 -1840 -1903 -234 -528 -1479 1214 3329 1553 266 814 73 -652 1913 2398 1068
1225A068M87j02j594k98n96j614O47R30n0J919J132k797k449J114J341N21J515
$$ 1068 1555 1453 -141 -439 -1035 -2649 -2002 -1072 -1122 797 1929 -868 -3317 -2203 -862 -341 1174
1242A174N48k052o43J911j018j196J708o41j990J588P64j221K69J272n68J02M38
$$ 1174 1722 -330 -973 938 -80 -1276 432 -209 -2199 -611 153 -1068 -799 473 -95 7 445
1259D45j78q95n0Q21J241J574o59k229l47N64j464L01J167j535o7J508q89r21
$$ 445 267 -628 -678 143 1384 2958 2299 70 -277 287 -1177 -876 291 -1244 -1311 197 -692 -1613
1277a613J059j35j370L63J427O08M88J453k71j237N26n73j553P62J198m20J123
$$ -1613 -554 -689 -2059 -1696 -269 339 827 2280 2009 772 1298 725 -828 -66 1132 712 1835
1294A835O4k575m71O65r20m80J700J69m62R13J29j597O69J358j133j347J535J50
$$ 1835 1899 -676 -1147 -482 -1402 -1882 -182 -13 -475 438 567 -1030 -361 997 -136 -1483 52 202
1312B02j148J310j68j599L17K65j541l58R26N95R40M54p14J14J455k95j117J078
$$ 202 -946 364 196 -1403 -1086 -821 -2362 -2720 -1794 -1199 -259 195 -519 -405 1050 755 -362 716
1330G16J415o45N2J148j279p64J267j120k041J209P12j314M12R93r40n17N88n05
$$ 716 2131 1486 1538 2686 1407 643 1910 790 -1251 -42 670 -644 -232 761 -179 -696 -108 -613
1348f13n82J382O15k17R2L74J84j46J09k066l7J045n24n01R23r29q46J233o69
$$ -613 -1195 187 802 585 677 1051 1235 1089 1198 -868 -905 140 -384 -885 38 -891 -1737 -504 -1173
1367a173j229K09J239l59K02K054Q82j039k26k12j252Q10J488o08J29J233r47
$$ -1173 -2402 -2193 -954 -1313 -1111 943 1825 786 560 348 -904 -94 1394 786 915 2148 1201
1384A201l03q49j273m5R61N77k07O31k90p40k44P57p65m09J206k45j007J506M84
$$ 1201 898 49 -1224 -1269 -308 269 62 693 403 -337 -581 176 -589 -998 208 -37 -1044 462 946
1403I46j490l86J66p51L42J229l74l03P90N00M54K00m43l73J66M30n57M29N19
$$ 946 -544 -930 -764 -1515 -1173 56 -318 -621 169 669 1123 1323 880 507 673 1103 546 975 1494
1422A494o16n43P21r69j713O87o35j314J422J505n92l57N18n57r6J102K52k11
$$ 1494 878 335 1056 87 -1626 -939 -1574 -2888 -1466 39 -553 -910 -392 -949 -1045 57 309 98
1440I8J259J761l99p10J45j177o96Q35l18J00J184j344j707K59p18m66O01O21
$$ 98 1357 3118 2719 2009 2154 977 281 1116 798 898 2082 738 -969 -710 -1428 -1894 -1293 -672
1458f72j090P01J875m79j533R53L47o93Q97P36j054J6J390r25p59N23l18o31K6
$$ -672 -1762 -1061 814 335 -1198 -245 102 -591 306 1042 -12 4 1394 469 -290 233 -85 -716 -690
1477f90J61N1K32K77p04j67R33k70k75L80k96j028J743Q63r18M5L84j526m16N83
$$ -690 -529 -478 -246 31 -673 -840 93 -177 -452 -72 -368 -1396 347 1210 292 337 721 -805 -1221 -638
1497f38j0j8J179J52m90N56k14j330p47O24M16P60J253r11j172N65q99q64O93
$$ -638 -648 -666 513 665 175 731 517 -813 -1560 -936 -520 240 1493 582 -590 -25 -924 -1788 -1095
1516a095R7n05Q08R91j034q8J511m58r68J021J231k35Q42R54o75j31J109o87j162
$$ -1095 -998 -1503 -695 296 -738 -826 685 227 -741 280 1511 1276 2118 3072 2397 2266 3375 2688 1526
1535A526M03o73N0N16j146q34N88p90j417M66L58o50m95J219k24j87J695n0j821
$$ 1526 1929 1256 1306 1822 676 -158 430 -360 -1777 -1311 -953 -1603 -2098 -879 -1103 -1290 405 355 -1466
1554a466N74J120p47J90J305n51o81J223j035j327N5L20q58R85Q64o57k70K57
$$ -1466 -892 228 -519 -329 976 425 -256 967 -68 -1395 -1340 -1020 -1878 -893 -29 -686 -956 -699
1572f99o22n03J856l21p50J220L1n79R78O14k208o0R40j56o75J564M87j010L87
$$ -699 -1321 -1824 32 -289 -1039 181 212 -367 611 1225 -983 -1043 -103 -259 -934 630 1117 107 494
1591D94M98j494K08J229r35j32K028j27o27N27r67j268R87R21j464J79L37q32
$$ 494 992 -502 -294 935 0 -132 1896 1769 1142 1669 702 -566 421 1342 -122 57 394 -438
1609d38q2J649q68j030L05L93j234J318J687p96n82J133r30q95J084n32q06Q17
$$ -438 -520 1129 261 -769 -464 -71 -1305 13 1700 904 322 1455 525 -370 714 182 -624 193
1627A93L53j43m74r83j126L83J049o62M52O12n14m64J588O61q48O82M00j456N91
$$ 193 546 403 -71 -1054 -2180 -1797 -748 -1410 -958 -346 -860 -1324 264 925 77 759 1159 -297 294
1646B94K141q19j180R00r49n77M11L5j467l44J381K99l26J83n53q19O66M88k74
$$ 294 2435 1616 436 1336 387 -190 221 256 -1211 -1555 -174 125 -201 -18 -571 -1390 -724 -236 -510
1665e10J129k81r21K59J211p05PJ62j539k67J788L70n72n1L8p15J66J187p41m21
$$ -510 619 338 -583 -324 887 182 189 351 -1188 -1455 333 703 131 80 118 -597 -431 756 15 -406
1685d06J929k88o48J083n43j684Q88r8q02J128L11j962l90J218j89m99P25m36
$$ -406 1523 1235 587 1670 1127 -557 331 233 -569 559 870 -1092 -1482 -264 -453 -952 -227 -663
1703f63j586J298J836n93N8J312j174o07J113k15r06J031K05j025P09O2r90n10
$$ -663 -2249 -951 885 292 350 1662 488 -119 994 779 -127 904 1109 84 793 855 -135 -645
1721f45j58k41K23R51j11r77J250R33j418L46O64j633K30J795k85m16J000q04
$$ -645 -803 -1044 -821 130 19 -958 292 1225 -193 153 817 -816 -586 1209 924 508 1508 704
1739G04j797M25L69r50K82J024l50n55J274k69j287K32J194j19J000M7j205N82
$$ 704 -1093 -668 -299 -1249 -967 57 -293 -848 426 157 -1130 -898 296 177 1177 1224 19 601
1757F01O11q39L52N66r01r67N44J60q44O80M83q73n88R78k8m97O85K68k89J094
$$ 601 1212 373 725 1291 390 -577 -33 127 -717 -37 446 -427 -1015 -37 -65 -562 123 391 102 1196
1777A196Q3j372k6K27n27O99m3p65o9L27m45l80L59j83q98M79P50rP57R92p84
$$ 1196 1279 -93 -119 108 -419 280 237 -528 -597 -270 -715 -1095 -736 -919 -1817 -1338 -588 -597 160 1152 368
1798C68r80J133k64n35J191R3l89M47K45j493l65J54j94k55O56J45q8p4Q5n57
$$ 368 -612 521 257 -278 913 1006 617 1064 1309 -184 -549 -395 -589 -844 -188 -43 -131 -205 -120 -677
1818f77L14Q05r21J71P07k61M2R80n59r44N69k48p11M5M94j59K36N93k30q42O47
$$ -677 -363 442 -479 -308 399 138 180 1160 601 -343 226 -22 -733 -688 -194 -353 -117 476 246 -596 51
1839E1%p08Q61M03k97J57L06q04j30O85q37j015O94Kn45L47O09q56m41J218o67
$$ 51 51 -657 204 607 310 467 773 -31 -161 524 -313 -1328 -634 -632 -1177 -830 -221 -1077 -1518 -300 -967
1860i67p46J635M54k43L44P48o67L24J39p96m9L79K52m35r3q3k27nk84p64K31
$$ -967 -1713 -78 376 133 477 1225 558 882 1021 225 176 555 807 372 279 196 -31 -36 -320 -1084 -853
1881h53J37M05K96M44l84j37N55k18o84O24P23p29K4P15m05p01L27n78n52M11
$$ -853 -716 -311 -15 429 45 -92 463 245 -439 185 908 179 203 918 513 -188 139 -439 -991 -580
1901e80O21n20n3L86k32j25J86l30O1R21r1l6K5J8k31j0Q0j69j31L84j2l7J7Q4
$$ -580 41 -479 -532 -146 -378 -503 -317 -647 -586 335 244 208 233 251 20 10 90 -79 -210 174 162 125 142 226
1925B26k63L71l66m07N05M01j77M1K98m43j3J10p46k32J39j93j27N35J54m72n9
$$ 226 -37 334 -32 -439 66 467 290 331 629 186 173 283 -463 -695 -556 -749 -876 -341 -187 -659 -718
1946g18J37n78J5R72L07l17R04Q63o69nL68m67k94N95l27K24k57M35r53n67r3
$$ -718 -581 -1159 -1144 -172 135 -182 722 1585 916 911 1279 812 518 1113 786 1010 753 1188 235 -332 -425
1967d25m1Q3K27n02L10L67k28J25L73k99n8P67J87l57M59M07p43j10R3m69k76
$$ -425 -466 -383 -156 -658 -348 19 -209 -84 289 -10 -68 699 886 529 988 1395 652 542 635 166 -110
1988a10Q8j23k15K29J7o52k67L74L8J32j5K70l22M86R5m2K46j53l26l16j2K73
$$ -110 -22 -145 -360 -131 -114 -766 -1033 -659 -621 -489 -504 -234 -556 -70 25 -17 229 76 -250 -566 -578 -305
2010c05J97L12np38K89L44l25k51K99M37N3M06O4p04J48l60j8qJ09o0K08P7k67
$$ -305 -108 204 199 -539 -250 94 -231 -482 -183 254 307 713 777 73 221 -139 -157 -165 -56 -116 92 169 -98
2033i8j74J88K3o94M04O06o0O85J28o07J11L87l19K67j20R6k58k82K02k46o18
$$ -98 -272 -84 -61 -755 -351 255 195 880 1008 401 512 899 580 847 727 823 565 283 485 239 -379
2054c79l5m31K6K51k72J62j62M35p2P91j53k04L14j05J15N47K50j62m99Q4k70
$$ -379 -414 -845 -819 -568 -840 -678 -840 -405 -477 314 161 -43 271 166 281 828 1078 916 417 501 231
2075B31l14J32l6l08j97K53p8q6K41n10m63P01L58k0L36j61j24L33J88n39j47
$$ 231 -83 49 13 -295 -492 -239 -317 -403 -162 -672 -1135 -434 -76 -96 240 79 -45 288 476 -63 -210
2096b10m0m7pM17l74l57K38j53l83M45J082n57j78N03j84n7N22k80n35L9O97j3
$$ -210 -250 -297 -304 113 -261 -618 -380 -533 -916 -471 611 54 -124 379 195 138 660 380 -155 -116 581 568
2118E68n40M0J4j62j66L33m23P8m14L1M79M64L50J1k91o82J72R24k30k53oj63
$$ 568 28 68 82 -80 -246 87 -336 -258 -672 -641 -162 302 652 663 372 -310 -138 786 556 303 297 134
2140A34j11K2j17m85o42N39J57l53O22k20J13O1K59l64K21K76k48J63N05L54n0
$$ 134 23 45 -72 -557 -1199 -660 -503 -856 -234 -454 -341 -280 -21 -385 -164 112 -136 27 532 886 836
2161H36n35n09j98q7M49l05k8Q5l64K66M7l2j61L4K79n1O64J93M6l70R0N22j26
$$ 836 301 -208 -406 -493 -44 -349 -377 -292 -656 -390 -343 -375 -536 -502 -223 -274 390 583 629 259 349 871 745
2184G45l02k64m83O49J61k23J2m69n23O77lj46J25N67l94j50L96K38m36k72lM7
$$ 745 443 179 -304 345 506 283 295 -174 -697 -20 -23 -169 -44 523 129 -21 375 613 177 -95 -98 -51
2206e1q5M22rj009J37L04k63M5N0n53M70J14L61J74p9l5l00J94J79%O02j58o25
$$ -51 -136 286 277 -732 -595 -291 -554 -509 -459 -1012 -542 -428 -67 107 28 -7 -307 -113 66 66 668 510 -115
2229a15R7K13K2k58j69m33L4J81O19m92K55N8O6j25O6n0k4M52K45L27l7m29m78
$$ -115 -18 195 217 -41 -210 -643 -609 -428 191 -301 -46 12 78 -47 19 -31 -55 397 642 969 932 503 25
2252B5l31L92J5J66K12n25l18L20j05j4J65M0k18L80L92k1l0r9j03l32M5K47l02
$$ 25 -306 86 101 267 479 -46 -364 -44 -149 -163 2 42 -176 204 596 575 545 446 343 11 56 303 1
2275Al70o3J96r8K71m13k03j99K55M75J93l94K57L35K89m51K36N00m87j90L72
$$ 1 -369 -432 -236 -334 -63 -476 -679 -878 -623 -148 45 -349 -92 243 532 81 317 817 330 140 512
2296E12j9j16N5l22l99r4K69k18j98kM39K81J37j71k26J53Q6K15M94k68j58j33
$$ 512 493 377 432 110 -289 -383 -114 -332 -530 -532 -93 188 325 154 -72 81 167 382 876 608 450 317
2318C17J59m04j26K76l41l31L39L0n3k21Q3j5k58N5M83P6j05K56K14j54J0k40
$$ 317 476 72 -54 222 -119 -450 -111 -81 -134 -355 -272 -287 -545 -490 -7 69 -36 220 434 280 290 50
2340E0l12L66j34K30j22M1m12N59m11r9L12j5j37j40N32J76l00O21m29m92J33
$$ 50 -262 104 -30 200 78 119 -293 266 -145 -244 68 53 -84 -224 308 484 184 805 376 -116 17
2361A7J52k40j66N0K48l19J64l34l18K08J02p2K11M87j36K09j90K4J45K01Pj90
$$ 17 169 -71 -237 -187 61 -258 -94 -428 -746 -538 -436 -508 -297 190 54 263 73 97 242 443 450 260
2383B60QK54n30L61k21l52j74P9l21J0K90O7K19j76J69l99M25K41KL8K28L45l88
$$ 260 268 522 -8 353 132 -220 -394 -315 -636 -626 -336 -269 -50 -226 -57 -456 -31 210 212 250 478 823 435
2406D35J88k95j99J16n47l2J72K91n89j85M62j01k41J45L07k03J27M68l83r6L01
$$ 435 623 328 129 245 -302 -334 -162 129 -460 -645 -183 -284 -525 -380 -73 -276 -149 319 -64 -160 141
2427A41j40M9Rk73j28J80R4q0Lj47J9J98m12K02L14J92j59l25M26J04r5M0l0j36
$$ 141 1 50 59 -214 -342 -162 -68 -148 -145 -292 -273 -75 -487 -285 29 221 62 -263 163 267 172 212 182 46
2451D6P9Q3j05j43K75l39l29K72j39j89L32K16k2K1K72Q9l94K19k25K69J09K18
$$ 46 125 208 103 -40 235 -104 -433 -161 -300 -489 -157 59 37 58 330 419 25 244 19 288 397 615
2473F15l74J23r8k60l95kl32j20O30J50l22J17J00q8M9J42j7J49K89J45m5L03
$$ 615 241 364 266 6 -389 -391 -723 -843 -213 -63 -385 -268 -168 -256 -207 -65 -82 67 356 501 456 759
2495G59q7n23l14J55j41L01J6n17K42K66o03O8L34l93m3K80L08N9n6K23k62j57
$$ 759 672 149 -165 -10 -151 150 166 -351 -109 157 -446 -378 -44 -437 -480 -200 108 167 111 334 72 -85
2517h5J86K22k54K01j41N7q2rl46k04K90o5L1J06L3K54r9p4o0K0O77p53j5K68
$$ -85 101 323 69 270 129 186 104 95 -251 -455 -165 -230 -199 -93 -60 194 95 21 -39 -19 658 -95 -110 158
2541A58J10l40M66n75k0K31j88K2j16N6q1K29L32%l99K05K02j85K93K79m58L11
$$ 158 268 -72 394 -181 -201 30 -158 -136 -252 -196 -277 -48 284 284 -115 90 292 107 400 679 221 532
2563E32m01k36K46o2n49k54O1N06k92L62J22n28K07K56K80k97L48M30k14J83J44
$$ 532 131 -105 141 79 -470 -724 -663 -157 -449 -87 35 -493 -286 -30 250 -47 301 731 517 700 844
2584H44j68k04l71j71J77J83m98K42l7l03R6O3j25j97K0O08j25j2M50p7l49L63
$$ 844 676 472 101 -70 107 290 -208 34 -3 -306 -210 -147 -272 -469 -449 159 34 22 472 395 46 409
2606D09l02j46J26Q4Q2q9j89R2m51M6L2k57L14L79l83P8J87LK68N3m09J53J47
$$ 409 107 -39 87 171 253 164 -25 67 -384 -338 -306 -563 -249 130 -253 -175 12 15 283 336 -73 80 227
2629B27k54j84M84l4m98n8r0l2K34m9k27NN59jj39K29l39o5O84p3k82K45l4l61
$$ 227 -27 -211 273 239 -259 -317 -407 -439 -205 -254 -481 -476 83 82 -57 172 -167 -232 452 379 97 342 308 -53
2653e3K74J82o93j13J93K9k9L57l6j70l24L37l37L90N33m23k24M94m1q2J41k63
$$ -53 221 403 -290 -403 -210 -181 -210 147 111 -59 -383 -46 -383 7 540 117 -107 387 346 264 405 142
2675A42k80Q0J93L1M0j79m19k02M77j21j26J52n3p3R5O47j49j41J75k79j62N06
$$ 142 -138 -58 135 166 206 27 -392 -594 -117 -238 -364 -212 -265 -338 -243 404 255 114 289 10 -152 354
2697C54J34p23L65J4k1j43o9m08K9K52j93J78J95K15l00J18K79k47r8K71l25P7
$$ 354 488 -235 130 144 123 -20 -89 -497 -468 -216 -409 -231 -36 179 -121 -3 276 29 -69 202 -123 -46
2719d6N55j50m23L20j28n67M53pj83K5N8j55K9K34J70l11K0K96m3R6J40k38n6
$$ -46 509 359 -64 256 128 -439 14 7 -176 -151 -93 -248 -219 15 185 -126 -106 190 147 243 383 145 89
2742H9J35l9k84K6l30j16M26j69J1M8J7j09j12K83K28j89J78J74m05K88J7l73
$$ 89 224 185 -99 -73 -403 -519 -93 -262 -251 -203 -186 -295 -407 -124 104 -85 93 267 -138 150 167 -206
2764b06K26L0pJ03Ll14j25k3K47j57R4r3n1L90L48l22J56L23m03k1J9J92l62M2
$$ -206 20 50 43 146 149 -165 -290 -313 -66 -223 -129 -222 -273 117 465 143 299 622 219 198 217 409 47 89
2788H9L19n36J23o2k34M2n4j80L91L90k77j22M5J70j57K26M8k32N2J40j0m3k10
$$ 89 408 -128 -5 -67 -301 -259 -313 -493 -102 288 11 -111 -66 104 -53 173 221 -11 41 181 171 128 -82
2811h2K88q52M07n8Mo4K45j61k18L93J82m00J38J93j6K44K13l04r9K85m9l27M67
$$ -82 206 -646 -239 -297 -293 -357 -112 -273 -491 -98 84 -316 -178 15 -1 243 456 152 53 338 289 -38 429
2834D29k12l04L06k09j82o0L56l38k31N07k49J42K58m8j96K58N7j47p5L0L44m10
$$ 429 217 -87 219 10 -172 -232 124 -214 -445 62 -187 -45 213 165 -31 227 284 137 62 92 436 26
2856B6P3P2l23LJ75l20m8K17o4m6K67o4R0J49j97J02j42L5j5R5k7l2J13j79O7
$$ 26 99 171 -152 -149 26 -294 -342 -125 -189 -235 32 -32 58 207 10 112 -30 5 -10 85 58 26 139 -40 27
2881B7k44K34j46J7j10M76k2k92K83p5j39L45j43j99K67k56L16K42p40q6J23J47
$$ 27 -217 17 -129 -112 -222 254 232 -60 223 148 9 354 211 12 279 23 339 581 -159 -245 -122 25
2903B5j44O5J02j20m08M45j91m8M45J5l28K93N67k58j17J40l45N3J17l26j27J66
$$ 25 -119 -54 48 -72 -480 -35 -226 -274 171 186 -142 151 718 460 343 483 138 191 308 -18 -145 21
2925B1j58j63J11J67k47J61j76J34l23N19K22l88L23J05l62K10O9k63J48J33j15
$$ 21 -137 -300 -189 -22 -269 -108 -284 -150 -473 46 268 -120 203 308 -54 156 225 -38 110 243 128
2946A28j22L26k53j26j32l8R1k67K64K04k10M07l32j55M43k73J01K40l12M6JJ6
$$ 128 6 332 79 -47 -179 -217 -126 -393 -129 75 -135 272 -60 -215 228 -45 56 296 -16 30 31 47
2968D7ql22M3J53r9K05j85OK29J28k85K32J42l64N0L17J05l41J36L6k38o8j04
$$ 47 39 -283 -240 -87 -186 19 -166 -160 69 197 -88 144 286 -78 -28 289 394 53 189 225 -13 -81 -185
2991a85K33l91j12L02k57j23P17n12Q6P0M7L59J08j78L2J45j05j11k48J87lJ43
$$ -185 48 -343 -455 -153 -410 -533 184 -328 -242 -172 -125 234 342 164 196 341 236 125 -123 64 61 204
3013B04k07m6J88k65J75k53q4K85m45N61q7M5j59K83k3j2J38j68J9K50j52m43
$$ 204 -3 -49 139 -126 49 -204 -288 -3 -448 113 26 71 -88 195 172 160 298 130 149 399 247 -196
3035a96R2K92l04k25L20j71M5R0p8K25j66j6J16J27j40P1K37l04j49L54P3p10
$$ -196 -104 188 -116 -341 -21 -192 -147 -57 -135 90 -76 -92 24 151 11 82 319 15 -134 220 293 -417
3057d17K83l9N8m19M49j23j37K84K57n54K63Oj0m4K58j8l36N16k91K88k63R7k89
$$ -417 -134 -173 -115 -534 -85 -208 -345 -61 196 -358 -95 -89 -99 -143 115 97 -239 277 -14 274 11 108 -181
3080a81J33J20l91J62k7J59p6J22j64j18J94l1L82j80j7K26l88Q2R0K4J08j4j12
$$ -181 -48 72 -319 -157 -184 -25 -101 21 -143 -261 -67 -98 284 104 87 313 -75 7 97 121 229 215 103
3103A03L2k26j35o5JP7nn6L52j30J13j04J28Ol3o3o1Q8J91k67K52j23k34J08O0
$$ 103 135 -91 -226 -291 -290 -213 -218 -274 78 -52 61 -43 85 91 58 -5 -66 22 213 -54 198 75 -159 -51 9
3128In1k48J59N4J6P3k93M10j80J21j80K29j62K1L26k41K18j37O3k56l15K17K18
$$ 9 -42 -290 -131 -77 -61 12 -281 129 -51 70 -110 119 -43 -22 304 63 281 144 207 -49 -364 -147 71
3151G1j9j63p1k3J32K06k60PJ98K96k50p1q8J31N4n2J28k99k6j03J3j18L33j11
$$ 71 52 -111 -182 -205 -73 133 -127 -120 78 374 124 53 -35 96 150 98 226 -73 -99 -202 -189 -307 26 -85
3175h5k4K5l81L97jK00j40Q7J10j04P0p3k87r0M46j28K31k23L1k69L7l7J48R9
$$ -85 -109 -84 -465 -68 -69 131 -9 78 188 84 154 81 -206 -296 150 22 253 30 61 -208 -171 -208 -60 39
3199C9k36k33J21L75j42J49J29k34K18qL91l77j36K30j27k31kL4J0k77L19m99
$$ 39 -197 -430 -309 66 -76 73 202 -32 186 178 569 192 56 286 159 -72 -74 -40 -30 -307 12 -487
3221d87L87m0Q1k3K02m1j0Q9j64J08JJ62r3n8j15k63J51J61k57M06l01k37K53
$$ -487 -100 -140 -59 -82 120 79 69 158 -6 102 103 265 172 114 -1 -264 -113 48 -209 197 -104 -341 -88
3244h8J63k59K31k12L07j28R1K35k50k06R8Q2k16Q1q0J46J3q4l6N0o7k48L58R3
$$ -88 75 -184 47 -165 142 14 105 340 90 -116 -18 64 -152 -71 -151 -5 8 -76 -112 -62 -129 -377 -19 74
3268G4m21K88J68j76j29N21p5j80j1J13k84J15J65j69m2n2j79K17L6k81J43L3
$$ 74 -347 -59 109 -67 -196 325 250 70 59 172 -112 3 168 -1 -43 -95 -274 -57 -21 -302 -159 -126
3290a26j19J13J63J94k26j69L16j6k8K16k22k22L8J78j42j81K46J67n34N02o3
$$ -126 -245 -132 31 225 -1 -170 146 130 102 318 96 -126 -88 90 -52 -233 13 180 -354 148 85
3311H5l54K45l3K9j6Q4M06r3j39J40l41K25m5k50P0j75J14o6R4k67k23M66n2j69
$$ 85 -269 -24 -57 -28 -44 40 446 353 214 354 13 238 193 -57 13 -162 -48 -114 -20 -287 -510 -44 -96 -265
3335b65K58k38K8J77l7M0J14p8O2J04J9l9n3j15K51m22J09j06O7J22j04L3L05
$$ -265 -7 -245 -217 -40 -77 -37 77 -1 61 165 184 145 92 -23 228 -194 -85 -191 -124 -2 -106 -73 232
$$ [...]
8191C3
##END NTUPLES=NMR FID
##END=
