##TITLE=1H_LR-758-R4-KA5-K2
 CDCl3
 64 sc, 
 20.12.2023
##JCAMPDX= 6.0         $$ Bruker NMR JCAMP-DX V2.0
##DATA TYPE= NMR FID
##DATA CLASS= NTUPLES
##ORIGIN= UXNMR, Bruker Analytische Messtechnik GmbH
##OWNER= root
$$ XWIN-NMR		Version 3.5
$$ Wed Dec 20 16:30:18 2023 Russian Standard Time (UT+4h)  she@DPX200
##.OBSERVE FREQUENCY= 200.1313
##.OBSERVE NUCLEUS= ^1H
##.DELAY= (6, 6)
##.ACQUISITION MODE= SIMULTANEOUS
##.ACQUISITION SCHEME= undefined
##.AVERAGES= 64
##.DIGITISER RES= 18
##SPECTROMETER/DATA SYSTEM= spect
##.PULSE SEQUENCE= zg30
##.SOLVENT NAME= CDCl3
##.SHIFT REFERENCE= (INTERNAL, CDCl3, 0, 15.7039)
##AUDIT TRAIL= $$ (NUMBER, WHEN, WHO, WHERE, WHAT)
$$ ##TITLE= Audit trail, XWIN-NMR		Version 3.5
$$ ##JCAMPDX= 5.01
$$ ##ORIGIN= Bruker BioSpin GmbH
$$ ##OWNER= she
$$ F:/spectra/data/she/nmr/H-F/1/audita.txt
$$ ##AUDIT TRAIL=  $$ (NUMBER, WHEN, WHO, WHERE, WHAT)
(   1,<2023-12-20 16:29:36.78 +0400>,<she>,<DPX200>,
      <continue with go, POWCHK disabled, PULCHK disabled
       configuration hash MD5:
       00 E9 B6 7A A2 85 ED C7 34 08 36 98 17 FE 4E 26
       data hash MD5: 16K
       9D 8F 2F AD 65 58 27 41 9D CF AD 82 42 91 57 9C>)
$$ ##END=
$$ 
$$ hash MD5
$$ CB A1 1F A4 FD F9 7A 14 C5 9C 72 08 58 0A 3E BD
##$RELAX= 
##$RELAX= 
##$RELAX= 
##$RELAX= 
##$RELAX= 
##$RELAX= 
$$ Bruker specific parameters
$$ --------------------------
##$DU= <F:/spectra>
##$EXPNO= 1
##$NAME= <H-F>
##$PROCNO= 1
##$TYPE= <nmr>
##$USER= <she>
##$AMP= (0..31)
100 100 100 100 100 100 100 100 100 100 100 100 100 100 100 100 100 100 
100 100 100 100 100 100 100 100 100 100 100 100 100 100 
##$AQSEQ= 0
##$AQ_mod= 1
##$AUNM= <au_zg>
##$AUTOPOS= <>
##$BF1= 200.13
##$BF2= 200.13
##$BF3= 200.13
##$BF4= 200.13
##$BF5= 200.13
##$BF6= 200.13
##$BF7= 200.13
##$BF8= 200.13
##$BYTORDA= 1
##$CFDGTYP= 0
##$CFRGTYP= 5
##$CHEMSTR= <none>
##$CNST= (0..31)
1 1 145 1 1 1 1 1 1 1 1 1 1 1 1 1 1 1 1 1 1 1 1 1 1 1 1 1 1 1 1 1 
##$CPDPRG= <>
##$CPDPRG1= <>
##$CPDPRG2= <>
##$CPDPRG3= <>
##$CPDPRG4= <mlev>
##$CPDPRG5= <mlev>
##$CPDPRG6= <mlev>
##$CPDPRG7= <mlev>
##$CPDPRG8= <mlev>
##$CPDPRGB= <>
##$CPDPRGT= <>
##$D= (0..31)
0 1.2 0 0 0 0 0 0 0 0.06 0 0.03 0 0 0 0 0.0002 0 0 0 0 0 0 0 0 0 0 0 0 
0 0 0 
##$DATE= 1703075158
##$DBL= (0..7)
120 120 120 120 120 120 120 120 
##$DBP= (0..7)
150 150 150 150 150 150 150 150 
##$DBP07= 0
##$DBPNAM0= <>
##$DBPNAM1= <>
##$DBPNAM2= <>
##$DBPNAM3= <>
##$DBPNAM4= <>
##$DBPNAM5= <>
##$DBPNAM6= <>
##$DBPNAM7= <>
##$DBPOAL= (0..7)
0.5 0.5 0.5 0.5 0.5 0.5 0.5 0.5 
##$DBPOFFS= (0..7)
0 0 0 0 0 0 0 0 
##$DE= 6
##$DECBNUC= <off>
##$DECIM= 32
##$DECNUC= <off>
##$DECSTAT= 4
##$DIGMOD= 1
##$DIGTYP= 9
##$DL= (0..7)
0 120 120 120 120 120 120 120 
##$DP= (0..7)
150 150 150 150 150 150 150 150 
##$DP07= 0
##$DPNAME0= <>
##$DPNAME1= <>
##$DPNAME2= <>
##$DPNAME3= <>
##$DPNAME4= <>
##$DPNAME5= <>
##$DPNAME6= <>
##$DPNAME7= <>
##$DPOAL= (0..7)
0.5 0.5 0.5 0.5 0.5 0.5 0.5 0.5 
##$DPOFFS= (0..7)
0 0 0 0 0 0 0 0 
##$DQDMODE= 0
##$DR= 18
##$DS= 0
$$ [...]
##$SUBNAM2= <"">
##$SUBNAM3= <"">
##$SUBNAM4= <"">
##$SUBNAM5= <"">
##$SUBNAM6= <"">
##$SUBNAM7= <"">
##$SUBNAM8= <"">
##$SUBNAM9= <"">
##$SW= 18.0517328524113
##$SWIBOX= (0..15)
0 0 2 0 0 0 0 0 0 0 0 0 0 0 0 0 
##$SW_h= 3612.71676300578
##$TD= 16384
##$TD0= 1
##$TE= 0
##$TE2= 300
##$TE3= 300
##$TEG= 300
##$TL= (0..7)
0 120 120 120 120 120 120 120 
##$TP= (0..7)
150 150 150 150 150 150 150 150 
##$TP07= 0
##$TPNAME0= <>
##$TPNAME1= <>
##$TPNAME2= <>
##$TPNAME3= <>
##$TPNAME4= <>
##$TPNAME5= <>
##$TPNAME6= <>
##$TPNAME7= <>
##$TPOAL= (0..7)
0.5 0.5 0.5 0.5 0.5 0.5 0.5 0.5 
##$TPOFFS= (0..7)
0 0 0 0 0 0 0 0 
##$TUNHIN= 0
##$TUNHOUT= 0
##$TUNXOUT= 0
##$USERA1= <user>
##$USERA2= <user>
##$USERA3= <user>
##$USERA4= <user>
##$USERA5= <user>
##$V9= 5
##$VALIST= <valist>
##$VCLIST= <CCCCCCCCCCCCCCC>
##$VD= 0
##$VDLIST= <DDDDDDDDDDDDDDD>
##$VPLIST= <PPPPPPPPPPPPPPP>
##$VTLIST= <TTTTTTTTTTTTTTT>
##$WBST= 1024
##$WBSW= 4
##$XGAIN= (0..3)
0 0 0 0 
##$XL= 0
##$YL= 0
##$YMAX_a= 312616
##$YMIN_a= -299792
##$ZGOPTNS= <>
##$ZL1= 120
##$ZL2= 120
##$ZL3= 120
##$ZL4= 120
##$ABSF1= 10
##$ABSF2= 0
##$ABSG= 5
##$ABSL= 3
##$ALPHA= 0
##$AQORDER= 0
##$ASSFAC= 0
##$ASSFACI= 0
##$ASSFACX= 0
##$ASSWID= 0
##$AUNMP= <proc_1d>
##$AZFE= 0.1
##$AZFW= 0.1
##$BCFW= 1
##$BC_mod= 2
##$BYTORDP= 1
##$COROFFS= 0
##$CY= 11.3945322036743
##$DATMOD= 1
##$DC= 2
##$DFILT= <>
##$DTYPP= 0
##$F1P= 15.7292609196834
##$F2P= 12.9074282941183
##$FCOR= 0.5
##$FTSIZE= 0
##$FT_mod= 4
##$GAMMA= 1
##$GB= 0.15
##$INTBC= 1
##$INTSCL= 1
##$ISEN= 128
##$LB= 0.24
##$LEV0= 0
##$LPBIN= 0
##$MAXI= 10000
##$MC2= 0
##$MEAN= 0
##$ME_mod= 0
##$MI= 1.114404
##$NCOEF= 0
##$NC_proc= 0
##$NLEV= 6
##$NOISF1= 3.799351
##$NOISF2= 2.8
##$NSP= 1
##$NTH_PI= 0
##$NZP= 0
##$OFFSET= 15.70392
##$PC= 1
##$PHC0= -24594
##$PHC1= 12.25272
##$PH_mod= 1
##$PKNL= yes
##$PPARMOD= 0
##$PSCAL= 0
##$PSIGN= 0
##$REVERSE= no
##$SF= 200.130013532006
##$SI= 16384
##$SIGF1= 3
##$SIGF2= 2
##$SINO= 400
##$SIOLD= 16384
##$SREGLST= <1H.CDCl3>
##$SSB= 0
##$STSI= 0
##$STSR= 0
##$SW_p= 3612.71676300578
##$SYMM= 0
##$S_DEV= 0
##$TDeff= 0
##$TDoff= 0
##$TI= <>
##$TILT= no
##$TM1= 0
##$TM2= 0
##$TOPLEV= 0
##$USERP1= <user>
##$USERP2= <user>
##$USERP3= <user>
##$USERP4= <user>
##$USERP5= <user>
##$WDW= 1
##$XDIM= 8192
##$YMAX_p= 0
##$YMIN_p= 0
$$ End of Bruker specific parameters
$$ ---------------------------------
##NTUPLES= NMR FID
##VAR_NAME=  TIME,          FID/REAL,        FID/IMAG
##SYMBOL=    X,             R,               I
##VAR_TYPE=  INDEPENDENT,   DEPENDENT,       DEPENDENT
##VAR_FORM=  AFFN,          ASDF,            ASDF
##VAR_DIM=   8192,          8192,            8192
##UNITS=     SECONDS,       ARBITRARY UNITS, ARBITRARY UNITS
##FACTOR=    0.0002768,     1,               1
##FIRST=     0,             0,               0
##LAST=      2.2672688,     0,               0
##MIN=       0,             -299792,         0
##MAX=       2.2672688,     312616,          0
$$ Real data points
##PAGE= N=1
##DATA TABLE= (X++(R..R)), XYDATA
0 0 0 0 0 0 0 0 0 0 0 0 0 0 0 0 0 0 0 0 0 0 0 0 0 0 22 -51 62 -64 64 -64 64 -64 86 -112 124 -127 141 -164
38 -164 181 -203 221 -246 275 -304 333 -373 403 -451 496 -548 597 -658 731 -809 892 -994
56 -994 1101 -1234 1387 -1567 1789 -2073 2435 -2913 3602 -4650 6414 -9959 19737 -98917
70 -98917 -297780 22184 131544 -11807 128330 312616 103836 -36136 118250 153524
80 153524 37278 83176 133386 30412 -18625 35757 85 -80327 -67410 -16541 -25086 -48861
92 -48861 -37117 -19818 -38545 -39576 8373 27456 4422 24189 45527 4565 3355 64123 50750
105 50750 3005 28231 25989 -31896 247 43865 -25814 -49110 31909 13524 -63060 -17922
117 -17922 23751 -36501 -38428 18155 -11835 -45477 4232 13926 -35706 -26889 4352 -15503 -25292
130 -25292 -5327 -4014 -6033 7070 5508 -591 1958 5553 16293 25019 11766 11199 34622 23561
144 23561 -4820 2999 12059 -8445 -7572 3902 -17764 -26144 -2741 -6544 -29026 -13646 -1354
157 -1354 -15885 -7491 10104 3168 10849 33181 20331 157 14428 24303 13235 14857 18224
170 18224 3718 2125 6451 -9322 -19429 -9007 -6428 -14465 -14998 -14409 -12894 -5880 -5170 -9314 -1829
185 -1829 3994 1193 2384 1548 -4253 5452 19066 3932 -8791 729 442 -12457 -5669 3754 -719
200 -719 3403 12498 -781 -10255 3273 10289 4084 9391 14816 9184 5451 5038 -5132 -8250 169
215 169 1508 -8037 -11861 -12933 -13291 -8148 -7445 -10177 -4752 2957 689 -808 4487 11628 17736 19101
231 19101 12995 7727 8529 11010 6062 3737 2039 681 -920 -8745 -19461 -20558 -12686 -9411 -10067
246 -10067 -6924 -5545 -6216 -3097 -2690 -3020 5143 15667 12783 7588 7486 7958 6508 4676 -874 -3793
262 -3793 716 4257 -3239 -8412 -8385 -8265 -6794 -3756 -3122 -2205 4653 6629 16 -890 4347 6545 4225
279 4225 1966 808 -38 1897 -5 -6735 -8069 -4075 -1585 -4163 -6342 -5203 -553 4529 5619
294 5619 5276 4142 5910 6260 3948 3739 8170 10150 5820 -1143 -5707 -6060 -6094 -5472 -7827 -9211 -5541
311 -5541 -3712 -6215 -9407 -6543 961 4027 5161 4867 4167 6230 10029 7830 4538 6030 7796 2632
327 2632 -4475 -4563 -3421 -2464 -2808 -4233 -7548 -5533 -2855 -4340 -6182 -2802 3116 5638 4949 3702
343 3702 2807 4765 4583 1446 -1132 -989 572 1179 -3004 -6188 -5011 -2418 -3964 -5203 -4253 203
359 203 5374 6128 3336 3148 6209 8628 6237 4426 4477 5652 4685 2088 -3168 -7037 -5312 -5757 -9006
376 -9006 -11674 -8657 -5317 -3972 -5787 -4753 -1871 2109 3470 3565 4288 8689 10666 9073 6084 4114
392 4114 5122 3853 -420 -3808 -4453 -2697 -2926 -5228 -9360 -10077 -4922 -4277 -6432 -4596 -800 2024
408 2024 4104 3972 4018 4703 6007 4968 2295 2551 5541 5329 2026 -693 -2223 -835 -617 -2131 -3049
425 -3049 90 4391 4906 1148 -888 -1197 1423 3823 3802 2222 1531 -42 -3406 -8398 -7978 -5832 -3266
442 -3266 -4005 -6708 -6490 -5520 -3555 -2238 -1714 1627 6897 7769 5500 3278 4572 7360 7301 5550 1798
459 1798 129 -1173 -2659 -6249 -7875 -5450 -5937 -9664 -11723 -10584 -6899 -2369 -417 -1034 31 4517
475 4517 5863 5710 6387 9121 11663 10485 7610 4223 3795 4157 3435 239 -2553 -1542 -1494 -3582 -4890
492 -4890 -4447 -2512 -1044 -1423 -2707 -1967 2209 3179 2961 441 587 622 1140 -1082 -2481 -1573 209 -906
510 -906 -4381 -5487 -2917 734 897 -1086 -611 1231 2615 3166 2645 1852 3964 5113 1401 -2294 -3930
527 -3930 -3119 -2990 -4132 -5354 -5997 -4446 -5905 -6516 -5806 -3060 1209 3337 2064 3073 5852 7880
543 7880 7600 6112 5837 7043 6260 5797 2982 1641 1585 -108 -3870 -6371 -6465 -5069 -3738 -4505 -4676 -3378
561 -3378 -1270 -1367 -3460 -1359 1856 5510 4963 3942 1850 3400 3771 1936 -657 128 1260 225
577 225 -1369 -3460 -2951 -1539 -1650 -2644 -3037 -2453 -722 -463 -1332 -1629 -434 1042 14 -2350 -4076
594 -4076 -1676 -609 34 -1708 -1972 -399 1023 99 -734 2300 4881 5826 5216 4638 5569 6818 5706
611 5706 4108 1938 2133 1097 -154 -2563 -4253 -4159 -3892 -5715 -6882 -7758 -4757 -1819 -1602 -2323 -1289
628 -1289 2000 3885 3899 4159 5547 6680 6613 4999 3283 2005 2584 978 -2232 -4861 -4361 -4148 -5531
645 -5531 -6449 -7126 -5419 -3234 -3347 -4098 -2662 839 3072 2832 2931 2725 4680 4865 3400 2583 3091 3560
663 3560 1801 -1378 -2698 -2010 -1415 -1386 -3030 -2641 -1066 441 -272 -358 -26 3355 3654 2811 468 -14
681 -14 1652 2727 1814 17 -1339 -538 -1681 -3167 -3215 -1444 408 -95 -509 -1444 233 2155 2341 2192
699 2192 2147 4191 3668 2247 -21 -968 -566 -428 -1973 -3650 -3683 -2879 -2089 -3763 -4560 -3775 -1982 -774
717 -774 -333 1652 3003 4808 4963 3003 2011 2928 4084 3244 1287 582 165 -365 -1930 -3780 -4418 -2526
735 -2526 -1807 -2932 -2858 -1652 -576 769 299 126 710 1687 2450 1987 1807 2718 3308 2117 -1128 -1665
753 -1665 -1629 -1188 -1068 -1910 -1638 133 -59 -1544 -1592 -754 1202 2710 2978 1235 1325 1874 1290 173 -696
772 -696 72 500 -1261 -1799 -2423 -1678 -1530 -2124 -3025 -2000 -625 134 -117 336 2012 2900 3295 2160 1114
791 1114 1312 3070 3037 418 -690 -428 -776 -1739 -3116 -3039 -2462 -1481 -1695 -1574 -2033 -156 962 1563 1295
810 1295 1797 2544 2913 2602 1271 1128 1711 1316 -945 -2166 -1820 -1406 -974 -1969 -2036 -1347 -638 -700 -1638 -665
830 -665 981 2777 3860 2550 1432 2152 2174 997 89 271 -241 -502 -1543 -4442 -1835 -1266 -2350
847 -2350 -2946 -3215 -907 371 1169 1034 844 2306 3091 2235 2319 1703 2200 2355 1263 53 -857 -859 -1767
866 -1767 -2871 -3008 -2918 -2916 -2269 -3021 -2858 -1087 578 478 768 840 1551 3323 3676 2242 1678 1613 2220 -8
886 -8 -502 -433 -273 530 -63 -1793 -2375 -2392 -1093 -1623 -1431 1122 1690 1912 998 435 1228 894 1239 49
906 49 -910 -819 -267 -998 -2384 -2042 -2419 -934 -2335 -1854 -260 557 1084 -1020 1439 1257 2546 1052
924 1052 1277 1337 1511 1634 859 -962 -2423 -2462 -955 -2341 -2805 -2453 -1826 -930 -1196 -1609 -1260 1054 1940
943 1940 2459 2519 2470 3557 3761 2748 1438 1729 1735 798 -153 -1216 -806 -682 -1655 -2224 -2528 -1988 -371 -413
963 -413 -959 -1123 810 1070 1303 712 1287 2301 1091 1070 -383 1559 1410 152 -1179 -1295 -1576 -343
981 -343 -887 -1590 -837 -401 336 -227 -1446 -665 -576 300 413 729 590 685 -181 -1191 -2440 -1143 -1228 -2202
1001 -2202 -1633 -1763 -338 -101 1271 1193 1369 1982 2461 3083 2391 1957 3377 3190 1762 796 181 -422 -566
1020 -566 -1543 -2892 -2451 -2089 -1754 -3379 -2658 -2550 -1326 -82 808 1003 537 2106 2850 2142 2392 2518
1038 2518 1903 1700 1234 -768 -494 -520 -1582 -2841 -2186 -1938 -1596 -2664 -1857 -1367 -147 -673 -577 -678 -31
1057 -31 1586 2362 2302 1481 1314 1209 -62 119 408 -267 398 -298 -1142 -1121 -107 627 -571 -911 317
1076 317 943 1557 1410 615 1391 1843 570 -385 -611 339 434 495 -184 -874 -1778 -739 -984 -1688 -864 355
1096 355 845 91 781 1484 980 1755 1875 678 995 1846 660 227 -483 -999 -953 -2158 -3022 -2688 -2001
1115 -2001 -53 -841 -1330 -1902 -630 -155 701 804 1093 1704 1973 1365 1149 263 149 182 -18 -293 -638
1134 -638 45 -675 -1219 -1497 -372 47 -143 -532 -994 -156 336 1169 908 1001 813 607 427 -618 -9 -168
1154 -168 1009 -270 -1236 -1645 -434 -594 -1457 503 -166 240 1192 880 832 1391 1823 1814 1295 581 535 601
1174 601 -510 -799 -1355 -1031 -1119 -2311 -1568 -1799 -732 -908 -1790 -723 765 32 750 1131 1409 1567 3651
1193 3651 2232 738 593 444 574 -167 -968 -1420 -742 -814 -1657 -1847 -1164 -925 -160 -936 336 630 1041
1212 1041 1223 833 1561 2011 1084 566 418 -463 -191 285 -954 -1413 -1570 -1071 -925 -1471 -594 -460 -277
1231 -277 286 316 -73 710 1353 1283 1540 866 1258 1286 1382 -263 -397 -54 -565 -833 -1450 -1271 -1127 -164 -411
1252 -411 -600 -932 -90 1844 446 1100 1608 1590 873 1344 812 -527 493 -311 -981 -291 -541 -1208 -977
1271 -977 -1562 -1003 -564 -826 533 76 623 418 1497 1683 129 632 903 895 127 92 13 -622 -822 -1035
1291 -1035 -1859 -1104 -309 -328 -815 -596 -523 -423 424 635 658 977 1504 1391 1122 -178 599 1099 -422 -561
1311 -561 -680 -814 -891 -827 -289 -697 -705 -902 -994 -890 744 1097 1427 797 376 1632 1577 1410 -171 54 -387
1332 -387 -181 -71 -1366 -589 -1183 -594 -1050 -1035 -200 -421 507 107 493 -204 985 1459 -202 -158 1114
1351 1114 1121 557 601 182 198 -200 -600 -1123 -1141 -815 -293 -842 -1018 -774 484 -430 446 -169 -134 1202 1310
1372 1310 122 451 -292 1218 -206 -167 -740 -259 -1019 -1187 -979 -519 -337 33 434 -462 404 724 983
1391 983 1434 1164 998 854 173 396 94 570 168 -502 -952 -1231 -1541 -254 -293 -1182 -302 341 -94 309
1411 309 275 -7 1195 1859 743 356 1017 1097 509 -146 -697 -478 -82 -1379 -996 -1312 -1115 -1245 -499 -666
1431 -666 -1432 -121 -348 -71 194 1046 1419 1201 1260 609 -415 965 370 -121 -636 -618 -260 -256 -1119 -896
1451 -896 -591 -348 -90 -237 467 1147 390 418 572 1647 697 1133 1131 172 207 769 353 -393 -576 -1230 -1111
1472 -1111 -613 -164 -136 55 157 8 -54 843 893 1514 1010 383 311 744 566 276 -898 -1500 -441 -44
1492 -44 -947 -1551 -1491 -1071 -796 -399 -695 -162 525 830 997 544 343 111 585 81 58 -63 -16 -273 -87
1513 -87 -985 -1102 70 -386 -1355 -1157 -853 -277 300 -75 305 1048 1165 1071 968 1646 548 1086 698 152
1533 152 945 619 273 -596 -1393 -654 -107 21 -583 41 -379 80 84 617 -596 547 212 672 -471 314
1553 314 33 110 412 -361 -348 241 -658 -1124 261 -489 -6 -766 -192 664 297 16 687 349 65 686
1573 686 426 -219 -21 -607 109 -278 -749 -690 63 -660 -1202 -469 -499 -260 -346 259 -166 472 1031 1778 756
1594 756 642 802 911 834 168 485 -101 -17 377 -427 -400 -537 25 -666 -298 -392 402 -24 -93 261 580 993
1616 993 249 745 -105 824 463 344 98 -39 -928 180 -818 -573 -264 -673 -498 -1172 -342 39 -510 -76
1636 -76 349 966 655 653 433 12 -800 -192 161 810 -680 -669 104 -544 -124 -398 -279 -154 115 -135 -461
1657 -461 -709 868 1161 633 23 1029 505 -9 411 -44 -325 241 -800 -753 -745 -19 -432 -202 -999 -246
1677 -246 -626 -277 149 558 499 313 658 759 505 130 152 402 401 -480 -711 -383 -568 -942 -389 -530 -1254
1698 -1254 -168 -973 23 50 781 -1 149 180 38 1174 73 98 -214 390 -83 -385 -1311 -760 -760 -603
1718 -603 -572 -549 -252 -374 -87 -674 -824 406 159 631 -173 29 53 -2 -443 -68 -17 -547 -425 -1351 -639
1739 -639 -343 -270 -363 -792 -940 370 217 294 100 205 305 1185 -127 1129 723 497 -223 487 -181 326
1759 326 124 -46 276 -551 -745 -655 -761 10 -135 505 792 955 299 178 -180 482 1012 557 138 -34
1779 -34 126 89 -122 -740 -245 -791 329 234 -38 -290 -60 201 1027 194 595 591 798 -837 351 261 501
1800 501 -501 108 -561 -608 -325 -666 -181 -742 454 -148 -291 -336 -501 664 634 258 767 518 981 392
1820 392 -182 -58 -61 121 -837 -452 -169 -182 -1036 -532 -416 -96 -292 -577 26 -545 319 276 336 54 773 262
1842 262 703 332 -311 300 -108 -511 -217 -732 -1093 -42 1091 -47 -901 121 -410 1238 387 125
1860 125 316 622 246 194 114 11 123 -499 -400 -143 -292 -381 204 -482 -393 -630 -908 -43 -157 -298 412 34
1882 34 1003 379 583 535 -73 337 -497 -872 363 59 -380 -318 -440 -425 -623 179 -754 -492 671 413 54
1903 54 -394 363 182 735 646 259 545 54 105 -234 -52 -327 -493 -972 -294 -568 -40 -550 -167 203 300
1924 300 -281 399 44 -140 569 697 472 620 239 559 -53 334 196 -397 107 853 -209 -976 131
1943 131 312 202 579 286 476 -148 -186 118 184 273 570 661 -431 -387 -687 70 89 -1111 -1075 91 391
1964 391 -900 -355 9 527 -97 322 693 279 -25 631 161 -204 -135 244 -172 -742 558 316 -580 -184
1984 -184 -828 -371 -773 -331 499 -452 -419 210 651 399 448 532 12 -484 -34 300 266 344 57 476 -900
2005 -900 -459 -260 -155 77 -615 -927 -844 429 -655 13 568 -597 -14 577 -412 -272 456 229 -29
2024 -29 394 189 -424 -451 169 -795 -326 -933 -155 -549 -370 336 193 273 72 376 736 -36 506 362 -304
2045 -304 100 -866 -785 -89 -393 -305 -275 415 88 271 -212 518 259 306 338 786 437 1 668 794 618 65
2067 65 5 180 -344 315 -182 -278 -477 -174 -821 -611 -367 260 -304 236 313 589 288 -108 578 823 520
2088 520 713 207 -144 -796 42 -384 -147 -298 -51 -126 -588 -818 389 347 -53 61 191 324 -386 550
2108 550 642 273 -194 42 522 -785 -331 -699 375 -265 -114 -647 -143 -438 -163 107 -404 31 33 346
2128 346 194 -210 -91 265 92 -920 -306 263 -638 -16 -578 -587 -61 -698 -633 -43 -586 103 365 -376 194
2149 194 -220 573 827 553 330 -89 373 -258 -19 195 355 -794 -1169 -639 -853 -849 -369 354 116 -3
2169 -3 438 364 731 911 -28 563 -172 135 -176 612 230 14 504 87 -225 118 277 -1104 -557 -942 -574
2190 -574 45 116 262 221 215 -142 -114 429 -94 220 268 -37 62 209 -222 -252 276 -509 8 -84 23 241 -309
2213 -309 -377 377 584 576 11 149 467 588 -138 -78 -106 382 -129 -982 80 -341 -370 -425 -220 450 -5 450
2235 450 308 162 551 371 873 892 -346 237 99 623 802 56 354 74 -222 -576 -324 -735 -88 -543
2255 -543 -385 -735 -43 -559 -225 236 -80 -406 24 -128 612 21 245 152 290 589 121 -591 -586 -70 -227
2276 -227 12 15 61 168 58 -277 -221 377 -196 159 266 218 385 -50 -56 324 151 -229 -881 -363 -46 -378
2298 -378 -122 298 -87 -403 -551 -306 -206 -476 443 -317 208 -528 363 259 1 15 -281 79 -128 93
2318 93 -841 -192 -349 -172 -979 -21 22 19 271 239 -518 294 108 629 204 13 55 -86 -611 -361 -163 -617
2340 -617 149 -310 -359 -13 251 92 45 -167 -641 792 240 -140 284 696 1403 -161 99 -38 409 -464
2360 -464 287 -640 -401 5 -636 102 -375 609 -859 631 -683 -207 337 -7 220 439 -273 -232 135
2379 135 328 647 -68 28 -349 -380 -398 -50 -435 -561 74 317 634 -331 83 174 -40 371 -33 16 959 520
2401 520 366 -229 87 466 -218 381 -400 -67 -422 55 -568 166 -200 172 -667 -477 181 562 489 256
2421 256 262 392 707 -263 -503 -129 -112 257 -330 344 -16 -298 -356 -274 321 -197 66 -69 158 544 33 684
2443 684 -54 -236 3 296 793 -333 314 -127 -14 -165 535 -362 208 185 -304 -30 173 -122 -2 -626
2463 -626 -196 -450 -33 294 -189 -149 -531 -285 234 -468 581 27 -382 -236 574 65 -88 450 189 -567
2483 -567 127 288 23 -20 -548 -513 4 -222 130 -127 -646 -377 -250 444 743 -344 -131 -296 -426 351
2503 351 -279 293 251 626 -338 129 176 -362 534 183 203 226 305 490 -292 -174 -525 -297 -546 -210 180 85
2525 85 305 543 226 325 270 492 177 477 689 -60 -33 -541 -466 -388 159 22 302 -577 150 291 -513 148
2547 148 624 -612 937 440 161 220 -231 124 -221 406 -93 -89 285 -861 -67 -287 -295 183 -494 -843 -261
2568 -261 142 -113 194 -540 -507 -31 -532 -640 -170 1085 -223 47 417 165 -392 -638 557 361 -158
2587 -158 -736 -598 -342 95 -767 -184 -310 107 -145 25 243 408 58 -475 508 102 149 248 -33 -83 931
2608 931 489 -122 -655 -357 -474 -15 -164 -615 458 -125 -452 -24 511 537 495 85 61 237 -556 -338 -885
2629 -885 -598 -476 -357 -306 -573 99 -4 -318 731 -51 132 100 849 456 197 749 -149 -349 -117 14
2649 14 -618 171 -130 648 -83 -863 -254 231 28 60 -206 138 -182 506 337 -598 -99 283 -133 66 422
2670 422 -283 -700 -350 -249 -259 316 72 -182 -691 -1165 -357 69 -133 594 -532 179 377 83 237 272
2690 272 126 59 -283 105 -560 -18 -122 -47 -348 -156 526 487 992 41 -177 -44 -142 -123 -207 133 31 291
2712 291 77 -26 339 752 57 314 -214 -178 -298 -336 233 458 655 -451 -244 543 -126 -304 81 -897
2732 -897 72 55 272 -147 -393 151 534 -563 666 -169 -322 -1 -61 408 349 -265 634 20 5 -30 -271
2753 -271 -162 -13 321 359 28 498 259 130 -329 347 -259 -79 233 -143 -42 -131 -69 581 -176 644 189
2774 189 593 -19 273 677 -68 -286 -190 542 -677 -309 -79 471 -96 -170 -331 69 -763 -365 -656 -362
2794 -362 5 225 -737 583 -277 52 -197 -429 388 16 0 -624 -98 504 -135 346 -124 355 238 342
2814 342 -458 116 -56 -96 212 -271 -388 -238 902 -203 185 -120 249 300 281 60 376 655 -172 -253 438
2835 438 208 349 692 -213 -160 108 -80 602 946 952 252 -328 391 399 246 669 255 -326 -170 59 158 16
2857 16 42 528 455 56 154 -121 -98 39 301 -225 297 33 264 100 755 -595 468 216 -539 -195 5
2878 5 406 -711 -75 -467 -55 671 506 352 78 -230 79 -106 962 -393 -125 228 198 768 569 -1127
2898 -1127 -238 -41 -124 266 -783 -350 -100 767 -543 -80 -177 127 171 525 437 46 151 144 164 525 -383
2919 -383 -78 -302 152 -21 508 27 315 -196 365 343 664 537 -11 -321 815 -682 -359 -541 332 172
2939 172 512 -159 -405 -16 554 -537 -539 323 -200 -205 -73 -57 157 544 226 -323 917 410 -375 -547 -292
2960 -292 119 36 591 -682 111 -487 -220 -363 -826 -234 190 -213 356 359 -202 550 -197 264 -71 120 197
2981 197 6 630 141 275 -333 342 259 -7 -570 -351 -119 172 226 -352 -97 127 305 -653 -406 -615 -507
3002 -507 370 123 10 -217 -677 449 -353 517 279 -698 -388 64 -143 1 393 -506 -13 -131 1023
3021 1023 -56 -120 -35 -285 137 181 -89 -310 312 390 -218 -131 -492 -213 -365 -103 282 22 -410 -95 -903
3042 -903 -455 67 98 108 198 -114 -735 632 -298 367 -390 969 -295 -732 -992 146 -141 510 188 -303
3062 -303 -21 -11 -265 -628 -170 70 -76 271 140 -616 -125 -259 216 -453 124 -1092 -136 -7 -233 252
3082 252 -263 152 355 598 122 88 -316 -128 236 -493 413 352 508 -261 45 -756 -11 236 81 -74 -205
3103 -205 109 141 135 -311 521 -351 -91 -360 332 -357 579 -343 -15 -402 13 -317 129 403 120 -441 -665
3124 -665 204 353 642 -645 -341 -450 -139 -72 -179 -290 233 -233 -409 252 11 244 29 -164 -351 -63
3144 -63 416 589 -7 -26 15 -115 363 318 -4 -23 -770 -345 195 -313 694 -453 160 65 7 -276 23 134
3166 134 -595 553 -804 -300 -400 339 -318 87 187 474 831 -390 -277 582 -623 -19 -134 -520 490
3185 490 318 -23 -366 -337 159 18 -246 567 -205 61 -243 -511 -924 159 881 -846 -6 371 376 379 -147
3206 -147 -204 -1146 -387 -111 -197 987 -237 80 15 -274 -47 -227 190 -102 -436 -495 -251 -530 320 -105 52
3227 52 343 -445 -146 639 -180 -525 510 361 122 72 -871 -257 -611 576 289 -26 0 417 378 399 478
3248 478 -642 -384 -141 -20 365 516 -10 11 -281 -366 -326 -225 -209 -331 -7 403 -13 109 -433 -55 426
3269 426 -186 -221 18 -106 -620 -144 -32 -855 472 227 176 -272 421 -206 873 -515 195 -175 24 501
3289 501 -278 -135 20 -166 -825 -285 -194 -292 -173 -20 801 -938 -125 -593 -381 653 -467 37 -646 619
3309 619 -539 65 -11 -356 -129 -93 254 260 -686 38 166 444 572 711 206 -263 -336 -782 156 105 405 -372
3331 -372 693 -77 -99 -227 173 422 -340 -340 366 -599 493 630 422 353 5 38 715 -689 -282 326 181
3352 181 -336 258 -703 373 -575 -108 395 222 23 -75 -141 114 -190 -577 79 69 -42 -409 -305 -109 342
3373 342 -23 -324 -333 472 346 143 350 85 -567 413 -191 -287 612 -58 -450 695 23 187 594 -119 439
3394 439 868 736 -13 -5 233 179 -732 919 550 69 29 407 -101 -74 -242 -403 54 -380 -736 -381 298
3415 298 -350 -365 146 -332 760 -234 -7 -533 -9 -200 -396 358 504 -456 111 -286 -72 436 -448 73
3435 73 -108 -199 -315 -200 -416 -709 -680 -209 208 -219 449 28 -107 -264 -195 405 689 278 102 -13 -141
3456 -141 691 -21 -70 102 -548 -484 -78 -310 689 -646 342 -265 5 -351 461 -498 27 -237 -346 403
3476 403 -245 -517 458 -102 111 -247 -356 -146 -108 -89 245 -388 82 -281 22 574 185 -546 -134 385 -619
3497 -619 20 -204 -1 -1023 -156 -244 1 99 -83 270 -602 286 -178 -31 938 757 464 -205 650 -500
3517 -500 -470 206 -661 111 -196 -926 -476 -838 252 100 210 103 548 536 434 -33 -19 -294 386 -193 -152
3538 -152 163 343 224 -86 -308 488 139 -571 -294 238 299 382 -96 -256 -59 -376 103 -21 457 -333 341
3559 341 -21 -435 -386 -167 9 37 142 227 39 782 243 92 -112 -499 224 136 140 -146 273 -25 -20 764 -252
3582 -252 515 2 520 102 -107 -102 -506 402 715 -52 143 114 432 -17 53 -276 301 -437 -111 -78 -200 64
3604 64 -280 -537 236 -606 425 -634 176 -229 -135 -670 -193 -33 78 -194 610 326 0 -796 -205 -157
3624 -157 58 542 385 -147 -145 -13 -371 -232 -256 -242 -515 517 281 416 503 341 428 101 267 -110 565 253
3646 253 230 119 189 322 -292 56 -267 -198 -138 196 -411 -413 253 151 -54 -172 285 -810 81 -285 -137 90
3668 90 -347 232 -42 -38 -378 95 70 318 588 526 264 -925 -407 198 -124 -229 -430 339 -67 140 63 -173
3690 -173 153 -337 -521 488 -559 178 75 -251 520 422 -553 182 500 -414 99 51 -211 307 -79 2
3710 2 -310 151 294 174 -147 -444 -77 360 -372 19 -430 -765 166 50 426 -678 551 325 -119 28
3730 28 -28 -563 535 769 -462 23 -45 217 -291 169 -53 81 -55 -139 -54 108 -192 539 633 -69 674
3751 674 -465 -225 166 38 0 -514 97 -481 -70 534 137 672 -460 426 410 -432 591 -445 -732
3770 -732 147 -496 615 -61 -267 117 1098 311 383 175 171 -370 -845 406 -228 129 173 517 -182 362 534
3791 534 145 -225 188 -85 -111 94 389 751 -420 -220 -20 -76 -728 211 702 175 -115 69 384 -58
3811 -58 460 -505 -73 445 -559 859 454 -146 -478 -22 180 -296 418 -46 -40 -508 472 296 356 -279 187
3832 187 207 49 136 472 511 -146 -291 349 -226 31 -207 -361 1 -1112 -259 -1066 -377 -589 15 60 -298
3853 -298 -603 -47 223 -130 -765 -198 547 755 -44 -558 302 465 242 -29 15 265 316 -53 285 -297 81
3874 81 -229 57 -604 674 -225 -192 -277 -285 -314 88 -643 -63 461 656 204 395 102 116 364 -172 -281 -432
3896 -432 659 -12 285 313 591 -406 -995 57 123 -13 -60 800 -169 541 -58 238 -89 -422 -223 -703
3916 -703 290 -313 -307 448 331 539 -369 -118 276 192 -692 342 189 85 -182 765 465 -11 509 351 -537
3937 -537 27 832 -206 -622 436 -433 233 414 131 -137 95 334 171 -160 -85 -187 -227 243 -501 464
3957 464 489 -87 -118 74 264 -309 -419 894 -341 -121 -212 -247 -646 45 -219 -437 933 -123 -36 -496
3977 -496 -329 45 426 620 83 76 -5 -336 312 -305 -27 444 -168 112 -539 -376 42 158 177 110 833 103
3999 103 -258 -12 465 235 212 112 36 -369 72 -152 102 475 -175 -679 -87 56 -137 262 612 -336 490
4020 490 212 -553 346 -115 601 139 -19 381 -384 -77 -203 -59 -234 -134 -209 227 74 -178 21 716
4040 716 84 -143 329 -49 58 3 -185 473 -331 -365 19 -78 403 306 224 260 438 541 176 128 522 -575
4062 -575 -309 151 -542 -719 -434 -79 766 233 161 -479 -471 -60 -642 181 -67 -824 -291 225 -196 663 -581
4083 -581 -520 -101 503 26 -266 624 -402 390 -506 -635 -88 -128 -956 212 -329 33 80 -288 281 -418
4103 -418 204 -213 -492 -146 645 649 413 533 505 296 -211 -215 -30 -431 -488 63 428 -334 -217 -151 299 -634
4125 -634 416 -127 62 -163 -168 193 183 487 376 263 -122 92 390 -1 -43 98 401 -199 -21 -313 526
4146 526 603 -37 539 728 219 -180 875 1 -10 -641 -329 -137 107 179 -290 153 -243 -721 609 345
4166 345 5 153 43 -81 -116 231 -189 374 -309 -216 291 603 -501 -36 162 -660 163 171 -282 -134 724
4187 724 348 -260 49 349 -414 257 510 -130 102 -377 32 864 115 915 -117 -560 95 226 385 489
4207 489 -129 553 244 267 -55 -256 87 408 718 291 -474 -119 -162 438 57 -600 284 -29 -72 -159 157
4228 157 647 -18 -91 200 448 -63 -317 -545 734 -180 -25 70 222 -191 -430 19 46 118 19 -290 58
4249 58 -256 -101 -703 5 290 -91 470 -637 223 -194 39 10 -426 730 325 -188 -665 218 284 64
4269 64 -88 563 -107 158 -489 -410 -62 190 46 -525 -140 197 -339 158 -135 512 290 262 -194 -89 -11
4290 -11 -365 -9 -84 -150 -293 109 -1 -764 386 441 -606 225 245 -292 -581 158 -637 561 516 127 75
4311 75 886 393 -151 210 360 -178 -183 -203 -435 -884 -447 246 -380 557 -185 252 176 -199 300 11 531 -305
4333 -305 -360 882 -556 -407 -740 221 -66 -593 29 136 -32 233 -807 -22 525 -149 151 -55 385
4352 385 -139 558 352 -299 -137 31 -161 514 -21 -10 -601 -255 123 -182 -716 -369 130 -94 -513 -113
4372 -113 -250 129 -391 150 324 -263 -463 -387 -609 180 589 -11 74 -41 -351 -684 186 -687 626 122
4392 122 -609 -156 -400 -87 311 -141 592 -115 -70 235 343 794 130 480 278 353 -652 484 461 237
4412 237 24 203 745 -91 180 154 82 -564 -702 -201 339 31 102 321 -953 61 -26 -330 146 -249 44
4433 44 332 -659 -701 -233 -635 -90 315 -416 251 -284 -1052 164 170 -490 669 127 -252 -439 -298 24 -144
4454 -144 648 -72 -129 -1113 39 593 -94 -454 243 -316 102 306 -166 -644 62 380 -307 -348 300 485
4474 485 503 -281 -76 -346 128 548 350 27 848 309 -34 458 193 -425 -203 168 752 326 -305 60
4494 60 -151 -89 135 -300 89 -227 -432 -86 50 -445 -38 -16 -188 93 150 113 -414 335 -575 401 324 -735
4516 -735 244 -253 268 16 -57 -110 261 228 63 97 718 -432 -367 -45 -431 205 -346 -91 -116 485 -250 725
4538 725 -97 -333 -109 -257 248 -1089 -320 -729 110 -510 290 418 422 273 59 -104 -33 181 -374 -362 -202
4559 -202 -23 276 -433 38 -380 46 -18 -485 -84 398 -217 360 -728 -512 552 592 -23 -356 -50 -494
4579 -494 149 -526 -12 194 173 42 313 246 28 453 -220 -196 294 -351 -144 -507 359 544 223 -163 -62
4600 -62 251 -103 449 558 570 -37 -130 -96 -268 -274 412 -234 -9 456 107 611 -574 -515 460 370 -757 -416
4622 -416 413 -56 -295 -173 52 198 242 -127 -315 -340 -172 652 -460 -145 233 -81 -1 344 701 802 132
4643 132 469 435 -69 439 -256 297 -357 7 161 -297 10 -180 -327 -291 -443 -182 321 -206 -446 421 -80
4664 -80 82 614 182 -195 -35 286 -182 -125 37 362 1 313 -333 381 32 -423 -15 -500 316 -720
4684 -720 -715 61 705 144 -76 97 -127 553 134 -262 -222 -504 496 110 -161 231 -126 -202 -481 742 418
4705 418 464 245 310 -95 -29 200 -173 53 -524 -421 693 270 498 -143 -69 -10 -496 137 207 19 476 197
4727 197 282 -529 288 241 -394 -150 244 56 -528 -299 -571 -59 -510 -328 401 62 -211 706 349 -105 54
4748 54 56 347 393 149 -443 351 -539 -91 -191 -57 149 244 -2 -254 -195 -62 -140 338 -197 173 -107 132
4770 132 270 -161 210 500 -343 -187 -186 -352 161 -383 -111 442 -148 362 151 -346 -84 7 147 -465 -131
4791 -131 -244 761 -231 704 7 -662 -63 136 59 -40 -42 -377 -219 -28 113 313 -524 -233 440 -337 589
4812 589 -247 701 467 313 392 -15 -47 -283 -591 -90 -536 224 -5 1180 223 378 -20 84 -338 -63
4832 -63 108 161 -122 -404 -36 231 195 -430 -7 7 -451 -142 -272 426 571 -174 -270 44 -306 -187 200 -243
4854 -243 619 -250 -199 -398 -428 370 -402 736 -741 -502 147 -213 -96 133 36 19 18 -270 102 108 -182 576
4876 576 41 -538 -48 -1021 -256 -654 381 939 -254 -145 -542 -280 -318 -389 90 -101 -196 -52 79 -92
4896 -92 848 310 363 143 -114 540 273 1 -132 -485 -547 -87 101 -48 -621 -272 -61 -514 26 -126 273
4917 273 533 24 -361 -348 -715 383 -656 350 -983 451 -290 291 -104 -421 -232 -193 685 -254 -623
4936 -623 581 54 -353 -317 145 -152 -415 -688 22 680 -92 -82 -10 -183 69 234 446 -473 478 172 360
4957 360 -667 533 74 269 286 395 106 -298 -628 -474 943 201 -68 497 385 62 -10 316 595 101
4977 101 414 -804 -57 -247 21 -285 228 88 93 -463 422 -241 -161 -217 -299 72 338 -711 -367 -130 186
4998 186 264 592 -250 112 -312 -599 -224 -734 -696 640 332 428 50 347 -568 4 282 81 294 255 -432
5019 -432 -461 -215 -465 156 -34 910 -705 18 11 -422 564 -67 213 -706 -161 237 -39 14 -259 308 -77
5040 -77 310 -136 -876 365 -140 519 -181 -547 -794 454 213 493 -280 381 287 544 -520 -269 -80 346
5060 346 124 30 129 556 -243 -268 464 208 103 -96 349 -896 133 287 -435 -35 -84 -643 144 -17 111
5081 111 -12 607 -107 -313 -680 -490 187 66 112 112 -32 705 -22 162 927 290 113 -178 -185 -898 -150 -594
5103 -594 -81 -443 270 85 341 330 125 158 402 -496 -322 -373 -370 -176 90 -544 251 238 -253 670 272 -202
5125 -202 -22 46 7 -40 10 -484 815 87 -661 497 -6 -808 378 507 -25 -321 -369 -577 -336 -324 123
5146 123 521 51 317 -357 554 383 -43 284 -295 245 -901 -224 40 -220 -6 323 -22 480 -511 466
5166 466 309 -68 -16 -7 191 229 -80 69 378 587 387 -927 732 521 184 -61 338 37 -293 360 -64
5187 -64 -328 -397 158 -115 231 67 -122 -54 -715 466 330 -86 -89 -104 -283 -387 486 -27 -68 377 742 207
5209 207 973 40 85 -229 -84 460 365 595 123 -24 -41 620 779 200 170 105 -350 585 -196 503 -216 348
5231 348 83 255 131 659 58 -149 286 -464 273 260 -118 229 773 -121 -19 8 -319 -11 -709 1189
5251 1189 -180 -415 -190 -84 -428 182 30 118 -886 371 -657 -475 -414 -107 379 -856 -711 -461 347
5270 347 889 337 373 181 299 166 159 409 388 -280 367 -279 -591 659 318 -19 -132 -233 1022 -270
5290 -270 29 -191 -641 -544 296 202 -200 -278 -3 520 -665 63 96 406 468 29 -619 126 276 -41 170
5311 170 -47 220 -577 22 80 178 -634 -550 -53 435 14 603 104 980 -256 -296 -565 -715 -42 228 -94
5332 -94 -538 73 -295 -73 238 898 454 193 -495 324 426 202 403 296 -66 -246 358 -684 413 76
5352 76 -396 -393 284 -547 475 27 -545 -370 70 -423 855 -251 194 512 -167 -342 -408 -893 82 57 -436
5373 -436 533 -47 -203 -434 -248 399 1085 503 -327 -104 621 -82 25 -288 -36 83 479 94 -118 -660
5393 -660 -493 -314 -151 31 -74 280 -146 183 -280 -120 86 -350 -45 -207 -137 -375 -482 5 -233 28
5413 28 83 179 179 530 -313 -190 -445 -325 -246 -21 71 -261 105 606 92 -618 65 -160 238 -5 73 -134 -105
5436 -105 -348 241 872 -15 205 -54 333 -358 243 -75 -44 172 429 -62 119 -61 116 173 -655 -214 164
5457 164 -240 447 -333 -567 -415 172 -293 -925 -298 -601 -179 204 194 441 -250 -171 197 277 -16 439 313
5478 313 -91 -266 -464 -487 -554 737 -341 -72 161 -232 -316 -344 -177 -193 500 440 -123 -558 385 -209 1161
5499 1161 403 -278 144 127 187 68 -420 401 15 2 921 100 446 -1051 308 378 423 430 -359 -805 -699
5520 -699 -709 -17 441 -64 -962 -141 537 -545 181 -221 -214 -395 101 -241 -149 -328 228 -241 64 -569 257
5541 257 461 -687 346 -639 -29 504 141 83 -273 -472 -100 -640 -69 -223 427 -288 131 -115 10 -522
5561 -522 -102 -808 -339 -45 450 619 -300 -371 -1020 93 -122 -530 -428 42 -366 -144 -138 184 130 -89 48
5582 48 -177 150 -46 -138 -289 -50 138 410 -782 -293 444 -311 -255 -928 515 31 108 104 744 178 -118
5603 -118 568 -73 30 -197 -212 179 -278 275 -655 215 -754 -650 -444 479 219 -451 -466 95 -737 -79 -232
5624 -232 -367 -254 -621 43 -36 146 63 220 305 -247 -507 -313 79 -161 241 -138 246 49 161 28 -610
5645 -610 452 -8 298 -13 65 174 232 -388 105 35 10 36 -711 -133 339 -519 -24 134 151 277 -48 -204
5667 -204 -362 -1207 249 -73 545 -45 373 -576 -436 -500 -286 1039 -419 183 250 502 -358 -131 69 -175
5687 -175 755 -111 -309 -301 -223 -450 -487 -606 -187 -303 -115 311 -627 -238 -387 433 -237 60 949 24 -411
5708 -411 424 142 142 -65 -111 -4 -115 744 -779 -703 827 -94 144 569 -449 298 306 -261 -448 -160 -54
5729 -54 11 16 172 110 239 -254 -543 -464 188 276 259 -79 -156 -29 -65 -486 -169 292 -132 -520 -589 -39 61 -2
5753 -2 -34 -367 313 49 -367 -581 447 0 502 -4 38 -179 -508 -56 119 202 -531 894 17 522 106
5774 106 -36 -400 -17 457 -144 -244 -599 -313 -160 372 -647 -142 284 79 -482 -742 182 -359 512 -475
5794 -475 -225 -95 335 -519 137 -6 677 693 -902 508 673 160 -595 747 -606 300 -43 38 858
5813 858 266 400 -216 278 -547 375 298 -479 261 -34 -5 29 -118 -294 76 -771 -54 603 -13 -187 378
5834 378 -143 44 285 -28 -435 821 38 407 135 -635 -244 -287 194 145 596 96 427 222 103 220
5854 220 -56 97 63 -178 -154 -470 28 464 56 -38 -170 379 -61 90 -200 201 -451 245 73 90 138 276
5876 276 528 564 186 -145 1038 344 345 359 151 29 -427 -393 20 532 -83 -280 192 161 358 -13 -66 23
5898 23 -649 597 -514 90 -599 275 -507 -465 -195 199 -91 -552 -1109 -396 53 430 -231 -789 81 -665
5918 -665 -973 -56 -228 138 -105 -548 120 -148 31 169 -82 -385 338 539 194 309 9 -211 153 -318
5938 -318 -140 491 -108 -347 143 -549 683 180 36 -36 -4 -1499 44 70 -439 14 653 -115 -718 -97
5958 -97 262 535 297 -266 280 -209 -793 -196 127 352 -256 43 -215 -132 -18 -269 160 1525 -283 -202
5978 -202 -220 -84 -497 -386 -93 115 83 -131 367 -308 137 252 402 75 -321 -147 171 -406 665 409
5998 409 -39 49 146 -49 -344 -504 281 221 -269 -488 -457 -85 -628 445 57 256 23 -3 -79 188 -26 327
6020 327 -422 -78 649 -517 -182 -93 -243 442 150 -158 -10 550 -787 752 -21 823 -353 -366 300
6039 300 140 56 -101 -484 791 381 -178 -371 -768 205 488 -311 -44 107 465 -186 -472 845 89 271
6059 271 -301 172 -1 -494 -423 4 196 522 -422 -437 -840 -492 294 837 -63 -22 -544 -75 208 -573 58
6080 58 -278 50 -230 614 -9 -485 -457 6 426 -189 598 -218 -337 61 -437 -159 -235 438 -90 -90 435 377
6102 377 -943 96 -472 555 522 -246 -78 -636 -107 -138 375 11 -52 -151 315 96 638 -633 -435 389
6122 389 21 222 81 63 -279 380 -327 -231 430 260 1092 480 -760 176 -245 -161 248 -280 -295 -188 222
6143 222 -482 -358 -400 205 140 46 -286 -95 -265 596 -71 60 645 355 213 -166 -647 -208 404 -193 328
6164 328 260 99 -127 61 90 751 -2 -46 55 60 -109 -94 134 -227 181 804 355 -41 249 -183 548 -229
6186 -229 116 -353 -85 229 419 -75 -750 1418 891 -82 -795 267 409 317 26 -389 -159 -387 61 410
6206 410 17 -454 -540 91 762 -17 -151 605 101 673 127 -216 144 -190 67 -157 -380 316 122 -307
6226 -307 -704 451 294 140 185 72 -180 -662 -499 283 426 244 554 276 -237 268 118 -206 294 511
6246 511 521 581 27 -21 -809 -28 580 -411 690 400 591 40 378 33 -357 134 485 -130 -317 -672 118
6267 118 -302 873 220 -624 598 -198 19 -370 242 -293 -204 79 -608 386 33 279 -23 121 -525 -36
6287 -36 88 212 288 -699 -361 -254 -490 -275 116 -147 381 546 -326 419 -326 -423 -122 -93 -406 -277 326
6308 326 -19 -182 120 -276 -73 182 -627 -200 -371 48 -602 -202 228 -11 -278 197 630 75 -157 -524
6328 -524 -266 408 464 169 -547 356 452 -53 0 540 -201 -267 -67 885 439 -468 238 -559 317 351 41 178
6350 178 380 -400 551 120 -594 -16 -896 -394 -65 213 97 413 -276 -165 214 -423 -394 -596 -289 -542
6370 -542 404 -313 219 154 308 -418 267 590 215 -501 198 82 -494 41 -918 84 -974 -635 -90 -83
6390 -83 700 68 202 279 183 -497 28 83 -97 446 -236 302 258 368 -104 219 -37 275 161 -255 -308 -11
6412 -11 101 844 -50 500 -291 218 -94 7 895 764 146 -607 -129 -656 -13 -480 51 -65 -458 182
6432 182 -302 240 213 -217 -19 427 -174 613 -367 213 82 361 -123 -449 -95 -218 323 -503 604 24
6452 24 -149 398 208 -475 -473 -501 -209 223 755 34 -238 231 -435 161 201 32 -340 249 6 293 -536 -695
6474 -695 68 -336 -343 -239 171 502 302 315 -9 341 -166 53 -248 690 506 917 97 -105 -418 -279 -41
6495 -41 1197 -15 60 -528 -449 546 204 -141 -470 26 -37 134 -414 284 29 -314 -86 -143 -156 -37 -502
6516 -502 121 -372 694 -24 -449 174 -156 119 -7 385 133 29 125 -314 -305 115 23 167 227 -25 -223
6537 -223 138 -481 341 143 197 613 47 84 189 272 -603 -12 88 -59 22 -202 136 23 -358 754 357
6558 357 528 762 26 -69 446 429 377 336 267 -363 574 -452 359 -119 -34 176 -275 52 172 605 354 129
6580 129 414 452 65 -212 -327 242 262 -186 -854 -378 29 320 -137 489 -199 -247 -18 163 -1134 38
6600 38 -99 -714 -399 -21 -158 234 -176 -20 -405 -275 15 -558 -148 -621 242 223 233 -702 706 -200 157
6621 157 171 -577 -593 -232 375 197 -199 -214 18 -262 81 356 306 -450 -202 803 336 141 -124 404 -75
6642 -75 -70 319 -490 200 -107 290 80 173 -178 349 -158 -181 -761 -64 186 848 149 -803 -409 -70 -128 92
6664 92 -353 -603 -242 154 -30 -374 -368 93 -634 411 -217 -515 -162 329 -764 -181 -233 -454 -123 -442 94
6685 94 -287 146 365 -830 -63 -278 204 -284 586 -15 -282 -225 -55 -43 -116 -629 122 192 -480 80 -35
6706 -35 90 99 1039 -222 -78 -123 -93 -338 570 367 556 -577 -668 -701 59 125 -87 -72 -387 619 197 -8
6728 -8 727 653 1023 -282 -283 -212 329 37 -329 218 74 121 0 592 -95 -93 14 223 -320 22 -812 -237 531
6751 531 552 -317 -279 130 21 259 41 486 -299 -95 101 -31 -800 221 -346 -169 -149 375 547 -312 302
6772 302 -680 713 -432 -174 -158 -99 -457 -213 -401 -261 239 734 -180 17 -823 66 410 -92 -208 -454
6792 -454 76 -221 -118 157 -43 -124 -56 166 247 1184 346 190 465 -161 -374 136 132 137 -73 -434 174 914
6814 914 -585 301 -200 123 229 -341 -44 -67 -9 -265 -4 -491 -33 -160 143 -457 383 -404 -636 183
6834 183 -170 718 804 143 69 250 241 250 -138 451 -123 -519 50 -313 -282 510 -820 454 -80 -302 -32 271
6856 271 195 -39 310 368 428 -59 -255 -154 -381 -406 667 -547 -234 -240 86 -206 290 310 -13 222 -255 814
6878 814 341 -71 72 -187 -759 -729 -98 417 -147 348 -541 332 333 278 369 -508 1 -714 -555 -370 36 -2
6900 -2 94 -137 -218 309 -616 394 106 -26 502 202 777 -189 -491 -330 -17 -255 -501 -376 -92 1 17 120
6922 120 -564 416 297 -247 120 -513 62 -400 144 -181 473 -128 -418 -648 338 688 -229 80 -83 337
6942 337 -421 135 52 -134 -53 -123 282 -472 -39 -165 437 106 -150 382 186 -288 82 145 -75 -188 -196 41
6964 41 801 -618 237 -691 -38 -723 363 190 134 648 -154 59 357 495 227 30 24 206 -67 179 -538
6985 -538 368 20 66 -509 -240 41 -507 -749 -95 -194 -213 9 -165 540 -157 -302 -544 514 -240 339 297
7006 297 -494 -169 -222 165 276 467 -360 675 -100 1153 65 1096 303 -260 47 -921 341 -267 194
7025 194 -355 -251 131 293 -782 -807 -169 -243 -255 -298 -375 126 344 -345 822 761 -308 473 581 19 410
7046 410 -499 160 -82 70 191 151 -215 -378 -797 809 62 559 6 429 87 -351 601 -462 408 -422
7066 -422 -712 -474 602 -274 -788 292 352 45 124 884 -87 -102 347 88 964 -53 311 11 856 780
7086 780 -526 -130 -450 93 249 -386 180 89 104 -36 -281 91 206 -405 -584 485 -214 204 558 -424
7106 -424 -147 192 208 249 36 145 831 264 -112 -723 658 -163 -282 -112 502 152 -573 -463 215 146 -209
7127 -209 -786 -817 -8 -91 375 -609 -37 -210 481 139 -707 -80 308 757 -12 -153 115 467 -292 267 -604
7148 -604 -240 -176 177 -445 -151 -104 -100 -47 -365 -357 -196 -214 144 -80 -295 -60 -182 -296 176 -127 -158 100 309
7171 309 97 -427 -30 604 68 345 118 -503 688 222 -155 -350 987 315 896 15 -540 372 326 128
7191 128 -329 -515 644 -478 377 -347 78 74 -704 -702 10 226 -204 -41 -640 -314 -657 223 -551 42 -41
7212 -41 -407 -912 -32 -285 176 283 -280 440 3 26 778 -344 695 298 -740 -219 347 132 -458 168
7232 168 -417 -480 125 -695 -266 -247 -792 -134 -304 -265 -137 193 203 -375 3 -377 543 124 -206 -263 394 192
7254 192 -524 -43 -706 171 661 77 198 54 -346 202 -301 -428 456 -344 0 337 -97 -33 -276 -205 -197
7275 -197 122 160 729 -34 354 -921 77 437 2 -404 394 0 -192 -158 -218 -232 -149 160 127 -45 166 -403
7297 -403 -27 -813 60 -637 -233 -57 1039 156 -171 285 -39 -1160 303 -241 214 150 -214 448 417 565
7317 565 -227 210 159 -387 -304 422 -491 107 130 460 -187 -20 -149 -248 277 491 -114 63 -219 98 -346
7338 -346 -756 -98 107 -210 138 46 -228 108 -730 431 343 13 160 46 758 717 316 -368 -174 484 123
7359 123 -310 55 -95 106 -292 -635 -26 240 -426 213 -81 -295 733 357 354 -465 66 361 55 -440
7379 -440 449 352 17 78 -421 -930 145 -691 213 -58 -284 -93 623 -11 78 83 -122 -300 259 449 168
7400 168 196 -91 588 213 -157 69 -288 911 186 400 554 -318 -520 -82 -85 642 132 451 -297 -263 -14
7421 -14 456 -228 -116 -33 257 210 -25 207 78 752 290 84 -135 -116 -134 -193 -320 253 68 269 48 -127
7443 -127 95 212 207 128 399 -833 177 608 552 124 -196 -351 248 -119 126 220 44 293 -367 -73 -95
7464 -95 -341 389 -24 -273 -178 332 679 198 -494 -292 -65 -165 206 377 128 224 440 316 -388 195 -606
7485 -606 -624 -149 555 127 -461 179 669 199 24 -459 -389 -294 24 -47 122 -58 313 -401 -563 -356 542
7506 542 -361 130 -365 -742 -487 449 477 228 247 135 -114 60 -69 -159 62 118 260 -442 111 -316 298
7527 298 -504 -159 -9 225 -155 -566 137 -694 -64 -303 -341 73 -36 -521 408 -19 -206 -157 -185 606 -261
7548 -261 -178 -294 -72 -113 251 46 764 492 566 837 12 -76 37 365 -154 -427 319 137 68 90 261 587
7570 587 -25 118 -388 587 595 379 -55 161 377 -853 -119 144 -123 -45 243 -459 94 -116 -257 -177 -368
7591 -368 -200 216 -186 434 460 335 -127 324 2 606 197 -706 373 494 -439 -286 -453 1054 76 485
7611 485 -206 195 1041 321 510 270 168 -112 116 -482 -319 -892 -171 3 457 36 -495 -564 -175 348
7631 348 -580 -189 76 35 443 408 213 368 -109 -794 -124 496 484 -106 86 382 -205 -477 -109 -632 -6
7652 -6 59 -69 369 47 -659 46 654 422 -421 -147 338 89 445 234 -61 170 89 246 60 90 -614 230
7674 230 -441 875 539 -516 -627 103 -395 -193 -285 -72 221 1 167 437 -42 -92 943 -866 115
7693 115 59 -277 868 80 65 52 48 123 -388 18 -201 -289 441 705 -415 -575 232 257 225 226 130 7 -531
7716 -531 -191 499 59 591 279 388 140 -436 -430 1042 -51 53 -441 278 224 -441 -265 -106 459 442 -386
7737 -386 -61 -268 -290 -58 185 -642 370 225 -200 99 -334 -464 122 94 192 89 -395 660 431 -120
7757 -120 -978 -540 -144 175 -305 -53 -639 285 -24 -254 -535 -65 -185 -98 -156 13 567 -127 -259 200 -234
7778 -234 2 -365 -296 29 943 -306 -247 -292 -217 432 -87 -335 183 -108 325 425 129 340 66 158 -189
7799 -189 3 -66 -13 -445 336 -681 108 -148 -555 -468 606 280 342 -88 576 812 -499 -77 329 55
7819 55 225 -239 -358 -36 244 -287 4 155 -657 348 44 -48 89 118 -12 -161 -141 -548 129 186 -138
7840 -138 751 -310 26 42 22 103 -486 -577 -652 -421 -91 -826 -470 -285 19 -162 -382 -64 273 846 -124
7861 -124 -484 66 -356 -79 -240 -849 -618 557 -8 491 64 -742 147 866 -542 -225 -471 234 107
7880 107 -39 -324 135 -53 168 351 226 36 114 426 -532 -51 345 -399 -382 -221 522 -359 82 90 327
7901 327 177 -9 -633 -178 -60 474 125 306 408 -344 -234 -408 -333 -63 57 -170 -293 -68 206 362
7921 362 -22 -499 -441 -391 -497 257 -650 -466 737 -148 -197 180 134 -135 969 -528 -177 4 58 -49 -113
7942 -113 54 -328 177 -383 233 277 349 -40 463 64 -208 267 11 736 464 -214 -165 227 -359 1002 -43
7963 -43 520 251 190 -422 -532 -279 -452 -709 -437 -203 -223 -302 -1021 96 359 266 210 -131 -356 -207 -303 -398
7985 -398 247 -105 283 141 77 476 -582 214 31 -13 -39 -165 134 21 -11 -287 -588 461 -462 42 313
8006 313 39 -77 -259 789 240 76 -165 77 -453 -282 217 453 -429 -188 57 88 -34 472 197 -410
8026 -410 -144 272 397 463 -349 -380 -685 -4 -84 449 -496 -58 11 93 42 76 229 -162 57 -186 543 -19
8048 -19 33 -4 -157 144 -890 -26 382 -221 561 -49 128 386 64 17 911 530 489 -71 488 -540 -340
8069 -340 -24 284 333 392 -360 171 -392 -332 -701 -461 43 -14 39 28 -14 4 -212 780 33 -470 262 -58 -533
8092 -533 -142 309 34 61 2 89 -393 640 -407 -279 -380 443 -931 151 66 495 347 291 -782 285
8112 285 429 -590 712 -414 -226 595 -214 87 -370 -314 340 -252 -672 -142 21 -528 -67 -449 -212
8131 -212 -106 233 260 110 212 63 80 81 711 36 -421 597 -33 -13 -122 -46 -110 265 134 -455 -449 -362 -413
8154 -413 436 -180 -63 321 -200 76 165 -121 -96 -342 -60 618 344 -272 94 10 323 -97 78 1111 245
8175 245 121 200 -625 -397 -82 436 18 -123 231 5 281 358 205 -138 91 -540
8191e40
$$ Imaginary data points
##PAGE= N=2
##DATA TABLE= (X++(I..I)), XYDATA
0 0 0 0 0 0 0 0 0 0 0 0 0 0 0 0 0 0 0 -64 64 -64 64 -64 64 -128 128 -128 183 -192 208 -256 290 -320 381
33 381 -428 477 -534 602 -678 759 -842 941 -1043 1158 -1279 1421 -1572 1729 -1908 2103
49 2103 -2316 2554 -2817 3096 -3419 3779 -4181 4640 -5171 5785 -6512 7376 -8442 9781
63 9781 -11532 13912 -17387 22928 -33180 58861 -299792 -247825 71396 -177474 -108923 25148
75 25148 -108437 -251158 -8998 83283 -13967 24984 154764 70103 16199 84468 106670
86 106670 32551 41302 69587 48454 6916 10099 -3662 -43571 -57526 -7232 4046 -45406
98 -45406 -57533 -18029 -25176 -25661 24638 22610 -17101 21329 44542 -10737 5545 74482 31499
111 31499 -14681 43536 44375 -24811 12176 58829 -12074 -35090 40064 28608 -29904 -639
123 -639 25003 -14790 -14653 12367 -13469 -29429 304 -1869 -26922 -24931 -15211 -18196 -21978 -27237
137 -27237 -21382 -944 -1013 -9793 3180 6357 -3804 16980 29701 7213 6205 33872 20252
150 20252 -3086 9600 13596 -5361 -2030 -2664 -26334 -22906 464 -11800 -27165 -12101 -9133
163 -9133 -20397 -6256 4312 -3470 8774 25602 13403 4201 17267 19477 13801 17743 14797
176 14797 5673 8339 7154 -5866 -9371 -3329 -1794 -3315 -8784 -15432 -7322 2748 -3664 -6727
190 -6727 4148 2555 -4779 792 -245 -11727 -803 13203 -1887 -12784 -5518 -5711 -15783 -8232
204 -8232 -375 -2030 6279 12118 -1457 -6253 6166 12747 10895 13693 14936 11608 11864 5051 -4355
219 -4355 -4188 2295 -2436 -9570 -12484 -15621 -13843 -8434 -9636 -12494 -7366 -2027 -2245 -1674 3990 10502
235 10502 18523 20059 10862 7592 9964 8243 6618 6152 4883 2893 2085 -5797 -17945 -17475 -9891
250 -9891 -8369 -8948 -4309 -3956 -2683 55 -2185 -4594 1605 8600 8260 6055 7010 5891 4489 1562
266 1562 -3881 -6894 -920 2721 -4231 -6566 -5396 -3799 -1590 150 -1321 -1683 5834 8250 3033
281 3033 2093 6016 7080 5211 2713 -1502 -2939 -2029 -2851 -7183 -6589 -3031 -2085 -7179 -10462 -7139
297 -7139 -437 4126 4772 3709 5203 7210 8169 5947 4121 6735 10085 7053 112 -4804 -6104 -5173
313 -5173 -4571 -5399 -8088 -6530 -4970 -7591 -8696 -4975 2402 4473 3921 3305 2378 5315 7390 6546 2833
330 2833 3005 5598 4436 -1717 -4505 -4641 -4234 -2072 -4157 -5106 -3132 129 -1224 -1970 -460 4950
346 4950 7066 4787 2456 3401 5614 5590 2176 -2349 -3474 -2176 -1893 -6270 -8498 -7726 -4971 -4683 -4840
363 -4840 -3458 -996 2501 5026 4706 4276 8415 10148 8059 4800 5937 6779 5808 1773 -1798 -4878
379 -4878 -3735 -4149 -8384 -11077 -9015 -5196 -4104 -4259 -4945 -2587 885 2967 3096 4498 6962 9577
395 9577 8964 4920 4171 4035 2873 -243 -2460 -3112 -2745 -2619 -4973 -8341 -7503 -3492 -2114 -3696 -3575
412 -3575 -477 3311 4370 1996 2418 2445 4624 2132 -791 -707 2285 3492 1149 -1703 -3889 -3479 -2088
429 -2088 -2139 -1267 2026 7117 7436 3796 420 790 3541 5879 5016 3122 3367 1747 -2102 -7793 -8252
446 -8252 -4897 -3156 -5372 -7010 -6400 -5843 -2932 -1407 438 1975 5457 7017 4409 3302 6731 9213
462 9213 8213 5645 1695 -1126 -2318 -2818 -6679 -7672 -5801 -6714 -9073 -10494 -10835 -7417 -3366 -1859
478 -1859 -2939 -2049 2228 5306 4729 4088 6352 7539 7506 4785 2857 2038 3029 2284 -767 -2793 -2222
495 -2222 -890 -1023 -3821 -2956 570 2436 1566 504 846 2601 5048 2625 1455 932 2397 1537 1059
512 1059 -983 -1607 -1202 -1920 -4271 -5869 -2719 1097 2289 1660 730 1924 2903 2658 2591 2995 5543 4931
530 4931 1470 -1557 -3450 -3319 -3788 -5404 -6983 -6993 -5626 -6386 -6735 -6576 -3375 -1023 810 712 582 4740
548 4740 7714 6966 6056 5035 5381 6580 4595 1704 937 2056 -15 -2659 -5303 -5256 -4658 -3245 -3948
565 -3948 -3020 -3139 -244 -391 -1423 119 2739 4846 5530 4294 3057 3385 4663 2783 223 475 764
582 764 1858 -590 -2764 -2560 278 424 -1083 -2156 -2223 -121 -135 -794 -1569 -1763 -1466 -2439 -4409 -5376
600 -5376 -4355 -2465 -2233 -3282 -2897 -2078 -767 -1039 -1850 1086 5117 5907 5327 5146 5707 7739 6009
617 6009 3528 2298 1661 1549 -476 -2226 -3963 -5189 -4622 -6643 -7822 -7380 -3867 -2197 -2415 -1122
633 -1122 -247 2761 4544 4206 4875 6200 8538 8519 5431 3883 2587 3632 1056 -1111 -3041 -4561
649 -4561 -4038 -4837 -5935 -5704 -4856 -3378 -3804 -4329 -2056 -219 1723 2115 1651 2560 3405 3444 1622 307
667 307 -5 1265 1288 -775 -1583 -1791 -1721 -1089 -2841 -3049 -1799 -626 100 -3 1372 2993 2958 809 -1205
686 -1205 -944 1095 1471 524 -859 -1547 -2213 -2325 -3025 -3579 -1962 -23 1212 1109 992 1383 3154 3662
704 3662 2625 2371 4513 4767 2719 1517 714 339 -597 -2233 -4707 -4260 -2660 -1683 -4212 -3930 -4373
721 -4373 -1786 -2211 -257 107 1465 4020 3308 2576 2466 3266 4075 3387 525 770 290 503 -1733 -3700
739 -3700 -3260 -2739 -1588 -2783 -3752 -2067 316 1058 1299 263 650 1913 1530 380 146 1218 2814
756 2814 1297 -1773 -2966 -1750 -738 -1568 -2005 -1526 466 951 -59 -1205 410 1623 4058 3145
772 3145 2191 2294 3133 2543 14 -1368 -661 -828 -1249 -2667 -3066 -2546 -2027 -2380 -3618 -3590 -525 -214 656
791 656 -60 2698 3019 3606 2816 1282 1867 2159 2019 884 -221 -749 -1021 -2417 -2620 -3445 -2707 -1615
809 -1615 -1034 -1720 -633 -82 2302 1863 1248 721 2015 2667 1715 1257 1855 1114 1056 -1775 -2956 -2432 -2383
828 -2383 -1341 -2534 -825 -672 -203 32 -1074 47 1611 3599 3550 2199 3192 2613 2771 1451 24
845 24 -470 -1152 -1180 -2010 -3483 -3345 -1422 -2652 -2971 -3283 -1901 -106 1102 952 974 3750 3819 3255 2381
864 2381 2281 3236 2895 1419 -398 -1201 -478 -830 -1968 -3657 -4136 -2719 -1712 -2022 -1791 170 722 1444
882 1444 255 675 592 2538 2273 1759 1439 1526 2035 -251 -603 -1988 -420 684 107 -501 -625 -413 860
901 860 -328 311 1659 2834 1635 1460 1366 1053 1438 912 -663 -1650 -464 -932 -1418 -2843 -1874 -2113
919 -2113 -1528 -1898 -1531 -1729 138 1328 2293 1103 2001 3140 2683 1773 1296 1646 2417 -197 -536 -2435
937 -2435 -1750 -2416 -2865 -3275 -3388 -1926 -1555 -1444 -2093 -1199 109 1356 2096 1673 2118 2553 3977 2052
955 2052 1451 986 2108 833 -53 -441 -500 -593 -1448 -2104 -1911 -965 -947 -828 -725 52 1140 2003 1056 513
975 513 590 1764 1138 358 -360 97 -45 -290 -961 -1476 -1667 -525 86 -1083 -1318 706 1226 395 816
994 816 -88 535 1035 905 54 -822 455 -879 -2273 -2468 -2502 -1472 -1511 -1746 -2340 -1175 -126 249 -184
1013 -184 106 1787 2588 2080 2320 3358 3214 3854 2146 820 -152 292 -13 -982 -2098 -1776 -1147 -2360
1031 -2360 -2393 -1961 -2250 -706 285 -260 88 1071 2797 2576 1647 2142 1562 2373 1707 860 -212 -560 -99
1050 -99 -1366 -2379 -1830 -2232 -1955 -2240 -1537 -307 307 198 -388 -1836 688 1062 905 343 1550 1166
1068 1166 774 70 -800 -1762 -717 -528 -960 -1114 -1288 -511 -184 -813 -1140 -202 330 1608 990 1159 1265
1087 1265 2270 746 438 157 382 303 3 -525 -446 -1021 -298 -478 -140 -1321 -60 779 1462 1340 961
1106 961 1976 1776 1062 924 448 941 1035 1146 -1017 -1253 -702 -1916 -2672 -2444 -1906 -1633 469 -1059 -1276
1125 -1276 -511 681 716 364 1362 1684 1918 1328 753 985 339 269 -249 -788 -468 -229 -1328 -1735 -1473 -594
1145 -594 664 727 -308 -549 26 1171 1355 307 917 1350 133 364 -694 -156 -438 234 -1071 -1384
1163 -1384 -867 -584 -725 -873 -289 248 1023 778 868 1516 1603 1158 1063 813 280 231 419 94 -1061 -1277 -711
1184 -711 -1232 -1947 -2710 -1757 -646 -407 80 348 -71 1371 611 1243 1525 2250 2655 1477 1119 864 193
1203 193 345 -710 -1387 -1611 -1260 -1112 -1839 -1050 -1493 -805 -772 -660 -225 612 1155 1549 1504 1439 771 1636 1444
1224 1444 299 30 -285 386 -1191 -1736 -1353 -737 -736 -1146 -1301 -1397 -586 54 461 427 1047 775 736 645 865
1245 865 1160 935 1072 255 -602 -1714 -1156 -1356 -1312 -1443 -217 -38 111 -761 -120 112 1967 1740 1519
1264 1519 454 688 812 634 222 -25 -365 -948 -813 -599 -1524 -219 126 -675 -1290 -544 13 94 124 622
1284 622 1597 1399 495 580 316 305 856 1204 413 -904 -396 -746 -1693 -986 -1149 33 -414 -736 -595 -138
1304 -138 349 331 910 324 1381 1589 1015 -541 -182 1199 644 293 -547 -858 -639 -829 -1365 -1313 -935 -213
1324 -213 -234 -12 -579 1175 851 1703 -110 1129 1813 833 700 -54 649 213 223 -400 -765 -1196 -788 -794
1344 -794 -1028 -1310 -1221 14 128 -384 -551 923 698 1285 1348 1317 766 687 789 206 -422 -172 -25 -613 -449
1365 -449 -659 -804 -346 -32 -222 282 -80 386 531 -707 -79 1192 482 -161 -16 908 342 -253 -881
1384 -881 -1796 -1195 -438 134 817 -1281 -1006 638 153 -32 1180 852 743 1049 972 117 318 543 -582
1403 -582 -1225 -107 29 -48 -925 -988 -1714 -905 -1025 -873 104 243 917 181 889 1723 1552 1073 1515 1582 1282
1424 1282 1300 1297 80 -378 -554 -103 -539 -1179 -957 -686 -459 -354 -760 -1074 271 -180 646 1410 1249 768
1444 768 1198 715 458 671 664 222 -728 -886 -497 -113 174 -1021 -1079 -1000 -544 -177 -354 51 757 966 653
1465 653 480 200 851 1105 129 -655 43 -355 -713 229 -1244 -67 -605 -632 -706 44 323 624 504 1204
1485 1204 374 788 1161 1400 793 685 1047 275 13 -481 -1240 -324 -385 -1592 -1571 -1426 -1073 -813 -559 62
1505 62 209 704 677 635 319 1010 1260 457 -137 443 -232 -3 -764 -748 -1135 -650 -708 -1084 -1147 -1804 -496 -476
1527 -476 -298 -551 280 927 473 691 881 535 811 178 573 325 367 -409 -174 -818 -682 -1530 28 -815
1547 -815 -807 172 264 322 143 1122 447 658 616 1038 624 242 393 389 111 -1173 -825 -270 -929 -491 -620 -616 68
1570 68 179 -10 503 -41 111 605 649 587 229 460 311 -82 -724 285 -435 -1050 -947 -708 -377 -794 -717
1591 -717 -1134 -891 386 188 -471 698 1004 522 932 859 396 350 314 -75 -6 -517 345 490 -1137 -738
1611 -738 -1033 -519 -345 -56 -245 597 370 463 293 529 837 988 163 387 704 1140 489 323 -710 -711 -239
1632 -239 -326 -391 -1803 -804 -546 -292 -449 -187 760 420 546 803 628 591 690 426 761 361 -198 -400 -329
1653 -329 -286 -866 -247 -681 -398 -570 -953 -54 532 495 309 166 1027 599 246 804 832 703 175 338 -217
1674 -217 -498 -1048 -375 17 188 -390 -94 -585 -332 698 548 -301 27 606 237 505 90 -517 867
1693 867 418 -94 -280 -657 -929 -331 -714 -866 -750 -449 -468 -278 28 -685 24 30 373 527 544 1279 520
1714 520 -1 236 -488 -102 -331 -491 -79 -296 -201 -906 -535 -1150 -567 737 803 282 -228 100 241 464
1734 464 1144 511 398 1002 574 -513 -814 -706 -627 -262 -225 -951 -199 63 21 89 1 249 1 783 349
1755 349 61 394 672 402 135 -522 -245 -124 -875 -581 -505 -425 -719 -764 -647 -330 140 81 456 119 -60
1776 -60 787 1086 392 -20 399 1216 479 -99 -483 -114 68 -622 -822 258 -420 -661 392 349 64 160
1796 160 588 -415 732 171 400 699 -326 228 337 256 -53 -644 -564 287 -475 -674 -550 -651 5 66
1816 66 137 -33 722 106 527 105 405 641 404 699 112 236 -155 -444 -259 -55 -990 -413 285 -180 -288
1837 -288 -197 1144 -63 92 138 969 61 146 364 -35 422 610 548 -88 -772 -9 166 -1127 -555 -899
1857 -899 -619 -704 -133 -136 315 -224 -208 434 860 319 609 255 -87 1039 -165 -319 -120 -99 -898 -363 -173
1878 -173 -158 221 -1305 997 -30 51 200 -120 854 503 919 -184 339 864 34 696 361 -125 -487
1897 -487 -618 -676 -632 -404 -319 627 -1747 -1192 234 121 426 181 -449 589 -32 641 319 207 1345 442
1917 442 309 999 40 -100 -234 -514 -377 -87 -423 -843 -263 -361 424 -25 192 -183 191 761 1185 723
1937 723 702 206 -241 -212 292 -957 -281 557 -245 -719 -1120 -642 131 -309 278 702 25 316 18 521
1957 521 403 283 390 203 124 -494 -468 91 -527 -788 -633 344 290 -104 -652 83 544 910 777 671 -383
1978 -383 827 977 255 -270 320 744 171 333 -667 -420 -681 -299 30 516 -59 -506 -211 -390 -363 491
1998 491 -294 314 885 1233 241 184 -24 -102 -79 -609 -204 -112 276 -202 -575 397 -131 -147 -85 -621 -157 -469
2020 -469 125 -398 774 565 445 -102 387 -100 -450 69 -31 -166 371 -111 -418 -732 -212 -607 -865 -368
2040 -368 28 -201 396 631 357 -23 777 269 286 725 -14 -467 350 -447 -473 -451 -157 -707 -465 -202 -1
2061 -1 -272 -111 75 359 145 175 434 681 355 305 119 513 127 -130 2 -776 -67 -610 -519 -585 -906 -106
2083 -106 -760 -177 -393 -72 -77 762 9 -137 867 224 181 -236 -182 -479 599 -284 -237 -160 -636 -374 -193
2104 -193 -173 679 -313 -342 97 1296 -86 231 304 -282 402 306 -378 -686 -43 257 80 -249 173 -111 96
2125 96 -137 -654 -723 2 317 -378 -160 -37 371 540 411 614 -3 390 -19 -78 -519 200 -1089 -540 -774
2146 -774 -381 -214 -441 -503 -196 198 -241 866 -159 586 796 -15 365 402 35 272 604 513 -472 220
2166 220 -197 324 -979 -20 -434 -575 -515 -449 -213 -654 398 650 -37 478 92 124 156 279 856 -499
2186 -499 319 471 92 -8 -451 -662 -342 -322 -673 169 488 388 146 477 284 -124 58 837 56 -315
2206 -315 699 41 -939 -138 -442 -96 -629 -725 138 -519 31 -80 253 351 -175 -72 1071 -214 -681 431
2226 431 -588 253 -234 146 287 -428 -603 188 143 -110 -240 -193 -683 152 -377 -833 340 558 -440 -239
2246 -239 242 -82 504 255 382 -220 111 304 -272 -759 -547 -145 94 7 -41 183 109 335 387 -477 975
2267 975 360 -125 514 324 556 8 -125 228 234 -51 -32 -396 -95 -592 -38 -335 73 25 49 -898 70 -418
2289 -418 449 -543 348 245 -192 -304 -470 -143 635 127 -441 -535 -75 164 -610 -20 -126 -70 404 35 331
2310 331 190 499 807 346 398 -79 537 213 111 -719 568 38 -93 -566 421 40 -273 -93 113 354
2330 354 477 -417 -276 659 142 -466 376 163 -664 -286 276 239 239 -90 -202 181 49 -697 117 -32 751
2351 751 -388 -390 588 277 -373 79 -156 493 540 134 242 460 69 352 -466 237 192 -266 -401 38 -454
2372 -454 -415 -270 -240 502 370 -890 -340 -149 201 263 62 -92 509 337 380 -437 -534 166 -561 -497 -278 174
2394 174 296 -30 234 -899 -277 120 -119 -136 539 552 -380 249 441 93 125 -144 87 65 -436 53 -212
2415 -212 591 -110 124 -229 -724 -51 78 -125 427 324 469 163 265 -212 -549 568 -119 34 374 31
2435 31 -61 -686 -220 277 -140 -48 -348 -345 18 61 616 494 -664 546 438 561 306 104 8 -543 -255 -162
2457 -162 -498 188 199 -240 -56 -433 217 45 207 91 24 346 -98 918 60 -51 586 305 502 -121
2477 -121 -56 -738 521 229 262 -124 -47 -234 -773 15 1108 94 426 713 -153 -539 -2 459 292 -98
2497 -98 80 -60 42 -50 -506 166 -359 -264 360 464 -266 10 519 -257 -466 679 181 -274 -410 506 -354
2518 -354 -439 144 590 408 438 28 -566 -658 -451 -432 24 -353 225 659 42 -101 203 503 -454 1033 459
2539 459 417 -33 476 6 -642 -533 -175 -779 -349 -694 -175 -53 -226 209 -315 173 577 -7 190 -191
2559 -191 586 617 -80 -380 -252 266 -548 534 -102 -405 -294 379 -408 -365 -210 -82 -317 -336 21 447 32
2580 32 -477 180 -4 -526 104 -495 -349 531 414 199 353 -401 -462 -606 608 -214 -270 -548 -819 418
2600 418 631 86 152 -250 478 -108 -8 696 107 21 -82 -149 781 -113 -21 210 1003 240 -270 -610 -187
2621 -187 -534 100 -132 -592 567 80 421 -237 -28 426 66 -228 46 -153 -165 273 68 244 -615 -155
2641 -155 163 812 188 111 652 628 -217 504 -440 -544 -132 184 -74 -38 45 -302 -120 82 -482 -95 -201
2662 -201 -168 -380 296 353 -53 297 -258 -36 -238 -156 377 -692 89 109 -199 -177 32 295 -126 48 547
2683 547 -705 9 474 -132 260 456 389 286 436 196 -168 323 206 265 -244 -156 -609 -218 -342 1055
2703 1055 -713 545 138 149 259 303 261 122 -117 268 148 205 -134 276 946 644 395 -199 108 32 -253
2724 -253 17 -414 745 535 -749 -1180 164 81 320 527 -154 50 -617 -512 171 -222 -115 211 370
2743 370 370 484 96 17 25 -279 457 -92 225 -395 49 -89 -341 277 727 -104 139 88 -253 185 -267 128
2765 128 -466 -149 36 187 590 89 48 -476 -11 49 414 -32 -258 609 418 -279 -123 202 370 -222 229
2786 229 -226 302 625 168 74 -75 -574 -59 797 69 -362 -710 125 230 -496 -699 405 417 -119 308
2806 308 -267 -75 -503 407 322 -320 -627 -189 -694 -275 247 364 -917 276 101 -637 509 -99 408
2825 408 564 305 602 47 -686 188 -299 434 80 230 422 -574 356 596 170 -592 19 -752 -735 51
2845 51 401 -752 -372 125 -263 135 197 75 331 -1006 478 20 27 -832 648 -492 146 -818 1012
2864 1012 -213 -248 64 430 58 91 204 -248 -54 -694 628 -600 383 -1 328 292 54 232 259 -575
2884 -575 102 -202 -553 -376 27 83 -576 95 -8 318 176 292 327 79 350 538 110 306 91 -560 -28
2905 -28 69 589 -122 223 -260 411 405 321 528 -502 -38 620 -150 129 -17 18 250 212 -107 -228 -462 -479
2927 -479 -401 1021 -592 65 386 -113 -123 -493 -794 143 477 -105 -218 130 486 -134 513 -99 380 -106
2947 -106 169 -148 398 170 -724 -46 328 488 -448 303 181 -282 438 835 52 -90 -19 -167 481 -161
2967 -161 -290 -394 -37 677 -324 38 -343 -423 281 -91 257 -29 65 -281 -545 187 -27 180 -572 -171
2987 -171 331 -346 639 69 202 209 -73 -464 -327 314 107 -50 -402 -461 -71 211 520 -196 127 668 115
3008 115 -30 -355 527 31 -93 -404 540 109 1015 232 -318 603 -297 364 146 207 -724 -61 398 -39
3028 -39 452 354 -248 337 -412 -462 -5 67 288 329 -15 142 -45 -609 434 -66 684 269 163 -140 414
3049 414 226 643 256 356 -170 -408 -145 110 -682 361 136 625 -369 232 -395 20 116 128 335 338 -282
3070 -282 206 411 -63 -72 354 349 236 697 102 137 -37 238 327 -1132 -304 -203 -313 235 -38 -29 -32 -552 161
3093 161 241 -353 -721 -30 39 50 153 454 247 1010 310 -188 -174 -21 -551 122 -538 -383 -300 62 58 -1074
3115 -1074 -481 -85 373 382 -241 194 -312 -122 -44 387 -879 342 272 -632 654 -33 -46 -312 500 215
3135 215 449 -166 212 -176 12 606 -25 -55 -541 -407 -439 274 67 -61 577 -318 109 -270 -102 -825 -259
3156 -259 -376 -367 -366 330 45 166 -268 509 -730 355 704 -323 80 -400 183 -373 -133 601 93 -70
3176 -70 -113 -18 -127 352 -570 -59 835 -15 -96 479 808 266 -668 106 -47 -85 541 -659 -209 379 396 -229
3198 -229 513 -332 -12 132 288 -9 -7 181 213 22 -118 128 -350 -60 392 320 348 -59 30 18 171 -265
3220 -265 582 -590 61 294 229 -205 600 -658 -405 174 70 -410 -281 -407 -494 -193 -583 -53 100 510
3240 510 -398 381 32 -392 523 292 404 -301 -331 234 415 -164 518 -99 -17 -382 58 226 290 266 -33
3261 -33 103 329 -643 223 2 512 -159 -303 50 -3 -58 -559 63 236 231 -192 -9 220 -537 200 -201 518
3283 518 -205 -50 211 240 216 -266 -542 -128 83 -5 220 -142 23 -158 -205 -752 -137 454 -289 -292 -726 -963
3305 -963 -880 778 -477 429 355 -558 61 320 507 71 -304 296 565 -443 317 -269 186 -29 -86 -353
3325 -353 -74 -325 -2 114 261 301 319 -470 -450 -488 -650 613 -635 91 163 -9 -412 -378 107 488 420 -428
3347 -428 389 -204 -268 489 -452 560 -434 451 -387 -666 -124 325 -69 322 -416 300 241 -48 -78 125 372
3368 372 26 -174 45 325 264 214 516 328 664 70 -233 -40 504 -11 864 94 469 -286 307 549 -49
3389 -49 545 249 225 -511 -156 371 3 103 -916 445 -120 -540 352 -225 1027 14 38 341 155 -615
3409 -615 164 234 146 -232 362 -38 -154 552 -454 28 55 -847 -146 757 68 295 16 -309 418 -227 189
3430 189 -249 -7 392 130 -200 492 201 -112 548 14 15 14 -720 -1 439 -467 -17 556 115 211 982 259
3452 259 423 684 -321 81 428 99 -446 -403 -247 -13 -376 419 226 -442 395 151 -217 41 -533 125
3472 125 -32 287 574 -47 -95 97 -145 -28 -536 -371 535 157 132 217 -138 52 -99 195 380 69 38
3493 38 133 97 -28 312 -257 46 -446 -108 631 458 71 -891 -2 -92 -60 -620 322 91 365 -278 -604 368
3515 368 443 -125 249 747 287 -284 -91 -258 253 405 -574 -670 194 193 -871 110 167 113 -359 201 32 -596
3537 -596 231 251 -182 75 169 783 98 795 225 -134 289 522 -205 -349 -329 -1 -87 320 314 -904 212
3558 212 766 -44 104 634 543 119 -310 -14 257 -668 155 456 344 -639 -542 61 326 -422 -172 347 170
3579 170 36 -539 -184 86 -224 147 7 290 -408 -212 -1005 -259 -66 73 324 -158 -32 -286 -436 -70
3599 -70 37 1136 347 -103 72 49 230 -223 339 -193 52 -241 -100 350 405 -210 359 70 161 256 -222
3620 -222 758 -44 -249 586 -385 -142 -326 112 4 -399 300 495 34 -126 -337 -178 -704 -597 -203 96
3640 96 554 -301 42 -366 -796 296 -196 -107 216 -192 198 407 294 11 478 -406 883 -798 -537 -160
3660 -160 -190 -148 -131 311 397 -82 -677 -85 402 -564 -384 868 103 76 308 -648 -27 -398 566 400 177
3681 177 -11 181 288 -86 30 30 373 -62 52 514 342 -320 508 -379 302 211 -750 150 -437 -470 -296
3702 -296 -381 343 -238 213 341 -42 -81 -15 -187 760 -123 -83 371 342 -445 -330 -68 46 -125 240 505 454
3724 454 217 -167 -839 445 -489 -619 204 -412 -21 -198 -984 -495 538 155 342 -459 -146 136 -175
3743 -175 502 68 -107 460 678 252 -357 86 172 -495 -382 -758 -327 11 -110 129 609 46 128 213 44
3764 44 -597 -127 286 -518 116 578 -452 247 -226 -323 306 -22 185 -230 288 206 88 585 -468 78
3784 78 327 5 259 544 59 -280 -334 387 -40 89 412 509 183 -75 264 -474 -1232 -240 473 212 385
3805 385 112 -381 -83 -677 606 -92 -827 -313 59 141 -492 -106 -583 -583 340 -222 -319 -877 -188 -294 -21
3826 -21 -204 -381 -147 7 -235 -38 311 160 -407 65 269 236 -570 -403 -118 -211 263 -859 -432 -45 -382
3847 -382 330 -379 -174 294 -324 109 647 861 40 -631 -98 -62 -179 164 63 -493 -217 -118 85 642 408
3868 408 311 237 -344 -29 -181 -185 -419 460 -19 8 -380 -47 16 243 -45 -244 -466 -18 -331 -601 -145 833
3890 833 382 144 254 -55 -119 256 -62 262 500 487 -60 -671 -128 37 -478 -31 517 10 -48 -268 -166
3911 -166 519 246 152 214 -376 176 -81 -490 385 -314 -424 241 -38 160 -87 206 274 83 -405 336 479
3932 479 743 26 65 -269 -293 643 47 172 11 -187 809 -363 -302 622 -813 -558 84 11 122 128 -308
3953 -308 -429 -34 -144 -393 201 -239 250 82 105 51 -667 -54 440 51 525 441 -307 -433 -318 556 560 43
3975 43 300 -591 703 496 -451 182 -553 391 21 73 -542 454 329 -620 182 -454 -85 62 -728 329
3995 329 -13 471 -457 -573 87 369 -641 -361 111 67 115 -227 101 189 72 -452 -71 966 347 110
4015 110 25 1021 426 -124 -647 -292 200 -414 -8 36 -342 -677 -527 344 -622 -27 -48 -364 -272 -366 38 476
4037 476 535 -49 -793 55 928 345 329 -865 -321 502 61 185 -176 -213 155 518 212 13 -248 -28 -196
4058 -196 -288 275 -224 -946 -507 670 -23 -132 -642 -998 -380 -410 -299 -391 -223 77 170 174 441 -190 -334 12
4080 12 -547 225 -480 -266 -149 214 25 331 -409 388 459 -198 12 -279 -24 199 -124 17 -569 -331 127
4101 127 -208 455 -305 -68 605 -506 -239 128 5 40 -373 -364 -29 -320 427 277 207 -578 -655 251 -735
4122 -735 276 -390 1 318 -341 214 -130 287 -787 438 -532 -454 785 354 130 -239 392 -56 -473
4141 -473 -636 -315 179 -75 191 314 276 -811 336 686 36 394 -167 -670 269 -391 -587 308 33 -54
4161 -54 39 -34 -75 -436 -175 519 145 514 906 -153 54 -88 42 96 458 -305 26 -217 -205 8 684 452
4183 452 -54 392 128 360 103 -819 -631 559 77 -350 143 432 307 -131 183 -426 699 149 210 -624
4203 -624 118 -20 344 6 235 815 -375 -638 -222 144 60 -34 89 -380 -482 508 -221 -744 -472 164
4223 164 483 314 -370 663 177 214 253 -492 214 185 -256 200 140 28 246 109 -356 460 -69 746 499
4244 499 -562 290 -160 -99 -1 175 341 -201 -186 307 -21 -240 -14 207 -467 60 208 423 285 221 90
4265 90 66 -220 -437 -414 -387 176 -39 116 -50 501 740 -324 347 694 93 -18 -12 -603 72 -476 -71 322
4287 322 -152 -538 609 -487 491 -27 773 475 381 -289 440 -494 819 69 -525 121 96 -67 -340 89
4307 89 31 -530 245 298 -40 228 15 292 357 341 -65 -127 -143 133 449 55 -28 47 409 -253 146 116 -325
4330 -325 751 -195 258 -217 783 916 216 -121 846 267 -606 -397 -109 296 49 -539 334 -241 -95
4349 -95 -323 -137 -403 -265 -565 -591 616 -96 -256 -212 -442 415 642 -326 -583 103 167 17 -695 -349 -474
4370 -474 97 365 172 119 197 -386 378 -237 4 634 732 73 283 -191 715 164 -195 -87 -555 551 -759
4391 -759 562 375 166 -115 -147 -589 -702 -7 -225 -484 -293 -2 155 375 32 -915 -137 288 116 -169
4411 -169 227 -459 367 285 110 -183 182 102 -495 405 -499 187 -299 -129 73 78 -438 -62 281 -798 253
4432 253 -14 -456 -157 70 -361 -813 478 106 305 235 -160 149 -436 -61 38 737 -100 209 -345 -3
4452 -3 -155 -60 -186 -712 -160 -111 193 -377 -199 -110 73 -232 -237 -241 -163 91 62 740 157 -218 -302 -316 101 136 513
4477 513 -26 554 581 184 -47 2 -74 -290 -138 159 113 -96 -171 -9 -422 343 -214 177 53 -221 631 -227
4499 -227 284 -16 -267 -86 -512 -73 -277 -840 -201 -221 -60 144 -12 -161 -434 362 -580 -366 18 -92
4519 -92 452 -480 -42 -88 93 -8 -478 -522 528 -917 51 -228 225 6 61 -128 350 -213 -217 252 520
4540 520 193 -185 -183 329 -189 -192 184 356 -361 769 361 379 26 -380 99 -487 -129 114 -90 519 -458
4561 -458 -253 198 -320 189 -8 214 -130 -625 -524 -56 -232 382 -681 198 -29 627 12 -42 -465 -485
4581 -485 -261 -475 133 373 -734 94 676 -167 -27 68 1113 -232 198 -278 -126 749 148 143 -280 -479
4601 -479 159 277 211 348 -234 354 24 303 -211 -146 78 169 125 -3 316 -301 -134 387 -359 -84 -472
4622 -472 723 -194 -332 -26 215 -709 797 199 -559 -204 68 -443 -405 -167 146 150 -579 -309 550 569 -121
4643 -121 -112 -233 -182 -462 -191 60 -112 -680 163 386 298 362 140 -254 -381 -597 -264 226 471 69 68 -1 -128
4666 -128 396 127 -132 -345 204 -217 -330 -111 -54 -502 -246 -771 115 -48 232 645 -675 153 -161 -592
4686 -592 -173 234 27 -267 124 717 -257 -14 -67 401 -399 43 53 466 386 809 523 -236 -380 -329 347
4707 347 -431 -337 -499 -1061 -192 -117 282 -609 -6 -355 435 -355 -279 -148 15 49 -89 -190 138 -109 -255
4728 -255 232 -434 -482 -818 429 -41 271 -334 397 101 -712 -449 -759 -256 -24 154 422 -753 0 -93
4748 -93 302 198 -35 33 622 509 -476 50 -65 362 168 -58 -51 373 437 -59 -171 -280 11 446 325 -997
4770 -997 -247 -231 -372 -420 -404 -410 130 -590 -209 491 -19 -156 -72 -58 389 -135 6 -74 465 -276 -42 379 -326
4793 -326 -338 -48 330 -43 124 -216 689 -600 -663 107 485 -99 -141 339 -469 -286 584 527 308 -1018 -52
4814 -52 986 -564 -2 -321 -286 -343 69 26 -435 40 -135 -37 627 492 -419 511 -181 -795 464 472 245
4835 245 -9 281 -809 -47 -20 189 257 75 -472 54 230 -26 -1 488 -674 -77 128 817 -335 496
4855 496 -574 57 139 -266 28 -176 454 355 804 -276 -618 -442 233 -259 -258 357 -280 280 -47 288 269
4876 269 71 72 515 -282 -498 236 548 -198 596 -89 -11 -309 285 8 -190 156 -375 39 -10 -512 -392
4897 -392 518 -286 493 285 -880 -244 -380 -438 -106 305 415 -115 -26 146 -790 -80 28 291 -694 79
4917 79 881 176 311 -160 205 254 -417 540 552 655 744 -31 -151 -153 -80 98 -106 -128 194 444 -104 -258 -17
4940 -17 35 749 -350 258 254 -138 -399 -29 -14 480 420 1026 248 145 441 535 -318 -108 -266 -373 119 784
4962 784 -28 -50 -127 -120 128 464 324 -49 102 -327 248 295 -51 -297 662 37 520 -13 -64 264 268 -163 131
4985 131 235 -105 -144 656 139 517 -278 -443 170 -378 -168 -535 350 29 10 263 -300 194 -402 -190 -294
5006 -294 138 -50 296 198 -103 -287 173 -231 -261 -438 208 385 744 682 185 125 753 63 -256 364 -79
5027 -79 272 -547 131 -180 -176 -456 36 -248 -267 196 420 -531 -6 468 239 495 -446 -392 34 -410 636
5048 636 -218 182 -528 -331 -59 -58 136 49 -949 -254 -40 177 -180 -565 -74 -649 -70 309 -82 358 -402
5069 -402 1140 265 -312 209 -262 -525 -176 -325 -338 148 -529 203 -456 -39 -47 -73 -481 223 -923 -200 80
5090 80 272 64 178 -823 -258 150 -284 -155 -699 165 178 45 -367 -617 -117 70 -3 290 16 -31 52
5111 52 320 -284 -349 159 -208 352 -4 -19 -502 -234 -135 -15 276 -542 -238 171 47 19 185 445 83 982
5133 982 531 -49 -343 -497 16 -715 531 -750 19 -210 -155 388 890 -138 -78 -421 351 -118 518 126
5153 126 58 342 69 45 -98 -725 414 -782 124 -393 609 -348 159 579 970 160 -240 697 347 594
5173 594 -156 228 395 168 -264 -77 55 5 -403 -350 454 -89 -442 -511 26 -216 377 210 -149 607 706
5194 706 786 589 -604 48 -188 -565 49 53 100 -150 -642 363 -194 88 -454 146 -469 509 471 112 -773
5215 -773 -570 -687 365 437 -59 -67 30 -153 142 -55 108 79 255 -245 -23 -170 -495 -202 -39 190 -818
5236 -818 -841 20 350 28 281 500 187 -25 -207 -458 109 -458 -188 -231 -101 145 281 -19 -406 122 -266
5257 -266 -88 55 -54 217 122 -309 -461 999 109 153 -54 -658 216 -75 158 241 -540 258 -495 286 -380
5278 -380 -319 258 154 64 143 634 141 -330 148 -276 451 505 -84 409 -110 -311 -595 -33 77 -558 307
5299 307 211 -470 -84 18 -395 -1153 -151 494 301 -425 220 160 -405 119 -354 612 -315 -410 356 -293 655
5320 655 -719 68 -194 -433 660 -909 111 -324 -125 -317 195 -397 -79 -109 -107 416 -526 589 416
5339 416 -150 62 -405 296 -264 433 -465 -146 -22 -160 123 408 -223 113 -153 -152 -139 -316 -633 -275 200
5360 200 -335 365 597 147 -686 -197 -65 -270 -185 -86 55 -144 -95 -93 -480 -401 622 828 -389 -82 391
5381 391 61 389 50 -370 500 784 358 210 -266 -84 -178 -232 113 -256 53 -230 291 -192 -170 41 -822
5402 -822 -246 443 -774 404 -15 -529 61 -32 -656 95 -546 -1060 -168 173 376 148 -345 -406 -467 -324
5422 -324 134 160 -719 -486 37 58 396 277 70 -114 213 -254 232 501 -351 -51 291 -10 184 -67 261
5443 261 -189 -104 -544 143 85 -164 70 -10 -3 -239 77 99 460 283 -76 119 135 74 -348 -470 -211 151 -34
5466 -34 252 106 398 -272 -509 -746 -346 356 -57 -926 135 -49 -487 7 -162 -32 -455 229 644 158
5486 158 616 -406 219 34 -128 -390 27 48 19 -112 -284 -359 -208 -232 -442 302 802 -45 416 351 -189
5507 -189 -266 537 468 -152 -202 397 334 202 -295 134 -549 178 -77 -269 -421 286 102 -51 -783 117 -319
5528 -319 75 157 -994 -397 -37 -14 -612 656 -348 -330 -52 -356 4 -127 99 -490 -525 -538 -442 216 -169
5549 -169 151 607 157 175 230 -314 274 22 -120 -200 101 -128 219 507 850 -340 -469 115 635 279 -46
5570 -46 172 169 654 410 -560 -357 507 -774 -98 507 14 -192 152 -483 624 -982 -408 -219 -481 211
5590 211 -155 -434 -136 748 -364 -493 856 297 -369 -83 -25 -39 -198 151 -238 485 567 -107 36 -899
5610 -899 -505 -266 -290 -831 -45 -560 -285 -966 -206 -231 -497 295 116 82 -71 -334 41 -302 460 -174 -715
5631 -715 415 250 -93 -122 -642 -574 -584 -696 -287 108 -258 219 81 -288 -116 -268 -198 182 -293 -596 450
5652 450 -8 -223 519 -290 -538 -468 -435 -61 -40 -161 -521 68 -449 167 76 -843 271 428 -44 -433 253
5673 253 -658 -565 492 -431 195 273 -398 65 375 7 40 4 -234 361 26 -206 308 716 289 -665 -350
5694 -350 -126 380 126 317 -108 471 250 -125 22 -268 29 -127 -363 65 596 -315 164 -207 -67 -5
5714 -5 105 404 70 -222 -484 -567 468 524 -156 262 24 138 -34 -179 579 31 410 384 158 -461 -720
5735 -720 -211 -327 35 -452 127 270 341 -1298 357 -345 -149 696 -205 570 -278 484 -374 485 247 753
5755 753 -138 10 -426 -49 -741 -632 -353 638 382 84 98 458 -411 -335 154 -462 -254 591 -198 -17 -68
5776 -68 41 -16 86 -900 40 606 630 -529 21 419 -265 -148 463 70 268 -699 278 -547 -43 -248 221
5797 221 -34 -110 -81 60 155 62 442 -715 -13 -8 183 418 -1 -462 -209 -25 176 -1081 319 -182 -157
5818 -157 -695 907 295 -138 99 309 361 99 136 177 344 -417 -226 -145 -426 -699 408 120 488 769 -308
5839 -308 -87 -317 1080 554 457 189 -69 -440 -363 298 215 437 -330 73 -308 6 439 269 -184 512 168
5860 168 -273 -90 -354 -443 328 298 149 -12 276 -434 415 474 486 468 -291 -543 541 -464 -301 603 -302
5881 -302 871 -67 -510 1 -281 474 56 -239 -246 -67 71 77 227 -309 -119 1 1096 -357 301 -339
5901 -339 277 -43 279 145 83 120 315 -469 -810 784 133 69 86 305 571 51 294 411 583 121 -91
5922 -91 440 8 288 448 10 153 -460 569 -21 265 327 29 46 594 773 869 206 -263 106 -743 87
5943 87 428 -151 43 18 314 794 347 -306 227 -544 819 114 -198 661 147 -319 433 603 -143 -19
5963 -19 -391 -645 -498 16 -97 -525 197 -78 639 3 -121 421 283 519 -1120 599 -242 108 -29 235
5983 235 -329 17 46 -654 -118 14 425 333 241 -276 -469 37 -530 -614 -683 600 -345 218 -187 -482 -490 1129
6005 1129 454 117 522 114 -227 194 453 520 -318 85 -25 621 -562 309 418 -808 465 605 688
6024 688 -442 170 -35 207 524 -295 -76 -57 343 624 487 537 436 -864 377 -153 -412 46 573 455
6044 455 -667 -370 -131 562 -39 -426 -787 215 71 215 196 -45 778 31 180 408 69 -86 -188 226
6064 226 98 471 362 -161 -54 -511 286 665 459 528 17 -60 -350 -176 319 -15 -180 -87 -319 315 -81
6085 -81 -447 802 196 -581 619 430 156 234 314 -730 -152 -324 -376 -518 -13 -575 521 859 -436 -33
6105 -33 374 155 -254 -565 187 -445 351 409 -509 287 -109 -88 -13 453 -788 -6 287 194 -23 -146 -103 -319
6127 -319 131 -105 -174 -223 494 -125 360 464 346 396 383 -392 -177 687 -34 273 38 -78 -108 -221 -266 -1128
6149 -1128 241 -236 -179 -13 -194 -70 396 328 -365 129 424 42 -175 570 -411 -391 228 818 -400 -276
6169 -276 396 723 375 247 -321 46 -430 -220 -82 -54 -300 -71 279 280 -119 -67 19 653 137 690 362 -847
6191 -847 -1178 -289 -408 465 759 270 210 -283 -285 -540 -26 216 -338 -410 291 -256 304 280 362 -303 -153 -361
6213 -361 110 -860 -699 86 -282 -154 393 -734 -157 47 87 286 677 -640 386 -448 -171 179 -175
6232 -175 445 -299 109 -253 3 -11 -477 -213 -272 -100 -184 542 -617 -173 -241 -203 161 137 -177 209 -315 197
6254 197 244 -462 -708 -571 -431 -577 -192 104 506 260 -136 223 80 616 393 873 878 -178 109 251 -164
6275 -164 448 -167 95 76 23 -260 -61 -17 -421 -86 -805 -54 -283 359 -677 547 -329 -396 -871 -68 -717
6296 -717 492 -154 -115 186 -330 128 -30 -30 194 58 322 798 81 -91 -571 51 5 -308 -268 -402 178
6317 178 431 506 -931 -66 188 -75 -216 30 114 -559 75 154 -444 -3 86 -3 -89 -236 161 -191 213 -288
6339 -288 -249 68 239 -271 -154 -464 -488 -148 -364 -238 281 444 119 -695 -103 -292 97 213 -181 283 467
6360 467 498 105 1 188 -209 -579 -509 -44 111 -499 201 243 -653 37 -65 -372 545 -86 58 -302 -554
6381 -554 132 198 -97 702 -123 -403 -444 29 434 404 143 -104 -3 292 -195 458 -122 178 253 -189 188
6402 188 -39 -173 -61 591 227 764 205 -16 274 310 112 -257 243 823 23 267 -112 349 -457 725
6422 725 150 -173 -810 332 -246 49 -207 137 -60 -63 -790 -452 504 90 -222 410 -1041 -182 -20 332
6442 332 47 -90 270 -90 -24 -278 2 -236 -259 27 23 293 333 -51 182 253 -282 -88 489 355 -294 -643
6464 -643 712 -289 -28 179 186 -448 -17 135 174 -473 -121 -119 -600 402 -242 -612 62 -304 -250 -380 810
6485 810 -604 -119 -408 -81 310 -296 -271 251 -23 119 -27 53 -270 88 230 -307 -384 239 -464 -619 -651
6506 -651 -172 -138 9 367 31 206 -95 -12 317 210 -169 161 650 489 209 -18 -260 -576 347 -515 514
6527 514 -186 -170 -495 299 168 17 102 -152 -687 457 -102 413 90 36 174 254 222 124 495 -174 413 -376
6549 -376 33 66 145 295 17 -1318 -429 232 52 -49 384 319 -140 -572 -354 178 63 -279 48 363 -69
6570 -69 -61 314 201 247 -442 166 -357 -125 471 -53 408 212 -386 305 84 176 414 -290 346 765 814 -694
6592 -694 -166 -1138 267 -29 -58 355 -513 -470 351 449 -259 -137 508 643 -193 -723 101 -599 -157 75 -52
6613 -52 -498 -225 147 -548 -2 -54 -343 525 541 141 -432 -242 278 133 -106 -184 712 51 56 -315 414 68
6635 68 177 -225 58 97 -446 414 134 114 -394 -189 -283 -352 738 414 71 574 -542 218 -208 -129 621
6656 621 234 495 45 -21 295 24 297 -156 -46 24 391 -86 -104 964 -311 -250 239 433 -225 -65 103
6677 103 97 542 -810 329 226 257 718 349 599 439 313 -131 498 -558 678 -260 -468 128 46 638
6697 638 -349 390 -266 254 -498 -169 607 818 232 17 196 -425 238 12 121 -199 -135 -31 -67 53 110
6718 110 -477 9 -5 -395 -362 -176 90 -137 744 433 72 -112 -581 -565 148 -493 107 1179 135 619
6738 619 342 638 -531 -244 164 466 -158 52 -305 215 -28 -132 -61 130 -21 -249 -579 320 -403 -102
6758 -102 51 572 -69 671 289 -14 -238 145 89 -231 -638 -93 207 -696 -580 -364 49 -408 136 -254
6778 -254 -379 -253 -247 584 75 -434 1144 100 -283 227 -113 -4 -184 305 14 -906 310 574 -207 636
6798 636 -847 506 127 60 -727 501 285 -329 -460 47 419 320 65 -237 -335 1203 -199 -610 -100
6817 -100 -297 -62 -621 542 -33 339 888 6 299 484 -166 -747 -349 345 316 -250 852 35 -115 -244
6837 -244 -536 -78 213 22 -211 -221 -911 -333 -224 -249 68 401 331 -205 93 208 919 -545 237 -125 -867
6858 -867 988 -34 23 -112 -524 -830 357 -89 -29 -18 -420 42 -165 199 692 -113 -396 288 -132 854
6878 854 -245 82 -230 -28 915 403 258 0 -201 -390 306 526 -489 -1016 -33 176 1182 474 -526
6897 -526 28 -228 404 -238 -472 -413 -3 242 -73 239 -294 99 157 153 246 -531 824 -618 210 -161 205
6918 205 168 -286 -757 -660 17 -816 -19 -73 79 -237 -549 548 -116 -33 45 78 -140 119 316 -506 660
6939 660 407 344 -25 195 519 -376 335 -481 -151 -319 -209 20 61 246 566 31 -229 391 -144 -584 -50
6960 -50 39 82 252 469 475 255 203 367 353 -76 4 -574 274 -508 -414 -276 -284 358 266 -472 637 203 -485 -204
6984 -204 -568 -4 -284 289 -420 104 249 -81 -323 652 101 -291 -101 390 -270 446 79 -310 76 -367
7004 -367 -746 -206 -186 -130 135 -239 512 88 182 198 797 536 233 345 -72 -582 -977 -599 -539 149 565 -141
7026 -141 67 -230 249 -303 -237 342 -628 153 225 386 54 385 120 -236 352 -530 237 -2 306 -349 -314
7047 -314 -378 45 -323 -435 -62 -162 -75 493 -563 -119 -158 -597 248 -211 281 158 15 1 1 545 171 -653
7069 -653 59 34 257 -209 495 -423 -89 -229 -97 -139 700 73 181 333 -220 3 12 -443 -355 20 -544 -473
7091 -473 434 -137 763 376 675 -472 313 -320 541 87 248 1139 -760 191 -244 239 -113 -401 12
7110 12 245 -75 -173 151 -171 582 -21 -618 -191 -117 -118 -303 2 -375 159 187 -1001 -99 -233 571 -14 228
7132 228 483 881 364 -1002 276 113 -525 53 -321 -761 -113 77 -342 -420 425 -44 -99 64 252 312
7152 312 324 -305 -8 -749 -1154 474 -392 -20 656 475 -246 527 -247 256 485 382 -331 469 -23 29
7172 29 158 378 77 241 -173 538 -211 -211 -65 152 33 239 517 -250 -91 404 -376 -1094 -28 -341 275
7193 275 -107 44 -66 422 -249 -328 132 -194 82 -358 19 216 -519 398 -215 202 138 167 72 -186 799
7214 799 -545 291 621 699 -413 -231 1335 -575 566 233 -333 364 -698 600 152 322 459 345
7232 345 14 -284 423 -339 -639 385 114 -107 -187 -258 -524 141 -403 -49 -292 72 142 -146 1077 446
7252 446 -360 527 -9 -69 -29 -399 79 -273 -182 -678 -343 -199 371 81 -46 -330 -438 -652 -101 -216 -78
7273 -78 641 85 56 -548 448 569 -854 -625 -417 132 472 79 388 291 -726 485 199 -274 39 -648
7293 -648 572 68 514 -111 52 -97 254 -364 -534 -150 -345 -219 -488 -254 178 -61 133 -241 145 480
7313 480 -389 -20 -103 901 -173 -566 -594 -67 300 212 -151 343 14 154 -113 178 130 599 -404 -424 -360
7334 -360 1 -480 -1084 268 -1087 -11 -546 193 -264 -122 -70 -316 -158 -79 -532 -367 -78 -221 -110 389
7354 389 48 841 373 -344 723 273 4 -20 118 346 -203 1509 303 183 -325 -248 256 -173 297 287
7374 287 -582 -107 -571 511 375 -278 -120 -87 -479 -176 -275 362 -278 399 -184 -534 -340 -850 400 -334
7394 -334 264 -69 -557 190 458 -139 -378 125 -6 -185 14 521 -34 -343 -604 674 265 311 -1390 -673
7414 -673 322 -192 223 -645 187 772 176 -270 551 206 -8 632 -410 -149 -313 105 339 -258 -79 761
7434 761 -245 -535 -5 60 -670 245 8 -361 469 39 -567 -33 696 234 762 392 -702 354 -435
7453 -435 124 74 -1044 3 -395 615 -387 -299 63 317 -1022 -14 -892 -47 -598 461 574 -325
7471 -325 -498 223 -325 -43 758 299 -794 -19 27 -201 -729 -348 681 484 -389 22 -143 -225 120 106
7491 106 438 164 -331 -241 518 553 340 127 -225 -140 -64 -350 -204 160 262 389 73 239 -235 -651 339
7512 339 492 611 18 42 -305 649 -85 233 895 550 27 -256 -410 30 -334 236 81 -235 166 -37
7532 -37 228 594 -919 320 534 -407 -239 846 -295 -426 -324 843 -770 378 80 159 -484 100
7550 100 -288 -171 39 -101 -444 51 -457 508 -466 -350 458 365 515 504 92 -18 341 427 13 -220 296
7571 296 -207 343 -182 -604 314 -123 71 -553 -54 -64 -825 -640 -772 -446 414 162 46 76 -236 -76 393
7592 393 -571 328 -415 557 665 671 -192 371 110 451 -56 695 -651 621 558 -10 627 405 -79 8 -295
7613 -295 -224 41 -340 -240 -181 30 609 895 -553 -186 -337 570 389 -491 -142 -44 268 -359 -91 -93 7
7634 7 94 -204 15 -6 -91 51 90 32 271 -227 -15 884 652 266 -235 -10 269 -430 -89 296 -13 -126
7656 -126 -337 -349 296 58 492 -575 -388 -790 113 -6 164 91 473 563 -338 -168 696 193 516 526 391
7677 391 -153 280 191 -328 -149 -328 -33 575 -345 -217 -39 509 282 128 343 -199 43 555 -49 183
7697 183 524 29 344 -103 845 -728 394 719 277 840 54 522 316 -221 118 8 638 -480 -144
7716 -144 295 919 -178 512 -127 -69 -350 -82 75 -306 679 29 -76 591 -362 -484 -184 696 216 -28
7736 -28 483 640 -90 -62 -788 -366 162 89 222 -735 452 -302 -255 -208 -256 432 340 89 -308 -445 -150 -415
7758 -415 186 -308 203 400 419 -94 -188 -7 -210 -367 332 75 -362 149 341 -294 -14 -22 -481 536 99
7779 99 157 -211 326 229 330 30 -74 -88 -679 714 -321 206 881 114 82 93 -258 -482 -464 -369 -630 39
7801 39 -239 -442 -117 -36 -675 -171 93 -306 399 -308 -211 33 263 196 -168 146 274 -83 -1148 951 152
7822 152 -153 -251 -561 -219 19 167 -737 13 187 -122 -112 -480 -347 74 130 -120 21 5 -201 -227 -669 240
7844 240 -231 144 -78 -48 184 -482 -689 -135 77 264 272 -221 -209 499 465 -183 -662 -318 -527 -36 -739 222
7866 222 587 -213 -273 37 -187 -439 75 -35 -355 836 330 215 104 -189 410 243 -122 228 -665 -244
7886 -244 -278 518 -8 -4 60 11 487 -48 -431 -154 16 -147 -300 -229 -361 194 -292 14 -223 -784 66 16
7908 16 -21 7 -287 -45 476 174 209 -394 396 75 287 -137 10 -337 393 68 -467 63 234 22 329
7929 329 -36 134 76 87 948 -150 -619 511 418 158 154 -215 661 -265 504 225 -200 706 -422 185 -4
7950 -4 -688 65 -300 23 294 -166 170 93 444 -148 -266 224 304 -43 -858 -357 -233 116 -334 265 92
7971 92 6 59 -742 118 294 -843 -326 -568 -762 -69 -701 251 191 -51 49 368 -194 149 -99 404 -628
7992 -628 515 -57 19 -175 222 -105 -68 -9 9 -108 -124 -77 -251 -272 -42 -485 -82 -104 -60 375 -371 -68 -2
8015 -2 781 -400 86 330 26 -312 -285 -382 -620 300 190 579 -98 223 -337 -405 -34 -169 -625 -52 87
8036 87 6 14 -250 658 -192 -489 634 -265 39 279 -112 300 5 7 314 -70 574 651 283 266 -351 -228
8058 -228 344 -621 -223 322 288 -324 -229 -5 357 -506 158 507 -473 -281 477 -155 51 -118 -1212 269
8078 269 124 359 360 -222 -121 -282 441 296 227 -131 95 -116 -321 622 -334 2 305 -643 147 39 -2
8099 -2 -110 644 725 -154 418 1 -868 -216 77 -51 -311 331 -358 414 -272 -225 261 -232 -329 -109 -463 -683
8121 -683 -259 157 -63 33 105 -408 -626 445 511 917 -13 -38 -198 711 104 -437 -314 -177 -296 -31 81
8142 81 64 -427 371 -510 -747 -232 -236 -125 661 209 1020 676 -137 6 563 -294 -798 -417 180 -207 -121 -6
8164 -6 197 286 381 -43 -68 19 341 93 173 195 -389 -371 -302 -9 103 -314 67 210 241 -321 -78 88 -28 -157
8188 -157 -44 -597 -289
8191b89
##END NTUPLES=NMR FID
##END=
