##TITLE=1H_LR-758-R4-KA5-K-CR5
 CDCl3
 8 sc, 
 26.12.2023
##JCAMPDX= 6.0         $$ Bruker NMR JCAMP-DX V2.0
##DATA TYPE= NMR FID
##DATA CLASS= NTUPLES
##ORIGIN= UXNMR, Bruker Analytische Messtechnik GmbH
##OWNER= root
$$ XWIN-NMR		Version 3.5
$$ Tue Dec 26 16:07:57 2023 Russian Standard Time (UT+4h)  she@DPX200
##.OBSERVE FREQUENCY= 200.1313
##.OBSERVE NUCLEUS= ^1H
##.DELAY= (6, 6)
##.ACQUISITION MODE= SIMULTANEOUS
##.ACQUISITION SCHEME= undefined
##.AVERAGES= 8
##.DIGITISER RES= 18
##SPECTROMETER/DATA SYSTEM= spect
##.PULSE SEQUENCE= zg30
##.SOLVENT NAME= CDCl3
##.SHIFT REFERENCE= (INTERNAL, CDCl3, 0, 15.7039)
##AUDIT TRAIL= $$ (NUMBER, WHEN, WHO, WHERE, WHAT)
$$ ##TITLE= Audit trail, XWIN-NMR		Version 3.5
$$ ##JCAMPDX= 5.01
$$ ##ORIGIN= Bruker BioSpin GmbH
$$ ##OWNER= she
$$ F:/spectra/data/she/nmr/H-F/1/audita.txt
$$ ##AUDIT TRAIL=  $$ (NUMBER, WHEN, WHO, WHERE, WHAT)
(   1,<2023-12-26 16:06:36.84 +0400>,<she>,<DPX200>,
      <created by zg, POWCHK disabled, PULCHK disabled
       configuration hash MD5:
       00 E9 B6 7A A2 85 ED C7 34 08 36 98 17 FE 4E 26
       data hash MD5: 16K
       C7 58 8A 4B 01 C6 25 2D 48 E5 DC 24 29 8F 25 68>)
$$ ##END=
$$ 
$$ hash MD5
$$ 19 62 56 64 AF E5 E4 74 60 F2 2C CE E4 F9 6F E1
##$RELAX= 
##$RELAX= 
##$RELAX= 
##$RELAX= 
##$RELAX= 
##$RELAX= 
$$ Bruker specific parameters
$$ --------------------------
##$DU= <F:/spectra>
##$EXPNO= 1
##$NAME= <H-F>
##$PROCNO= 1
##$TYPE= <nmr>
##$USER= <she>
##$AMP= (0..31)
100 100 100 100 100 100 100 100 100 100 100 100 100 100 100 100 100 100 
100 100 100 100 100 100 100 100 100 100 100 100 100 100 
##$AQSEQ= 0
##$AQ_mod= 1
##$AUNM= <au_zg>
##$AUTOPOS= <>
##$BF1= 200.13
##$BF2= 200.13
##$BF3= 200.13
##$BF4= 200.13
##$BF5= 200.13
##$BF6= 200.13
##$BF7= 200.13
##$BF8= 200.13
##$BYTORDA= 1
##$CFDGTYP= 0
##$CFRGTYP= 5
##$CHEMSTR= <none>
##$CNST= (0..31)
1 1 145 1 1 1 1 1 1 1 1 1 1 1 1 1 1 1 1 1 1 1 1 1 1 1 1 1 1 1 1 1 
##$CPDPRG= <>
##$CPDPRG1= <>
##$CPDPRG2= <>
##$CPDPRG3= <>
##$CPDPRG4= <mlev>
##$CPDPRG5= <mlev>
##$CPDPRG6= <mlev>
##$CPDPRG7= <mlev>
##$CPDPRG8= <mlev>
##$CPDPRGB= <>
##$CPDPRGT= <>
##$D= (0..31)
0 1.2 0 0 0 0 0 0 0 0.06 0 0.03 0 0 0 0 0.0002 0 0 0 0 0 0 0 0 0 0 0 0 
0 0 0 
##$DATE= 1703592396
##$DBL= (0..7)
120 120 120 120 120 120 120 120 
##$DBP= (0..7)
150 150 150 150 150 150 150 150 
##$DBP07= 0
##$DBPNAM0= <>
##$DBPNAM1= <>
##$DBPNAM2= <>
##$DBPNAM3= <>
##$DBPNAM4= <>
##$DBPNAM5= <>
##$DBPNAM6= <>
##$DBPNAM7= <>
##$DBPOAL= (0..7)
0.5 0.5 0.5 0.5 0.5 0.5 0.5 0.5 
##$DBPOFFS= (0..7)
0 0 0 0 0 0 0 0 
##$DE= 6
##$DECBNUC= <off>
##$DECIM= 32
##$DECNUC= <off>
##$DECSTAT= 4
##$DIGMOD= 1
##$DIGTYP= 9
##$DL= (0..7)
0 120 120 120 120 120 120 120 
##$DP= (0..7)
150 150 150 150 150 150 150 150 
##$DP07= 0
##$DPNAME0= <>
##$DPNAME1= <>
##$DPNAME2= <>
##$DPNAME3= <>
##$DPNAME4= <>
##$DPNAME5= <>
##$DPNAME6= <>
##$DPNAME7= <>
##$DPOAL= (0..7)
0.5 0.5 0.5 0.5 0.5 0.5 0.5 0.5 
##$DPOFFS= (0..7)
0 0 0 0 0 0 0 0 
##$DQDMODE= 0
##$DR= 18
##$DS= 0
$$ [...]
##$SUBNAM2= <"">
##$SUBNAM3= <"">
##$SUBNAM4= <"">
##$SUBNAM5= <"">
##$SUBNAM6= <"">
##$SUBNAM7= <"">
##$SUBNAM8= <"">
##$SUBNAM9= <"">
##$SW= 18.0517328524113
##$SWIBOX= (0..15)
0 0 2 0 0 0 0 0 0 0 0 0 0 0 0 0 
##$SW_h= 3612.71676300578
##$TD= 16384
##$TD0= 1
##$TE= 0
##$TE2= 300
##$TE3= 300
##$TEG= 300
##$TL= (0..7)
0 120 120 120 120 120 120 120 
##$TP= (0..7)
150 150 150 150 150 150 150 150 
##$TP07= 0
##$TPNAME0= <>
##$TPNAME1= <>
##$TPNAME2= <>
##$TPNAME3= <>
##$TPNAME4= <>
##$TPNAME5= <>
##$TPNAME6= <>
##$TPNAME7= <>
##$TPOAL= (0..7)
0.5 0.5 0.5 0.5 0.5 0.5 0.5 0.5 
##$TPOFFS= (0..7)
0 0 0 0 0 0 0 0 
##$TUNHIN= 0
##$TUNHOUT= 0
##$TUNXOUT= 0
##$USERA1= <user>
##$USERA2= <user>
##$USERA3= <user>
##$USERA4= <user>
##$USERA5= <user>
##$V9= 5
##$VALIST= <valist>
##$VCLIST= <CCCCCCCCCCCCCCC>
##$VD= 0
##$VDLIST= <DDDDDDDDDDDDDDD>
##$VPLIST= <PPPPPPPPPPPPPPP>
##$VTLIST= <TTTTTTTTTTTTTTT>
##$WBST= 1024
##$WBSW= 4
##$XGAIN= (0..3)
0 0 0 0 
##$XL= 0
##$YL= 0
##$YMAX_a= 97902
##$YMIN_a= -103322
##$ZGOPTNS= <>
##$ZL1= 120
##$ZL2= 120
##$ZL3= 120
##$ZL4= 120
##$ABSF1= 10
##$ABSF2= 0
##$ABSG= 5
##$ABSL= 3
##$ALPHA= 0
##$AQORDER= 0
##$ASSFAC= 0
##$ASSFACI= 0
##$ASSFACX= 0
##$ASSWID= 0
##$AUNMP= <proc_1d>
##$AZFE= 0.1
##$AZFW= 0.1
##$BCFW= 1
##$BC_mod= 2
##$BYTORDP= 1
##$COROFFS= 0
##$CY= 11.3945322036743
##$DATMOD= 1
##$DC= 2
##$DFILT= <>
##$DTYPP= 0
##$F1P= 15.7292609196834
##$F2P= 12.9074282941183
##$FCOR= 0.5
##$FTSIZE= 0
##$FT_mod= 4
##$GAMMA= 1
##$GB= 0.15
##$INTBC= 1
##$INTSCL= 1
##$ISEN= 128
##$LB= 0.24
##$LEV0= 0
##$LPBIN= 0
##$MAXI= 10000
##$MC2= 0
##$MEAN= 0
##$ME_mod= 0
##$MI= 1.114404
##$NCOEF= 0
##$NC_proc= 0
##$NLEV= 6
##$NOISF1= 3.799351
##$NOISF2= 2.8
##$NSP= 1
##$NTH_PI= 0
##$NZP= 0
##$OFFSET= 15.70392
##$PC= 1
##$PHC0= -24595.66
##$PHC1= 18.25273
##$PH_mod= 1
##$PKNL= yes
##$PPARMOD= 0
##$PSCAL= 0
##$PSIGN= 0
##$REVERSE= no
##$SF= 200.130013532006
##$SI= 16384
##$SIGF1= 3
##$SIGF2= 2
##$SINO= 400
##$SIOLD= 16384
##$SREGLST= <1H.CDCl3>
##$SSB= 0
##$STSI= 0
##$STSR= 0
##$SW_p= 3612.71676300578
##$SYMM= 0
##$S_DEV= 0
##$TDeff= 0
##$TDoff= 0
##$TI= <>
##$TILT= no
##$TM1= 0
##$TM2= 0
##$TOPLEV= 0
##$USERP1= <user>
##$USERP2= <user>
##$USERP3= <user>
##$USERP4= <user>
##$USERP5= <user>
##$WDW= 1
##$XDIM= 8192
##$YMAX_p= 0
##$YMIN_p= 0
$$ End of Bruker specific parameters
$$ ---------------------------------
##NTUPLES= NMR FID
##VAR_NAME=  TIME,          FID/REAL,        FID/IMAG
##SYMBOL=    X,             R,               I
##VAR_TYPE=  INDEPENDENT,   DEPENDENT,       DEPENDENT
##VAR_FORM=  AFFN,          ASDF,            ASDF
##VAR_DIM=   8192,          8192,            8192
##UNITS=     SECONDS,       ARBITRARY UNITS, ARBITRARY UNITS
##FACTOR=    0.0002768,     1,               1
##FIRST=     0,             0,               0
##LAST=      2.2672688,     0,               0
##MIN=       0,             -103322,         0
##MAX=       2.2672688,     97902,           0
$$ Real data points
##PAGE= N=1
##DATA TABLE= (X++(R..R)), XYDATA
$$ [...]
$$ plain form
1729 -3 -178 -409 -180 -127 -256 -412 -283 -207 -128 -188 -242 143 -233 116 -417 235 282 -50 57 241 182 409 135
1752 135 10 90 284 232 -14 -165 37 130 37 -71 -138 -142 -145 131 113 -104 195 30 42 158 -16 85 247 66
1776 66 -145 -146 62 186 -90 3 -3 -15 203 -184 325 163 135 272 -145 114 137 16 158 101 67 -264 76 -151
1800 -151 -293 -244 -222 -70 -212 -107 -100 -52 143 80 215 189 346 443 -41 235 588 596 490 120 116 -15 79 -244
1824 -244 -250 -251 -183 295 -438 -220 -335 29 61 60 -70 -61 387 208 160 182 -13 131 273 -48 121 88 207 175 -170
1849 -170 -238 80 94 -140 32 -152 -275 103 -113 -320 -71 134 -140 -233 155 247 261 11 -160 -55 -101 279
1871 279 143 -140 166 -43 192 256 68 37 339 217 -14 -32 131 -59 3 -359 -403 -447 -87 -350 -602 -516
1893 -516 -336 -73 -198 -146 -297 49 117 96 41 -74 441 308 149 254 159 319 265 -32 -23 -27 -118 -157 -331 -299
$$ packed form
1729cj75k31K29N3j29j56J29P6P9o0n4L85l76L49n33O52M7l32J07J84n9K27k74
1752A35j25Q0J94n2k46j51K02R3r3j08o7mlK76j8k17K99j65J2J16j74J01J62j81
1776F6k11jK08J24k76R3oj2K18l87N09j62k8J37m17K59K3j21J42n7l4l31L40k27
1800a51j42M9K2J52j42J05PM8J95o3J35k6J57R7m84K76L53Qj06l70mj31R4l23
1824b44ojO8M78p33K18j15L64L2jj30RM48j79m8K2j95J44J42l21J69l3J19l2l45
1849a70o8L18J4k34J72j84j23L78k16k07K49K05k74r3L88R2J4k50j71J05m6L80
1871B79j36k83L06k09K35O4j88l1L02j22k31j8J63j90O2l62m4m4L60k63k52Q6
1893e16J80K63j25N2j51L46O8k1n5j15N15j33j59J05r5J60n4k97Rmr1l9j74L2
$$ plain form
1917 -299 -250 -124 27 -79 -81 57 263 306 -72 55 69 535 163 223 131 324 170 65 15 261 39 119 -29
1940 -29 97 86 -95 -34 -462 -555 -30 -342 -165 -205 -222 -310 -275 -231 -328 -152 -333 -133 -175 -75 -2 -1 229 37 242
1965 242 72 179 117 226 51 213 266 21 29 -23 -139 -85 -178 -81 -160 -21 -149 -88 -86 -182 -181 -210 338 142 270
1990 270 271 159 240 367 523 349 369 252 -71 133 -55 -55 -112 -404 -191 -179 -256 -446 -31 -406 -272 -404 -231
2013 -231 -66 96 -19 -134 109 60 172 218 114 -23 218 -172 -82 118 179 -212 -76 -25 69 3 22 112 -201
2036 -201 -152 -223 7 8 -85 269 200 -97 77 -72 -33 -4 158 -33 129 -34 277 236 -17 49 -5 139 83 100
2060 100 -15 65 252 351 -136 -227 -133 -419 -92 -393 -144 -251 -29 -165 -300 -34 -24 319 130 182 51 267
2082 267 229 201 61 -13 263 57 -203 -232 60 -15 -23 -324 98 -137 -220 -55 -172 -43 178 100 -139 -92 -153 116
$$ packed form
1917b99M9J26J51j06kJ38K06M3l78J27J4M66l72O0r2J93j54j05n0K46k22Q0j48
1940b9J26j1j81O1m28r3N25l12J77m0j7q8L5M4r7J76j81K00m2J00P3JK30j92K05
1965B42j70J07o2J09j75J62N3k45Qn2j16N4r3R7p9J39j28O1Kr6Jk9N48j96J28
1990B70Jj12Q1J27J56j74K0j17l23K04j88%n7k92K13J2p7j90M15l75J34j32J73
2013b31J65J62j15j15K43m9J12M6j04j37K41l90R0K00O1l91J36N1R4o6J9R0l13
2036b01M9p1K30Jr3L54o9k97J74j49L9K9J62j91J62j63L11m1k53O6n4J44n6J7
2060A00j15Q0J87R9m87r1R4k86L27l01K49j07K22j36j35K66J0L43j89N2j31K16
2082B67l8k8j40p4K76k06k60k9K92p5ql01M22k35q3J65j17J29K21p8k39M7o1K69
$$ plain form
2106 116 122 105 87 344 224 404 69 20 -9 43 -109 -15 -253 -143 -171 166 106 -133 -40 -296 29 -275 -87 170
2130 170 98 -101 -194 -170 100 8 -125 99 118 -34 -125 85 -47 120 120 146 146 225 325 100 275 28 103 -2
2154 -2 82 -74 -39 102 -242 -59 60 -169 72 42 76 -85 -209 -205 88 187 -47 85 218 91 166 105 -90 -21
2178 -21 -64 -178 -11 -27 -78 -25 -139 -290 22 48 -139 -71 -29 -136 -44 -15 211 112 133 235 -45 270 137 21
2202 21 -11 71 -270 -200 93 279 -63 129 -14 24 27 -44 0 59 -66 131 -41 77 -153 207 -117 -214 -226 165
2226 165 -256 -115 -177 -37 -133 105 -9 -66 105 76 166 48 95 345 -11 14 0 -233 -37 -146 -138 -96 2 -94
2250 -94 94 -148 -104 -389 -167 -37 71 31 48 49 8 -56 -33 4 99 18 -15 224 76 167 -292 21 -208 70 198
2275 198 12 83 -136 -83 124 26 241 109 68 -79 84 66 -241 -6 -177 -72 -214 -5 5 -102 -38 63
$$ packed form
2106A16Oj7j8K57j20J80l35m9k9N2j52R4k38J10k8L37o0k39R3k56L25l04J88K57
2130A70p2j99r3K4K70r2j33K24J9j52r1K10j32J67%K6%P9J00k25J75k47P5j05
2154bQ4j56L5J41l44J83J19k29K41l0L4j61j24MK93R9k34J32J33j27P5o1j95O9
2178b1m3j14J67j6n1N3j14j51L12K6j87O8M2j07R2K9K26r9K1J02k80L15j33j16
2202B1l2Q2l41P0K93J86l42J92j43L8Lp1M4N9j25J97j72J18k30L60l24r7j2L91
2226A65m21J41o2J40r6K38j14n7J71k9R0j18M7K50l56K5j4k33J96j09QM2R8r6
2250i4J88k42M4k85K22J30J08m0J7Jm1o4K3L7R5q1l3K39j48R1m59L13k29K78J28
2275A98j86P1k19N3K07r8K15j32m1j47J63j8l07K35j71J05j42K09J0j07O4J01
$$ plain form
2297 63 57 19 183 36 24 -260 -32 -98 84 127 347 -69 -235 298 -121 -237 -131 -54 -81 -59 -195 -276 -219 28
2321 28 -14 132 186 -213 -61 218 205 142 167 63 30 66 130 39 105 -40 -139 -56 -116 24 -172 -155 -351 175 31
2346 31 -201 -10 -59 -162 -83 -210 -9 40 12 94 121 80 -232 299 170 -41 198 211 15 222 42 -202 -44
2369 -44 243 -48 -183 8 -40 -179 -112 13 -35 112 -339 -36 -208 -188 -20 -110 -96 -22 -172 157 211 164 -138
2392 -138 102 285 199 190 -58 126 99 -12 100 -189 -327 130 -11 -172 -299 -5 183 -79 -108 -41 10 54 353
2415 353 280 251 148 112 341 -95 64 328 243 91 -132 -207 145 -144 45 66 -11 76 -19 9 10 -64 -81 42 -83
2440 -83 -50 255 46 29 260 -175 -126 -201 110 -20 274 135 -162 -71 -241 -70 -168 -154 -52 -13 52 74 -100 -213
2464 -213 -175 -73 -258 -263 93 -118 7 -363 10 22 172 -163 86 -5 -63 221 104 137 103 57 224 37 -22
$$ packed form
2297F3ol8J64j47j2k84K28o6J82M3K20m16j66N33m19j16J06P7k7K2j36q1N7K47
2321B8m2J46N4l99J52K79j3o3K5j04l3L6O4r1O6j45r9Q3o0J40j96J7j96N26j44
2346C1k32J91m9j03P9j27K01M9k8Q2K7m1l12N31j29k11K39J3j96K07j80k44J58
2369d4K87k91j35J91m8j39O7J25m8J47m51L03j72K0J68r0J4P4j50L29N4m7l02
2392a38K40J83q6rk48J84k7j11J12k89j38M57j41j61j27K94J88k62k9O7N1M4K99
2415C53p3k9j03l6K29m36J59K64q5j52k23p5L52k89J89K1p7Q7r5K8Jp4j7J23j25
2440h3L3L05k09j7K31m35M9p5L11j30K94j39k97R1j70J71r8J4J02L9O5K2j74j13
2464b13L8J02j85nL56k11J25l70L73J2J50l35K49r1n8K84j17L3l4m6J67j87n9
$$ plain form
2487 -22 101 45 171 39 23 -62 -46 226 -43 156 -112 -259 2 -48 -16 -5 70 128 344 184 -11 -56 171 -23
2511 -23 347 -66 57 39 -221 39 -68 -107 -12 -301 -115 -23 -166 -129 -297 345 79 -14 -19 -129 -1 -36 380
2534 380 205 91 165 -97 74 42 -86 -204 6 33 40 171 -104 -71 172 185 -48 2 -107 7 244 -48 226
2557 226 -149 -2 68 -8 -11 -11 -68 26 -282 78 50 -232 9 -20 -72 24 11 -109 18 45 -126 39 172 208 149
2582 149 44 -97 -95 -222 11 -169 -18 -26 39 164 -91 167 -36 290 153 -25 77 -32 -87 -36 -76 -29 290
2605 290 -25 -227 228 19 -266 -280 -180 -69 -164 -103 -309 141 -53 -38 -21 -73 -99 157 233 -50 143 -63 142
2628 142 50 125 -64 -32 -110 60 20 117 12 124 -18 79 -419 -68 -78 59 12 -243 4 -154 -13 -194 -44
2651 -44 -230 -198 124 -71 -133 -183 -87 59 -150 -154 -308 72 33 -149 156 -39 40 -61 160 -107 39 -176 72
$$ packed form
2487b2J23n6J26j32j6q5J6K72k69J99k68j47K61n0L2J1P5N8K16j60j95m5K27j94
2511b3L70m13J23j8k60K60j07l9R5k89J86R2j43L7j68O42k66r3nj10J28l5M16
2534C80j75j14P4k62J71l2j28j18K10K7PJ31k75L3K43J3k33N0j09J14K37k92K74
2557B26l75J47P0p6l%n7R4l08L60k8k82K41k9n2R6j3j20J27K7j71J65J33L6n9
2582A49j05j41Kj27K33j80J51qO5J25k55K58k03L26j37j78J02j09n5N1m0M7L19
2605B90l15k02M55k09k85j4J00J11r5O1k06M50j94J5J7n2k6K56P6k83J93k06K05
2628A42r2P5j89L2p8J70m0R7j05J12j42R7m98L51j0J37m7k55K47j58J41j81J50
2651d4j86L2L22j95o2n0R6J46k09mj54L80l9j82L05j95P9j01K21k67J46k15K48
$$ plain form
2674 72 -86 -13 -141 54 -83 -182 300 44 -92 -280 213 -94 -4 28 44 18 187 -8 -23 -137 50 -35 -210
2697 -210 -87 -162 -157 -168 -323 -64 73 166 100 271 -110 -124 -162 139 -255 176 -33 143 204 -298 119 58 66 -246
2721 -246 49 -3 -79 76 -155 60 -137 -2 -84 131 -24 -113 12 37 -115 -146 52 -137 -65 -213 -214 -155 -151 -151 227
2746 227 169 -154 136 122 44 -123 102 -26 -59 198 101 81 32 193 -26 19 -120 -37 43 123 324 131 -135 30
2770 30 77 -2 -278 -38 77 -86 -117 146 90 36 92 3 7 -71 128 14 124 186 -235 -93 -61 184 -49 47 -7
2795 -7 -85 209 141 162 93 2 170 -239 -143 124 -46 -49 -138 114 -200 -91 73 203 -11 -276 116 -124 239 -195
2819 -195 -44 137 40 -99 -28 207 64 157 -430 4 11 182 126 -77 13 123 -57 -28 -22 -118 -51 -19 -52 -42 -192
2844 -192 13 139 7 211 -152 -361 -163 1 -121 182 -219 -122 63 -86 58 -51 -58 -66 -83 -284 122 -376
$$ packed form
2674G2j58P3j28J95j37r9M82k56j36j88M93l07R0L2J6k6J69j95j5j14J87q5j75
2697b10J23p5Nj1j55K59J37R3o6J71l81j4l8L01l94M31k09J76O1n02M17o1Ql12
2721b46K95n2p6J55k31K15j97J35q2K15j55q9J25K5j52l1J98j89P2j48jN9M%L78
2746B27n8l23K90j4p8j67K25j28l3K57r7k0m9J61k19M5j39Q3Q0Q0K01j93k66J65
2770C0M7p9k76K40J15j63l1K63n6n4N6q9Mp8J99j14J10O2m21J42L2K45k33R6n4
2795gp8K94o8K1o9r1J68m09R6K67j70lq9K52l14J09J64J30k14k65L92k40L63m34
2819a95J51J81r7j39P1K35j43R3n87M34PJ71n6k03R0J10j80K9Or6O7L2l3J0j50
2844a92K05J26j32K04l63k09J98J64j22L03m01R7J85j49J44j09pqj7k01M06m98
$$ plain form
2866 -376 266 160 -186 321 -219 -137 90 33 -94 -43 -128 -34 23 109 344 224 23 225 -184 -234 -255 12 -86
2889 -86 -93 185 44 -53 -232 73 -75 -6 -192 -188 -21 -31 -77 -89 -82 -80 -10 134 -250 -16 26 -163 128 -138 331
2914 331 99 74 142 -32 52 -211 120 116 -70 15 -166 196 -109 108 21 -46 -54 17 -289 63 46 -102 25 79
2938 79 98 -65 210 -136 -107 32 44 -10 -39 67 241 -80 83 -3 37 30 -156 -11 -125 129 -286 82 78 -77
2962 -77 -51 -137 -52 -112 -166 19 145 -133 124 -205 -184 59 -69 -115 -69 131 -15 -15 -319 25 -117 -199 -55 -3
2986 -3 -297 194 96 -146 126 33 66 -5 44 -232 -423 -101 25 26 130 -34 85 118 54 99 -95 -92 -198 -42 -73
3011 -73 216 114 -180 2 126 76 -172 179 157 -125 -5 19 -15 95 37 19 84 -28 43 -127 -42 380 -59
3034 -59 46 127 38 20 -111 -153 46 50 -8 39 -99 23 44 163 -179 30 -99 -3 299 -181 34 -254 -95 137
$$ packed form
2866c76O42j06l46N07n40Q2K27n7j27N1q5R4N7Q6K35j20k01K02m09n0k1K67r8
2889h6pK78j41r7j79L05j48O9j86MJ67j0m6j2PKP0J44l84K34M2j89K91k66M69
2914C31k32k5O8j74Q4k63L31mj86Q5j81L62l05K17q7o7qP1l06L52j7j48J27N4
2938G9J9j63K75l46K9J39J2n4k9J06J74l21J63q6M0pj86J45j14K54m15L68mj55
2962g7K6q6Q5o0n4J85J26k78K57l29K1K43j28m6M6K00j46%l04L44j42q2J44N2
2986ck94M91r8k42K72r3L3p1M9k76j91L22J26JJ04j64J19L3o4M5j94Lj06J56l1
3011g3K89j02k94J82J24n0k48L51k2k82J20K4l4J10n8j8O5j12P1j70Q5M22m39
3034e9J05Q1q9j8j31m2J99Mn8M7j38J22K1J19l42K09j29R6L02m80K15k88J59K32
$$ plain form
3058 137 -143 89 129 84 69 -4 380 193 17 -46 -64 -69 135 -24 194 -238 -61 -243 -192 -121 -58 -96 46 -22
3082 -22 20 15 51 -42 -183 -64 44 -9 32 -134 68 127 55 -99 4 161 -58 -29 112 -120 143 168 -150 -100
3106 -100 158 152 25 13 117 -263 -7 115 -9 -21 -377 50 -57 -21 -16 -71 -72 11 -20 196 -138 -26 -161 -286
3130 -286 345 -5 260 121 -30 -7 -86 2 44 76 153 -141 -98 -77 302 -243 17 33 -278 -105 10 222 197
3153 197 -167 -100 -23 112 84 -44 10 -135 205 -359 59 -140 -5 4 344 -89 172 163 5 115 87 186 -59
3176 -59 -79 -100 87 84 14 128 -90 85 -204 181 7 113 -97 -110 35 190 -38 -228 83 42 353 -77 -181
3199 -181 -237 -80 -1 98 38 340 -64 112 33 -59 -32 -64 107 123 47 165 -338 -48 22 166 18 -10 -88 81
3223 81 369 -71 107 -41 175 -186 -58 209 31 -53 -262 -18 -85 109 143 48 24 177 -14 -194 28 77
$$ packed form
3058A37k80K32M0m5j5p3L84j87j76o3j8nK04j59K18m32J77j82N1P1O3l8J42o8
3082b2M2nL6r3j41J19J08n3M1j66K02N9p2j54J03J57k19K9J41k32K63K5l18N0
3106a00K58oj27j2J04l80K56J22j24j2l56M27j07L6Nn5jQ3l1K16l34J12j35j25
3130b86O31l50K65j39j51K3p9Q8M2L2P7k94M3K1L79n45K60J6l11J73J15K12k5
3153A97l64O7P7J35k8j28N4j45L40n64M18j99J35RL40m33K61rj58J10k8R9k45
3176e9k0k1J87lp0J14k18J75k89L85j74J06k10j3J45J55k28j90L11m1L11m30j04
3199a81n6J57P9R9o0L02m04J76p9r2K7l2J71J6p6J18n03K90P0J44j48k8p8J69
3223H1K88m40J78j48K16l61J28K67j78q4k09K44o7J94L4r5k4J53j91j80K22M9
$$ plain form
3245 77 190 23 174 -170 -119 -91 -14 -229 65 -8 124 -180 166 168 -204 236 312 -244 42 -157 103 -139 120
3268 120 214 -1 -8 -83 9 -21 -33 -44 -53 -32 -26 -242 64 -121 -217 -130 -63 5 -43 24 54 -35 135 -15 -55 -209 310
3295 310 31 -122 -139 2 32 101 193 -12 -36 222 -90 55 -60 106 184 79 -59 -200 95 -206 124 111
3317 111 -135 -198 -58 158 231 -304 -40 -84 388 -31 -105 14 95 16 12 30 -40 49 13 -34 128 -230 -11 30 13
3342 13 -94 -1 17 46 -216 298 -165 -163 -42 -11 -94 26 -64 -98 79 -26 351 294 95 -184 122 37 -116 65
3366 65 -208 -43 -20 230 -231 33 319 -272 271 253 -152 253 166 -122 25 -47 59 -6 64 2 -8 178 -90
3389 -90 -181 -230 97 94 27 88 -216 150 -45 -111 -88 91 85 -58 -186 -296 -138 -232 -17 -16 180 157 -160 38 -156
3414 -156 -150 200 34 159 83 119 -46 -52 224 -126 -20 -56 125 41 -56 -182 190 92 -113 -98 -26 -10 236 -4
$$ packed form
3245G7J13j67J51l44N1K8P7k15K94p3J32l04L46Kl72M40P6n56K86j99K60k42K59
3268A20R4k15pp5R2l0j2j1rK1Ok16L06j85r6Q7O7O8m8O7L0q9J70j50m0j54N19
3295C10k79j53j7J41L0O9R2k05k4K58l12J45j15J66P8j05j38j41K95l01L30j3
3317A11k46o3J40K16P3n35K64m4M72m19p4J19Q1p9mJ8p0Q9l6m7J62l58K19M1j7
3342A3j07R3J8K9k62N14m63KJ21L1q3J20r0l4J77j05L77n7j99k79L06q5j53J81
3366F5k73J65K3K50m61K64K86n91N43j8m05M05q7k88J47p2J06o5P0o2j0J86k68
3389i0r1m9L27lo7O1l04L66j95o6K3J79oj43j28j10J58r4K15JJ96k3l17J98j94
3414a56OL50j66J25p6L6j65oK76l50J06l6J81q4r7j26L72r8k05J5P2J6K46k40
$$ plain form
3438 -4 89 23 51 217 57 -9 -49 86 40 -166 -36 157 9 -150 -13 10 7 -6 -177 -24 -199 143 154 -63
3462 -63 -72 271 297 -234 -23 51 -13 182 13 -69 -339 75 -37 -12 -127 2 4 -35 151 43 95 -53 100 -115
3486 -115 -81 220 38 7 190 -80 -71 -192 -18 145 -84 -104 71 -135 -134 347 88 16 -257 -129 -81 222 -64
3509 -64 -298 153 -111 1 3 136 215 -374 -19 106 95 158 47 6 -46 124 87 -73 39 169 47 91 11 202
3533 202 -22 56 163 27 -74 199 -103 -53 90 -155 -100 52 -32 -34 -166 212 13 -201 -257 -23 -6 155 -48
3556 -48 -302 65 153 -171 -149 -120 238 -116 -76 -112 139 1 -128 80 13 -48 -41 45 91 -172 -150 42 -116 45
3580 45 175 359 87 60 -4 -217 -100 155 93 47 -63 -78 41 90 -92 154 6 63 -81 -36 -50 278 163
3603 163 -23 -78 74 43 -112 315 -37 -6 56 -6 -158 57 -1 173 7 18 -82 97 164 -85 239 -150 -176
$$ packed form
3438dR3o6K8J66j60o6m0J35m6k06J30J93j48j59J37K3lj3j71J53j75L42J1k17
3462f3rL43K6n31K11P4o4J95j69q2k70M14j12K5j15J29Kl9J86j08N2j48J53k15
3486a15L4L01j82l1J83k70Rj21J74J63k29k0J75k06JM81k59p2k73J28M8L03k86
3509f4k34M51k64J12KJ33P9n89L55J25j1O3j11m1n2J70l7j60J12J30j22M4q0J91
3533B02k24P8J07j36j01K73l02N0J43k45N5J52q4kj32L78j99k14n6K34J7J61k03
3556d8k54L67Q8l24K2K9L58l54M0l6K51j38j29K08o7o1PQ6M6k63K2J92j58J61
3580D5J30J84k72k7o4k13J17K55o2m6j10j5J19M9j82K46j48N7j44M5j4L28j15
3603A63j86n5J52l1j55M27l52L1O2o2j52K15n8J74j66J1j00J79O7k49L24l89k6
$$ plain form
3626 -176 177 -242 133 -152 -129 -13 196 183 -83 102 -273 14 -221 56 -128 31 -25 129 -2 138 -210
3647 -210 -149 -114 -14 -139 -88 -263 268 -94 -233 34 98 -258 1 265 -16 -21 207 -79 125 28 185 1
3669 1 -28 -74 75 24 -171 139 110 97 -172 -178 -132 -29 252 -59 -58 193 17 20 -4 -86 78 16 94 170 149 3 -196
3696 -196 127 -18 169 -363 -75 -89 136 -108 182 -57 -80 70 36 -10 -24 316 -207 -135 182 156 202 133 -139
3719 -139 -143 -109 -133 72 -74 -172 48 243 245 -20 -114 -51 -177 -67 -86 -117 139 -400 132 216 150 54 159 -110 -156
3744 -156 -200 237 39 -56 107 -112 242 66 -44 -36 -354 -112 -49 -10 142 -31 -130 -154 -215 -247 171 73 -99 43
3768 43 -361 131 -38 -132 -245 -29 -70 69 -18 50 86 -231 -128 125 8 -65 -148 -3 168 72 67 135 24 124
3792 124 -108 -122 73 -110 76 65 -111 -72 65 74 -55 278 -89 58 -58 116 7 -34 -217 -174 303 10
$$ packed form
3626a76L53m19L75k85K3J16K09j3k66J85l75K87k35K77j84J59n6J54j31J40l48
3647b10O1L5J00j25N1j75N31l62j39K67O4l56K59K64k81nK28k86K04r7J57j84
3669Ak9m6J49n1j95L10k9j3k69oM6J03K81l11JK51j76Lk4q2J64o2P8P6k1j46j99
3696a96L23j45J87n32K88j4K25k44K90k39k3J50l4m6j4L40n23P2L17k6M6o9k72
3719a39mL4k4K05j46r8K20J95Kk65r4O3j26J10j9l1K56n39N32Q4o6r6J05k69m6
3744a56m4M37j98r5J63k19L54j76j10Ql18K42O3L9J52j73r9k4o1l2M18r8j72J42
3768D3m04M92j69r4j13K16m1J39q7O8L6l17J03K53j17p3q3J45J71r6nO8j11J00
3792A24k32j4J95j83J86j1j76L9J37Rj29L33l67J47j16J74j09m1j83M3M77k93
$$ plain form
3814 10 15 145 -98 153 -62 -92 -45 -258 -294 118 90 -111 117 234 46 -181 -370 24 -13 55 67 55 214 90
3838 90 158 77 -26 133 -62 -80 5 32 25 -278 166 -17 168 7 -5 -38 -71 134 -2 9 58 -163 -92 65 121
3863 121 -147 -262 -92 100 -39 27 53 -121 -217 -42 198 191 -88 5 -90 -194 123 33 -162 -120 -153 17 -157
3886 -157 -74 -202 -131 76 75 -49 42 15 -362 -33 87 -178 230 103 104 -35 241 46 168 7 297 87 -208
3909 -208 193 112 76 49 13 29 -14 -99 61 137 83 30 125 -95 107 -32 123 105 -203 -204 -54 94 -165 -44 -56
3934 -56 -27 -81 -142 44 0 74 -75 -14 -37 -134 -39 14 -139 -15 -42 4 -38 151 -159 -79 -112 43 21 53 -213 -157
3960 -157 -454 -39 36 107 50 300 -78 -71 146 142 -190 91 -124 54 -109 22 220 83 113 -83 -18 -15 124 -59
3984 -59 -214 -85 -282 62 10 98 -15 127 -117 82 -300 -112 99 -58 216 7 -87 -159 -17 -86 -126 -103 19
$$ packed form
3814A0NJ30k43K51k15l0M7k13l6M12k8k01K28J17j88k27j89L94l7O8J2j2J59j24
3838I0O8q1j03J59j95j8Q5K7pl03M44j83J85j61j2l3l3K05j36J1M9k21P1J57N6
3863A21k68j15J70J92j39O6K6j74r6J75K40pk79R3r5j04L17r0j95M2l3J70j74
3886a57Q3j28P1K07jj24R1k7l77L29J20k65M08j27Jj39K76j95J22j61K90k10k95
3909b08M01q1l6k7l6J6m3q5J60P6n4n3R5k20K02j39J55j8l08jJ50J48k59J21j2
3934e6K9n4o1J86m4P4j49O1k3r7R5N3j53J24k7M6m2J89l10Q0l3J55k2L2k66N6
3960a57k97M15P5P1n7K50l78PK17ml32K81k15J78j63J31J98j37L0j96O5LJ39j83
3984e9j55J29j97L44n2Q8j13J42k44J99l82J88K11j57K74k09r4p2J42o9m0K3J22
$$ plain form
4007 19 201 -70 11 246 154 -62 -29 -274 64 35 35 102 -66 -20 -260 -169 -346 -239 99 -45 41 139 -59 -94
4031 -94 200 96 56 -45 171 190 -114 -40 116 132 -85 227 -199 25 87 -77 -93 66 -69 -94 176 98 -3
4054 -3 26 53 2 -201 51 141 57 180 -25 -224 113 202 -201 206 -9 133 -69 -61 143 123 119 29 33 81 -17 -26 105
4081 105 -137 -87 97 -283 -79 -84 138 56 -95 9 -34 129 -85 -67 47 -29 47 -150 -75 49 88 460 -12
4104 -12 -154 197 -226 -41 -21 -58 101 -240 10 32 144 -260 92 -13 56 -269 -139 163 -45 -80 190 -18
4126 -18 -77 -201 154 66 33 16 -119 98 135 66 185 296 78 -14 129 -128 -3 -146 150 -74 -10 -67 -32 -24
4150 -24 -136 236 69 -9 217 72 -32 53 237 20 -84 163 68 140 -160 -158 13 31 135 236 126 241 -9
4173 -9 227 -84 34 -74 -43 -240 19 -366 -26 157 -117 -125 61 27 148 -41 6 145 46 -84 146 114 79
$$ packed form
4007A9J82k71Q1K35r2k16L3k45L38k9%O7j68M6k40R1j77J07L38j44Q6R8j98l5
4031i4K94j04m0j01K16J9l04P4J56J6k17L12m26K24O2j64j6J59j35k5K70p8j01
4054cK9K7n1k03K52R0q4J23k05j99L37Q9m03M07k15J42k02QK04k0mr0MM8r8rJ31
4081A05k42N0J84l80K04nK22q2j51J04m3J63k14J8J14p6P6j97P5J24L9L72m72
4104a2j42L51m23J85K0l7J59l41K50K2J12m04L52j05O9l25J30L02k08l5K70k08
4126a8n9j24L55q8l3j7j35K17L7o9J19J11k18r2J43k57J25j43K96k24O4n7L5Q
4150b4j12L72j67p8K26j45j04Q5J84k17j04K47r5P2l00KJ71J8J04J01j10J15k50
4173iK36l11J18j08L1j97K59l85L40J83k74qJ86l4J21j89M7J39r9j30K30l2l5
$$ plain form
4196 79 276 -19 -102 -115 39 -155 66 31 -28 158 -158 -12 165 -28 13 -134 48 -25 -153 255 33 8 39
4219 39 -133 193 -169 -98 -190 82 -228 -38 -101 -100 280 -21 -101 64 -91 -18 9 82 -123 -185 37 -132 -138 210
4243 210 39 151 -80 -179 183 158 -52 224 262 -104 -159 -128 -209 -32 151 144 56 -4 65 -279 241 -56 5 -22
4267 -22 35 -205 96 -97 -176 323 -129 -55 -62 142 78 -190 74 179 99 142 132 -204 -56 -40 351 -196 -155 -156 -4
4292 -4 88 156 123 53 -60 -7 -162 -182 101 95 -50 134 -43 -159 -160 -4 87 -129 -39 72 108 98 265 -20 148
4317 148 -34 -49 136 -28 288 -44 154 135 120 59 -52 47 187 -126 -40 -9 -121 191 291 103 47 71 117
4340 117 143 -10 135 -64 195 234 -292 -99 -105 -59 -47 -105 126 -157 274 -109 127 123 -12 -26 -13 -59 290 -73
4364 -73 -124 -233 112 -7 92 6 -259 60 140 28 -33 7 179 -83 -278 -97 -161 -20 84 173 -15 15 -62 72
$$ packed form
4196G9J97k95q3j3J54j94K21l5n9J86l16J46J77j93M1j47J82p3j28M08k22k5L1
4219C9j72L26l62P1r2K72l10J90o3JL80l01q0J65j55P3K7P3k05o2K22j69oL48
4243B10j71J12k31r9L62k5k10K76L8l66n5L1q1J77J83pq8o0O9l44N20k97O1k7
4267b2N7k40L01j93p9M99m52P4pK04o4k68K64J05q0M3j0l36J48J6L91n47M1jJ52
4292dR2O8l3p0j13N3j55k0K83oj45J84j77j16jJ56R1k16R0J11L6j0J67k85J68
4317A48j82j5J85j64L16l32J98j9j5o1j11R9J40l13Q6L1j12L12J00j88n6K4M6
4340A17K6j53J45j99K59L9n26J93oM6J2n8K31k83M31l83K36mj35j4J3m6L49l63
4364g3n1j09L45j19R9q6k65L19Q0j12o1M0J72k62j95J81o4J41J04Q9j88L0p7J34
$$ plain form
4388 72 9 -2 81 18 -70 -13 77 4 57 67 -65 113 -52 147 36 193 74 174 -125 -8 117 92 117 68 -244
4413 -244 -115 1 -108 107 -8 -93 -65 10 120 -148 -57 -4 292 -332 -43 -91 -22 -72 -15 -94 -175 -100 -36 -82 -103
4438 -103 -17 -76 -117 -115 230 1 -225 -177 -151 -164 -73 -193 50 165 -169 -27 -104 -54 -26 126 21 -21 -44 -48 72
4463 72 -18 99 -105 172 -226 -163 -48 -215 16 -9 -33 102 35 288 -80 -170 -217 -199 -109 -49 165 43 288 110
4487 110 5 76 -79 75 17 -17 -120 -30 78 97 -66 149 196 -116 82 356 -85 310 -237 -79 307 -21
4509 -21 110 -27 65 -137 -90 -103 120 251 14 240 174 173 -69 -36 88 -122 -119 42 162 27 91 50 -37 150
4533 150 -61 -138 3 -190 -249 231 75 171 74 -117 296 -104 60 -161 42 -148 -46 -32 122 101 -65 141
4555 141 -92 -123 232 43 12 -265 45 142 14 -310 186 192 -14 -105 48 165 -6 209 -183 -64 -306 -67
$$ packed form
4388G2o3j1Q3o3q8N7R0p3N3J0j32J78j65J99j11J57j19J00k99J17J25k5K5m9l12
4413b44J29J16j09K15j15q5K8P5J10k68R1N3K96o24K89m8O9n0N7p9q1P5O4m6k1
4438a03Q6n9m1KL45k29k26M8K6j3R1j20K43J15l34J42p7N0K8J52j05m2k3mJ20
4463G2r0J17k04K77l98O3J15j67K31k5k4J35o7K53l68r0m7J8R0O0K14j22K45j78
4487A10j05P1j55J54n8l4j03R0J08J9j63K15M7l12J98K74m41L95n47J58L86l28
4509b1J31j37R2k02M7j3K23J31k37K26o6jk42L3J24k10LJ61J20j35O4m1q7J87
4533A50k11p7J41j93n9M80j56R6r7j91M13m00J64k21K03j90J02J4J54k1j66K06
4555A41k33l1L55j89l1k77L10R7j28l24M96Ok06r1J53J17j71K15l92J19k42K39
$$ plain form
4577 -67 85 -202 85 189 -14 150 -19 -191 -116 55 171 -21 107 -53 -40 -22 -320 112 192 42 95 88 -258
4600 -258 20 -152 72 324 -75 -98 -206 336 -145 -205 78 -18 147 100 -147 9 -109 -158 -106 26 17 -3 -250
4623 -250 -60 222 39 98 -59 223 -193 -23 -141 29 215 -118 97 17 108 127 -107 -113 -6 -164 83 -1
4645 -1 55 127 115 -165 193 -55 -80 -58 230 174 71 -1 24 184 12 69 -89 107 -176 125 -179 -362 -24 -66
4669 -66 -33 -97 31 -114 69 0 285 -128 -76 51 -23 242 -143 89 -57 164 52 -50 110 -14 -353 21
4691 21 -216 149 -135 -34 -162 -202 22 36 -12 -58 -7 -176 290 34 -17 -124 73 -30 48 6 -92 1 130 -251
4715 -251 167 13 98 84 162 -212 -150 -263 -116 154 164 -86 55 93 73 -184 -15 63 -71 18 -95 96 174
4738 174 63 169 36 -202 -89 -108 15 -37 60 -162 -151 146 45 -108 -69 64 -166 139 -126 -35 -113 -37 -62
$$ packed form
4577f7J52k87K87J04k03J64j69j72P5J71J16j92J28j60J3J8k98M32Q0j50N3pl46
4600b58K78j72K24K52l99k3j08N42m81o0K83r6J65m7k47J56j18m9N2J32rk0k47
4623b50J90K82j83N9j57K82m16J70j18J70J86l33K15q0R1J9k34oJ07j58K47q4
4645aN6P2j2k80L58k48k5K2K88n6j03p2K5J60j72N7j58J96k83L01l04j83L38m2
4669f6L3o4J28j45J83o9K85m13N2J27p4K65l85K32j46K21j12j02J60j24l39L74
4691B1k37L65k84J01j28m0K24J4m8m6N1j69M66k56n1j07J97j03P8m2r8R3J29l81
4715b51M18j54Q5j4P8l74O2j13J47K70J0k50J41L8k0k57J69P8j34Q9j13J91P8
4738A74j11J06j33k38J13j9J23n2R7k22J1K97j01j53L9J33k30L05k65R1p8P6k5
$$ plain form
4761 -62 36 -171 -96 136 -143 -16 26 39 31 -63 -75 -14 2 -222 165 -157 16 -216 126 49 307 -238 -300 -11
4785 -11 115 -65 -27 -45 254 155 -106 -99 149 -20 7 -158 -91 -309 -147 -73 85 -205 42 -37 -263 145 98 -153
4809 -153 -225 130 204 -107 21 53 181 74 45 91 -83 116 9 -2 -44 37 -53 129 159 -6 100 -116 186
4832 186 39 -15 57 81 292 -129 -164 40 -2 19 -183 -163 -47 -232 -18 -24 -42 142 67 97 -68 131 -42 115
4856 115 -83 -196 77 19 133 -14 -69 87 138 -59 84 -152 170 -37 201 90 87 24 -18 160 -74 256
4878 256 98 217 -407 1 -229 -25 -65 -54 71 114 -7 -51 23 57 191 -47 -44 -137 -3 54 19 -33 80 180
4902 180 -130 88 -70 184 -61 -49 -162 31 131 -165 126 156 -66 227 91 184 -4 -39 25 2 6 -4 90
4925 90 -201 27 43 -23 40 299 -10 -191 -27 345 9 149 254 200 333 -155 -23 84 197 40 99 48
$$ packed form
4761f2R8k07P5K32k79J27M2J3qr4j2O1J6k24L87l22J73k32L42p7K58n45o2K89
4785a1J26j80L8j8K99r9k61PK48j69K7j65O7k18J62P4J58k90K47p9k26M08m7k51
4809a53p2L55P4l11J28L2J28j07k9M6j74J99j07j1m2Q1r0J82L0j65J06k16L02
4832A86j47n4P2K4K11m21l5K04m2K1k02K0J16j85K14oj8J84p5L0j65J99j73J57
4856A15j98j13K73n8J14j47n5J56N1j97J43k36L22k07K38j11lo3m2J78k34L30
4878B56j58J19o24M08k30K04m0J1J25M3j21m4P4L4J34k38Lr3J34N7l5n2J13J00
4902A80l10K18j58K54k45J2j13J93J00k96K91L0k22K93j36R3j88l5O4k3Mj0R4
4925I0k91K28J6o6O3K59l09j81J64L72l36J40J05n4J33m88J32J07J13j57N9n1
$$ plain form
4947 48 -28 -113 68 -131 -63 256 -103 -165 -4 77 -69 70 -71 22 105 128 -54 -65 77 -219 -25 -118 -108 -31
4971 -31 -98 -67 161 -121 32 -79 -61 21 100 273 -262 46 321 83 -80 64 52 124 69 35 99 -100 170 136
4995 136 90 161 -30 49 149 -158 -93 115 -228 -42 -109 51 113 -151 70 39 -155 -6 -12 163 -140 -242 -30
5018 -30 51 227 -76 449 44 -15 -204 12 -127 156 -88 -53 66 103 118 14 -97 50 178 -134 35 82
5040 82 -61 -139 102 -121 93 -23 134 51 116 13 50 134 101 111 104 -77 -56 135 11 -59 -12 -136 -94 -89 250
5065 250 107 117 -3 182 -54 -27 143 -201 27 -134 149 -231 165 -187 282 187 -99 113 30 80 -12 -52
5087 -52 13 234 55 -180 248 -38 16 -74 212 -126 33 69 99 17 -82 51 100 -109 15 50 -48 -71 -93 -87 36
5112 36 151 66 -17 -172 66 168 194 -4 -107 9 119 171 141 -217 129 -85 -122 292 -11 -42 42 -96 90
$$ packed form
4947D8p6q5J81j99O8L19l59o2J61Q1j46J39j41R3Q3K3j82j1J42k96J94r3J0P7
4971c1o7L1K28k82J53j11J8Q2P9J73n35L08K75k38j63J44j2P2n5l4O4j99K70l4
4995A36m6P1j91P9J00l07O5K08l43J86o7J60O2k64K21l1j94J49oJ75l03j02K12
5018c0Q1J76l03N25m05n9j89K16j39K83k44L5J19L7J5j04j11J47J28l12J69M7
5040H2j43p8K41k23K14j16J57q3O5j03L7Q4l3J0pj81K1J91j24p0M7j24M2NL39
5065B50j43J0j20J85k36K7J70l44K28j61K83l80L96l52M69r5k86K12q3N0r2m0
5087e2O5K21j79k35M28k86N4r0K86l38J59L6L0q2r9J33M9k09J24L5r8k3k2OJ23
5112C6J15q5q3j55K38J02K6j98j03J16J10N2l0l58L46k14l7M14l03l1Q4j38J86
$$ plain form
5135 90 -60 -536 -121 -144 62 -106 -121 -95 -129 247 -51 -34 -42 137 -134 -111 -22 -81 69 106 -156 3 94 73 -95
5160 -95 -14 -164 66 -58 -196 78 81 -214 -87 -66 -50 47 -275 273 -56 -107 58 48 -133 -175 -77 276 95 119
5184 119 58 218 -259 11 73 99 94 -116 -120 36 150 -201 182 74 -72 155 8 171 118 -74 -16 132 -59
5207 -59 82 -16 41 116 -16 -53 217 -33 158 -195 34 117 38 -74 47 86 -32 60 316 288 -12 145 -153
5230 -153 -65 -69 19 -278 183 -135 117 -68 119 -145 18 164 -7 215 5 228 -14 -26 -6 116 -41 -34 57
5253 57 9 -106 -127 -170 -103 7 -270 -141 157 176 172 58 -169 -26 -10 65 48 -218 -8 -384 -144 -114 46 363
5277 363 70 136 -268 -39 130 -73 254 169 -193 -113 28 364 -157 -98 -43 -137 28 93 47 -150 -56 54 -70
5300 -70 -198 -108 145 70 -64 10 115 29 236 -91 -35 50 -1 -164 230 -77 259 -116 102 66 33 -70 228
$$ packed form
5135I0j50m76M15k3K06j68j5K6l4L76k98J7qJ79k71K3Q9n9J50L7k62J59R1k1j68
5160i5Q1j50K30j24j38K74Lk95J27K1J6R7l22N48l29n1J65j0j81m2R8L53j81K4
5184A19o1J60m77K70O2K6nk10mJ56J14l51L83j08j46K27j47J63n3j92N8J48j91
5207e9J41r8N7P5j32l7K70k50J91l53K29Q3p9j12J21L9j18R2K56k8l00J57k98
5230a53Q8mQ8k97M61l18K52j85J87k64J63J46j71K22k10K23k42j2K0J22j57PR1
5253E7m8j15k1m3O7J10k77J29K98J9mj14k27J43J6P5j7k66K10l76K40L0J60L17
5277C63k93O6m04K29J69k03L27q5l62Q0J41L36n21N9N5r4J65O5m6j97R4J10j24
5300g0j28R0K53p5j34P4J05q6K07l27N6Q5n1j63L94l07L36l75K18l6l3j03K98
$$ plain form
5323 228 -14 125 -171 -9 -201 -5 12 21 -299 94 -187 -170 69 -56 28 69 198 -4 50 -23 28 239 48
5346 48 -204 -66 -128 -98 227 83 -57 342 -40 46 -31 -39 -49 -255 102 101 -125 98 156 67 273 18 170 39
5370 39 92 -229 -81 -298 -59 87 -108 -205 -148 -166 -121 -124 63 -64 176 -77 192 -78 112 268 35 22 -48
5393 -48 -177 -138 132 -117 -176 191 -58 -131 66 -163 -43 124 134 -240 -16 103 42 -31 -9 26 -65 86 -90
5416 -90 -155 190 195 -33 -64 137 -176 62 39 138 -76 203 -114 38 -19 -196 -276 -119 38 33 246 -85 -67 71
5440 71 26 -142 50 -184 298 15 106 69 -34 -52 137 166 194 -104 -62 215 -101 -137 -171 42 -69 -27 -182 151
5464 151 -152 -40 140 -9 264 103 -299 -157 -259 38 105 -233 -106 60 -162 -63 -19 111 154 -235 -156 294
5486 294 12 247 -150 126 26 65 264 -200 -47 113 -29 22 28 11 -107 -174 24 12 88 28 61 192 214 -59
$$ packed form
5323B28k42J39k96J62j92J96J7Rl20L93k81J7K39j25Q4M1J29k02N4p3N1K11j91
5346D8k52J38o2L0L25j44j40L99l82Q6p7qj0k06L57jk26K23N8q9K06k55J52j31
5370C9N3l21J48k17K39J46j95r7N7j8M5lJ87j27K40k53K69k70J90J56k33j3p0
5393d8j29L9K70k49n9L67k49p3J97k29J20J67J0l74K24J19o1p3K2L5r1J51j76
5416i0o5L45Nk28l1K01l13K38k3R9k14K79l17J52n7j77q0J57J57nK13l31J8J38
5440G1m5j68J92k34M82k83R1l7j03j8J89K9K8k98M2K77l16l6l4K13j11M2j55L33
5464A51l03J12J80j49K73j61m02J42j02K97O7l38J27J66k22R9M4J30M3l89P9M50
5486B94k82K35l97K76j00L9J99m64J53J60j42N1Oj7j18o7J98j2P6o0L3J31K2k73
$$ plain form
5510 -59 -50 -75 -34 -70 -132 -4 41 111 143 -26 -26 -59 26 21 67 -58 15 -187 -38 21 -26 54 180 -96 -195 4 -43 -31
5538 -31 -104 -165 41 -27 -83 -109 -88 178 182 12 81 460 231 -86 116 253 131 277 126 -103 114 -52 -1 112
5562 112 30 121 26 57 -41 -71 -150 -34 99 -24 215 -46 -93 35 35 -27 123 -108 -113 26 -105 172 -59 -49 258
5587 258 -50 -210 -40 -256 -39 24 49 269 236 -17 -49 224 66 114 160 -60 179 140 -139 38 289 59
5609 59 -172 -11 -213 -16 14 13 151 -88 -145 8 38 35 290 -171 -167 -290 -64 0 198 11 -39 -82 -94 -26 -150
5634 -150 71 -108 -42 11 12 -46 91 -82 11 -10 69 -187 -282 14 10 -112 404 -186 139 8 -59 17 -93 -94 -82
5659 -82 131 12 6 260 -233 -95 92 -281 -12 -84 -97 -45 20 95 -101 -177 -112 296 156 -144 -139 -49 34 -138 -116
5684 -116 -32 263 -138 -322 108 -40 12 1 195 60 -86 154 255 -17 129 -139 -214 -1 110 65 13 -54
$$ packed form
5510e9Rk5M1l6o2J28M5P0L2j69%l3Q5nM6j25P3k02J49N9m7Q0J26k76r9J99m7J2
5538c1p3o1K06o8n6k6K1K66Mj70O9L79k29l17K02J37j22J46j51k29K17j66N1J13
5562A12q2R1r5L1r8l0p9J16J33j23K39k61m7J28%o2J50k31nJ39j31K77k31J0L07
5587B58l08j60J70k16K17O3K5K20l3k53l2K73j58M8M6k20K39l9k79J77K51k30
5609E9k31J61k02J97L0jJ38k39n7J53L0lK55m61Mj23K26O4J98j87n0m3j2O8j24
5634a50K21j79O6N3Jn8J37j73R3k1P9k56r5K96mj22N16n90L25j31o7P6j10jJ2
5659h2K13j19oK54m93J38J87l73K69p2j3N2O5P5j96p6O5M08j40l00NR0Q3j72K2
5684a16Q4K95m01j84M30j48N2j1J94j35j46K40J01k72J46k68p5K13J11m5n2o7
$$ plain form
5706 -54 102 27 16 -131 57 90 -30 10 28 20 131 -231 55 -13 -22 190 -84 -110 -93 145 -174 -4 -153 -48
5730 -48 -66 147 -86 84 61 -157 218 -294 -326 -119 251 -149 -125 295 -81 -115 -66 -153 106 -97 -42 -113 85
5753 85 117 93 -84 -137 205 -259 108 23 82 -185 67 -104 -124 -22 -4 -76 -112 -29 -250 199 -51 -101 -161 52
5777 52 -92 -317 -81 65 255 -28 68 161 34 203 12 -221 4 -122 43 84 130 -17 -22 -64 19 -18 -10 -12 -157
5802 -157 -1 69 -131 45 110 -138 8 -85 67 90 -228 -52 1 1 -4 72 72 -72 -24 128 167 -14 -32 440 -70
5827 -70 -78 89 114 -227 -117 37 58 -89 45 41 291 -122 -191 -131 -77 67 -126 -170 112 -155 -262 67 -29 157
5851 157 112 -113 -1 -334 -188 -118 -218 -92 -48 -77 -129 173 31 19 -47 1 217 -18 196 -5 -58 323 3
5874 3 11 3 93 -30 -125 -364 -62 -107 109 181 139 -23 146 -118 -80 125 5 -301 59 -182 99 166 -145 71
$$ packed form
5706e4J56p5j1j47J88L3j20M0J8qJ11l62K86o8rK12k74k6J7K38l19J70j49J05
5730d8j8K13k33J70k3k18L75n12l2K07L70m00K4M20l76l4M9q7K59k03N5p1J98
5753H5L2k4j77n3L42m64L67q5N9k67K52j71k0J02J8p2l6Q3k21M49k50n0o0K13
5777E2j44k25K36J46J90k83R6R3j27J69j91k33K25j26J65M1M6j47nm2Q3l7Qkj45
5802a57J56P0k00J76O5k48J46r3J52K3l18J76N3%nP6%j44M8J52L9j81j8M72n10
5827g0qJ67K5l41J10J54K1j47J34mK50m13o9O0N4J44j93m4K82k67j07L29r6J86
5851A57m5k25J12l33J46P0j00J26M4k9n2L02j42j2o6M8K16k35K14k01n3L81l20
5874CQqR0j23r5k39L02m5K16P2m2j62J69k64L8K05j20l06L60k41K81O7l11K16
$$ plain form
5898 71 1 56 68 40 29 -4 -14 20 0 2 99 -9 -40 -120 -116 -26 -131 -88 -173 20 12 -120 -83 -37 36 43 94 -52 -48 -39 194
5929 194 68 69 -99 155 -82 -43 208 71 17 22 33 39 150 113 24 -94 100 -200 149 81 133 -133 59 277
5953 277 54 144 4 199 -2 -177 -16 -138 196 -61 -22 -254 148 -11 -94 47 158 98 -254 36 41 49 -89
5976 -89 101 137 314 15 25 -196 146 125 207 -235 19 214 -42 148 -110 123 212 -90 257 62 -176 -133
5998 -133 -78 76 139 -100 28 166 105 48 -21 -88 5 29 8 -129 -3 84 95 -25 -196 -73 172 90 58 -68
6022 -68 120 -306 -234 -37 18 -73 -31 55 22 -11 286 76 -173 -134 214 -332 -127 -195 -29 -40 145 96 76 53 -84
6047 -84 82 122 130 -115 -109 47 3 -57 -192 71 -245 -93 -160 193 -167 46 -51 108 244 -158 26 8 59 -80
6071 -80 -17 -87 -29 61 311 69 350 -24 172 10 -15 34 -289 171 -196 39 -44 -56 -154 -72 50 126 111 96 -113
$$ packed form
5898G1p0N5J2k8j1l3j0L4k0KR7j08l1q0MR0j05M3q5J93qj32L7M6P3PN1j46MRK33
5929A94j26Jj68K54k37L9K51j37n4NJ1OJ11l7q9j18J94l00L49o8N2k66J92K18
5953B77k23R0j40J95k01j75J61j22L34k57L9k32M02j59q3J41J11o0l52K90NQj38
5976h9J90L6J77k99J0k21L42k1Q2m42K54J95k56J90k58K33Q9l02L47j95k38M3
5998a33N5J54O3k39J28J38o1n7o9o7R3K4k1j37J26Q7J1j20j71J23K45q2l2j26
6022f8J88m26P2J97N5r1M2Q6l3l3K97k10k49L9L48n46K05o8J66j1J85m9k0k3j37
6047h4J66M0Qk45OJ56m4o0j35K63l16J52o7L53l60K13r7J59J36m02J84j8N1j39
6071h0O3p0N8R0K50k42K81l74J96j62k5M9l23M60l67K35q3j2r8Q2J22P6j5j5k09
$$ plain form
6096 -113 -122 482 114 40 -262 7 -56 351 10 -34 -16 162 -214 33 146 -188 -56 -51 -114 17 -3 -9 -28 -134
6120 -134 86 -4 -120 191 126 -292 -84 323 95 -86 -306 -35 177 17 -9 -177 60 -127 -49 105 -111
6141 -111 -119 11 29 25 68 -4 22 -93 -175 -338 -311 83 -40 148 30 11 -41 49 369 227 -28 114 -183 60
6165 60 -297 86 186 -112 170 84 -223 32 -94 -63 50 -44 58 15 65 -10 13 -76 -17 -61 -82 -167 161 34
6189 34 -24 -29 46 -76 -4 142 2 102 -42 -73 -122 -72 88 64 -3 139 59 -66 281 245 -32 108 -196 -183 -111
6214 -111 -247 -10 106 45 -230 90 63 10 144 93 106 -153 48 19 -25 -71 -165 -67 -139 -122 20 -65 -56 -104 -19 -138
6240 -138 261 -40 79 -93 213 34 130 -40 5 127 -56 3 155 -16 121 85 79 156 -30 -229 -138 -85 -35
6263 -35 -32 31 -15 -105 222 178 62 118 -197 122 -112 -48 30 27 11 -127 108 -11 54 -152 36 141 -174 116 69
$$ packed form
6096a13rO04l68p4l02K69o3M07l41m4J8J78l76K47J13l34J32No3J31k0oj9j06
6120a34K20r0j16L11o5m18K08M07k28j81k20K71K12j60k6j68K37j87P8J54k16
6141a11qJ30J8mM3p2K6j15q2j63K7L94j23J88j18j9n2R0L20j42k55J42k97K43
6165F0l57L83J00k98K82q6l07K55j26L1J13r4J02m3N0p5K3q9N9m4k1q5L28j27
6189C4n8nP5j22P2J46j40J00j44l1m9N0J60k4o7J42q0j25L47l6k77J40l04J3P2
6214a11j36K37J16o1k75L20k7n3J34n1J3k59K01k9m4m6r4R8p2J7J42q5Rm8Q5j19
6240a38L99l01J19j72L06j79R6j70M5J22j83N9J52j71J37l6oP7j86j99R1N3N0
6263c5LO3m6r0L27m4j16N6l15L19k34O4P8lj6j38K35j19O5k06J88J05l15K90m7
$$ plain form
6288 69 1 -151 69 -241 35 -130 -153 2 109 -31 -21 49 22 145 207 63 -158 -95 141 236 2 91 -15
6311 -15 163 -257 -134 -30 -25 -15 58 -230 36 -61 230 -107 111 -8 -102 -25 373 72 94 93 -151 12 -89 43
6335 43 -381 46 -94 -23 -229 -258 -264 -50 -32 -18 -54 170 -272 -144 11 68 -69 -64 39 -146 -86 327 -161 -283
6359 -283 7 -33 157 -180 39 -132 57 39 20 107 140 -79 1 73 114 -69 -171 -3 -98 101 483 57 120
6382 120 -10 75 -204 -189 -13 47 117 9 -18 -180 22 -111 324 183 -143 23 22 128 87 -244 -39 23 192
6405 192 -124 145 13 -67 83 110 -6 116 7 18 -59 -73 49 -211 122 94 -226 -83 149 -8 372 -80
6427 -80 -44 46 19 -35 12 26 -37 57 -19 -43 -166 159 -40 -12 -144 -46 -104 239 282 46 152 153 39 35 -98 -63 146
6454 146 15 -229 103 9 28 120 105 -105 -203 -84 133 -81 50 146 126 35 -147 -327 17 -17 50 -110 -173 50
$$ packed form
6288F9o8j52K20l10K76j65k3J55J07j40J0P0k7J23O2j44k21O3K36R5k34Q9j06
6311a5J78m20J23J04NJ0P3k88K66r7K91l37K18j19r4P7L98l01K2jk44J63j01J32
6335D3m24M27j40P1k06k9oK14J8J4l6K24m42J28J55N7j37NJ03j85O0M13m88j22
6359b83K90m0J90l37K19j71J89j8j9Q7L3k19Q0P2M1j83j02J68r5J99L82m26O3
6382A20j30Q5k79J5J76O0P0j08k7j62K02j33M35j41l26J66jJ06m1l31K05O2J69
6405A92l16K69j32q0J50K7j16J22j09J1p7j4J22k60L33k8l20J43K32j57L80m52
6427h0L6R0k7n4M7J4o3R4p6k4j23L25j99K8j32R8n8L43M3k36J06Jj14mj33L5K09
6454A46j31k44L32r4J9R2j5k10r8J19K17k14J31R6k0r1j82j80L44l4O7j60o3K23
$$ plain form
6478 50 -103 227 20 -4 238 188 183 -304 -76 141 -24 -108 -9 271 -228 146 -432 0 -70 0 11 23 -10 -41
6502 -41 134 -72 -106 -285 12 85 70 60 113 79 117 -1 150 -2 -257 260 -82 54 164 10 193 69 -133
6525 -133 -38 -93 -120 156 -31 13 43 211 -38 -44 235 -200 45 80 375 45 75 -45 -79 -92 153 -21 -229 162
6549 162 272 -115 -122 -97 -44 46 125 6 -104 24 202 178 -114 62 116 129 -75 -41 -75 -163 -126 114 165 12 20
6574 20 64 -13 -162 63 152 -58 -134 46 -88 70 -40 57 -89 -16 -96 -311 193 -166 53 -113 71 -17 76
6597 76 44 -130 -113 -89 12 28 27 250 105 161 48 46 303 32 -71 74 31 134 49 -118 104 201 -14 -112 -132
6622 -132 55 261 -41 -136 13 99 -47 -146 0 28 -165 -146 155 -39 302 102 8 -166 97 -81 38 20
6644 20 -51 -201 174 23 -21 122 -49 -265 127 290 -271 197 -3 236 -51 14 131 -68 104 157 -70 112
$$ packed form
6478E0j53L30k07k4K42n0nm87K28K17j65q4R9K80m99L74n78M32p0P0J1J2l3l1
6502d1J75k06l4j79K97P3j5j0N3l4L8j18J51j52k55N17l42J36J10j54J83j24k02
6525a33R5n5k7K76j87M4L0J68k49oK79m35K45L5K95l30L0j20l4j3K45j74k08L91
6549A62J10l87pK5N3R0P9j19j10J28J78k4k92J76N4J3k04L4l4q8L7K40N1j53Q
6574B0M4p7j49K25Q9k10p6J80j34J58j10R7j46P3q0k15N04l59K19j66J84q8R3
6597G6l2j74J7K4J01J6jK23j45N6j13kK57k71j03J45m3J03q5j67K22R7k15r8k0
6622a32J87K06l02r5J49Q6j46r9J46K8j93J9L01j94L41k00r4j74K63j78J19j8
6644B0p1j50L75j51m4J43j71k16L92J63n61M68k00K39k87O5J17j99J72N3k27J82
$$ plain form
6666 112 -89 -51 -127 23 152 -85 -28 -80 -29 42 97 170 -2 -39 44 -168 247 20 -19 47 -37 -27 167 -53 -74
6691 -74 -51 -6 48 99 -48 28 107 135 74 -79 101 32 291 -59 143 59 -217 -14 -62 136 331 -186 60 -169
6715 -169 -56 -127 16 -128 56 -27 -86 32 92 168 -93 125 -243 105 -47 -124 -21 -211 -14 105 -4 42
6737 42 -62 32 104 186 121 -162 89 223 118 40 -32 67 -20 -270 -14 -11 -127 -16 165 -35 -85 -19 -56 152 -22
6762 -22 88 -131 -117 89 238 -114 64 -23 12 -11 -68 -101 -93 92 81 -35 129 62 -44 158 152 84 79 -97 -38 -150
6788 -150 239 68 74 9 -92 12 -165 -254 -232 -204 -84 246 128 -227 168 87 111 -160 130 -239 -198 36 -2
6811 -2 -34 70 -28 202 -11 157 -142 237 74 112 -126 -42 144 98 -15 -77 163 -60 25 5 3 6 151 -75 -203
6836 -203 -43 -85 24 -118 -52 -216 4 -157 16 -289 158 -103 -44 71 61 -182 -33 18 -7 135 7 7 -75
$$ packed form
6666A12k01L8p6J50J29k37N7n2N1P1N5P3j72l7Q3k12M15k27l9O6q4J0J94k20k1
6691g4K3M5N4N1j47P6P9K8o1j53J80o9K59l50K02q4k76K03m8J98J95n17K46k29
6715a69J13p1J43j44J84q3n9J18O0P6k61K18l68L48j52p7J03j90J97J19j09M6
6737D2j04R4P2Q2o5k83K51J34j05p8p2R9q7k50K56Lj16J11J81k00n0O6l7K08j74
6762b2J10k19J4K06J49l52J78q7L5k3n7l3QJ85j1j16J64o7j06K02oo8nj76N9j12
6788a50L89j71Oo5j01J04j77q9K2K8J20L30j18l55L95q1K4k71K90l69M1K34l8
6811bl2J04r8K30k13J68k99L79j63L8k38Q4J86m6j13o2K40k23Q5k0kLJ45k26j28
6836b03J60m2J09j42O6j64K20j61J73l05M47k61N9J15j0k43J49N1k5J42j28%q2
$$ plain form
6859 -75 -23 166 37 91 125 98 159 0 177 112 -123 -185 -94 -81 18 -9 93 -89 -86 251 250 30 -49 -113 -82 347
6885 347 -180 12 28 78 39 1 194 106 111 84 62 105 -175 -2 -126 -89 -90 71 169 -130 146 -66 217 382 -48
6910 -48 97 104 205 -33 172 -100 29 163 83 -37 -47 -2 17 -88 87 5 11 -67 51 -97 30 169 4 107
6934 107 -323 247 157 107 108 -264 -39 128 145 -202 -26 -174 120 104 -145 320 -26 145 115 67 11 -120 228
6957 228 -66 -135 35 -90 -1 -41 -71 228 -117 -170 -46 24 62 -37 126 110 295 -31 -75 -10 198 49 106 105 -33
6982 -33 127 61 180 -45 -83 359 179 1 -351 112 -70 76 12 125 -33 66 154 101 -57 -105 -305 -86 -44
7005 -44 25 -157 139 -268 38 -36 -92 226 -118 11 174 -106 15 -122 -96 51 -1 177 -95 73 -2 124
7027 124 14 178 33 3 23 -20 -30 -36 163 44 -128 261 -191 96 -107 83 180 -256 116 -13 25 61 -68
$$ packed form
6859g5N2J89j29N4L4k7O1j59J77o5k35o2R1J3R9k7J02j82LL37jk20p9o4L1M29
6885C47n27J92J6N0l9l8J93q8Nk7k2M3k80J73j24L7jJ61R8k99K76k12K83J65m30
6910d8J45PJ01k38K05k72J29J34q0j20j0M5J9j05J75q2Op8J18j48J27J39j65J03
6934A07m30N70r0n0Jl72K25J67J7l47J76j48K94j6k49M65l46J71l0m8n6j31L48
6957B28k94o9J70j25Q9m0l0K99l45n3J24P0L8r9J63j6J85l26m4O5K08j49N7jj38
6982c3J60o6J19k25l8M42j80j78l52M63j82J46o4J13j58R9Q8n3j58m8k00K19M2
7005d4O9j82K96m07L06p4n6L18l44J29J63k80J21j37K6J47n2J78k72J68p5J26
7027A24j10J64j45l0K0m3j0oJ99j19j72L89m52K87k03J90R7m36L72j29L8L6j29
$$ plain form
7050 -68 28 -230 53 142 -117 -22 -9 5 67 198 35 118 41 75 -102 41 13 81 74 5 51 290 -271 -2 282
7075 282 133 -77 -158 215 112 -238 -117 6 222 99 104 65 -42 158 -96 127 -98 -71 159 -51 249 79
7097 79 67 7 -46 -55 -165 46 -42 29 -275 108 75 -100 -118 53 19 84 -125 15 -66 -47 -64 -143 61 76 8 32
7123 32 232 -2 370 127 25 203 84 -134 -118 138 224 -17 126 -67 -8 3 -83 -99 -91 -77 294 353 -374 -89
7147 -89 213 14 229 60 -108 139 -334 100 169 104 46 -63 168 -132 -150 110 -63 114 -88 36 164 117
7169 117 -95 -57 173 61 72 173 -73 329 -125 -91 -81 -134 110 38 9 -51 99 48 81 -118 -68 12 14 5 95 197
7195 197 231 -24 -133 -46 165 86 235 -51 254 -117 -144 200 134 26 323 22 -17 -42 -21 67 36 93 -13 7
7219 7 56 -31 192 69 135 113 166 382 -165 333 -58 -46 26 -255 -38 -199 133 97 7 182 26 104 325 -19
$$ packed form
7050f8R6k58K83Q9k59R5J3J4O2J31j63Q3p7L4j77J43k8O8po9M6K39n61K69K84
7075B82j49k10q1L73j03l50J21J23K16j23Nl9j07K00k54K23k25K7K30k10L00j70
7097G9j2o0n3rj10K11q8P1l04L83l3j75j8J71l4O5k09J40q1J9j7p9K04J5o8K4
7123C2K00k34L72k43j02J78j19k18J6K56Q6k41J43j93N9J1q6j6QJ4L71N9p27K85
7147h9L02j99K15j69j68K47m73M34O9o5n8j09K31l00j8K60j73J77k02J24J28m7
7169A17k12L8K30j12J1J01k46M02m54L4J0n3K44p2k9o0J50n1L3j99N0Q0KrR0J02
7195A97L4k55j09Q7K11p9J49k86L05l71k7L44o6j08K97l01l9k5K1Q8l1N7j06K0
7219GM9q7K23j23O6k2N3K16n47M98l91J2P2k81K17j61L32l6r0J75j56P8K21l44
$$ plain form
7243 -19 -128 62 -150 -273 -171 -19 -33 209 -160 -58 248 -56 148 274 -6 -11 15 85 -193 -144 -256 -71
7265 -71 96 265 -143 5 102 -293 62 157 -145 -99 24 267 -95 -113 -95 -95 -77 -88 -57 -278 -143 -2 -31 -91
7289 -91 82 249 -150 -249 99 148 126 56 -264 -9 -35 -203 62 -51 -26 -87 -111 -138 251 -134 110 -12 81 49
7313 49 -127 78 67 50 133 -14 -34 -121 -127 123 145 -84 -115 82 35 301 -5 -116 96 129 161 -35 -49 -89 -19
7338 -19 -10 -225 295 259 -254 42 -251 164 -190 154 47 66 60 54 62 -109 -60 87 15 101 -366 -21 1 -102 -96 216
7364 216 -271 13 56 -66 223 127 -187 59 127 -144 95 -40 196 80 20 187 -170 -132 125 -306 102 -61
7386 -61 61 -145 7 159 -26 175 63 -112 59 159 62 115 -152 21 6 -95 18 118 340 -26 -308
7407 -308 118 146 56 19 -44 73 -60 -168 -81 130 -222 -101 -11 -257 32 53 -84 -105 205 184 -135 223 86
$$ packed form
7243a9j09J90k12j23J02J52j4K42l69J02L06l04K04J26k80nK6P0k78M9j12J85
7265g1J67J69m08J48R7l95L55R5l02M6J23K43l62j8J8%J8j1L1k21J35J41k9o0
7289i1J73J67l99r9L48M9k2p0l20K55k6j68K65j13K5o1k4k7L89l85K44j22R3l2
7313D9j76K05j1j7Q3j47k0q7oK50K2k29l1J97m7K66l06j11K12L3L2j96j4m0P0
7338a9Rk15N20l6n13K96k93M15l54L44j07J9ooQj71M9J47p2Q6m67L45K2j03OL12
7364B16m87K84M3j22K89r6l14K46O8k71K39j35K36j16o0J67l57L8K57m31M08j63
7386f1J22k06J52J52j85K01j12j75J71J00r7N3k67J73j5j01J13J00K22l66k82
7407c08M26K8r0l7o3J17j33j08Q7K11l52J21R0k46K89K1j37k1L10k1l19L58j37
$$ plain form
7430 86 -50 -146 -349 -99 184 70 136 -161 -163 -143 -65 81 -130 -132 -121 112 -103 270 137 140 241 56 161 23
7454 23 134 83 -133 19 -24 81 138 -83 -36 130 -87 73 216 58 -99 99 -54 158 65 101 -12 119
7476 119 107 205 303 154 -178 3 22 171 73 -118 201 -67 91 -151 193 -42 153 -88 90 225 -19 -151
7498 -151 108 142 -180 -37 -10 2 189 -22 -41 -101 -125 -92 -12 66 -248 46 -148 118 4 203 37 -115 308
7521 308 -88 7 68 -22 -108 -20 165 -151 42 133 -127 118 301 -60 207 165 -159 -25 49 -47 -35 247 -39
7544 -39 144 146 55 -141 -190 -31 -37 -71 -53 -138 191 -9 86 -241 -24 9 -135 159 34 -119 -85 198 150 121 122 -28
7570 -28 -122 224 8 -52 -106 -100 -42 -55 134 73 17 16 -12 -157 -24 95 22 134 -217 -180 103 39 -80 -177 85 -67
7596 -67 -134 -75 -1 -109 45 8 -137 201 114 -95 -135 50 -123 85 -74 112 4 56 164 -14 -73 -37 72
$$ packed form
7430H6j36r6k03K50K83j14O6k97kK0P8J46k11kJ1K33k15L73j33LJ01j85J05j38
7454B3J11n1k16J52m3J05N7k21M7J66k17J60J43j58j57J98j53K12r3L6j13J31
7476A19j2R8R8j49l32J81J9J49r8j91L19k68J58k42L44k35J95k41J78J35k44j32
7498a51K59L4l22J43K7J2J87k11j9o0k4L3Q0P8l14K94j94K66j14J99j66j52M23
7521C08l96R5O1r0q6Q8J85l16J93R1k60K45J83l61K67m2l24J34P4r6J2K82k86
7544c9J83Kr1j96m9J59ol4J8q5L29k00R5l27K17L3j44K94j25j53L4K83m8k9Jj50
7570b8r4L46k16o0n4ON8j3J89o1n6jk8j45J33J19p3J12l51L7K83o4j19r7K62j52
7596f7o7N9P4j08J54l7j45L38q7k09m0J85j73K08j59J86j08N2J08j78n9L6J09
$$ plain form
7619 72 -31 -38 -19 -125 -11 167 89 -298 134 -60 -219 86 88 81 -191 206 -149 152 251 -123 54 81 -18 165
7643 165 69 41 174 0 14 194 186 174 42 -165 -70 -67 10 214 -57 -146 15 -65 309 223 -13 -43 69 304 -67
7668 -67 -155 -101 241 2 -31 -88 -186 -66 -205 219 289 -279 102 100 5 186 45 113 -133 -99 24 -57 156 -165
7692 -165 -109 -115 9 -68 46 210 -42 -88 68 288 -29 -70 -33 -12 -13 83 273 -156 -21 -174 119 180 -162 119
7716 119 53 -267 -196 28 -347 94 132 -21 25 -72 -149 174 -79 -30 80 39 150 -49 -5 80 -29 161 -71
7739 -71 26 39 -65 -178 141 -90 -73 8 107 61 28 -82 -129 69 -218 -7 131 26 200 76 53 -68 96
7762 96 -34 -9 -111 -110 11 39 30 -81 275 74 -52 -63 151 25 -48 -70 -59 230 237 114 220 -138 -134 -20 124
7787 124 37 86 -201 -57 -110 104 86 126 83 -80 82 -364 -34 -113 -73 -302 -12 0 21 250 -237 373 -16
$$ packed form
7619G2j03pJ9j06J14J78p8l87M32j94j59L05Kpk72L97l55L01R9l74J77K7r9J83
7643A65r6k8J33j74J4J80qj2j32k07R5LP7K04k71q9J61q0L74q6k36l0J12K35l71
7668f7q8N4L42k39l3n7r8J20j39M24P0n68L81kr5J81j41O8k46L4J23q1K13l21
7692a65N6oJ24p7J14J64k52m6J56K20l17m1L7K1jR6J90m29J35j53K93O1l42K81
7716A19o6l20P1K24l75M41L8j53M6r7p7L23k53M9J10m1J11j99M4Q5j09J90k32
7739g1R7J3j04j13L19k31J7Q1R9m6l3j10m7J98k87K11J38j05J74j24k3j21J64
7762I6j30K5j02JJ21K8rj11L56k01j26j1K14j26p3k2J1K89Pj23J06l58MJ14J44
7787A24q7M9k87J44n3K14j8M0m3j63J62m46L30p9M0k29K90J2K1K29m87O10l89
$$ plain form
7810 -16 215 -85 14 164 22 1 -69 103 -14 -37 -31 76 167 -29 -64 -75 -44 103 -103 -152 -86 -122 -67 77 235
7835 235 83 176 -20 -220 334 107 11 -163 -84 180 76 163 -119 93 76 15 -133 253 -50 -142 -37 -146
7857 -146 82 -235 108 76 105 -154 43 111 -51 116 -201 17 39 14 -9 -17 71 121 -29 -58 -32 -62 -27 8 50
7882 50 24 207 -44 -29 109 73 130 -92 142 167 289 83 -190 231 -82 96 41 -95 -65 45 227 198 -81
7905 -81 -159 -52 -125 -125 5 -142 41 106 -255 42 272 52 167 -162 -98 169 -263 35 -72 -25 186 -150 116
7928 116 52 103 129 -22 71 84 -167 27 -16 -94 -95 -188 -27 -186 -141 -68 -18 12 -251 -156 -58 130 -27 36 14 82
7954 82 0 190 9 124 -25 -17 -71 -12 -67 198 -34 -4 -132 84 19 -72 -100 138 -60 -181 272 -7 -43 -211
7978 -211 63 79 -129 25 237 47 -176 153 -173 -264 -158 14 147 -16 -2 -90 177 69 -30 14 34 137
$$ packed form
7810a6K31l00R9J50j42k1p0J72j17k3OJ07R1j96l5j1L1J47k06m9O6l6N5J44J58
7835B35j52R3j96k00N54k27r6j74P9K64j04Q7k82K12j7o1j48L86l03r2J05j09
7857a46K28l17L43l2K9k59J97O8j62J67l17K18K2k5k3qQ8N0j50k9K6l0L5L5M2
7882E0k6J83k51J5J38l6N7k22K34K5J22k06k73M21l13J78n5j36L0J10J82k9k79
7905h1p8J07p3%J30j47J83O5l61K97K30k20J15l29O4K67m32K98j07M7K11l36K66
7928A16o4N1K6j51R3J3k51J94m3p8jr3J61j59M5P3N0L0k63R5R8J88j57O3k2O8
7954H2q2J90j81J15j49Qn4N9n5K65k32L0j28K16o5r1k8K38j98j21M53k79l6j68
7978b11K74J6k08J54K12j90k23L29l26r1J06J72J33j63J4q8K67j08r9M4K0J03
$$ plain form
8000 137 213 158 193 56 -167 64 10 -67 155 -137 77 224 196 17 -263 1 -110 -209 -83 -17 35 90 -37
8023 -37 132 183 204 16 27 69 51 117 122 99 -21 -157 -82 139 182 114 -215 17 -216 46 110 -7 123 -83 -76
8048 -76 -53 38 168 -42 133 66 -44 -45 29 53 -192 52 66 199 18 146 -40 52 284 -73 26 -31 -136 -152
8072 -152 -135 -97 124 -47 -88 -18 60 -72 28 21 -11 -297 48 -74 9 60 150 -43 121 -20 -36 6 31 -19 20
8097 20 58 43 138 -114 80 308 98 -129 -148 103 -57 200 221 -120 -129 149 242 105 35 -57 225 164 -174 31
8121 31 -66 -225 -144 11 20 -59 -204 85 211 -431 -245 -138 41 -129 157 -124 13 -75 290 -135 77 69 -33
8144 -33 -159 82 -21 -260 71 -15 62 -11 170 201 174 -1 -146 76 -155 77 -9 -192 -98 239 -12 57 103
8167 103 -51 34 -135 -3 -119 179 335 85 271 192 -34 276 -129 14 50 257 -59 -107 -137 207 -118 -149
$$ packed form
8000A37P6n5L5j37k23K31n4p7K22k92K14J47k8j79k80K64j11r9J26O6N2N5j27
8023c7J69N1K1j88J1M2j8O6Nk3j20j36P5K21M3o8l29K32k33K62O4j17J30k06P
8048g6K3R1J30k10J75o7j10jP4K4k45K44J4J33j81J28j86R2K32l57R9n7j05j6
8072a52J7L8K21j71m1P0P8j32J00pl2k86L45j22Q3N1R0j93J64j41j6M2K5n0L9
8097B0L8j5R5k52J94K28k10k27j9K51j60K57K1l41rK78R3j37p0r2K82o1l38K05
8121C1r7j59Q1J55Rp9j45K89J26o42J86J07J79j70K86k81J37q8L65m25K12qj02
8144c3j26K41j03k39L31q6P7p3J81L1k7j75j45K22k31K32q6j83R4L37k51O9M6
8167A03j54Q5j69J32j16K98J56k50J86p9k26L10m05J43L6K07l16m8l0L44l25l1
$$ plain form
8189 -149 -234 -51
$$ packed form
8189a49q5J83
8191e1
$$ Imaginary data points
##PAGE= N=2
##DATA TABLE= (X++(I..I)), XYDATA
$$ plain form
0 0 0 0 0 0 0 0 0 0 0 0 0 0 0 0 8 -8 8 -8 8 -16 16 -16 24 -24 32 -32 40 -48 56 -64 72 -80 90 -104 115 -130
36 -130 147 -164 184 -205 227 -253 282 -312 344 -381 420 -463 510 -562 619 -683 754 -831 919
55 919 -1015 1128 -1258 1407 -1584 1795 -2056 2387 -2816 3406 -4265 5652 -8252 14879 -73896
70 -73896 -103322 -8921 -24809 -33511 -47480 -56394 -58063 -15507 -1164 -4573 10670 43731 34745
83 34745 15653 21913 42139 36461 19667 12785 26537 40926 36914 5721 -28274 -34246 -4512
96 -4512 15543 -1437 -24061 -18692 -9276 -14221 -20246 -12108 4965 19816 17290 3457 6761 30546
110 30546 37981 21920 13208 23165 37917 47357 35217 7169 -62 16271 18086 -491 -9777
123 -9777 -4719 -4170 -15624 -32459 -41503 -31260 -17839 -24712 -40913 -39636 -22629 -13017 -18816 -27658
$$ packed form
0@%%%%%%%%%%%%%%Qj6J6j6J6k4L2l2M0m8N6o4P2q8J04j20J36j52J70j94K19k45
36a30K77l11L48l89M32m80N35n94O56p25Q01q83R73j072J181j302J437j585J750
55I19j934K143k386K665k991L379l851M443n203O222p671R917j3904K3131q8775
70g3896k9426R4401j5888q702j3969q914j669M2556J4343l409J5243L3061q986
83C4745j9092O260K0226n678j6794o882J3752J4389m012l1193l3995n972K9734
96d512K0055j6980k2624N369R416m945o025Q138J7073J4851k526j3833L304K3785
110C0546P435j6061q712R957J4752R440j2140k8048p231J6333J815j8577r286
123i777N058N49j1454j6835r044J0243J3421o873j6201J277J7007R612n799q842
$$ plain form
137 -27658 -20899 1598 13822 6211 -239 8998 20963 24011 16685 9522 15293 26862 20763 -973
151 -973 -8951 2297 8001 -2861 -16482 -21610 -14727 -6240 -12167 -23742 -19006 -2533 4811 -1891
165 -1891 -6175 3989 19816 23361 14734 11099 21221 31185 28936 17222 9918 14472 21272 13451
179 13451 -4106 -9035 565 2381 -9888 -20671 -19722 -11992 -9207 -17274 -25953 -19462 -5728 -3680
193 -3680 -12156 -15522 -6827 4638 6183 -1702 -4999 4953 14608 10014 500 1814 10481 14050 7399
208 7399 -2571 -2846 6188 9352 64 -9908 -6871 2250 1267 -9242 -15107 -8302 609 -1315 -9443
223 -9443 -10803 -2740 5247 4054 -3087 -2895 8146 15543 9417 1961 5495 14902 16462 8559 1212
238 1212 1959 8746 8876 -1571 -9397 -5168 1341 -2258 -12213 -15890 -9386 -2947 -5222 -11857 -11176 -2223
$$ packed form
137b7658O759K2497J2224p611o450R237J1965L048p326p163N771J1569o099k1736
151i73p978J1248N704j0862j3621n128O883Q487n927j1575M736J6473P344o702
165a891m284J0164J5827L545q627l635J0122R964k249j1714p304M554O800p821
179A3451j7557m929R600J816j2269j0783R49P730K785q067q679O491J3734K048
193c680q476l366Q695J1465J545p885l297R952R655m594r514J314Q667L569o651
208G399r970k75R034L164r288r972L037R121r83j0509n865O805Q911j924q128
223i443j360Q063P987j193p141J92J1041P397o126p456L534R407J560p903p347
238A212P47O787J30j0447p826M229O509l599r955l677O504O439k275o635O81Q953
$$ plain form
254 -2223 3696 232 -5357 -1964 7143 10872 4677 -1121 2884 10855 10209 993 -4460 -65 6506
269 6506 4422 -4358 -7971 -1978 3338 72 -6916 -7577 -597 4205 245 -5596 -3937 4249 6235
284 6235 -674 -5658 -1976 5100 5290 -1913 -6172 -1668 5489 4384 -3126 -5649 470 6439 3592
299 3592 -2386 -2656 3905 7071 2920 -3399 -1997 4283 5684 -861 -6629 -3860 2878 2783 -5250 -8980
315 -8980 -4144 1835 902 -5514 -7457 -1617 4918 3373 -2584 -2472 3863 7397 3046 -1610 -181 5742
331 5742 7337 1829 -3366 -1082 4372 3952 -2886 -6078 -1692 3532 2154 -3944 -6550 -2015 2654
346 2654 557 -5413 -5710 792 3799 -478 -5846 -4533 1306 3527 -664 -4689 -1703 5224 6139 678
362 678 -2040 2765 8443 7364 1706 331 4504 7914 4967 -1512 -3128 1457 3305 -1918 -7843
$$ packed form
254b223N919l464n589L393R107L729o195n798M005P971o46r216n453M395O571
269F506k084q780l613N993N316l266o988o61O980M802l960n841J659Q186J986
284F235o909m984L682P076J90p203m259M504P157j105p510k523O119N969k847
299C592n978k70O561L166m151o319J402O280J401o545n768K769O738r5q033l730
315h980M836N979r33o416j943N840O535j545n957J12O335L534m351m656J429N923
331E742J595n508n195K284N454m20o838l192M386N224j378o098k606M535M669
346B654k097n970k97O502L007m277n368J313N839K221m191m025K986O927R15n461
362F78k718M805N678j079n658j375M173L410k947o479j616M585J848n223n925
$$ plain form
377 -7843 -7568 -2943 -2173 -6633 -10249 -7469 -1575 -181 -4153 -6558 -1424 4775 5102 1325 758 5912
393 5912 9729 7002 1233 778 4668 6876 2024 -3969 -4439 -561 -187 -5977 -10425 -8583 -3178 -2881
409 -2881 -6625 -8084 -4321 1277 1402 -1911 -1358 4469 9007 7440 3742 4377 9440 11827 8212 3451
425 3451 3942 8496 8846 3429 -1857 -536 2714 2025 -2978 -6601 -4650 -1889 -3617 -8339 -9816 -5426
441 -5426 -1934 -3703 -7504 -7093 -1870 1150 -589 -3462 -1154 4426 6940 3383 -131 2225 6235
456 6235 6150 1561 -1204 743 2584 123 -5458 -8052 -5430 -3448 -6857 -10943 -10934 -6385 -3487 -5293
472 -5293 -7561 -5202 1410 5106 3334 2551 6750 12718 13659 10949 9082 11700 14666 13048 7245 4713
488 4713 6141 7162 2950 -3220 -4933 -2636 -2535 -6710 -10520 -9871 -5648 -4430 -6393 -8945 -5666 -676
$$ packed form
377g843K75M625P70m460l616K780N894J394l972k405N134O199L27l777n67N154
393E912L817k727n769m55L890K208m852n993m70L878L74n790m448J842N405K97
409b881l744j459L763N598J25l313N53N827M538j567l698O35N063K387l615m761
425C451M91M554L50n417n286J321L250o89n003l623J951K761j728m722j477M390
441e426L492j769l801M11N223L020j739k873K308N580K514l557l514K356M010
456F235q5m589k765J947J841k461n581k594K622J982l409m086RM549K898j806
472e293k268K359O612L696j772p83M199N968R41k710j867K618K966j618n803k532
488D713J428J021m212o170j713K297J01m175l810O49M223J218j963k552L279M990
$$ plain form
504 -676 480 -2097 -2251 1690 5823 5282 1865 402 4081 6113 3509 -1117 -1844 695 849 -2798
520 -2798 -6465 -6723 -4323 -3579 -7197 -10408 -8615 -4762 -4538 -7175 -7285 -3855 -45 490 -1431 -790 4044
537 4044 8212 7646 5364 6375 10796 12851 9793 6725 7423 9945 9317 5185 1700 1556 3027 1275
553 1275 -3634 -6719 -5405 -3354 -4939 -7776 -8361 -5342 -2222 -2769 -5144 -3804 1687 4777 2996 1644
569 1644 3272 6427 7383 4277 1684 2517 4578 2890 -2152 -5401 -4039 -3251 -5633 -9349 -10520 -8594
585 -8594 -6582 -7941 -10202 -8604 -3817 -1039 -1690 -2667 -618 3926 6314 5067 4078 6319 9919 9904
601 9904 6775 5026 6591 8124 6152 2667 1373 2579 3083 939 -2896 -3755 -1521 -660 -3528 -5839
617 -5839 -4406 -1465 -819 -2936 -4300 -2769 1090 2299 119 -973 1959 4586 3650 1547 1403 3482
$$ packed form
504f76J156k577j54L941M133n41l417j463L679K032k604m626p27K539J54l647
520b798l667k58K400P44l618l211J793L853K24k637j10L430L810N35j921O41M834
537D044M168n66k282J011M421K055l058l068O98K522o28m132l485j44J471j752
553A275m909l085J314K051j585k837n85L019L120n47k375J340N491L090j781j352
569A644J628L155R56l106k593Q33K061j688n042l249J362P88k382l716j171J926
585h594K012j359k261J598M787K778o51r77K049M544K388j247r89K241L600j5
601I904l129j749J565J533j972l485j294J206N04k144l835q59K234Q61k868k311
617e839J433K941O46k117j364J531L859J209k180j092K932K627r36k103j44K079
$$ plain form
633 3482 4877 3076 -576 -939 780 1265 -2487 -5251 -5004 -3058 -3856 -6868 -8582 -6974 -4175 -3512
649 -3512 -5378 -5933 -2820 736 758 -160 1112 4318 6682 5868 4087 4407 6696 7686 5237 2225 2516
666 2516 3987 2999 -153 -2725 -2228 -715 -1173 -4161 -5483 -3325 -781 -1470 -3248 -2767 27 1655
682 1655 1267 154 859 3648 4919 2774 639 1746 3694 3358 865 -1042 -245 1334 349 -2424
698 -2424 -3685 -2253 -304 -1584 -3840 -4093 -2143 -750 -1767 -3165 -2599 -279 879 -623 -1985 -1126
714 -1126 1818 2396 881 -259 1122 3490 3650 1302 518 1831 3725 2582 446 -339 979 1689
730 1689 160 -2154 -2508 -1203 -274 -1879 -3730 -2791 -754 -399 -2060 -2653 -917 1373 1711 243 -414
747 -414 1538 3408 2762 882 495 2252 2705 1391 -846 -1130 506 1086 -802 -2854 -1976 -563 -284
$$ packed form
633C482J395j801l652l63J719M85l752k764K47J946p98l012j714J608K799O63
649c512j866n55L113L556K2r18J272L206K364q14j781L20K289R90k449l012K91
666B516J471r88l152k572M97J513m58k988j322K158K544o89j778M81K794J628
682A655l88j113P05K789J271k145k135J107J948l36k493j907P97J579r85k773
698b424j261J432J949j280k256k53J950J393j017j398N66K320J158j502j362Q59
714a126K944N78j515j140J381K368J60k348p84J313J894j143k136p85J318P10
730A689j529k314l54J305R29j605j851R39K037L55j661n93J736K290L38j468o57
747d14J952J870o46j880l87J757M53j314k237k84J636N80j888k052Q78J413K79
$$ plain form
764 -284 -1529 -2266 -1071 1003 777 -668 -1321 426 1851 1518 -475 -336 1096 2071 683 -1180 -875
781 -875 685 1237 -197 -1705 -771 878 1519 -337 -1160 202 1804 1323 -86 -814 228 1947 768
798 768 -1286 -1435 -367 433 -843 -2579 -2418 -692 -2 -960 -2246 -1237 459 1307 -41 -1001 707
815 707 2234 2441 1049 235 1328 2513 1775 -230 -481 697 1148 -73 -1795 -1904 -392 21 -1465
832 -1465 -2588 -1734 -65 371 -849 -1867 -589 954 896 -633 -788 329 2095 1435 -119 -362 1063
849 1063 1831 966 -375 40 1326 1828 336 -662 -91 876 1153 -733 -1322 -903 275 -374 -1679 -2364
867 -2364 -1221 238 -411 -1699 -1859 -120 1069 542 -229 525 2039 3180 2090 1058 1504 2746 2592
884 2592 1128 262 567 1127 470 -1689 -2883 -2240 -1796 -2264 -4007 -3911 -2614 -1793 -2318 -2923 -2313 -152
$$ packed form
764b84j245p37J195K074k26j445o53J747J425l33j993J39J432R75j388j863L05
781h75J560N52j434j508R34J649O41j856q23J362J602m81j409p28J042J719j179
798G68k054j49J068Q00j276j736J61J726O90r58j286J009J696Q48j348r60J708
815G07J527K07j392q14J093J185p38k005k51J178M51j221j722j09J512M13j486
832a465j123Q54J669M36j220j018J278J543n8j529j55J117J766o60j554k43J425
849A063P68q65j341M15J286N02j492r98N71R67K77j886n89M19J178o49j305o85
867b364J143J459o49j288j60J739J189n27p71P54J514J141j090j032M46J242j54
884B592j464q66L05N60o57k159j194O43M44m68j743R6J297Q21n25o05O10K161
$$ plain form
902 -152 486 381 -34 930 2328 3123 1790 1340 2384 3164 2328 932 289 660 1079 374 -1285 -1659 -669
921 -669 -256 -1254 -2217 -1795 -602 70 -611 -988 -146 1085 1695 1024 359 1499 2957 2517 1786 1473 1893
940 1893 2835 1992 755 620 1129 1375 401 -1299 -1529 -936 -952 -2285 -3275 -3399 -2317 -2220 -3141 -3774 -2931
959 -2931 -1710 -1474 -2214 -2044 -300 938 1367 693 1021 1964 3202 2549 1501 1643 2417 2494 1248 -7
977 -7 -444 292 -424 -1527 -2555 -1868 -1152 -1529 -2240 -1958 -901 588 575 -143 686 2378 3149 3026 2310 2649
997 2649 3549 3988 3047 1959 1881 2156 1769 459 -942 -1073 -1059 -1593 -2496 -3520 -2922 -2495 -2434 -3600 -3144
1016 -3144 -2199 -1283 -1603 -2126 -1603 -427 558 3 -119 513 1245 1432 653 385 1148 1925 1617 432 -249
1035 -249 147 691 22 -1037 -1127 -878 -359 -908 -1700 -1306 -596 -300 -650 -939 -182 1207 1308 1386 1412 2323
$$ packed form
902a52O38j05m15R64J398P95j333m50J044P80q36j396o43L71M19p05j659l74R90
921f69M13r98r63M22J193O72o81l77Q42J231O10o71o65J140J458m40p31l13M20
940A893R42q43j237j35N09K46r74j700k30N93j6j333r90j24J082R7r21o33Q43
959b931J221K36p40J70J744J238M29o74L28R43J238o53j048J42P74P7j246j255
977gm37P36p16j103j028O87P16l77p11K82J057J489j3p18Q29J692P71j23p16L39
997B649R00M39r41j088p8K75l87j310j401j31J4n34r03j024N98M27O1j166M56
1016c144R45R16l20n23N23J176R85n55j22O32P32J87p79k68P63P77l08j185o81
1035b49L96N44o69j059r0K49N19n49p92L94P10K96l50k89P57J389J01P8K6R11
$$ plain form
1055 2323 3220 2969 2548 2183 2903 3434 2663 1186 980 901 695 -258 -1491 -2016 -1573 -1565 -2712 -3324 -3042 -2034
1075 -2034 -2114 -2374 -2478 -1493 -351 -385 -410 -201 771 1969 1432 1024 948 1050 1353 934 223 -75 286 -46
1095 -46 -909 -1744 -1731 -954 -1023 -1536 -2089 -1134 -523 -517 -586 -454 333 1095 1055 817 729 1641 2389 1585 946 1223 2073
1118 2073 1922 1503 594 836 1283 1023 97 -479 -115 150 -402 -1272 -1426 -1159 -977 -905 -1920 -1899 -1033 -633
1138 -633 -1048 -1288 -648 126 769 344 201 550 1348 1296 850 484 1050 1443 821 35 -299 -589 -152 -631
1158 -631 -1453 -1705 -1049 -613 -1328 -1663 -1267 -555 -129 -399 -286 50 1054 1372 1082 943 1328 1835 1558 753
1178 753 724 782 1154 621 -322 -664 -272 161 -682 -1049 -1081 -430 -282 -675 -1208 -1062 -62 361 -345 -486 78
1199 78 573 428 -57 -71 143 833 597 -163 -218 504 868 461 -263 97 768 988 507 -247 -268 546 453 -181
$$ packed form
1055B323Q97k51m21l65P20N31p71j477k06p9k06r53j233n25M43Qj147o12K82J008
1075b034q0k60j04R85J142l4k5K09R72J198n37m08p6J02L03m19p11k98L61l32
1095d6q63q35J3P77o9n13n53R55O11Oo9J32P87P62m0k38q8R12P48q04o39K77Q50
1118B073j51m19r09K42M47k60r26n76L64K65n52q70j54K67J82P2j015K1Q66M00
1138f33m15k40O40P74O43m25j43L49P98n2m46l66N66L93o22p86l34k90M37m79
1158f31q22k52O56M36p15l35L96P12M26k70J13L36J004L18k90j39L85N07k77q05
1178G53k9N8L72n33r43l42L92M33q43l67l2O51J48l93n33J46J000M23p06j41N64
1199G8M95j45m85j4K14O90k36p60n5P22L64m07p24L60O71K20m81p54k1Q14r3o34
$$ plain form
1221 -181 -624 24 2 166 -636 -796 -264 165 -31 -385 -463 20 282 373 71 101 657 702 329 200 16 512
1243 512 600 -68 -541 -485 123 -279 -946 -696 -618 -217 -454 -518 -765 -181 93 -8 -6 49 478 649 580 -17 105
1266 105 694 734 16 -263 -156 788 458 -40 -333 192 325 326 22 -297 270 487 329 -120 -181 443 216
1287 216 -69 -476 -91 91 78 -397 -607 -496 11 -53 -822 -293 -177 302 355 -49 90 362 763 431 79
1308 79 108 796 605 27 -144 -445 6 -114 -483 -982 -507 -314 -417 -924 -1041 -198 87 81 -280 -127 344
1329 344 661 574 139 614 702 986 217 177 268 203 257 -213 -247 88 96 -203 -532 -583 -260 -105 -392 -683 -832
1352 -832 -131 16 -186 -659 -556 -105 210 -182 -411 -46 224 500 156 160 459 900 593 531 224 707 398
1373 398 540 -84 -190 171 187 -460 -450 -796 -479 -329 -854 -972 -535 -377 -73 -400 -98 -7 732 545 421
$$ packed form
1221a81m43O48k2J64q02j60N32M29j96l54p8M83K62R1l02L0N56M5l73j29j84M96
1243E12Q8o68m73N6O08m02o67K50P8M01k37o4k47N84K74j01KN5M29J71o9n97J22
1266A05N89M0p18k79J07R44l30m98k93N25J33Jl04l19N67K17j58m49o1O24k27
1287B16k85m07L85J82j3m75k10J11N07o4p69N29J16M79N3m04J39K72M01l32l52
1308G9K9O88j91n78j71l01M51j20l69m99M75J93j03n07j17Q43K85ol61J53M71
1329C44L17q7m35M75Q8K84p69m0R1o5N4m70l4L35Qk99l29n1L23J55k87k91j49
1352h32P01J47k02m73J03M51L15l92k29L65K70K76l44MK99M41l07o2l07M83l09
1373C98J42o24j06L61J6o47J0l46L17J50n25j18M37J58L04l27L02R1P39j87j24
$$ plain form
1394 421 235 595 953 789 347 161 366 462 111 -594 -685 -470 -494 -959 -1191 -1064 -831 -878 -689 -833 -490
1415 -490 -30 -9 -186 182 362 678 693 432 633 909 1109 824 505 551 688 722 290 -124 69 57 37 -326
1437 -326 -351 -172 -318 -187 -429 -489 -218 -14 -40 -258 -427 316 140 -35 -64 -46 422 620 322 163 256 546
1459 546 417 291 -315 -98 -248 -105 -529 -784 -694 -509 -878 -1274 -1258 -673 -782 -911 -925 -339 -118 282 182
1480 182 144 636 1119 1299 1002 1050 986 1127 967 567 433 498 702 160 -355 -328 -183 -318 -836 -814 -557 -486
1502 -486 -212 -204 -338 176 182 395 339 -26 375 497 656 566 327 664 482 290 109 -269 -178 -335 -430 -811 -928
1525 -928 -689 -569 -676 -635 -641 -562 -595 -673 -749 -427 -53 -303 -209 -174 271 605 378 284 362 615 771 675 540 426
1549 426 661 721 630 315 -116 161 25 -423 -461 -348 -19 -207 -519 -545 -137 -111 -212 -232 -170 -41 276 361 47
$$ packed form
1394D21j86L60L58j64m42j86K05R6l51p05r1K15k4m65k32J27K33m7J89j44L43
1415d90M60K1j77L68J80L16J5k61K01K76K00k85l19M6J37L4m32m14J93j2k0l63
1437c26k5J79j46J31k42o0K71K04k6k18j69P43j76j75k9J8M68J98k98j59R3K90
1459E46j29j26o06K17j50J43m24k55R0J85l69l96J6N85j09j29j4N86K21M00j00
1480A82l8M92M83J80k97M8o4J41j60m00j34O5K04n42n15K7J45j35n18K2K57P1
1502d86K74Qj34N14OK13n6l65M01J22J59r0k39L37j82j92j81l78R1j57r5l81j17
1525i28K39J20j07M1oP9l3p8p6L22L74k50R4L5M45L34k27r4P8K53J56r6j35j14
1549D26K35O0r1l15m31K77j36m48l8J13L29j88l12k6M08K6j01k0O2J29L17Q5l14
$$ plain form
1572 47 357 619 801 616 446 351 221 62 -50 -230 -348 -374 -684 -774 -621 -644 -484 -654 -1129 -880 -588 -396
1594 -396 147 -245 102 320 486 194 267 161 410 430 407 299 274 261 236 100 -204 -93 -25 59 -251 -302 -158
1617 -158 -39 -243 -348 46 -196 66 -134 -291 -90 44 68 -33 -196 121 342 288 280 286 301 297 322 136 -5
1640 -5 200 163 -61 -131 -120 15 -290 -296 -567 -217 -355 -260 -429 -424 -213 47 4 87 -130 213 509 536 12 242
1664 242 411 403 515 112 31 168 271 -15 -43 -168 -512 -312 -328 -482 -398 -1 -135 -431 -406 -50 -154 -17
1686 -17 39 -141 307 174 172 -223 176 185 111 -71 -150 -49 44 -117 -218 130 -271 149 -216 225 149 -30 165
1709 165 105 -31 -126 -68 24 114 -152 -247 1 135 237 59 -352 301 182 116 430 -121 459 205 -46 19 40
1732 40 263 260 53 -178 25 -148 -58 -544 -494 -208 -136 -629 -362 -317 34 300 -130 -302 -241 151 122 44 -265
$$ packed form
1572D7L10K62J82j85j70r5j30j59j12j80j18k6l10r0J53k3J60j70m75K49K92J92
1594c96N43l92L47K18J66k92P3j06K49K0k3j08k5j3k5j36l04J11O8Q4l10n1J44
1617a58J19k04j05L94k42K62k00j57K01J34K4j01j63L17K21n4qOJ5mK5j86j41
1640eK05l7k24p0J1J35l05ok71L50j38R5j69NK11K60m3Q3k17L43K96K7n24K30
1664B42J69qJ12m03q1J37J03k86k8j25l44K00j6j54Q4L97j34k96K5L56j04J37
1686a7N6j80M48j33kl95L99Rp4j82p9J01R3j61j01L48m01M20l65M41p6j79J95
1709A65o0j36r5N8R2R0k66r5K48J34J02j78m11O53j19o6L14n51N80k54k51O5K1
1732D0K23lk07k31K03j73R0m86N0K86P2m93K67M5L51K66m30j72O1L92k9p8l09
$$ plain form
1755 -265 -18 153 163 -196 78 -20 121 -263 -119 -276 110 -106 -161 7 95 164 149 8 34 34 111 239 178 98
1779 98 -11 150 21 -312 -39 -26 153 -67 -17 -201 287 132 -42 -132 333 167 304 146 129 355 204 285
1801 285 -213 -123 -30 -72 -274 -256 -488 -189 -156 -72 -139 -305 -42 -2 16 -228 -4 356 289 263 564 47 412 203
1825 203 -87 21 198 156 -136 -102 -233 -176 -8 -300 -448 -246 -83 8 44 -90 171 171 170 128 191 51 -35 152
1849 152 -105 18 53 48 223 19 -108 -7 -26 -228 5 -208 72 183 -113 86 -301 -82 -189 -35 -273
1870 -273 -276 43 -120 -208 -96 3 139 208 263 76 386 500 600 423 208 623 628 340 -190 237 109 18 -104
1893 -104 -49 -373 -247 -393 -297 -526 -507 -441 -286 -208 32 65 -13 290 112 3 185 284 140 -50 233 342 85
1916 85 219 -85 -109 -371 26 -141 -167 -179 -214 -70 -38 -174 135 19 -43 -23 53 421 309 235 191 17 502 286
$$ packed form
1755b65K47J71J0l59K74r8J41l84J44j57L86k16n5J68Q8O9j5j41K6%P7J28o1q0
1779I8j09J61j29l33K73J3J79k20N0j84M88j55j74r0M65j66J37j58j7K26j51Q1
1801B85m98R0R3m2k02J8k32K99L3Q4o7j66K63M0J8k44K24L60o7k6L01n17L65k09
1825B03k90J08J77m2k92L4j31N7J68k92j48K02J63R1L6j34K61%jm2O3j40q6J87
1849A52k57J23L5nJ75k04j27J01j9k02K33k13K80J11k96J99l87K19j07J54k38
1870b73lL19j63q8J12R9J36O9N5j87L10J14J00j77k15M15Nk88n30M27j28r1j22
1893a04N5l24J26j46R6k29J9O6J55P8K40L3p8L03j78j09J82R9j44j90K83J09k57
1916H5J34l04k4k62L97j67k6j2l5J44L2j36L09j16o2K0P6L68j12p4m4j74M85k16
$$ plain form
1940 286 287 435 251 57 408 362 129 115 125 -126 -60 355 -126 -121 -77 -245 -234 30 -187 -303 -329 -114 -148 -101
1964 -101 -263 -308 -208 -204 62 160 93 183 -91 95 96 231 67 137 65 -349 -43 59 -209 -604 -117 -377 -239
1987 -239 -175 -307 -261 -84 -61 -38 -60 48 146 -57 297 410 320 515 570 307 72 292 333 262 203 -391 37 82
2011 82 -226 146 -202 -261 -244 -222 -323 -268 -183 -148 -111 -189 -152 85 98 129 5 -248 -76 -34 142 101 103 280 25
2036 25 -102 -36 -170 25 -102 -40 -312 99 -47 -115 -175 -296 -53 35 12 -255 -157 -100 -7 -46 -101 -60 275 79
2060 79 175 250 379 93 301 -139 204 68 176 286 -267 -146 -143 -62 -428 -176 -301 -95 -394 -201 -236 -3
2082 -3 -229 -137 -146 213 187 267 -16 60 30 332 151 248 135 -143 286 -28 -155 -233 114 40 -66 -76 -389 -138
2106 -138 -251 140 -8 97 -243 79 340 72 -2 275 154 -60 -149 -127 11 -140 -78 45 -237 -38 19 -17
$$ packed form
1940B86JJ48j84j94L51m6k33j4J0k51O6M15m81NM4j68J1K64k17j16k6K15l4M7
1964a01j62m5J00MK66R8o7R0k74J86JJ35j64P0p2m14L06J02k68l95M87k60J38
1987b39O4j32M6J77K3K3k2J08R8k03L54J13r0J95N5k63k35K20M1p1n9n94M28M5
2011H2l08L72l48n9J7K2j01N5Q5L5L7p8L7K37J3L1j24k53J72M2J76m1KJ77k55
2036B5j27O6j34J95j27O2k72M11j46o8o0j21K43Q8k3k67R8N7R3l9n5M1L35j96
2060G9R6P5J29k86K08m40L43j36J08J10n53J21LQ1l66K52j25K06k99J93l5K33
2082ck26R2rL59k6Q0k83P6l0L02j81R7j13k78M29l14j27p8L47p4j06j0l13K51
2106a38j13L91j48J05l40L22K61k68p4K77j21k14q9K2J38j51O2J23k82J99N7l6
$$ plain form
2128 -17 47 233 -54 -36 71 17 396 -348 81 76 -127 -202 -115 -18 -159 -70 -1 62 -24 23 58 130 -8 323 180
2153 180 73 109 150 57 -148 210 -83 70 79 -346 -87 -253 -159 -360 -231 69 170 -26 -225 -166 102 180 326
2176 326 132 -61 231 169 -113 185 321 -118 255 -36 -345 -53 -118 -207 58 75 -54 23 -66 -16 42 72 -85
2199 -85 37 50 -120 -40 -65 -189 -79 249 55 114 16 155 50 113 13 -86 168 185 296 -27 -39 -11 291 229
2223 229 -4 -5 -37 215 189 76 82 -56 35 93 -158 -192 275 111 72 -87 51 203 223 -194 -120 -166 -28 32 27
2248 27 -7 129 189 -171 -273 -92 -73 -232 -158 -79 -203 14 -148 -55 -159 -37 136 -52 -33 -109 83 -36 3
2271 3 -53 -52 -200 184 150 -23 126 167 115 -105 -68 166 98 105 216 48 -54 200 219 51 -9 -225 48 -16 -67
2296 -67 -207 -324 105 -145 -190 -66 83 114 -63 -200 -36 193 -69 -132 -195 396 225 -24 137 -287 -161 -181
$$ packed form
2128a7O4J86k87J8J07n4L79p44M29nk03p5Q7R7j41Q9O9O3q6M7L5P2j38L31j43
2153A80j07L6M1r3k05L58k93J53Rm25K59j66R4k01J29L00J01j96j99N9K68P8J46
2176C26j94j93K92o2k82K98J36m39L73k91l09K92o5q9K65J7j29P7q9N0N8L0j57
2199h5J22J3j70Q0k5j24J10L28j94N9r8J39j05O3j00r9K54J7J11l23j2K8L02o2
2223B29k33jl2K52k6j13Oj38R1N8k51l4M67j64l9j59J38J52K0m17P4m6J38O0n
2248B7l4J36O0l60j02J81J9j59P4P9j24K17j62R3j04J22J73j88J9p6J92j19L9
2271Cn6Jj48L84l4j73J49M1n2k20L7K34o8PJ11j68j02K54J9j68o0k16K73o4n1
2296f7j40j17M29k50m5J24J49L1j77j37J64K29k62o3o3N91j71k49J61m24J26k0
$$ plain form
2318 -181 23 230 -68 -30 -71 121 -240 -178 -302 -120 147 -209 28 14 49 124 88 -62 339 -106 -141 38 -12
2341 -12 195 108 -38 -185 -78 55 -69 -108 -101 11 -34 -68 -111 -139 70 -8 -6 -364 4 27 46 -40 -135 -52 -231 81
2367 81 123 -62 15 -53 135 217 5 93 -68 -51 105 -8 125 -47 185 63 20 9 -152 -2 85 -36 -297
2390 -297 52 -2 -316 282 36 185 231 -65 -48 -160 144 -88 -214 183 261 -103 0 128 -282 -112 -138 -171
2412 -171 -236 52 -49 -32 -39 -43 77 -133 78 -135 135 40 15 -129 -134 199 201 258 -14 -93 95 67 -96 53 -304
2437 -304 -47 62 -201 -78 1 113 -70 -18 -44 38 -20 3 -65 40 -94 -131 -26 -46 94 121 91 169 102 78 27
2462 27 292 -25 -219 278 23 -338 47 -207 27 55 -238 -245 -217 -237 -189 33 -89 61 -80 218 107 111 33
2485 33 150 93 56 189 197 190 94 75 -85 138 193 -63 102 -272 85 19 30 193 -140 -104 -156 34 469 -148 16
$$ packed form
2318a81K04K07k98L8m1J92l61O2j24J82K67l56K37j4L5P5l6j50M01m45l5J79n0
2341a2K07q7j46j47J07J33j24l9PJ12m5l4m3k8K09p8Kl58L68K3J9q6r5Q3j79L12
2367H1M2j85P7o8J88Q2k12Q8j61J7J56j13J33j72K32j22m3j1j61J50Q7j21k61
2390b97L49n4l14N98k46J49M6k96J7j12L04k32j26L97P8l64J03J28m10J70k6l3
2412a71o5K88j01J7pmJ20k10K11k13K70r5k5j44nL33KN7k72p9J88k8j63J49l57
2437c04K57J09k63J23P9J12j83N2k6Q2n8K3o8J05j34l7J05k0J40K7l0P8o7k4n1
2462B7K65l17j94M97k55l61L85k54K34K8k93pK8k0M8K22j22J50j41K98j11Mp8
2485C3J17n7l7J33Qpr6j9j60K23N5k56J65l74L57o6J1J63l33L6n2J90M35o17J64
$$ plain form
2510 16 152 -163 -17 102 26 22 184 -94 17 48 2 27 -87 -182 60 -66 193 -46 248 -16 -329 -262 -80
2533 -80 -3 -151 -93 -309 -37 163 -252 -122 -27 11 -48 70 -162 -107 186 282 114 -118 65 42 96 178 0 -12
2557 -12 45 121 -42 -229 40 -8 -1 -198 -10 -104 103 -85 -32 -142 0 44 123 -82 173 206 177 257 127 -34
2581 -34 -165 -102 40 87 -226 25 -229 -93 -64 -208 16 -332 -193 191 39 -17 232 -67 -199 80 52 -73
2603 -73 -42 292 171 110 -103 133 -39 29 -112 85 -124 43 59 -208 226 250 -122 43 -87 -61 57 -14 -83
2626 -83 183 117 -34 144 -20 64 -178 -178 291 90 -152 65 115 -34 -91 39 191 -32 170 -32 -66 128 20
2649 20 -13 10 363 -427 -198 -16 56 -296 -100 -21 470 -60 -10 10 71 101 26 161 -20 104 104 407 56 215
2673 215 -60 34 -55 44 371 219 6 -79 16 11 82 -332 -138 -24 10 39 411 161 -123 171 -174 184 -19
$$ packed form
2510A6J36l15J46J19p6mJ62k78J11L1m6K5j14r5K42j26K59k39K94k64l13O7J82
2533h0P7j48N8k16K72K00m15J30R5L8n9J18k32N5K93R6j68k32J83k3N4Q2j78j2
2557a2N7P6j63j87K69m8Pj97J88r4K07j88N3j10J42M4P9k05K55L3k9Q0j30j61
2581c4j31O3J42M7l13K51k54J36K9j44K24l48J39L84j52n6K49k99j32K79k8j25
2603g3L1L34j21o1k13K36j72O8j41J97k09J67J6k67M34K4l72J65j30K6J18p1o9
2626h3K66o6j51J78j64Q4k42%M69k01k42K17N0j49n7J30J52k23K02k02l4J94j08
2649B0l3K3L53p90K29J82P2l52J96P9M91n30N0K0O1L0p5J35j81J24%L03l51J59
2673B15k75R4q9R9L27j52k13q5R5nP1m14J94J14L4K9L72k50k84K94l45L58k03
$$ plain form
2696 -19 16 -252 115 -96 -97 44 250 -168 73 56 -116 7 127 248 174 -9 16 -133 -115 -132 292 -210 138
2719 138 -131 145 40 -358 -115 -128 134 134 -139 110 -2 52 108 120 -234 -196 189 142 -81 84 210 20 188
2742 188 19 89 205 -334 -51 -77 -118 32 -140 354 -40 44 -95 -354 -182 38 269 -132 228 74 -212
2763 -212 -36 63 26 -149 18 151 13 -94 124 -128 -171 34 140 32 180 -121 55 -173 153 4 -179
2784 -179 134 -147 -43 -15 226 -59 -121 -106 70 -18 -107 -359 46 241 -19 158 16 9 289 88 51 -172 173
2807 173 -122 47 2 -244 -8 -245 108 41 -179 -146 -24 140 -136 -99 -34 137 145 -5 -90 -10 106 -26 -171
2830 -171 -3 149 40 -89 -212 -61 -229 22 126 -7 -144 -76 -200 17 38 -155 149 39 157 -11 279
2851 279 155 -71 -36 -67 117 -203 305 182 47 132 -99 37 145 -46 -220 -24 -164 21 -208 152 57
$$ packed form
2696a9L5k68L67k11jJ41K06m18K41j7j72J23J20J21p4j83K5j49J8j7M24n02L48
2719A38k69K76j05l98K43j3K62%k73K49j12N4N6J2l54L8L85m7k23J65J26j90J68
2742A88j69P0J16n39K83k6m1J50j72M94l94Q4j39k59J72K20K31m01L60j54k86
2763b12J76R9l7j75J67J33j38j07K18k52m3K05J06j08J48l01J76k28L26j49j83
2784a79L13k81J04K8K41k85o2J5J76q8q9k52M05J95k60J77j42pK80k01l7k23L45
2807A73k95J69m5k46K36k37L53o7k20L3J22J64k76L7O5J71Qj50q5Q0J16j32j45
2830a71J68J52j09j29j23J51j68K51J04j33j37O8j24K17K1j93L04j10J18j68K90
2851B79j24k26L5l1J84l20N08j23j35Q5k31J36J08j91j74J96j40J85k29L60r5
$$ plain form
2872 57 -21 172 -89 91 -30 122 113 19 -156 -104 -87 -75 -113 77 -26 -106 296 132 70 154 351 -44 -108 95
2896 95 -110 13 -34 -201 -24 -147 25 -206 -120 67 -112 -62 150 17 62 72 237 202 -157 194 286 -84 9
2919 9 99 138 79 45 -73 -133 -10 11 -27 -121 33 -69 -255 78 -52 285 127 -12 -5 -29 -33 -191 46 47 10 -150
2945 -150 30 -176 -129 90 -153 -207 -173 -49 78 -265 46 -2 -84 127 228 127 -16 -270 39 -81 76 148
2967 148 5 -2 -54 86 -170 -28 -63 161 -70 -86 80 80 112 39 103 65 147 70 -138 40 49 -57 125 152 -194
2992 -194 -48 109 -100 164 -127 101 47 71 61 -270 260 51 107 124 -171 12 -24 -152 75 -64 216 54
3014 54 -137 -40 75 40 68 -60 -252 -77 -69 -91 128 105 74 111 -28 31 -36 70 -6 42 -12 98 15 85 -21 47
3040 47 -169 111 -144 -51 29 -80 145 -42 -157 2 -316 -67 75 -118 -52 -20 -64 -205 35 -101 -210 -85
$$ packed form
2872E7p8J93k61J80j21J52rr4j75N2J7J2l8J90j03q0M02j64o2Q4J97l95o4K03
2896I5k05J23m7j67J77j23J72k31Q6J87j79N0K12j33M5J0J65l5l59L51R2l70R3
2919IR0L9n9l4j18o0J23K1l8r4J54j02j86L33j30L37j58j39Pk4mj58K37Jl7j60
2945a50J80k06M7K19k43n4L4J24J27l43L11m8q2K11J01j01j43k54L09j20J57P2
2967A48j43pn2J40k56J42l5K24k31j6J66%L2p3O4l8Q2p7k08J78Rj06J82K7l46
2992a94J46J57k09K64k91K28n4K4j0l31N30k09N6J7k95J83l6j28K27j39K80j62
3014E4j91R7J15l5K8j28j92J75Qk2K19k3l1L7j39N9o7J06p6M8n4J10q3P0j06O8
3040D7k16K80k55R3Q0j09K25j87j15J59l18K49J42j93O6L2m4j41K40j36j09J25
$$ plain form
3062 -85 42 -140 -60 270 -200 -160 146 130 -110 28 -21 106 -120 4 -187 -80 -151 -3 30 27 -153 -49 -44 -107
3086 -107 41 47 188 202 171 -202 -31 -74 212 -36 -124 153 6 120 230 112 37 1 91 91 89 -38 -64 77 71
3111 71 67 15 67 121 -123 -82 22 5 -115 -14 -50 10 -77 -392 -53 0 12 290 47 98 -81 -194 -97 200 -67
3136 -67 -88 -59 12 92 41 -183 -102 -115 276 286 -299 -37 35 -60 64 -216 -172 -73 -42 -196 245 58 -116 199 198
3161 198 -206 171 -73 196 -229 59 -261 6 -79 -210 -19 -187 -57 -68 -86 -216 -28 206 -54 149 -175
3182 -175 200 49 28 177 -91 -156 57 50 -108 8 -142 324 -12 -180 32 -3 51 120 -33 -64 179 191 89
3205 89 12 -55 88 -16 -30 144 140 -28 14 -9 13 10 -243 -33 -182 59 108 1 204 -102 -93 46 123 90 75 137
3231 137 251 -327 -51 -96 4 122 50 -50 -93 -68 -25 358 33 111 -166 14 -120 -6 -86 196 -68 -10 -132
$$ packed form
3062h5J27j82Q0L30m70M0L06j6k40J38m9J27k26J24j91J07p1J48L3lj80J04No3
3086a07J48OJ41J4l1l73J71m3K86k48q8K77j47J14J10j18p5l6R0%kj27k6J41o
3111G1mn2N2N4k44M1J04j7j20J01l6O0q7l15L39N3J2K78k43N1j79j13R7K97k67
3136f7k1K9P1Q0n1k24Q1j3L91J0n85K62P2r5J24k80M4R9L1j54M41j87j74L15j
3161A98m04L77k44K69m25K88l20K67q5j31J91j68J30j1j8j30J88K34k60K03l24
3182a75L75j51k1J49k68o5K13pj58J16j50M66l36j68K12l5N4O9j53l1K43J2j02
3205H9p7o7J43j04j4J74mj68M2k3K2lk53K10j49K41M9j07K03l06RJ39P7l3j5O2
3231A37J14n78K76m5J00J18p2j00m3K5M3L83l25P8k77J80j34J14q0K82k64N8j22
$$ plain form
3254 -132 -261 -128 86 -168 -97 4 -154 -45 -71 1 54 85 -30 -82 -87 175 120 -11 67 0 94 133 151 100 48
3279 48 26 -21 30 71 -113 -113 234 21 273 95 19 11 -124 205 -233 -32 -106 -139 9 29 -127 -350 -339 -29 12
3304 12 36 -66 65 184 12 13 84 -136 -30 -219 20 -115 36 -24 -113 -104 -46 -219 -198 -106 -71 201 196 -218 104
3329 104 78 -112 87 -54 -2 -47 59 242 440 127 -59 -37 61 -70 -135 22 199 141 84 132 -55 -133 23
3352 23 188 -7 69 -179 137 177 198 -6 -292 33 -4 69 199 83 -172 -46 -127 13 172 -159 -194 257 -65
3375 -65 155 -197 205 -15 -207 -4 100 213 -131 131 119 83 -123 18 66 99 -97 269 -200 -54 84 214
3397 214 62 89 -365 -191 244 -226 -85 -82 116 -21 -202 -93 -49 -231 -61 46 135 18 -174 -61 89 73
3419 73 -41 1 -3 173 47 181 -251 -44 -125 232 116 -79 147 -23 -200 -264 245 333 64 56 6 150 264
$$ packed form
3254a32j29J33K14k54P1J01j58J09k6P2N3L1j15n2nK62n5j31P8o7R4L9J8n1n2
3279D8k2m7N1M1j84%L47k13K52j78p6qj35L29m38K01p4l3J48K0j56k23J1L10M1
3304A2K4j02J31J19j72JP1k20J06j89K39j35J51o0q9RN8j73K1R2L5K72nm14L22
3329A04k6j90J99j41N2m5J06J83J98l13j86K2R8j31o5J57J77n8n7M8j87p8J56
3352B3J65j95P6k48L16M0K1k04k86L25l7P3J30j16k55J26q1J40J59l31l5M51l22
3375f5K20l52M02k20j92K03J04J13l44K62j2l6k06J41M8L3j96L66m69J46J38J30
3397B14j52K7m54J74M35m70J41LJ98j37j81J09M4j82J70J07Q9j17j92J13J50j6
3419G3j14M2mJ76j26J34m32K07q1L57j16j95K26j70j77o4N09Q8k69qn0J44J14
$$ plain form
3442 264 -56 -66 74 155 58 9 -4 49 4 17 -37 -146 -36 -64 159 2 -249 220 -167 77 258 32 65 144
3466 144 49 140 237 -178 -299 -143 577 -117 -74 -37 73 24 18 155 -38 73 -373 -137 -309 -167 33 0 -142
3489 -142 31 -2 31 -184 -231 -235 30 47 44 138 3 -218 47 -50 169 219 301 -30 21 59 -71 -13 24 183 -213
3514 -213 133 87 130 -17 199 31 183 157 125 182 39 -163 -74 248 -296 -235 -132 22 53 -19 -73 -134 162 -75
3538 -75 -265 181 -144 -178 -5 35 58 -27 -13 -282 213 -47 -247 92 -33 101 23 -165 111 63 55 92 152 55
3562 55 127 -62 -47 73 13 -171 6 -118 -7 -88 6 -18 -17 28 -148 111 16 -175 159 155 -109 105 -52 19 17
3587 17 -37 -115 -2 -168 66 51 103 131 156 367 -54 102 238 -121 115 143 108 36 180 283 253 -7 186 -57
3611 -57 21 -117 -124 63 72 35 -70 31 54 96 -114 130 -4 -154 202 3 126 26 3 332 -107 35 301
$$ packed form
3442B64l20j0J40Q1r7m9j3N3m5J3n4j09J10k8K23j57k51M69l87K44J81k26L3P9
3466A44r5R1R7m15j21J56P20o94M3L7J10m9oJ37j93J11m46K36j72J42K00l3j42
3489a42J73l3L3k15m7mK65J7lR4j35k21K65r7K19N0Q2l31N1L8j30N8L7J59l96
3514b13L46m6M3j47K16j68J52k6l2N7j43k02Q9L22n44O1J03J54L1p2n4o1K96k37
3538g5j90M46l25l4J73M0K3q5J4k69M95k60k00L39j25J34p8j88K76m8qL7O0r7
3562E5P2j89J5J20o0j84J77j24J11q1R4k4JM5j76K59r5j91L34mk64K14j57P1k
3587A7n4p8J13j66K34j5N2K8K5K11m21J56J36l59K36K8l5p2J44J03l0k60J93k43
3611e7P8j38pJ87Rl7j05J01K3M2k10K44j34j50L56j99J23j00k3L29m39J42K66
$$ plain form
3634 301 4 2 -109 40 -270 -291 -57 -257 -95 -24 100 190 13 128 137 46 -98 100 27 -262 -93 147 -110
3657 -110 -221 -116 -91 75 106 -57 131 210 99 -9 184 -91 16 115 128 -28 15 44 -142 24 139 -117
3679 -117 -85 -30 178 -182 -34 129 127 -62 -122 240 -66 28 149 -213 -64 -56 -244 -86 -36 -14 -88 106 -161 250
3703 250 152 203 -72 -146 -65 214 200 73 230 47 209 19 220 -131 61 74 72 -99 -154 -145 -102 -153 -122 -101 -102 -397
3729 -397 -69 -53 30 -98 78 -80 45 91 141 29 0 -108 -172 258 -45 -78 -19 -143 12 323 -6 -116 41
3752 41 117 -11 40 172 -71 136 -100 183 94 -184 235 -24 211 -203 90 -136 -15 1 -130 -21 -27 -262
3774 -262 4 -97 -127 77 68 53 -86 164 27 29 147 -27 50 52 -139 67 28 156 -27 -150 -72 62 101 -88
3798 -88 -80 65 -186 149 146 -85 82 192 51 -87 -60 130 10 192 -129 59 229 19 -30 372 -250 -109
$$ packed form
3634C01k97kj11J49l10k1K34k00J62P1J24R0j77J15Rr1j44J98p3k89J69K40k57
3657a10j11J05K5J66L1j63J88P9j11j08J93k75J07R9J3j56M3K9j86J66J15k56
3679a17L2N5K08l60J48J63kj89o0L62l06R4J21l62J49Qj88J58N0K2p4J94k67M11
3703B50r8N1k75p4Q1K79j4j27J57j83J62j90K01l51J92J3kj71n5RM3n1L1K1jk95
3729c97L28J6Q3j28J76j58J25M6N0j12k9j08o4M30l03l3N9j24J55L11l29j10J57
3752D1P6j28N1J32k43K07k36K83q9k78M19k59K35m14K93k26J21J6j31J09ok35
3774b62K66j01l0K04rj5j39K50j37KJ18j74P7Kj91K06l9J28j83j23P8J34L9j89
3798h8QJ45k51L35lk31J67J10j41j38K7J90j20J82l21J88J70k10m9M02o22J41
$$ plain form
3820 -109 -51 -200 -15 -257 -90 -17 -172 -194 39 -82 -12 -185 -168 -39 -2 46 169 44 -211 -191 -36 -22 46
3843 46 35 -169 -26 12 83 241 -69 -53 -174 -11 -96 -125 -20 31 -259 17 23 -71 -64 -58 -54 -283 -14 -4 106 -17
3869 -17 -148 -227 86 -36 42 2 -93 -142 -147 -280 89 96 19 -63 -40 242 227 -52 -327 198 6 136 -121 107 90
3894 90 148 -104 195 75 -49 177 -140 32 -230 357 84 -187 -79 -114 -190 -94 319 -125 169 57 33 -71
3916 -71 109 446 -34 -14 -48 -312 -64 103 64 75 293 93 -199 -73 2 18 -33 37 184 -8 67 96 63 168
3940 168 -163 23 -160 69 -80 24 -71 221 -31 142 -96 -380 -84 370 -202 -15 -25 -181 238 29 43
3961 43 115 118 -11 30 172 261 -91 -120 238 -82 11 80 254 66 55 -66 115 60 137 -46 -105 219 -132 218
3985 218 -175 29 -36 -142 -186 -161 28 145 -46 -85 149 -215 70 277 123 64 -125 -18 -139 23 11 -48
$$ packed form
3820a09N8j49J85k42J67P3j55k2K33j21P0j73J7J29L7M8J23j25k55K0J55J4O8
3843D6j1k04J43L8P1J58l10J6j21J63q5k9J05N1k90K76Or4POMk29K69J0J10j23
3869a7j31p9L13j22P8m0r5m9nj33L69Pp7q2K3K82j5k79k75N25j92J30k57K28j7
3894I0N8k52K99j20j24K26l17J72k62N87k73k71J08l5p6R6M13m44K94j12k4j04
3916g1J80L37m80K0l4k64K48J67l9J1K18k00k92J26P5J6n1P0J47j92P5K9l3J05
3940A68l31J86j83K29j49J04r5K92k52J73k38k84K96M54n72J87j0j56M19k09J4
3961D3P2Lj29M1J42Q9l52k9L58l20R3O9J74j88j1j21J81n5P7j83n9L24l51L50
3985B18l93K04o5j06m4K5J89J17j91l9K34l64K85K07j54n9j89J07j21J62j2n9
$$ plain form
4007 -48 156 141 -38 -23 42 22 72 -47 -177 -257 64 184 -68 -256 -166 -17 145 107 -81 81 -200 -92 59
4030 59 -117 138 163 -115 6 33 -39 161 37 3 -88 54 172 2 25 167 -225 39 -215 -97 29 24 -33
4053 -33 -147 -98 175 -45 82 24 -143 -209 -84 -152 -87 -75 25 -170 319 79 49 -8 5 -119 167 86 -6 -8 -169
4078 -169 24 164 -77 91 179 -17 0 166 -75 -161 -11 -178 -95 50 72 -100 -296 -57 51 167 -110 123
4100 123 316 -225 -1 66 -113 -256 -47 72 -45 48 167 30 121 -237 127 -118 11 -31 115 -22 -30 275
4122 275 308 261 -50 95 -73 -153 233 -365 -129 211 -118 -328 32 34 -313 247 23 -119 22 67 -113 -67
4144 -67 223 -145 157 53 -220 -98 27 124 -276 -12 63 -54 93 -100 -16 -242 27 133 6 -89 14 190
4166 190 -308 -121 49 23 -72 42 -157 -2 21 4 173 302 49 93 171 -64 -273 13 175 -7 88 182 36
$$ packed form
4007d8K04j5j79J5O5k0N0j19j30q0L21J20k52j88R0J49J62l8j88J62k81J08J51
4030E9j76K55K5k78J21K7p2K00j24l4r1J42J18j70K3J42l92K64k54J18J26nn7
4053c3j14M9K73k20J27n8j67o6J25o8O5J2J00j95M89k40l0n7J3j24K86q1r2kj61
4078a69J93J40k41J68Q8j96J7J66k41q6J50j67Q3J45K2j72j96K39J08J16k77K33
4100A23J93n41K24O7j79j43K09J19j17R3J19j37R1l58L64k45J29m2J46j37qL05
4122B75L3m7l11J45j68q0L86n98K36L40l29k10L60Kl47N60k24j42J41M5j80M6
4144f7K90l68L02j04k73J22J25R7m00K64P5j17J47j93Q4k26K69J06j27r5J03J76
4166A90m98J87J70k6r5J14j99J55K3j7J69J29k53M4P8k35k09K86J62j82R5R4j46
$$ plain form
4189 36 11 -52 46 258 123 -10 43 -32 3 230 -128 78 -44 356 -149 108 124 150 19 -47 169 -342 46
4212 46 -72 54 -300 -81 304 -55 44 -101 -67 -86 -103 -188 -190 -232 -69 11 161 63 -74 -264 34 -75 121 -182
4236 -182 39 -6 -23 95 163 -227 318 -138 51 -72 -32 -35 -196 -118 -130 -122 67 153 -143 -357 -164 -176 -172 -155 -223
4261 -223 -114 -59 -107 -222 1 -218 118 -88 15 354 -297 -191 51 -12 76 48 -20 -13 -72 -116 -154 -17 94 16
4285 16 -18 2 169 102 -50 64 249 -18 -175 -105 -213 65 -24 66 -232 -81 48 91 -149 -172 96 -120 41
4308 41 -125 -138 95 201 14 71 -165 122 -90 -66 -103 -107 -113 24 -10 99 -13 28 168 175 -73 -133 -38 6 -3 122
4334 122 -41 -15 151 252 -71 61 -99 3 25 -31 81 -92 -177 194 127 -26 -15 170 8 -195 50 -111
4356 -111 76 -124 220 -8 1 -12 -122 -1 7 202 -107 -91 -143 -152 35 -76 329 39 -177 224 -45 -93 100
$$ packed form
4189C6k5o3R8K12j35j33N3p5L5K27l58K06j22M00n05K57J6K6j31o6K16n11L88
4212D6j18J26l54K19L85l59R9j45L4j9j7q5km2J63Q0J50r8j37j90K98j09J96l03
4236a82K21m5j7J18O8l90N45m56J89j23M0lj61P8j2QJ89Q6k96k14J93j2MJ7o8
4261b23J09N5m8j15K23k19L36k06J03L39o51J06K42o3Q8k8o8Pn9m4l8J37J11p8
4285A6l4K0J67o7j52J14J85k67j57P0j08K78q9R0k98J51J29M3k40k3K68k16J61
4308D1j66j3K33J06j87N7k36K87k12K4l7moJ37l4J09j12M1J40Pk48o0R5M4rJ25
4334A22j63K6J66J01l23J32j60J02K2n6J12j73q5L71o7j53J1J85j62k03K45j61
4356a11J87k00L44k28Rj3j10J21QJ95l09J6n2rJ87j11M05k90k16M01k69m8J93
$$ plain form
4379 100 70 77 -84 130 -34 27 -121 -19 -19 -165 -39 197 214 -183 -173 1 160 11 254 -25 56 -5 -2 -128
4403 -128 0 144 24 -52 170 3 83 26 -142 184 72 -239 -63 102 -193 -139 20 4 141 90 -65 -148
4425 -148 -152 8 -39 231 50 -38 209 -29 164 -29 -232 102 119 120 -133 -174 144 61 71 127 -14 -206 -224 -215 -52
4450 -52 -1 -39 -127 -6 46 110 44 1 -134 -342 -31 21 -105 -82 -4 158 -45 162 205 141 2 -47 1 -22 236
4475 236 73 -40 -173 -8 -220 -286 -200 -187 40 29 256 -1 -105 -46 -54 -266 -163 -152 -85 -38 -77 34 -273 23
4499 23 -26 -120 214 63 -11 86 -257 -94 320 108 101 138 -211 -31 168 -15 -104 -163 -200 -21 72 -44 297 146
4523 146 91 60 -130 -56 193 -82 -88 -2 -167 -9 96 -162 159 38 -21 91 152 -65 57 124 -90 61 -271
4546 -271 42 -57 -65 -276 209 -15 128 -49 106 53 164 147 168 -153 -107 -10 24 -1 28 14 57 -159 -108 -112 5
$$ packed form
4379A00l0Pj61K14j64O1j48J02%j46J26K36J7l97J0J74J59j49K43k79Q1o1Lj26
4403a28J28J44j20p6K22j67Q0n7j68L26j12l11J76J65k95N4J59j6J37n1j55q3
4425a48mJ60m7K70j81q8K47k38J93j93k03L34J7Jk53m1L18q3J0N6j41j92j8RJ63
4450e2N1l8q8J21N2O4o6m3j35k08L11N2j26K3P8J62k03K07M3o4j39m9M8k3K58
4475B36j63j13j33J65k12o6Q6J3K27j1K27k57j04N9qk12J03J1O7M7l9J11l07K96
4499B3m9r4L34j51p4R7l43J63M14k12pL7l49J80J99j83q9n9l7J79R3j16L41j51
4523A46n5l1j90P4K49k75oQ6j65J58J05k58L21j21n9J12O1k17J22O7k14J51l32
4546b71L13r9qk11M85k24J43j77J55n3J11j7K1l21M6R7L4k5K9j4M3k16N1mJ17
$$ plain form
4571 5 -153 236 164 -60 10 -30 22 213 48 -184 215 83 47 101 -21 259 -158 -43 -1 109 14 -83 45 -21
4595 -21 -186 144 -122 -36 -33 41 164 46 -71 -95 19 -99 43 177 -174 -84 143 12 133 -82 134 -231
4617 -231 -256 16 210 101 -56 267 -78 157 52 128 -7 0 -202 32 347 -73 127 -217 -100 15 60 85
4639 85 138 -36 -76 2 170 -37 -14 -119 -108 165 -195 175 94 -42 229 -117 176 24 15 289 -75 -121 265
4662 265 110 -28 -169 -101 -100 59 -128 50 70 -45 -48 134 267 34 63 203 32 -132 -12 -47 -49 107 -2
4685 -2 -167 -27 17 272 40 -260 180 -216 51 76 69 32 -158 -46 163 -121 -183 -17 -395 -17 23 140 -259
4708 -259 112 260 128 73 210 8 298 -34 -32 -170 -92 22 131 -23 -133 -185 35 79 -191 144 169 -103
4730 -103 -63 64 -74 -78 -176 78 -115 62 -157 145 -45 44 -142 -24 38 -19 -10 -88 -18 -22 83 45 138 24 -86
$$ packed form
4571Ej58L89p2k24P0m0N2J91j65k32L99j32l6N4j22K80m17J15M2J10r5r7J28o6
4595b1j65L30k66Q6LP4J23j18j17k4J14j18J42J34l51R0K27j31J21k15K16l65
4617b31k5K72J94j09j57L23l45K35j05P6j35Pk02K34L15m20K00l44J17J15M5K5
4639H5N3j74m0P8J68k07K3j05J1K73l60L70q1j36K71l46K93j52rK74l64m6L86
4662B65j55j38j41O8JJ59j87J78K0j15lJ82J33k33K9J40j71j64J20l5kJ56j09
4685bj65J40M4K55k32l00M40l96K67K5pl7j90J12K09k84o2J66l78L78M0J17l99
4708b59L71J48j32n5J37k02K90l32Kj38P8J14J09j54j10n2K20M4k70L35K5k72
4730a03M0J27j38mr8K54j93J77k19L02j90Q9j86J18O2n7Rp8P0mJ05l8R3j14j10
$$ plain form
4755 -86 -79 -31 32 -112 121 -240 -25 -141 -7 129 323 231 -301 -138 -10 111 265 4 -92 -117 -267 -138 -168
4778 -168 -216 102 76 268 -125 -66 149 32 297 39 23 149 -57 -10 78 -56 -15 -69 198 -489 80 98 48
4801 48 57 65 129 175 -33 49 -157 115 -66 -67 146 -210 -189 312 -76 -97 -6 -222 3 7 -127 -7 2 138 -225 279
4827 279 291 128 111 -235 -105 -80 101 -196 -64 -208 -6 -103 38 136 103 -133 -77 3 -163 56 59 -120 250
4850 250 -112 14 -48 -146 -199 78 0 -68 -147 -78 128 -65 -95 -228 76 100 -174 -33 -75 160 0 135 -48
4873 -48 -85 79 131 32 -112 -176 -95 3 -2 -345 -81 -56 88 179 64 82 -23 107 -246 -69 -22 -13 -37 264 -198
4898 -198 -147 -164 86 15 111 -32 -55 -173 189 -3 250 -87 -81 52 -280 -159 138 12 -4 -65 154 46 -314
4921 -314 -168 -39 4 -167 -46 -10 -231 168 -40 -122 -207 -68 -96 1 -146 -85 -1 90 159 54 64 -142 75 -74
$$ packed form
4755h6PM8O3j44K33l61K15j16J34J36J94r2n32J63J28J21J54k61r6k5j50J29l0
4778a68m8L18k6J92l93N9K15j17K65k58j6J26k06M7Q8j34M1n4K67o87N69J8n0
4801D8RQO4M6k08Q2k06K72j81jK13l56K1N01l88k1R1k16K25Mj34J20RJ36l63N04
4827B79J2j63j7l46J30K5J81k97J32j44K02r7J41R8l3k36N6Q0j66K19Lj79L70
4850B50l62J26o2r8n3K77p8o8p9O9K06j93l0j33L04K4k74J41m2K35j60J35j83
4873d8l7J64N2r9j44o4Q1R8nl43K64K5J44R1j15J8j05J30l53J77M7Rk4L01m62
4898a98N1j7K50p1R6j43k3j18L62j92K53l37OJ33l32J21K97j26j6o1K19j08l60
4921c14J46J29M3j71J21L6k21L99k08q2q5J39k8R7j47O1Q4R1O9j05J0k06K17j49
$$ plain form
4945 -74 45 144 32 35 70 272 293 -300 -5 193 -119 56 -121 311 99 -148 21 -24 96 20 17 -143 131
4968 131 77 -169 -229 -167 177 -127 -85 -8 -7 -53 316 -83 82 148 -232 36 -149 57 212 -19 82 170 29
4991 29 -153 104 -150 -79 -173 -50 1 -175 -135 20 -219 -92 87 -40 185 27 80 -40 18 38 9 -53 -16 -66
5015 -66 120 -81 284 -31 -359 -156 -50 186 203 -7 70 -53 -151 29 28 158 123 211 21 56 -114 80 -2
5038 -2 50 39 111 -34 31 119 195 71 -53 -210 -8 -11 10 55 -143 -50 201 102 101 -56 -102 38 144 -10 2 162
5064 162 -69 -86 -8 126 91 257 39 259 -12 -96 51 89 102 -28 112 -149 -10 -64 -124 -57 -24 267 109
5087 109 39 -266 52 133 15 -11 -100 144 0 -114 -43 -114 61 32 60 51 -120 96 -307 97 151 -257 146 137
5111 137 -127 40 -102 -204 -202 102 61 -51 197 -134 64 -72 -24 -49 -47 -68 -102 150 -39 -88 -103 -154 26 125
$$ packed form
4945g4J19R9j12LL5K02K1n93K95J98l12J75j77M32k12k47J69m5J20p6lj60K74
4968A31n4k46o0O2L44l04M2P7Jm6L69l99J65O6l80K68j85K06J55k31J01Q8j41
4991B9j82K57k54P1r4J23N1j76M0J55k39J27J79j27K25j58N3j20N8K0k9o2L7n0
5015f6J86k01L65l15l28K03J06K36J7k10P7j23r8J80jJ30l5Q8j90L5j70J94q2
5038bN2j1P2j45O5Q8P6j24j24j57K02lK1M5j98R3K51r9jj57m6J40J06j54J2J60
5064A62k31j7P8J34l5J66k18K20k71q4J47L8J3j30J40k61J39n4o0O7L3K91j58
5087A09p0l05L18Q1j18k6q9K44j44j14P1p1J75k9K8rj71K16m03M04N4m08M03r
5111A37k64J67j42j02KL04m1j12K48l31J98j36M8k5Kk1l4K52j89m9j5n1J80R9
$$ plain form
5135 125 -102 222 -183 341 169 55 -56 207 -79 206 -310 -250 -56 121 270 -206 98 -90 79 -61
5155 -61 72 -26 -125 -198 92 -78 -56 -48 -322 -131 -283 22 96 37 38 -135 -49 -74 221 -104 143 -23 123 137 -288
5180 -288 221 63 -29 -218 -311 -185 116 185 -135 -42 33 -92 42 -118 242 112 -25 58 -68 111 -108 -58
5202 -58 67 49 150 104 104 -173 41 -147 26 -94 -48 -77 -165 9 101 -251 -138 -45 166 -255 -82 -35 -195 160
5226 160 139 -257 51 -309 -202 250 101 203 -47 19 57 -71 206 127 -137 36 106 -23 85 -6 -102 -130 -62
5249 -62 -137 -151 125 -30 41 190 79 326 -263 38 -54 -141 42 180 -358 17 -243 7 -108 -429 228 188
5271 188 25 53 93 -72 -65 -109 45 -211 40 -194 -96 13 -197 38 368 -112 84 -194 -34 166 -44 88
5293 88 46 -3 -82 -85 114 313 -78 66 91 149 -207 -86 207 -126 -64 -85 118 -205 -74 -49 -81 161 1 13
$$ packed form
5135A25k27L24m05N24j72j14j11K63k86K85n16O0J94J77J49m76L04j88J69j40
5155f1J33r8r9p3K90j70K2Qk74J91j52L05P4n9Jj73Q6k5K95l25K47j66J46J4m25
5180b88N09j58r2j89r3J26L01O9l20R3P5j25J34j60L60j30j37Q3j26J79k19N0
5202e8J25j8J01m6%k77K14j88J73j20M6k9q8J74R2l52J13R3K11m21J73M7j60L55
5226A60k1l96L08l60J07M52j49J02k50O6L8j28K77p9k64J73P0j29J08r1r6k8O8
5249f2p5j4K76j55P1J49j11K47n89L01r2q7J83J38n38L75k60K50j15l21O57m0
5271A88j63K8M0j65Pm4J54k56K51k34R8J09k10K35L30m80J96k78J60K00k10J32
5293H8m2m9p9lJ99J99l91J44K5N8l56J21K93l33O2k1K03l23J31K5l2K42j60J2
$$ plain form
5317 13 141 -247 38 -25 13 55 -192 255 83 -320 181 -221 45 -204 -134 -31 154 54 20 -66 21 15 152
5340 152 -65 -103 88 -205 96 -176 -175 -38 -98 25 30 46 -260 141 374 102 -237 147 -1 47 105 12 -86 -88
5364 -88 -96 126 -6 -180 -16 147 98 -187 16 -6 -43 -64 22 -276 -24 -79 -43 -80 119 -38 38 -186 174 23
5388 23 31 346 -53 -38 285 139 -82 44 67 -50 171 191 -25 188 -194 -143 243 -106 -176 -79 -132 -446 -61
5411 -61 86 -35 -6 64 -63 -18 -16 80 134 197 165 138 -123 141 100 -38 -149 53 162 -15 21 162 -94 266
5435 266 -125 98 -60 -223 -130 -195 264 -27 -294 -87 198 -287 -103 -104 193 -133 -59 -93 -95 -36 126 -105 -78
5458 -78 -120 -117 -18 -72 229 147 -133 -197 141 193 -10 -127 -14 -126 175 18 -238 190 -44 -50 -57 411 -151 -213 -138
5483 -138 -113 -44 13 16 -145 82 -191 62 -15 -123 -193 270 -67 12 -129 -125 -48 -147 -48 -147 95 217 7 290 -150
$$ packed form
5317A3J28l88K85o3L8M2k47M47j72m03N01m02K66k49P0J03J85j00l4q6Q7oJ37
5340A52k17l8J91k93L01k72JJ37o0J23NJ6l06M01K33k72l39L84j48M8N8r3r8k
5364h8qK22j32j74J64J63m9k85K03k2l7k1Q6k98K52n5L6l7J99j57P6k24L60j51
5388B3QL15l99J5L23j46k21J26K3j17K21K0k16K13l82N1L86l49p0R7n3l14L85
5411f1J47j21K9P0j27M5KR6N4O3l2k7k61K64m1j38j11K02J09j77L6J41k56L60
5435B66l91K23j58j63R3o5M59k91k67K07K85m85J84jK97l26P4l4kN9J62k31K7
5458g8m2LR9n4L01q2k80o4L38N2k03j17J13j12L01j57k56M28k34opM68n62o2P5
5483a38K5O9N7Lj61K27k73K53p7j08p0M63l37P9j41MP7r9R9r9K42J22k10K83m40
$$ plain form
5508 -150 73 4 -275 126 186 131 292 -79 -19 214 111 217 -65 29 -55 -12 -206 -139 -107 140 142 41 127 73
5532 73 -4 15 -120 227 -16 16 253 -168 -157 81 -111 -255 -151 62 58 -17 -7 30 -44 64 218 22 -122 -251
5556 -251 -199 111 102 -26 253 135 -91 127 -69 22 -66 -205 -112 -60 -44 136 150 -36 -106 -87 29 -76 -7 -79
5580 -79 337 -53 331 12 -54 -60 -103 -130 14 34 89 8 -66 58 29 -142 -56 43 149 152 18 98 -17 -286 106
5605 106 109 91 215 -149 193 107 120 -75 130 74 148 -237 105 -70 -117 106 -72 99 -418 196 70 269 -65
5628 -65 -80 -19 163 -269 -76 301 -179 -13 -63 -97 145 -121 147 159 309 -167 -4 -62 -111 224 -142 88 -56
5651 -56 -250 11 -12 111 -134 143 -90 141 147 183 294 29 15 -181 -17 19 -76 176 -194 25 81 -34 79
5674 79 -77 -6 61 -192 372 -97 20 303 -90 249 196 13 138 -47 156 221 -217 4 24 -146 182 81
$$ packed form
5508a50K23o9k79M01O0n5J61l71O0K33j03J06k82R4q4M3j94O7L2K47Kj01Q6n4
5532G3p7J9j35L47k43L2K37m21J1K38j92j44J04K13mp5J0L7p4J08J54j96j44j29
5556b51N2L10rj28K79j18k26K18j96R1q8j39R3N2J6J80J4j86p0J9J16j05O9p2
5580g9M16l90L84l19o6om3k7J44K0N5q1p4J24k9j71Q6R9J06Lj34Q0j15k69L92
5605A06Lj8J24l64L42q6J3j95K05n6P4l85L42j75m7K23j78J71n17O14j26J99l34
5628f5j5O1J82m32J93L77m80J66n0l4K42k66K68J2J50m76J63n8m9L35l66K30j44
5651e6j94K61k3J23k45K77k33K31OL6J11k65j4j96J64L6r5K52l70K19N6j15J13
5674G9j56P1O7k53N64m69J17K83l93L39n3j83J25j85K03O5m38K21K0j70L28j01
$$ plain form
5696 81 -48 111 209 96 111 50 -221 257 51 -52 -35 116 26 16 -40 -254 275 -97 -163 -81 -92 163 -69 170
5720 170 149 139 -76 -311 -116 49 182 66 -46 316 27 198 32 -84 -154 -145 -49 11 116 117 75 -42 -283
5743 -283 193 65 10 -95 -55 106 -72 3 -54 -57 -167 19 -135 144 -173 -197 100 -37 186 71 -68 -18 -191
5766 -191 -107 -26 42 10 0 112 1 35 -102 -94 66 -18 -142 -182 -222 -160 -78 28 -45 -222 1 161 -44 214 -11
5791 -11 -77 116 146 -141 -43 -55 -65 117 -76 14 -136 1 -51 51 -53 50 -94 -103 431 -221 32 -109 179
5814 179 180 16 167 274 46 -212 46 125 -200 -99 175 -161 -198 1 -21 -41 -9 -69 -29 26 143 120 131 -18
5838 -18 -63 99 166 29 43 59 201 71 38 98 314 -90 43 -85 111 -26 111 18 -188 7 290 80 22
5861 22 -134 -50 -137 168 -204 96 141 167 12 147 5 315 138 -134 -70 -209 50 -145 16 125 -4 -12 -121
$$ packed form
5696H1j29J59R8j13J5o1k71M78k06j03J7J51r0j0n6k14N29l72o6Q2j1K55k32K39
5720A70k1j0k15k35J95J65J33j16j12L62k89J71j66j16p0RR6O0J05Jm2j17k41
5743b83M76j28n5j05M0J61j78P5n7lj10J86j54K79l17k4K97j37K23j15j39N0j73
5766a91Q4Q1O8l2j0J12j11L4j37QJ60q4j24m0m0O2Q2J06p3j77K23J60k05K58k25
5791a1o6J93L0k87R8j2j0J82j93R0j50J37n2J02j04J03j44rN34o52K53j41K88
5814A79Jj64J51J07k28k58K58P9l25J01K74l36l7J99k2k0L2o0M0N5J17k3J1j49
5838a8m5J62O7j37J4J6J42j30l3O0K16m04J33j28J96j37J37r3k06J95K83k10n8
5861B2j56Q4q7L05l72L00M5K6j55J35j42L10j77k72O4j39K59j95J61J09j29qj09
$$ plain form
5884 -121 -96 0 -208 35 84 -98 -75 100 53 16 -78 -195 -22 168 26 -71 -75 -9 205 152 35 262 -138 -72
5908 -72 -249 113 -69 -258 83 198 -160 21 50 -60 -173 -118 200 -96 192 225 54 20 16 236 -60 -208
5930 -208 32 45 42 -51 -56 88 -66 135 119 136 1 73 -38 46 -138 86 10 77 7 269 -148 -217 77 117 346
5955 346 56 41 28 96 -5 38 196 90 101 22 43 270 40 -169 -166 88 -148 17 -90 -237 208 -300 185
5978 185 61 -40 -196 -73 -115 -46 -163 -235 -69 -82 72 199 -111 35 -248 -88 -111 8 -59 386 121 191
6000 191 144 -36 56 -186 46 64 174 148 201 20 194 252 112 183 -52 -171 4 -238 162 -118 3 -68 53
6023 53 -30 -141 -28 104 273 -62 -255 6 -90 113 -35 -69 135 110 94 -60 111 -17 105 30 -128 145
6045 145 -38 205 202 -58 14 53 208 318 -31 -196 75 184 -36 -187 220 -1 189 4 -292 -171 150
$$ packed form
5884a21K5R6k08K43M9j82K3J75m7l7r4j17J73J90j42r7mO6K14n3j17K27m00O6
5908g2j77L62j82j89L41J15l58J81K9j10j13N5L18k96K88L3j71l4mK20k96j48
5930b08K40J3lr3nJ44j54K01j6J7j35P2j11Q4j84K24p6O7p0K62m17o9K94M0K29
5955C46k90j5j3O8j01M3J58j06J1p9K1K27k30k09LK54k36J65j07j47M45n08M85
5978A85j24j01j56J23m2O9j17p2J66j3J54J27l10J46k83J60k3J19o7M45k65P0
6000A91m7j80R2k42K32J8J10k6N3j81J74N8j40P1k35j19J75k42M00k80J21p1J21
6023E3q3j11J13J32J69l35j93K61r6K03j48l4K04k5j6j54J71j28J22p5j58K73
6045A45j83K43lk60P2L9J55J10l49j65K71J09k20j51M07k21J90j85k96J21L21
$$ plain form
6066 150 13 127 -44 70 -132 -122 79 89 -84 -21 165 -175 7 -13 -14 -114 81 27 106 48 -15 42 -41 30
6090 30 -201 -146 -383 -118 50 -36 -151 -41 82 -160 73 -95 32 24 101 154 -246 -185 65 36 134 -124 169
6113 169 -51 -149 -10 -184 15 159 -32 -19 118 172 -62 96 -37 60 -264 -37 -42 70 12 -85 244 -236 -397
6136 -397 -34 -246 9 -25 -131 -44 -210 70 -179 57 0 -167 -148 -455 263 -165 75 135 158 111 -72 259
$$ packed form
6066A50j37J14j71J14k02J0K01J0j73O3J86l40J82k0jj00J95n4P9n8o3N7q3P1
6090C0k31N5k37K65J68q6j15J10J23k42K33j68J27qP7N3m00O1K50k9R8k58K93
6113A69k20r8J39j74J99J44j91J3J37N4k34J58j33R7l24K27nJ12n8r7L29m80j61
6136c97L63k12K55l4j06Q7j66K80k49K36n7j67J9l07P18m28K40O0K3m7j83L31
$$ [...]
8191d2
##END NTUPLES=NMR FID
##END=
