##TITLE=1H_LR-758-R4-KA5-K-CR2
 CDCl3
 8 sc, 
 25.12.2023
##JCAMPDX= 6.0         $$ Bruker NMR JCAMP-DX V2.0
##DATA TYPE= NMR FID
##DATA CLASS= NTUPLES
##ORIGIN= UXNMR, Bruker Analytische Messtechnik GmbH
##OWNER= root
$$ XWIN-NMR		Version 3.5
$$ Mon Dec 25 14:03:55 2023 Russian Standard Time (UT+4h)  she@DPX200
##.OBSERVE FREQUENCY= 200.1313
##.OBSERVE NUCLEUS= ^1H
##.DELAY= (6, 6)
##.ACQUISITION MODE= SIMULTANEOUS
##.ACQUISITION SCHEME= undefined
##.AVERAGES= 8
##.DIGITISER RES= 18
##SPECTROMETER/DATA SYSTEM= spect
##.PULSE SEQUENCE= zg30
##.SOLVENT NAME= CDCl3
##.SHIFT REFERENCE= (INTERNAL, CDCl3, 0, 15.7039)
##AUDIT TRAIL= $$ (NUMBER, WHEN, WHO, WHERE, WHAT)
$$ ##TITLE= Audit trail, XWIN-NMR		Version 3.5
$$ ##JCAMPDX= 5.01
$$ ##ORIGIN= Bruker BioSpin GmbH
$$ ##OWNER= she
$$ F:/spectra/data/she/nmr/H-F/1/audita.txt
$$ ##AUDIT TRAIL=  $$ (NUMBER, WHEN, WHO, WHERE, WHAT)
(   1,<2023-12-25 14:02:28.23 +0400>,<she>,<DPX200>,
      <created by zg, POWCHK disabled, PULCHK disabled
       configuration hash MD5:
       00 E9 B6 7A A2 85 ED C7 34 08 36 98 17 FE 4E 26
       data hash MD5: 16K
       31 07 1F 4F 61 42 BD DF 42 7D 94 49 B8 D8 CF F9>)
$$ ##END=
$$ 
$$ hash MD5
$$ 28 53 39 AA CB 35 E6 A1 4B 2C 20 58 14 7B A4 07
##$RELAX= 
##$RELAX= 
##$RELAX= 
##$RELAX= 
##$RELAX= 
##$RELAX= 
$$ Bruker specific parameters
$$ --------------------------
##$DU= <F:/spectra>
##$EXPNO= 1
##$NAME= <H-F>
##$PROCNO= 1
##$TYPE= <nmr>
##$USER= <she>
##$AMP= (0..31)
100 100 100 100 100 100 100 100 100 100 100 100 100 100 100 100 100 100 
100 100 100 100 100 100 100 100 100 100 100 100 100 100 
##$AQSEQ= 0
##$AQ_mod= 1
##$AUNM= <au_zg>
##$AUTOPOS= <>
##$BF1= 200.13
##$BF2= 200.13
##$BF3= 200.13
##$BF4= 200.13
##$BF5= 200.13
##$BF6= 200.13
##$BF7= 200.13
##$BF8= 200.13
##$BYTORDA= 1
##$CFDGTYP= 0
##$CFRGTYP= 5
##$CHEMSTR= <none>
##$CNST= (0..31)
1 1 145 1 1 1 1 1 1 1 1 1 1 1 1 1 1 1 1 1 1 1 1 1 1 1 1 1 1 1 1 1 
##$CPDPRG= <>
##$CPDPRG1= <>
##$CPDPRG2= <>
##$CPDPRG3= <>
##$CPDPRG4= <mlev>
##$CPDPRG5= <mlev>
##$CPDPRG6= <mlev>
##$CPDPRG7= <mlev>
##$CPDPRG8= <mlev>
##$CPDPRGB= <>
##$CPDPRGT= <>
##$D= (0..31)
0 1.2 0 0 0 0 0 0 0 0.06 0 0.03 0 0 0 0 0.0002 0 0 0 0 0 0 0 0 0 0 0 0 
0 0 0 
##$DATE= 1703498547
##$DBL= (0..7)
120 120 120 120 120 120 120 120 
##$DBP= (0..7)
150 150 150 150 150 150 150 150 
##$DBP07= 0
##$DBPNAM0= <>
##$DBPNAM1= <>
##$DBPNAM2= <>
##$DBPNAM3= <>
##$DBPNAM4= <>
##$DBPNAM5= <>
##$DBPNAM6= <>
##$DBPNAM7= <>
##$DBPOAL= (0..7)
0.5 0.5 0.5 0.5 0.5 0.5 0.5 0.5 
##$DBPOFFS= (0..7)
0 0 0 0 0 0 0 0 
##$DE= 6
##$DECBNUC= <off>
##$DECIM= 32
##$DECNUC= <off>
##$DECSTAT= 4
##$DIGMOD= 1
##$DIGTYP= 9
##$DL= (0..7)
0 120 120 120 120 120 120 120 
##$DP= (0..7)
150 150 150 150 150 150 150 150 
##$DP07= 0
##$DPNAME0= <>
##$DPNAME1= <>
##$DPNAME2= <>
##$DPNAME3= <>
##$DPNAME4= <>
##$DPNAME5= <>
##$DPNAME6= <>
##$DPNAME7= <>
##$DPOAL= (0..7)
0.5 0.5 0.5 0.5 0.5 0.5 0.5 0.5 
##$DPOFFS= (0..7)
0 0 0 0 0 0 0 0 
##$DQDMODE= 0
##$DR= 18
##$DS= 0
$$ [...]
##$SUBNAM2= <"">
##$SUBNAM3= <"">
##$SUBNAM4= <"">
##$SUBNAM5= <"">
##$SUBNAM6= <"">
##$SUBNAM7= <"">
##$SUBNAM8= <"">
##$SUBNAM9= <"">
##$SW= 18.0517328524113
##$SWIBOX= (0..15)
0 0 2 0 0 0 0 0 0 0 0 0 0 0 0 0 
##$SW_h= 3612.71676300578
##$TD= 16384
##$TD0= 1
##$TE= 0
##$TE2= 300
##$TE3= 300
##$TEG= 300
##$TL= (0..7)
0 120 120 120 120 120 120 120 
##$TP= (0..7)
150 150 150 150 150 150 150 150 
##$TP07= 0
##$TPNAME0= <>
##$TPNAME1= <>
##$TPNAME2= <>
##$TPNAME3= <>
##$TPNAME4= <>
##$TPNAME5= <>
##$TPNAME6= <>
##$TPNAME7= <>
##$TPOAL= (0..7)
0.5 0.5 0.5 0.5 0.5 0.5 0.5 0.5 
##$TPOFFS= (0..7)
0 0 0 0 0 0 0 0 
##$TUNHIN= 0
##$TUNHOUT= 0
##$TUNXOUT= 0
##$USERA1= <user>
##$USERA2= <user>
##$USERA3= <user>
##$USERA4= <user>
##$USERA5= <user>
##$V9= 5
##$VALIST= <valist>
##$VCLIST= <CCCCCCCCCCCCCCC>
##$VD= 0
##$VDLIST= <DDDDDDDDDDDDDDD>
##$VPLIST= <PPPPPPPPPPPPPPP>
##$VTLIST= <TTTTTTTTTTTTTTT>
##$WBST= 1024
##$WBSW= 4
##$XGAIN= (0..3)
0 0 0 0 
##$XL= 0
##$YL= 0
##$YMAX_a= 146719
##$YMIN_a= -127357
##$ZGOPTNS= <>
##$ZL1= 120
##$ZL2= 120
##$ZL3= 120
##$ZL4= 120
##$ABSF1= 10
##$ABSF2= 0
##$ABSG= 5
##$ABSL= 3
##$ALPHA= 0
##$AQORDER= 0
##$ASSFAC= 0
##$ASSFACI= 0
##$ASSFACX= 0
##$ASSWID= 0
##$AUNMP= <proc_1d>
##$AZFE= 0.1
##$AZFW= 0.1
##$BCFW= 1
##$BC_mod= 2
##$BYTORDP= 1
##$COROFFS= 0
##$CY= 11.3945322036743
##$DATMOD= 1
##$DC= 2
##$DFILT= <>
##$DTYPP= 0
##$F1P= 15.7292609196834
##$F2P= 12.9074282941183
##$FCOR= 0.5
##$FTSIZE= 0
##$FT_mod= 4
##$GAMMA= 1
##$GB= 0.15
##$INTBC= 1
##$INTSCL= 1
##$ISEN= 128
##$LB= 0.24
##$LEV0= 0
##$LPBIN= 0
##$MAXI= 10000
##$MC2= 0
##$MEAN= 0
##$ME_mod= 0
##$MI= 1.114404
##$NCOEF= 0
##$NC_proc= 0
##$NLEV= 6
##$NOISF1= 3.799351
##$NOISF2= 2.8
##$NSP= 1
##$NTH_PI= 0
##$NZP= 0
##$OFFSET= 15.70392
##$PC= 1
##$PHC0= -24590.87
##$PHC1= 6.45273
##$PH_mod= 1
##$PKNL= yes
##$PPARMOD= 0
##$PSCAL= 0
##$PSIGN= 0
##$REVERSE= no
##$SF= 200.130013532006
##$SI= 16384
##$SIGF1= 3
##$SIGF2= 2
##$SINO= 400
##$SIOLD= 16384
##$SREGLST= <1H.CDCl3>
##$SSB= 0
##$STSI= 0
##$STSR= 0
##$SW_p= 3612.71676300578
##$SYMM= 0
##$S_DEV= 0
##$TDeff= 0
##$TDoff= 0
##$TI= <>
##$TILT= no
##$TM1= 0
##$TM2= 0
##$TOPLEV= 0
##$USERP1= <user>
##$USERP2= <user>
##$USERP3= <user>
##$USERP4= <user>
##$USERP5= <user>
##$WDW= 1
##$XDIM= 8192
##$YMAX_p= 0
##$YMIN_p= 0
$$ End of Bruker specific parameters
$$ ---------------------------------
##NTUPLES= NMR FID
##VAR_NAME=  TIME,          FID/REAL,        FID/IMAG
##SYMBOL=    X,             R,               I
##VAR_TYPE=  INDEPENDENT,   DEPENDENT,       DEPENDENT
##VAR_FORM=  AFFN,          ASDF,            ASDF
##VAR_DIM=   8192,          8192,            8192
##UNITS=     SECONDS,       ARBITRARY UNITS, ARBITRARY UNITS
##FACTOR=    0.0002768,     1,               1
##FIRST=     0,             0,               0
##LAST=      2.2672688,     0,               0
##MIN=       0,             -127357,         0
##MAX=       2.2672688,     146719,          0
$$ Real data points
##PAGE= N=1
##DATA TABLE= (X++(R..R)), XYDATA
0 0 0 0 0 0 0 0 0 0 0 0 0 0 0 0 0 0 0 -1 7 -8 8 -8 8 -8 13 -16 16 -17 24 -24 29 -32 37 -41 48 -53 59 -65 73 -83
40 -83 91 -102 111 -124 138 -151 167 -184 202 -223 247 -273 297 -330 365 -405 451 -503 563 -638
60 -638 728 -840 983 -1176 1446 -1856 2538 -3897 7601 -38959 -107030 2859 41836 8138
74 8138 72345 146719 67559 -4685 42611 81082 57603 59217 61438 30921 26171 45911 16253
87 16253 -38393 -43470 -10732 -2347 -17567 -16840 -4060 -21618 -46404 -30487 -3282 -935 15232
100 15232 35146 9058 -8779 30371 47235 12627 8924 31021 19399 16303 36229 10579
112 10579 -26987 -4140 9781 -32202 -41649 -6185 -11680 -43486 -44723 -38528 -44610 -34560 -22349
125 -22349 -29128 -30578 -18900 -12538 -11427 -10015 -3542 14432 27158 18484 13439 24915 26955 21724
139 21724 24702 23115 18496 27959 26252 -62 -10560 1155 -1963 -11818 -9299 -12108 -19312 -11931
153 -11931 -10228 -21869 -14234 3885 -338 -6387 7170 14862 15380 26265 27806 13513 13752 26819
167 26819 23882 12566 11702 13499 7792 -382 -10283 -15891 -14295 -16810 -23091 -23080 -22226 -24064 -21412 -20342
183 -20342 -24567 -17715 -4483 -5181 -9460 -2751 3505 5973 13706 16101 8507 10648 18861 13384 6032
198 6032 12603 16313 10571 9203 6452 -1917 -1787 1872 -4202 -8823 -3396 -1571 -7351 -10061 -9181 -8998
214 -8998 -6401 -3849 -5389 -5372 -1571 1152 2895 4332 4508 7269 11004 7721 4205 8765 13039 10036
230 10036 8378 6421 2148 730 1441 -4768 -9833 -6511 -4702 -9629 -11056 -10012 -12949 -12960 -8744 -7978
246 -7978 -7500 -1554 1936 -199 740 5823 8082 8349 7388 6090 6693 9572 9464 6056 2583 706 281
263 281 -77 -2337 -4213 -3709 -4349 -6452 -4618 -2339 -3043 -2616 -1892 -2997 -2031 2887 4389 308 -486
280 -486 2876 3950 3456 3316 -148 -3282 -220 2836 1364 393 923 -609 -2036 467 2066 1216 227
297 227 -373 -478 1293 3823 3149 -1501 -4638 -3732 -1667 -1210 -2247 -3251 -3111 -2449 -915 -741 -2453
314 -2453 -2984 -920 1377 2868 5442 6252 3281 1756 2589 3810 4361 4350 3132 -471 -36 1721 -20
331 -20 -3181 -4105 -4055 -3788 -2772 -1976 -3762 -4729 -3255 -2277 -1540 -495 207 -1142 -1756 -327 1416 2299
349 2299 2395 2375 2015 2474 3182 3138 1694 1131 2962 5269 5217 4259 3111 1009 -445 -257 -357 -1693 -1768
368 -1768 -1523 -3474 -5323 -5804 -7474 -9497 -8844 -6222 -4783 -2997 -1269 -1797 -2334 -153 2618 3826
384 3826 5029 7082 8504 8963 8214 6622 4631 3252 2846 1735 -15 -1701 -3448 -5058 -6550 -6900
400 -6900 -6474 -7027 -6947 -5457 -3964 -1993 417 2198 3029 4526 7674 9581 9083 9285 8803 7484 7802
417 7802 8465 6711 4879 3023 145 -2786 -4533 -6131 -7644 -8302 -7853 -7637 -8205 -9233 -11084 -12040 -10218
434 -10218 -6991 -4105 -1739 -1207 -1479 -1157 146 1359 2869 4834 6440 7303 6892 6184 5300 4505 2995
451 2995 2524 2617 1089 -856 -2551 -3598 -5293 -5433 -5710 -6990 -7664 -6923 -5622 -4406 -1408 757 2070
468 2070 4583 6823 8327 10386 13218 15287 15332 15825 15564 14047 12725 10956 7569 4033 1153 -2810
484 -2810 -6069 -7995 -10384 -13372 -14978 -16261 -17163 -16972 -15597 -13978 -11140 -8891 -6773 -3335 -1316 139
500 139 2309 5597 7116 7411 7958 7536 6395 5932 5249 4135 2639 -252 -3831 -5179 -5157 -5734 -5876 -5489
518 -5489 -6052 -7913 -7480 -5820 -4569 -2819 137 2624 4363 6163 6535 6451 8623 10788 11880 12617 13410
535 13410 12247 10393 9386 9112 8108 5710 2776 -26 -1326 -2972 -5058 -5946 -7580 -10908 -12280
550 -12280 -11688 -11408 -11067 -9725 -8090 -6075 -4587 -3787 -2267 1156 3767 4769 6730 8085 7151 5713
566 5713 6345 6288 4951 3638 697 -2904 -5199 -6840 -8806 -8707 -8307 -9693 -11077 -10463 -9568 -9089 -6507
583 -6507 -2267 1308 5105 6807 7813 9970 11798 12853 14158 16117 15894 13021 11672 10778 8241 5049
599 5049 2701 -121 -2150 -4379 -6747 -7822 -8653 -10129 -11463 -10696 -10175 -10436 -9213 -7040 -4975 -2989
615 -2989 -1630 -1568 -265 2048 3513 4151 5417 5383 3845 4015 5908 5212 4329 2469 325 -1931 -2239
632 -2239 -2800 -3560 -3858 -4359 -5555 -6328 -6472 -7677 -7867 -5151 -2793 -717 911 1526 1950 2569 4575 7283
650 7283 9678 10429 9920 9416 9566 9405 8437 7327 4677 2297 968 -589 -2484 -3400 -4891 -7213 -7454
667 -7454 -7212 -7976 -8311 -6653 -5110 -4006 -1081 485 198 629 2638 4133 4894 6370 5308 3316 2741
684 2741 3069 2248 1791 504 -1764 -4352 -4545 -5025 -5422 -5017 -4776 -4613 -4391 -4184 -4142 -3499 -2492 -798 1213
703 1213 2835 2749 2686 2983 2545 2877 4573 4215 3595 4169 4098 2738 2557 2681 974 -126 341 203 -558
722 -558 -231 -722 -2290 -2843 -2529 -3281 -3693 -3334 -3038 -2948 -2083 -1428 -1570 -1145 -147 490 1442 2543 2729 2663
742 2663 3524 3761 3946 3559 3319 2299 1417 651 -254 -103 -568 -1743 -2446 -2447 -3594 -4379 -3777 -2984 -2818 -1417
762 -1417 -477 -216 -46 557 911 1111 2152 2432 1915 2131 2217 1290 867 858 32 -542 -865 -1072 -1246 -774 -659
783 -659 -874 -381 -144 -487 -410 75 238 199 774 413 254 -17 -499 -1302 -1193 -1021 -1674 -1463 -1049 -877 -621
804 -621 53 267 90 549 1282 1139 2084 3409 3250 2635 2497 1793 676 610 137 -417 -843 -1062 -1695 -2422
824 -2422 -2998 -3513 -3638 -2726 -2371 -1163 -421 -279 -408 351 1355 1797 2162 2792 2163 2260 2700 2434 2264 1881
844 1881 1336 491 580 170 -480 -1485 -1472 -1655 -1390 -417 -1031 -1830 -2170 -2459 -2330 -1189 -509 -915 56 252
864 252 78 317 124 -64 416 1783 3254 3844 3416 2772 1573 1342 1940 1390 1475 764 -198 -1458 -1546 -2758
884 -2758 -4612 -5138 -5444 -5268 -4520 -3890 -4291 -4074 -3210 -1693 -580 1085 2555 2919 3734 5450 5989 6440
902 6440 6963 5903 5463 5105 4581 3154 2050 402 -845 -1182 -1646 -2628 -3800 -4378 -4945 -4599 -3521 -2569
920 -2569 -2108 -1006 210 441 1384 2116 1656 2220 3551 3959 4228 3896 2714 1149 398 207 -733 -1298
938 -1298 -1805 -2688 -3358 -3528 -4266 -5374 -5795 -5290 -5068 -4275 -3230 -3138 -3139 -2702 -1874 -832 423 1123 1640 2502
958 2502 3172 3896 4756 5006 4669 4770 4862 4483 3804 3661 2252 1313 1423 -15 -1124 -1711 -2393 -3435 -3638
977 -3638 -3154 -3000 -2605 -1517 -779 -213 911 2116 2207 3528 4763 5256 5891 5951 5246 3712 3214 2386 1076
996 1076 -24 -1446 -3096 -4626 -5769 -7066 -7769 -8022 -8528 -8237 -7179 -6756 -5758 -4427 -3061 -1829 42
1013 42 1452 2117 2854 4065 4920 5560 6378 6231 5027 4526 3749 2816 2246 2335 987 62 -366 -1137 -2065
1032 -2065 -1935 -2137 -2432 -1922 -1568 -1904 -1510 -139 -44 482 1370 1884 1858 2487 2773 2993 3731 3826 3919 3246 2848
1053 2848 1675 1132 975 99 -527 -1337 -2655 -4026 -4261 -5118 -5773 -6083 -6187 -6512 -5594 -4609 -4169 -3671 -2024
1072 -2024 -1220 -934 697 2074 2838 3740 4926 5230 4695 4709 3794 2689 2603 2435 1371 155 -679 -2010
1090 -2010 -2766 -2759 -2844 -3171 -2973 -2655 -2048 -996 297 675 1864 2729 3042 3675 4634 4583 4483 5038 4404 3727
1110 3727 3305 2146 680 -21 -267 -1625 -2048 -2461 -3644 -4093 -3703 -3937 -4396 -4270 -4298 -4071 -3360 -1843
1128 -1843 -1522 -988 -371 -477 -766 230 817 1100 2195 2974 2864 2954 2471 1249 1068 1404 1908 1622 1446
1147 1446 659 -583 -1248 -1518 -1878 -2304 -2126 -2630 -2576 -2124 -1736 -1754 -1323 -708 -26 709 1735 2001 2537 3328
1167 3328 3759 3760 4163 3233 2418 2420 2215 1113 495 -436 -1611 -2364 -2276 -3034 -3166 -3122 -3402 -3542 -2726 -2054 -1608
1188 -1608 -638 236 45 1027 1606 1419 1589 2214 2641 2553 2354 1947 885 274 540 -125 -119 86 -394 -933
1208 -933 -843 -974 -1156 -1256 -690 -1057 -308 76 18 239 -138 -187 -411 -119 -335 -101 113 340 -95 192 -60
1229 -60 -387 -50 226 570 718 899 520 12 120 416 -27 -239 -49 -512 -1092 -1152 -1157 -1157 -1177 -872 -748 -546
1251 -546 -556 -257 -14 610 1254 1798 1799 1731 1513 1331 1643 1401 1439 1274 892 340 202 -76 -518 -1007 -943 -1446
1273 -1446 -1182 -1042 -931 -400 -463 -405 -346 -252 -648 -395 -219 227 -270 -31 -245 -601 -758 -689 -556 -362 -399 -300
1295 -300 -249 338 438 755 799 828 909 631 1030 1144 751 699 227 -73 -666 -942 -1418 -1511 -1025 -1365 -1217 -646
1317 -646 -906 -1036 -493 -96 817 821 1207 1598 1999 2124 2293 1833 1861 1111 879 685 505 -215 -501 -1001 -1656
1338 -1656 -1598 -1859 -2049 -1908 -1720 -1556 -1051 -770 -334 -106 183 476 810 907 1050 1348 1580 1518 1475 1303 1267
1359 1267 808 453 134 411 320 355 200 -341 -616 -793 -1130 -1115 -1087 -1068 -769 -810 -974 -1407 -1357 -1027 -1056 -570
1381 -570 -283 204 240 823 1048 948 1596 1541 1613 1806 1227 1007 880 550 205 -448 -867 -1688 -2234 -2375 -2709
1402 -2709 -2609 -2439 -2473 -1755 -1466 -1010 -611 17 581 1849 2469 3483 3473 3697 3637 3497 3238 2771 2453 1837
1422 1837 1223 576 -65 -781 -1619 -2274 -2952 -3036 -2867 -2870 -2530 -2425 -2180 -1992 -1267 -755 -172 453 602 1181 1212
1443 1212 1332 1529 1191 1280 1251 837 621 361 -175 -356 -513 -612 -813 -1182 -1578 -1551 -1443 -1510 -1478 -1500 -825 -782
1465 -782 -408 -430 -513 77 579 775 1353 1960 2498 2876 2800 3017 2831 2436 2506 2566 2195 2002 1604 1013 -41
1486 -41 -1051 -1799 -1871 -2396 -2420 -2695 -3101 -2783 -2906 -2522 -2101 -1609 -911 -399 413 833 1091 1280 1446 1797 1858
1507 1858 1865 1439 632 176 -264 -930 -1446 -1462 -2076 -2723 -2771 -2995 -3101 -2862 -2303 -1907 -1120 -387 301 390 956
1528 956 1631 1904 2714 3206 3229 3262 3465 3014 3065 2589 2006 1441 1320 1375 642 452 -209 -498 -821 -1258 -1365
1549 -1365 -1566 -1406 -1351 -1518 -1358 -1343 -1345 -1247 -1128 -805 -450 118 315 366 602 758 1201 1218 867 677 754 800 583
1572 583 165 -301 -734 -1599 -1793 -1866 -2420 -2336 -2365 -2541 -2151 -1886 -1801 -1583 -700 -194 244 1104 1754 2089 2582
1593 2582 2629 2859 2700 2616 2512 2112 1716 1284 928 588 16 -577 -1331 -1617 -2000 -1598 -1564 -1397 -1339 -988 -1060
1614 -1060 -809 11 88 460 856 1052 1315 1307 1258 808 756 804 147 -129 81 -262 -739 -455 -566 -766 -496 -824
1636 -824 -867 -958 -705 -616 -155 -268 -439 -389 -249 -207 -109 101 28 413 323 680 795 905 883 822 1013 801 934
1659 934 1083 918 848 174 -20 -300 -741 -919 -791 -1162 -1627 -1047 -1318 -1809 -1469 -1157 -1026 -756 -99 -104 301
1680 301 712 990 950 1286 1281 1356 1020 1109 871 519 214 242 -174 -484 -650 -894 -1216 -476 -467 -556 -239 -282 -79
1703 -79 255 266 470 743 885 434 627 734 623 397 247 -38 -181 -409 -422 -417 -476 -11 -387 -347 -218 -467
1725 -467 -569 -79 43 -148 102 -12 -570 -580 -460 -548 -595 -533 -688 -1016 -479 -402 -632 -218 -75 -292 69 493
1747 493 476 755 947 1351 1272 1184 880 603 665 504 231 420 77 -274 -311 -513 -305 -452 -391 -200 -258 67
1769 67 139 119 611 286 619 370 498 451 310 653 275 267 -204 -382 -535 -492 -710 -520 -490 -304 -431 -260 -284
1792 -284 -295 -472 -127 -267 -356 -379 -317 -349 -218 -248 -487 -785 -258 -538 -320 119 324 290 645 677 762 595 1003
1815 1003 864 1086 1383 1312 713 479 500 -213 -460 -322 -665 -701 -1008 -960 -1098 -1167 -923 -902 -670 -369 -406 110
1837 110 241 1042 1166 1048 1350 846 1086 997 527 663 685 249 -26 -272 -766 -1074 -1015 -954 -1221 -1187 -905 -843
1859 -843 -574 -325 -511 -316 -27 286 409 334 1000 767 578 624 462 281 579 191 385 430 229 40 42 -230
1881 -230 -78 -231 -355 -672 -388 -695 -724 -842 -988 -986 -1019 -892 -1050 -1030 -590 -395 -52 158 472 707 639 1381
1903 1381 1166 1266 1532 1785 1306 1022 927 285 101 -11 -413 -805 -1004 -1050 -1062 -917 -642 -865 -473 -314 -326
1924 -326 -40 660 637 1195 1535 1309 1404 1419 1385 1362 1275 1009 524 -109 -187 -516 -1096 -1216 -1308 -1889 -1428 -1829 -1815
1947 -1815 -1589 -1346 -1263 -1225 -463 -456 -332 93 149 461 282 676 836 728 711 625 539 798 767 413 466 505 362
1970 362 216 59 -305 -138 14 -229 -362 -293 -320 -462 -287 -142 -428 66 226 701 684 470 866 952 1169
1991 1169 1323 1284 1056 1317 1090 969 599 252 3 -625 -848 -1128 -1353 -1499 -1775 -1674 -1806 -1543 -1454 -1309
2011 -1309 -1321 -1067 -546 -473 -68 458 725 868 1067 1241 951 684 866 502 573 412 50 -262 -614 -746 -837
2032 -837 -968 -825 -870 -642 -408 -324 -124 -222 174 360 478 447 865 967 1145 757 796 572 487 450 253 311 142
2055 142 381 65 70 -30 -168 -249 -267 -394 -337 -727 -366 -358 -623 -703 -649 -699 -776 -508 -489 -224 47 299 239 255 535
2080 535 505 755 851 905 841 894 668 573 170 76 -237 -365 -652 -545 -613 -758 -714 -1154 -966 -767 -787 -382 67
2103 67 285 435 707 652 822 786 653 850 573 591 674 421 105 -298 -300 -625 -479 -684 -908 -832 -845 -624 -665
2126 -665 -314 -372 -107 15 213 256 277 526 604 876 520 305 416 202 401 347 73 138 55 195 -282 112
2148 112 152 75 156 25 34 35 189 100 -27 77 -210 -531 -326 -503 -541 -452 -232 -329 -249 -159 -306 -48 395 -41
2172 -41 734 201 480 234 448 215 -43 -186 -177 -469 -272 -595 -696 -518 -347 -416 -746 -587 -71 -61 191 426
2194 426 378 806 695 1007 771 1056 753 808 752 532 354 190 -72 -154 -295 -98 -198 -433 -202 -251 -145 41
2216 41 -128 15 -145 150 190 160 177 -157 -216 -288 -258 -335 -590 -307 -273 -248 -404 -389 -129 -392 -189 94 179 -79
2240 -79 296 132 207 280 315 236 -201 -73 -107 -136 -281 -381 -170 -153 -212 -474 -227 -111 37 133 -5 417 536
2263 536 953 553 580 674 791 726 446 397 269 98 -105 -270 -359 -625 -177 -784 -337 -349 -394 -169 -286 -238 -301
2286 -301 61 93 26 -164 81 19 69 100 -74 -114 -196 -362 -52 40 -174 175 45 200 9 176 203 332 196
2309 196 -71 -84 4 67 -223 -227 25 -320 -345 -196 -197 -123 -115 -196 211 157 133 309 361 369 793 389 604 766 602 384
2335 384 -6 22 59 -142 -537 -816 -574 -490 -1092 -600 -673 -478 -420 -252 -187 98 302 357 595 581 638 564 652 604
2359 604 455 155 -21 480 116 -280 -167 -445 -262 -351 -12 -275 -121 -343 -166 -25 -55 -37 -188 88 22
2380 22 74 280 183 -92 -315 -191 219 84 24 241 166 75 143 -48 5 62 -207 -8 -26 -69 -198 -195 -166 -447 -377
2405 -377 -377 -431 -559 -172 -321 -208 -217 -57 -54 349 448 576 932 723 439 854 863 631 815 195 211 15 31 -307
2429 -307 -297 -494 -602 -905 -638 -464 -539 -461 -253 89 -65 332 89 337 304 553 708 460 384 360 198 82
2451 82 66 -106 -340 -603 -412 -226 -576 -651 -416 -479 -582 -406 -146 -212 -197 -94 -117 6 193 55 149 260 434
2474 434 463 176 199 131 176 274 390 257 307 397 209 212 371 -119 -71 8 190 -92 -361 -293 -499 -254 -339 -367 -52
2499 -52 -398 -402 -96 -213 -103 141 409 186 242 504 312 562 404 82 290 139 -107 -270 -411 -457 -620 -422
2521 -422 -534 -622 -744 -700 -264 -255 -484 -51 365 358 503 673 539 649 618 520 347 511 381 148 338 -296 -265
2544 -265 -599 -324 -402 -420 -300 -409 -447 -329 -439 -84 74 -291 -20 103 -31 315 -170 188 246 -158 -304
2565 -304 -163 182 101 134 68 -208 -236 -43 207 97 -150 22 171 -70 -98 107 -353 -321 -161 -287 -375 -246
2587 -246 -200 181 169 -298 66 63 205 48 504 478 210 396 426 204 154 293 166 205 -476 -60 -531 -434 -533
2610 -533 -701 -477 -550 -448 -325 -116 -184 -9 -97 348 242 184 380 581 307 540 449 615 216 -27 -249 -196
2632 -196 12 -282 -278 84 -139 -292 -158 -47 136 -157 251 69 315 104 196 512 151 236 69 26 -298 -182
2654 -182 10 30 -37 -164 -56 -51 141 14 -101 -83 172 425 42 -50 -143 5 46 -53 -336 -190 -233 -424 -445 -605
2678 -605 -625 -492 -440 -238 -312 -78 -240 123 195 231 111 266 291 325 178 561 250 406 212 -7 112 -159
2700 -159 36 -312 -28 10 -122 -35 268 180 209 444 394 373 206 130 422 252 663 276 -176 -42 -70 -328 -197
2723 -197 -316 -227 -322 -79 81 -66 0 101 -134 33 -23 -132 -140 -49 -68 -58 -229 -251 -255 -196 -363 -289 -367 -156 -372
2748 -372 -379 17 15 -110 62 311 518 255 187 371 117 498 -51 244 81 232 -130 107 97 -221 -141 -93 -195
2771 -195 -52 -159 -53 216 273 74 470 568 33 449 411 329 82 272 52 203 91 -158 -162 -364 -402 9
2793 9 -455 -240 -278 -65 183 -265 77 -54 -5 -84 -293 -95 138 -119 104 58 6 -244 -2 52 -182 -42 16
2816 16 90 24 85 240 246 444 51 415 339 9 343 78 -180 -7 -86 -379 -204 -239 -207 -251 -413 -175 -388 -182
2840 -182 39 -3 80 380 326 264 180 160 198 254 37 5 109 -296 -337 -285 -319 -132 -370 -217 -262 -93 -57 39 133
2865 133 104 185 121 267 343 -53 222 271 433 94 164 56 -30 -281 -335 -115 -282 -323 -320 -70 -130 -298 -106 133
2889 133 119 -8 -27 14 81 31 23 -46 2 106 -237 -14 -176 -117 140 -156 -63 88 208 305 98 90 108 58 385
2914 385 113 -53 -231 -214 -320 -282 -259 -440 -550 -289 -215 -285 242 60 279 102 185 171 566 323 451 540 191
2937 191 36 207 209 -128 93 -190 -227 -21 -224 -86 -476 -481 -15 -274 -305 224 -307 -147 -8 180 294 183
2959 183 170 183 341 176 348 121 126 -115 -65 -192 -28 43 128 80 -187 -69 116 -93 4 -175 170 218 30
2982 30 16 -359 204 -91 195 218 328 -213 -40 -237 -160 -53 206 167 41 354 271 344 189 295 89 163 -117
3005 -117 -137 -102 123 -115 -344 62 -492 -380 -218 -183 -85 -94 -96 -200 53 138 125 202 224 357 134 345 320 -68
3029 -68 338 -147 -96 94 -264 -87 -344 -288 -337 -266 -273 -93 -2 -188 218 106 28 71 360 29 102 194 358 172
3053 172 -37 -156 -175 -76 -279 -42 -204 -89 -41 37 -68 21 115 2 -44 25 68 -8 70 452 89 35 -18 -303
3077 -303 -178 -225 99 -69 198 225 35 241 96 410 105 153 -4 -73 192 93 231 -188 21 -34 -40 242 -301
3100 -301 -47 -22 -306 -188 -345 -155 -187 -8 -30 -15 43 180 -36 -43 59 105 328 -69 -167 75 -182 -375 -158
3123 -158 -176 -279 -152 -262 -168 -358 -295 -19 -13 -13 276 174 68 277 159 57 507 46 94 171 135 130 -53 -109
3147 -109 -35 14 -253 29 -89 -200 43 54 339 40 66 6 331 54 41 31 -8 -33 -118 -260 -53 -99 -65 -408
3171 -408 -395 -128 -102 34 124 -237 -279 143 -324 27 56 49 -61 37 -296 -115 -80 -114 -324 -244 -106 -245 -271 -82
3195 -82 -84 247 -146 3 -23 252 189 230 231 142 309 599 195 81 238 99 16 30 -12 -46 -111 -30 -107 -23 133 -154
3221 -154 121 -24 -141 -184 252 -52 -157 151 16 225 58 -70 -77 -250 -259 -337 -379 -187 -217 -230 -117 -150 44
3244 44 58 -99 -44 -145 -60 165 72 -5 -268 -149 -88 -54 -185 52 86 120 -229 49 -152 239 -156 123 275
3267 275 347 232 3 191 425 203 -265 182 94 -73 176 200 -112 81 -204 -184 190 -109 -181 194 76 -18
3289 -18 -16 73 118 321 274 99 163 -283 21 146 -119 -194 12 -94 -242 -214 -19 -235 -29 97 6 170 -171
3312 -171 -123 112 66 88 188 -1 103 -144 -14 7 -124 -117 -61 -265 -324 -173 -38 94 -85 -84 47 34 58 -178
3336 -178 156 219 467 50 -104 230 -27 -156 -227 96 -148 -216 -169 -304 -421 -99 -48 7 186 119 50 69 170
3359 170 149 404 152 -15 212 -92 18 18 -143 65 -383 -356 -277 -272 -84 -226 152 1 188 115 -66 203 -66
3382 -66 409 -45 -21 -38 159 51 -101 -136 -32 183 -110 -135 -160 26 -255 -98 108 -181 183 69 -48 -54 -115
3405 -115 42 156 -64 -266 -32 -205 -186 31 -430 -11 10 125 -46 -34 100 -37 59 -68 305 328 235 46
3427 46 -50 200 11 -28 78 73 -18 121 -98 98 -336 -292 -201 -136 45 192 201 -182 420 62 117 137 66 285 8
3452 8 123 -85 -87 67 57 -148 -466 -97 -290 102 -185 -208 -51 190 61 -14 -269 99 113 -25 189 219 67
3475 67 -163 222 -121 -39 -40 25 -146 1 258 -14 -273 -87 62 51 -282 63 87 36 -56 39 140 -82 -144 -149
3499 -149 -218 81 -256 -109 -92 -253 177 153 -164 -33 78 136 47 465 128 7 61 77 134 -17 159 -120 -25
3522 -25 14 -155 -157 -118 -103 -323 -281 -217 128 -177 69 139 -73 261 406 236 -21 -53 97 274 87 32 -85 -124
3546 -124 -125 -193 -190 -171 -256 -231 -264 17 -104 -43 4 101 134 53 141 -54 21 79 147 -141 -174 -92 -109 -359 -294 -111 -341
3573 -341 -68 -130 -245 179 -29 -62 -139 154 -17 128 -89 135 136 -131 99 351 -250 -14 -61 -4 193 -145
3595 -145 -192 64 -206 309 11 129 -155 402 263 -20 13 -139 -68 -325 -161 -19 -7 -50 -370 -292 -103 -414
3617 -414 -113 -144 -125 106 51 176 -153 196 20 47 53 -8 85 76 -138 48 76 -111 309 -183 -274 -88 46 65
3641 65 -71 -214 113 17 189 131 141 198 286 53 -165 76 78 144 -3 62 -35 -118 170 -1 -85 -40 -75 25 66
3666 66 -193 -27 -88 145 154 -70 82 39 -96 -168 56 -20 -378 -191 -56 -45 10 -167 -93 154 -119 -229 66
3689 66 144 -139 -113 -60 -33 135 295 177 105 110 -49 130 -87 281 -122 17 13 -1 63 -14 -236 82 34 22 389
3714 389 -38 184 123 238 -84 192 101 -182 73 14 2 -15 -138 -269 -57 -99 -137 -76 68 -56 -46 -293 -56
3737 -56 97 190 40 -66 3 -398 109 -47 -89 40 -219 -61 -122 -229 -8 -128 225 -149 -77 -53 -37 93 276
3760 276 260 104 -49 106 344 -8 76 -42 42 -132 -144 -293 -155 -40 -381 -65 103 -110 -51 -134 -40 155
3782 155 80 88 24 384 -110 -36 44 -47 -82 391 -53 -27 -254 12 -42 -377 89 -191 65 -58 -72 152 -83 161
3806 161 116 -172 -61 -30 -78 -38 7 -199 40 -22 -133 -105 -63 121 180 -312 199 -27 -260 227 144 94 77 -141
3830 -141 -27 112 85 260 -152 -197 253 -383 -33 -254 157 -124 -196 -114 -187 31 230 50 -58 253 73 107
3852 107 92 12 -110 -229 37 -179 -34 -312 -179 -160 -48 -150 28 -155 -256 -22 243 -43 195 24 51
3873 51 232 -56 139 214 -109 146 47 -14 -53 -220 -176 -65 -99 -176 -22 74 -58 -97 -57 -14 58 95 -7 27 46
3898 46 65 50 7 81 -184 -245 -135 -90 -11 -41 -214 -94 59 -74 121 -188 79 55 302 17 320 -227 283
3921 283 201 -63 68 -94 16 -23 -116 -378 -69 -24 -86 -169 -22 -6 46 210 99 172 163 302 50 29 -40 86
3945 86 -321 -145 206 21 -184 4 -8 -107 -126 -256 -106 81 96 76 114 216 273 -85 -33 207 392 -86 -29
3968 -29 13 -100 -2 -56 -91 -274 -438 -140 131 -197 -7 65 -4 55 104 16 -111 292 176 186 27 -83 -9 204
3992 204 -18 -116 37 143 -49 -238 -37 -92 0 34 24 58 49 94 -59 -30 84 -88 262 71 -7 129 -183 -74
4016 -74 100 -71 -392 308 -4 60 137 -67 159 -15 189 122 269 277 -52 64 87 -73 52 -61 72 -188
4038 -188 -179 -36 45 -200 -296 -168 -130 -93 35 123 258 36 179 50 143 7 -317 -179 -11 8 -52 184 -254
4061 -254 201 -116 -58 -206 -300 -166 -14 -187 -214 -141 44 1 -28 243 -24 -135 211 266 -33 -209 -64 241
4083 241 -125 250 283 -60 86 -55 34 -25 -66 -180 231 203 -71 75 22 256 28 58 58 247 -53 -111 81
4106 81 -239 25 -74 -186 99 -7 98 -202 -188 157 341 217 -172 83 16 -69 -160 91 -20 -120 -170 -87 -283
4129 -283 -258 67 -325 151 -7 -103 35 -90 141 60 86 224 250 63 36 -56 240 196 133 110 15 95 -193 -160
4153 -160 -53 164 -175 -165 -39 -129 7 -51 294 -95 340 36 4 399 132 -62 -76 -243 -49 60 71 54
4175 54 80 -180 -94 -321 -28 -20 3 33 -143 -97 -194 88 -135 -56 -41 -128 -92 -5 294 14 12 -182 -249 -183 28 80
4201 80 -84 111 61 -50 145 -55 174 -21 -6 69 40 159 -111 255 284 -82 -240 -84 96 18 23 45 -72
4224 -72 201 117 7 200 9 98 133 -40 55 73 -17 42 -133 -35 -175 -47 -87 -50 -94 -137 -100 -333 -15 -168 -59
4249 -59 -37 -122 65 81 -60 -173 -157 57 -45 -274 -24 96 -144 -39 -148 127 -100 -108 212 17 -144 -94 60
4272 60 138 -11 48 77 220 -30 19 4 381 138 152 -64 -271 -91 -169 -208 -114 20 -222 -108 -314 -213 57
4295 57 -253 -47 -40 -39 -48 141 -164 -36 365 -130 17 -5 26 60 -318 -93 -162 68 93 -167 -60 33 81 115 -123
4320 -123 -14 -139 159 -51 35 -51 -298 -35 141 -245 -331 106 155 -126 149 -84 -75 14 204 -56 32 -57 41
4343 41 433 -112 332 287 320 -3 -66 62 54 -167 -66 -163 -72 -56 -415 269 -57 143 -84 -81 -74 26 100 -174 -165
4368 -165 140 43 28 -172 9 -138 -5 -95 -229 15 -144 -97 292 -70 36 243 -74 61 -58 182 114 3
4390 3 -23 -91 110 -102 -33 83 18 -5 -34 -5 7 96 -54 11 228 -133 124 26 37 132 -74 117 108 7 97 -142
4416 -142 29 48 8 157 210 43 -289 -92 54 -142 -62 -103 -11 -246 45 -30 -24 105 38 219 31 54 -365 -180
4440 -180 45 -47 -121 -77 -38 72 29 -47 -101 -187 55 51 -29 59 -51 -50 230 -33 176 0 152 -1 -74 -240 -50
4465 -50 43 -6 75 102 -48 46 224 276 209 -70 3 -61 299 -101 47 -12 -6 5 -30 131 64 -167 41 -3 -49 230
4491 230 -90 100 -382 -205 -82 -1 -26 -84 101 29 -30 129 93 -418 -17 -49 -62 -140 -65 68 -12 162 -268 31
4515 31 -74 -57 -1 -33 89 -79 -101 -206 197 -174 38 12 38 42 -5 -260 50 -74 34 62 66 28 373 161 170
4540 170 36 306 180 -61 19 54 -54 86 28 -66 -119 -37 -285 -3 -81 -257 -232 48 103 23 152 -36 -42 134
4564 134 113 -3 68 299 38 -202 4 -117 -27 -37 3 -163 -77 252 -225 -18 -38 -180 -161 10 121 -61 -161
4587 -161 -7 -144 64 194 250 126 88 5 226 -130 58 -95 46 102 -225 69 -186 -60 -6 206 20 156
4609 156 149 -3 -52 -74 -69 127 4 207 -103 -265 -127 -124 96 -255 129 92 41 42 -31 72 93 -116 54 -145 205
4634 205 167 425 9 -129 114 -48 143 8 187 100 -118 -44 10 151 84 170 -174 137 87 -40 163 -90
4656 -90 62 -44 15 51 -49 -186 92 -36 294 67 -157 -257 83 64 -159 137 238 -176 -121 97 -193 111
4678 111 141 31 -157 187 31 144 -31 62 -49 -95 -27 -157 -160 24 -49 -140 -32 18 352 44 108 250 -313
4701 -313 -34 51 173 144 -1 77 54 -384 -247 -278 -327 57 -62 -35 151 101 -269 -135 130 130 124 72 97 13 -138
4726 -138 16 84 -336 79 -59 -87 -190 107 -151 98 -192 -70 75 60 33 -159 115 -103 106 358 -45
4747 -45 213 31 -69 46 -169 13 -91 200 -49 -312 -23 -64 69 105 154 240 -119 235 24 147 254 -75
4769 -75 240 -95 -33 -106 -123 -24 -24 60 190 144 47 115 -7 61 -48 -247 -215 88 -241 58 205 -92 210 -118
4793 -118 -225 -89 -247 -122 -167 49 -75 -205 -42 146 39 183 86 -176 117 -43 33 144 -134 8 127
4814 127 -16 -34 53 39 44 -151 -99 -17 -153 220 -137 37 239 37 54 83 -31 -232 10 149 -40 122 76
4837 76 -171 482 -265 -53 63 -172 2 -124 -205 -9 -84 116 -25 220 196 89 -25 238 202 328 153 140
4859 140 -106 -317 -147 -43 -134 43 108 -58 -143 -272 15 -243 142 147 -72 120 -178 -2 155 96 75 18 312
4882 312 110 -68 -67 69 -218 103 53 41 109 23 22 -63 44 87 9 -27 -106 37 -147 -44 181 65 -223 73
4906 73 -243 -52 -97 -87 69 6 0 -152 4 -3 -244 -3 125 -30 39 -78 100 -58 -147 -55 108 -27 -112 24
4930 24 -164 -65 -340 137 -19 45 -240 294 -44 76 -200 15 20 -242 106 -227 247 141 47 17 -43 130 144
4953 144 -113 -9 -62 -159 -186 -107 -18 69 105 -232 -319 82 -9 83 21 -49 248 31 98 384 -324 160 -92 -198
4977 -198 195 -137 -291 -252 -103 -59 43 -97 81 -57 239 220 207 43 268 -51 153 -111 421 -162 -243 -115
4999 -115 -154 301 -54 -160 -109 -67 -224 5 16 -41 -58 -132 -168 10 273 -96 59 125 -130 139 73 -38 143
5022 143 10 -197 19 -131 -90 -65 72 -70 -69 205 111 42 67 185 -77 -12 119 -63 11 53 -265 -413 -77
5045 -77 -141 -86 62 72 98 -331 34 209 -173 -106 -140 1 -35 -156 -185 40 158 -250 25 -10 136 -106 -4
5068 -4 -25 231 -46 35 -8 -179 -51 -5 -79 -146 -34 -103 194 -157 -146 -113 -89 -6 13 -214 166 11 -97 -88 98
5093 98 -290 109 68 -103 50 153 60 -21 -3 4 -125 -118 90 -159 -261 26 -128 -70 -166 -126 -113 52 -147 217
5117 217 -23 211 236 43 128 -98 69 -243 51 -207 -66 80 -161 156 -110 -49 203 -214 39 -61 -15
5138 -15 90 -29 124 -5 301 67 282 26 184 42 67 -2 232 -124 -250 201 109 90 -288 20 -38 -30 -51
5161 -51 198 200 149 70 23 -221 -247 136 -150 67 -38 130 -261 -103 165 -232 78 216 61 82 -173 -77 -22
5184 -22 -148 195 53 -48 116 155 81 -146 -348 -137 187 -126 154 205 82 -46 57 -153 30 -89 73
5205 73 -203 115 161 20 200 136 179 -92 -56 172 -206 75 230 5 -141 -153 -250 42 123 -120 -10 69 69 125
5229 125 -69 -219 -181 -6 -97 250 -143 4 -206 -48 264 -146 49 -26 12 -206 -12 85 -160 -53 -153 -223
5251 -223 130 3 -55 -128 -115 -237 -29 279 -84 -27 4 100 -125 76 137 -60 -97 -96 -247 182 103 92 23 -127
5275 -127 -83 59 -168 97 -141 -146 150 -191 -448 -67 54 -121 57 -260 131 38 -45 136 221 -29 -1 142
5297 142 -135 -28 6 -120 164 105 -1 -119 134 110 135 -200 -68 59 -131 -139 -4 -64 -107 -196 -103 58 -250
5320 -250 132 91 116 79 -153 -43 2 19 302 -36 -29 -6 135 -56 12 -44 1 -246 -91 -63 -268 229 -17 134
5344 134 213 -175 183 272 137 -47 292 -105 -97 -106 138 -101 157 44 -148 19 -17 56 103 116 81 -160 131 191
5368 191 20 20 15 170 -136 -75 232 219 -199 -101 29 118 171 103 69 345 77 -360 -2 -210 -50 272 61 -11
5392 -11 35 -53 80 -337 69 -196 -78 252 -295 -215 89 364 -78 -256 -3 33 10 -163 -197 264 -51 20 72
5415 72 -130 -232 -105 33 -72 0 -215 -229 37 -290 -67 36 -35 -111 -90 314 149 -37 77 -24 245 22
5437 22 -114 -10 -175 -90 -238 -169 84 -9 175 16 -370 -183 -49 -91 -2 214 -135 124 -88 234 223 103
5459 103 130 244 -59 -13 -299 403 166 46 112 -329 69 161 -178 93 -110 -166 5 -121 -22 -62 298 75
5481 75 -174 8 324 28 155 111 -322 197 119 -25 110 -306 32 -46 -190 -47 62 -10 -17 -47 -79 -61 86
5504 86 58 337 38 22 -216 -3 -78 -55 -36 49 -234 -312 -52 -362 88 -76 142 -190 -224 -60 144 53 58 20
5528 20 -57 -72 191 -9 35 -222 77 -19 -154 51 142 -107 -38 -153 -181 26 -35 35 50 91 -182 -106 -101 -70 -6 132
5554 132 117 121 -191 -142 63 114 172 45 -81 130 21 25 -184 89 12 -165 -36 -194 300 -89 114 -9 -76
5577 -76 -23 86 -51 208 160 -292 -41 124 -151 92 -94 -107 -63 116 239 279 226 127 2 152 206 -121 57
5600 57 73 -48 39 144 4 -73 25 169 18 -47 34 -142 49 -342 261 -3 -20 80 94 135 -221 105 217
5623 217 77 42 -77 -160 -347 -138 45 -81 -291 212 193 167 160 12 162 -5 53 -93 159 -19 187 -161
5645 -161 36 40 290 38 -70 19 131 -75 -57 32 -148 -24 -62 79 -128 84 -121 103 158 39 125 -12 23
5668 23 -74 -83 -21 -121 56 2 -103 78 65 148 292 250 -44 -287 -25 200 -142 -60 97 59 -239 -147 -71 95
5692 95 -87 6 -97 -25 430 193 66 58 78 266 75 -4 126 -93 -234 80 -146 40 -25 -54 -154 -27 -17
5715 -17 143 72 -188 171 28 -35 105 114 -135 30 140 59 88 -102 -115 -214 366 270 10 50 -13 -214 -78 137
5739 137 138 192 64 -166 -80 41 -55 5 237 62 77 -53 297 75 -29 46 7 53 -141 163 -142 -205 106 31
5763 31 -63 -5 -85 -69 -94 -153 -201 73 -248 232 160 100 -179 -71 -164 -19 -74 195 -7 -41 -45 -91 -3 -220 -298 -61
5789 -61 135 -139 -87 45 121 21 -130 72 60 -24 16 -112 42 -62 117 -229 -65 36 -42 37 -329 237 134
5812 134 -14 60 215 63 -22 50 236 286 172 216 -47 51 -145 111 129 -94 -56 71 85 57 42 -36 168 -361
5836 -361 170 -69 53 4 3 49 68 22 4 -190 17 -112 154 -240 -112 1 -25 96 73 -172 -100 148 174 -23
5860 -23 -77 -71 173 248 58 -62 81 -417 -133 46 -119 -146 -21 44 116 -287 2 258 264 28 -127 -229 -50
5883 -50 -84 26 135 -83 20 -130 22 -191 -3 89 88 3 193 -33 64 186 9 51 -37 47 167 177 208 106
5907 106 -299 -32 -89 -234 215 -140 -17 243 -236 -207 50 -43 -68 196 -65 35 -58 -141 -66 -104 76 2 46
5930 46 54 369 89 13 -128 56 43 49 -130 10 105 -142 76 86 -278 -242 -138 -126 -179 -82 -25 -33 -101 -126 294 215
5956 215 154 63 -76 -75 -140 35 43 3 -26 -73 -223 157 1 175 -57 -133 63 -174 -107 98 -174 166 142 -7
5980 -7 177 -321 -183 -102 -161 -215 -33 142 53 -97 -37 -43 -83 11 24 28 -133 34 183 211 -138 -311 -57 -188 -141
6005 -141 162 -24 -18 -196 299 -125 17 23 -2 112 -173 9 -127 -125 129 -55 -8 108 -155 -27 153 -17 -128
6028 -128 207 252 95 9 103 182 -189 -189 97 257 99 65 117 -196 -75 108 4 -315 160 169 -163 -208 -223 136
6052 136 31 100 90 -87 159 8 51 243 65 25 206 57 -260 235 -111 76 -44 162 -84 -267 315
6073 315 -182 -82 205 -9 90 187 237 -95 -30 -71 -4 -100 15 51 92 -57 -271 -260 -23 -134 19 108 -82 131
6097 131 90 -86 -174 295 176 -13 293 75 -117 189 142 -42 44 -22 64 -77 24 -152 -140 216 -100 110
6119 110 77 11 -117 -119 -198 -50 138 16 421 155 148 48 15 146 -114 32 87 -69 -22 2 -108 291 123 112
6143 112 -33 -152 -120 64 62 176 67 -48 -8 127 -89 -275 -219 -42 98 -239 140 -54 80 11 113 12
6165 12 133 76 -125 -95 -185 236 200 -129 -20 53 -62 -27 138 101 -228 77 -39 110 -127 -288 -70 188 34
6188 34 -67 139 -154 -147 -7 18 103 75 -97 212 -7 -101 41 -17 -142 -44 67 -120 -120 52 -153 57 -76 94
6212 94 -135 -242 -39 99 -285 -9 92 284 41 -119 -11 139 133 -176 -10 109 -102 47 285 -190 -6
6233 -6 -122 98 -9 -251 -221 15 216 30 -158 109 46 7 -11 121 11 159 30 192 -2 180 -54 245
6255 245 -69 -100 17 -61 -35 -263 -39 147 63 81 157 2 100 -203 164 22 -137 80 -43 48 83 208 -240
6278 -240 -18 21 22 -177 80 377 -212 29 -197 -197 8 31 77 46 114 122 -89 169 -37 -190 134 69 153 150 147 140
6304 140 -125 -130 56 182 -51 247 172 29 221 -75 36 54 83 86 33 -135 -35 110 95 106 -131 245 -115
6327 -115 -147 44 370 286 -3 26 98 5 143 128 -106 61 -85 -312 164 -182 182 79 151 41 169 155 -130
6350 -130 -16 -202 24 -103 -98 -221 -22 22 -80 -60 -100 -120 -97 -53 92 212 -2 -276 61 -26 -78 63 -10 111
6374 111 65 -108 68 -147 109 -39 -321 -190 -212 -61 -195 1 41 -102 -23 391 5 68 151 97 211 -124
6396 -124 -34 -88 -71 -37 141 87 112 261 -201 -236 0 -52 -90 -288 -44 74 -129 -274 -4 229 -36 96 85
6419 85 -116 -133 -233 -127 -51 50 268 35 84 -92 130 34 -40 94 86 25 150 182 -39 -10 -64 79 -196 -125
6443 -125 123 305 288 -111 -213 185 70 -24 146 287 -51 -271 197 62 206 -82 -352 -77 5 36 -42 25
6465 25 -37 -36 -57 -35 -31 -54 -73 -8 28 -44 -52 -239 -75 -66 -221 249 203 -18 20 -61 -60 172 -216 41 16 -175 21 -35
6493 -35 -311 211 -95 -190 95 41 -52 170 -65 -146 203 -9 -14 -249 104 32 -50 37 37 -52 -47 -28 147 -65 -44 -96
6519 -96 -55 11 -67 300 -79 -78 -13 -121 34 -36 -24 24 -345 86 256 -159 90 124 119 0 206 3 -99 -102 -104 -352
6545 -352 3 47 -176 258 -49 22 140 29 336 -38 -366 107 -54 -153 21 39 -22 98 -176 -63 -304 33
6567 33 24 -55 -153 -8 61 -221 166 18 0 -86 -102 -46 -60 59 60 8 194 86 -176 168 41 7 119 -87 -168
6592 -168 -81 89 134 -193 39 -81 269 30 -119 -137 -110 36 6 -30 -29 254 80 -1 24 -203 30 -21 -57 -72
6616 -72 -33 -157 213 238 114 37 75 355 16 -22 158 -112 200 186 43 17 201 -199 -25 91 -79 100 51
6639 51 -259 -174 175 -176 -165 -58 196 127 184 -116 187 -245 102 30 -156 167 -52 -63 -84 62 -215 -68 237
6662 237 -27 -85 278 197 209 11 27 -95 -16 -14 -14 37 -64 71 -155 50 64 27 125 -69 -55 -49 164 -68 184
6687 184 219 182 -237 -186 -69 54 58 -162 26 126 -66 228 -181 150 92 -75 70 -62 41 -24 256 -33
6709 -33 48 -318 59 -3 46 83 110 247 -116 78 45 105 -130 -22 26 -85 12 115 25 -146 -85 -189 220 221 -46
6734 -46 101 -145 66 26 -145 -44 -7 1 -12 -76 -123 -132 184 -158 109 -16 108 32 -56 227 12 67 2 -103 -12
6759 -12 -94 -90 -27 -284 -62 -267 -64 69 20 134 52 -160 -53 -64 50 -39 19 -64 -34 -29 -130 281 103 -245 3
6784 3 123 415 -150 -329 109 133 -75 -523 26 41 71 -44 -172 -39 95 220 54 52 126 -22 -57 -142 10
6807 10 91 265 29 -17 -44 -17 297 67 18 98 18 -41 152 -22 -149 257 -41 -108 -217 117 154 43 60 5
6831 5 -11 -179 99 3 -165 -78 121 -399 -21 -68 -131 -132 34 82 -30 -90 119 58 -67 16 -2 -126 265 -344 42
6856 42 -43 92 -83 35 60 214 -13 -45 -5 -42 -129 -24 -91 -7 21 28 -44 121 98 51 -34 -256 28 -7 215 20
6882 20 158 -65 121 -188 151 109 178 33 168 125 160 -17 361 244 -1 152 -119 64 -141 10 -11 -236
6904 -236 -10 -44 101 -134 -55 -69 -94 125 -152 -81 25 -173 45 68 -151 -293 20 -25 -314 -222 137 -6 -31
6927 -31 -5 -167 25 -29 -122 -4 0 76 60 7 231 -126 247 -91 60 -58 104 -121 66 -43 -321 -62 -272
6950 -272 25 146 -7 -165 -50 32 -382 27 -43 124 -116 -194 -63 -246 121 -260 -152 46 134 -182 -485
6971 -485 39 -131 -98 259 -24 222 129 -122 123 -208 -73 155 -170 -75 -21 157 257 -181 -39 37 -59 221
6993 221 206 44 38 -71 -32 3 -162 -153 66 -23 -72 -113 29 247 -206 -135 -27 134 25 -24 107 277 -96 -118
7017 -118 53 293 -221 140 -27 -60 -12 -56 -27 116 72 115 189 -87 52 -14 -73 -209 -106 20 -133 208 -38
7040 -38 69 -135 -175 140 82 135 142 -210 -55 -292 48 -131 -70 152 -69 -35 -81 -30 18 107 -166 -150 -93 -12 -110
7065 -110 -209 -149 17 28 96 93 117 -100 77 -99 -148 65 -127 59 120 99 -73 279 -22 7 -212 -50 207 -46
7089 -46 47 -169 -108 235 -149 198 -16 -148 -208 116 -16 76 -256 -157 -64 -29 227 59 -276 19 101 205 55
7112 55 -19 191 -149 72 178 18 -264 -180 148 46 117 135 121 53 41 70 -146 62 -159 -246 -108 195 19
7135 19 -235 176 -7 241 -87 -149 29 92 122 11 116 -44 77 143 55 -63 128 70 -225 -127 219 58 3
7158 3 135 144 254 -17 55 -49 -44 -50 -31 -51 -278 35 28 -147 -31 11 53 -229 -81 -138 201 -140 -141 68 64 5 -83
7185 -83 -118 -63 -193 90 86 31 -21 197 -51 -46 -166 110 81 -7 220 -123 82 26 22 205 79 204 54 70 261
7210 261 -241 -257 64 -71 -61 -37 -34 121 -205 -83 -98 30 71 6 192 -107 -34 122 -46 216 -88 264 -45
7233 -45 3 -116 122 -138 73 -148 -114 -9 55 94 -25 26 -125 173 -69 -105 20 -230 -65 57 273 138
7255 138 -84 87 98 -21 -208 -246 112 7 -50 413 -99 53 -325 43 223 -84 -110 192 -119 -18 -203
7276 -203 -103 -39 -47 -186 -161 147 -51 4 8 -386 -213 -149 -177 47 -117 -151 -199 -64 113 257 -64 -250 -70 166
7300 166 -87 15 46 153 43 48 7 -175 -102 16 -166 4 -299 -89 129 -32 90 -142 -18 53 -317 -166
7322 -166 232 -1 -196 -193 -29 -22 111 150 86 12 191 -121 177 135 120 -94 217 58 -31 176 -140 -81 -130 67
7346 67 118 -225 -217 -312 -27 -88 -197 66 -84 -99 -102 65 177 -13 -68 -124 177 -60 -46 -43 -219 -3 -112 35 -235
7371 -235 -118 -160 53 20 119 262 -88 -84 179 -11 77 220 -141 -160 55 -116 -167 131 108 114 -46 -45 86 25 -64
7396 -64 -104 36 -31 -22 40 7 31 91 215 -64 114 94 -17 35 -22 41 -133 -288 89 -13 223 185 142 109 -248
7421 -248 119 -103 -26 186 180 114 37 51 -83 -49 10 57 50 144 46 -43 -45 -337 10 -130 145 -233 206 -218 166
7446 166 -239 -108 -10 342 -76 -73 105 170 -23 -85 44 1 129 -58 3 152 -117 -302 -233 -104 -27 18 143
7469 143 -152 29 116 118 166 73 -139 55 105 -36 -14 -195 -108 58 35 -122 -224 410 -150 72 -6 76 -111 -106
7493 -106 -20 -23 312 25 -42 -24 -150 -392 -184 -46 1 -52 74 243 58 59 193 118 -263 9 -69 64 86 204
7517 204 -135 46 -40 74 -139 106 -267 -207 -243 52 -48 -176 -174 96 -111 42 124 55 -49 -253 122 -2
7539 -2 -87 40 153 33 -71 61 -211 -145 225 -301 16 10 19 200 -70 179 282 76 -24 3 -181 -36 -67
7562 -67 46 -65 -40 -234 -159 172 -285 91 69 -281 -31 55 -29 -77 -124 89 121 -47 121 -18 -111 -141 -212 19
7586 19 -168 115 191 -145 -69 -37 -111 -34 120 26 25 -150 -218 -32 257 -31 99 2 -99 100 266 113 -44 69
7610 69 188 -131 -69 134 34 -36 -102 -33 -66 -31 -103 160 -25 141 155 133 60 -30 -121 -21 237 14 40 -3 -29
7635 -29 -236 -90 212 -12 171 -12 -78 -64 139 -90 122 -77 -97 -62 163 101 50 -30 -60 60 -205 91 92 -129
7659 -129 -54 43 -42 56 -57 32 -280 -195 -141 -122 122 81 53 71 247 12 7 -410 38 -37 -162 39 -20 -244 -29
7684 -29 77 90 -228 216 -74 -78 -14 24 75 -4 29 61 -337 130 262 -65 -82 -12 -151 57 -13 141 -71 140
7708 140 141 -65 -13 -109 81 73 -72 -40 -41 -147 33 -71 163 -55 -67 27 183 254 -72 47 -102 -67 91 66 -78
7733 -78 -3 98 -21 -73 1 -97 21 112 -58 70 -197 -235 142 -255 198 -128 38 105 8 136 -48 68 -88
7756 -88 105 -4 216 157 11 118 -4 -122 -18 -300 7 -135 -151 -11 -67 -89 -87 -224 60 -245 141 -15
7778 -15 -75 -15 -112 80 -300 206 90 83 -316 157 -248 -89 -194 -110 -59 45 -28 -138 73 71 -256 -176 -24 364
7802 364 98 53 211 -166 326 36 51 -95 309 43 -2 17 16 -250 36 -149 -53 -97 -175 50 -7 109 99 66
7826 66 -53 -13 -92 74 28 87 -141 -121 171 43 81 218 72 20 -21 32 19 244 205 -6 -143 58 3 143
7850 143 147 82 -4 211 172 -2 -41 -162 89 35 -90 118 -98 0 124 27 112 -32 -120 44 -65 6 -93 -12 72
7875 72 10 59 41 -34 14 -7 -119 116 -187 58 -59 -120 281 316 -177 66 -137 -111 54 358 61 -71 -62 -87
7899 -87 6 -138 45 -63 -12 -89 50 -82 162 99 -60 248 -168 -90 -13 -133 -32 -96 206 11 209 101 106
7922 106 -111 -139 -150 39 -190 32 -98 -91 -213 -235 60 170 -26 11 220 -140 -102 -36 -174 -32 -12 -223 138
7945 138 47 125 96 206 -70 41 -43 -37 -341 -174 -72 -43 35 270 237 66 270 -132 -28 -14 -277 -358 34 355
7969 355 -231 -163 -351 -8 13 -181 -11 -8 -35 172 193 -140 -62 329 -178 41 91 33 22 -89 276 -134 -36 17
7993 17 -92 -115 -239 -83 -292 -72 -35 47 -15 120 245 -135 90 -51 282 87 80 93 38 -79 47 122 233
8016 233 136 -253 -58 -155 -98 83 149 -5 35 -310 -78 -142 17 -183 151 66 -74 -213 106 -191 -160 -13 -8
8039 -8 -124 255 -45 19 -204 6 -184 245 160 -71 -57 -223 -98 -119 61 104 -227 -30 80 178 -149 -110 -355
8062 -355 -79 13 -195 -22 12 139 -2 125 -140 169 28 -14 66 1 -188 -59 81 -48 -357 -109 92 311
8084 311 4 -128 37 -22 -186 29 -63 -58 -37 43 -102 -59 95 -59 23 115 48 -41 -208 -149 -138 -80 60 106 257
8109 257 55 -13 247 -117 -189 38 -144 101 23 -158 89 50 239 150 106 44 -45 49 122 -141 -159 -110 107 235
8133 235 -159 -41 -144 -170 277 152 -135 -218 98 -72 41 -106 67 238 58 250 56 -14 -52 -18 -24 -39 89
8156 89 20 -6 -97 -63 -132 330 -155 -88 12 14 -58 41 85 184 -54 191 -94 75 42 -101 -27 111 90 -27 -45 151
8182 151 25 -114 196 146 -178 154 -86 -53 55
8191E5
$$ Imaginary data points
##PAGE= N=2
##DATA TABLE= (X++(I..I)), XYDATA
0 0 0 0 0 0 0 0 0 0 0 0 0 0 8 -8 8 -8 8 -16 16 -17 24 -28 32 -40 48 -56 64 -72 81 -96 110 -124 142 -160
34 -160 180 -202 228 -256 287 -319 354 -394 436 -484 536 -592 654 -721 794 -876 965 -1061
52 -1061 1171 -1293 1427 -1580 1754 -1954 2187 -2460 2788 -3192 3702 -4366 5274 -6595 8709
67 8709 -12645 22525 -106065 -127357 14273 -55729 -52883 -30366 -70218 -107509 -20612 14947
79 14947 -12263 7299 63448 40690 16971 39547 55898 29831 21432 32979 43303 39867 35718
92 35718 11975 -28577 -43759 -1964 23421 -11281 -37571 -14178 -12170 -30821 -15296 3027
104 3027 -9142 4900 29981 10334 1442 44033 47336 5651 14702 49839 39524 32434 48805
117 48805 26418 -7560 8728 24612 -1231 -14865 -913 -935 -18204 -31980 -39654 -36591 -29301
130 -29301 -32507 -35531 -27601 -23146 -23281 -20484 -24016 -21989 1184 13676 2818 3956 18195 17911
144 17911 15189 21532 16498 11297 22152 19497 -2560 -5292 4472 -2274 -9684 -9449 -20206 -25387
158 -25387 -12065 -11683 -24605 -15886 937 -3843 -8592 3075 11544 14093 20857 22422 18035 21734
172 21734 28528 28038 23939 19717 16704 16937 10021 -3578 -5922 -471 -5001 -13040 -14118 -18100 -21943
187 -21943 -17780 -19530 -25740 -17734 -6080 -9976 -14320 -7103 -4730 -4145 4206 6673 1262 5981 13310
202 13310 8437 5604 11807 12880 8871 8137 5066 181 2492 6141 764 -3932 -2579 -1914 -5924
217 -5924 -9759 -11707 -9228 -4771 -4772 -7152 -5253 -3546 -3853 -329 1709 1646 6023 11181 7993 6483 12014
234 12014 14124 10693 9974 8089 4165 4784 6402 -185 -5327 -2450 -2036 -7456 -10153 -11054 -13185 -11261
250 -11261 -7649 -7363 -6611 -3265 -2111 -2910 -1319 2234 4500 5126 4587 5131 8101 9861 6860 2704
266 2704 -80 -1148 950 2655 -1081 -3581 -2119 -1843 -3883 -3541 -3259 -4899 -3942 -361 441 682 3312
283 3312 2118 -2541 -1617 2564 2342 676 491 -736 -693 2612 3861 -329 -3033 -1680 129 1360
299 1360 2713 3640 1639 1050 1094 1070 1572 1512 172 -1197 -2090 -710 417 -2186 -5474 -5457 -3784 -2826
317 -2826 -2191 -2708 -4349 -3442 846 3334 2200 2544 2904 1614 1652 4509 4946 4129 4291 3545 1877 1820
335 1820 1488 -1150 -4062 -2788 -702 -47 -585 -1874 -4331 -4871 -3582 -2817 -2713 -2174 -922 -69 -707
352 -707 -1257 -1039 -1585 -1574 -309 1703 2596 3071 3841 2794 2145 3820 5574 5043 4720 5833 5259 4007
370 4007 3451 1786 -216 -546 -152 -2699 -5518 -6075 -7186 -8317 -7520 -6853 -6794 -6008 -4784 -3955 -3277 -1359
388 -1359 794 2546 4846 6809 8081 7575 5823 4667 4414 3846 3732 2776 168 -2235 -3267 -5247
404 -5247 -7586 -9134 -8888 -8452 -7292 -4811 -3494 -3538 -2686 -1462 -10 2865 7082 8573 8910 10457 10703
421 10703 10442 10017 9257 7783 7397 8027 6503 4016 997 -1749 -3306 -3729 -3676 -4801 -6265 -8092 -9467
438 -9467 -9780 -7998 -6705 -6074 -5600 -4681 -4440 -3626 -2580 -1140 991 2732 5091 6294 5755 3728 3411
455 3411 3966 3770 3628 3149 1371 -1588 -3400 -4916 -7327 -8601 -9880 -11420 -11807 -10230 -9476 -8762 -6741
472 -6741 -5443 -4108 -1015 2625 5444 9059 12691 15137 16726 17909 17830 16892 16920 15940 13786 11635 9100
489 9100 5927 1981 -1367 -3866 -6607 -9379 -11906 -12253 -12033 -11831 -11256 -8857 -8277 -7933 -6591 -3700 -2058
506 -2058 1001 4348 6189 5974 5253 4399 4157 5210 4463 2862 1911 443 -3078 -4895 -5211 -7208 -8904
523 -8904 -8876 -9371 -10512 -10357 -10144 -9599 -6996 -4805 -3694 -2621 -1157 143 1868 5290 8515 10283 10845
540 10845 10713 11333 12347 12348 11256 11681 11172 8568 5722 5147 3644 295 -2124 -4275 -6086 -7602 -8768
557 -8768 -8926 -7762 -6798 -7497 -7011 -5359 -4888 -3184 929 4937 6513 7302 7320 6954 6682 6777 6070 5615 5496
576 5496 2288 -1693 -3633 -6405 -9485 -11280 -11689 -12122 -13027 -13866 -14347 -12686 -9478 -7172 -4981 -1296
592 -1296 756 1575 4675 8924 11026 12313 13202 13874 13733 12749 11230 10017 9164 7414 4926 3765 2120
609 2120 -1350 -3329 -4345 -5555 -6693 -7171 -7963 -7839 -5589 -4941 -5123 -4333 -4177 -4141 -1897 1940 3652
626 3652 3703 4005 3812 3445 4335 5130 4522 4022 3674 1972 387 -125 -2280 -4701 -4986 -5034 -6425 -7666 -9060
645 -9060 -10121 -9518 -7801 -6029 -4436 -4338 -4157 -2842 176 2822 5380 7259 7795 8104 9064 9789 9053
662 9053 8853 7872 5991 5009 5112 2503 -609 -1838 -3098 -4697 -5070 -5306 -6638 -6947 -4575 -2730 -2273
679 -2273 -1237 -982 -1315 400 3594 5205 6212 6419 5343 3899 3883 3571 2776 1777 892 -405 -1217 -2296
697 -2296 -3883 -5127 -5566 -5447 -4932 -4382 -4981 -4863 -4043 -3422 -2563 -662 -431 -1347 -459 971 1290 2077 3123
716 3123 2943 2357 3305 3852 2822 2935 3100 2053 1948 2827 2284 960 723 190 -1281 -2262 -2546 -3242 -3333
735 -3333 -2771 -2844 -3097 -2896 -3260 -3307 -2612 -1151 215 1452 2442 2422 2778 3077 2878 3531 3659 3407 2711 2893
755 2893 2001 811 410 -232 -1691 -2020 -2641 -2986 -3199 -2634 -2044 -1868 -1299 -1097 -1551 -1494 -33 398 1052
774 1052 2021 2065 1657 1262 746 491 360 39 168 -112 220 -420 -425 -34 -327 -603 -441 28 429 1109 1020
795 1020 877 810 542 -580 -734 -963 -1047 -1602 -976 -1421 -2001 -2370 -1939 -2067 -1514 -460 -15 51 880 1801
815 1801 2045 2570 3334 2902 2384 2175 1877 2007 1476 960 148 -56 -966 -2187 -2764 -3319 -3748 -2853 -2077 -1954
835 -1954 -1738 -1413 -1610 -1776 -99 441 875 1809 2250 2349 2735 2918 1827 1093 1319 1432 1455 1967 1664 252
855 252 -281 -496 -1282 -856 -923 -1262 -1221 -1113 -1454 -1728 -2054 -2636 -2465 -1274 -239 -518 -518 -595 56 1199 2543
876 2543 3166 2827 3061 3153 3578 3544 4017 3236 2326 2455 1293 267 -1249 -2935 -4573 -5064 -4921 -5172 -5123
895 -5123 -6045 -6525 -6256 -4962 -4080 -2833 -1240 -85 1026 2872 3837 4099 4180 4595 4694 5316 5759 5034 3556
914 3556 2440 1266 377 -487 -1373 -2418 -2717 -2710 -2796 -2766 -2721 -3431 -2402 -974 240 930 1383 2230 2097 3487
934 3487 4188 4722 4604 4573 3441 2935 3109 2625 1688 1152 748 -576 -1098 -2008 -3784 -4671 -4571 -4506 -4576 -4206
954 -4206 -4868 -5534 -5428 -5057 -4784 -3755 -2687 -1882 -898 434 1198 1342 1998 2488 2613 3927 4490 4058 3813
973 3813 3431 2175 1218 830 -195 -1302 -1878 -2211 -3178 -3253 -3218 -3726 -3398 -2155 -1406 -557 1082 1789 2872
992 2872 4703 6201 6488 7218 7297 6905 6100 6376 5452 4442 3538 1795 -1 -1938 -3748 -5478 -6208 -6500
1010 -6500 -7401 -7143 -6946 -7340 -7256 -6118 -5327 -3992 -2411 -1471 -631 497 1996 2072 2833 3718 3179 2803 3048
1029 3048 2712 2044 2609 2207 917 39 -570 -1445 -2275 -1632 -1850 -2105 -1694 -1870 -2430 -2181 -1403 -1290 -482
1048 -482 706 1429 1978 2760 3378 3620 4666 4975 4952 5308 5174 4511 4879 4308 3024 1947 1252 -806 -2130
1067 -2130 -2315 -3551 -4529 -4901 -5335 -6227 -6262 -5455 -5646 -5229 -3625 -2736 -2330 -608 653 1145 2377 3409
1085 3409 3210 2850 3308 3135 2501 2493 1885 547 -737 -1690 -2795 -3047 -3324 -3761 -3584 -3422 -3456 -3184 -1992
1104 -1992 -1412 -643 584 1689 2523 3780 4515 4211 5040 5472 4677 4403 4274 3512 3032 3299 2492 1128
1122 1128 199 -868 -1876 -2239 -1676 -2131 -2700 -2754 -3385 -3587 -3467 -2957 -2714 -2260 -1611 -1339 -1601 -1097 -674
1141 -674 -170 1325 1802 1913 2127 1654 1338 1746 2416 2472 2132 1569 445 -429 -715 -1383 -1742 -2047 -2299 -2667
1161 -2667 -3125 -2853 -3218 -3083 -2000 -1645 -968 315 782 1343 2018 3191 3244 3384 3368 3127 2957 3719 3300
1180 3300 2452 1353 175 -1118 -1223 -1528 -2317 -2159 -2154 -2603 -2966 -2192 -2121 -2153 -1335 -348 -63 488 961 826
1200 826 1127 1563 1715 1557 1501 1128 567 546 980 450 49 162 -338 -482 -473 -257 -804 -315 40 -183 138
1221 138 17 -420 -145 -387 -305 -283 -486 -329 -266 383 -227 -203 -99 -263 -396 185 972 985 1478 1403 656 327
1243 327 44 -25 -132 483 -9 -618 -1042 -1322 -1639 -2184 -1969 -1489 -1474 -1017 -792 -424 194 416 695 1014 1121
1264 1121 1100 1517 1500 1930 1667 1554 1010 596 405 93 -168 -78 -114 -191 -383 -327 -301 -590 -230 0 -254 -171
1286 -171 385 155 -212 229 230 -194 -849 -645 -1160 -849 -315 -535 -444 -621 -735 -405 -8 471 553 958 1326
1307 1326 1413 1512 1150 999 785 426 315 -102 -240 -783 -1088 -1402 -1663 -1913 -1983 -1668 -1469 -1110 -841 -472 418
1328 418 836 876 1007 1498 1906 1670 1870 1854 1824 1453 933 544 90 -250 -701 -947 -1170 -1359 -1557 -1694 -1493
1349 -1493 -1433 -1384 -1132 -972 -574 -80 105 604 838 764 873 1164 1253 952 961 1164 1195 1129 1321 1058 779 690 649
1372 649 329 -14 -144 -511 -99 -605 -808 -1058 -1221 -1516 -1601 -1556 -1305 -1006 -483 -333 109 295 413 875 1240
1393 1240 1765 2121 2069 2333 2018 1637 1165 752 -91 -698 -951 -1548 -2141 -2614 -2964 -3334 -3242 -3436 -2810 -2592
1413 -2592 -1881 -1521 -973 192 953 1624 2381 2837 2918 3349 3841 3242 3402 3157 2610 2125 1692 623 -160
1432 -160 -725 -1330 -1498 -1495 -1690 -1842 -2142 -1781 -1688 -1994 -1196 -861 -569 433 893 1161 987 858 798 929 1140
1453 1140 1129 1185 1169 893 705 324 -198 -667 -856 -1036 -1425 -1185 -1748 -2195 -2374 -2109 -2425 -2280 -2249 -1877 -1735
1474 -1735 -1473 -685 -320 387 859 1302 1669 2120 2774 3119 3514 3425 3077 3389 2952 2451 1627 1119 223 -355
1494 -355 -519 -1239 -1368 -1832 -2067 -2438 -2597 -2184 -1951 -1160 -187 211 981 1113 1100 1480 1705 2000 2204 2262 2156
1515 2156 1354 808 212 -878 -1399 -1829 -2194 -2715 -2736 -3107 -3295 -3449 -3258 -2913 -2822 -2004 -1703 -1113 -409 243
1535 243 503 926 1468 1636 1864 2245 2505 2535 2454 2277 1954 1977 1707 1400 931 952 601 113 246 -9 -504
1556 -504 -652 -796 -1029 -1171 -1303 -1167 -1080 -565 -326 -167 55 224 444 1047 1212 1454 2094 1848 1712 1648 1304
1577 1304 1005 511 264 -446 -1013 -1257 -1839 -2081 -2438 -2555 -3207 -2915 -3070 -2704 -2099 -1529 -1036 -648 116 450
1597 450 927 1490 1730 2029 2237 2191 2140 1851 1359 1151 1085 639 103 -271 -756 -869 -1252 -1039 -1202 -1243 -981
1618 -981 -954 -954 -581 -26 352 567 999 958 756 934 770 708 886 662 701 930 249 160 -299 -117 -278 -428
1640 -428 -511 -442 -736 -479 -400 -535 -762 -436 -804 -997 -869 -651 -236 -378 -318 -9 154 326 341 385 878 877 1473
1663 1473 1454 1323 1128 1093 1084 899 272 -148 -534 -503 -536 -723 -1116 -1326 -1754 -1946 -1465 -1147 -1198 -611 -353 -317
1685 -317 -162 242 721 247 868 1307 441 1236 1007 434 59 447 -60 -257 -741 -727 -519 -551 -181 -589 -355
1706 -355 -402 -117 -162 655 411 592 915 809 551 605 428 374 375 507 282 299 6 321 -66 88 162 83 -175
1729 -175 -162 185 240 520 501 191 -10 -468 -351 -571 -465 -798 -838 -959 -1298 -1217 -875 -1361 -1281 -590 -607 -409
1751 -409 -333 67 13 338 650 709 754 479 620 566 828 413 338 305 -139 -387 -388 -337 -406 -210 35 54 230 208
1775 208 182 14 386 722 856 857 980 712 292 586 435 172 114 23 -88 28 94 -261 -255 -70 -314 -118 -66
1798 -66 -2 -36 -43 -75 -446 -409 -562 -732 -740 -725 -754 -913 -695 -582 -676 -354 -139 -87 36 477 606 1032 1254 1194 1178
1823 1178 1367 1238 958 768 770 172 -107 -100 -587 -803 -902 -1189 -1653 -1199 -1318 -979 -721 -354 5 211 257 383
1845 383 636 1103 1218 1006 993 1188 982 691 747 -54 -217 -86 -445 -435 -715 -690 -865 -798 -881 -987 -829 -724
1867 -724 -616 -441 -232 84 -48 344 383 532 625 331 231 585 617 666 758 824 715 576 433 587 445 342
1889 342 221 -93 -39 -513 -992 -1072 -1192 -1286 -1361 -1371 -1226 -1221 -894 -903 -596 -446 152 185 474 810 1123 1208 1137 1357
1913 1357 1115 1084 989 637 -49 30 -476 -369 -987 -1065 -1392 -1318 -1254 -1478 -788 -363 -487 427 492 593 793 1514
1935 1514 1327 1614 1934 1745 1698 1970 1712 1016 895 387 -102 -258 -262 -634 -826 -913 -1228 -1316 -1429 -1486 -1262 -1042
1957 -1042 -848 -627 -635 -424 -382 -555 -317 -96 -150 90 141 -47 513 395 377 275 417 205 11 199 305 -105
1979 -105 -82 -231 -599 -519 -659 -738 -670 -665 -649 -689 -367 -187 28 -94 476 763 1043 1292 1612 1566 1935 1869 1779 1474
2003 1474 1314 1086 551 686 178 -77 -662 -905 -1244 -1576 -1494 -1543 -1463 -1448 -1180 -751 -727 -326 -173 178 312
2024 312 639 953 715 899 777 983 360 126 260 -319 -433 -405 -538 -1080 -662 -730 -1152 -898 -690 -613 -622 -183
2046 -183 123 45 417 183 399 556 470 526 465 882 611 977 745 389 490 449 241 293 237 319 224 108 146
2069 146 10 -219 -606 -547 -619 -709 -643 -676 -451 -460 -676 -526 -320 -310 -134 96 490 598 994 892 712 911 825
2092 825 810 605 481 359 -59 -210 -245 -818 -890 -812 -862 -753 -703 -681 -720 -490 -462 -153 -21 423 485 606 781
2115 781 702 609 929 850 696 243 -165 65 -333 -583 -303 -412 -438 -925 -779 -734 -776 -448 -190 -275 -47 288
2137 288 -29 310 147 169 -40 227 244 32 212 102 264 66 151 192 102 315 202 494 335 610 197 210
2159 210 311 195 -106 -15 -142 -461 -424 -299 -360 -449 -281 -193 -715 -544 -450 -51 113 234 64 394 250 91
2181 91 4 460 137 132 -47 -200 -251 -484 -488 -584 -673 -547 -803 -758 -509 -438 -360 -84 192 114 342 359 196 760 739
2206 739 553 466 477 252 142 -10 -87 25 181 -82 87 259 307 -91 251 395 197 512 474 149 279 334
2228 334 269 -46 -96 -50 -290 -154 -412 -433 -404 -376 -419 -505 -294 -127 -143 24 143 63 130 314 61 210 221 -226
2252 -226 68 116 -426 -393 -441 -453 -528 -659 -627 -315 -460 -335 -193 1 190 317 581 269 726 568 576 932 773
2275 773 557 446 146 166 128 122 -54 119 -230 -38 -189 -92 -109 -267 -150 -8 -65 0 -137 -97 158 8 -207
2298 -207 -191 53 -353 -249 -228 -163 -101 49 -303 -296 115 200 120 112 429 145 147 504 96 -93 -138 -137 -260 -176 -470
2323 -470 -408 -353 -425 -409 -413 -6 -61 309 316 576 270 615 1081 546 739 607 789 547 459 272 -180 -25 -53 -364
2347 -364 -668 -576 -814 -500 -732 -643 -451 -95 -94 37 185 244 378 410 543 747 652 423 513 391 643 159 -29
2370 -29 -42 31 -45 -305 -268 -329 -342 -248 -193 -347 -298 -21 -48 76 61 -155 36 89 -254 245 99 142 -57 113 7
2395 7 155 393 157 188 263 -32 277 173 372 16 58 10 -402 -370 -918 -399 -567 -728 -453 -723 -781 -266 -256
2418 -256 -126 -144 252 324 538 525 793 610 547 658 743 433 505 429 5 47 -259 -235 -629 -494 -147 -596 -371
2441 -371 -492 -224 -234 -247 -38 235 98 603 346 606 629 722 366 458 259 154 7 130 243 -125 -312 -305
2463 -305 -229 -275 -292 -747 -252 -339 -332 -266 -141 -183 -134 -182 -250 -97 -79 -99 -47 49 -12 112 210 180 132 269 409 384 354
2490 354 316 326 286 271 81 -13 85 -96 -135 -373 -409 -394 -451 -356 -260 -372 -206 -126 -87 186 353 33 382 539 457
2515 457 242 448 545 430 73 16 129 -170 -306 -569 -548 -585 -689 -774 -861 -538 -374 -304 -318 88 113 229 367
2538 367 155 523 523 347 509 399 239 189 238 183 173 180 -135 -229 -90 -88 -181 -341 -441 -109 -104 -42 184 -8 -2 162
2564 162 -56 -291 203 -112 -33 74 190 2 110 -106 -283 201 57 228 248 196 122 -20 265 214 -126 295
2586 295 -180 -154 -281 -249 -146 -265 -447 -358 -360 -357 -219 57 113 345 218 304 661 358 490 617 410 297 290 367
2610 367 309 68 -81 -134 -351 -585 -612 -491 -407 -484 -304 -320 -179 -30 -156 -101 52 21 328 443 137 228 193
2633 193 -22 142 49 -17 -212 -385 -254 -150 -186 -149 -31 -215 -38 -266 63 346 337 411 391 225 50 382 -33
2656 -33 71 291 134 155 -139 -140 -306 -89 38 172 231 288 2 43 369 312 53 184 132 -44 44 -53 -256 -327
2680 -327 -232 -306 -332 -659 -667 -683 -323 -533 -128 -65 -146 12 95 200 -2 -259 453 45 143 24 210 -198 15
2703 15 -253 -247 -276 -345 -188 -266 -123 -137 5 119 82 -20 394 239 270 571 452 33 259 165 141 143 330 -149
2727 -149 -204 32 90 -30 -130 31 211 185 214 112 18 390 54 -97 26 -62 -7 -244 -70 -111 -290 -372 -375 -342
2751 -342 -471 -339 -136 -319 -137 -21 -106 -185 49 126 274 194 213 12 130 51 -65 282 54 40 -370 -336 -340
2774 -340 -434 -243 -132 -210 -104 -48 -147 125 151 109 515 123 196 403 328 226 273 177 245 -142 -106 -225 51 220
2798 220 -122 -187 -189 49 -146 -111 -212 152 33 -106 -109 -57 -141 -153 -285 -204 148 -117 -378 -107 -414 -226 95
2821 95 54 57 296 194 41 461 280 276 3 335 238 60 -308 79 -69 -231 -388 -194 -343 -35 -236 -297 -213
2844 -213 -130 210 21 -90 392 354 390 456 346 492 267 27 79 -17 98 -85 -83 -287 -196 -277 -297 -369 -269 -230
2868 -230 -186 -126 -30 205 274 188 219 229 325 442 522 187 -9 -169 -33 196 -217 -83 159 -354 -243 -32 -212
2891 -212 1 -186 160 132 82 -178 56 31 -220 -71 -22 -162 -30 -54 -102 48 -282 -219 108 9 152 343 380
2914 380 106 189 -34 211 421 -177 -23 -55 -169 -139 -270 -299 -350 -536 -293 -371 -247 -372 -30 -101 27 138
2936 138 48 218 322 404 255 350 226 604 283 110 -134 13 -311 -165 -25 -145 -547 -483 -176 -259 -163 68
2958 68 -162 2 236 -69 -61 -97 73 323 207 279 87 172 14 79 27 -65 -48 -156 -334 -182 -146 -115 78 149
2982 149 -209 -118 -16 26 148 -47 -9 -100 -59 24 -235 -110 -28 -5 -226 40 -21 233 -21 64 306 307 162 -129
3006 -129 82 62 206 -114 141 -234 -288 63 -82 -84 -151 -292 -152 -128 51 -227 -188 -107 39 79 385 144 255
3029 255 178 121 285 190 46 -152 128 208 99 22 -31 -246 -251 112 -149 -345 -55 -216 -191 9 27 2 164 38
3053 38 90 344 202 201 159 341 -117 112 70 -142 1 -446 -215 -56 138 -177 -153 -160 55 -126 -42 -99 -61 -11
3077 -11 57 22 -95 -164 -54 66 -129 -411 -51 24 -209 16 97 254 40 307 90 283 97 473 9 409
3099 409 359 180 160 75 -19 -9 111 -119 10 -89 -231 -376 -12 -229 36 64 100 266 272 218 374 243 192 -76
3123 -76 12 -56 -215 -128 -243 -251 -399 -407 -321 -488 -299 -267 87 -324 -173 -326 -110 -58 -58 322 -133 33 -155 443
3147 443 280 -160 91 -70 -61 229 159 -12 70 75 -124 227 178 275 233 325 297 37 309 119 -64 116 -187 -54
3171 -54 178 41 -174 76 10 -313 -300 -114 -43 -262 -148 241 -431 -167 85 -33 42 26 71 0 85 -78 -199
3194 -199 -242 -325 -48 -275 -440 -220 -309 -187 -126 -318 186 -108 107 -179 195 152 134 372 174 -130 -115 224
3216 224 30 -189 134 57 283 59 -179 48 178 255 291 89 124 419 228 291 365 157 320 190 27 -83
3238 -83 -31 -148 -117 -319 -113 -150 -222 -273 19 210 -30 -44 53 38 -39 124 124 -90 4 -28 -277 -195 -254 -289 -477 -327
3264 -327 -415 -74 -99 -363 -273 -157 232 -20 39 126 7 -7 286 187 125 108 125 -114 173 -37 -188 -185 -138 150
3288 150 -178 -161 -180 -316 37 -234 -29 97 33 -91 366 157 -2 241 221 202 64 104 -394 -118 -50 -432
3310 -432 -235 -74 93 -223 77 68 -2 -164 89 240 -18 145 26 67 62 -251 -15 133 -131 -65 -329 80
3332 80 -160 -167 -67 -125 42 95 80 157 -5 132 180 223 -17 -135 55 -40 -27 -144 -440 -10 -287 -116 79 -77
3356 -77 -169 28 -112 -55 -48 172 271 142 175 377 257 -4 220 35 -203 111 -278 -156 -73 -208 -292 -82 -8
3379 -8 50 -78 -179 183 319 -84 294 -62 155 503 -199 162 107 -161 -60 -32 -141 71 -120 -286 -70 -18
3401 -18 -221 -36 -203 -103 55 -20 127 165 238 78 -12 -42 -128 79 -183 -79 -242 62 -191 84 -94 -150 -92
3424 -92 -202 -64 -192 -12 63 -268 33 119 -1 165 146 32 -20 -32 -96 -206 -209 94 -274 -282 23 -37 4 -71 -144
3449 -144 -2 214 340 -26 125 365 -4 128 178 -103 -106 29 -13 142 -241 -135 -229 -349 253 -13 -277 -178
3471 -178 -16 -79 -129 96 71 96 131 267 327 -20 -43 -279 133 130 -138 134 -225 -261 217 -34 167 37 -48 247
3495 247 -39 67 33 103 105 145 -74 56 64 -278 -2 -11 74 47 -182 -272 -141 -201 49 -131 150 132 114 -112 0
3520 0 6 149 -17 -8 93 -175 18 -295 -166 63 -75 -301 -424 -317 -222 -302 101 83 329 87 32 261 318 185
3544 185 229 160 64 277 13 156 -123 -103 18 -152 -70 13 -171 -34 -62 176 -260 -260 -165 46 -113 205 -122
3567 -122 -31 124 81 -125 59 -23 -106 -161 -277 -251 -243 -83 -286 13 -166 -148 -127 188 68 81 92 363 104 127
3591 127 -65 67 -51 277 -47 -208 -65 30 -46 143 -53 -8 -21 -221 163 -79 182 -92 282 177 247 200
3613 200 232 -112 26 77 -118 -47 -157 -189 -221 29 -153 -155 23 -105 8 -136 34 -31 -69 237 191 307 -161
3636 -161 40 203 -134 -103 -26 -296 -102 -68 121 -153 -258 -111 -279 -199 -160 106 43 -101 284 92 330 192
3658 192 11 -67 0 -66 -70 -50 -109 -33 -120 34 -11 -83 40 -27 129 -106 126 242 -84 249 -23 120 88 -48
3682 -48 -49 2 30 -159 -45 -184 -39 -246 -146 -19 84 -161 117 -87 142 11 104 -26 297 -56 11 -44 -12
3705 -12 208 -65 -172 -106 -37 -153 -183 51 -205 -143 52 137 321 326 300 225 210 200 176 -82 246 206 97 30 26 -240
3731 -240 -63 33 22 -169 -120 -148 -128 130 167 206 119 166 -206 124 103 -91 56 42 -39 -97 -190 -139 -141 -175 -325 35
3757 35 -80 -291 -121 -160 -64 121 217 153 314 169 82 35 -200 -115 150 -57 -136 -159 50 163 130 88 -77 -180
3781 -180 -146 62 241 70 169 156 169 81 85 -13 226 77 28 139 -36 -151 -209 148 119 -282 2 -39 -35 -221 -40
3806 -40 46 -29 -117 -239 158 35 56 120 9 155 -6 -189 251 11 -153 -27 -301 -239 -244 244 104 56 120 84
3830 84 23 69 147 -137 76 -106 91 48 -240 55 -44 -170 -278 -318 -240 -258 59 10 -71 24 40 189 227 226 133 126
3856 126 159 183 -146 154 -176 134 -217 -156 -306 -250 -18 -22 19 -210 87 30 34 -91 103 70 61 -109 1 157
3880 157 -109 28 212 -256 130 -5 109 -91 -142 54 27 -18 -132 -196 -2 198 -47 25 3 -75 40 241
3902 241 48 69 192 -27 101 121 -53 22 5 139 -52 -4 -82 152 -73 -107 162 -101 152 -7 84 204 44
3925 44 222 131 -127 139 -110 -41 -155 28 -236 -63 -246 -2 -315 40 196 -37 -114 -135 228 60 42 209
3947 209 -77 -112 73 -131 36 -21 183 -286 -175 163 74 -131 -104 -226 81 -90 -267 159 43 17 154 -191
3969 -191 138 -38 -68 308 91 101 -43 29 -46 -16 -136 43 -56 -84 -46 244 -185 88 -44 18 69 157 193 141
3993 141 101 233 -215 -373 -185 -96 -247 -22 228 52 -377 -47 169 -142 1 235 -221 388 140 106 27
4014 27 -211 85 -143 110 -63 -126 276 111 132 -38 118 58 -83 -241 -49 -148 51 130 185 27 112 213 201
4037 201 100 -193 33 -38 240 2 -53 246 77 62 59 -38 -54 -300 -167 53 305 -45 96 74 -36 0 383
4060 383 157 69 -105 98 90 -113 1 -32 -89 36 -83 -6 -128 34 -101 -27 1 -242 -64 92 15 12 -177 19
4084 19 -96 -62 -301 -379 -97 -135 91 -26 -117 218 -117 -127 -214 154 438 -35 50 300 251 76 83 -84 -19 -149
4108 -149 -17 14 -88 108 -48 -190 -53 -217 -59 -156 -160 51 91 100 77 -120 -42 -170 -121 92 256 27 -98
4131 -98 -53 -117 -303 -4 -110 -212 -155 65 41 17 149 -257 141 8 91 114 211 288 204 139 6 -193 -3 58
4155 58 -57 91 -481 -68 167 -111 -89 -191 -120 239 -13 274 233 163 69 139 -50 101 48 61 129 -89 -5 -43
4179 -43 -87 15 149 -155 57 70 95 -6 100 84 -17 418 -58 -103 279 116 169 -88 2 -122 -74 -171 -112 59
4203 59 -9 32 -24 30 99 24 -115 113 5 -108 -273 241 -256 317 -7 6 146 -256 -51 163 -180 -119 36
4226 36 170 4 -82 -70 126 93 179 197 -21 204 258 -56 128 312 93 -47 -94 -12 -236 91 -250 -150 -290
4249 -290 59 180 -163 -118 115 82 -3 157 82 264 -9 -115 -49 -159 -101 -9 -307 -40 28 -50 -239 50 -72
4272 -72 -223 -265 -45 23 -122 176 21 -12 132 -10 112 184 26 -98 -26 110 -184 -163 25 -14 92 152 -164
4295 -164 63 120 -164 276 66 86 -211 -27 -179 -28 -122 193 231 -28 -1 -65 35 50 -91 -85 -174 -239 198 103
4319 103 -53 -46 158 -188 -126 -2 205 25 178 24 105 83 -29 -28 -288 -352 -9 -138 169 -111 -183 52 -118
4342 -118 66 146 139 -77 214 -161 -89 127 177 38 -265 -245 290 -165 -25 93 93 45 59 161 29 -41 -106 -4
4366 -4 -78 183 194 434 13 25 21 246 -113 87 285 52 -69 -148 -148 236 -4 -279 -29 -119 -302 68 279 -89
4390 -89 125 20 45 -167 24 218 249 143 73 -174 85 43 97 299 -56 151 228 -23 35 128 48 134 20 145
4414 145 -83 54 -83 -143 105 -10 50 -118 -256 -340 62 -196 75 -207 -14 -64 -281 -230 -86 196 -193 73
4436 73 132 8 256 107 10 147 100 29 -133 -145 -106 -4 -170 276 -82 -104 -26 98 110 22 102 14 170 36
4460 36 110 77 31 165 -12 108 -152 46 108 12 -115 -127 -86 -18 -217 -34 -151 69 -65 -34 -109 -116 179 -39
4484 -39 258 -148 68 59 233 -144 74 229 -18 -10 86 -11 -124 62 272 17 87 54 -178 -60 162 201 308
4507 308 74 -64 116 -103 29 -13 60 -97 -19 -299 242 -366 -69 -108 27 106 -79 87 101 -51 75 -109
4529 -109 186 17 -89 31 5 132 -200 -250 -117 91 -59 109 266 87 40 70 151 67 15 -20 49 175 98
4552 98 -40 -108 93 -217 -296 -267 -150 116 -243 -8 8 -221 -68 -82 -129 215 -75 -58 57 -124 168 -229 39
4575 39 -88 -67 -51 -102 138 120 -180 -150 -102 -150 -211 -4 -127 30 -352 -126 7 146 -38 6 166 -61 -238
4598 -238 -7 -99 -23 -285 -176 49 -153 227 274 -127 20 325 -316 -58 97 -69 27 3 232 -49 114 212
4620 212 96 177 -75 -130 -95 -90 78 -207 247 -147 167 -217 -177 62 128 304 37 74 146 -164 20 -18 -39 -3
4644 -3 194 149 -39 126 -115 -84 70 89 53 -57 101 22 31 27 60 72 -5 -100 -139 5 -45 234 -11 235 49 17
4670 17 -3 -303 -96 -82 -160 110 -5 235 -155 39 -158 95 82 138 142 -157 42 -317 107 -107 7 27 -64
4693 -64 -293 -70 -309 -58 -93 -196 70 -65 -12 366 216 166 -45 58 -134 14 238 -104 143 -58 41 -63
4715 -63 -70 -135 -79 142 228 -127 -80 115 -8 -23 333 257 -16 99 236 -55 -6 -150 -93 20 37 -269 -80 -46
4739 -46 -34 -78 -137 -12 -305 -51 -65 -252 88 357 79 216 161 38 -188 -169 -190 -100 -50 -205 120 -354 -55
4762 -55 19 -80 146 13 -119 -176 -9 167 40 262 -133 96 -154 44 103 101 104 29 164 24 -117 0 101
4785 101 49 -289 115 -5 -7 166 -119 -18 -30 -38 207 -288 -100 103 -183 0 -49 63 -59 29 -80 93 -37
4808 -37 266 -42 -102 -36 86 -199 190 150 -44 243 -6 29 -143 161 157 -38 -232 -27 -182 -203 135 149 -30
4831 -30 164 20 -28 76 -134 -9 -86 186 -24 -3 -171 -196 296 53 150 -67 22 83 62 16 -39 -106 -123 -124 -15
4856 -15 -12 227 22 181 127 -20 66 125 76 -78 -98 94 -152 -274 88 71 -83 -15 -6 6 -183 -192 -97 20 -9 25
4882 25 -97 112 -10 -34 160 213 -250 -135 136 -215 -263 2 251 -186 -128 -60 37 -227 -17 -61 -92 -177 163
4905 163 17 -77 10 312 93 90 277 -43 -41 -138 63 80 -90 154 -118 -63 -83 206 51 -14 -160 16 55 -238
4929 -238 -39 139 -266 155 109 -281 284 79 209 -303 109 -169 91 -19 -4 160 -54 39 72 201 49
4950 49 17 163 -105 -87 -13 121 52 -205 15 -66 109 98 12 -120 -439 59 184 -108 -43 39 109 161 6 3 77
4975 77 -30 -138 -103 -89 108 165 -45 -23 -501 -13 -107 -255 90 -117 199 30 133 -94 -80 103 100 61 -44
4998 -44 248 96 36 93 -45 247 -5 32 -224 -124 -104 26 -121 32 113 -81 67 83 -42 156 252 225 -85
5021 -85 -160 -62 -24 174 -52 216 55 -28 249 43 156 179 407 477 187 137 122 -26 25 190 -98 -116 -77 -98
5045 -98 79 -68 40 8 -89 -180 -40 -221 85 268 92 -114 68 26 -252 30 -11 150 132 25 57 49 163
5068 163 323 -26 5 57 -48 -241 278 57 42 180 312 87 176 -106 -79 222 -20 62 -214 129 -37 74
5090 74 62 192 -318 -47 -56 -120 -36 -80 26 -81 88 183 74 3 128 66 124 -59 124 22 99 -128 28 -129
5114 -129 -90 -22 94 191 -1 -183 -31 -51 91 26 -110 161 10 -27 208 -54 226 153 92 381 89 -195 65
5137 65 178 -67 -208 -226 -157 -36 -249 -120 -278 -153 125 6 -23 -19 169 -73 -15 -150 5 319 -281 -50
5159 -50 11 10 161 151 104 -40 -48 -321 -400 -14 -2 -105 -35 -26 288 96 -124 5 -54 -128 -67 -62 -173 66 208 -41
5185 -41 52 -255 75 -5 -103 -48 31 -310 14 60 -32 40 -26 -25 48 -209 -7 63 -83 -180 7 112 87 -137 88
5210 88 -82 193 -76 -122 263 38 -13 53 -54 -235 124 144 -196 -133 -200 -195 170 406 180 17 6 -42 25 249
5234 249 -125 90 -165 -49 -39 317 -204 0 -50 -185 7 81 -212 42 115 76 96 -29 -129 -90 -50 -209 -16
5257 -16 -154 192 164 9 -116 103 -28 126 67 233 -21 -170 21 -39 174 124 -153 -32 -170 -163 90 -46
5279 -46 -137 161 23 39 -69 159 -153 292 -25 -107 107 -56 55 75 -37 -188 -5 57 136 134 17 -382 -109
5302 -109 71 10 258 -25 168 205 -85 -158 76 -8 29 189 -264 198 91 -57 216 217 246 -70 41 28 250
5325 250 -128 -125 161 334 117 -18 -24 110 -13 26 6 99 -183 -179 -159 -109 -2 -28 -131 188 -107 108 135 145 -129
5350 -129 -142 -126 144 230 231 69 -40 289 230 115 -302 64 -118 -60 -156 -60 11 111 110 129 224 -2 33 -7 -36 353
5376 353 111 92 24 -194 209 -113 -35 45 246 5 -156 40 -33 -232 -19 -60 -37 91 120 81 29 64 86 99
5400 99 -59 -208 0 -207 -8 -265 -182 109 -149 -275 63 38 -25 97 -52 -253 -116 30 -20 -76 63 218
5422 218 238 91 43 -19 365 -71 -143 173 -54 -111 -111 -4 11 -5 184 2 106 53 -5 -165 -13 93 78 119
5446 119 216 -129 -75 101 -87 -131 -36 -248 -98 96 104 72 -464 35 85 126 48 108 -20 60 -30 76 157 83 147
5471 147 -141 -4 -83 -77 -78 -152 -49 141 -34 4 -3 -34 -112 -2 57 136 96 -14 -43 52 35 65 171 -164 70 -264
5497 -264 -220 394 31 -47 15 7 88 214 96 -72 -11 117 74 -115 -99 -160 64 -30 56 -60 -29 -23 127 73 -210
5522 -210 -184 -15 59 312 -120 168 -121 -112 172 -51 196 -120 -222 -86 63 113 -255 -216 61 -152 -81 -271
5544 -271 154 -8 212 14 -88 236 -82 115 -8 -87 -298 -101 -28 304 -71 111 207 -78 124 -164 -5
5565 -5 -97 70 58 -33 130 74 265 249 -16 271 54 -53 141 74 163 -18 -47 -93 96 20 -90 -53 -179 -377
5589 -377 -236 -27 27 -140 14 172 233 248 40 157 -84 -47 170 -41 94 96 159 54 -21 -120 196 -174 -71
5612 -71 100 79 11 -96 16 218 64 -62 214 -194 113 -6 -9 138 46 111 61 126 25 -52 -22 -85 -23 -58 255
5637 255 334 156 -173 41 -118 96 177 82 -134 -62 -94 84 306 -53 87 28 -48 -4 -86 -21 110 343 41
5660 41 -337 -45 -27 19 20 19 329 67 52 -61 191 -91 -222 62 -9 -103 -162 -108 -238 112 162 -116 -86 198 63
5685 63 -80 44 -255 -12 92 -38 74 -189 -150 -13 -18 -112 -217 43 -204 -313 -96 -42 106 -6 348 -57
5707 -57 -67 2 -32 61 45 33 9 8 13 8 -90 33 -179 -142 142 -129 199 -15 -122 -388 30 294 184 31 -258
5732 -258 -120 -5 279 -23 80 -78 74 18 -49 23 -118 6 -159 -64 75 33 225 40 -30 23 164 -36
5754 -36 -210 -266 -80 -91 -94 -60 90 -142 29 96 9 -102 272 172 281 -222 -49 -159 -143 32 -144 -25 -229
5777 -229 -190 -150 -52 -11 59 211 -92 60 -29 126 2 213 -166 -13 17 -133 -49 -157 -126 -150 -230 141 92 157
5801 157 -11 -155 -113 42 276 -83 124 -2 -81 -176 -32 -51 -113 -2 -41 44 128 -3 -4 -36 66 245 -237 4
5825 4 276 212 50 -36 77 -40 389 -289 217 171 112 -10 -106 -81 85 -52 121 251 141 -159 55 250 6
5848 6 16 241 33 275 42 87 33 -26 11 -116 16 -13 144 -104 -107 6 60 46 -1 83 318 -233 -92 -41 -130
5873 -130 -61 45 188 33 213 -239 -148 -86 2 138 226 -90 -123 -174 -192 240 97 185 -29 -27 9 34 -217 97
5897 97 174 -48 54 -196 -93 -7 -83 26 -26 5 -10 131 56 14 108 -43 -74 -89 295 56 173 6 -277 -60
5921 -60 -31 -18 204 -228 127 -96 27 22 -92 120 -199 125 19 92 215 13 46 49 -62 176 -136 -12 90
5944 90 69 242 114 -5 -25 -88 70 -25 19 -186 -128 312 140 217 -36 -50 182 121 -90 -172 -221 138 -46 94
5968 94 152 141 -72 188 121 -161 8 -21 -37 -128 204 177 -148 50 -32 84 168 377 184 -97 -145 -205 168 -17
5992 -17 -144 178 117 -27 251 -50 181 73 16 -104 -109 -93 76 -228 40 135 47 -144 108 2 -201 -204 -99
6015 -99 -182 -3 -30 -64 38 335 79 -73 -57 36 -185 -37 -45 -132 -21 -120 114 -132 -255 -104 304 -45 144
6038 144 61 -56 -29 117 -293 167 28 -138 -23 -14 -54 -213 -53 -55 93 -52 244 -38 -8 18 100 -33 45 -164
6062 -164 -66 144 -287 -71 29 -89 98 165 184 -48 182 -87 -119 33 -7 3 -216 196 -278 -64 -246 -105
6084 -105 -103 63 160 -130 219 11 -38 13 88 79 -53 89 32 156 60 -82 -25 211 96 2 95 107 -199 53 -172
6109 -172 20 19 -242 47 75 177 119 201 -33 67 51 92 -197 -223 148 -23 39 -71 -80 -144 160 -64 -169 114
6133 114 230 -32 -224 126 -39 -9 -111 -332 9 6 -153 -5 10 -110 98 86 17 71 -23 30 -59 -84 116 -252
6157 -252 58 23 109 -142 -108 -88 127 86 84 60 -71 -186 -159 326 57 -71 247 -123 -201 62 118 115 81 -47 135
6182 135 -47 -25 101 -214 -126 121 -106 -17 -77 -257 148 -97 -115 -115 119 35 -125 143 -84 -311 -114 -127 -106
6205 -106 -137 287 53 12 175 -154 47 -41 61 -106 316 -223 -192 398 -2 36 -51 -240 -56 31 -25 341 16
6228 16 119 44 200 45 -246 20 -144 -72 -250 -92 -126 -32 -82 -106 -138 -99 -66 -139 -2 -4 -154 0 -77 103 113
6253 113 136 129 64 -8 259 -243 113 66 99 -411 -112 59 86 -46 -155 225 -45 -90 -67 -129 -80 147 142 90 128
6278 128 -21 281 -125 -226 368 -111 26 60 287 192 12 -152 -246 -122 151 -265 111 9 56 -13 -203 199
6300 199 159 -139 -156 184 192 73 14 -54 -52 176 29 88 66 -123 -58 -105 168 -45 -60 272 151 61 188 -141 -9
6325 -9 -81 11 -143 22 84 -40 -1 293 -180 -38 121 -25 134 -270 19 -315 63 20 -351 -38 90 -127
6347 -127 -59 -82 14 -169 163 9 70 50 5 -13 121 185 -116 5 -8 -28 -72 -258 6 -402 158 -31 290 84
6371 84 -79 210 -67 94 -47 229 111 100 6 -126 121 -30 -157 215 15 -111 17 182 4 -107 -330
6392 -330 -75 -42 -74 -160 99 33 -166 -91 -290 169 194 -44 -218 -111 233 -89 -103 212 226 171 -189 -106 95
6415 95 -41 289 104 75 -119 176 166 104 -54 -96 -113 121 189 -151 -50 -160 -81 -94 -16 1 285 -118 -41 -190
6439 -190 -35 160 249 -102 -53 -23 28 -51 177 -82 -137 -36 -178 3 -113 -28 71 87 0 43 8 215 -164 20
6463 20 97 -49 -74 -90 -109 -76 -231 199 108 -164 -41 -45 18 148 -177 -250 247 42 -147 -145 -64 6 163 6 -27
6488 -27 10 -14 223 -43 -156 93 -18 27 -155 112 -9 1 -35 289 -22 -71 9 -2 69 -13 160 321 -53 60
6512 60 -122 -107 33 77 34 35 -247 -380 6 114 9 -176 45 5 46 366 -219 149 107 -150 68 -141 6
6535 6 12 -93 20 -86 154 -52 -55 -95 -28 71 20 14 -80 76 229 -13 -18 148 -128 123 -506 -169 -287 -53 -27
6560 -27 -154 -200 -63 198 175 -156 142 -23 -44 39 103 -147 46 -4 -94 12 87 191 -137 -216 -62 160 149 8
6584 8 -142 -159 110 98 -143 -140 194 39 -45 41 -168 -91 111 190 -5 -452 -65 -35 -64 154 54 -80 57 -32
6608 -32 37 -32 119 97 183 79 94 -26 -166 -27 -176 -261 29 -142 65 -80 42 -166 268 -2 -249 95
6630 95 264 -25 146 -215 -145 -78 -165 -233 -42 -67 -155 92 298 -72 102 164 174 95 -25 -123 108 74 141 131 101
6655 101 -162 -12 91 66 -35 219 115 -79 205 120 -78 -26 -75 -132 -93 122 131 -18 139 15 203 162 -24
6678 -24 -205 -88 -75 -182 -155 -85 -115 -32 166 152 149 -84 -113 -87 65 -27 54 -23 119 16 118 21 24 -98 139 -123
6704 -123 63 -120 10 -173 -194 -217 -31 114 -117 -1 -1 112 -241 -18 5 84 27 38 114 136 -107 -126 0 -63
6728 -63 -4 -239 120 -41 -45 371 160 -33 -94 -208 -9 263 64 28 -22 63 -65 -8 -189 273 -8 -10 161 56
6752 56 114 -67 -227 10 88 19 -26 342 -28 11 161 108 -139 -173 -17 158 82 43 110 136 235 257 38 96 49
6777 49 -107 157 74 -27 13 251 -17 -32 131 -273 -104 26 -87 56 41 127 -12 -130 58 21 -96 -114 -135
6800 -135 -109 -81 -208 122 -147 -284 -76 -91 196 -40 32 216 -201 -21 -52 -138 33 83 80 -165 -201 -119 -164 -67
6824 -67 216 171 107 126 -265 18 -21 -191 263 300 131 -100 -128 -270 -60 221 -38 -166 -40 -32 -36 -134 80 -51
6848 -51 82 -43 -82 106 -27 -18 -105 116 -68 -185 -51 131 70 -87 139 -1 55 -187 178 185 -61 -74 -175
6871 -175 3 138 -110 47 21 189 145 -45 24 56 -60 -39 -60 66 -163 30 -88 -28 -136 26 -166 -181 190
6894 190 -36 -275 36 217 -170 -17 -19 74 -88 -40 -45 -112 36 -71 124 84 -75 -174 27 18 -90 57 104 196
6918 196 -18 107 -142 32 -102 65 -17 90 118 103 131 -19 -3 215 -120 59 -147 -12 11 246 74 -45
6940 -45 251 1 63 125 307 34 -121 -10 -26 -16 398 187 153 262 -67 168 -124 24 18 -13 16 65 -77 -105
6964 -105 19 -18 205 90 58 57 -123 75 -38 -90 -17 85 -99 -52 240 15 2 54 87 279 323 101 -14 -283
6988 -283 -12 -206 147 225 144 -33 -9 -139 -37 -258 -186 62 -129 52 -128 95 264 -60 12 -23 36 -42 -27
7011 -27 -311 332 -79 205 -115 -65 128 0 233 149 -194 -105 77 67 80 75 4 39 96 -158 -259 -125 245 -115
7035 -115 -285 -31 -75 -162 36 -151 127 151 -59 -206 -126 -199 227 -65 42 -111 -237 5 -163 161 -304 -18
7057 -18 149 69 -237 -15 43 185 -48 257 233 -30 -23 -25 -133 -56 -96 11 -53 22 121 -231 -48 -32 300 -111 6
7082 6 -138 -392 -116 -57 -68 -161 40 -228 -90 -4 229 209 -213 -130 -7 229 -10 -28 42 189 -101 88 -26
7105 -26 248 40 -100 -119 -28 172 290 -233 -85 129 101 -82 -29 -178 129 -89 -63 -45 -57 -70 66 -40 -101
7128 -101 -18 169 51 -99 -116 59 -238 -175 -176 -17 -16 -200 -129 54 165 -53 101 79 89 -101 27 -153 279
7151 279 -23 -266 -106 37 80 -29 -56 -230 134 91 -15 -125 -228 261 36 -338 -118 -154 -52 -33 37 86
7173 86 -98 -68 80 45 143 -116 99 -9 -4 83 -231 16 -48 8 82 -54 95 124 -26 -229 -140 -222 42 -38 21
7198 21 -25 -86 132 39 -8 -137 -68 -255 38 19 -38 75 -437 -61 131 -132 93 130 186 29 -171 -29 -39 103
7222 103 -195 53 13 25 62 55 -256 36 184 -99 165 -196 74 344 143 244 80 -166 29 -105 -86 -294
7244 -294 185 -78 -174 -11 -8 -29 -204 72 98 126 -123 88 -32 147 238 -118 65 -366 -133 -117 -49 -70 -146 -72
7268 -72 81 -205 64 6 227 48 -104 -76 -68 200 -58 157 11 25 -10 -201 -247 -262 32 -159 -211 -131 148 -11
7292 -11 7 -31 -100 96 80 -83 132 -36 -64 299 -184 20 -53 111 142 28 -4 167 -3 189 -54 -24 92
7315 92 87 46 -113 -27 -207 -48 -182 -127 -81 7 -147 44 -168 239 -50 44 -123 0 -23 165 -17 -62 53 107
7339 107 -196 107 95 187 4 -16 338 -95 122 131 279 116 113 -105 132 -70 81 -108 -62 76 -105 154 403
7362 403 -57 42 73 -96 -193 24 177 293 93 61 -112 -114 107 -171 32 80 148 80 73 13 89 -176 41 165
7386 165 188 -64 -30 179 -153 139 -36 457 -29 -3 -136 -15 186 262 221 146 194 -126 56 102 97 -116 -304
7409 -304 -48 122 144 -111 -175 23 -33 124 119 -64 155 194 164 -150 -56 -18 60 69 115 -293 -2 -2 -60 -13 210 65
7435 65 -44 -30 -8 4 25 98 -65 30 17 27 34 -128 -144 -63 -81 102 -88 231 -45 29 205 -80 -26 101 90 157
7461 157 68 -127 150 124 -199 -85 78 -68 123 219 276 -174 -89 -293 -122 -140 13 -260 32 -152 -49 -146
7483 -146 -72 -115 75 187 -289 -49 -336 -38 56 -34 -9 83 -268 -96 15 40 -31 -61 -107 6 -50 23 -63 -33 -402
7508 -402 7 85 -143 -130 -80 29 116 -131 -137 -29 189 41 -184 35 -129 140 126 213 39 10 -115 -177 -134 227
7532 227 -84 -180 -99 -79 -20 -282 -357 46 7 -64 7 32 104 243 142 36 43 133 49 -129 19 -65 65 -48 -106
7557 -106 -244 -134 -80 27 -134 -137 -120 2 61 -174 59 -23 131 -68 -225 15 -411 -66 16 190 -11 84 -5
7580 -5 -28 281 109 -73 116 -81 91 -103 184 51 122 8 -32 76 -190 -110 129 -35 -91 -26 414 -21 -116
7603 -116 -102 -138 -24 -139 -169 -229 3 48 22 55 197 225 40 10 33 -121 -30 -58 -117 246 -210 84 -75 -191
7627 -191 274 -180 -173 48 264 4 185 153 -66 47 -188 80 -80 -87 138 -225 -138 -114 114 -71 -144 -154 49
7650 49 147 64 189 77 239 -29 37 95 -80 57 1 166 255 -115 -12 39 186 -5 47 -45 -167 -149 210 -243
7674 -243 256 -23 89 85 71 -303 -14 -117 48 31 108 219 -86 -130 183 -76 -70 88 137 195 12 123 1
7697 1 29 145 -63 -87 -180 226 -125 35 29 -93 -98 189 -151 199 -6 -302 198 -10 38 -106 20 145 23
7720 23 -152 -228 66 -106 -15 27 -239 -73 109 -139 116 -40 -28 171 37 -54 -70 -102 -188 75 188 -136 -69
7743 -69 1 142 150 158 153 -43 119 -96 259 7 15 -148 25 -317 -210 187 -220 130 27 -74 -49 -127 151 -158
7767 -158 -97 80 78 224 32 -115 -18 70 -190 -113 -11 -14 -145 26 -281 9 72 57 -17 -87 145 -152 131 167
7791 167 -53 -175 161 -103 -13 146 -223 322 128 -79 -155 -154 82 -15 -207 157 -42 139 -25 -27 67 187 155
7814 155 145 12 -187 -44 64 -236 33 31 -36 -7 22 -25 -8 -35 115 -24 18 71 -52 -34 25 -124 -245 114
7838 114 -91 83 1 -234 -301 -48 -106 -157 -103 -68 119 -127 223 -51 -181 -138 48 -183 23 -34 95 -23 -92
7861 -92 151 -135 78 -70 28 88 -79 -75 114 -30 -23 -73 -3 330 38 29 -106 -175 -205 -151 157 49 213 45 19
7886 19 -26 -64 -12 141 -42 69 18 -309 -176 -75 -82 12 72 110 -273 109 -30 -8 130 -218 169 122 95 14 -94
7911 -94 6 -33 -179 75 -116 235 -125 -181 239 58 -35 -67 152 -30 -185 141 187 36 121 -213 300 131
7933 131 182 10 -249 164 83 -314 -68 9 156 162 -169 115 -104 -171 -167 256 -116 -85 -59 45 -89 189 9
7956 9 -183 -48 -84 -42 148 185 192 55 -43 -223 133 -40 -151 159 14 43 69 33 -229 207 30 -25 -63 -29 -214
7981 -214 -91 -126 172 8 -87 -145 -49 79 95 -160 -9 30 248 117 126 -27 -32 152 46 68 138 109 84 83 -329
8006 -329 -45 -85 69 65 59 213 -233 -76 100 -14 -234 -87 -95 85 21 -98 45 76 62 -167 106 100 71 178
8030 178 -199 113 87 -1 43 -58 56 40 93 -42 -41 -63 -92 -66 -29 88 52 125 21 190 -22 -31 150 185 186 -73
8056 -73 -221 119 96 218 121 -34 12 -137 56 45 66 -118 33 85 -57 113 5 12 58 150 99 42 -40 -82 50
8081 50 -232 39 -33 -146 156 -68 -2 160 -46 60 -80 121 -61 120 16 -155 -42 238 183 -63 160
8102 160 79 -338 64 135 6 131 -166 -104 -33 -115 248 -23 -315 98 -159 -78 -178 154 75 67 -242 102 6
8125 6 83 298 180 5 14 -84 -67 -210 -9 -90 47 17 -23 21 310 -31 -270 -33 -64 -87 -5 -150 164 -7 -69
8150 -69 61 8 1 -130 -17 -20 -143 -340 -240 261 -56 90 234 -314 37 18 131 16 -18 -47 -51 -162 156 80
8174 80 -146 -90 59 -174 -147 45 -28 -1 1 -37 -163 -21 74 73 58 -202 163
8191A63
##END NTUPLES=NMR FID
##END=
