##TITLE=1H_LR-758-R4-KA5-CR23
 CDCl3
 8 sc, 
 28.12.2023
##JCAMPDX= 6.0         $$ Bruker NMR JCAMP-DX V2.0
##DATA TYPE= NMR FID
##DATA CLASS= NTUPLES
##ORIGIN= UXNMR, Bruker Analytische Messtechnik GmbH
##OWNER= root
$$ XWIN-NMR		Version 3.5
$$ Thu Dec 28 13:44:06 2023 Russian Standard Time (UT+4h)  she@DPX200
##.OBSERVE FREQUENCY= 200.1313
##.OBSERVE NUCLEUS= ^1H
##.DELAY= (6, 6)
##.ACQUISITION MODE= SIMULTANEOUS
##.ACQUISITION SCHEME= undefined
##.AVERAGES= 8
##.DIGITISER RES= 18
##SPECTROMETER/DATA SYSTEM= spect
##.PULSE SEQUENCE= zg30
##.SOLVENT NAME= CDCl3
##.SHIFT REFERENCE= (INTERNAL, CDCl3, 0, 15.7039)
##AUDIT TRAIL= $$ (NUMBER, WHEN, WHO, WHERE, WHAT)
$$ ##TITLE= Audit trail, XWIN-NMR		Version 3.5
$$ ##JCAMPDX= 5.01
$$ ##ORIGIN= Bruker BioSpin GmbH
$$ ##OWNER= she
$$ F:/spectra/data/she/nmr/H-F/1/audita.txt
$$ ##AUDIT TRAIL=  $$ (NUMBER, WHEN, WHO, WHERE, WHAT)
(   1,<2023-12-28 13:42:46.98 +0400>,<she>,<DPX200>,
      <created by zg, POWCHK disabled, PULCHK disabled
       configuration hash MD5:
       00 E9 B6 7A A2 85 ED C7 34 08 36 98 17 FE 4E 26
       data hash MD5: 16K
       46 84 4E 1A 1E 16 5F 33 D9 10 08 CC C4 73 8A 4E>)
$$ ##END=
$$ 
$$ hash MD5
$$ 44 8C 60 B2 29 5F 62 49 E7 2D 23 2B 37 31 B9 F1
##$RELAX= 
##$RELAX= 
##$RELAX= 
##$RELAX= 
##$RELAX= 
##$RELAX= 
$$ Bruker specific parameters
$$ --------------------------
##$DU= <F:/spectra>
##$EXPNO= 1
##$NAME= <H-F>
##$PROCNO= 1
##$TYPE= <nmr>
##$USER= <she>
##$AMP= (0..31)
100 100 100 100 100 100 100 100 100 100 100 100 100 100 100 100 100 100 
100 100 100 100 100 100 100 100 100 100 100 100 100 100 
##$AQSEQ= 0
##$AQ_mod= 1
##$AUNM= <au_zg>
##$AUTOPOS= <>
##$BF1= 200.13
##$BF2= 200.13
##$BF3= 200.13
##$BF4= 200.13
##$BF5= 200.13
##$BF6= 200.13
##$BF7= 200.13
##$BF8= 200.13
##$BYTORDA= 1
##$CFDGTYP= 0
##$CFRGTYP= 5
##$CHEMSTR= <none>
##$CNST= (0..31)
1 1 145 1 1 1 1 1 1 1 1 1 1 1 1 1 1 1 1 1 1 1 1 1 1 1 1 1 1 1 1 1 
##$CPDPRG= <>
##$CPDPRG1= <>
##$CPDPRG2= <>
##$CPDPRG3= <>
##$CPDPRG4= <mlev>
##$CPDPRG5= <mlev>
##$CPDPRG6= <mlev>
##$CPDPRG7= <mlev>
##$CPDPRG8= <mlev>
##$CPDPRGB= <>
##$CPDPRGT= <>
##$D= (0..31)
0 1.2 0 0 0 0 0 0 0 0.06 0 0.03 0 0 0 0 0.0002 0 0 0 0 0 0 0 0 0 0 0 0 
0 0 0 
##$DATE= 1703756566
##$DBL= (0..7)
120 120 120 120 120 120 120 120 
##$DBP= (0..7)
150 150 150 150 150 150 150 150 
##$DBP07= 0
##$DBPNAM0= <>
##$DBPNAM1= <>
##$DBPNAM2= <>
##$DBPNAM3= <>
##$DBPNAM4= <>
##$DBPNAM5= <>
##$DBPNAM6= <>
##$DBPNAM7= <>
##$DBPOAL= (0..7)
0.5 0.5 0.5 0.5 0.5 0.5 0.5 0.5 
##$DBPOFFS= (0..7)
0 0 0 0 0 0 0 0 
##$DE= 6
##$DECBNUC= <off>
##$DECIM= 32
##$DECNUC= <off>
##$DECSTAT= 4
##$DIGMOD= 1
##$DIGTYP= 9
##$DL= (0..7)
0 120 120 120 120 120 120 120 
##$DP= (0..7)
150 150 150 150 150 150 150 150 
##$DP07= 0
##$DPNAME0= <>
##$DPNAME1= <>
##$DPNAME2= <>
##$DPNAME3= <>
##$DPNAME4= <>
##$DPNAME5= <>
##$DPNAME6= <>
##$DPNAME7= <>
##$DPOAL= (0..7)
0.5 0.5 0.5 0.5 0.5 0.5 0.5 0.5 
##$DPOFFS= (0..7)
0 0 0 0 0 0 0 0 
##$DQDMODE= 0
##$DR= 18
##$DS= 0
$$ [...]
##$SUBNAM2= <"">
##$SUBNAM3= <"">
##$SUBNAM4= <"">
##$SUBNAM5= <"">
##$SUBNAM6= <"">
##$SUBNAM7= <"">
##$SUBNAM8= <"">
##$SUBNAM9= <"">
##$SW= 18.0517328524113
##$SWIBOX= (0..15)
0 0 2 0 0 0 0 0 0 0 0 0 0 0 0 0 
##$SW_h= 3612.71676300578
##$TD= 16384
##$TD0= 1
##$TE= 0
##$TE2= 300
##$TE3= 300
##$TEG= 300
##$TL= (0..7)
0 120 120 120 120 120 120 120 
##$TP= (0..7)
150 150 150 150 150 150 150 150 
##$TP07= 0
##$TPNAME0= <>
##$TPNAME1= <>
##$TPNAME2= <>
##$TPNAME3= <>
##$TPNAME4= <>
##$TPNAME5= <>
##$TPNAME6= <>
##$TPNAME7= <>
##$TPOAL= (0..7)
0.5 0.5 0.5 0.5 0.5 0.5 0.5 0.5 
##$TPOFFS= (0..7)
0 0 0 0 0 0 0 0 
##$TUNHIN= 0
##$TUNHOUT= 0
##$TUNXOUT= 0
##$USERA1= <user>
##$USERA2= <user>
##$USERA3= <user>
##$USERA4= <user>
##$USERA5= <user>
##$V9= 5
##$VALIST= <valist>
##$VCLIST= <CCCCCCCCCCCCCCC>
##$VD= 0
##$VDLIST= <DDDDDDDDDDDDDDD>
##$VPLIST= <PPPPPPPPPPPPPPP>
##$VTLIST= <TTTTTTTTTTTTTTT>
##$WBST= 1024
##$WBSW= 4
##$XGAIN= (0..3)
0 0 0 0 
##$XL= 0
##$YL= 0
##$YMAX_a= 315761
##$YMIN_a= -288476
##$ZGOPTNS= <>
##$ZL1= 120
##$ZL2= 120
##$ZL3= 120
##$ZL4= 120
##$ABSF1= 10
##$ABSF2= 0
##$ABSG= 5
##$ABSL= 3
##$ALPHA= 0
##$AQORDER= 0
##$ASSFAC= 0
##$ASSFACI= 0
##$ASSFACX= 0
##$ASSWID= 0
##$AUNMP= <proc_1d>
##$AZFE= 0.1
##$AZFW= 0.1
##$BCFW= 1
##$BC_mod= 2
##$BYTORDP= 1
##$COROFFS= 0
##$CY= 11.3945322036743
##$DATMOD= 1
##$DC= 2
##$DFILT= <>
##$DTYPP= 0
##$F1P= 15.7292609196834
##$F2P= 12.9074282941183
##$FCOR= 0.5
##$FTSIZE= 0
##$FT_mod= 4
##$GAMMA= 1
##$GB= 0.15
##$INTBC= 1
##$INTSCL= 1
##$ISEN= 128
##$LB= 0.24
##$LEV0= 0
##$LPBIN= 0
##$MAXI= 10000
##$MC2= 0
##$MEAN= 0
##$ME_mod= 0
##$MI= 1.114404
##$NCOEF= 0
##$NC_proc= 0
##$NLEV= 6
##$NOISF1= 3.799351
##$NOISF2= 2.8
##$NSP= 1
##$NTH_PI= 0
##$NZP= 0
##$OFFSET= 15.70392
##$PC= 1
##$PHC0= -24591.87
##$PHC1= 13.65273
##$PH_mod= 1
##$PKNL= yes
##$PPARMOD= 0
##$PSCAL= 0
##$PSIGN= 0
##$REVERSE= no
##$SF= 200.130013532006
##$SI= 16384
##$SIGF1= 3
##$SIGF2= 2
##$SINO= 400
##$SIOLD= 16384
##$SREGLST= <1H.CDCl3>
##$SSB= 0
##$STSI= 0
##$STSR= 0
##$SW_p= 3612.71676300578
##$SYMM= 0
##$S_DEV= 0
##$TDeff= 0
##$TDoff= 0
##$TI= <>
##$TILT= no
##$TM1= 0
##$TM2= 0
##$TOPLEV= 0
##$USERP1= <user>
##$USERP2= <user>
##$USERP3= <user>
##$USERP4= <user>
##$USERP5= <user>
##$WDW= 1
##$XDIM= 8192
##$YMAX_p= 0
##$YMIN_p= 0
$$ End of Bruker specific parameters
$$ ---------------------------------
##NTUPLES= NMR FID
##VAR_NAME=  TIME,          FID/REAL,        FID/IMAG
##SYMBOL=    X,             R,               I
##VAR_TYPE=  INDEPENDENT,   DEPENDENT,       DEPENDENT
##VAR_FORM=  AFFN,          ASDF,            ASDF
##VAR_DIM=   8192,          8192,            8192
##UNITS=     SECONDS,       ARBITRARY UNITS, ARBITRARY UNITS
##FACTOR=    0.0002768,     1,               1
##FIRST=     0,             0,               0
##LAST=      2.2672688,     0,               0
##MIN=       0,             -288476,         0
##MAX=       2.2672688,     315761,          0
$$ Real data points
##PAGE= N=1
##DATA TABLE= (X++(R..R)), XYDATA
$$ [...]
$$ plain form
1901 -461 -285 20 547 745 657 767 1051 970 1117 736 510 641 489 -95 -118 -365 -793 -738 -592 -658 -415 -34
1923 -34 17 -117 233 473 518 770 727 735 494 475 63 -54 50 -544 -752 -981 -865 -1171 -1110 -888 -847 -613 -406
1946 -406 -293 82 548 846 626 672 742 359 391 621 64 258 -58 -321 -1016 -829 -581 -852 -540 -485 -505 -252
1968 -252 244 -126 375 622 911 843 978 996 728 1084 910 301 298 76 -308 -516 -172 -634 -761 -481 -482 -381
1990 -381 -74 324 195 418 538 541 666 730 524 124 280 59 -279 -492 -606 -921 -929 -583 -542 -625 -528 -224 -404
2013 -404 -57 -33 139 562 273 222 596 709 481 212 321 -236 -352 -176 -711 -877 -534 -705 -482 -611 -224
2034 -224 -446 110 621 575 702 1054 1232 965 1079 935 538 616 624 -32 -115 -168 -576 -991 -648 -890 -636 -610
2056 -610 -474 -80 -134 280 27 438 734 719 671 727 813 223 136 -144 -193 -45 -334 -963 -849 -694 -955 -920 -479
$$ packed form
1901d61J76L05N27J98q8J10K84q1J47l81k26J31j52n84k3k47m28N5J46o6K43L81
1923c4N1j34L50K40M5K52m3Qk41j9m12j17J04n94k08k29J16l06O1K22M1K34K07
1946d06J13L75M66K98k20M6P0l83L2K30n57J94l16k63o95J87K48k71L12N5k0K53
1968b52M96l70N01K47K89o8J35J8k68L56j74o09lk22l84k08L44m62j27K80jJ01
1990c81L07L98j29K23J20LJ25O4k06m00J56k21l38k13j14l15qL46M1q3R7L04j80
2013d04L47K4J72M23k89n1L74J13k28k69J09n57j16J76n35j66L43j71K23j29L87
2034b24k22N56N11m6J27L52J78k67J14j44l97P8Qo56q3n3m08m15L43k42K54K6
2056f10J36L94n4M14k53M11K96j5m8N6Q6n90q7k80m9J48k89o29J14J55k61L5M41
$$ plain form
2079 -479 -635 -480 -109 -16 13 313 366 633 409 501 461 305 152 -106 -127 -140 -339 -364 -489 -318 -295 -69 -2
2102 -2 236 -9 525 801 534 711 588 391 461 470 96 96 -46 -37 -415 -182 -536 -595 -635 -446 -659 -469 -80 -146
2126 -146 50 461 549 528 585 781 500 439 -95 -257 -126 -598 -807 -750 -815 -1101 -878 -772 -733 -426 -600 -178
2148 -178 -191 125 555 469 671 762 683 406 206 273 108 244 -221 -535 -308 -579 -626 -825 -628 -283 -258 130
2170 130 235 257 818 669 728 657 901 527 581 512 51 68 -89 -304 -561 -657 -613 -701 -712 -394 -433 -449 274 55
2194 55 182 349 451 490 633 631 265 267 -7 12 -421 -329 -382 -606 -375 -710 -847 -377 -416 -227 71 -17 -165 165
2218 165 599 462 636 800 558 354 331 139 176 144 -205 -844 -263 -127 -347 -154 -59 -48 -195 200 464 493
2240 493 475 657 644 530 573 568 302 380 -100 -435 -526 -469 -617 -504 -670 -815 -602 -377 -278 -9 462 225 251
$$ packed form
2079d79j56J55L71R3K9L00N3K67k24R2m0j56j53k58k1j3j99k5j25J71K3K26O7
2102bK38k45N34K76k67J77j23j97P0Rl74%j42Rl78K33l54n9m0J89k13J90L89o6
2126a46J96M11Q8k1N7J96k81o1n34j62J31m72k09N7o5k86K23J06L9L07j74M22
2148a78j3L16M30q6K02R1p9k77k00O7j65J36m65l14K27k71m7j99J97L45K5L88
2170A30J05K2N61j49N9p1K44l74N4o9m61J7j57k15k57r6M4q8j1L18l9j6P23k19
2194E5J27J67J02L9J43kl66Kk74J9m33R2n3k24K31l35j37M70l9J89K98q8j48L30
2218A65M34j37J74J64k42k04k3j92L7l2l49o39N81J36k20J93R5J1j47L95K64K9
2240D93j8J82j3j14M3nk66P8m80l35r1N7j48J13j66j45K13K25R9K69M71k37K6
$$ plain form
2263 251 602 483 554 591 334 -45 -214 21 -11 -421 -375 -808 -807 -565 -836 -543 -132 -251 -119 180 265 359 696
2286 696 935 771 480 692 776 555 383 49 -38 -229 -257 -436 -404 -512 -169 -359 -152 -155 183 352 444 395 558
2309 558 760 493 815 710 195 185 235 91 -361 -297 -374 -527 -407 -569 -323 -577 -191 -115 -49 92 136 159 254
2332 254 457 272 201 233 209 -331 -315 -499 -443 -251 -499 -685 -439 -417 -229 -91 59 135 146 247 603 1059 593
2355 593 592 407 452 119 164 -130 9 -329 -454 -425 -340 -247 -381 -297 -82 -10 399 265 595 503 663 716 356 248
2379 248 530 377 245 -306 -353 -524 -539 -595 -304 -726 -371 -586 -514 -291 -162 64 237 470 516 188 414 607
2401 607 242 310 194 -54 -270 78 -631 -621 -504 -349 -425 -325 -119 -92 -269 52 275 416 575 612 621 781
2423 781 735 378 330 413 50 -30 -140 57 -332 -316 -258 -250 -389 -202 -123 77 187 279 437 450 424 382 451 391 183
$$ packed form
2263B51L51j19P1L7k57l79j69K35l2m10M6m33JK42k71K93M11j19J32K99Q5R4L37
2286F96K39j64k91K12Q4k21j72l34q7j91k8j79L2j08L43j90K07lL38J69R2m9J63
2309E58K02k67L22j05n15j0N0j44m52O4p7j53J20j62K46k54L86P6O6J41M4K3R5
2332B54K03j85p1L2k4n40J6j84N6J92k48j86K46K2J88J38J50P6J1J01L56M56m66
2355E93jj85M5l33M5k94J39l38j25K9Q5R3j34Q4K15P2M09j34L30r2J60N3l60j08
2379B48K82j53j32n51m7j71j5n6K91m22L55k15P2K23J29K26J73K33M6l28K26J93
2401F07l65O8j16k48k16L48p09J0J17J55p6J00K06K7j77L21K23J41J59L7RJ60
2423G81m6l57m8Q3l63q0j10J97l89J6N8Qj39J87P9K00J10R2J58J3k6m2O9o0k08
$$ plain form
2448 183 235 122 -155 -105 -445 -616 -337 -403 -671 -488 -403 -368 -163 21 162 194 210 221 155 136 286 -157 -96 -248
2472 -248 -195 -345 -358 -293 -298 -329 -712 -253 34 271 110 273 537 610 527 690 680 524 70 446 -19 -35 250
2495 250 -250 -301 -312 -542 -708 -355 -432 -532 -128 -153 -81 150 324 331 601 715 662 364 333 391 -5 88 -136 -330
2519 -330 -586 -593 -369 -653 -537 -686 -411 -209 -209 62 347 314 286 310 546 336 201 311 -49 -67 -131 -83 -304
2542 -304 -201 -227 -276 -392 -178 -247 -175 290 444 526 434 514 321 634 466 338 452 476 70 103 -52 -207 -185
2565 -185 -398 -480 -596 -298 -210 -386 -306 -104 270 43 181 398 365 355 126 399 145 67 -192 -32 -354 -424
2587 -424 -768 -540 -452 -381 -466 -324 -502 -103 152 -36 325 118 251 497 529 283 286 89 59 -93 -88 -78 -244
2610 -244 -418 -189 -435 -81 -170 -38 -198 102 557 299 535 275 298 399 454 398 19 5 -59 -5 -455 -391 -311
$$ packed form
2448A83N2j13k77N0l40j71K79o6k68J83Q5L5K05J84J41L2J6J1o6j9J50m43O1j52
2472b48N3j50j3O5nl1l83M59K87K37j61J63K64P3q3J63j0j56m54L76m65j6K85
2495B50n00n1j1k30j66L53p7j00M04k5P2K31J74PK70J14n3k98l1N8l96R3k24j94
2519c30k56pK24k84J16j49K75K02%K71K85l3k8K4K36k10j35J10l60j8o4M8k21
2542c04J03k6m9j16K14o9P2M65J54Q2r2Q0j93L13j68j28J14K4m06L3j55j55K2
2565a85k13q2j16K98Q8j76Q0K02L74k27J38K17l3j0k29K73k54p8k59J60l22p0
2587d24l44K28Q8P1q5J42j78L99K55j88L61k07J33K46L2k46Lj97l0j52NJ0j66
2610b44j74K29k46L54q9J32j60L00M55k58K36k60K3J01N5n6l79j4o4N4m50O4Q0
$$ plain form
2633 -311 -489 -573 -446 -247 -290 -117 -128 101 445 563 477 491 416 381 259 50 -45 -165 -440 -381 -92 -397 -657
2656 -657 -506 -495 -696 -235 -345 -127 76 180 387 421 624 477 344 332 215 371 277 316 -131 -180 -53 -429
2678 -429 -385 -260 -312 -353 -226 -140 73 317 206 338 433 297 412 352 360 31 295 -78 60 -216 164 -246 -723
2701 -723 -338 -443 -124 -232 97 -102 111 -223 -23 -69 195 356 -96 80 245 -64 -79 -525 -373 -290 -357
2722 -357 -700 -195 -510 -248 -149 79 189 -34 132 470 274 434 272 362 47 365 138 66 -20 -491 -423 -27
2744 -27 -114 -410 -337 -311 -135 -284 -3 50 113 285 617 439 490 208 379 460 330 1 -241 -240 -347 -410 -320 -482
2768 -482 -322 -345 -221 -503 -523 -38 115 137 30 317 413 573 247 97 140 91 -141 -359 -204 -432 -435 -363 -151
2791 -151 -239 -288 56 -302 -73 37 125 389 272 279 425 331 491 480 461 267 114 -286 -163 -363 -284 -156 -111
$$ packed form
2633c11j78q4J27J99m3J73j1K29L44J18q6J4p5l5j22k09r5j20k75N9K89l05k60
2656f57J51J1k01M61j10K18K03J04K07L4K03j47j33j2j17J56r4L9m47m9J27l76
2678d29M4J25n2m1J27Q6K13K44j11J32R5j36J15o0Ql29K64l73J38k76L80m10m77
2701g23L85j05L19j08L29j99K13l34K00m6K64J61m52J76J65l09j5m46J52Q3o7
2722c57l43N05l15K62R9K28J10k23J66L38j96J60j62R0l15L18k27p2q6m71O8L96
2744b7q7k96P3K6J76j49K81N3O3J72L32j78N1k82J71Q1j30l29k42Jj07o3R0j62
2768d82J60k3J24k82k0M85J53K2j07K87R6J60l26j50M3m9k32k18J55k28lP2K12
2791a51q8m9L44l58K29J10Q8K64j17PJ46r4J60j1j9j94j53m00J23k00P9J28M5
$$ plain form
2814 -111 157 -84 -106 -171 254 146 301 361 530 249 103 218 101 7 174 157 -75 -323 -177 -83 0 -166
2836 -166 -58 -104 -482 -47 190 -93 43 111 177 339 174 285 114 -87 39 34 -23 -224 -297 -497 -285 -461
2858 -461 -456 -408 -22 -32 1 147 197 -104 220 387 313 214 175 259 253 111 191 87 -605 -183 -199 -641 -410 -313 -429
2883 -429 -285 20 152 243 333 445 258 458 404 409 468 422 137 -303 -168 -77 -254 -380 -569 -447 -576 -592 -351
2906 -351 -242 -38 53 187 124 -65 274 195 318 -52 284 -87 -219 -123 -116 -301 -364 -86 -400 -139 -421 -44
2928 -44 -119 175 -26 -95 17 407 65 168 242 347 226 289 152 -73 208 -70 -236 -191 -119 -144 17 -313 -94
2951 -94 -137 50 79 32 97 253 54 317 31 325 249 21 -122 36 -36 -306 -480 -196 -443 -509 -193 -76 -173
2974 -173 115 61 -202 68 -18 68 250 99 361 172 31 37 -96 -204 -427 -308 -203 -163 -330 -159 -140 -86 -154
$$ packed form
2814a11K68k41k2o5M25j08J55O0J69k81j46J15j17r4J67j7k32k48J46R4Q3j66
2836a66J08m6l78M35K37k83J36O8O6J62j65J11j71k01J26nn7k01p3k00K12j76
2858d61NM8L86j0L3J46N0l01L24J67p4r9l9Q4oj42Q0j04o92M22j6m42K31R7j16
2883d29J44L05J32R1R0J12j87K00n4NN9m6k85m40J35R1j77j26j89J22j29j6K41
2906c51J09K04R1J34o3j89L39p9J23l70L36l71j32R6Pj85o3K78l14K61k82L77
2928d4p5K94k01o9J12L90l42J03P4J05j21O3j37k25K81k78j66M5P2k5J61l30K19
2951i4m3J87K9m7O5J56j99K63k86K94p6k28j43J58p2k70j74K84k47o6L16J17r7
2974a73K88n4k63K70q6Q6J82j51K62j89j41Oj33j08k23J19J05M0j67J71J9N4o8
$$ plain form
2997 -154 107 -42 130 189 162 352 123 227 160 216 100 137 -25 -123 -391 -148 -284 -155 -269 77 159 -39
3019 -39 110 115 22 237 271 400 316 409 114 46 -52 -111 -88 -451 -538 -366 -324 -399 -508 -121 -203 -177 -27 -132 80
3044 80 32 13 173 411 335 269 116 -70 130 -259 -249 -268 40 -520 -287 -354 -443 -205 -106 60 -24 52 52 157 209
3069 209 606 169 296 292 12 -66 98 23 -7 57 -52 -354 20 -10 -292 -90 -40 -151 98 130 420 -121 233
3092 233 367 230 -78 -26 12 223 -125 -205 -75 -64 -89 -326 -376 -203 -179 -170 188 -93 345 252 146 380 319 248
3116 248 354 167 274 -41 -31 -191 -197 -380 -175 -279 -282 -225 -36 -338 280 -22 155 206 416 323 400 312 177
3139 177 -96 303 243 58 73 31 -266 -232 -317 -448 -226 -344 -209 -276 -141 254 216 329 178 152 194 226 293 82
3163 82 0 -39 -24 -131 -475 -334 -259 -454 -391 -350 -179 -297 -276 102 85 144 44 435 174 397 244 247 308 -92
$$ packed form
2997a54K61j49J72N9k7J90k29J04o7N6j16L7j62r8k68K43j36J29j14L46Q2j98
3019c9J49Nr3K15L4J29q4R3k95o8r8n9K3l63q7J72M2p5j09L87q2K6J50j05K12
3044H0m8j9J60K38p6o6j53j86K00l89J0j9L08n60K33o7q9K38R9J66q4P6%J05N2
3069B09L97m37J27mk80p8J64p5l0O4j09l02L74l0k82K02N0j11K49L2K90n41L54
3092B33J34j37l08N2L8K11l48q0J30J1k5k37n0J73K4RL58k81M38r3j06K34o1p1
3116B48J06j87J07l15J0j60oj83K05j04lN7J89l02O18l02J77N1K10r3P7q8j35
3139A77k73L99o0j85J5m2k97L4q5j31K22j18J35o7J35L95l8J13j51k6M2L2O7k11
3163H2q2l9J5j07l44J41P5j95O3M1J71j18K1L78j7N9j00L91k61K23j53LO1m00
$$ plain form
3187 -92 98 -23 -140 -216 -121 -56 -217 -105 -163 -72 7 66 273 122 349 -116 415 335 502 164 -77 170 -10
3210 -10 -132 -106 -108 -115 -212 -205 -381 -229 -149 -129 -233 -26 -64 123 145 229 297 192 -33 -74 -89 113 -143 -95 -256 -271
3236 -271 -278 -100 -245 -153 -49 33 108 114 122 78 233 391 500 99 235 309 17 -74 -188 -163 -302 -141 -150 -289 -164
3261 -164 -65 -259 82 280 25 76 230 255 407 424 345 253 193 -81 144 -2 -97 -15 -256 -278 -369 -350 -287 -383 20
3286 20 -93 -19 89 8 31 -80 131 216 185 290 74 243 -208 -113 -121 -285 -198 -351 -294 -363 75 -305 -157 5
3310 5 18 328 -48 150 36 338 41 18 332 207 104 106 -57 -255 -1 -120 -59 -322 -193 -238 -273 -191 298
3333 298 66 223 298 321 117 336 244 88 -74 130 34 -81 -93 -231 -271 -104 -620 -292 -145 -444 -205 -41
3355 -41 110 131 167 149 279 120 163 -49 -133 -81 -266 -107 -193 22 -52 -172 -186 -565 -263 -135 -145 -202 13 221
$$ packed form
3187i2J90j21j17p6R5O5j61J12n8R1P9N9K07j51K27m65N31q0J67l38k41K47j80
3210a0j22K6kpr7Pj76J52Q0K0j04K07l8J87K2Q4O8j05k25m1j5K02k56M8j61j5
3236b71pJ78j45R2J04Q2P5OQm4J55J58J09m01J36P4k92r1j14K5j39J61rj39J25
3261a64R9j94L41J98k55N1J54K5J52J7p9r2o0k74K25j46r5Q2k41k2r1J9O3r6M03
3286B0j13P4J08q1K3j11K11Q5l1J05k16J69m51R5qj64Q7j53N7o9M38l80J48J62
3310EJ3L10l76J98j14L02k97k3L14j25j03Kj63j98K54j19O1k63J29m5l5Q2M89
3333B98k32J57P5K3k04K19r2j56j62K04r6j15j2j38m0J67n16L28J47k99K39J64
3355d1J51K1L6j8J30j59M3k12q4N2j85J59q6K15p4j20j4l79L02J28j0n7K15K08
$$ plain form
3379 221 -8 293 355 262 103 347 264 237 86 56 167 -346 -216 -506 -395 -173 -238 -207 -94 -77 -8 434 -23
3402 -23 109 64 435 136 270 232 -112 160 -195 38 -190 -186 -488 -578 -342 -385 -227 -106 -287 -169 109 161 255
3425 255 212 64 284 -95 197 54 -76 152 143 -126 -3 -77 -252 -293 -103 -192 -74 -117 16 255 269 25 99
3448 99 205 52 626 327 -70 -67 -62 -82 13 -7 112 -255 -460 -54 -110 -139 -102 19 59 -79 229 26 412 364
3472 364 159 19 -180 -18 89 -300 -135 -116 -179 -165 -179 -288 -206 -251 -246 -151 -132 -208 -25 251 -37 159 333 116
3496 116 321 303 335 13 -387 4 -129 -134 -271 -308 -178 -355 -152 -236 121 -12 336 110 158 495 228 104
3518 104 382 327 -82 200 189 -66 176 107 -287 -87 -105 -284 -153 -158 -136 54 272 50 124 103 204 220 225 277
3542 277 203 -361 -43 9 -241 -148 -285 -57 -119 -334 -109 -71 -228 -111 68 292 41 227 229 394 398 396 -8 333
$$ packed form
3379B21k29L01O2r3j59K44q3k7j51l0J11n13J30k90J11K22o5L1J13J7O9M42m57
3402b3J32m5L71k99J34l8l44K72l55K33k28Ml02r0K36m3J58J21j81J18K78N2R4
3425B55m3j48K20l79K92j43j30K28rk69J23p4j75m1J90q9J18m3J33K39J4k44P4
3448I9J06j53N74k99l97LNk0R5k0J19l67k05M06n6k9L7J21M0j38L08k03L86m8
3472C64k05j40j99J62J07l89J65J9o3J4j4j09Q2m5NR5J9p6J83K76k88J96J74k17
3496A16K05j8L2l22m00L91j33nj37l7J30j77K03q4L57j33L48k26M8L37k67j24
3518A04K78n5m09K82j1k55K42o9l94K00j8j79J31nK2J90K18k22P4k1J01J6NN2
3542B77p4n64L18N2k50R3j37K28o2k15K25L8j57J17J79K24k51J86KJ65Mkm04L41
$$ plain form
3566 333 -62 72 -178 -231 -344 -189 -242 -79 -39 -6 -50 255 8 43 119 314 161 294 96 104 123 68 192 128
3590 128 87 68 -247 -114 -131 88 -206 247 148 -201 -87 54 201 -170 456 197 209 197 57 100 77 -248 64
3613 64 -327 -256 -230 -223 -118 -307 -370 -35 -5 -13 190 230 69 156 172 144 252 302 -65 14 243 -150 -113 -191 -163 -322
3639 -322 -244 248 -229 -91 -288 -56 -268 132 -20 177 80 123 147 44 241 13 -49 -2 21 -118 -102 -200 -310
3662 -310 -104 -92 16 -283 95 131 -38 65 268 12 106 118 142 183 36 14 -47 78 -134 -223 -121 -367 -263
3685 -263 -218 114 -324 -148 213 9 -38 144 93 60 114 430 248 222 166 113 -33 0 -163 -18 -143 29 -57
3708 -57 -135 -91 109 157 -112 -35 -62 2 235 225 58 506 164 209 -199 186 -64 -44 -209 -195 -268 -228 -276 -1 -162
3733 -162 -210 -97 95 144 152 301 114 122 363 149 -161 57 -74 -64 6 -235 -98 -46 -38 -169 -224 -86 -36 -144
$$ packed form
3566C33l95J34k50n3j13J55n3J63M0L3m4L05k47L5P6J95j53J33j98QJ9n5J24o4
3590A28m1j9l15J33j7K19k94M53r9l49J14J41J47l71O26k59J2j2j40M3k3l25L12
3613F4l91P1K6PJ05j89o3L35L0qK03M0j61Q7J6k8J08N0l67P9K29l93L7p8K8j59
3639c22P8M92m77J38j97K32k12M00j52J97r7M3K4j03J97k28o2M7K3j39J6r8j10
3662c10K06J2J08k99L78L6j69J03K03k56R4J2K4M1j47k2o1J25k12q9J02k46J04
3685b63M5L32m38J76L61k04m7J82n1l3N4L16j82k6n6n3j46L3j63J45j25J72q6
3708e7p8M4K00M8k69P7k7O4K33j0j67M48l42M5m08L85k50K0j65J4p3M0m8K75j61
3733a62m8J13J92M9QJ49j87QK41k14l10K18j31J0P0k41J37N2Qj31n5J38N0j08
$$ plain form
3757 -144 31 450 282 145 28 184 52 301 178 217 179 -146 -160 -151 -144 -126 -124 -182 -107 -139 -133 -23 96 207 92
3782 92 -64 273 228 -16 236 0 144 -71 -294 249 144 -36 -293 -313 -305 -70 -319 -244 88 9 -110 85
3804 85 -18 255 291 24 182 162 -85 -36 84 -96 28 -77 -76 -79 40 -23 -73 -67 -72 -113 -8 136 105 -329 282
3829 282 240 339 110 204 56 7 -60 -139 -31 -297 105 -290 -288 -137 -36 15 270 -261 232 207 160 -63 17 30
3853 30 136 182 -105 52 -259 200 -348 -161 -60 -189 -347 -314 -46 -117 2 53 -117 203 286 -61 230 213
3875 213 148 170 -74 320 -86 -340 215 -202 212 -170 -376 83 -333 -256 -154 134 -77 146 147 160 -21 209
3897 209 283 287 176 234 221 279 134 -299 182 -65 -54 -171 -97 -264 194 -130 202 -3 65 -216 89 134 207 68
3921 68 -108 145 33 -269 4 -208 -117 -165 -175 8 -141 -163 -195 -127 -36 152 -34 49 322 50 148 -8 93
$$ packed form
3757a44J75M19j68j37j17J56j32K49j23L9l8l25j4RPJ8Kn8P5l2OJ10J19J11j15
3782I2j56L37m5k44K52k36J44k15k23N43j05j80k57k0QK35k49P5L32p9j19J95
3804H5j03K73L6k67J58k0k47M9J20j80J24j05JlJ19o3n0Onm1J05J44l1m34O11
3829B82m2R9k29R4j48m9o7p9J08k66M02l95KJ51J01N1K55n31M93k5m7k23Q0J3
3853C0J06M6k87J57l11M59n48J87J01j29j58L3K68p1J19N1j70L20Q3l47K91j7
3875B13o5K2k44L94m06k54N55m17M14l82k06M59m16P7J02K88k11K23JJ3j81K30
3897B09P4Mj11N8j3N8j45m33M81k47J1j17P4j67M58l24L32k05O8k81L05M5P3j39
3921F8j76K53j12l02K73k12R1m8j0J83j49k2l2O8R1J88j86Q3K73k72R8j56J01
$$ plain form
3944 93 154 -10 121 152 201 -116 -284 28 -21 44 3 -60 3 -47 72 311 109 189 147 10 125 250 122 -127
3968 -127 56 128 137 -42 -47 -74 -193 27 12 99 218 -409 -157 269 -15 201 -32 -75 55 258 226 230 264 -78
3992 -78 -73 -133 -94 -465 -216 30 -161 -111 -96 123 -95 177 287 92 216 107 255 183 207 32 166 -163 156
4015 156 40 -139 109 175 306 56 -105 -57 -103 20 -135 -18 101 -63 282 151 55 226 239 78 -74 -216
4037 -216 28 29 -102 22 -134 -57 -143 -107 80 -63 -40 -50 -118 188 84 242 78 141 24 55 132 83 -279 -61
4061 -61 19 -79 -210 -223 -203 -362 246 -44 -126 131 85 144 82 123 345 68 -42 251 -10 133 105 -48 -122 -135
4085 -135 -87 -461 -149 -74 -29 6 154 156 30 20 47 81 142 424 23 -129 -144 140 102 11 -112 -166 -70 38 -270
4110 -270 -108 -76 -189 -256 -58 33 105 -10 106 121 125 134 126 54 -91 -161 -168 -86 -235 -289 -304 -219 -12 -209 -166 -24 33
$$ packed form
3944I3O1j64J31L1M9l17j68L12m9O5m1o3O3n0J19K39k02Q0m2j37J15J25j28k49
3968a27J83P2Rj79nk7j19K20j5Q7J19o27K52M26k84K16k33m3J30K03l2ML4l42
3992g8No0L9l71K49K46j91N0J5K19k18K72J10j95J24j09J48p2K4j75J34l29L19
4015A56j16j79K48O6J31k50j61M8m6J23j55J17J19j64L45j31r6J71J3j61j52j42
4037b16K44Jj31J24j56P7q6L6J87j43K3j0o8L06j04J58j64O3j17L1P7m9l62K18
4061f1Q0r8j31j3K0j59O08k90q2K57m6N9o2M1K22k77j10K93k61J43k8j53p4j3
4085a35M8l74L12P5M5L5J48Kj26j0K7L4O1K82m01j52j5K84l8r1j23n4R6J08l08
4110b70J62L2j13o7J98R1P2j15J16J5MRqp2j45p0pQ2j49n4j5Q5K07j97M3J42N7
$$ plain form
4137 33 -125 86 56 213 -107 92 61 45 254 56 202 240 -127 -232 -26 -207 -94 -146 -4 87 -71 38
4159 38 -38 -53 10 283 268 134 95 238 57 210 74 -89 -32 -225 -188 -183 -288 104 -265 -44 -9 -43 22 65 -72
4184 -72 62 70 48 83 134 -86 189 -245 -161 -80 -137 -115 -92 68 -128 -450 -243 -144 -131 -18 69 175 292 97 156
4209 156 61 51 59 -176 49 -18 213 -36 50 -251 -107 -257 34 184 -149 59 157 -235 88 170 179 38 184
4232 184 323 88 117 -117 -45 82 -244 -226 -149 -73 -186 -34 -292 -237 -56 -85 249 224 -308 139 -73 270 -3
4255 -3 22 -116 142 18 -26 -154 -221 -324 -279 -155 -24 -92 -86 -274 -80 -118 -117 -17 25 -44 103 -2 51 179 -170
4280 -170 196 60 128 158 -58 52 -250 -156 -123 -186 0 9 -126 -231 202 -42 220 -6 164 279 98 40 65
4303 65 55 81 13 -107 -152 -183 13 -207 -249 -134 -226 -11 -210 -91 35 58 85 331 -21 182 173 56 5 9 -109
$$ packed form
4137C3j58K11l0J57l20J99l1j6K09j98J46L8l67j05K06j81J13n2J42R1j58J09
4159C8p6j5O3K73j5j34l9J43j81J53j36j63N7j93L7Nj05L92l69K21L5l4O5M3j37
4184g2J34Qk2L5N1k20K75m34Q4Q1n7K2K3J60j96l22K07R9J3J13Q7J06J17j95N9
4209A56r5j0Qk35K25o7K31k49Q6l01J44j50K91J50l33K08R8l92L23Q2Rj41J46
4232A84J39k35K9k34P2J27l26J8P7P6j13J52k58N5J81k9L34k5n32M47k12L43k73
4255cK5j38K58j24m4j28o7j03M5J24J31o8Oj88J94l8JJ00M2o9J47j05N3J28l49
4280a70L66j36O8L0k16J10l02R4L3o3J86Rj35j05M33k44K62k26J70J15j81n8K5
4303F5j0K6o8j20m5l1J96k20m2J15r2K15j99J19J26K3K7K46l52K03rj17n1Mj18
$$ plain form
4328 -109 200 -6 321 -9 68 -37 -149 319 -215 26 -144 182 171 143 39 39 110 63 29 26 -212 -113 3 -18
4352 -18 -42 -219 39 73 -72 -27 -119 -73 70 -94 99 280 209 72 -18 153 319 286 42 -171 -82 -9 -128 26
4376 26 -318 -128 -370 86 -34 -140 -176 -60 -129 42 123 3 25 223 140 234 180 116 -67 -52 195 -245 25
4399 25 -90 -60 -212 -286 -21 15 -111 27 222 -164 271 -119 196 113 3 223 -87 -45 2 -108 71 -16 -57
4422 -57 -180 -256 -106 -58 111 2 -74 -144 88 -94 109 227 264 102 180 -69 -132 -212 -135 -303 -109 70 -158
4445 -158 -143 -143 -196 -61 -35 155 -131 154 -13 32 130 186 -18 246 11 339 -114 -147 13 152 -145 -39 230
4468 230 61 22 -6 -5 105 -7 72 112 89 417 63 -113 267 127 96 15 -233 -31 -308 -241 61 -305 -213 -127
4492 -127 -177 209 -149 9 173 -10 -93 440 -36 77 108 193 -264 1 -87 -171 105 -110 -141 -89 -234 -90 115
$$ packed form
4328a09L09k06L27l30P7j05j12M68n34K41j70L26j1k8j04%P1m7l4lk38R9J16k1
4352a8k4j77K58L4j45M5r2M6J43j64J93J81p1j37r0J71J66l3k44k13Q9P3j19J54
4376B6l44J90k42M56j20j06l6J16o9J71Q1j20K2J98q3R4n4o4j83J5K47m40K70
4399B5j15L0j52p4K65L6j26J38J95l86M35l90L15q3j10K20l10M2M7j10J79q7m1
4422e7j23p6J50M8J69j09p6p0K32j82K03J18L7j62P8k49o3q0P7j68J94J79k28
4445a58J5%n3J35K6J90k86K85j67M5R8N6k04K64k35L28m53l3J60J39k97J06K69
4468B30j69l9k8JJ10j12P9M0k3L28l54j76L80j40l1q1k48K02k77O7L02l66R2Q6
4492a27n0L86l58J58J64j83q3N33m76J13L1Q5m57K65q8q4K76k15l1N2j45J44K05
$$ plain form
4515 115 -4 -35 248 -51 -212 165 162 35 114 17 -131 46 -77 290 82 -12 -139 -154 -99 -41 -159 -138 19
4538 19 154 22 -179 124 69 -94 38 -91 -29 178 130 37 164 248 -316 -43 28 -85 -111 38 44 -224 -169 24
4562 24 -202 -98 138 101 326 235 -3 178 -33 33 35 -150 12 -107 230 -35 -136 -271 7 -131 -76 154
4584 154 30 126 -141 271 451 414 308 485 -55 243 72 -213 -209 -117 -137 -16 90 -157 -148 -18 -118 -99 -24
4607 -24 134 257 61 15 359 221 43 218 158 19 114 56 -280 98 72 -247 172 -137 -14 -198 125 -158
4629 -158 49 251 125 98 80 -42 -11 52 -150 -137 -126 40 245 14 -144 64 -56 -27 -286 -47 -31 270 274
4652 274 142 104 -36 107 -7 151 240 -78 39 76 -140 114 -135 -159 -29 -205 -77 -3 -143 24 -54 -26
4674 -26 20 14 332 123 252 70 -100 -87 137 390 -19 -3 -138 -195 18 -177 30 -105 5 -12 -44 -233 -103
$$ packed form
4515A15j19l1K83k99j61L77lj27P9r7j48J77j23L67k08r4j27j5N5N8j18K1J57
4538A9J35j32k01L03n5j63J32j29O2K07m8r3J27Q4n64K73P1j13k6J49Ok68N5J93
4562B4k26J04K36l7K25r1k38J81k11O6Kj85J62j19L37k65j01j35K78j38N5K30
4584A54j24R6k67M12J80l7j06J77n40K98j71k85MR2k0J21J06k47RJ30j00J9P5
4607b4J58J23j96m6L44j38j78J75o0j39R5n8l36L78k6l19M19l09J23j84L23k83
4629a58K07K02j26k7j8j22L1O3k02J3J1J66K05k31j58K08j20K9k59K39J6L01M
4652B74j32l8j40J43j14J58Q9l18J17L7k16K54k49k4J30j76J28P4j40J67p8K8
4674b6M6oL18k09J29j82j70J3K24K53m09J6j35n7K13j95K07j35J10j7l2j89J30
$$ plain form
4697 -103 -18 124 64 226 -8 115 100 2 169 105 -255 113 -192 9 127 -210 -50 -144 10 -137 -158 -54
4719 -54 178 381 214 36 106 125 27 171 14 341 -160 34 122 8 138 -12 -371 -85 148 25 -15 -206
4741 -206 47 -15 218 72 198 170 208 -113 95 -20 -46 6 -208 112 -192 44 -84 -225 -195 87 -104 -100 -45
4764 -45 89 -132 -25 193 121 123 385 35 -121 -274 -175 36 -45 43 -98 45 -143 -228 228 -49 149 0 -13
4787 -13 29 91 158 13 212 157 82 -129 -6 68 -64 216 242 78 -163 -331 44 -97 -229 -141 215 299 -3
4810 -3 168 235 41 39 14 25 204 -184 28 -115 51 73 0 25 30 -81 13 -119 -10 -35 161 -189 -49 227 -131
4835 -131 158 37 -30 55 -69 -30 62 -178 -69 -235 -281 -102 -99 64 -176 -373 151 130 -80 201 123 -16 -10 158
4859 158 268 177 -5 176 -109 -384 -92 38 14 36 -7 115 -91 69 -27 -135 -105 -166 -253 -53 153 263 -50
$$ packed form
4697a03Q5J42o0J62k34J23j5r8J67o4l60L68l05K01J18l37J60r4J54j47k1J04
4719e4K32K03j67j78P0J9r8J44j57L27n01J94Q8j14J30j50l59K86K33j23m0j91
4741b06K53o2K33j46J26k8L8l21K08j15k6N2k14L20l04K36j28j41L0K82j91MN5
4764d5J34k21J07K18p2KK62l50j56j53R9K11q1Q8j41J43j88q5M56k77J98j49j3
4787a3M2O2O7j45J99n5p5k11J23P4j32K80K6j64k41j68L75j41j32Q8L56Q4l02
4810cJ71O7j94kk5J1J79l88K12j43J66K2p3K5Nj11R4j32J09k5J96l50J40K76l58
4835a31K89j21o7Q5j24L9R2k40J09j66m6J79LJ63k40j97N24k1k10K81p8j39OJ68
4859A58J10r1j82J81k85k75K92J30k4K2m3J22k06J60r6j08L0o1q7K00K06J10l13
$$ plain form
4882 -50 -77 303 -90 137 -27 179 46 -31 -70 25 -139 62 -21 -78 -39 7 -124 -54 16 177 -96 108 -36 -40
4906 -40 -19 -192 -107 -114 22 -12 -111 -43 -382 101 12 -43 95 -276 34 -21 23 -14 138 294 260 -94 -49 5 57 -79
4932 -79 -103 61 -66 -37 167 -146 -282 -78 27 10 31 103 101 248 168 181 160 211 146 -98 37 -105 -146 76 -3
4957 -3 42 -34 -179 -84 -95 -111 48 -121 254 -1 15 -165 157 96 243 -153 -66 -101 -297 147 66 -107 24 -126
4981 -126 78 -44 71 -233 215 5 42 127 -21 188 -83 -129 -94 278 91 -125 -147 -23 -105 -228 -400 -120
5003 -120 -237 88 -100 -138 29 179 -38 180 62 15 67 149 104 34 177 68 -98 -259 -212 2 44 -18 -208
5026 -208 -13 -85 -255 -21 -133 33 113 202 -80 9 -67 293 83 -8 98 -102 -99 43 -153 124 15 -186 -153
5049 -153 119 80 -70 -230 -40 -100 -57 146 155 247 -91 152 57 -59 -111 72 -3 53 -104 -244 -141 148 -106
$$ packed form
4882e0k7L80l93K27j64K06j33p7l9R5j64K01q3n7L9M6j31P0P0J61k73K04j44m
4906d0K1j73Q5pJ36l4r9O8l39M83q9n5J38l71L10n5M4l7J52J56l4l54M5N4N2j36
4932g9k4J64j27K9K04l13j36K04J05j7K1P2kJ47q0J3k1N1o5k44J35j42m1K22p9
4957cM5p6j45R5j1j6J59j69L75k55J6j80L22o1J47l96Q7l5j96M44q1j73J31j50
4981a26K04j22J15l04M48k10L7Q5j48K09k71m6L5L72j87k16k2J24q2j23j72K80
5003a20j17L25j88l8J67J50k17K18j18m7N2Q2m5p0J43j09j66j61M7K14M2o2j90
5026b08J95p2j70K34j12J66Q0Q9k82Q9p6L60k10r1J06k00LJ42j96K77j09k01L3
5049a53K72l9j50j60J90o0M3K03RR2l38K43r5j16n2J83p5N6j57j40J03K89k54
$$ plain form
5072 -106 105 -113 -57 240 -101 -122 11 198 -215 56 26 -320 59 -39 -145 -152 -141 177 -261 -142 -170 50 -34
5095 -34 -77 3 51 25 113 -54 9 183 225 106 -23 42 150 266 -70 -43 -82 89 -102 -20 -238 -56 26 -46 -196
5120 -196 93 30 67 452 321 -172 104 223 -214 41 166 -83 -51 -100 -32 -79 -140 -221 -199 68 -38 181 -34
5143 -34 141 58 55 310 68 35 -81 66 16 209 101 -157 -80 87 -86 260 -125 -34 -326 -56 91 15 -3
5166 -3 -73 96 6 102 118 -58 -60 133 223 -24 100 -184 -149 -7 -157 -349 -167 -135 -285 -103 -145 -81 -10 -172 65
5191 65 220 150 -68 97 256 13 -31 -166 -36 -99 99 158 -309 -227 -95 -27 -105 263 -211 -245 -219 185 377
5214 377 91 151 131 -5 67 -231 -14 -539 -82 -273 -136 -179 -144 148 -199 -85 -193 29 -58 -145 -132 70 1
5237 1 -55 100 250 114 216 214 -216 -158 122 53 93 -68 215 -26 -84 16 -123 -39 76 -16 72 39 108 145 -246
$$ packed form
5072a06K11k18N6K97l41k1J33J87m13K71l0l46L79r8j06pJ1L18m38J19k8K20q4
5095c4m3Q0M8k6Q8j67O3J74M2j19j29O5J08J16l36K7l9J71j91Q2k18J82Q2p2j50
5120a96K89o3L7L85j31m93K76J19m37K55J25k49L2m9O8m7o1q1K2K67j06K19k15
5143c4J75q3lK55k42l3j16J47n0J93j08k58P7J67j73L46l85R1k92K70J47p6j8
5166cp0J69r0R6J6j76kJ93R0k47J24k84L5J42j50j92J82L2j50J82m2O4P1j62K37
5191F5J55p0k18J65J59k43m4j35J30o3J98N9m67Q2J32O8p8L68m74l4K6M04J92
5214C77k86O0k0j36P2k98K17n25M57j91J37m3L5K92l47J14j08K22q7q7J3K02o9
5237An6J55J50j36J02km30N8K80o9M0j61K83k41n8J00j39Q4J15r2Q8l3O9L7l91
$$ plain form
5262 -246 191 -2 -86 92 -20 -16 -154 -215 -182 198 -137 -27 -90 -94 -243 169 1 26 223 -54 -142 234 184 59
5286 59 53 47 42 -67 -65 -20 32 -219 -118 -157 -84 157 89 92 91 49 133 21 22 322 -15 168 13 136 -18 21 -209 -57
5314 -57 141 -33 -156 1 -134 -5 -84 12 64 24 -145 331 99 82 82 51 118 -60 85 -90 -46 -111 17 -335
5338 -335 17 -169 -163 85 -110 -3 -238 11 48 -112 118 -130 -64 67 40 263 175 -229 -29 97 -221 10
5360 10 46 -127 -27 -75 -19 -59 -117 -47 75 -131 -65 261 -79 201 126 203 -137 97 27 -81 59 107 72 84 -85
5385 -85 -199 -50 -182 -101 -7 186 103 268 74 119 60 295 163 -132 139 74 -111 -296 82 -85 170 -163
5407 -163 28 116 111 -24 -379 -135 -46 -31 35 -15 -140 162 109 187 -142 20 10 -251 -82 -111 234 -73 353 -68
5431 -68 137 -72 -191 108 246 284 -199 1 34 -68 327 334 65 -210 -80 -33 9 148 308 41 -89 103
$$ packed form
5262b46M37j93q4J78j12Mj38o1L3L80l35J10o3mj49M12j68K5J97k77q8L76n0j25
5286E9oonj09KM5N2k51J01l9P3K41o8Ljm2Q4j12JL00l37J83j55J23j54L9k30J52
5314e7J98j74j23J57j35J29p9R6N2m0j69M76k32j7%l1O7j78J45j75M4o5J28l52
5338c35L52j86OK48j95J07k35K49L7j60K30k48O6J31k7K23q8m04K00J26l18K31
5360A0L6j73J00m8N6m0n8P0J22k06O6L26l40K80p5P7l40K34p0j08J40M8l5J2j69
5385h5j14J49j32Q1R4J93q3J65j94M5n9K35j32k95K71o5j85j85L78j67K55l33
5407a63J91Q8nj35l55K44Q9J5O6n0j25L02n3P8l29J62j0k61J69k9L45l07M26m21
5431f8K05k09j19K99J38L8m83K00L3j02L95Pk69k75J30M7M2J39J60k67j30J92
$$ plain form
5453 103 -20 82 1 146 260 151 319 258 63 -5 2 25 -116 -17 79 -14 69 -77 -188 -273 185 128 18 27 -92
5478 -92 67 55 179 103 -172 118 205 88 123 -18 60 54 130 238 1 -35 -93 -178 -7 96 -116 13 -132 248
5502 248 -26 101 104 110 196 226 -72 -164 102 165 5 7 146 209 -43 -179 36 29 -123 156 -36 -23 -180 -144 111
5527 111 -58 63 85 -80 234 -62 130 -83 -4 44 -106 -68 53 144 -155 61 -179 -64 -46 180 96 117 56
5550 56 3 134 -70 83 106 31 305 9 -82 147 121 10 66 -103 47 108 98 -145 46 -232 88 170 91 206
5574 206 -153 349 218 -117 -183 -35 -32 -129 292 9 7 -117 -87 -64 -144 1 25 -34 132 -2 151 -44 -126 67
5598 67 -17 -151 77 197 11 -92 6 -140 -211 72 14 219 146 27 11 -81 118 156 251 -17 80 124 -97 96
5622 96 140 -177 -98 41 104 -137 -3 -153 -64 -66 10 50 72 181 87 27 31 36 -209 20 25 30 83 251 21 -76 244
$$ packed form
5453A03j23J02q1J45J14j09J68o1j95o8PK3j41R9R6r3Q3j46j11q5M58n7j10Rj19
5478i2J59j2J24p6k75K90Q7j17L5j41P8oP6J08k37l6n8q5J71J03k12J29j45L80
5502B48k74J27LOQ6L0k98r2K66O3j60KJ39O3k52j36K15pj52K79j92J3j57L6K55
5527A11j69J21K2j65L14k96J92k13P9M8j50L8J21R1k99K16k40J15J8K26q4K1o1
5550E6n3J31k04J53K3p5K74k96r1K29k6j11N6j69J50O1j0k43J91k78L20Q2p9J15
5574B06l59N02j31l35o6J48Lr7M21k83kj24L0K3q0J45K4n9J66j34J53j95q2J93
5598F7q4j34K28J20j86j03R8j46p1K83n8K05p3j19j6r2J99L8R5k68R7M4k21J93
5622I6M4l17P9J39O3k41J34j50Q9kP6M0K2J09r4o0MNk45K29NNN3J68k30r7L20
$$ plain form
5649 244 -408 -130 -169 -87 -250 -250 85 -160 121 5 -17 -76 151 -111 191 102 -111 -134 -39 207 -164 -157 -41 71
5673 71 -163 -33 62 77 54 -160 34 75 -37 -12 47 -93 43 -208 8 -159 -113 -8 -124 -177 10 -100 24
5696 24 -23 9 23 69 -111 166 96 -209 110 206 -8 -163 0 197 -138 57 -255 -110 -176 -219 207 38 -111
5719 -111 -63 -122 73 33 316 32 3 246 -38 -91 32 155 -66 -199 196 -4 -124 105 94 -8 74 -108
5741 -108 -4 -103 94 -69 -123 -28 130 -62 144 -46 81 70 -38 -66 16 30 -65 -81 -231 -150 49 224 -218
5764 -218 -201 163 -89 -37 12 191 -36 84 -46 241 -130 -123 -201 -115 -27 38 126 -161 -247 -54 -306 -298 -119 -107 51
5789 51 82 -203 36 97 -17 200 215 13 180 111 136 -122 -174 10 -249 -14 21 -106 -171 -136 2 -172 264
5812 264 -106 -91 -148 43 27 54 -139 97 -33 37 -57 170 111 270 193 -70 -69 -164 -254 -358 -24 -62 172 -205
$$ packed form
5649B44o52K78l9Q2j63%L35k45K81j16k2n9K27k62L02q9k13k3R5K46l71PJ16J12
5673G1k34J30R5J5k3k14J94M1j12K5N9j40J36k51K16j67M6J05j16n3J87j10J24
5696B4m7L2J4M6j80K77p0l05L19R6k14j55J63J97l35J95l12J45o6m3M26j69j49
5719a11M8n9J95m0K83k84k9K43k84n3J23J23k21j33L95k00j20K29j1j02Q2j82
5741a08J04r9J97j63n4R5J58j92K06j90J27j1j08k8Q2J4r5j6j50Q1J99J75m42
5764b18J7L64k52N2M9J79k27J20j30K87l71Pp8Q6Q8O5Q8k87q6J93k52QJ79J2J58
5789E1L1k85K39O1j14K17J5k02J67o9K5k58n2J84k59K35L5j27o5L5J38j74M36
5812B64l70J5n7J91j6K7j93K36j30P0r4K27n9J59p7k63Jr5r0j04L34l8K34l77
$$ plain form
5836 -205 -11 -243 101 -72 140 -146 276 -47 -44 -97 -21 195 -243 109 -203 211 -85 44 -193 135 42 -13
5858 -13 -35 -43 41 317 17 125 221 99 206 -124 344 -71 -14 46 -197 -26 -15 -114 -13 -74 -166 120 8 -42
5882 -42 106 -84 52 -122 3 -58 57 -72 153 -44 -110 -9 17 -280 18 -311 97 56 -23 -122 -194 -104 180
5905 180 -5 -83 29 170 204 132 56 54 -80 175 -190 -113 -76 -52 170 -179 -42 -136 146 -48 51 118 70 66 -131
5930 -131 16 -98 -97 -100 156 -13 78 252 116 9 -98 -236 -38 27 142 -23 -4 30 111 -106 -102 174 -65 -22
5954 -22 -35 150 187 -93 98 183 409 165 80 -100 -117 -145 -48 -26 34 -298 -136 -6 86 16 -90 -138 -62 -83 1
5979 1 331 146 33 146 -75 13 -66 -251 -77 -338 -19 -266 155 307 -207 62 82 26 98 179 120 233 -58
6002 -58 -218 7 -81 16 88 -159 55 -89 35 -67 5 -144 34 -150 171 102 -6 -160 28 230 113 124
$$ packed form
5836b05J94k32L44j73K12k86M22l23Ln3P6K16m38L52l12M14k96J29k37L28r3n5
5858a3k2qQ4K76l00J08R6j22J07l30M68m15N7O0k43J71J1r9J01o1r2K86j12n0
5882d2J48j90J36j74J25o1J15j29K25j97o6J01K6k97K98l29M08m1p9r9p2R0K84
5905A80j85p8J12J41L4p2p6kj34K55l65P7L7K4K22l49J37r4K82j94R9O7m8mj97
5930a31J47j14JlK56j69R1J74j36j07j07j38J98O5J15j65J9L4Q1k17MK76k39M3
5954b2j3J85L7k80J91Q5K26k44q5j80j7k8R7K2O0l32J62J30R2p0j06m8P6k1Q4
5979AL30j85j13J13k21Q8p9j85J74k61L19k47M21J52n14K69K0n6P2Q1n9J13k91
6002e8j60K25q8R7P2k47K14j44J24j02P2j49J78j84L21o9j08j54J88K02j17J1
$$ plain form
6024 124 97 203 -44 52 32 66 -303 -28 17 171 87 -219 82 120 -212 182 11 -82 -16 102 -40 200 47
6047 47 -48 -152 53 -77 -17 -17 -61 -101 -115 -159 -33 21 -101 133 -147 78 155 219 126 -81 131 93 52 -33 -57 -2
6073 -2 86 -83 -12 -178 -79 -73 -32 -177 213 196 -15 -42 -127 65 -154 -34 -8 132 113 108 88 -16 -42 -70 -275 -190
6099 -190 -42 -270 258 -81 45 -286 -55 -6 -126 63 274 -134 -88 -156 -292 100 140 68 -106 128 -176 54
6121 54 -100 8 -141 -222 79 -30 -178 97 235 2 24 57 35 -73 -21 -258 167 -13 -123 227 10 80
6143 80 -34 192 -312 -78 -76 -156 -104 83 -7 74 54 103 -125 67 307 39 -128 -49 71 -96 -29 -96 -275 137
6167 137 123 90 -14 196 -17 30 17 72 13 80 -89 -220 -266 196 72 -27 -181 -21 -59 -78 -240 -41 132 -191
6191 -191 -141 -86 190 -190 -71 -60 97 -260 155 16 238 43 -141 186 124 -31 -25 16 -85 -111 -124 -31 -5 -190
$$ packed form
6024A24k7J06k47R6k0L4l69K75M5J54q4l06L01L8l32L94j71r3O6J18j42K40j53
6047D7r5j04K05j30O0%m4m0j4m4J26N4j22K34k80K25P7O4r3k07K12l8m1q5k4N5
6073bQ8j69P1j66R9OM1j45L90j7k11k7q5J92k19J20K6J40j9nk0j04k6k8k05Q5
6099a90J48k28N28l39J26l31K31M9j20J89K11m08M6o8j36L92M0p2j74K34l04K30
6121E4j54J08j49q1L01j09j48K75J38k33K2L3k2j08N2k37M25j80j10L50k17P0
6143H0j14K26n04K34Kq0N2J87r0Q1k0M9k28J92K40k68j67P9J20j67O7o7j79M12
6167A37j4l3j04K10k13M7j3N5n9O7j69j31m6M62j24r9j54J60l8j9j62J99J73l23
6191a91N0N5K76l80J19J1J57l57M15j39K22j95j84L27o2j55OM1j01k6j3R3K6j85
$$ plain form
6215 -190 -26 -34 34 225 99 36 -40 158 0 87 381 36 -139 218 18 -6 95 -202 -180 2 44 46 -121 -32
6239 -32 123 -130 -114 49 287 23 -14 -102 306 -49 -51 172 -56 96 94 108 160 -21 -115 -36 4 70 58 144 158 22
6265 22 147 221 -78 -221 247 16 164 -34 17 145 -92 -188 -83 129 -450 114 87 58 -136 -42 269 250 68
6288 68 54 -124 111 -55 -196 -13 164 215 -133 16 -66 74 20 -83 -89 -245 56 147 21 -97 -141 -2 -51
6311 -51 -141 320 59 110 62 52 227 -114 -60 -77 162 -85 -8 -143 12 32 1 58 -1 -12 138 -27 146 193 14
6336 14 -12 119 -88 85 133 8 111 15 -3 -6 -80 -66 -86 -212 -107 -130 -84 200 14 454 13 -152 48 -15
6360 -15 -51 -26 -55 -279 237 -101 -31 -174 -206 34 37 124 31 183 43 181 106 13 147 -36 -39 106 80 -177 219
6385 219 -49 -52 -46 -113 123 -239 150 126 257 -84 -75 146 -68 122 282 115 124 116 48 16 211 -9 -78 -159 -48
$$ packed form
6215a90J64qO8J91j26o3p6J98j58Q7K94l45j75L57k00k4J01k97K2J82M2Kj67Q9
6239c2J55k53J6J63K38k64l7q8M08l55kK23k28J52kJ4N2j81r4P9M0O6j2Q6J4j36
6265B2J25P4k99j43M68k31J48j98N1J28k37r6J05K12n79N64k7k9j94R4L11j9j82
6288F8j4j78K35j66j41J83J77N1l48J49q2J40n4j03oj56L01R1j26j18m4J39m9
6311e1r0M61k61N1m8j0J75l41N4j7K39k47P7j35J55K0l1N7n9j1J50j65J73M7j79
6336A4k6J31k07J73M8j25J03r6j8lp4J4k0j26J05k3M6K84j86M40m41j65K00o3
6360a5l6K5k9k24N16l38P0j43l2K40LQ7r3J52j40J38p5r3J34j83lJ45k6k57L96
6385B19k68lOo7K36l62L89k4J31l41RK21k14J90J60j67Rqo8l2J95k20o9q1J11
$$ plain form
6410 -48 194 139 -145 -136 -126 -175 -32 61 154 29 -45 -65 -63 -130 161 241 -59 106 -163 18 -197 107 -10 -30 -77
6435 -77 -94 -43 -234 -127 137 10 97 67 129 134 188 -70 -72 -2 -101 -62 157 2 -169 131 -94 52 -91 -45 166
6460 166 53 -255 56 104 -44 -51 139 -154 -64 116 165 127 -177 165 -130 307 57 -185 -195 -172 45 -282 -20
6483 -20 206 3 -192 25 -51 55 114 211 176 -78 129 47 -95 -100 -43 -77 -75 -6 -93 -42 109 -39 42 -242 -169 -252
6509 -252 18 -6 5 46 193 -17 5 -3 67 49 -82 253 -169 -101 -181 -173 59 117 -86 -74 -31 8 33 62 157 53
6535 53 -67 37 174 -117 -161 36 -17 216 151 -82 -230 -134 -85 -179 -126 -333 -290 -54 55 -124 209 -34 -76
6558 -76 -114 285 289 -129 -10 43 -207 -41 -15 -69 -218 45 89 119 110 -77 -154 -67 81 -3 -45 10 -237 74 116 -266
6584 -266 67 298 -116 56 108 -152 -88 -140 -104 -141 -100 24 -43 -3 62 47 6 8 168 83 -9 -107 -209 -91 -166 362
$$ packed form
6410d8K42n5k84RJ0m9J43R3R3j25p4k0Ko7K91Q0l00J65k69J81k15L04j17k0m7
6435g7j7N1j91J07K64j27Q7l0O2NN4k58kP0r9L9K19j55j71L00k25J46j43M6K11
6460A66j13l08L11M8j48pJ90k93R0J80M9l8l04L42k95M37k50k42j0K3K17l27K62
6483b0K26k03j95K17p6J06N9R7l5k54K07q2j42nN7l4KO9q7N1J51j48Q1k84P3q3
6509b52K70k4J1M1J47k10K2qP0j8j31L35m22O8q0QK32N8k03J2M3L9K5K9R5j04
6535E3j20J04J37k91m4J97n3K33o5k33j48R6M9r4N3k07M3K36J09j79L33k43m2
6558g6l8L99Mm18J19N3k50J66K6n4j49K63M4L0rj87p7Q7J48q4m2N5k47L11M2l82
6584b66L33K31m14J72N2k60O4n2L6l7M1J24o7M0O5j5m1KJ60q5r2r8j02J18p5N28
$$ plain form
6610 362 140 -55 -8 -86 43 170 -78 125 -61 -21 -169 -227 -90 258 1 -178 -115 58 -52 -1 41 108 -25
6633 -25 12 -16 69 136 61 65 -204 -280 -236 -131 33 104 -143 242 -31 -73 74 -29 -166 -186 -83 182 -193 -71
6657 -71 27 -190 -10 65 -89 -254 217 -15 10 -5 -114 -87 101 41 -134 75 -18 263 -227 -58 182 -107 -99
6680 -99 36 33 43 51 -22 -182 -132 109 24 -80 -180 -225 -113 30 82 -61 219 -62 -77 -130 -243 -24 31 109 -148
6705 -148 128 -163 -131 -130 -17 69 -19 -96 273 185 -22 124 -231 54 129 36 196 43 -219 -66 -34 -291 39
6728 39 352 13 -82 237 -81 43 141 -45 88 -99 -143 -53 13 143 119 -38 -188 138 -131 -171 85 4 88
6751 88 -17 -93 -80 -267 -76 -10 201 221 -61 -26 -70 -77 -101 -11 88 -167 1 -208 36 -20 -19 153 64 7 10 9 -51
6778 -51 -5 24 17 136 -174 242 -67 -345 139 -78 36 98 -10 4 -1 -32 17 -53 -71 -206 30 -24 284 17 -97
$$ packed form
6610C62k22j95M7p8J29J27k48K03j86M0j48n8J37L48k57j79O3J73j10N1M2O7j33
6633b5L7k8Q5O7p5Mk69p6M4J05J64P1k47L85k73m2J47j03j37k0J03K65l75J22
6657g1R8k17J80P5j54j65M71k32K5j5j09K7J88o0j75K09r3K81m90J69K40k89Q
6680i9J35lJ0Qp3j60N0K41q5j04j00m5J12J43N2j43K80k81j5n3j13K19N5P8k57
6705a48K76k91L2JJ13Q6q8p7L69q8k07J46l55K85P5r3J60j53k62J53L2k57L30
6728C9L13l39r5L19l18J24R8j86J33j87m4R0O6J30k4j57j50L26k69m0K56q1Q4
6751H8j05p6J3j87J91O6K11K0k82L5m4pk4R0R9k55J68k09K44n6JJ72q9n7Ljo0
6778e1M6K9pJ19l10M16l09k78M84k17J14O2j08J4nl1M9p0j8j35K36n4L08k67j14
$$ plain form
6803 -97 84 134 -74 -80 -2 -151 254 81 51 -61 -250 -36 -232 -114 -301 79 240 -111 110 191 128 -148 138
6826 138 108 -11 25 313 -56 105 407 135 -135 -32 -113 -28 -163 -18 -88 -237 -28 156 184 128 69 25 311
6849 311 127 275 -82 -47 -4 -147 66 94 -185 -45 23 14 7 -72 -137 -104 -255 147 129 55 255 27 98 -17 59
6874 59 -194 28 -90 -17 -96 -160 -98 -49 -276 -118 -144 178 220 15 103 -323 -28 -87 208 7 22 -171 -107 -208
6898 -208 -129 -238 -52 128 -68 -132 -63 -101 -149 -5 84 67 -27 -30 -6 -28 210 7 -43 -38 99 -48 101 -159 45
6923 45 -202 -210 109 -99 -122 87 80 34 123 44 149 -60 153 -95 -18 208 218 136 169 11 274 88 -55 -121 -254
6948 -254 -92 45 -238 55 -70 -129 3 -38 100 161 29 44 137 51 25 -110 2 -272 -87 -139 -163 -177 5
6971 5 -245 63 -229 -144 -67 -4 -166 -38 50 -48 280 35 162 333 189 111 -6 -52 -54 -82 -166 -242 -158 -95 -165 27
$$ packed form
6803i7J81N0k08oP8j49M05j73l0j12j89K14j96J18j87L80J61l51K21Q1o3k76K86
6826A38l0j19L6K88l69J61L02k72k70J03q1Q5j35J45p0j49K09J84K8n6n9m4K86
6849C11j84J48l57L5M3j43K13K8k79J40O8rpp9o5L3j51M02j8p4K00k28P1j15P6
6874E9k53K22j18P3p9o4O2M9k27J58k6L22M2k05Q8m26K95n9K95k01J5j93O4j01
6898b08P9j09J86J80j96o4O9l8m8J44Q9j7r4lK4k2K38k03n0NJ37j47J49k60K04
6923D5k47qL19k08k3K09pm6Q9p9J05k09K13k48P7K26J0q2L3j58K63j86j43o6j33
6948b54J62J37k83K93j25n9J32m1J38O1j32J5R3q6k6j35J12k74J85n2k4j4J82
6971Ek50L08k92Q5P7O3j62J28Q8r8L28k45J27J71j44p8j17m6kk8q4p6Q4O3p0J92
$$ plain form
6997 27 37 108 225 96 -46 -4 45 -125 20 24 19 159 172 89 -87 -86 161 53 -96 2 -123 -9 16 -189 246
7022 246 239 68 -1 50 25 56 14 170 137 127 143 53 166 20 -70 -244 -163 -131 -198 81 65 53 -13 63 -15 80 -98
7049 -98 -101 316 235 267 273 76 -61 19 -279 67 -174 -49 -68 114 -93 79 68 -239 -173 29 141 170 -80 265
7073 265 -44 -59 223 -44 7 -248 59 83 -150 -15 169 -59 70 -34 -250 110 47 -23 -339 -260 -147 -166
7095 -166 -135 25 -39 86 -240 -61 133 -106 161 -43 -17 -8 41 -81 -254 -69 -53 87 51 -47 -147 47 74
7118 74 59 -103 81 -176 166 114 15 -71 123 81 -171 110 -39 96 29 -19 -196 128 118 -248 -111 -31 113
7141 113 -147 -158 1 65 28 70 -291 -7 -150 58 135 -135 -225 79 29 -18 70 163 382 -35 -63 143 -117 256
7165 256 96 30 235 -6 12 -233 53 24 131 10 129 -350 -153 50 182 98 94 -125 -147 236 246 24 -104
$$ packed form
6997B7J0P1J17j29j42M2M9j70J45MnJ40J3q3j76JK47j08j49R8j25J14K5k05M35
7022B46pj71o9N1k5L1m2J56l3j0J6r0J13j46r0j74Q1L2o7K79j6j2o6P6p8R5j78
7049i8lM17q1L2Oj97j37Q0k98L46k41J25j9J82k07J72j1l07O6K02J12K9k50L45
7073B65l09j5K82k67N1k55L07K4k33J35J84k28J29j04k16L60o3p0l16P9J13j9
7095a66L1J60o4J25l26J79J94k39K67k04K6RM9j22j73J85J6J40l6r8j00J94K7
7118G4j5j62J84k57L42n2r9q6J94m2k52K81j49J35o7m8j77L24j0l66J37Q0J44
7141A13k60j1J59O4l7M2l61K84j43K08P7k70r0L04n0m7Q8R3K19m17k8K06k60L73
7165B56j60o6K05k41J8k45K86k9J07j21J19m79J97K03J32q4mk19k2L83J0k22j28
$$ plain form
7188 -104 196 -65 -126 111 -93 359 -62 14 -196 -352 -121 -97 3 98 96 -27 19 -22 48 14 -152 88 -141
7211 -141 -17 46 -236 3 -39 -123 -234 -218 -378 81 114 20 182 10 78 156 95 56 -181 -114 70 -46 11 -187
7235 -187 25 -102 -93 -113 90 37 27 3 215 -114 26 54 193 26 281 262 -12 -102 -10 -101 210 -137 195 -122
7259 -122 -401 -111 -202 8 -47 -175 -67 83 2 6 32 158 -173 67 93 144 101 6 131 58 -14 119 -144 -87
7283 -87 -20 -37 -148 -173 -259 -53 43 -99 -68 135 119 186 178 38 -109 -213 18 145 207 -8 -34 4 -39 284 -60
7308 -60 -66 120 -253 -12 126 83 179 -220 -2 -7 14 -175 166 -193 69 -113 85 -97 43 -42 -102 -231 -144 26
7332 26 21 -14 79 -185 1 245 108 -9 -3 -241 -299 158 153 19 236 46 -129 -149 -153 -105 -189 54 256 61 162
7357 162 101 -79 -43 -166 232 60 71 -19 -164 84 81 206 122 -216 -10 -79 -135 48 -198 -115 -42 166 -219 -64
$$ packed form
7188a04L00k61o1K37k04M52m21P6k10j56K31K4J00R5kj23M6m1P0l4j66K40k29
7211a41J24O3k82K39m2q4j11J6j60M59L3r4J62j72O8P8o1l9k37O7J84j16N7j98
7235a87K12j27Rk0K03n3j0k4K12l29J40K8J39j67K55j9k74r0R2r1L11l47L32l17
7259a22k79K90r1K10n5j28J08J50q1MK6J26l31K40K6N1m3r5J25p3p2J33k63N7
7283h7O7j7j11k5q6K06R6j42L1K03j6O7qj40j47j04K31J27O2k15k6L8m3L23l44
7308f0oJ86l73K41J38m3R6l99K18nK1j89L41l59K62j82J98j82J40q5o0j29Q7J70
7332B6nl5R3k64J86K44j37j17Ok38n8M57nj34K17j90j75k0mM8q4K43K02j95J01
7357A62o1j80L6j23L98j72J1r0j45K48lJ25q4l38K06o9n6J83k46Q3P3K08l85J55
$$ plain form
7381 -64 6 64 -47 186 211 166 -11 -4 29 -51 -67 86 -49 53 -164 286 -37 -236 -66 285 -124 -6 50 -189
7405 -189 -103 194 126 9 116 27 108 -1 -32 -295 91 -226 -7 -282 78 -125 -68 -126 125 89 66 -127 227
7428 227 78 103 132 -226 139 260 -67 50 -6 -93 192 -344 -202 156 -51 0 -28 -32 -413 -81 -131 25 -50
7451 -50 56 160 49 -164 121 205 0 94 -124 -131 -78 89 -77 -34 -39 -19 -229 -60 73 251 98 -103 149
7474 149 131 145 -44 -109 -60 164 47 266 -44 -191 -256 69 -39 120 81 30 31 104 135 -147 -127 118 129 -70
7498 -70 -202 -165 -94 44 35 -150 -243 -46 -222 -333 -26 -110 -88 -65 -28 -75 226 -107 176 -16 132 -132 2 233
7522 233 96 271 141 -73 -38 -173 -127 -203 -242 108 -96 123 -139 118 -31 -106 231 8 -34 9 233 151 58
7545 58 161 -47 61 -93 -19 -119 -38 -26 -47 -42 222 -32 -69 -125 54 -3 133 -173 1 -72 -59 177 70 -243
$$ packed form
7381f4P0N8j11K33K5m5j77PL3q0j6J53j35J02k17M50l23j99J70L51m09J18N6k39
7405a89Q6K97o8j17J07q9Q1j09l1k63L86l17K19k75L60k03N7n8K51l6k3j93L54
7428B27j49K5K9l58L65J21l27J17n6q7K85n36J42L58k07N1k8ml81L32n0J56p5
7451e0J06J04j11k13K85Q4k05R4k18pN3J67j66M3nK0k10J69J33J78j53k01K52
7474A49j8J4j89o5M9K24j17K19l10j47o5L25j08J59l9n1JP3L1k82K0K45J1j99
7498g0j32L7P1J38rj85r3J97j76j11L07q4K2K3L7m7L01l33K83j92J48k64J34K31
7522B33j37J75j30k14L5j35M6p6l9L50k04K19k62K57j49p5L37k23m2M3K24q2r3
7545E8J03k08J08j54P4j00Q1J2k1NK64k54l7n6J79n7J36l06J74p3J3K36j07l13
$$ plain form
7569 -243 -15 147 72 -65 44 -104 40 52 57 -111 193 18 -253 -80 -29 180 191 -135 236 -137 -83 -28 -283
7592 -283 -8 -97 47 -55 88 -122 79 -67 -175 -365 -82 -170 -181 -42 260 40 208 -113 -12 92 -38
7613 -38 182 -35 116 86 28 287 -92 -312 50 -247 43 -55 43 54 51 -41 113 91 13 114 -214 179 -103 99
7637 99 174 -127 67 -37 -158 -39 25 -53 14 219 36 -8 -20 20 -37 314 56 53 44 65 188 0 -15 33 67 -68
7663 -68 3 -175 -108 -243 -28 -78 133 -146 259 -112 181 -165 65 9 162 -154 -31 -20 -44 -183 44 -69
7685 -69 1 -35 -212 -162 -112 40 43 -85 -206 107 167 311 110 -36 143 104 57 218 -44 103 -107 -239 -124
7708 -124 -68 50 -205 -49 -16 78 69 -19 -54 -174 186 109 228 -82 -34 287 -296 176 21 -121 146 154 16 -198
7732 -198 -69 -191 -100 135 80 -16 -139 42 -88 172 -24 115 -49 233 284 130 -51 171 -72 -27 -175 -53
$$ packed form
7569b43K28J62p5j37J09j48J44J2Nj68L04j75k71J73N1K09J1l26L71l73N4N5k55
7592b83K75q9J44j02J43k10K01j46j08j90K83q8j1J39L02k20J68l21J01J04j30
7613c8K20k17J51l0n8K59l79k20L62k97K90r8R8J1lr2J54k2p8J01l28L93k82K02
7637I9P5l01J94j04j21J19O4p8O7K05j83m4j2M0n7L51k58lrK1J23j88j5M8L4j35
7663f8P1j78O7j35K15n0K11k79M05l71K93l46K30n6J53l16J23J1k4j39K27j13
7685f9P0l6j77N0N0J52Lj28j21L13O0J44k01j46J79l9m7J61k62J47k10j32J15
7708a24N6J18k55J56L3R4rq8l5j20L60p7J19l10M8L21n83M72j55j42K67Qj38k14
7732a98J29j22R1K35n5r6j23J81j30K60j96J39j64K82N1j54j81K22k43M5j48J22
$$ plain form
7754 -53 -191 -58 -59 -60 50 -210 -2 183 -13 45 -52 69 -116 53 302 -149 -46 -128 -133 -249 223 -190 37
7777 37 -30 -37 -257 -26 196 158 201 -37 11 113 -20 -109 -52 -72 19 5 11 0 -108 -134 -85 95 -260 158 2 205
7803 205 -34 -43 65 -96 14 192 85 -30 189 20 -45 -76 -162 -125 305 32 15 -83 -84 -130 -100 248 26 -211
7827 -211 209 136 30 -89 -81 250 64 125 -207 81 287 67 -141 -142 -72 -53 -84 -207 19 -121 -47 -12 -357 76
7851 76 -263 -195 36 123 -5 34 161 38 7 -222 -4 -156 38 86 -52 -74 2 -318 122 5 226 0 -45
7874 -45 -56 112 251 -25 -149 -86 151 206 -137 3 -316 194 127 4 -148 20 136 -246 33 -217 -104 58
7896 58 104 22 54 -9 -41 242 5 87 -52 140 92 6 -132 -74 -157 -6 -111 79 -185 -214 -43 -2 184 -37
7920 -37 56 219 -218 31 38 105 37 -48 -18 -43 217 -67 72 -171 -275 90 237 -116 92 195 -59 -41 13 20
$$ packed form
7754e3j38J33jjJ10k60K08J85j96N8r7J21j85J69K49m51J03q2nj16M72m13K27
7777C7o7pk20K31K22l8M3k38M8J02j33q9N7k0R1j4Oj1j08k6M9J80l55M18j56K03
7803B05k39rJ08j61J10J78j07j15K19j69o5l1q6L7M30k73j7r8jm6L0L48k22k37
7827b11M20p3j06j19QL31j86O1l32K88K06k20k08jP0J9l1j23K26j40P4L5l45M33
7851G6l39O8K31Q7j28L9J27j23l1k29K18j52J94M8j38k2P6l20M40j17K21k26m5
7874d5j1J68J39k76j24O3K37N5l43J40l19N10o7j23j52J68J16l82K79k50J13J62
7896E8M6q2L2o3l2K83k37Q2j39J92m8q6j38N8q3J51j05J90k64k9J71M1J86k21
7920c7R3J63m37K49PO7o8q5L0k5K60k84J39k43j04L65J47l53K08J03k54J8N4P
$$ plain form
7944 20 99 -41 154 -120 -107 -125 11 -106 -90 -110 70 -17 -12 -115 -134 35 130 181 -96 -22 -73 -104 138 250 -117
7969 -117 -311 167 33 -47 -180 67 -138 144 -44 -117 -148 -104 79 91 86 117 40 -52 38 35 65 161 -6 105 89
7994 89 -339 119 193 135 90 44 -40 229 48 -14 105 64 -116 4 -40 62 -30 35 -27 156 67 246 -123 148
8018 148 -35 63 140 -109 74 -398 -329 -39 7 26 45 115 145 174 -243 -153 -26 113 30 188 -217 -130 43 351
8042 351 -329 -73 -142 -297 -264 162 -125 -21 38 -158 -132 -93 61 -27 187 -62 208 108 51 160 -236 -98
8064 -98 -94 -195 -20 -109 -37 99 86 14 140 -5 17 125 274 18 177 66 -200 250 -354 129 -17 -94 116
8087 116 -153 -249 -159 -429 -38 198 -34 26 161 -61 -78 -351 104 61 -61 190 -48 56 -149 246 -220 -23
8109 -23 -11 -124 10 -177 -9 -115 -68 -43 235 -36 -125 60 -4 -130 -115 288 123 -19 192 -127 34 90 -14
$$ packed form
7944B0P9j40J95k74J3j8J36j17J6k0J80q7Nj03j9J69R5N1k77P4n1l1K42J12l67
7969a17j94M78j34q0j33K47k05K82j88p3l1M4J83J2nL1p7r2R0lL0R6j67J11j6
7994H9m28M58P4n8m5m6q4K69j81o2J19m1j80J20m4J02r2O5o2J83q9J79l69K71
8018A48j83R8P7k49J83m72O9K90M6J9J9P0L0K9m17R0J27J39q3J58m05Q7J73L08
8042C51o80K56o9j55L3M26k87J04N9j96K6L9J54q8K14k49K70j00n7J09l96J38
8064i8Mj01J75q9P2J36j3p2J26j45K2J08J49k56J59j11k66M50o04M83j46p7K10
8087A16k69r6R0k70L91K36k32O0J35k22j7k73M55m3j22K51k38J04k05L95m66J97
8109b3J2j13J34j87J68j06M7K5K78k71q9J85o4j26J5M03j65j42K11l19J61N6j04
$$ plain form
8132 -14 -315 -81 -225 100 19 -96 107 -189 93 142 194 56 50 -122 -10 -130 14 195 -143 310 -129 73
8154 73 -51 198 282 184 -89 172 -43 -14 -104 -210 -23 27 24 372 -101 -65 59 -110 5 -175 38 120 -10
8177 -10 -207 59 -63 20 141 5 -33 85 16 -84 134 216 284 117
$$ packed form
8132a4l01K34j44L25q1j15K03k96K82M9N2j38oj72J12j20J44J81l38M53m39K02
8154G3j24K49Q4r8k73K61k15K9r0j06J87N0lL48m73L6J24j69J15j80K13Q2j30
8177a0j97K66j22Q3J21j36l8J18o9j00K18Q2O8j67
8191A17
$$ Imaginary data points
##PAGE= N=2
##DATA TABLE= (X++(I..I)), XYDATA
$$ plain form
0 0 0 0 0 0 0 0 0 0 0 0 8 -8 8 -8 16 -16 24 -24 32 -40 48 -56 68 -80 96 -112 128 -148 169 -196 224 -255
32 -255 290 -328 371 -418 470 -526 588 -655 729 -810 898 -996 1102 -1219 1343 -1480 1633
49 1633 -1799 1980 -2184 2408 -2656 2934 -3248 3605 -4014 4492 -5053 5726 -6551 7590 -8942
64 -8942 10788 -13463 17708 -25517 44652 -196482 -155574 115046 -183258 -103796 102253 -85925
76 -85925 -273249 17451 120104 -43736 18491 179783 30737 -50722 94031 118527 -4759
87 -4759 41050 108376 21837 -51827 9968 25106 -40042 -41282 25301 -11475 -91801 -47182 24977
100 24977 -33296 -49172 49505 36057 -60616 3706 77352 -13718 -26961 88022 47809 -44225
112 -44225 38766 70675 -46155 -27335 67237 -1701 -50264 37513 21925 -62785 -10061 34636
$$ packed form
0@%%%%%%%%%%Qj6J6j6K4l2M0m8N6p2Q8j04J24j48J76k08K40k76L17l65M20m79
32b55N45o18O99p89Q88r96J114j243J384j539J708j894K098k321K562k823L113
49A633l432L779m164M592n064N590o182O853p619Q506r545J0779j2277J4141j6532
64h942J9730k4251L1171m3225P0169k41134M0908K70620k98304P9462K06049j88178
76h5925j87324K90700J02653j63840O2227J61292j49046q1459J44753K4496j23286
87d759M5809O7326q6539p3664O1795J5138o5148j240O6583l6776q0326M4619P2159
100B4977n8273j5876R8677j3448r6673O4322P3646r1070j3243J14983m0213r2034
112d4225Q2991L1909j16830J8820R4572o8938m8563Q7777j5588q4710N2724M4697
$$ plain form
124 34636 -35953 -32825 29332 -11183 -45123 11887 15901 -29131 -5961 15073 -19175 -19403 5584
137 5584 -821 -338 11251 3489 1064 1101 -13336 160 24642 5056 -6524 19373 3239 -30300
151 -30300 -297 22101 -14354 -13646 17002 -11949 -33774 6316 12303 -18239 -919 18216 -8070
164 -8070 -11860 14025 12123 4770 15946 13493 1881 5008 6397 4451 9768 4439 -5390 -70
178 -70 -3251 -15786 -2604 6845 -12805 -10176 7614 -7025 -13399 11392 7442 -10806 8363 17930
192 17930 -6506 -1753 17823 -3125 -15961 8255 4766 -16776 -568 5877 -22176 -19130 2649
205 2649 -10117 -15088 10437 8372 -13009 -2594 9935 -1869 1605 20984 15862 2044 8516
218 8516 9672 -1732 -108 8789 3905 -4735 -5886 -4598 -6894 -9831 -5047 140 -4635 -8202 -1000
$$ packed form
124C4636p0589L128O2157m0515l3940N7010M014m5032K3170K1034l4248k28K4987
137E584o405M83J1589p762k425L7j4437J3496K4482j9586j1580K5897j6134l3539
151c0300L0003K2398l6455P08L0648k8951k1825M0090N987l0542J7320J9135k6286
164h070l790K5885j902p353J1176k453j1612L127J389j946N317n329r829N320
178g0l181j2535J3182R449j9650K629J7790j4639o374K4791l950j8248J9169R567
192A7930k4436M753J9576k0948j2836K4216l489k1542J6208O445k8053L046K1779
205B649j2766m971K5525k065k1381J0415J2529j1804L474J9379n122j3818O472
218H516J156j1404J624Q897m884q640j151J288k296k937M784N187m775l567P202
$$ plain form
233 -1000 -176 -4744 3537 11859 5076 2529 10326 6017 -3394 2550 8310 2384 3814 8714 -1928
248 -1928 -10240 -5047 -7362 -10158 850 5209 -2796 -3086 -2698 -10683 -10163 715 844 -1161 6527 5474
264 5474 -7274 -6996 -863 -5370 -4429 5696 3524 -2806 2287 3587 -2477 -548 5393 3134 750
279 750 5539 6594 2052 1949 2116 -2999 -3929 -1802 -4207 -6214 -3738 -3171 -4731 -3733 -2210 -2912 -2921 -205
297 -205 2440 3685 8076 11897 9263 7097 8723 6087 1307 3429 7447 3936 -671 -869 -4754 -12940
313 -12940 -12524 -7312 -10401 -11010 -3025 -2334 -8401 -5010 687 -2521 -2605 6978 9685 5813 8473 10343
329 10343 3088 479 5486 2926 -2278 570 1186 -5201 -6454 -4465 -7796 -9194 -5454 -3685 -4618
344 -4618 -1324 1340 -518 143 5065 4742 3272 5764 5382 2442 3991 5493 2115 485 2227 537
$$ packed form
233a000Q24m568Q281Q322o783k547P797m309r411N944N760n926J430M900j0642
248a928q312N193k315k796J1008M359q005k90L88p985N20J0878J29k005P688j053
264E474j2748K78O133m507R41J0125k172o330N093J300o064J929N941k259k384
279G50M789J055m542j03J67n115r30K127k405k007K476N67j560R98J523p02rK716
297b05K645J245M391L821k634k166J626k636m780K122M018l511m607j98l885q186
313a2940M16N212l089o09P985O91o067L391N697l208q4R583K707l872K660J870
329A0343p255k609N007k560n204K848O16o387j253J989l331j398L740J769r33
344d618L294K664j858O61M922l23j470K492l82k940J549J502l378j630J742j690
$$ plain form
360 537 -3351 -2440 321 -959 -1935 1275 1099 -2067 -960 1334 201 553 4047 4503 -82 -571 1280
377 1280 -1358 -4081 -753 -187 -2701 -2317 -1053 -3825 -4320 -1093 -221 -167 2304 3565 577 -380 314
394 314 325 972 2529 1237 -1285 -1827 -3963 -5895 -3465 -985 -1908 -2104 -1885 -3178 -3765 -559 2735
411 2735 3852 5136 6344 3398 791 2914 5147 4562 4308 3143 -56 -3547 -3905 -2800 -1954 -1232
427 -1232 -232 -2170 -5331 -4800 -2001 75 3972 7239 6366 3946 1279 -313 595 3964 6450 5020
443 5020 1946 -1599 -7145 -9229 -6099 -4192 -3501 -853 -2409 -7176 -6666 -2684 -1536 890 6070 5798
459 5798 1592 1782 5463 3992 4036 6303 2824 -3269 -3787 -1562 -2686 -2436 -753 -3132 -7814 -8519 -5237
476 -5237 -2499 -275 3327 3678 410 702 3088 3441 4535 7449 6844 2856 2395 3310 2219 1130 1908
$$ packed form
360E37l888R11K761j280r76L210j76l166J107K294j133L52L494M56m585m89J851
377A280k638k723L328N66k514L84J264k772m95L227Q72N4K471J261k988r57O94
394C14J1O47J557j292k522n42k136j932K430K480r23j96K19j293n87L206L294
411B735J117J284J208k946k607K123K233n85k54j165l199l491l58J105Q46P22
427a232J000j938l161N31K799K076L897L267q73k420k667j592R08L369K486j430
443E020l074l545n546k084L130J907O91K648j556m767N10L982J148K426N180k72
459E798m206J90L681j471M4K267l479o093n18K225j124K50J683k379m682p05L282
476e237K738K224L602L51l268K92K386L53J094K914o05l988m61R15j091j089P78
$$ plain form
493 1908 -645 -4555 -3227 -1346 -2752 -212 3351 -189 -3882 -2611 -2809 -3709 983 5064 2356 25
509 25 693 -3197 -7289 -3366 495 -571 743 3119 -178 -3784 -2248 -720 329 3707 6135 4505
525 4505 639 -521 181 -833 -158 1568 715 -4220 -6663 -5580 -4527 -4113 -1655 -561 -3723 -4005
541 -4005 -1153 492 2493 8078 9210 6525 5123 5000 4731 5999 8076 5972 3488 905 -3052 -6311
557 -6311 -4555 -3724 -6183 -6317 -5480 -8077 -7296 -3164 -2567 -2370 1234 2765 2067 4238 6821 6824 5745 5464
575 5464 4203 2696 2565 1781 -374 -2281 -4419 -6768 -6049 -5685 -6597 -5642 -5827 -7166 -5237 -711 322
592 322 698 2132 1816 1520 3744 5985 6064 5109 4016 1439 -420 997 1765 1471 864 -1266 -2575 -1928
610 -1928 -2635 -1920 1671 1671 -350 489 975 -421 1470 4034 1636 -285 937 763 -1369 95 1762
$$ packed form
493A908k553l910J328J881j406K540L563l540l693J271j98r00M692M081k708k331
509B5O68l890m092L923L861j066J314K376l297l606J536J528J049L378K428j630
525D505l866j160P02j014O75J726q53m935k443J083J053M14K458J094l162k82
541d005K852J645K001N585J132k685j402j23k69J268K077k104k484k583l957l259
557f311J756Q31k459j34Q37k597P81M132N97J97L604J531o98K171K583Lj079k81
575E464j261j507j31p84k155j907k138k349P19L64r12R55j85j339J929M526J033
592C22L76J434l16k96K224K241P9r55j093k577j859J417P68k94o07k130j309O47
610a928p07P15L591%k021Q39M86j396J891K564k398j921J222j74k132J464J667
$$ plain form
627 1762 -1677 -3532 -2046 -1593 -917 1826 1317 -1520 -1542 -827 -614 1328 2741 1657 832 -658 -2118
644 -2118 -2734 -912 -1121 -2744 -2146 -1969 -3159 -2931 -1634 -1568 -1483 -119 483 1014 2554 2759 2873 2190 1358
663 1358 1743 3112 1948 862 682 -1018 -3556 -2279 162 -931 -2279 -1188 -2458 -3110 1381 3903
679 3903 2779 3286 3779 896 302 3554 4827 4089 3833 1983 -2049 -3669 -2624 -2963 -2770 -981 -1868
696 -1868 -3752 -2946 -3085 -2747 -554 463 713 2166 4021 3908 3145 2575 1268 -87 2 9 566 -71 -2120
715 -2120 -4429 -5503 -5237 -4879 -2381 -1923 -2918 -1815 -490 -1205 812 4105 3424 2413 3264 2502 1595
732 1595 3256 4301 2177 293 467 -2086 -3598 -1622 61 -971 -831 -316 -2216 -1373 590 612 1416
749 1416 3213 3204 2536 2884 2353 1217 967 715 -393 -296 380 -676 -1956 -2041 -2337 -3314 -1684 -730 -381
$$ packed form
627A762l439j855J486M53O76K743n09k837k2P15K13J942J413j084q25j490j460
644b118o16J822k09j623N98J77j190K28J297O6Q5J364O02N31J540K05J14o83q32
663A358L85J369j164j086j80j700k538J277K441j093j348J091j270o52M491K522
679C903j124N07M93k883n94L252J273p38k56j850m032j620J045l39J93J789q87
696a868j884Q06j39L38K193J017K50J453J855j13p63n70j307j355Q9PN57o37k049
715b120k309j074K66L58K498M58r95J103J325p15K017L293o81j011Q51p62r07
732A595J661J045k124j884J74k553j512J976J683j032J40N15j900Q43J963K2Q04
749A416J797ro68L48n31j136k50k52j108R7O76j056j280q5k96r77J630R54L49
$$ plain form
768 -381 230 255 -306 443 1124 828 981 664 -228 -473 -481 -1192 -1731 -1372 -2195 -3682 -3153 -2250 -1704 -1043 515
789 515 92 127 1333 1659 2105 3655 3640 2926 2407 1909 929 415 599 -943 -1757 -1783 -2241 -3508 -2425 -1581
809 -1581 -2359 -1214 221 315 1327 3002 2480 2523 3653 4170 3714 3476 3496 2034 820 53 -912 -2020
827 -2020 -2026 -2312 -3933 -3558 -3639 -3472 -2726 -2195 -1851 -907 -219 -191 1062 1890 1735 1252 837 651 1045 1042 1008 -265
849 -265 -911 -1021 -1539 -1515 -130 -366 -734 -555 -922 -345 1128 1877 1706 1492 1237 41 -599 394 632 775
869 775 721 -760 -2480 -2927 -1875 -1073 966 2162 1600 319 388 583 1499 3736 4787 4069 3372 2061
887 2061 122 -1204 -846 -227 -506 -905 -2568 -4596 -4932 -4459 -4198 -2509 -1204 -1621 -1650 -1044 -143 1298
905 1298 2674 3045 2733 2280 1587 1370 1131 1504 1018 374 -824 -2597 -3219 -2582 -2439 -1586 -333 -573 -1492
$$ packed form
768c81O11K5n61P49O81k96J53l17q92k45qp11n39L59q23j487N29R03N46O61J558
789E15m23L5J206L26M46J550j5p14n19m98r80n14J84j542q14k6m58j267J083Q44
809a581p78J145J435R4J012J675n22M3J130N17m56k38K0j462j214p67r65j108
827b020ok86j621L75q1J67P46N31L44R44O88K8J253Q28j55m83m15j86L94ll4j273
849b65o46j10n18K4J385k36l68J79l67N77J473P49j71k14k55j196o40R93K38J43
869G75n4j481j720m47J052Q02K039J196n62j281O9J95R16K237J051p18o97j311
887B061j939j326L58O19k79l99j663k028l36M73K61J689J305m17k9O06R01J441
905A298J376L71l12m53o93k17k39L73m86o44j198j773o22O37J43Q53J253k40r19
$$ plain form
924 -1492 -743 -510 -305 1702 3042 2450 2109 2432 2072 1036 1289 1017 -374 -601 -334 -1289 -1520 -371
942 -371 -557 -1178 -507 -65 -411 1007 2134 2551 2718 2878 1258 900 644 826 623 173 -445 -1827 -2561
961 -2561 -3385 -3714 -2829 -2376 -3142 -2031 -1718 -2037 -754 790 851 1372 2751 2070 1517 2488 2733 1895 1429
980 1429 1426 -300 -1045 -367 -1568 -2461 -1069 -1063 -2419 -1546 -1028 -1263 -616 530 949 1522 2293 1443 1099 1702
1000 1702 1780 1597 2004 1783 741 221 12 -867 -576 669 349 -258 398 -373 -766 378 1023 703 1397
1019 1397 1075 -360 -621 60 -953 -1249 -739 -1666 -2694 -2353 -2306 -2570 -1559 -241 -1372 -572 851 340
1037 340 766 2416 2529 1952 2897 2335 1086 660 921 -196 -723 -633 -1770 -2481 -1897 -3083 -3409 -2047
1055 -2047 -1188 -1230 90 564 119 1393 2548 2581 3787 4885 3801 2426 2545 1839 882 780 867 -1018
$$ packed form
924a492P49K33K05K007J340n92l41L23l60j036K53k72j391k27K67r55k31J149
942c71j86o21O71M42l46J418J127M17J67J60j620l58k56J82k03m50o18j382p34
961b561q24l29Q85M53p66J111L13l19J283J544O1N21J379o81n53R71K45q38m66
980A429lj726p45O78j201q93J392Oj356Q73N18k35O47J146M19N73P71q50l44O03
1000A702P8j83M07k21j042n20k09q79K91J245l20o07O56p71l93J144O45l20O94
1019A397l22j435k61O81j013k96N10r27j028L41M7k64J011J318j131Q00J423n11
1037C40M26J650J13n77R45n62j249m26K61j117n27R0j137p11N84j186l26J362
1055b047Q59m2J320M74m45J274J155L3J206J098j084j375J19p06r57j02Q7j885
$$ plain form
1073 -1018 -1591 -1622 -2606 -2710 -1820 -1869 -2534 -1377 -982 -886 762 1395 612 806 1618 803 731 2099 1464 366
1093 366 -57 -488 -1285 -575 48 -1049 -1361 -1135 -1606 -1399 -34 242 4 573 -411 -997 361 1156 276
1112 276 392 256 -1400 -1631 -567 -782 -937 413 118 -858 1 1075 369 1270 2458 1887 1947 2525 2189
1131 2189 1369 1555 671 -480 -265 43 -847 -988 -1140 -2261 -3228 -2183 -1834 -1450 184 327 -70 372
1149 372 1446 1239 2302 2634 1627 1118 1262 362 -257 86 -649 -2100 -2093 -2617 -3358 -2173 -1193 -2339 -2010
1168 -2010 -663 -622 -707 1355 1807 1560 2240 2290 1257 1860 2255 1027 -23 349 -400 -1398 -676 -814 -1905
1187 -1905 -2082 -1679 -2194 -874 501 684 952 1608 965 1591 2552 2914 2124 2508 1623 328 224 551 -334
1206 -334 -1009 -866 -1878 -2546 -1732 -1441 -1558 -656 -225 -1037 -379 690 907 1427 1947 957 219 908 556
$$ packed form
1073a018n73l1r84j04Q90m9o65J157L95R6J648O33p83J94Q12q15p2J368o35j098
1093C66m23m31p97P10O23j097l12K26m71K07J365K76k38N69r84n86J358P95q80
1112B76J16j36j656k31J064k15j55J350k95r76Q59J074p06R01J188n71O0N78l36
1131B189q20J86q84j151K15L08q90j41j52j121r67J045L49L84J634J43l97M42
1149C72J074k07J063L32j007n09J44r00o19L43p35j451Pn24p41J185R80j146L29
1168b010J347M1q5K062M52k47O80N0j033O03L95j228j050L72p49r98P22j38j091
1187a905j77M03n15J320J375J83K68O56o43O26R61L62p90L84q85j295j04L27q85
1206c34o75J43j012o68Q14K91j17R02M31q12O58J069K17N20N20r90p38O89l52
$$ plain form
1225 556 -29 66 -105 -1719 -1803 -1353 -1911 -1564 -676 -1418 -2007 -395 71 367 949 1047 531 782 1349 1158
1245 1158 1605 1913 901 -340 -338 -835 -606 94 424 -469 -466 -459 -642 -142 1684 1826 1336 1589 1200 1180 1612
1266 1612 1750 899 646 78 -959 -1212 -1186 -1107 -1701 -1642 -1946 -2111 -1260 -261 -461 50 848 700 948 1581
1286 1581 1344 1367 1467 932 345 418 113 -664 -1176 -1722 -2052 -2422 -1752 -2233 -2074 -1073 -1233 -1184 -38 379
1306 379 931 1815 2218 1918 2079 2417 2315 1781 1246 1153 -4 18 20 -507 -1214 -1048 -1715 -1832 -1030 -486 -424
1327 -424 583 474 -262 272 965 1386 1779 1484 919 261 146 -10 -318 -222 -378 -957 -1266 -1161 -1389 -885
1347 -885 -95 -370 -232 150 47 168 670 790 598 639 46 -588 -977 -456 -828 -1042 -926 -1032 -1289 -818
1367 -818 -775 -946 14 388 410 893 1498 1375 1411 1421 1397 1484 921 928 266 -144 -25 -663 -764 -998 -908 -1126 -681
$$ packed form
1225E56n85R5j71j614q4M50n58L47Q88p42n89J612M66K96N82R8n16K51N67j91
1245A158M47L08j012j241Km97K29P00L30q93LPj83N00J826J42m90K53l89k0M32
1266A612J38q51k53n68j037k53K6P9n94N9l04j65Q51R99k00N11P98j48K48O33
1286A581k37K3J00n35n87P3l05p77n12n46l30l70O70m81J59J001j60M9J146M17
1306C79N52Q84M03l00J61L38j02n34n35r3j157K2Kn27p07J66o67j17Q02N44O2
1327d24J007j09p36N34O93M21L93k95n65o58j15j56l08R6j56n79l09J05k28N04
1347h85P90k75J38L82j03J21N02J20j92M1n93o34l89N21l72k14J16j06k57M71
1367h18M3j71R60L74K2M83O05j23L6J0k4Q7n63Po62m10J19o38j01k34R0k18M45
$$ plain form
1390 -681 -999 -761 236 325 280 1289 1347 1165 1532 1567 1244 1209 1078 -89 -661 -737 -701 -1067 -1385 -1318 -2181 -1789
1412 -1789 -1382 -1281 -768 -112 -2 131 831 985 1003 1073 1061 833 697 421 -364 -318 -532 -679 -1692 -1592 -1327
1433 -1327 -1402 -1210 -913 -691 -186 305 591 1048 1655 2123 2119 2007 1636 1501 1206 976 202 215 184 -427 -1245
1454 -1245 -1145 -1466 -1468 -1306 -794 -616 -60 118 -10 677 1078 1156 1395 1341 1075 1000 684 355 -248 -125 -295
1475 -295 -1044 -1461 -1417 -1387 -1424 -844 -882 -379 -317 -532 -355 72 462 842 778 996 453 295 16 -191 -241 -71
1497 -71 -486 -763 -722 -493 -748 -502 233 202 407 1017 843 995 1366 1273 1030 788 695 287 15 -46 -756 -1035
1519 -1035 -956 -1206 -1049 -804 -608 -630 18 -126 201 848 1149 1348 1474 1395 1292 1493 905 571 200 -1 -618
1540 -618 -1491 -1493 -1484 -2055 -1993 -1689 -1899 -1589 -644 -843 -649 621 980 771 1267 1389 1336 1162 1085 868 354 608
$$ packed form
1390f81l18K38R97Q9m5J009N8j82L67L5l23l5j31j167n72p6L6l66l18O7q63L92
1412a789M07J01N13O56J10J33P00J54J8P0j2k28j36k76p85M6k14j47j013J00K65
1433a327p5J92K97K22N05M91K86M57O07M68mj12l71j35k95k30p74J3l1o11q18
1454a245J00l21kJ62N12J78N56J78j28O87M01P8K39n4k66p5l16l29o03J23j70
1475b95p49m17M4L0l7N80l8N03O2k15J77M27L90L80o4K18n43j58k79k07n0J70
1497g1m15k77M1K29k55K46P35l1K05O10j74J52L71r3k43k42r3m08k72o1p10k79
1519a035P9k50J57K45J96k2O48j44L27O47L01J99J26p9j03K01n88l34l71k01o17
1540f18q73kRn71O2L04k10L10R45j99J94J270L59k09M96J22n3j74p7k17n14K54
$$ plain form
1562 608 127 -566 -618 -840 -1381 -1211 -900 -1129 -379 -76 -239 216 476 857 1139 1535 1442 1308 868 1082 775
1583 775 607 333 -457 -690 -416 -746 -760 -467 -537 -918 -449 -360 -251 327 668 416 518 998 543 403 352
1604 352 331 -123 -368 -469 -771 -782 -560 -856 -1203 -731 -707 -638 -256 164 -452 435 653 164 640 820 267
1625 267 390 87 -283 -442 -304 -657 -957 -517 -606 -811 -470 41 440 739 1006 702 972 1502 1348 904
1645 904 1438 875 669 396 285 -141 -409 -554 -1080 -1970 -1186 -1251 -1036 -714 -435 -689 110 462 498 1220 1562
1666 1562 903 850 1418 929 583 557 71 -739 -953 -1267 -1666 -1567 -1366 -1479 -1853 -1532 -1301 -1010 13 438
1686 438 -6 760 1003 714 1310 1334 970 684 783 280 186 62 -157 -636 -707 -643 -856 -341 50 -14 93 500
1708 500 169 454 859 1193 644 922 693 189 483 409 -217 -344 -649 -981 -1309 -355 -586 -762 -300 -488
$$ packed form
1562F08m81o93n2k22n41J70L11k29P50L03j63M55K60L81K82L96r3j34m40K14l07
1583G75j68k74p90k33K74l30j4K93p0l81M69Q9J09N78L41k52J02M80m55j40n1
1604C52k1m54k45j01l02j1K22k96l47M72K4O9L82M20o16Q87K18m89M76J80n53
1625B67J23l03l70j59J38l53l00M40q9k05L41N11L99K99K67l04K70N30j54m44
1645I04N34n63k06k73j11m26k68j45n26q90P84o5K15L22K79k54P99L52L6P22L42
1666A562o59n3N68m89l46k6m86q10k14l14l99R9K01j13l74L21K31K91J023M25
1686D38m44P66K43k89N96K4l64k86R9n03r4j24k19m79p1O4k13N15L91o4J07M07
1708E00l31K85M05L34n49K78k29n04K94p4o26j27l05l32l28R54k31j76M62j88
$$ plain form
1728 -488 -577 -238 445 467 712 954 395 311 558 297 201 -55 -377 -1203 -1037 -1017 -1193 -1315 -644 -882 -1170 -595
1750 -595 -236 160 375 775 564 618 1265 753 847 1031 710 196 270 -338 -461 -307 -353 -814 -597 -432 -356 -105
1772 -105 400 169 298 767 549 788 1469 1078 786 603 546 -321 -87 -47 -888 -915 -708 -1006 -1352 -721 -630
1793 -630 -607 -417 -46 -115 143 1034 779 656 784 630 394 324 476 -116 -378 -781 -1359 -1221 -1120 -1062 -1191
1814 -1191 -1297 -978 -859 -398 216 410 601 984 567 1114 959 1042 974 977 611 202 10 -50 29 -378 -497 -867
1836 -867 -1026 -316 -381 -323 25 250 64 453 711 433 997 708 529 313 175 181 -97 -162 -253 -648 -618 -655 -909
1859 -909 -839 -405 -673 -341 -132 -49 173 804 699 71 340 388 -219 -192 -48 -475 -544 -1018 -825 -994 -885 -470
1881 -470 -898 -349 -458 14 285 1008 960 1138 1011 934 1147 1432 1023 682 656 210 -373 -168 -445 -584 -513
$$ packed form
1728d88q9L39O83K2K45K42n59q4K47k61r6k56l22q26J66K0j76j22O71k38k88N75
1750e95L59L96K15M00k11N4O47n12R4J84l21n14P4o08j23J54m6m61K17J65P6K51
1772a05N05k31J29M69k18K39O81l91k92j83n7q67K34M0q41k7K07k98l46O31R1
1793f30K3J90L71o9K58Q91k55j23J28j54k36p0J52n92k62m03n78J38J01N8j29
1814a191j06L19J19M61O14J94J91L83m17N47j55Q3o8Ll66m09j92o0P9m07j19l70
1836h67j59P10o5N8L48K25j86L89K58k78N64k89j79k16j38Ok78o5r1l95L0l7k54
1859i09P0M34k68L32K09Q3K22O31j05o28K69M8o07K7J44m27o9m74J93j69J09M15
1881d70m28N49j09M72K71P23m8J78j27p7K13K85m09l41k6m46n83K05k77j39P1
$$ plain form
1902 -513 -606 -651 -774 -543 -14 12 497 419 361 468 761 687 778 454 522 170 63 -23 -360 -506 -779 -1036 -929
1925 -929 -542 -833 -593 -230 -448 -237 246 298 414 573 852 421 381 659 102 86 -82 -301 -700 -715 -815
1946 -815 -973 -619 -473 -778 -278 157 114 412 910 990 805 1025 1247 803 633 606 199 217 -441 -319 -520
1967 -520 -632 -863 -777 -606 -379 -418 -219 -57 224 282 477 515 571 1127 516 417 480 463 -338 -459 -374 -830 -703
1990 -703 -768 -902 -975 -484 -539 -481 -92 -75 20 475 449 534 365 256 524 407 131 177 56 -392 -583 -801 -545
2013 -545 -677 -455 -502 -158 -130 23 343 350 519 787 837 827 970 795 361 657 367 -283 -308 -436 -481 -555 -759
2036 -759 -655 -595 -435 -354 -274 181 -33 410 388 767 956 616 920 624 129 185 -95 -389 -593 -564 -790 -786 -913
2059 -913 -1333 -1015 -749 -496 -514 -25 67 96 459 587 562 722 793 268 281 307 206 -338 143 -166 -613 -472
$$ packed form
1902e13r3m5j23K31N29K6M85p8n8J07K93p4R1l24O8l52j07q6l37j46k73k57J07
1925i29L87k91K40L63k18K11M83N2J16J59K79m31m0K78n57j6j68k19l99j5j00
1946h15j58L54J46l05N00M35m3K98M98Q0j85K20K22m44j70k7m07J8o58J22k01
1967e20j12k31Q6J71K27l9J99J62K81N8J95L8N6N56o11r9O3j7q01j21Q5m56J27
1990g03o5j34p3M91n5N8L89J7R5M55k6Q5j69j09K68j17k76M6j21m48j91k18K56
2013e45j32K22m7L44K8J53L20PJ69K68N0j0J43j75m34K96k90o50k5j28m5p4k04
2036g59J04O0J60Q1Q0M55k14M43k2L79J89l40L04k96m95N6k80k94k04K9k26Mj27
2059i13m20L18K66K53j8M89R2K9L63J28k5J60P1n25J3K6j01n44M81l09m47J41
$$ plain form
2081 -472 -262 -539 -735 -22 -106 94 -70 424 445 807 703 592 567 402 95 253 30 -75 -228 -463 -65
2102 -65 -525 -486 -370 -324 -153 -143 -128 193 535 210 237 682 503 246 462 131 -86 -338 -423 -729 -440 -617
2124 -617 -1083 -826 -567 -634 -446 -394 72 36 372 714 598 827 900 715 485 631 248 160 -125 -245 -311 -546
2146 -546 -707 -803 -761 -412 -323 -225 72 162 291 465 608 793 880 896 614 532 372 308 59 100 -136 -728 -586
2169 -586 -633 -706 -348 -555 -860 -449 62 164 178 621 282 476 591 647 177 451 269 -70 -180 -178 -495 -751
2191 -751 -822 -758 -819 -939 -503 -531 -171 -79 -124 238 629 325 486 648 510 397 361 190 25 46 31 -262 -570
2214 -570 -537 -511 -151 -238 -110 -34 55 285 113 795 560 362 735 335 249 207 295 141 -1 -212 -271 -476 -239
2237 -239 -354 -599 -299 -275 -438 -126 99 436 330 355 473 451 379 361 210 149 -233 -503 -450 -333 -557 -817
$$ packed form
2081d72K10k77j96P13q4K00j64M94K1L62j04j11k5j65l07J58k23j05j53k35L98
2102f5m60L9J16M6J71J0J5L21L42l25K7M45j79k57K16l31k17k52q5l06K89j77
2124f17m66K57K59o7J88N2M66l6L36L42j16K29P3j85k30J46l83q8k85j20o6k35
2146e46j61r6M2L49Q9R8K97R0J29J74J43J85Q7J6k82q2j60o4k49M1k36n92J42
2169e86m7p3L58k07l05M11N11J02J4M43l39J94J15N6m70K74j82l39j10Kl17k56
2191g51p1O4o1j20M36k8L60R2m5L62L91l04J61J62j38j13l6j71j65K1j5k93l08
2214e70L3K6L60q7J28P6Q9K30j72O82k35j98L73m00q6m2Q8j54j42k11n9k05K37
2237b39j15k45L00K4j63L12K25L37j06K5J18k2p2j8j51o1l82k70N3J17k24k60
$$ plain form
2259 -817 -754 -473 -647 -516 -16 -217 202 290 190 391 448 988 696 400 638 -33 130 14 -155 -452 -465
2280 -465 -464 -439 -442 -384 -234 5 -49 -50 365 230 832 493 868 458 549 726 211 74 260 -71 -284 -543 -788
2303 -788 -556 -710 -456 -471 -608 -226 -127 -31 166 202 124 134 356 306 322 295 190 -65 -80 -549 -370 -427 -242 -499
2327 -499 -385 -601 -567 -50 84 -21 243 353 425 547 719 566 571 473 228 164 -126 -166 -129 -155 -534 -666 -395
2350 -395 -419 -298 -62 134 378 72 569 726 832 429 684 641 312 229 17 -129 -88 -221 -708 -534 -636
2371 -636 -682 -733 -547 -648 -387 -177 8 120 457 518 155 435 356 492 411 119 -73 -122 -330 -474 -332 -502
2393 -502 -507 -561 -303 -613 -216 80 374 402 134 631 653 259 619 696 135 479 -7 -55 -311 103 -301 -580
2415 -580 -551 -511 -357 -485 -128 -228 95 33 189 307 311 724 359 584 486 232 226 236 -175 -284 -288 -631 -448 -696
$$ packed form
2259h17O3K81j74J31N00k01M19Q8j00K01N7N40k92k96K38o71J63j16j69k97j3
2280d65JK5lN8J50K39n4jM15j35O02l39L75m10R1J77n15j37J86l31k13k59k45
2303g88K32j54K54j5j37L82R9R6J97L6p8J0K22n0J6k7j05k55j5m69J79n7J85k57
2327d99J14k16L4N17J34j05K64J10P2J22J72j53Nr8k45o4k90m0L7k6l79j32K71
2350c95k4J21K36J96K44l06M97J57J06m03K55m3l29q3k12j46M1j33m87J74j02
2371f36m6n1J86j01K61K10J85J12L37O1l63K80p9J36q1k92j92m9k08j44J42j70
2393e02nn4K58l10L97K96K94K8k68M97K2l94L60P7n61L44m86m8k56M14m04k79
2415e80K9M0J54j28L57j00L23o2J56J18MM13l65K25r8k54oJ0m11j09ml43J83k48
$$ plain form
2439 -696 -408 -528 -419 -239 -252 67 -73 41 145 286 400 312 274 392 189 237 -145 -41 -181 -270 -312 -490
2461 -490 -135 -287 -123 -111 51 218 360 416 269 549 462 331 628 287 81 125 37 -177 -157 -307 -492 -136
2483 -136 -381 -204 -408 69 198 -86 241 261 257 599 610 629 679 494 -17 11 60 -254 -639 -873 -635 -662 -595
2506 -595 -603 -831 -377 -478 -471 -210 98 262 473 300 532 402 420 159 242 262 15 -65 -289 -380 -436 -451 -358 -340
2530 -340 -325 -347 -188 -28 264 448 302 299 487 502 376 559 217 32 85 -38 -268 -273 -300 -178 -471 -237 -338
2553 -338 -136 -289 28 140 100 604 200 373 267 245 213 323 204 10 -90 256 -517 -580 -290 -661 -311
2574 -311 -336 -615 17 -193 156 191 195 401 219 485 296 581 287 293 141 -27 225 -391 -284 -159 -225 -377
2596 -377 -225 -215 -181 107 309 142 315 305 570 250 482 589 236 291 252 296 132 -102 -426 -562 -285 -448
$$ packed form
2439f96K88j20J09J80j3L19j40J14J04J41J14q8l8J18k03M8l82J04j40q9m2j78
2461d90L55j52J64J2J62J67J42N6j47K80q7j31K97l41k06M4q8k14K0j50j85L56
2483a36k45J77k04M77J29k84L27K0mL42J1J9N0j85n11K8M9l14l85k34K38k7O7
2506e95qk28M54j01PK61L08J64K11j73K32j30J8k61Q3K0k47q0k24r1n6j5R3J8
2530c40J5k2J59J60K92J84j46lJ88J5j26J83l42j85N3j23k30nk7J22k93K34j01
2553c38K02j53L17J12m0N04m04J73j06k2l2J10j19j94j00L46p73o3K90l71L50
2574c11k5k79O32k10L49L5MK06j82K66j89K85k94Oj52j68K52o16J07J25o6j52
2596c77J52J0L4K88K02j67J73j0K65l20K32J07l53N5l9M4j64k34l24j36K77j63
$$ plain form
2618 -448 -85 -271 -52 -100 320 186 159 48 376 194 213 -51 169 37 -167 -75 -340 -470 -554 -626 -574 -644 -503
2641 -503 -502 -340 -255 -30 243 226 420 501 544 662 483 589 385 67 88 247 -280 -98 -342 -362 -468 -289 -269
2664 -269 -298 -327 20 -43 68 354 126 664 633 393 511 463 245 193 268 -220 -217 -393 -260 -354 -157 -281 -730
2687 -730 -536 -186 -210 230 9 180 523 336 252 219 303 109 94 -77 15 -258 -310 -392 -148 -297 -122 -371 -184
2710 -184 -197 -310 206 139 158 323 214 413 491 540 411 247 350 7 36 -269 12 -291 -305 -425 -83 -84 -296
2733 -296 61 212 306 369 512 495 291 560 550 292 379 70 -134 11 -72 -160 -353 -418 -285 -369 -399 43 -133
2756 -133 -212 76 141 294 244 235 490 363 -39 183 120 -302 -84 11 -274 -12 -309 -601 -353 -378 -231 -264 -124
2779 -124 -66 309 -46 250 519 483 428 431 35 99 412 7 167 -13 -507 -101 -285 -279 -342 -249 -431 -259 -20
$$ packed form
2618d48L63j86K19m8M20j34k7j11L28j82J9k64K20j32k04R2k65j30q4p2N2p0J41
2641e03JJ62Q5K25K73j7J94Q1M3J18j79J06k04l18K1J59n27J82k44k0j06J79K0
2664b69k9k9L47o3J11K86k28N38l1k40J18m8k18n2P5m88Lj76J33r4J97j24m49
2687g30J94L50k4M40k21J71L43j87q4l3Q4j94j5j71R2k73n2q2K44j49J75k49J87
2710a84j3j13N16o7J9J65j09J99P8M9j29j64J03l43K9l05K81l03j4j20L42jk12
2733b96L57J51R4O3J43j7k04K69j0k58Q7l09k04J45q3q8j93o5J33q4l0M42j76
2756a33p9K88O5J53n0rK55j27m02K22o3m22K18R5k85K62k97k92K48k5J47l3J40
2779a24N8L75l55K96K69l6n5Ll96O4L13m05J60j80m94M06j84Oo3R3j82J72K39
$$ plain form
2802 -20 34 185 330 316 45 201 312 387 168 227 132 69 -107 -118 -497 -373 -358 -414 -397 -417 -121 -49 -159 173
2826 173 152 75 262 -98 186 603 11 11 55 21 82 -127 -214 -249 -225 -133 -361 -27 143 130 239 -76 400 217
2850 217 277 451 512 532 275 213 -146 -23 -11 -103 -170 -222 -360 -234 -40 -188 -178 258 -31 236 386 290 403
2873 403 377 276 510 260 243 -4 -85 -25 -337 -289 -293 -533 -434 -280 -538 -445 -83 15 -142 10 214 330 176
2896 176 255 306 88 323 103 -161 -159 -230 -375 -379 -204 -325 -274 -444 -662 -357 166 -52 79 92 236 227 345 437
2920 437 326 325 237 176 50 100 82 -177 -132 -152 -102 -124 -50 -166 -248 80 -12 101 384 174 310 131 74 359 267
2945 267 -26 108 8 -225 -268 -200 -351 -261 -258 -123 -245 -312 -135 -169 163 170 290 72 412 214 18 195 -45
2968 -45 -70 -167 -153 -20 -294 -195 -331 -332 -115 128 -105 84 288 317 508 451 250 260 345 569 321 -114 75 -38
$$ packed form
2802b0N4J51J45j4k71J56J11P5k19N9r5o3j76j1l79J24J5n6J7k0K96P2j10L32
2826A73k1p7J87l60K84M17n92%M4l4O1k09q7l5K4R2k28L34J70j3J09l15M76j83
2850B17O0J74O1K0k57o2l59J23J2r2o7n2j38J26J94j48J0M36k89K67J50r6J13
2873D03k6j01K34k50j7k47q1O0l12M8mk40R9J54k58R3L62R8j57J52K04J16j54
2896A76P9N1k18K35k20k64Kp1j45mJ75j21N1j70k18L05N23k18J31J3J44rJ18R2
2920D37j11jq8o1j26N0j8k59M5k0N0k2P4j16q2L28r2J13K83k10J36j79n7K85r2
2945B67k93J34j00k33m3O8j51R0LJ35j22o7J77l4L32PJ20k18L40j98j96J77k40
2968d5k5r7J4J33k74R9j36jK17K43k33J89K04K9J91n7k01J0Q5K24k48m35J89j13
$$ plain form
2992 -38 263 145 -145 -243 -255 -556 -239 -181 -166 73 -214 -117 290 46 127 384 308 301 335 390 74 39 -167 -444
3016 -444 -214 -201 -284 -110 -209 -472 -197 -354 125 -127 108 93 87 347 296 522 504 53 49 -193 -128 -28 -104 -318
3040 -318 -90 -137 -580 -299 -388 146 9 14 266 247 331 374 590 283 204 459 122 249 113 -77 2 -100 -271
3063 -271 -211 -152 -165 -562 -195 -82 -76 -33 38 152 116 217 135 57 314 238 27 -257 -246 -149 -281 -280 -127 -280 -490
3088 -490 -246 -36 -211 -49 173 82 167 417 -85 71 262 268 366 206 -217 45 -98 -32 -412 58 -195 -92
3110 -92 -53 -99 114 5 54 -8 321 41 206 381 447 441 198 367 48 45 -130 -222 158 -338 -271 -274 -316 -310 -265 141
3136 141 -28 -35 249 280 280 161 175 290 185 209 427 23 -187 117 -336 21 -393 -298 -291 -85 -262 -176 -145 -104
3160 -104 -77 35 217 211 405 -54 402 174 461 257 -93 -37 -217 -171 -115 -232 -356 -321 -48 -106 -219 42 72
$$ packed form
2992c8L01j18k90r8j2l01L17N8J5K39k87R7M07k44Q1K57p6pL4N5l16l5k06k77
3016d44K30J3q3J74r9k63K75j57M79k52K35j5oK60n1K26j8m51mk42O5J00p6k14
3040c18K28m7m43K81q9N34j37NK52j9Q4M3K16l07p9K55l37J27j36j90P9j02j71
3063b71O0N9j3l97L67J13OM3P1J14l6J01q2p8K57p6k11k84J1R7j32JJ53j53k10
3088d90K44K10j75J62K22r1Q5K50n02J56J91OR8j60m23K62j43O6l80M70k53J03
3110i2L9m6K13j09M9o2L29k80J65J75O6ok43J69l19lj75r2L80m96O7lm2OM5M06
3136A41j69pK84L1%j19J4J15j05K4K18m04k10L04m53L57m14R5PK06j77Q6L1M1
3160a04K7J12J82oJ94m59M56k28K87k04l50N6j80M6N6j17j24L5K73n8j13K61L0
$$ plain form
3183 72 -212 167 472 179 151 440 273 152 226 259 -365 208 -224 -140 -433 -284 -319 -420 -159 -362 141 -38
3205 -38 159 -231 29 10 -256 -111 382 130 39 -42 -18 -79 -237 -226 -362 -338 -225 -230 -91 -285 -153 14 154
3228 154 224 470 183 165 193 325 127 -72 11 -74 -15 -85 -16 -215 2 -547 -191 -398 70 211 -52 300 203
3251 203 356 364 382 222 253 278 189 172 160 208 -260 49 -333 -150 -483 -436 -91 -273 -362 124 -48 36 31 375 323
3276 323 357 154 254 229 -40 61 141 -211 -96 -283 -364 -39 -480 -332 -373 -187 -187 91 17 187 264 347 -20
3299 -20 228 -15 153 299 311 -281 141 -1 -17 -382 -138 -191 -269 -120 -226 -50 93 -46 255 67 161 200
3321 200 134 348 45 148 160 -55 -14 -191 -254 -150 -281 -263 -286 -117 -346 -131 371 76 20 224 234 135 141 208
3345 208 45 0 -56 -113 -217 96 -101 -92 -274 -133 46 -154 141 -142 265 16 174 130 115 325 333 205 15
$$ packed form
3183G2k84L79L05k93k8K89j67j21P4L3o24N73m32Q4k93J49l5j01K61k03N03j79
3205c8J97l90K60j9k66J45M93k52r1q1K4o1j58J1j36K4J13nJ39j94J32J67J40
3228A54P0K46k87j8K8J32j98j99Q3q5N9p0O9j99K17n49L56k07M68J41k63L52r7
3251B03J53QJ8j60L1K5q9j7j2M8m68L09l82J83l33M7L45j82q9M86j72Q4nL44n2
3276C23L4k03J00k5k69J01Q0l52J15j87q1L25m41J48m1J86%K78p4J70P7Q3l67
3299b0K48k43J68J46J2n92M22j42j6l65K44n3p8J49j06J76J43j39L01j88R4L9
3321B00o6K14l03J03J2k15M1j77o3J04j31J8k3J69k29K15N02k95n6K04J0r9OO7
3345B08j63m5n6n7j04L13j97Rj82J41J79k00K95k83M07k49J58m4j5K10Qj28j90
$$ plain form
3368 15 506 116 379 -81 -216 -3 -491 -303 -197 -220 -290 -200 197 169 -81 168 215 236 441 130 169 492 256
3391 256 226 9 229 -207 -101 -111 -265 -199 -199 -246 -381 -111 -36 -217 -272 -70 103 237 84 194 121 251 246 146
3415 146 42 -99 -271 -38 -255 -585 -392 -288 -491 -226 -29 -160 -155 -23 -22 379 551 336 253 412 442 27
3437 27 240 8 -122 -193 -177 -12 27 -185 -25 65 23 141 41 -146 10 166 66 175 251 -13 107 162 82
3460 82 -139 -103 -332 -395 -258 -524 -190 -216 -181 -2 244 -109 -136 182 73 -113 202 284 23 116 127 -22 -113
3483 -113 -70 29 -30 -233 -91 -360 -237 -269 -67 -134 -156 -102 201 282 295 111 383 473 342 129 384 42 81 -126
3507 -126 -250 -334 -164 -143 -332 -323 -256 -215 -49 -228 138 156 447 99 446 177 193 260 128 225 -186 126 -316
3530 -316 -91 -308 -112 -240 -615 -69 -24 124 -3 202 71 80 189 431 156 277 272 275 193 55 -78 -68 -24
$$ packed form
3368A5M91l90K63m60j35K13m88J88J06k3p0R0L97k8k50K49M7K1K05l11L9L23k36
3391B56l0k17K20m36J06j0j54O6%m7j35K70P5j81n5K02J73J34j53J10p3J30nj00
3415A46j04j41j72K33k17l30J93J04k03K65J97j31NJ32JM01J72k15q3J59L0m15
3437B7K13k32j30p1J6J65L9k12J60R0m2J18j00j87J56J56j00J09P6k64J20N5q0
3460H2k21L6k29o3J37k66L34k6L5J79K46l53k7L18j09j86L15Q2k61R3J1j49r1
3483a13M3R9n9k03J42k69J23l2K02o7k2N4L03Q1J3j84K72R0j31k13K55l42L9k07
3507a26j24q4J70K1j89RO7M1J66j79L66J8K91l48L47k69J6O7j32R7m11L12m42
3530c16K25k17J96j28l75N46M5J48j27K05j31RJ09K42k75J21nLq2j38j33J0M4
$$ plain form
3553 -24 -52 11 278 -259 -226 -76 106 -63 168 1 19 477 464 202 243 168 233 318 35 43 -275 243 -69 -21
3577 -21 -328 -74 -182 -275 22 -116 92 -52 167 -175 106 104 -78 11 4 6 45 8 35 -211 -225 -225 -24 -194 -206
3602 -206 -469 -191 12 213 -29 -54 21 121 163 115 136 180 403 78 121 88 -142 -66 95 -121 12 1 116
3625 116 -208 -21 173 34 -37 267 257 47 249 110 140 157 176 288 128 -28 -572 -507 -150 -68 -272 -419
3647 -419 -458 -255 -10 -150 151 -11 -148 117 65 -140 -77 222 -12 -185 281 -215 -25 -35 -83 -140 -84 -165 84
3670 84 116 -223 -140 2 73 323 361 23 226 179 36 285 118 90 151 -287 -88 -55 76 -191 -135 -70 124 -270
3694 -270 -29 -146 171 122 -6 6 200 96 184 174 34 -72 -168 -156 49 -46 -102 -308 -87 -98 -261 188 -261
3717 -261 -154 -119 112 153 106 9 173 300 213 43 160 174 -130 -66 -276 -696 -13 -249 71 -39 -174 105
$$ packed form
3553b4k8O3K67n37L3J50J82j69K31j67J8M58j3k62M1p5O5Q5k83Ql18N18l12M8
3577b1l07K54j08r3K97j38K08j44K19l42K81kj82Q9pKL9l7K7k46j4%K01j70j2
3602b06k63K78K03K01k42k5P5J00M2m8K1M4K23l25M3l3k30P6J61k16J33j1J15
3625A16l24J87J94j39p1L04j0k10K02j39L0J7J9J12j60j56n44O5L57Q2k04j47
3647d19l9K03K45j40L01j62j37K65n2k05O3K99k34j73M66m96J90j0m8n7N6q1K49
3670H4L2l39Q3J42P1K50L8l38K03m7j43K49j67k8O1m38J99L3J31k67N6O5J94l94
3694b70K41j17L17m9j28J2J94j04Q8j0j40j06r6J2K05r5n6k06K21j1j63M49m49
3717b61J07L5K31M1m7r7J64J27q7j70J17J4l04O4k10m20O83k36L20j10j35K79
$$ plain form
3739 105 -281 82 89 20 148 347 423 264 301 93 17 232 -53 176 4 -150 -122 -54 -7 -169 -106 -22 -55 18
3763 18 119 192 142 407 39 100 281 196 -66 32 109 -84 66 -204 -2 -40 -131 119 -399 -182 -66 -151 113
3786 113 -6 197 -35 69 192 178 97 12 -5 192 -87 -119 -52 59 -189 -329 -482 -300 -109 -107 -219 10 92
3809 92 127 -1 -157 349 278 216 103 126 211 386 -53 -104 -17 107 -24 -305 -82 125 -82 14 106 -146 11
3832 11 382 243 206 -110 214 90 268 -114 -338 -16 -58 -319 -77 -149 -112 -492 -458 -80 -231 -21 -172 -4
3854 -4 340 13 124 102 211 -117 341 211 -200 -182 -253 -39 -308 -248 71 -180 -102 -114 -303 -137 -156 10 305
3877 305 20 510 352 270 179 -22 182 -25 90 -79 -146 -77 76 -307 -50 3 -219 -63 -196 25 -55 122
3899 122 132 149 150 89 226 142 -45 259 179 101 238 -118 -104 -248 -107 -357 37 -315 -81 59 -33 -28 64 15 50
$$ packed form
3739A05l86L63Po9J28J99P6j59L7k08p6K15k85K29j72j54K8O8M7j62O3Q4l3P3
3763A8J01P3n0K65l68O1J81q5k62R8P7j93J50k70K02l8r1K50n18K17J16q5K64
3786A13j19K03k32J04J23j4q1q5j7J97k79l2O7J11k48j40j53J82J91Kj12K29Q2
3809I2L5j28j56N06p1o2j13K3Q5J75m39n1Q7J24j31k81K23K07k07R6R2k52J57
3832A1L71j39l7l16L24j24J78l82k24L22m2k61K42p2L7l80L4L78j51K10j51J68
3854dL44l27J11k2J09l28M58j30m11J8p1K14k69O0L19k51P8j2j89J66j9J66K95
3877C05k85M90j58q2r1k01K04k07J15j69o7O9J53l83K57N3k22J56j33K21q0J77
3899A22J0J7Jo1J37q4j87L04q0p8J37l56J4j44J41k50L94l52K34J40r2NR2m9L5
$$ plain form
3924 50 74 32 63 119 124 8 27 -18 13 6 -48 -121 -294 -51 63 -51 86 144 187 349 -16 54 49 378 80 140 66
3951 66 143 -40 -243 -539 -39 -225 -138 -164 -60 -87 76 -115 99 226 146 -157 73 127 157 194 62 138 33
3974 33 208 3 -72 -174 -339 -7 -197 -365 -211 -38 -126 -200 99 179 228 279 -109 254 54 213 -20 -88 274
3997 274 202 -151 -139 -81 -117 -174 -314 49 -244 95 114 -388 -184 303 103 184 303 107 75 225 66 230 0
4020 0 -116 94 -86 8 -197 -288 -76 -240 -145 324 108 -184 165 143 123 -25 176 -77 -77 97 -118 50 -80
4043 -80 15 -132 -68 24 -114 -289 -96 -129 -164 125 -72 49 -162 25 319 191 260 -106 262 245 -57 156 144
4066 144 -43 -85 87 -236 -125 -21 -183 -163 127 194 -147 470 214 285 237 312 98 -10 -26 43 14 -76 -53 -159
4090 -159 -190 -283 -331 -173 99 -76 -215 -103 274 184 127 39 117 14 380 177 168 192 49 -34 -14 -12 -213 -38 34
$$ packed form
3924E0K4m2L1N6Nj16J9m5L1pn4p3j73K43J14j14J37N8M3J62l65P0nL29k98O0p4
3951F6P7j83k03k96N00j86Q7k6J04k7J63j91K14J27q0l03K30N4L0L7j32P6j05
3974C3J75k05p5j02j65L32j90j68J54J73q8p4K99Q0M9N1l88L63k00J59k33o8L62
3997B74p2l53J2N8l6n7j40L63k93L39J9n02K04M87k00Q1J19j96l2J50j59J64k30
4020@j16K10j80R4k05r1K12j64R5M69k16k92L49k2k0j48K01k53%J74k15J68j30
4043h0R5j47O4R2j38j75J93l3l5K89j97J21k11J87K94j28O9l66L68j7l02K13j2
4066A44j87m2J72l23J11J04j62K0K90O7l41O17k56P1m8P5k14j08j6O9k9r0K3j06
4090a59l1r3m8J58K72j75j39J12L77r0n7q8P8j03L66k03rK4j43q3K0Kk01J75P2
$$ plain form
4115 34 -126 -284 -170 -218 -152 122 -137 1 83 429 9 82 -46 297 127 339 201 -51 33 -51 -31 -323 -186
4138 -186 -136 -83 68 110 -124 -9 -71 469 250 32 151 194 49 13 57 271 78 229 7 -20 -478 93 -209
4161 -209 -423 -163 123 -102 111 -163 283 88 -17 212 42 -162 -34 152 235 -35 -247 134 -211 1
4181 1 -185 -462 -284 -185 17 -176 24 -80 170 -94 96 412 179 407 -22 -54 -34 0 87 16 -78 -129 166
4204 166 -223 -4 -52 95 -68 -44 380 -101 135 -333 293 152 9 132 89 126 120 141 -51 -111 -166 -6 -131
4227 -131 -372 -26 -100 151 112 -76 70 173 66 302 79 166 99 -33 -31 118 13 -376 -246 -388 -106 -136
4249 -136 -122 -264 -215 -18 -258 105 153 82 134 56 170 259 232 244 199 257 41 62 83 -174 -72 -131 39 68 -231
4274 -231 -171 -118 19 292 20 102 163 147 477 -89 -44 52 88 -116 -232 -53 -96 -155 -69 299 -173 -375 70 120
$$ packed form
4115C4j60j58J14m8O6K74k59J38Q2L46m20P3j28L43j70K12j38k52Q4q4K0k92J37
4138a86N0N3J51M2k34J15o2N40k19k18J19M3j45l6M4K14j93J51k22k7m58N71l02
4161b09k14K60K86k25K13k74M46j95j05K29j70k04J28J86Q3k70k12L81l45K12
4181Aj86k77J78R9K02j93K00j04K50k64J90L16k33K28m29l2K0L4Q7p1r4n1K95
4204A66l89K19m8J47j63K4M24m81K36m68O26j41j43J23m3L7oK1j92o0n5J60j25
4227a31k41L46p4K51l9j88J46J03j07K36k23Q7o7j32KJ49j05l89J30j42K82l0
4249a36J4j42M9J97k40L63M8p1N2p8J14Q9k7J2m5N8k16K1K1k57J02n9J70K9k99
4274b31O0N3J37K73k72Q2O1j6L30n66M5R6L6k04j16J79m3n9Q6L68m72k02M45N0
$$ plain form
4298 120 -114 58 172 128 171 201 200 -42 74 84 79 -103 134 -233 -81 -214 -504 -5 -51 -93 -41 -94 171 33
4322 33 46 390 -100 19 42 176 201 231 352 70 -64 174 121 25 -196 17 79 -235 -144 -52 73 -75 16 85
4346 85 161 168 177 158 162 -65 -84 -85 -184 69 112 32 -184 63 -199 -33 -183 -449 -305 19 -12 35 161 293 -183 12
4372 12 342 -61 132 34 65 -155 -63 -207 -32 -37 173 -281 -183 -40 -154 24 164 145 -4 327 50 33 24 453
4396 453 223 78 -46 107 -88 21 77 -20 -290 -35 -71 -78 48 -257 -149 10 227 35 -150 44 158 0
4418 0 155 -103 77 40 99 -4 -20 -154 -195 -35 97 -326 87 -70 -91 -102 81 196 -334 319 -56 26 133
4441 133 -49 300 309 -23 -303 -122 88 9 -59 8 -63 18 -248 31 -66 122 160 271 203 -147 234 157 402 33
4465 33 263 208 284 -143 -242 98 52 -171 -168 -234 -74 -32 29 -44 109 -191 -7 318 239 126 99 195 46 -223 -49
$$ packed form
4298A20k34J72J14m4M3L0jk42J16J0nj82K37l67J52j33k90M99m6m2N2n3K65j38
4322C3J3L44m90J19K3J34K5L0J21k82j34K38n3r6k21K13O2l14R1R2J25j48R1O9
4346H5P6PRj9Mk27j9jr9K53M3q0k16K47k62J66j50k66J44L24l1M7J26J32m76J95
4372A2L30m03J93r8L1k20R2j44J75nK10m54R8J43j14J78J40j9j49L31k77j7rM29
4396D53k30j45j24J53j95J09N6r7k70K55l6pJ26l05J08J59K17j92j85J94J14j58
4418@J55k58J80l7N9j03j6j34m1J60J32m23M13j57k1j1J83J15n30O53l75Q2J07
4441A33j82L49Rl32k80J81K10p9o8O7p1Q1k66K79r7J88L8J11o8l50L81p7K45l69
4465C3K30n5P6m27r9L40m6k23Lo6J60M2O1p3J53l00J84L25p9j13k7R6j49k69J74
$$ plain form
4490 -49 -88 -87 -278 28 -332 -159 193 -224 -6 -120 77 121 -35 157 -40 -7 54 76 249 204 78 52 231
4513 231 -10 -125 -115 176 -5 21 -328 41 -8 202 -9 102 25 11 85 172 -15 -99 -46 -188 -168 -59 102
4536 102 -139 -30 -58 -211 -284 -168 -197 -132 17 -197 -183 -16 205 245 33 219 113 124 100 -16 -65 -38 -182
4559 -182 19 76 -140 -73 -123 -240 -11 -66 -276 -28 75 183 75 236 171 104 252 99 -60 136 112 92 49
4582 49 -43 -98 -159 -284 148 55 148 -60 160 -15 28 -70 105 -66 87 302 -181 69 -36 -171 72 22 -149
4605 -149 -225 -342 -158 -79 -338 76 121 40 8 27 140 106 383 46 267 -152 -48 -69 207 -49 -102 -215 85
4628 85 -40 44 -143 -283 -40 -288 -150 98 -181 104 156 161 309 -168 235 145 -7 150 -41 45 -19 -283 -69
4651 -69 20 258 99 -38 69 -26 -18 267 -84 208 281 456 162 -54 11 56 58 -301 248 13 -160 -49 -117 -143
$$ packed form
4490d9l9Jj91L06l60J73L52m17K18j14J97M4j56J92j97L3O1K2J73m5j26k6J79
4513B31k41j15J0K91j81K6l49L69m9K10k11J11p7j4P4Q7j87q4N3j42K0J09J61
4536A02k41J09k8j53p3J16k9O5J49k14J4J67K21M0k12J86j06J1k4j16m9K7j44
4559a82K01N7k16O7n0j17K29n5k10K48J03J08j08J61o5o7J48j53j59J96k4k0m3
4582D9r2n5o1j25M32r3R3k08K20j75M3r8J75j71J53K15m83K50j05j35K43n0j71
4605a49p6j17J84P9k59M14M5q1l2J9J13l4K77l37K21m19J04k1K76k56n3j13L00
4628H5j25Q4j87j40K43k48J38K48k79K85N2NJ48m77M03r0j52J57j91Q6o4k64K14
4651f9Q9K38j59j37J07r5QK85l51K92P3J75k94k16O5M5Kl59N49k35j73J11o8k6
$$ plain form
4675 -143 -77 -219 -173 -206 -158 17 145 7 -102 29 117 -17 24 57 -236 -195 111 -35 -181 -44 131 -149 46
4698 46 161 80 73 72 252 154 -36 45 -95 117 -15 284 135 -190 -139 55 -141 -24 -138 180 -40 -81 -2 236
4722 236 13 120 -116 -253 200 159 -128 118 123 190 0 68 -85 85 -12 -1 -315 -450 156 -266 21 142
4744 142 70 -111 62 110 189 -49 -69 347 217 -171 131 -177 75 5 -336 -85 6 71 -232 -256 297 16 -94
4767 -94 -54 130 -116 132 253 226 335 304 -80 150 -121 15 -126 16 27 -119 -197 44 -3 0 -105 -95 -358
4790 -358 -197 -215 19 311 -184 68 50 211 39 -175 143 -3 -97 41 -46 76 -415 59 -23 -130 -37 -289
4812 -289 -48 -50 14 69 156 72 -245 -72 169 103 176 70 51 130 -58 -63 28 -100 -365 281 -57 -241 -140 -30
4836 -30 -102 41 10 168 119 -49 -231 172 197 52 73 -129 -54 -192 -285 -52 -158 298 -60 29 -70 -120 143 -220
$$ packed form
4675a43O6j42M6l3M8J75J28j38j09J31Q8j34M1L3k93M1L06j46j46J37J75k80J95
4698D6J15q1pjJ80r8j90Q1j40K12j32K99j49l25N1J94j96J17j14L18k20m1P9K38
4722B36k23J07k36j37M53m1k87K46NO7j90O8j53J70r7J1l14j35O06m22K87J21
4744A42p2j81J73M8P9k38k0M16j30l88L02l08K52p0l41K51R1O5l03k4N53k81j10
4767i4M0J84k46K48J21k7J09l1l84K30k71J36j41J42J1j46p8K41m7Lj05J0k63
4790c58J61j8K34K92m95K52j8J61j72k14L18j46r4J38q7J22m91M74q2j07R3k52
4812b89K41kO4N5Q7q4l17J73K41o6P3j06j9P9j88nR1j28k65O46l38j84J01J10
4836c0p2J43l1J58m9j68j82M03K5j45K1k02P5j38r3K33j06M56l58Q9r9n0K63l63
$$ plain form
4860 -220 55 322 338 56 150 285 -56 273 128 36 -73 161 -233 -83 -206 -73 56 131 48 -246 -80 -10
4882 -10 142 313 -105 -118 337 -179 -63 216 109 -243 -253 -124 -346 7 92 -10 -82 -113 165 -66 132 52
4904 52 262 -83 332 125 317 159 222 -78 -104 111 -251 72 -92 202 -342 26 -111 -340 -127 55 -50
4925 -50 278 223 119 67 178 162 80 14 243 7 -80 168 10 90 -164 -270 -98 -168 -123 -143 150 230 -58 152
4949 152 -32 115 -103 -110 160 -51 113 -184 151 8 -80 110 87 -51 9 34 -11 -184 8 1 -102 144 189
4972 189 48 109 334 29 -13 73 160 -68 -98 -71 -11 15 36 106 0 -299 -53 -50 106 157 172 230 49 85 50 0
4998 0 245 4 208 25 -181 -61 -161 -256 -23 -54 111 16 101 80 -67 -60 192 -292 240 433 119 249 73
5021 73 60 -43 67 111 77 -233 9 38 -257 -207 5 -96 -101 131 159 -70 5 113 -177 37 323 -6 51 119
$$ packed form
4860b20K75K67J6k82R4J35l41L29j45r2j09K34l94J50j23J33J29P5q3k94J66P0
4882a0J52J71m18j3M55n16J16K79j07l52j0J29k22L53Q5j02p2l1K78k31J98q0
4904E2K10l45M15k07J92j58O3l00k6K15l62L23j64K94n44L68j37k29K13J82j05
4925e0L28n5j04n2J11j6q2o6K29k36q7K48j58Q0k54j06J72p0M5k0K93Q0k88K10
4949A52j84J47k18pK70k11J64k97L35j43q8J90k3j38O0K5m5j73J92pj03K46M5
4972A89j41O1K25l05m2Q6Q7k28l0K7O0K6K1P0j06k99K46LJ56N1J5N8j81L6l5n0
4998@K45k41K04j83k06J20j00r5K33l1J65r5Q5k1j47PK52m84N32J93l14J30j76
5021G3j3j03J10M4l4l10K42K9k95N0K12j01nK32K8k29P5J08k90K14K86l29N7O8
$$ plain form
5045 119 178 119 -250 -32 -7 -108 184 -27 -140 -175 -274 -152 46 120 62 -16 99 292 128 -57 -169 165 -35
5068 -35 -172 -80 -4 -109 -184 195 -360 -62 -45 -356 -54 -126 -17 -97 -176 -78 -1 44 160 150 81 28 180 276 -87
5093 -87 119 -521 -115 -148 3 -146 -114 145 -214 -149 -51 146 -31 87 -57 17 136 40 -175 108 12 120 -48
5116 -48 75 2 -267 -122 124 -157 -38 60 -202 -37 -171 194 136 192 28 -43 -115 -124 4 27 -18 -234 46 -249
5140 -249 -129 -268 -230 -61 -204 80 -306 -80 -100 -53 39 -6 121 -71 213 48 -21 -141 226 -60 112 107 64
5163 64 -144 -216 -72 -121 62 -59 -34 -80 -141 -169 279 140 157 89 193 76 2 -100 -143 152 -280 -84 67 -276
5187 -276 -466 98 -228 5 -19 37 -90 13 -18 -107 80 -139 -119 -46 -4 5 64 260 58 11 51 -215 103 -7
5211 -7 -136 60 -166 -42 15 140 -122 -81 248 7 -48 -69 336 -62 -87 -12 19 -41 41 -147 -81 62 -213 322
$$ packed form
5045A19N9n9l69K18K5j01K92k11j13l5r9J22J98P4n8p8J15J93j64j85j12L34k00
5068c5j37R2P6j05p5L79n55K98J7l11L02p2J09q0p9R8P7M5J16j0o9n3J52R6l63
5093h7K06o40M06l3J51j49L2K59l59O5R8J97j77J18j44P4J19r6k15K83r6J08j68
5116d8J23p3k69J45K46k81J19R8k62J65j34L65n8N6j64p1p2rJ28K3m5k16K80k95
5140b49J20j39L8J69j43K84l86K26k0M7R2m5J27j92K84j65o9j20L67k86J72nm3
5163F4k08p2J44m9J83j21K5m6o1k8M48j39J7o8J04j17p4j02m3K95m32J96J51l43
5187b76j90N64l26K33k4N6j27J03l1q9J87k19K0P3M2RN9J96k02m7M0k66L18j10
5211gj29J96k26J24N7J25k62M1L29k41n5k1M05l98k5P5L1o0Q2j88O6J43k75N35
$$ plain form
5235 322 -271 255 -252 -29 242 -33 72 190 192 14 135 -63 -138 -92 -209 104 -138 -4 -80 -178 1 166
5257 166 -116 -63 -85 22 237 221 -57 35 283 142 48 31 50 -8 -342 95 -26 -192 -273 -200 8 125 -17
5280 -17 -85 165 31 -217 -190 -23 71 -83 77 -159 13 -63 -145 8 -143 175 -119 39 -270 -21 -37 -236
5302 -236 10 186 322 61 -119 0 6 301 -11 184 19 203 -45 237 108 -8 -332 93 -321 -25 97
5323 97 -211 -126 -150 -68 -96 109 -199 -84 -44 -95 -119 134 -304 -102 226 -68 27 129 -10 -89 -181 -4 -104 -20
5347 -20 -2 60 65 14 -234 57 83 83 -70 -42 -27 440 33 -232 152 2 38 -107 7 -224 36 -3 -42 -129 54
5372 54 140 -436 -30 82 73 -75 59 383 52 -153 138 49 112 -203 46 -49 -87 -172 -70 -76 -51 91 188 4
5396 4 -252 139 28 -2 242 325 96 302 32 -18 15 63 -117 50 -163 100 2 71 12 -180 -211 -223 -140 -52 7
$$ packed form
5235C22n93N26n07K23K71k75J05J18Kj78J21j98p5M6j17L13k42J34p6r8J79J65
5257A66k82N3k2J07K15j6k78R2K48j41r4j7J9n8l34M37j21j66q1P3K08J17j42
5280a7o8K50j34k48K7J67R4j54J60k36J72p6q2J53j51L18k94J58l09K49j6j99
5302b36K46J76J36k61j80J19OK95l12J95j65J84k48K82j29j16l24M25m14K96J22
5323I7l08Q5k4Q2k8K05l08J15M0n1k4K53m38K02L28k94R5J02j39p9r2J77j00Q4
5347b0J8O2Nn1k48K91K6%j53K8J5M67m07k65L84j50L6j45J14k31K60l9l9q7J83
5372E4Q6n76M06J12rj48J34L24l31k05K91q9O3l15K49r5l8q5J02oK5J42R7j84
5396Dk56L91j11l0K44Q3k29K06k70n0L3M8j80J67k13K63r8O9n9j92l1j2Q3Q8N9
$$ plain form
5421 7 254 -4 92 -65 157 130 77 189 -51 -4 16 -157 -255 153 154 -93 108 -202 -110 48 57 154 317 230 -210
5446 -210 -84 96 -11 -123 -51 212 -118 -128 120 33 -182 -42 49 60 -40 -99 -13 58 382 76 47 106 -101
5469 -101 -133 -74 -5 29 32 6 56 -29 -275 -310 134 -107 -95 -129 -42 -8 54 47 253 -165 -85 -119 -83 -147 129 157 13
5496 13 137 -78 -134 -312 144 -311 -115 -147 -170 132 11 -117 -125 -41 9 -53 -237 83 175 171 -212 -211 -30 58 -96
5521 -96 -10 37 -125 -24 57 -15 132 -19 32 169 -10 193 330 122 -140 209 41 54 31 132 -299 122 38
5544 38 -98 -130 63 -11 56 70 -37 -241 329 -49 -143 -27 139 112 -96 -129 -160 69 167 -15 13 -9 51 -67
5568 -67 -358 10 193 196 -222 -34 15 52 -92 57 243 -233 244 250 -54 -2 91 -174 -85 23 97 -41 -35 113
5592 113 -206 -140 83 -132 224 74 -105 -16 -7 59 38 78 142 -131 393 -47 163 -74 -47 -309 46 -248 124
$$ packed form
5421GK47k58R6j57K22k7n3J12k40M7K0j73r8M08Jk47K01l10R2J58RR7J63q7m40
5446b10J26J80j07j12P2K63l30j0K48q7k15J40R1J1j00n9Q6P1L24l06k9N9k07
5469a01l2N9O9L4Lk6N0q5k46l5M44k41J2l4Q7L4O2pK06m18Q0l4L6o4K76K8j44
5496A3J24k15n6j78M56m55J96l2k3L02j21j28qQ4N0o2j84L20R2ml83JJ81Q8j54
5521i6Q6M7j62J01Q1p2J47j51N1J37j79K03J37k08k62L49j68J3k3J01m31M21q4
5544C8j36l2J93p4O7J4j07k04N70l78r4J16J66k7k08l3l1K29R8j82K8k2O0j18
5568f7k91L68J83Lm18J88M9L7j44J49J86m76M77Ol04N2R3k65Q9J08P4j38OJ48
5592A13l19O6K23k15L56j50j79Q9RO6k1M0O4k73N24m40K10k37K7k62L55k94L72
$$ plain form
5615 124 -49 -158 -51 163 300 -4 113 -24 143 -141 -168 -184 87 74 -138 -324 -85 56 -208 -95 58
5636 58 43 105 -50 130 -73 -229 198 177 -318 110 -25 -39 -202 57 -116 202 -165 66 -410 -41 -42 53 164
5659 164 -29 -13 41 128 -21 -119 73 262 39 268 208 -74 145 315 -8 -104 48 61 -296 38 -42 91 39
5682 39 -82 -109 -146 23 93 16 255 198 32 -212 223 107 -145 25 91 -70 -159 -43 -13 -60 -48 -90 14 -350
5706 -350 -187 -71 -135 118 -186 175 201 254 191 49 351 57 -10 -240 -65 -40 -176 131 -262 23 155 -187
5728 -187 -253 -183 52 54 -23 112 -63 129 373 22 -207 0 215 121 201 27 54 -114 -333 -137 -178 -46 -338
5751 -338 -322 39 -56 -38 -50 -30 70 -24 -18 3 130 306 -22 -40 -52 -83 -155 40 -122 137 -63 171 -116 54
5775 54 -14 105 43 129 59 37 20 -110 324 -62 296 5 -107 -85 53 -291 -290 -45 6 208 -121 26 143 173
$$ packed form
5615A24j73j09J07K14J37l04J17j37J67k84k7j6K71j3k12j86K39J41k64J13J53
5636E8j5O2j55J80k03j56M27k1m95M28j35j4j63K59j73L18l67K31m76L69jR5J11
5659A64j93J6N4Q7j49r8J92J89k23K29o0k82K19J70l23r6J52J3l57L34q0J33n2
5682C9j21k7l7J69P0p7K39n7j66k44M35j16k52J70O6j61q9J16L0m7J2m2J04l64
5706c50J63J16o4K53l04L61K6N3o3j42L02k94o7k30J75K5j36L07l93K85J32l42
5728a87o6P0K35Kp7J35j75J92K44l51k29K07K15r4Q0j74K7j68k19J96m1J32k92
5751c38J6L61r5J8j2K0J00r4OK1J27J76l28j8j2l1p2J95j62K59k00K34k87J70
5775E4o8J19o2Q6p0k2j7j30M34l86L58k91j12K2J38l44JK45N1K02l29J47J17L0
$$ plain form
5799 173 177 -37 267 160 219 136 22 -100 -86 -121 -189 -81 -1 -73 70 9 -142 16 -156 -172 304 -91 55 268
5823 268 123 21 -256 208 -145 -100 125 210 167 -101 -99 -342 -34 -72 -160 -79 -159 -72 -71 204 -125 -209 -124 15 97
5848 97 270 347 88 -8 -30 -22 -116 -135 -333 90 -208 -40 -57 -150 -179 -70 -34 76 233 -3 138 201 4 26 68
5873 68 -21 303 126 -23 -164 6 105 -99 -50 118 48 -200 -61 -56 116 -1 -84 -41 32 -264 -52 -167 -97 -261
5897 -261 -211 -137 -79 -210 -92 -228 73 -107 133 7 59 -17 70 294 -163 98 68 -102 -59 -102 -156 260 43
5920 43 153 40 21 -9 -65 142 8 94 -335 -67 -245 52 -70 58 62 -53 -1 168 37 -20 339 97 -137
5943 -137 -64 331 42 -164 -178 22 -111 -233 -56 -238 -73 229 78 6 37 118 198 13 -62 -44 12 -36 4 127
5967 127 37 96 -21 -107 70 -212 10 -266 -72 186 120 -77 -13 -24 134 225 27 337 -24 -29 -50 -28 78 -181
$$ packed form
5799A73Mk14L04j07N9q3j14j22J4l5o8J08Q0p2J43o1j51J58j72j6M76l95J46K13
5823B68j45j02k77M64l53M5K25Q5m3k68Kk43L08l8q8Q1q0Q7JK75l29q4Q5J39Q2
5848I7J73P7k59r6k2Qr4j9j98M23k98J68j7r3k9J09L6J10J57k36J41O3j97K2M2
5873F8q9L24j77j49j41J70R9k04M9J68p0k48J39NJ72j17q3M3P3k96K12j15P0j64
5897b61N0P4N8j31J18j36L01j80K40j26N2p6Q7K24m57K61l0j70M3m3n4M16k17
5920D3J10j13j9l0n6K07j34Q6m29K68j78K97j22J28Mj15N2J69j31n7L59k42k34
5943a37P3L95k89k06j4K00j33j22J77j82J65L02j51p2L1Q1Q0j85p5J8N6m8M0J23
5967A27r0N9j17q6J77k82K22k76J94K58o6j97O4j1J58R1j98L10l61nk1K2J06k59
$$ [...]
8191G4
##END NTUPLES=NMR FID
##END=
