##TITLE=1H_LR-758-R4-KA5-CR19
 CDCl3
 8 sc, 
 29.12.2023
##JCAMPDX= 6.0         $$ Bruker NMR JCAMP-DX V2.0
##DATA TYPE= NMR FID
##DATA CLASS= NTUPLES
##ORIGIN= UXNMR, Bruker Analytische Messtechnik GmbH
##OWNER= root
$$ XWIN-NMR		Version 3.5
$$ Fri Dec 29 15:54:10 2023 Russian Standard Time (UT+4h)  she@DPX200
##.OBSERVE FREQUENCY= 200.1313
##.OBSERVE NUCLEUS= ^1H
##.DELAY= (6, 6)
##.ACQUISITION MODE= SIMULTANEOUS
##.ACQUISITION SCHEME= undefined
##.AVERAGES= 8
##.DIGITISER RES= 18
##SPECTROMETER/DATA SYSTEM= spect
##.PULSE SEQUENCE= zg30
##.SOLVENT NAME= CDCl3
##.SHIFT REFERENCE= (INTERNAL, CDCl3, 0, 15.7039)
##AUDIT TRAIL= $$ (NUMBER, WHEN, WHO, WHERE, WHAT)
$$ ##TITLE= Audit trail, XWIN-NMR		Version 3.5
$$ ##JCAMPDX= 5.01
$$ ##ORIGIN= Bruker BioSpin GmbH
$$ ##OWNER= she
$$ F:/spectra/data/she/nmr/H-F/1/audita.txt
$$ ##AUDIT TRAIL=  $$ (NUMBER, WHEN, WHO, WHERE, WHAT)
(   1,<2023-12-29 15:53:01.93 +0400>,<she>,<DPX200>,
      <created by zg, POWCHK disabled, PULCHK disabled
       configuration hash MD5:
       00 E9 B6 7A A2 85 ED C7 34 08 36 98 17 FE 4E 26
       data hash MD5: 16K
       BD D3 65 17 AE A1 F1 1F 67 A0 C7 C0 48 6D 7F 32>)
$$ ##END=
$$ 
$$ hash MD5
$$ 86 B0 98 E7 B0 E7 A2 EF 36 72 9D BD BB 35 01 73
##$RELAX= 
##$RELAX= 
##$RELAX= 
##$RELAX= 
##$RELAX= 
##$RELAX= 
$$ Bruker specific parameters
$$ --------------------------
##$DU= <F:/spectra>
##$EXPNO= 1
##$NAME= <H-F>
##$PROCNO= 1
##$TYPE= <nmr>
##$USER= <she>
##$AMP= (0..31)
100 100 100 100 100 100 100 100 100 100 100 100 100 100 100 100 100 100 
100 100 100 100 100 100 100 100 100 100 100 100 100 100 
##$AQSEQ= 0
##$AQ_mod= 1
##$AUNM= <au_zg>
##$AUTOPOS= <>
##$BF1= 200.13
##$BF2= 200.13
##$BF3= 200.13
##$BF4= 200.13
##$BF5= 200.13
##$BF6= 200.13
##$BF7= 200.13
##$BF8= 200.13
##$BYTORDA= 1
##$CFDGTYP= 0
##$CFRGTYP= 5
##$CHEMSTR= <none>
##$CNST= (0..31)
1 1 145 1 1 1 1 1 1 1 1 1 1 1 1 1 1 1 1 1 1 1 1 1 1 1 1 1 1 1 1 1 
##$CPDPRG= <>
##$CPDPRG1= <>
##$CPDPRG2= <>
##$CPDPRG3= <>
##$CPDPRG4= <mlev>
##$CPDPRG5= <mlev>
##$CPDPRG6= <mlev>
##$CPDPRG7= <mlev>
##$CPDPRG8= <mlev>
##$CPDPRGB= <>
##$CPDPRGT= <>
##$D= (0..31)
0 1.2 0 0 0 0 0 0 0 0.06 0 0.03 0 0 0 0 0.0002 0 0 0 0 0 0 0 0 0 0 0 0 
0 0 0 
##$DATE= 1703850781
##$DBL= (0..7)
120 120 120 120 120 120 120 120 
##$DBP= (0..7)
150 150 150 150 150 150 150 150 
##$DBP07= 0
##$DBPNAM0= <>
##$DBPNAM1= <>
##$DBPNAM2= <>
##$DBPNAM3= <>
##$DBPNAM4= <>
##$DBPNAM5= <>
##$DBPNAM6= <>
##$DBPNAM7= <>
##$DBPOAL= (0..7)
0.5 0.5 0.5 0.5 0.5 0.5 0.5 0.5 
##$DBPOFFS= (0..7)
0 0 0 0 0 0 0 0 
##$DE= 6
##$DECBNUC= <off>
##$DECIM= 32
##$DECNUC= <off>
##$DECSTAT= 4
##$DIGMOD= 1
##$DIGTYP= 9
##$DL= (0..7)
0 120 120 120 120 120 120 120 
##$DP= (0..7)
150 150 150 150 150 150 150 150 
##$DP07= 0
##$DPNAME0= <>
##$DPNAME1= <>
##$DPNAME2= <>
##$DPNAME3= <>
##$DPNAME4= <>
##$DPNAME5= <>
##$DPNAME6= <>
##$DPNAME7= <>
##$DPOAL= (0..7)
0.5 0.5 0.5 0.5 0.5 0.5 0.5 0.5 
##$DPOFFS= (0..7)
0 0 0 0 0 0 0 0 
##$DQDMODE= 0
##$DR= 18
##$DS= 0
$$ [...]
##$SUBNAM2= <"">
##$SUBNAM3= <"">
##$SUBNAM4= <"">
##$SUBNAM5= <"">
##$SUBNAM6= <"">
##$SUBNAM7= <"">
##$SUBNAM8= <"">
##$SUBNAM9= <"">
##$SW= 18.0517328524113
##$SWIBOX= (0..15)
0 0 2 0 0 0 0 0 0 0 0 0 0 0 0 0 
##$SW_h= 3612.71676300578
##$TD= 16384
##$TD0= 1
##$TE= 0
##$TE2= 300
##$TE3= 300
##$TEG= 300
##$TL= (0..7)
0 120 120 120 120 120 120 120 
##$TP= (0..7)
150 150 150 150 150 150 150 150 
##$TP07= 0
##$TPNAME0= <>
##$TPNAME1= <>
##$TPNAME2= <>
##$TPNAME3= <>
##$TPNAME4= <>
##$TPNAME5= <>
##$TPNAME6= <>
##$TPNAME7= <>
##$TPOAL= (0..7)
0.5 0.5 0.5 0.5 0.5 0.5 0.5 0.5 
##$TPOFFS= (0..7)
0 0 0 0 0 0 0 0 
##$TUNHIN= 0
##$TUNHOUT= 0
##$TUNXOUT= 0
##$USERA1= <user>
##$USERA2= <user>
##$USERA3= <user>
##$USERA4= <user>
##$USERA5= <user>
##$V9= 5
##$VALIST= <valist>
##$VCLIST= <CCCCCCCCCCCCCCC>
##$VD= 0
##$VDLIST= <DDDDDDDDDDDDDDD>
##$VPLIST= <PPPPPPPPPPPPPPP>
##$VTLIST= <TTTTTTTTTTTTTTT>
##$WBST= 1024
##$WBSW= 4
##$XGAIN= (0..3)
0 0 0 0 
##$XL= 0
##$YL= 0
##$YMAX_a= 88559
##$YMIN_a= -96166
##$ZGOPTNS= <>
##$ZL1= 120
##$ZL2= 120
##$ZL3= 120
##$ZL4= 120
##$ABSF1= 10
##$ABSF2= 0
##$ABSG= 5
##$ABSL= 3
##$ALPHA= 0
##$AQORDER= 0
##$ASSFAC= 0
##$ASSFACI= 0
##$ASSFACX= 0
##$ASSWID= 0
##$AUNMP= <proc_1d>
##$AZFE= 0.1
##$AZFW= 0.1
##$BCFW= 1
##$BC_mod= 2
##$BYTORDP= 1
##$COROFFS= 0
##$CY= 11.3945322036743
##$DATMOD= 1
##$DC= 2
##$DFILT= <>
##$DTYPP= 0
##$F1P= 15.7292609196834
##$F2P= 12.9074282941183
##$FCOR= 0.5
##$FTSIZE= 0
##$FT_mod= 4
##$GAMMA= 1
##$GB= 0.15
##$INTBC= 1
##$INTSCL= 1
##$ISEN= 128
##$LB= 0.24
##$LEV0= 0
##$LPBIN= 0
##$MAXI= 10000
##$MC2= 0
##$MEAN= 0
##$ME_mod= 0
##$MI= 1.114404
##$NCOEF= 0
##$NC_proc= 0
##$NLEV= 6
##$NOISF1= 3.799351
##$NOISF2= 2.8
##$NSP= 1
##$NTH_PI= 0
##$NZP= 0
##$OFFSET= 15.70392
##$PC= 1
##$PHC0= -24593.9
##$PHC1= 14.25273
##$PH_mod= 1
##$PKNL= yes
##$PPARMOD= 0
##$PSCAL= 0
##$PSIGN= 0
##$REVERSE= no
##$SF= 200.130013532006
##$SI= 16384
##$SIGF1= 3
##$SIGF2= 2
##$SINO= 400
##$SIOLD= 16384
##$SREGLST= <1H.CDCl3>
##$SSB= 0
##$STSI= 0
##$STSR= 0
##$SW_p= 3612.71676300578
##$SYMM= 0
##$S_DEV= 0
##$TDeff= 0
##$TDoff= 0
##$TI= <>
##$TILT= no
##$TM1= 0
##$TM2= 0
##$TOPLEV= 0
##$USERP1= <user>
##$USERP2= <user>
##$USERP3= <user>
##$USERP4= <user>
##$USERP5= <user>
##$WDW= 1
##$XDIM= 8192
##$YMAX_p= 0
##$YMIN_p= 0
$$ End of Bruker specific parameters
$$ ---------------------------------
##NTUPLES= NMR FID
##VAR_NAME=  TIME,          FID/REAL,        FID/IMAG
##SYMBOL=    X,             R,               I
##VAR_TYPE=  INDEPENDENT,   DEPENDENT,       DEPENDENT
##VAR_FORM=  AFFN,          ASDF,            ASDF
##VAR_DIM=   8192,          8192,            8192
##UNITS=     SECONDS,       ARBITRARY UNITS, ARBITRARY UNITS
##FACTOR=    0.0002768,     1,               1
##FIRST=     0,             0,               0
##LAST=      2.2672688,     0,               0
##MIN=       0,             -96166,          0
##MAX=       2.2672688,     88559,           0
$$ Real data points
##PAGE= N=1
##DATA TABLE= (X++(R..R)), XYDATA
$$ [...]
1822b79k77m64L69M91j97J50k1l34l41N43n2J08M39n3K27K60K77m09K67o75K2
1843E1J19L12k62l52K51m86j25RK47l42M16K34p9M5J17k67M22j07j62K7J04k6
1865A46O2J99O8l66p7k13m14L14J11j87K63M63r0J50m14J24r4K46q8k6J44R7n79
1888a61K4Q6m63l13K81K46k33N61q4j10k70Q56o88M70J08r9J35K96J44j89m2l2
1910E23l55j52k60L2R1p3J06r8j82K4n5L9J16L6K91M73k02J93J69m79J80k12K11
1933D16n63RL96n20k0J56o25J07k7J07R4J32L81m60P33m55K75o3j28K09J35J98
1955D87p7l67M35j33m78n8j62l0L10O4J8J99J20k21j87J35O0k63K05K86l61J73
1977A55K5k71l29j38K29p7R5N06l42K44L4j96J77n8K78j75K71J80J69J1k48k03
$$ plain form
1822 -279 -556 -1020 -651 -160 -357 -207 -228 -562 -903 -360 -412 -304 135 82 309 569 846 437 704 29 51
1843 51 170 482 220 -132 119 -367 -492 -483 -236 -578 -162 72 -7 38 155 -112 310 203 41 68 172 146
1865 146 208 407 475 109 32 -181 -595 -281 -170 -357 -94 369 279 429 15 139 45 291 203 177 321 418 -161
1888 -161 -137 -51 -514 -827 -546 -300 -533 28 -56 -166 -436 420 -268 202 310 211 346 642 786 597 555 523
1910 523 168 16 -244 -212 -121 -194 -88 -186 -368 -344 -399 -360 -244 -208 83 556 354 547 716 237 417 205 416
1933 416 -147 -138 258 -262 -282 -126 -751 -644 -671 -564 -470 -338 43 -417 316 -139 136 73 -55 154 289 487
1955 487 410 43 478 345 -133 -191 -353 -383 -73 -9 9 208 328 107 -80 55 115 -148 57 343 -18 155
1977 155 180 -91 -420 -558 -329 -406 -311 195 -147 97 131 -65 112 54 332 157 428 608 777 788 540 337
1999C37j60p1j07n96M30k81k8M86k97q9J52M3k56K71M84j22M58r9p7K7l0k06k89
2022b0J02N8j00N2n9k98j10k12J48j06K65K17j54L95q7q5r9j8L1r2L38K9L8J02
2046C35n53R9k53q6K07k51K68J44J29J86j16j37J56j63j4K32j62l74N55R2k09
2067H5l9R5m08r2J4j19J82O23k75N6P1j47j1J09O7J93Q6J02k04M6j87p5l92L5
2091a85J55l52Q4R6k51j44M41j30k37p5O68j78L82K98j96o6J70k73L40k45m78
2112a76K46M37l08n71M87m54k32K75L04k13L6K27j1j38K10K96m71J92R0k40k3
2133c7K87k55K2M0m19j34O8J35k97L37L33k17K87J32m08J27K38q8m6o6K5o0L85
2156C89O4o13J58p3j76O4R5M1j45J30k13K14j42L07J56K96j59j04R8%k36j71J17
$$ plain form
1999 337 177 106 -1 -597 -167 -448 -476 10 -287 -376 -224 -181 -437 -166 318 196 654 555 478 505 475 269 -20
2022 -20 82 140 40 92 33 -265 -375 -587 -439 -545 -280 -63 -217 178 91 6 -93 -111 -80 -172 166 195 233 335
2046 335 -218 -119 -372 -458 -251 -502 -234 -90 39 225 109 -28 128 -35 -49 183 21 -353 202 294 85
2067 85 46 141 -267 -359 -345 -464 -282 341 66 122 193 46 35 144 211 404 490 592 388 434 247 172 -220 -185
2091 -185 -30 -382 -298 -202 -453 -597 -156 -286 -523 -598 70 -108 274 572 376 310 480 207 547 302 -176
2112 -176 70 507 199 -372 115 -339 -571 -296 8 -205 -169 58 47 -91 119 415 -56 136 226 -14 -37
2133 -37 250 -5 17 57 -362 -496 -428 -293 -590 -253 80 -137 150 282 -126 1 239 151 105 39 64 4 389
2156 389 453 -160 -2 -75 -251 -187 -92 -51 -196 -66 -279 -65 -207 100 256 552 393 289 387 387 151 -20 97
2179I7K6l63J06j81R0K67p1o6j81M9j42r8N49J27J48k38K18j92J39j22j18J15
2201A59J91l96r8p4j36j0J22J16k35j64K88J83J21L74k80j86p0L58n55M16L86
2222E10j04k51j07N7m16K64k62K6K83m5J39o9N89m81j16P81n41j23P2K35j79L66
2244F28j50k23o7l87k97K89K03k1j08m9r3L3J5J18j36K02J58j00J23Q8k10j41
2266a25K4j61P5j8K6l2j33L71j49jk48J83j56j7L23M1K17J83r9k16q1k81K50K94
2290B70m10N5J1R6j26J22l2l4k24K84J30Q1q6Q7L57k91L81p16M98m36L37j7k20
2313A17Kk14K26M7l76K19k73k07K52k9J61j09L02J1j04OK14l50K42M05k63k50
2335B9q1K40k17m25J32J87J27R1m7l05L22L2K2Rk0N9J39N8k40m0R9pj92j18l7
$$ plain form
2179 97 123 -240 -134 -315 -225 42 -29 -95 -276 -227 -369 -467 82 209 357 119 337 145 284 162 44 159
2201 159 350 -46 -144 -218 -354 -364 -242 -126 -361 -525 -237 -54 67 441 161 -25 -95 263 -292 124 510
2222 510 406 155 48 105 -311 -47 -309 -283 0 -45 94 25 614 133 17 798 257 134 206 441 262 628
2244 628 478 255 188 -199 -496 -207 -4 -25 -133 -182 -275 -242 -227 -109 -245 -43 115 15 138 226 16 -125
2266 -125 -101 -262 -187 -205 -179 -211 -344 27 -122 -123 -371 -188 -344 -361 -38 3 220 403 304 88 7 -274 -24 270
2290 270 -140 -85 -74 22 -104 18 -14 -48 -272 12 142 223 137 224 581 290 671 -45 453 17 354 337 117
2313 117 119 -95 131 178 -198 21 -252 -459 -207 -236 -75 -184 118 129 25 31 245 -105 137 542 279 29
2335 29 -52 188 -29 -454 -322 -135 -8 83 36 -269 53 85 107 116 96 155 294 352 112 72 171 164 -28 -146 -183
2360a83K42o0j64N0M3r8l8J10p5K91K08k40K62p8j35j71J04L09k43k30K20k89
2382a65R8q4j00k01K96j04L1J78O4K77l0Q5Q9o2N2k66J20K55k74j98J90l14j20
2405a83p3l3L7j33kJ26J11K3J62j50m4M5L82j05r7J44Q6J2m9k88J81j17j96J18
2429d3l31K42j44K06Q5q2j89L4OK86m5K10J19j10j33o7l24K10k37M24Mj41J55
2452A35j82j94J58o8Q3lJ62N3n3L85l30K3j76J12p3j84M50k10j05k1M2j66k85
2475d47J85j3j83N79j12kJ36q9J67q7k5O8L6k35K66J72j58k45j7j59k3m2m6oo2
2500c42J77K18L6k76p1L40j4J81K02k32OK87m67M75o41m4K86m16L02k57J93J72
2522A15l22O6jP3M8K3o2J74l9q0r7M03j02l06L45l45M0J31m0j00k24L39k30J44
$$ plain form
2360 -183 59 -1 -165 -115 -72 -170 -208 -98 -173 118 326 86 348 270 135 -36 68 377 134 -96 124 -165
2382 -165 -67 -151 -251 -452 -156 -260 -229 -51 13 290 260 345 434 372 424 158 278 533 259 61 251 -63 -183
2405 -183 -256 -289 -252 -385 -387 -261 -150 -127 35 -115 -159 -114 268 163 66 210 296 308 259 -29 152 35 -161 -43
2429 -43 -374 -132 -276 -70 15 -67 -256 -222 -216 70 25 235 354 244 111 44 -280 -70 -307 117 121 -20 135
2452 135 -47 -241 -83 -151 -68 -71 91 144 91 476 146 169 -7 105 32 -152 298 88 -17 -38 4 -162 -447
2475 -447 -262 -275 -458 121 9 7 143 54 221 134 109 177 213 -22 244 416 258 13 -4 -163 -186 -228 -274 -280 -342
2500 -342 -165 53 89 -187 -258 82 68 249 451 219 225 512 45 520 -121 -165 121 -295 7 -250 -57 115
2522 115 -207 -141 -142 -69 -21 2 -60 114 75 -5 -102 301 199 -107 238 -107 -67 64 24 -76 -300 39 -191 -47
2546d7K45j49R3J13j94J08k4q0n9K18J5j22jq8j28R4r1k76P0K92M9j78L91Ok82
2571b5K64k56J87o4L17k94j94K12P9k55r9K55k87P4k68J05K11m1j52l0K77j66
2593a50j57M88j40r0K49L3j51K05q1j51K7Q0k54j84L18j98J67l30M52k13l0J52
2615D2J81k73K46m4q1K49J5l46j93L40j82L1n7p3j49M5K93k21KO8k8K93j42l9
2639b3P0R6nR2j98K60j96l77K42lJ00k07L83k28j82l44l1L20Q6j36L86N0k04R4
2663D5J01M7n7m3M0j82K14k09N18m64l19L44l66N5J42J66J20q9k82L58J7k00L29
2686B85j33j18m5K39j74j00J70l92K81k36K62k79K15J9k89K79j06R7j95r0K73
2707c7J94K45J4j20j15j20n7k01l0L47k11j74K82o2kQ5j03l15L41M9Q6j30RL16
$$ plain form
2546 -47 198 49 142 255 61 169 145 65 6 224 239 117 116 28 -100 -6 -97 -373 -303 -11 38 -140 251 257 -25
2571 -25 239 -17 170 106 423 129 -65 147 226 -29 -128 127 -160 -86 -354 -249 -38 -79 -231 -261 16 -150
2593 -150 -307 181 41 -49 200 233 82 287 206 55 82 162 -92 -276 42 -156 11 -319 133 -80 -110 42
2615 42 223 -50 196 152 71 320 335 -11 -204 136 -46 -15 -72 -145 -294 -249 44 -177 -175 -107 -135 158 16 -23
2639 -23 47 143 138 230 32 292 96 -281 -39 -42 58 -149 234 6 -176 -520 -551 -231 -145 -281 105 155 -49 45
2663 45 146 193 136 93 133 -49 165 -44 474 10 -309 35 -331 -276 -134 32 152 63 -219 139 156 -44 285
2686 285 152 34 -11 228 54 -46 124 -268 13 -223 39 -240 -25 -6 -295 -16 -122 -25 -220 -310 -37
2707 -37 157 402 416 296 181 61 4 -197 -227 120 -91 -265 17 -45 -47 38 -65 -380 -39 10 96 -34 -25 291
2731B91K89n07N1No8q8K01j11p5N0l0j93n2J79q8K4j51L53j23q2R6nL9j16J58
2756D7l86N59l05j81L58l16%L12j93q6l39L90Q9k28O4K40j2j17k47K87L45l3j87
2779F1K55k31j23K48l96K39k14J06mJ54N3k69J19j56R1K08l77M83j30J06l22M23
2801C24n58K94k3P1Q5k32M5l07M40m38K58j4j19Pk7L54k53L25j47p7K80n16J86
2824d2j8K00k66J88j27p8J3p4P7k68R1L93k19j47J61Q8M7pK72k91j1N2J57k27
2848c6L6j92k0L36j27l15J53K41k99J89J17l8O6p7J52oj61m8L39l8O2k02j72K08
2872A68m19J53j21K6j09K91J46k50K8K33l36K66j55O1K17j07j51N8R3J22l53k17
2894c56J46K40J97l28j89K67j32J22J93k84J19l68K38K30P6k67K98j77J51k15
$$ plain form
2731 291 580 73 124 129 61 -27 174 63 -12 38 8 -185 -237 -58 -146 -122 -273 80 -43 -125 -29 -34 5 -111 47
2756 47 -339 220 -85 -266 92 -224 -224 88 -105 -191 -530 -140 -51 -279 -215 25 13 -104 -351 -64 281 248 61
2779 61 316 85 -38 210 -186 53 -161 -55 -59 95 148 -121 -2 -158 -67 141 -236 247 117 223 -99 324
2801 324 -234 60 37 108 193 -39 6 -301 139 -299 -41 -55 -174 -167 -194 160 -93 232 85 8 288 -228 -42
2824 -42 -60 140 -126 62 -65 -143 -130 -204 -127 -395 -304 89 -130 -277 -116 -28 19 12 284 -7 -18 34 191 -36
2848 -36 0 -192 -212 124 -3 -318 -165 76 -223 -34 83 45 111 34 186 180 19 -29 310 272 334 132 -40 168
2872 168 -251 -98 -219 -193 -302 -11 135 -115 -87 146 -190 76 -79 -18 199 92 -59 -1 92 214 -139 -356
2894 -356 -210 30 227 -101 -290 -23 -155 -33 160 -124 -5 -373 -135 95 171 -96 202 25 176 -39
2914c9jk42N09Rj06l09p2L66k75R1j8Q6m5p5l6J35L47l47J02N0J1k1K40m87K98
2939A71l87L64k26l5K10m04L26j99J98l3lP7L0k4k3k00M69k04J98o9p0r3j73J70
2963G0j44k01J16J79p1J08Q7m36K84M1q1K71k12J10j07K11k33L7n9J09k66j9J05
2986a01j4QQ2k33J17J63J0j15R8j58L54K7o5Jr9j41J91k72M16j89P4j76n5K06
3010A29j99k79K25k6R3J6p8L0M02k34J5N6k3N0j19n6K22J7l38QM0J61l44J90J9
3035b3o9O3N4j72K28l6N7L6m0MJ3K57k20j29n3lj24N2j8J96n4k91L67k98R9Qm2
3062a38J19R5L1q3L05j57k38J16P9q6k47O4q5J64J64k64l3j45J88q8K54j66J02
3085d9J98M4j79J50j4J0r8J82j42k66K48J19m5n01K06J20l01J68J74o5J99L8k09
$$ plain form
2914 -39 -40 -282 227 236 130 -179 -251 115 -160 -69 -87 -1 -46 -121 -157 -22 325 -22 80 130 141 120 360 -127 171
2939 171 -216 148 -78 -113 97 -307 19 -180 18 -15 -18 59 89 65 42 -158 311 107 305 236 166 73 -100 70
2963 70 -74 -275 -159 20 -51 57 144 -292 -8 33 -48 223 11 121 14 225 -8 29 -30 79 -187 -206 -101
2986 -101 -115 -107 -25 -258 -141 22 32 -83 15 -143 211 238 173 174 75 -66 125 -147 269 80 154 -22 -77 129
3010 129 -70 -349 -124 -150 -57 -41 -119 -89 313 79 94 150 127 177 58 2 224 241 -97 -89 -49 112 -232 -42 -23
3035 -23 -92 -29 25 -147 81 45 102 138 98 102 115 372 152 23 -30 -33 -157 -105 -123 73 19 -272 95 -203 -104 -96 -138
3062 -138 -19 76 107 24 329 172 -66 50 129 43 -204 -140 -225 -61 103 -161 -194 -339 -151 -239 15 -151 -49
3085 -49 149 193 14 164 150 160 62 244 102 -164 84 203 158 -343 -137 -17 -318 -150 24 -41 158 196 -13
3108a3L5j76J44R4k2J25j16k38K99J41m11J39N2j53K00mn3N8N5j98J10r6J58N3
3132A83k96L46k23q8N4p0P6kj19J48j16k25N03k82L8k49N03m14N9J24l2J20l6
3155Bq5J93p0J34l11L04j74k6N1n0n4k78M44P2k80j30K99j80J9K24j30K31p3m7
3179H5Jl06L15p3j40J84J92l46J30k30j2jJ85p6N2r6J72m2J48O5on4j7k33K73
3204A70j54j01J50k06l9K69m2j19o3p1K51j65J56j67J15j41K57j56O1J34m0j90
3226i1L74J9k34j0n6k72J63l1j13L48k11Q5K7p3K64m7k04L0Q1J39o9o4K12l32
3250f5Q0j8pj59J44j42L49l03L06o5k96L17K29m11J34J90l4k23M3J86q3n03L91
3273F0r4n8J63k05J62k58p9L2N2R0J14j41L49P8m4k6O9o3j98K23O1k25j28jJ10
$$ plain form
3108 -13 22 -154 -10 84 62 187 71 -167 132 273 -138 1 53 -100 100 96 43 101 156 -42 68 -28 130 183
3132 183 -113 233 10 -78 -24 -94 -18 -20 -139 9 -107 -332 171 -111 -73 -322 181 -233 -174 -50 -82 38 2
3155 2 -83 110 40 174 -137 167 -7 -33 18 -32 -86 -364 80 152 -128 -258 41 -139 -120 104 -26 205 132 85
3179 85 86 -220 95 22 -118 66 258 -88 42 -188 -200 -201 -16 -92 -40 -136 36 -6 142 207 201 147 130 -103 170
3204 170 16 -85 65 -141 -180 89 47 -72 -135 -206 45 -120 36 -131 -16 -157 100 -56 5 139 99 -91
3226 -91 283 302 68 58 2 -270 -107 -138 -251 97 -114 -29 -2 -75 189 142 -62 -32 49 188 119 55 267 -65
3250 -65 15 -3 -10 -169 -25 -167 182 -121 185 120 -176 141 370 -41 93 283 249 26 69 255 172 -331 60
3273 60 -34 -92 71 -134 28 -230 -309 -277 -225 -135 -21 -162 187 265 221 195 264 201 3 226 287 62 -66 -67 43
3298D3k81K04N9r8R9o6j89K21K4k94N19k48k31O79l38L51m43j30K68l16J31J49
3320A13P2n5n2k0j86K73l72K3J58J57r9k6J26K2J24j58P6j94Q5k36k03L98J45
3343A71k24n4j37L74k70K73k80K81j72J56j12L2J66j20J85j50k18M6K49k82P8
3364hj59P9J83k28L7O6J98k40J26k04L34j22o1J16n3q5k8k1J63r9l7K00O7j88
3388C6l15J64J28k31mJ03n0K33j45M46k19j66KJ73j9j46J72k02M1k42L61l38J26
3411i2J2rp8J48k4j92R3O1K72p8k63J37O2N3m5O6j87k1J85k59M18k77k24K6K99
3436H3j85N5j0J46k9j6NJ14k00M02m8k37N5j5l2R1n7j85j09K5J42K4k65J63J5
3461f8J03o0j1J51j11j32J53N3k12O75m59j40P3j06J82ok08J71j10ro9J6J35M4
$$ plain form
3298 43 -238 -34 25 -73 26 -40 -229 -8 16 -278 241 -7 -238 441 103 454 11 -119 149 -167 -36 113
3320 113 185 130 78 58 -128 145 -227 -204 -46 111 12 -14 112 134 258 100 176 -18 67 -169 -372 26 171
3343 171 -53 -107 -244 130 -140 133 -147 134 -38 118 6 38 204 84 269 119 -99 -53 196 -86 -8
3364 -8 -167 -88 95 -133 -96 -30 168 -72 54 -150 184 62 1 117 64 -21 -49 -70 93 -6 -43 157 224 36
3388 36 -279 -115 13 -218 -222 -119 -169 64 -81 365 146 -20 -18 155 136 -10 162 -40 1 -241 120 -218 -92
3411 -92 -80 -89 -167 -19 -43 -235 -142 -81 191 113 -150 -13 49 102 57 123 -64 -85 100 -159 259 -18 -242 -216 83
3436 83 -102 -47 -57 89 60 44 49 163 -37 365 317 80 135 120 88 179 122 -63 -172 -147 -5 19 -246 -83 -68
3461 -68 35 -25 -36 115 4 -128 25 78 -134 541 82 -58 15 -91 91 85 -123 48 -62 -71 -140 -124 11 55
3485E5j60J43j52K39N3k67K04j30K70j76j17K50j89p4R6p9O2o9N0k95K08R8o6
3508d6L73j40%l1N1j48k05K55j52K03j21j46J39J3l1oj16M1q6Q1j63K81Q3k33
3532a04J42J23P0k29J49j28j44p4O9o3J19J60k85K72j21j04j05J19K07L8l2L00
3554C79l93J5J45l8j30j06Jj75M51O4j12j85J32j36n1R3j91K15j39J28l0K32j74
3577eJ71n0k33J7Q3j98K45j36J21n1j6J0k75K88J89l12J02J58j81J80j5l36M46
3600B02K9n10K03K38m6m4K01j38j84rJ7j35O3P0n6L6K21k12m0L04m88M65j34J08
3624A61j03pK9l0K1QN3N3o4O1k45j84M62k79j12pK14O0q5m6M1r0R6n9N0J61k67
3651a08J81J83j36k91J43l1l08M53m2J52l21Q3R6J54l21M9K75j27J70q3l3r7K9
$$ plain form
3485 55 -105 38 -114 125 178 -89 115 -15 255 79 -38 212 23 -51 45 -34 28 -41 9 -286 -78 20 -46
3508 -46 327 187 187 156 207 59 -146 109 -43 160 39 -107 32 45 14 8 -108 -67 -153 -72 -235 46 129 -104
3532 -104 38 161 231 2 151 23 -121 -195 -126 -189 -70 90 -195 77 -44 -148 -253 -134 73 111 79 379
3554 379 -14 1 146 108 -22 -128 -127 -302 149 213 101 -84 48 -88 -139 -46 -237 -22 -161 -33 -63 169 -5
3577 -5 166 116 -117 -100 -17 -215 30 -106 15 -36 -52 -42 -317 -29 160 -152 -50 108 -73 107 92 -244 202
3600 202 231 -279 -76 162 116 72 273 135 -49 -58 -41 -176 -113 -43 -99 -63 158 -54 -94 210 -278 187 53 161
3624 161 58 51 80 50 71 79 132 185 121 182 -63 -247 215 -64 -176 -183 31 91 6 -40 1 -89 7 -52 -2 159 -108
3651 -108 73 256 120 -171 -28 -59 -367 86 44 196 -125 -42 54 208 -113 -64 211 84 254 171 138 41 70
3674G0k2o2K3l8K70l67J15j52J26O5k79J74k23N64K6n02L32J20k62J25j46o7J27
3697A7J13k79J98k45K04q7j28j08J76r4L05j17L5n2M04j07j60J25l98M03j32N0
3719A23k14Q3p3L07k55j37j63K31N1J18k08R8J64j42k4j46K36j36J57Q5j36l9
3741b0p6K22p9k62M10k42J48j57J1J7K32k23J02j54J80j02J5kJ10l21Q7O1R4N7
3765A08j91oJ01j22J30J98l26J96p6O5k26K84K8j93K4Q2j12K23P5l71K24j50K00
3788A65P5k44J36j83q8J23o1l6oJ18K47j37q2J73j97k45L43J44j17r8k30M6J4
3811a40L9J27K2k86J77m9P3K40j80j12L05k91j17M90j84j35K9k4Q6P4k33K43j28
3834B6J55l10K17m9l61J28K06j79J49k1M8j14j5L32j77j26K48j35n9K14j97L62
$$ plain form
3674 70 48 -14 9 -29 241 -126 -11 -163 -37 28 -251 -77 -300 264 290 -212 120 240 -22 103 -43 -110 17
3697 17 130 -149 49 -196 8 -79 -207 -315 -139 -233 72 -45 -10 -62 342 235 75 200 -198 205 73 123
3719 123 -91 -8 -81 226 -29 -166 -329 -98 -47 71 -137 -39 125 -17 -41 -187 49 -87 70 155 19 -20
3741 -20 -96 126 47 -215 195 -47 101 -56 -45 -28 204 -19 83 -71 109 7 22 20 130 -191 -104 -43 51 108
3765 108 -83 -89 12 -110 20 218 -108 88 12 77 -149 135 163 -30 -6 76 -36 187 262 -109 115 -35 165
3788 165 240 -4 132 -51 -139 -16 -77 -113 -119 -1 246 109 27 200 3 -242 101 245 128 30 -200 -154 -140
3811 -140 -101 26 48 -238 -61 -110 -37 203 23 -89 216 -75 -192 298 114 -21 8 -16 70 144 -89 154 26
3834 26 181 -129 88 39 -322 -194 12 -167 -18 -39 9 -105 -120 212 35 -91 157 22 -37 177 -20 342
3856C42m31P2L9J56l17r6J94L2%J52k41j7j5K18J82l44J31J91r8l26J85o1J95
3879A43j18J07M9k96r9J84j87K48K02l59J87Q6j65J66pj48j06L5M7mj8p6K46l31
3903b14J23J23R9j3l25L06O6k14J50j0m5J21j88O1K5P8k40J53j38J68k69N0P7
3926e6J17J49l05J89j71rK13k69L23j2k11M3J3K18k74J0K73j30k71L8P1J23j24
3949e2J60k13rN8j4j26L56j00M2p9J27n2P2j64q9l8N9LM2R6j30j9j4J58j5k8n1
3976b0K09k09J6J54l06L31j64L3L1K3k08o1K05L3J87l68K12p6p1k79K37O7j57
3999a81P4L42j86n5J89j40J24k02J48p5pj81J6L6J13j17m0R8j3Qk32L03k3j59
4023a60R4J35K0J19l00m6M5K13j67k05K05J97j55j78J86o2K71j48j08J24j72J2
$$ plain form
3856 342 -89 -17 22 178 -139 -235 -41 -9 -9 143 -98 -115 -130 88 270 -74 57 248 150 -176 9 -52 143
3879 143 25 132 181 -115 -214 -30 -217 31 233 -126 61 147 -18 148 141 -7 -113 -78 -31 -35 -53 -129 117 -214
3903 -214 -91 32 131 118 -207 99 165 -49 101 91 46 167 -21 40 65 143 -97 56 -82 86 -183 -133 -56
3926 -56 61 210 -95 94 -77 -86 127 -142 181 169 -42 1 14 232 -42 -32 241 111 -160 -122 -51 72 -52
3949 -52 108 -105 -114 -56 -70 -196 160 60 102 23 150 98 170 6 -83 -121 -62 -59 -17 79 -51 -70 -84 74 59 31 -20
3976 -20 189 -20 -4 150 -156 175 11 44 75 98 -110 -171 34 67 254 -114 98 22 -49 -328 -91 -24 -181
3999 -181 -107 235 49 -6 183 43 167 -35 113 38 31 -150 -134 -98 15 -102 -142 -44 -57 -49 -281 22 -1 -160
4023 -160 -66 69 89 208 -92 -138 -93 120 -47 -252 -47 150 -5 -183 3 -59 212 64 -44 80 -92 -80
4045h0J54K85l55J01j22L23j20k49j22J88n2j11o3K54J8K0l33K2M15j82K4q9J37
4068F3j53J39O8p3J58j00j08K54k48O4M9j99n7K02j53l2K54m09M40k6j09j48J32
4091Hj61P9J86m1Q1m23K05p2J56r0m5J33k26J73j2J06j91J01J89l24K16k58L49
4114A39k2j04K24j68P1j19J69j66j03J48k4p4k02K06%l3J38k4n0K5k91K06o6K49
4138A29p8kJ84j16Ojk84j27P2M08j44j07J51j10M4j78K66r7N2J54j57l05L65j80
4162e5J44J48m04J34O4J68j16p4K02m37J3L73k3l71N4K57R6k18J74j92Q7l27R8
4185b05O1J46l8k1N3j39K3J66o6k6j31M4Q0P5j11J45J61n0k07J55j7L5K2K4j21
4210E8o9M0L2R7j89O1p5n4K7M5j06J30M6K5l3l67J25J49q9J56J88k0l40K75j78
$$ plain form
4045 -80 74 359 4 105 -17 306 186 -63 -185 3 -49 -160 -223 31 49 69 -264 -242 173 -9 15 -74 63
4068 63 -90 49 117 44 202 102 -6 248 0 64 113 -86 -143 59 -94 -126 128 -281 159 133 24 -124 8
4091 8 -153 -74 112 71 152 -271 -66 -138 18 -72 -117 16 -210 -37 -49 57 -134 -33 156 -168 48 -210 139
4114 139 117 13 237 69 140 21 190 24 -79 69 45 -29 -231 -25 -25 -58 80 56 6 31 -260 -54 -120 129
4138 129 51 49 233 117 123 122 -162 -289 -217 191 47 -60 91 -19 25 -153 113 16 68 222 65 -240 125 -55
4162 -55 89 237 -167 -33 31 199 83 9 211 -226 -213 160 137 -234 -180 77 173 -45 129 -63 24 -303 -205
4185 -205 -144 2 -36 -57 -4 -143 -120 46 -20 -46 -177 -133 -53 22 -89 56 217 167 -40 115 98 133 155 179 58
4210 58 -11 29 61 158 -31 30 -45 -99 -72 -27 -133 -3 43 68 35 -332 -207 -58 -147 9 197 177 -163 112 -66
4235f6J38pj96J57j38m5K89k97j24L04j84K62k1j45P1J74J04r5J4l36O3K44l29
4258a63M07k76j05K86k94K02j54r0L6K07k58L43j51J08k13M2L45k00r5J09J31
4279B17l54j98L50o7J17j51K52o2K0Nn2r3jQ1J6pJ08l26J75k5l3k0J21j7j55P3
4305b6j33J54j16J28j88J54m1O6mn4K02j78J32K89m07J16k1p5r5K47l02j44M32
4328A36O9l97K81k19K44k35J33j07R3k3Q1k20J82J95ok93K47r6l1o8q9L2R1L18
4352C18m57J60N5Jj8Jk33J09J27J91j24j51J77k61M8J72k04j8R7j9Q2j44J69j54
4376g6M54o51L17q6k16L11k01L76k12L6J78m37J68j53J47J47P7l25k7N3J04j18
4398a34J58j70L04j21j03M4J06k0o9P4k8K6j81J00N3n1J09l40M30l90K68j10M
$$ plain form
4235 -66 72 65 -131 26 -112 -157 132 -165 -289 15 -169 93 72 -73 -2 172 276 181 195 -141 -78 166 -163
4258 -163 244 -32 -137 149 -145 57 -97 -187 -151 56 -202 141 -10 98 -115 -73 272 72 -23 86 217
4279 217 -137 -335 15 -52 65 -86 166 104 124 129 77 -16 -17 64 80 73 181 -145 30 5 -28 -48 73 56 -99 -26
4305 -26 -159 -5 -121 7 -181 -27 -68 -2 -6 -60 142 -36 96 385 -22 94 73 -2 -97 150 -152 -296 136
4328 136 205 -192 89 -130 114 -121 12 -95 -2 -25 56 -164 18 213 207 -86 161 65 34 -34 -123 -91 0 318
4352 318 -139 21 76 77 59 60 -173 -64 63 254 130 -21 156 -105 -57 115 -89 -107 -10 -29 53 -91 78 -76
4376 -76 378 -273 44 -42 -258 53 -148 228 16 52 230 -207 -39 -192 -45 102 179 -146 -173 -120 -16 -134
4398 -134 24 -146 158 37 -66 -22 84 64 -5 69 41 67 -114 -14 39 -12 97 -243 187 -203 65 -45 -41
4421d1J56rk29Q8R0j81K11j10L86k40j17o4r1K11k8k41J44M07l29j1l8P0n1qk8
4446e3K5K8K36j78m1J2J74k98J99k26J11J38j12P2p0p1M4M3o4k68K23K03j65Q7
4470D9J44l61j64L33N6j33p4K88o7K00Ol15K73j62j8k73L24k38r4K08P6j52P0
4493b4K02m1O8m97L52m3K7k55L65l3j94J09M0j03Q1j8n0j87L43j18K26j59J48
4516B39m37K83r7j08J22N1j08j3K26NLj9k60J46j83J11j9J55j52J36ML4j45j43
4540a69M43k04j56L37k63J89l20k7M31m22o8J9J42j68O8K88j5n70M36J77l09K48
4562H7J16l95M09j05l2l54M32k00o1O7J73k52L38l40q7J15J13J99j27j29K60l71
4584a44L36k78L43k26j5K16j15m1k0j18p8J73Jn5J55O4k38K53m60J95m7P9k68
$$ plain form
4421 -41 115 106 -123 -35 55 -126 85 -25 361 121 4 -60 -151 60 32 -209 -65 342 13 2 -36 34 -17 -25 -53
4446 -53 -28 0 236 58 17 29 203 -95 104 -122 -11 127 15 87 17 -54 -10 33 -31 -299 -76 127 -38 49
4470 49 193 -168 -332 1 57 -76 -150 138 71 271 277 -38 235 73 55 -218 106 -132 -226 -18 58 -94 -24
4493 -24 178 137 205 -292 60 17 44 -211 154 121 -73 36 76 -27 54 36 -14 -201 142 24 250 91 239
4516 239 -198 85 -12 -120 2 53 -55 -68 158 163 166 147 -113 33 -150 -39 -58 97 -55 81 85 119 -26 -169
4540 -169 274 70 -86 251 -12 177 -143 -170 261 -161 -229 -210 -68 -236 -168 120 105 -465 -29 148 -161 87
4562 87 203 -192 217 112 80 -274 158 -42 -103 -36 137 -115 223 -117 -204 -89 24 223 96 -33 227 -144
4584 -144 192 -86 257 31 16 232 117 76 56 -62 -140 33 34 -21 134 198 -40 213 -247 -52 -99 -20 -288
4607b88L11J26r8o1K4m0K87k54l1n5L23k53P5q6l6j30J40m9L4MP3k97K75J35k77
4632a48K01J29o5k00J53j01N8K6k17K04k02j28K79J03k68K88k55J59L11l57J1
4653a9o0J69M3j23R2j57J4L00j68J7k09O2k02M29l66R6J84j48J25K9p3k86K04
4676d7RR3P4k48L8Q3j6j56P0p1K3O9j7K04J3j30Q5k8J8l9j95K54j54L60n91K39
4702f0J27j32J17l22J81K8J24q9J4N2j98LR9J09J37k18J1J46l3M9j40J0jr2L08
4727B30l23M5j51J79O7J31j25j28K85j05k7l66K04n9rn9J01J74N3n8pl3j87K95
4751A27l9J97j34L5r6k80K42l24K37K53l4k04J60m58K23K22j12J36k27J10k24
4772a90O4lj04K45N3j83N9m5J8P3k63M16l0M8P2k46P8j05P1J11j96J84K5j50q8
$$ plain form
4607 -288 23 149 51 -10 14 -26 261 7 -24 -79 244 -9 66 -20 -56 -186 -46 -95 -61 -57 16 -281 -6 129 -148
4632 -148 53 182 117 -83 70 -31 27 53 -164 40 -162 -290 -11 92 -176 112 -143 16 327 -30 -19
4653 -19 -79 90 133 10 102 -55 -41 259 91 108 -101 -39 -241 188 -178 -82 102 -46 79 108 35 -251 -47
4676 -47 -38 55 129 -119 -81 2 -14 -170 -100 -171 -148 -79 -96 108 121 -9 76 48 66 27 -168 86 -68 292 -299 -60
4702 -60 67 -65 52 -270 -89 -61 63 -26 -12 40 -158 -155 -56 53 190 -28 -17 129 96 145 5 15 14 -78 230
4727 230 -93 -48 -199 -20 47 178 53 -75 210 105 78 -288 -84 -143 -152 -211 -110 64 117 59 52 19 -168 127
4751 127 88 285 151 186 90 -190 52 -272 -35 218 184 -20 140 -318 -95 127 15 151 -76 34 -190
4772 -190 -126 -129 -233 12 65 -118 -59 -104 -86 -13 -276 140 110 158 230 -16 62 -43 28 139 -57 127 152 2 -86
4797h6Q1K21r7r6L6j34QRJ73L8j62k28M07O1j69L8k28K42j9j32O3O7m1o8k98L29
4823A5q3q0J97J56l42p4J64r3L42j39p8PJ9Po1K13m07J14K79n2j05pk82L7K88
4848C5k7l26J21L20n9k7r5K57k20n8L32j00q2k74l0J28J39J49l42Q9k48L46k60
4871b32L12j10L63j40q9J64k07L2j37J48l9l5p3j0O2j6k74J24K91j98M2n8L3j
4895d8L15j35N5m06J55p2K54l05L91k05J4J28r4j70J72k02J70k58K32J63j41Q0
4917I3r7o0q6L7j24K50j12j37K25j14J36j6l8j0k2J63m8L6O4Pk56J96J46j77n2
4942Dp1R8Q1N4j93J24J24k25Q8k1j98L15k36J86l19j12K07K33k16J66j4p0L1j39
4966a03K51J9k40O9M1p2j80L7l2k6J53n5J52L6J86l23j12R6L24k26k12K43K7J01
$$ plain form
4797 -86 -5 216 119 23 59 -75 -67 -58 115 153 -9 -237 170 231 62 100 -128 114 95 -37 26 93 52 -16 -314 15
4823 15 -68 -148 49 205 -137 -211 -47 -140 202 63 -15 -8 11 18 -43 170 -237 -123 156 104 -1 -8 -290 -253 35
4848 35 8 -318 -197 123 64 37 -58 199 -21 -79 253 153 71 -203 -233 -105 34 183 -159 -70 -318 28 -232
4871 -232 80 -30 333 193 104 268 61 93 -44 104 65 30 -43 -53 9 -7 -281 -157 134 -64 -22 -80 -47 -48
4895 -48 267 132 187 -219 -64 -136 118 -187 204 -1 13 141 47 -123 49 -153 17 -241 -9 154 13 93
4917 93 -4 -64 -150 -113 -237 13 -99 -236 -11 -125 11 -5 -43 -53 -75 88 40 76 140 147 -109 87 233 56 4
4942 4 -67 31 112 166 -27 97 221 -4 84 63 -135 180 -56 130 -189 -301 -94 139 -77 89 75 5 36 -103
4966 -103 148 167 -73 -4 37 -35 -215 -178 -210 -236 -83 -138 14 50 236 -87 -199 -103 221 -5 -217 26 53 154
4990A54k79L16k01P6l59K84q2J05O2o5kJ18l10P8J3K07j09Q0O2j45J7n5p7L20
5014B08k72o9K74%j39kj3k27P3qP3J85k42L8J15R6j12J07m6n6j96J53K12p1n3
5039B8J33Qk48j06KK40n5J48j61LJ38j17n3N6j15K57K35m40J72j71k63R2L92l02
5063a27p8j07P3J41L04q2Qr7L5k23N6L50r4k87K70p0j3r9k9P7J44k19j76P1K52
5088H0j17k83L27r6K8J38N0j49J43JP4j69P1k82K7K24k40m6J87j19O0Ok00K49
5112c6l6J69m46J73K53l13J72J01j82L6Q6K68j53j87o5L08j66k3l55M37l7j16
5134a12J1M8j58K72k05N2l87N20n4j7J23j22K1KK46j37Km7j70J82j35p5L91k99
5158d8Q0j4p4R6R2j79J43j6q3k00K70K6j65M2J2m9K90m24k18M07k56L00j01K39
$$ plain form
4990 154 -125 191 -10 66 -293 -9 -91 14 76 11 9 127 -183 -105 -92 115 6 86 148 3 20 -35 -112 208
5014 208 -64 -133 141 141 2 0 -13 -240 -167 -175 -102 83 -159 -121 -6 90 -22 85 39 -17 -213 -60 152 81 28
5039 28 161 169 -79 -185 -183 57 2 150 -11 -8 130 13 -40 16 -99 158 393 -47 125 -46 -309 -217 175 -127
5063 -127 -205 -312 -239 -98 206 124 132 35 70 -153 -97 253 159 -128 142 72 59 -40 -69 8 152 -67 -243 -172 80
5088 80 -37 -320 7 -89 -61 77 127 -22 121 122 196 27 98 -184 -157 67 -173 -219 -32 -151 -91 -85 -285 -36
5112 -36 -72 97 -349 -176 77 -236 -64 37 -145 -109 -23 245 92 -95 -160 148 -18 -41 -396 41 4 -112
5134 -112 -101 -53 -211 61 -144 -92 -479 41 -13 -30 93 -29 -8 -6 240 103 105 58 -112 70 -65 -140 251 -48
5158 -48 32 18 -56 40 132 -47 96 80 -3 -203 67 93 -72 -30 -18 -67 223 -201 -419 -12 -268 32 -69 170
5182A70l4l07J04K69k91M67j88j26K19l03K50n4n5j52J33l7l91L58nk72K57R7
5204A09j28K2J1n5o1K37p8M9n9J92k12K8o6r2J47K00l07j68l5J82K70p7j0o5K22
5229B56j72k39J46L25l29j94K18J01j02l1P6q4K28k02j81K10j01j27P7L37j07
5250A05j13J52k07J82L08l33j72n1Rq3P4J22M7j55k5j3N7K5qk0O6n1K21j73J77
5275A41j05R7j26K6N5Q0j6k11m4j21J84l5J40p2j18J33n5L9l7o4K08M2j42n3K20
5300A66j41K2J2m2K15L9l18q5l0L39j04Q5k98j3P2P4q3L25j18q5k35L54P9k96
5324f6J22j71K83J54m59J14K34k76k35M99j31j01j60J52r8K59j3l8Q5O7j75qJ
5347C9k94L18J5j42o3J17J40k89K69q0N6l98N57j36p8j69J96J6K07j90j05q5Q9
$$ plain form
5182 170 136 -171 -67 202 -89 378 190 64 283 -20 230 176 121 -31 102 65 -326 32 27 -245 12 109
5204 109 -19 3 14 -41 -102 135 57 106 47 239 27 55 -11 -103 44 244 -63 -231 -266 -84 186 109 99 34 256
5229 256 84 -155 -9 316 -13 -207 11 112 10 -21 55 -29 199 -3 -184 26 -75 -202 -125 212 105
5250 105 -8 144 -63 119 427 94 -78 -129 -120 -203 -129 -7 40 -115 -140 -153 -96 -71 -79 -99 -33 -84 137 -36 141
5275 141 36 133 7 33 88 168 152 -59 -103 -224 -40 -75 65 -7 -125 8 -47 -8 -45 -109 99 141 -1 -54 166
5300 166 25 47 59 17 232 271 -47 -132 -162 177 73 158 -140 -153 -81 -7 -90 235 117 32 -203 151 230 -66
5324 -66 56 -115 168 322 -137 -23 211 -65 -300 199 68 -33 -193 -41 -139 120 107 69 154 221 46 38 39
5347 39 -255 63 78 -64 -127 -10 130 -159 110 30 86 -312 245 109 31 -138 58 74 281 91 -14 -99 -10
5370a0L5J61j53J54j27k3r9rj06kJ05j2J32k04J56r0n1M04m44J78J24m2k03r7
5394b23L86k2L8l45q5L46j15K03k75PJ44Rj07n6J97mO5j63o5J59J31k3L0l08j4
5419i0l9P0n0K01j37l7N6K45k95J03o9j01K25K3O2k27l2j81L08K37k31P6l32M01
5443A86n65L72M8kM9nm9J4L3j33J55k03K99j98q1K74k79k3l6J40rj44K08M8j06
5468gm4j99M34j24j30l6L8J68p3%j92L30l28K29j06r0K97K0k93J66j42p0k03M29
5492G4l0j50R6J12j58J81k2j47L25n09L61q9r4O9L2k60L77l17Q4R8J12jj56K7
5516A5n5o1q6J87J31k02J28j28L18j66j25K51j09l1k69J97Jm0J22J23l31J08J71
5539A49M9k35j00M90o9m90L64L9n7P9j44r8J85k88K14Lj91p6K21k84L68l60L64
$$ plain form
5370 -10 25 186 33 187 60 37 -62 -71 -177 -179 -74 -86 46 -158 -2 -92 -143 261 -183 -5 119 77 -126 -223
5394 -223 163 141 179 -166 -251 95 -20 183 -92 -85 59 68 -39 -95 102 98 163 0 -65 94 225 202 232 -76 -90
5419 -90 -129 -59 -109 92 -45 -82 -26 219 -76 27 -42 -143 82 105 167 -60 -92 -273 35 272 41 117 -215 186
5443 186 -379 -7 41 39 88 83 34 48 81 -52 103 -100 199 1 -80 194 -85 -108 -144 -4 -13 -157 51 99 -7
5468 -7 -51 -250 184 60 -70 -106 -68 100 27 27 -165 165 -163 66 -40 -130 167 187 -106 60 -82 -152 -355 74
5492 74 44 -106 -10 102 -56 125 103 -44 281 -228 133 44 -50 19 51 -209 168 -149 -65 33 145 144 -12 15
5516 15 -40 -101 -187 0 131 -71 57 -71 247 81 -44 207 98 67 -202 -5 -4 -44 78 201 -130 -22 149
5539 149 198 -37 -137 353 284 -206 158 197 140 219 75 -23 162 -126 88 91 -100 -176 45 -239 129 -231 133
5562A33k49k35L46k0K91k24q7J72j16Q5l44N4L86j5k82N7J01j75K91k37L19k59
5584hJ96k09O1j7P6N6j12M0l7l08J62NJ58p9L01l18l7J91j88k90K87J31P2j30
5608Cr9Mj29K40P7r0l3K91j13k06O4k24M24r0j38k0r0Q9j2n7n4Mn2K86o2J78j87
5635Dmj4j8J26M5k91j1L03N8m7k80K6O9m7L9p7J87r9rL8M1j81K15k01J58j50J12
5662ho9J73k42J63o7K2lr1L23j36r1p8p9K98n2O9k07O5j73K10O2j29P1n3q4J74
5688F8k65K37j59r8J52J73P0n8q1rj70K85j00R8k80J82Q3L3N4q3l51K18n2j92
5712b45L09j44P2J71k67J32J12l02J5K14j23J83j13k17K52j06K50m5j53R1k15
5733a29K10k50N88m29o1q3R8l6M2J27j30K21m26L52J88j02O0qj84P6l03K64l62
$$ plain form
5562 133 -116 -351 -5 -25 266 42 -45 127 11 96 -248 -194 192 177 -105 -48 53 -122 169 -68 251 -8
5584 -8 188 -21 40 23 99 155 43 83 46 -262 -100 -95 63 -16 285 -33 -70 121 -67 -357 -70 61 133 3
5608 3 -96 -92 -221 19 96 6 -27 264 151 -55 9 -215 209 119 -19 -39 -129 -40 -52 -109 -163 -159 -211 75 13 191 4
5635 4 0 -14 -32 94 139 -152 -163 140 198 151 -129 -103 -34 -81 -42 -119 68 -31 -40 -2 39 -142 73 -128 30 -120 -8
5662 -8 -77 96 -146 17 -50 -28 -31 -122 201 65 -26 -104 -183 115 63 132 -75 -10 -183 27 89 -40 31 -22 -106 68
5688 68 -197 40 -119 -217 -65 108 178 120 39 30 -140 145 45 143 -137 45 128 161 215 132 -219 -1 -53 -245
5712 -245 64 -80 -8 163 -104 28 140 -162 -147 67 -56 127 14 -203 49 -57 193 148 -5 86 -129
5733 -129 81 -169 419 -10 -71 -154 -56 -92 -50 77 -53 168 -258 94 282 180 240 232 48 124 -179 85 -277
5756b77J17j1J10l01O46j63p5P9k04j21K82j03j8N5q6R5O2k32J9R3j58K40j13
5779f4k28M34l9o0n7l6J75l61L21no2K08l01L9J08j47J97k9m52L11N9j90J2M6
5803a21k1J10M1j46L0N5j97L53J49j90J90l18J17j1Q4n5k4j32k8M3J48L2j9j45
5827e5K69k68o5rQ1m1k9K71l41J48j96J83jM7P2K46k07k89K35j19mj29l3K79k95
5852b50J81J88k6J05m59K18j12J73R2l8n3K6J02j23j0j05J51k09J68Q7k69K07
5874D4L6n2Q7j52J53k36q6L63k71J97m19K45J54O8Kk80J78j56K57m40L63m2Q4
5897I7l34K78qJ85km4Q6m02J73j8j47L49l51J91r3J72k38K44m9l6J1p4qL1J48
5922A61j84N9j35R1K86m8k74J41mj56R7j74L04j50k59O6J57o8JJ8K6J25k10N4
$$ plain form
5756 -277 -160 -171 -61 -362 284 121 46 125 -79 -200 82 -21 -39 16 -70 25 87 -145 -126 -33 -191 49 -64
5779 -64 -292 142 103 43 -14 -50 125 -236 85 80 18 226 -75 -36 72 -75 122 93 -359 -48 11 -179 -167 -121
5803 -121 -142 -32 9 -137 -107 -52 -249 104 253 63 253 -65 52 41 125 70 46 -86 -114 -71 77 109 90 -55
5827 -55 214 -54 -119 -128 -47 -88 -117 154 -187 -39 -235 -52 -53 -6 66 312 105 -184 51 -68 -72 -201 -234 45 -250
5852 -250 -69 119 93 198 -261 -43 -155 18 110 72 19 45 147 24 14 -91 60 -149 19 106 -163 44
5874 44 80 28 115 -37 116 -120 -206 157 -114 83 -336 -91 63 131 133 -147 31 -125 132 -308 55 13 97
5897 97 -237 41 33 218 216 172 258 -144 29 11 -136 213 -138 53 -40 132 -106 138 89 53 64 -10 -18 13 161
5922 161 -23 36 -99 -8 278 230 -44 97 93 -63 34 -140 164 14 -245 -179 -22 -90 -89 -71 -45 80 -130 -76
5946g6R3K05k36k6Q9J24k37N1K02k28j11K14r9q3J10m3Q6l54L11q5K5K35M0k16
5970iJ6Ol7j58K56rj11Q8N0k75J24Q9J24j54j97KK48j48K7J37j76J62r9L7r2m1
5996a40RJ61L8l69K52j64K2J96j76M8R2j02P7n1j18L81k11j62J0K63J12n7l29
6019b18M9K93j10OJ32k11l0K08k39n3K80k45P8L8k85L44j69R7L0M2O3k67L00j02
6043C1r1Q3j93K57j14j9J21j64l7J66k42M00r7j76K05k50O01o09j50M64k04N1
6065C3Rl15J24J38k26K73m1N2m20J59J98k9J96j64j83J38J33j87J39M5r5p0J73
6088H0l25L13K1J71k28j36L59k65j3K0Q7j39l4K65nl54Q4J28k44R2j40L54l30
6111b39L62j37Kj6p4J96j91K77k86RJ37n8j02KL78j13j46K28l35L00m9q3j50O5
$$ plain form
5946 -76 17 222 -14 -40 49 173 -64 -13 189 -39 -150 64 -35 -118 -8 -51 35 -319 -8 -93 -68 167 207 -9
5970 -9 7 13 -24 -182 74 65 -46 42 92 -183 -59 30 154 0 -197 -195 53 -95 -68 69 -107 55 -44 -7 -99 -140
5996 -140 -131 30 68 -301 -49 -213 -191 5 -171 -123 -31 -133 -56 -107 -225 156 -55 -217 -207 56 168 111 -218
6019 -218 -169 124 14 20 152 -59 -89 119 -120 -173 107 -138 -60 -22 -307 37 -132 -35 -5 37 100 -167 133 31
6043 31 -60 23 -170 87 -27 -46 75 -89 -126 40 -202 198 101 -75 130 -120 481 -128 -278 186 -18 33
6065 33 42 -273 -149 -11 -237 36 -5 47 -373 -214 -16 -45 151 -13 -196 -58 75 -112 27 72 -23 -93 80
6088 80 -245 68 89 260 32 -104 255 -10 -23 -3 84 -55 -89 176 171 -183 -99 29 -215 -123 -263 91 -239
6111 -239 123 -14 -12 -28 -102 94 -97 180 -106 -97 40 -18 -120 -118 260 147 1 229 -106 194 145 62 -88 -23
6135b3l7K7P5m1K29j58n9oR8j20j13N5K30k48J91j67K27n6l60J01J74j54L3J64
6159F2J3k37J70j41J2J83K5n4k86K08j11k0K21J04P4k77J20J8k09L2J43q1Q6j35
6183h0R8o0J48l5J22k45m3M0N4m6o6J28J48o6n6j73J54k22l3L80j27q8P1K2j03
6208g8p9L05K5k05L5k1n7J70j78R4j25J4m06M48j47L21j72p3L93l37L7n5L56k41
6232B4J6j01L0j07L11O3m79K84m5K06l19R1j48K50j34R0j2j15R2j09k30L04j45
6255a83J31k33L20k0J53j28k8L69l97N9K4R5j7n3k98J80J03K54m76J06LJ56P5
6278A95n4j12k1k15L39k95K91k36R2j01m3J90j6j72P7N5L5o9J29j17k2K17j80
6301c3J1R6r3K06k41n3J02R2K28o41M21k14j83L60J05k64J63J19j67J6N6k7j36
$$ plain form
6135 -23 -60 -33 42 1 230 72 13 7 105 -15 -128 -73 157 -91 100 -67 160 104 -256 -155 19 -135 -102 62
6159 62 75 -162 8 -133 -121 62 87 33 -253 -45 -156 -176 45 149 223 -54 66 84 -125 -93 50 -31 55 -80
6183 -80 18 -42 106 71 193 -52 -95 -55 -1 -47 -113 15 163 97 41 -132 22 -200 -233 147 20 -68 3 25 -78
6208 -78 -157 148 173 -32 3 -18 -75 95 -83 11 -114 -100 -506 -58 -205 116 -56 -129 264 -73 -36 -91 265 24
6232 24 40 -61 -31 -138 173 236 -243 41 -4 202 -117 -26 -174 76 -58 32 20 -95 -3 -112 -342 -38 -183
6255 -183 -52 -285 35 15 168 40 12 381 -16 43 67 162 145 92 -206 -26 77 331 -145 -39 -36 120 195
6278 195 141 29 8 -207 132 -163 128 -108 -16 -117 -160 30 14 -158 -81 -26 9 -60 69 -48 -70 147 -33
6301 -33 -22 74 -19 187 -54 -107 -5 87 315 -326 95 -119 -302 58 163 -101 62 181 14 30 86 59 -77
6324g7K46j21K00k01p2R1K6j3J3m3Mn3M7J21l75J09J19n6j9n8JM6J72j23R8j04
6350b2l3L23k82l5K31j53o6k92M36j26j04O0r8L35k14m9m1J12M6r2j15K21k69
6373b27L98j78j79J97M3o6L9P4K8k39K63k42O1J84m12L11K1Q7k77N3K80j70r0
6396d1J42J00p1k72R0K50j82j21L60j57j84O4K56l47nJ01k5m3K29k2l44J84P7
6419C9N2PQ7m25K28P2k58J45l37O14n2j84j40JR8L07n67M40j16J92j27l1j65Q7
6443c3K16j81J91l3j83K7k44K05J68k49J93J97j02p4k09J21k25J22J79O1l97J38
6465a12L1J83l18L21j41N8K60m03J24p6m7j24L38q8n2j18Q0N1Q6J13j69j25K02
6488G4j79J01NJ44k23j7q0L53r8l3J64k28q5J09J00l15K41q0J38L2J42j46p8J27
$$ plain form
6324 -77 169 48 248 47 -25 66 92 79 92 49 53 0 47 168 -207 -98 21 -35 -54 -112 -111 -65 107 -16 82 -22
6350 -22 -55 268 -14 -49 182 29 -37 -329 107 -19 -123 -63 -161 174 -40 -89 -130 -18 28 -64 -179 42 -227
6373 -227 171 -7 -186 11 54 -12 27 101 129 -110 153 -89 -28 156 -256 55 76 163 -114 -61 219 49 -41
6396 -41 101 201 130 -142 -52 198 16 -105 255 98 -86 -22 234 -113 -118 -17 -42 -85 144 122 -222 -38 39
6419 39 91 98 185 -240 -12 60 -198 -53 -390 224 172 -12 -152 -151 -53 254 -313 127 11 203 76 45 -120 -33
6443 -33 183 2 193 160 -23 4 -240 -35 133 -116 77 274 172 98 -111 10 -215 -93 86 147 -250 -112
6465 -112 -81 102 -216 105 -36 22 282 -121 3 -73 -120 -244 94 6 -46 -164 -84 -33 53 166 -3 -128 74
6488 74 -105 -4 1 145 -78 -95 -175 178 80 47 211 -17 -102 7 107 -208 33 -47 91 123 265 119 41 168
6512A68m33M52p6k21J8J4n9L96l72K58o3r3K48m33J71R6j55L05j60M6L9J8j28
6535C6o3k7n8K53l59J26p8J97l5J77R3l39j09J94j48J82j4k2J99J5o2m56J49J27
6559b2J57n3j24Q4j09P6Qo1K13j41j9j33P2j7j55L17j02O6q8L50l69J0J30m2L0
6584G8k06K72k08n6J46l47L47j08K6R9r6K0O9R6k11j3O2j33Q7J28J49j20n1m0
6608a0K08o5J0j31j75K14O4j45J52o5l05L08K15k40K2K0k8p1J3J42j12K62l29
6631d6oj93J62N6J69J00n90J7L30J67j05k5q1K24pl9l9k49K35lj98JL48l03j68
6656b43K82L3n5P1O3l99R3L08lj2l26K38r0m5J83j61K0J55k8j83J89o8k21K94
6680I5N8j23j47N6M6j5J35j97K8K98o3k3L8j19l0P2J18l54m4l6K12O3o9l52K88
$$ plain form
6512 168 -265 187 111 -110 -92 -78 -137 259 -113 145 82 -11 237 -196 -25 71 -84 221 61 107 146 164 36
6535 36 -27 -54 -112 141 -218 -92 -170 27 -8 169 262 -77 -186 8 -140 42 28 6 205 220 158 -298 -149 -22
6559 -22 135 82 -42 42 -67 9 17 -44 169 28 9 -124 -52 -69 -224 93 -9 57 -31 319 -50 -40 90 48 78
6584 78 -128 144 -64 -120 26 -321 26 -82 -56 43 -53 -33 36 132 -79 -92 -30 -163 -76 52 201 81 30 -10
6608 -10 198 133 143 12 -163 51 115 -30 122 57 -248 60 275 35 57 77 49 -22 -9 133 21 283 -46
6631 -46 -52 -245 -83 -27 142 242 -348 -331 -1 166 61 36 -45 179 172 133 94 -155 80 77 -121 -120 228 -75 -243
6656 -243 39 72 17 88 151 -248 -155 153 150 138 -188 50 -40 -85 98 -63 -43 112 84 -99 90 22 -199 95
6680 95 153 30 -117 -61 -15 -30 105 -92 -64 234 171 148 186 67 37 109 227 -127 -171 -207 5 68 -1 -353 -65
6705f5k35L65J07M5j59oj07j00J60J4J73k67PJ1n4J41q7K10j43r4J96k55L1K73
6729A61k86O7j92M09q3p2npJ93k44k36M90m24L22q5k91M22k77K29l09J07K63j28
6752B4k03L46j83O9l5K30m66L76k68J83k61J32K7Q4n7lK54l68L57m17J77k5n2
6775g9l2J59k10o6K15J43n9R4j53j04L2J09K01k25j04j24M78j77mo6k28J84r6
6798a12J41j70k1K60r9j18J80o8O9l41L71j26j55K03r2K74q1L0j96Q7J34j93J44
6821A21j18j35K70j49J1j01R8j3l8P9J51l60J01P4M4J71l89M8J33j2J78k09j78
6844b23L02Q9K08l87p2K21j74J59j96J37q8Kk55P3K26O9j84j38l3J89K22J03j45
6867A05j64J75j54K8J08k26o6L18n8l84J48K12Q2m23K37k7k54K64KP9o6J86j70
$$ plain form
6705 -65 -300 65 172 217 58 52 -55 -155 5 19 192 -75 -68 -57 -111 30 -57 153 10 -84 112 -143 -112 161
6729 161 -125 -58 -250 159 76 4 -1 -8 185 -59 -295 195 -229 93 8 -283 139 -138 91 -218 -111 152 24
6752 24 -179 167 -16 53 18 248 -218 158 -110 73 -188 -56 -29 55 -2 -5 249 -119 238 -179 -2 -27 -79
6775 -79 -111 48 -162 -228 -13 130 71 165 12 -92 -60 49 250 25 -79 -203 275 98 94 28 -200 -16 -112
6798 -112 29 -141 -162 98 -1 -119 61 -7 62 -279 92 -34 -189 14 -78 196 115 145 -51 36 170 -23 121
6821 121 3 -132 138 -11 0 -101 -3 -16 -54 25 176 -184 -83 -9 35 206 -183 -135 -2 -14 164 -45 -223
6844 -223 79 168 376 -11 -83 138 -36 123 -73 64 -24 -22 -277 -204 22 91 -93 -231 -264 -75 147 250 105
6867 105 -59 116 -38 -10 98 -128 -194 124 66 -318 -170 42 124 -299 -62 -89 -343 -79 -77 2 -64 122 -48
6890d8p6J53Pj18K0j59O9Qp6M07j67J96j14r7Q3k19J65Kj25j3L8J35n7J11j88
6915f3M0k17L62j21j36L3K48k23J60k12L7K82k12K16k00K50k64Pl5L7M0K49k50
6938B8j14K27k17J21Q9j95Q6O5k02j05L07j1l4J43m95M04j84M0p9p5K88r7M3K4
6962E7J74q5L5l49J14K14m36K82j08J28j34P5O4k50K98j52L07k64J53j0j25m9
6984f1J80m3l3j30J35o7J1P6j43p3K0K09r5K15j68J57j37K24k27k7J44k9k50m1
7008a53K88m39M35j77J43k16J36Q9K0P4l90K93j4k23K6J5J94L0l1N9k53k05L80
7031H1j40Q5J17l0k50J81J50m85N47j44n6Lrm3o8J14O9j20k61K30M3q5N9p0J5
7056f7Q3j05o9L08j62q7L0q5K72m8j02J29j13Q3P4l17J94m1L6q3M4j1j51K52J52
$$ plain form
6890 -48 -124 29 36 -82 -62 -221 -152 -144 -220 187 20 216 102 5 88 -131 34 36 -89 -102 -64 71 14 125 -63
6915 -63 -23 -240 122 1 -135 -102 146 -77 83 -129 -92 190 -22 194 -6 244 -20 -13 -48 -11 29 278 28
6938 28 -86 141 -76 45 134 -61 25 90 -112 -217 90 79 45 188 -307 97 -87 -47 -126 -201 87 -10 33 57
6962 57 231 146 181 -168 -54 160 -276 6 -102 26 -108 -33 31 -219 79 -73 234 -30 123 113 -12 -61
6984 -61 119 76 43 -87 48 -19 -8 68 -75 -148 -128 81 -14 201 33 190 53 277 50 23 167 138 -112 -153
7008 -153 135 -304 131 -46 97 -119 17 106 126 200 -190 103 89 -134 -108 -93 101 131 100 159 -94 -299 81
7031 81 -59 26 143 113 -137 44 194 -291 256 112 56 59 50 7 -61 53 122 2 -259 -29 14 -71 -12 -82 -67
7056 -67 16 -89 -158 150 -12 -99 -69 -154 118 70 -32 97 -16 67 141 -176 18 -23 13 -70 -26 -37 -188 64 216
7081B16j04J47o0n20K14J06J2K37j65J41k55j09J72p4N9j42J77j60J74o6n9j16
7103a75J24Q6j11jn6J22k07J91J18n6K81m98J08k36K56K63k70M1L6j41K32j15
7125hO4K17l59n9M35m61L25k40P8J51j18j24J55l6k58J88R9j16K15l0j5j75J59
7148H7j93J42J74k72L24l94K80o3n1P4J72l19J1K27l50K21m57M73j48K00k62P4
7170e0J65k75K42O0J47j67J30k34k49J90J52k4k6k12J69K6J23k0k1k87L02k75
7192a34J74j01o0L20l20M47mk09J03l99O5K22m4J22j81l9M5o5mN1l9p4Q0R9K23
7217B78j89k24K54j05K1K1J18p0J33m38K80o6oL26k48j68Q5k62L12j26L08n8k02
7240b6J55k57p1L30n8L6l3j49o6J95Mj73K5K13j09O0Ok83j15J82J78k41J81L6
$$ plain form
7081 216 112 259 199 -321 -107 -1 11 248 83 224 -31 -140 32 -42 17 -125 52 -108 66 0 -59 -175
7103 -175 -51 35 -76 -77 -133 -11 -218 -27 91 35 316 -182 -74 -310 -54 209 -61 -20 16 -125 107 -8
7125 -8 56 273 -86 -145 290 -171 154 -86 -8 143 25 -99 56 20 -238 -50 49 -67 148 118 103 -72 87
7148 87 -106 36 210 -62 262 -132 148 85 34 108 280 -39 -28 199 -151 70 -387 86 -62 138 -124 -50
7170 -50 115 -160 82 142 289 122 252 18 -231 -41 111 87 61 -151 18 44 167 147 126 -161 141 -134
7192 -134 40 -61 -121 199 -121 326 322 113 216 -183 -118 104 60 182 1 -38 7 -58 -62 -11 -50 -124 -44 55 278
7217 278 89 -135 119 14 35 56 174 104 237 -201 79 13 7 333 85 -83 2 -260 52 -74 234 176 -26
7240 -26 129 -128 -199 131 73 109 76 -73 -139 56 60 -113 -88 125 16 76 82 -201 -316 -134 44 -197 -16 20
7264B0j27J05Nk8O5J48n7k4R6j96L4Mj34j9J93n3j24j61L14j17J76j9J82l24l9
7289h0q9O3O7j90K53M9k20K99n3J29j20k16K53j62j31J10J02l1n9q9J24o5K03
7312A47l0rM0j97j17K49j67j39M28j19M7j20N6n0J00k28o0O7J17J52Q0j70k5q
7336D4j1p9p5J45O6k58J06J7p2j50L13k2J73k05k09K36P7j73N7J10j45N3j34K3
7360a13L31k12j49R9j05K06j93K62l26K10k90J93K28k52k18K75K36j05p8q9K6
7381f4p3l5K63R0k19L0k09N04k80k85K76J18j11j18J83m38M30J18Mj39J07n5o3
7404C4p6j06K81p7N3l6j74n7K71l75J43K23J54j99p4J67j71L6j7MN4j51J96L3
7428A36j9J2l47K4J53J76p7j29j4j5M55m20j99O6K04r3OL73k45O0j54L41l85K08
$$ plain form
7264 20 -107 -2 3 -25 40 188 131 107 203 7 41 45 -89 -108 85 32 -92 -253 61 -56 120 101 283 -41 -80
7289 -80 -169 -106 -39 -229 24 73 -147 152 99 228 108 -108 145 -17 -148 -38 64 33 -26 -115 9 -56 147
7312 147 117 108 148 -49 -166 83 -84 -223 205 86 133 13 69 19 119 -109 -169 -102 15 167 247 77 52 44
7336 44 33 -46 -121 24 90 -168 -62 -45 -117 -267 46 24 197 -8 -217 19 96 -77 -20 90 -55 -2 -136 -113
7360 -113 218 6 -143 -44 -149 57 -136 126 -200 10 -280 -87 141 -111 -329 -54 182 77 -1 -90 -64
7381 -64 -137 -172 91 181 -38 -8 -217 287 7 -278 -2 116 5 -113 70 -368 62 180 184 45 152 97 34
7404 34 -42 -148 133 56 109 73 -101 -158 113 -262 -119 104 258 59 -15 152 -19 17 0 4 58 -93 103 136
7428 136 117 129 -218 -194 -41 135 58 -71 -85 -100 355 -65 -264 -198 6 -87 -81 292 47 107 -47 294 -91 117
7452A17p0N1J90m47j21K52K71n39M59l35L85k74N2J2j09M18n79J74L95j62n0J36
7474B26k09j1j2j22K29k8oj36M2N9M8q0r3K33q0k98L58j8j23J56j39R6j51K01
7498A42k16q1L2L45l7k21j6J23l25J01JQ2J8J21j14J36j06lJ58k57N8J48qr4K53
7523B40j32k96K55J02J07j59k23K57j1j44J2R4j40J98j02j90J40J26j56O0j49
7544a11J92%j44Nj59r6J46p3K35J5k79J12K02p4K04j62n7O9p8K15m5%k03J25L7
7569G6j81J51K15j04j7J3n4m1n0l12j2R7J80k3J1j51J72K7K1r8L62k50j67L42
7593B07k81o0J51m6L9j30j62J55N2K25pj6R0m03p6M52p2J26k81M0J0k14J69J62
7617A30j73k3o7k19M27j30J11q7K35j70j27P6j20J39N2j31k9M9M0j24M66l42J01
$$ plain form
7452 117 47 98 288 -159 -280 -28 243 -296 163 -172 213 -61 -9 3 -106 312 -267 -93 302 140 90 226
7474 226 17 6 -6 -128 101 73 67 -69 -27 32 80 0 -93 140 60 -238 120 102 -21 135 -4 92 -59 142
7498 142 -74 -155 -123 222 185 -36 -52 71 -254 -153 -152 -70 -52 69 -45 91 -15 -18 140 -117 -59 89 81 -13 240
7523 240 108 -188 67 169 276 117 -106 151 140 -4 8 102 -38 160 58 -132 8 134 -22 38 -111
7544 -111 81 81 -63 -58 -217 -313 -167 -240 -5 10 -269 -157 45 -29 175 13 -44 25 -53 162 117 117 -86 39 76
7569 76 -105 46 261 157 140 153 99 58 8 -304 -316 -219 -39 -62 -51 -202 -30 -3 18 -80 282 32 -135 207
7593 207 -74 -134 17 -29 10 -120 -282 -127 -75 150 143 127 217 -186 -262 190 118 244 -37 3 13 -201 -32 130
7617 130 -43 -66 -133 -352 75 -55 56 -31 204 34 -93 -17 -137 2 54 -77 -106 -57 -17 -141 325 -17 84
7640H4nj52K65k24L6K4k4R9M8j41O3Q4l21J04J33l1o4JM2L4r6p7m0J56j03K12
7666A07k9J6o4j12Q5o1j17J14J0m9j0R8J43j48J25k06JK20j52l4L30m90J06J14
7690cp6J05L23m2k96l0j19J46j74K28k49J11L6Q1n1J5JK5n5j56K60k42j0M11j08
7715A31M5j85r7R6q2K69l26N08q8l77M8Q5Pr5o1K4K22Q5k72K24k52k3N9r8K57
7740A04q9J88Q9k06j9j79Q4J6p9N1R1m3k0l5J52J79k68J5j86lK78j24L1j82P8
7765g7j09J62L28k46q4j70M83k99r0LO0Qk38K60L9O5r0R1N0k74J53k86M40j67
7789A2m2P0J16o5o6J70r7J54k89R6J0j08j50J00O3m1j9M02l72K68o7O6j46l17
7813b52K32K19n0q3k28L93j08m03J72%l2K82j93qJ12J07l21L54j45J1p7J36l9
$$ plain form
7640 84 79 -73 192 -32 4 28 4 103 151 10 73 157 -164 -60 73 42 -22 -21 21 55 -41 -118 -158 -2 -105 107
7666 107 78 94 30 -82 3 -58 -175 -61 -51 -100 -110 -12 131 -17 108 -98 -97 123 -29 -63 267 -223 -117 -3
7690 -3 -79 26 349 307 11 -19 -138 8 -166 62 -187 -76 -40 41 -10 5 6 31 -24 -180 80 -162 -172 239 131
7715 131 176 -9 -106 -10 -92 177 -149 359 271 -106 -58 27 34 -61 -122 -98 124 209 -63 161 -91 -114 -55 -153 104
7740 104 15 203 292 86 67 -112 -28 -12 -91 -40 51 8 -12 -47 105 284 16 31 -155 -158 120 -4 27 -155 -77
7765 -77 -186 -24 304 58 -26 -196 287 -12 -102 -99 -39 -31 -269 -9 30 95 5 96 146 -128 25 -261 179 12
7789 12 -30 40 156 91 25 195 98 252 -37 59 69 -39 -189 -89 -26 -67 -86 316 -56 212 145 211 65 -252
7813 -252 -20 199 149 66 -162 231 123 -280 -108 -108 -140 142 -51 -59 53 160 -161 193 48 59 -18 118 79
7836G9j77R9j26J68k5Nr2K03j52j04K65k2k62R7j07r2K54J69j35k57J77J02j9
7859D8o6K39N0m39M89l34k1J00N7k02K34j43j26K67k41K64k40R0J4k80J00J32
7881hLJ8K8Nr4k42K56j06L22n9Rk13J22k68L48k55P0j61L05kj30n5J30j1K1k25
7907a92K34n8K55m08L08R2l1j97q2n8J20O9k62J94J5L5M2k47K08l01R9K34k27
7930a58N09l51k18R4M26l62R0j09MK4J72k10K32m31q6J95J41k16K60M0j03l3j00
7953a90K35j93J78NM3Oj14k97M70l23N4J15r5J03Q3q7j21K52j87k17K42j41J18
7976f1j84K62J44M3j91qJ38j23L3J0J03ol09r4J80o5O2J9pq4J45J72l18L6m5K54
8002A06n2j1J36k59J1K6l8R2J57J08k69j7n8j33J76J99k24J12j2j66K16J11k98
$$ plain form
7836 79 -98 1 -125 43 18 23 -69 134 -18 -122 143 121 -141 -44 -151 -243 11 180 45 -212 -35 67 48
7859 48 -18 221 271 -168 321 -13 -34 66 123 -79 155 12 -114 153 -88 176 -64 26 40 -240 -140 -8
7881 -8 -5 13 41 46 -48 -290 -34 -140 182 123 132 -81 41 -227 121 -134 -64 -225 80 78 -52 -107 23 12 33 -192
7907 -192 42 -16 239 -169 139 231 200 3 -79 -137 -17 52 -210 -16 -1 34 76 -171 37 -264 -165 69 -158
7930 -158 351 0 -218 -124 302 -60 30 -79 -75 -51 121 -89 143 -288 -374 -179 -38 -254 6 46 -57 -90 -190
7953 -190 45 -148 30 35 78 84 -30 -327 143 -180 -126 -11 -106 -3 80 -7 -128 124 -63 -280 -38 -179 -61
7976 -61 -245 17 161 204 13 5 143 20 53 63 166 160 -149 -243 -63 -128 -66 -47 -54 -138 7 179 -139 -103 -148 106
8002 106 54 43 179 -80 -69 -43 -81 11 168 276 7 -10 -68 -201 -25 174 -50 62 50 -116 100 211 -87
8025h7K57j63n5j9%N0j78J86L06k89R9J00j81P2j23M60k87k23J91k56J30j35k04
8048c49M19j88qK67j81J50q4o3K44l15NM7J41n9m6J36j00LK70j49j5L9k22q0L20
8073A82j03r7K34k34J22j77K8J6J27o2j39K01O0l81L47K4r3j43N4K08k42K24K5
8096A81j65K27j03j08M0O1k19K83k41p6mJ78j48j81L33K3n1M11k95K4j25n9r7
8119a11K47k18j96J10N08k05r1J6j66L15j70j72J98j91J17q9j47M35j53Q3j2k64
8141a56n2L89p6p0k33K68j74m2Q9Q8k89J46Jo3R5P1M3m04L51k00L99k51M7n1n2
8166a26L30l07k0N4K25j51J25k01K28j26k7k69N62k45j94L52O6n14Q9L83k85K54
8188B03j50p0q1
$$ plain form
8025 -87 170 7 -48 -67 -67 -17 -195 -9 297 8 107 207 26 98 -25 435 148 -75 116 -140 -10 -145 -349
8048 -349 70 -118 -126 141 -40 110 26 -37 207 -108 -103 -56 85 26 -20 116 16 19 289 140 125 164 -58 -138 182
8073 182 79 -18 216 -18 104 -73 -45 -29 98 36 -103 98 158 -223 124 148 55 -88 -34 174 -68 156 181
8096 181 16 243 140 32 72 133 -86 197 -44 -120 -124 54 -94 -275 58 81 30 441 146 170 45 -14 -111
8119 -111 136 -82 -278 -168 340 135 44 60 -106 209 39 -133 65 -126 -9 -98 -245 190 37 120 108 -156
8141 -156 -208 181 105 35 -198 70 -104 -146 -57 31 -258 -112 -111 -174 -79 -8 35 -369 -18 -218 181 -70 -23 -74 -126
8166 -126 204 -103 -123 -69 156 5 130 -71 157 31 4 -265 297 52 -142 210 276 -238 -149 234 -51 203
8188 203 53 -17 -98
8191i8
$$ Imaginary data points
##PAGE= N=2
##DATA TABLE= (X++(I..I)), XYDATA
0@%%%%%%%%%%%%%%Qj6J6j6J6k4L2l2M0m8N6p2Q1q9J04j20J37j60J84k08K35k63
36a39K96l34L73m14M62n16N73o35P03p76Q56r44J041j147J264j392J533j693J868
55I79k063K289k546K842l189L602m104M727n526O596q106J0419j4454K3491q3810
70f8853K4177R1352j02019J4778P2795m3038p2851P0548M1431m3164j607N0661
82C4210j3280k2162J8118Q476k7573K621K7847J683l0524m610J7861q960k0730
95a7023K8739K0080m6022k3477M4798O935l2216J8770J9371l8764k868M1906r788
108A0441k2105K7449p167l9892K7839L7347l5786j2489M5797n085m3021J1582
120e090K1739k3437o822L2366J4309j6303j8544j0695P42M227L004J3073P674
$$ plain form
0 0 0 0 0 0 0 0 0 0 0 0 0 0 0 0 8 -8 8 -8 8 -16 16 -16 24 -24 32 -40 41 -48 56 -64 73 -87 97 -111 124 -139
36 -139 157 -177 196 -218 244 -272 301 -334 369 -407 449 -495 546 -601 663 -729 804 -889 979
55 979 -1084 1205 -1341 1501 -1688 1914 -2190 2537 -2989 3607 -4499 5920 -8534 14957 -68853
70 -68853 -44676 46676 -55343 -40565 32230 -10808 -83659 -13111 28320 -14844 -16451 34210
82 34210 20930 -1232 16886 25362 -2211 410 28257 29940 -584 -5194 12667 3707 -17023
95 -17023 11716 31796 -14226 -37703 7095 14030 -18186 584 19955 -18809 -21677 20229 10441
108 10441 -11664 15785 8618 -31274 -3435 33912 -1874 -14363 31434 26349 -16672 -5090
120 -5090 16649 -6788 -13610 18756 33065 16762 -1782 -12477 -11735 -7508 -4504 8569 16243
133A6243j7694j2250R165j449n470J2466N17j2160J3378J0711k0360j685K1333
146A2745r155j3132J8473K40k4896O073J6792j0876j06J2292j8511j4710K1749
159c022O229j6857J0449J4323j7633o319K3062N897j3359l3O548l250l963K635
173D707O722K960q180n054M189o922j3939M908J0360m242J870N916j1731j0642
187a9078R193J116n163J3012O730j2964M93J1120o780m226J2250j520r896Q270
201B557M797r486N458J1639q949n639R003l722j0936Q110R556n523k338N506m562
216E471r196p21K575k9n48P18J169k144m977J299N113l328k735O722o1n108Q587
233B807P823q326k676P784m461p303R502M628j0676o62R131m979o998M991n01
$$ plain form
133 16243 -1451 -13701 -4536 -5985 -11455 1011 1528 -10632 2746 13457 -6903 -8588 12745
146 12745 3590 -9542 8931 9171 -15725 -9652 7140 -3736 -3842 8450 -10061 -24771 -3022
159 -3022 3207 -13650 -3201 11122 -6511 -12830 10232 16129 2770 2737 9285 6035 2072 4707
173 4707 11429 14389 6209 1155 5344 -1578 -15517 -10609 -249 -4491 -2621 3295 -8436 -19078
187 -19078 -9885 -8769 -13932 -920 5810 -7154 -6661 4459 -2321 -6547 5703 4183 -5713 2557
201 2557 7354 -2132 3326 14965 6016 377 9380 5658 -5278 2832 12388 6865 4527 10033 5471
216 5471 -3725 -4446 -1871 -1900 -2448 -1730 -561 -2705 -7682 -6383 -1270 -4598 -7333 -611 -672 -5780 2807
233 2807 10630 2304 -372 7412 2951 -4352 5150 9778 -898 -1560 7571 2592 -4406 585 84
248H4q094J987O767k196k698L338J553l57R94l49k847l216M03O020N258j300k250
265C097j819o066l318M990K409k967K450N279k098k048J520m634m955O282O988
280E110m50R89R58o713l001N567K55m663J166J800k936J805M470m611o343K821
296c776M012K03J910J597m929l470M568N710o88k871q61j468k961J051K623k802
312b152m323M668N615l295l826K38m674l411R290R690k503l501K140l085m712
327c841M106L709m670j56P514K002m930k520l324n348J264P647M218k739k486
342D46j215p30L31J642r0j970l40L212K653k432l800j589m63J375L991O80m609
359b908l615J198K880K909L287j107k911O19J587m4M69j03q99K384M625m45n121
$$ plain form
248 84 -8010 -6023 744 -1452 -4150 -812 741 384 1378 1029 -1818 -5034 -4631 1389 6647 5347 3097
265 3097 1278 -4788 -8106 -3116 -707 -3674 -1224 4055 1957 -91 1429 -3205 -8160 -1878 5110
280 5110 4660 5649 6607 -106 -3107 2460 2715 -1948 -782 1018 -1918 -113 4357 -254 -6597 -3776
296 -3776 236 439 2349 3946 -983 -4453 115 5825 5137 2266 1405 -63 -3024 -1973 650 -2152
312 -2152 -6475 -1807 3808 513 -3313 -3075 -7749 -11160 -1870 7820 5317 1816 3956 871 -3841
327 -3841 265 3974 -696 -852 6662 8664 3734 1214 -2110 -7458 -6194 1453 5671 2932 446
342 446 -769 -1499 -1168 474 384 -1586 -1926 1286 3939 1507 -2293 -3882 -4345 -2970 1021 1701 -2908
359 -2908 -6523 -5325 -2445 464 3751 2644 -267 352 1939 1895 2364 2261 1362 3746 8371 7926 2805
376B805m645l167j834M214N691p00l276j268j261j461n8R87m1J190M626L832j117
393D517m109l389J47P69K680L855j016m497J10K320j331j827J434j006k278L926
409C05M763k120k984J342N95o16K777J451l274k473J375J477l8L23r74j329l84
426B16n47o44q38j668N96M038K577j278j581k919m544M33M586K222n11J78o50
443c34l248j662k1KP97J766J999K543o08k301K84K395l95O35K592p91k068K070
461C655J721j954j178r82m348k543K764P17j957R57N12k887j729K307P42j94J778
478b619J547J670J444k7J433K647n45j602P54O78j661Q59K725o99j307m98l475
495A324l038J807J75j423K404J955l656l659J164M43j167R00R33q66j045q79J199
$$ plain form
376 2805 -1840 -5007 -6841 -2627 3064 2364 -912 -2180 -3441 -4902 -4960 -3973 -4014 -2824 1802 5634 4517
393 4517 408 -2981 -2834 -2065 615 4470 3454 -1043 -933 1387 56 -1771 -337 -1343 -3621 305
409 305 5068 2948 -36 1306 1901 1285 4062 5513 2239 -234 1141 2618 2580 2903 1929 600 216
426 216 -331 -975 -1813 -3481 -2885 1153 3730 2452 871 -2048 -6592 -6159 -1573 649 138 316 -334
443 -334 -3582 -5244 -5265 -5263 -4466 -2700 -701 1842 1234 -1067 -783 1612 1217 1852 4444 3653 1585 3655
461 3655 5376 3422 2244 1262 -3086 -5629 -2865 -2148 -4105 -3148 -2636 -5523 -7252 -4945 -4203 -4397 -2619
478 -2619 -1072 598 2042 2015 3448 6095 5550 3948 4702 5380 3719 4578 7303 6604 5297 4799 1324
495 1324 -1714 93 268 -1155 1249 3204 -452 -4111 -2947 -2504 -3671 -2771 -1838 -2704 -3749 -4628 -3429
512c429L809l41l050L68J432k119j62N717K665q32J013M20l564j831L29M47L043
529C915L178j922m016j994j865p05J083J505m07n55j386k19L872J624m553j047
545c492M299o47k889M424L509l969k095K577j258m082o75O80J338J192q91k316
561d295q28n09P0L757L089j654k219K4Q64L944L824m85j878L77k234l511K936
578A272K479j325j58K679j439n405k742j848J487N026K303j192l62j780m212J332
594c885N376J14k306J399J492J06J471O60k281o20N75n99K075K941j501k211K365
611E171P71l283j748L06n80Q18P22j740k201k647k584J772M452j401m319r36j035
628h462o33M938M522n46p39L10j937p28L786J388o24L447L586l549l543j413k278
$$ plain form
512 -3429 380 39 -3011 -2643 -1211 -3330 -3492 2225 4890 4058 5071 5491 1927 96 425 872 3915
529 3915 7093 5171 1155 -839 -2704 -3409 -2326 -821 -1228 -1783 -3169 -3388 484 2108 -2445 -3492
545 -3492 807 160 -2729 1695 5204 1235 -860 1717 459 -3623 -4298 -3618 -2280 -1088 -1979 -4295
561 -4295 -5123 -5632 -5562 -1805 1284 -370 -2589 -2565 -1701 2243 6067 5582 3704 4081 1847 -1664 1272
578 1272 3751 2426 2268 4947 3508 -1897 -4639 -6487 -5000 26 2329 1137 775 -1005 -5217 -3885
594 -3885 1491 1605 -701 698 2190 2296 3767 4427 2146 1526 2101 1502 3577 6518 5017 2806 5171
611 5171 5942 2659 911 1217 637 1455 2177 437 -1764 -4411 -6995 -5223 -771 -2172 -6491 -7427 -8462
628 -8462 -9095 -4157 365 -181 -920 -610 -2547 -3275 511 1899 1275 4722 8308 4759 1216 -197 -2475
645b475O6L296K132n41j787l257j108J976P89j652R13J071q57J939K778j074k548
662c39J39p8o17K123P02k160O01J591j715j498K40j375L1L172J090j378m18j210
680a099r48L422L241j787j856o80k342j86M116J696j845n79j18k594j262J443
696a378K79O20K434J468j058j915k097q00J452J604Q60J008j642k554P79J078
712A38j755j336R06m74j001L354J684j779k0J368j345o08K784N71j006J420R98
729C899j265q00o48j393l14O18o92n58L9j160m02J664M06j526m32M58q09J180
747a735K299J162J23J84j283j525N09j52J89J744M16j009j09n38j675J13J259
764b8k74J52J828j65j236J443J178j877p01J103j076j374J346J003q87j97L4k003
$$ plain form
645 -2475 -2409 887 3019 2478 691 -2566 -3674 -1698 -909 -2561 -1648 -577 -1434 505 3283 2209 -339
662 -339 -200 -278 -895 1228 1930 -230 371 1962 247 -1251 -1011 -2386 -2355 817 1907 529 111 -1099
680 -1099 -2047 1375 4616 2829 973 293 -2049 -2235 1881 3577 1732 1153 1035 -1559 -2821 -1378
696 -1378 -1099 -479 1955 3423 2365 450 -1647 -2447 -995 609 1469 2477 835 -1719 -940 138
712 138 -1617 -2953 -2047 -2521 -3522 -168 1516 -263 -283 1085 -260 -868 1916 2487 1481 2901 3899
729 3899 2634 1834 1186 -207 -521 97 -595 -1153 -1114 -2274 -2676 -1012 -606 -2132 -2564 -2106 -2915 -1735
747 -1735 564 1726 1849 2033 750 -775 -266 -418 -229 1515 1931 922 813 275 -1400 -1287 -28
764 -28 -302 -150 1678 1513 277 1720 2898 1021 320 1423 347 -1027 319 1322 435 238 272 -1731
782a731j207K7L43Q58R30K03M28L84l93m72O96p51KJ850M98m29M87N5k173o80
802a075J230p24j551J391J125o65M98J018j579j106N99R79Q19R23k7q71k98O55
820A341l56O5o98j126k48N19q9j41M66o35nQ14J89j833K8P13J051J233J694r55
840B027j622j096k73l39O98L87l68N92O49r20k55n30j767J07K623J694K52Q33
858B692m19j694k54J225k42p50L55N90j79j96p29j932j588K59Q23J046k97j456
876b746M03M29O95J326J126p39j254J273R69l69P22N31n03N42P28q92k247p63
894g69n8K24J940J046j262j081p77q85j05N49N1K78J182Q27o14o36j335k203L90
913c238J742J016O60L21o83j030N92L19o21O38P76R10J122N93r86j264l72l57
$$ plain form
782 -1731 -2938 -2911 -2568 -1710 -780 -577 -149 235 -158 -630 66 -685 -683 1167 1665 1236 1723 1778 -395 -1075
802 -1075 155 -569 -2120 -729 396 -269 229 1247 -332 -1438 -839 140 959 1882 1855 984 686 1341
820 1341 985 1050 352 -774 -1022 -503 -592 -733 -267 -902 -907 -93 96 -1737 -1709 -996 55 1288 2982 2027
840 2027 405 -691 -964 -1303 -605 -218 -586 6 655 -265 -520 -1050 -2817 -2710 -87 1607 1859 2692
858 2692 2273 579 325 1550 1308 558 913 1503 1324 1128 399 -1533 -3121 -2862 -2039 -993 -1290 -2746
876 -2746 -2343 -1914 -1219 107 1233 494 -760 513 1482 1113 1835 2366 1863 2405 3133 2241 -6 -769
894 -769 -827 -603 1337 2383 1121 40 -737 -1622 -1727 -1178 -1127 -849 333 1160 546 -90 -1425 -3628 -3238
913 -3238 -1496 -480 180 501 -182 -1212 -620 -301 -922 -284 492 1402 2524 3117 2131 867 495 138
931A38O01J010j134j979q0k25l01O44O34j756p29J263jm54J494M78J27J201J059
950A990p04j452p70L58Q38J123O41p75q76j225l93K51l03l81P90J381L43Q04K99
969A939j344r19J102Q32L62J004M84r88j09M98j429q49m09m9J3R43k72q79n38
988f08p73n21J095Q45j226l36Q29k39k52J139N64j299l24J10o62j82R87M27P93
1007C67Q95lj278k28L3k5R70R34L96K50q83j499k60L78j424p62J165o08j168R44
1027a806K79j284m14P24o54L37J422Q89Q51J710j43o61L66j43j74N82J073M6l95
1046B605j39j115q54J53p40o90M28j50j043L02J126l1l16J31n91m07N93J92Q83
1065C37J204j53j324j78K36j420K87J556j23k02O56j72j093P76M34o26N95R70
$$ plain form
931 138 739 1749 615 -1364 -1444 -1669 -1970 -1326 -692 -2448 -3177 -1914 -1915 -2369 -875 -397 -270 931 1990
950 1990 1286 -166 -936 -578 260 1383 2024 1249 373 -852 -1245 -994 -1297 -1678 -888 493 836 1640 1939
969 1939 595 -324 778 1610 1972 2976 3460 2472 2363 2861 1432 583 174 125 138 1081 809 -70 -608
988 -608 -1381 -1902 -807 38 -1188 -1524 -695 -934 -1186 -47 517 -782 -1106 -996 -1658 -1840 -853 -426 367
1007 367 1262 1259 -19 -247 -214 -239 731 1665 2061 2311 1428 -71 -331 47 -1377 -2139 -974 -1582 -2750 -1806
1027 -1806 -1527 -2811 -3225 -2501 -3155 -2818 -1396 -507 344 2054 1911 1250 1616 1473 1299 1881 2954 3000 2605
1046 2605 2466 1351 497 650 -90 -780 -352 -502 -1545 -1243 -117 -148 -464 -333 -924 -1331 -738 -546 337
1065 337 1541 1388 64 -114 122 -1298 -1011 545 422 220 876 704 -389 387 821 195 790 1760
1083A760j455n14J561M95o64K97p07j768k22K41N91N24N35o17K46p15n95p5J081
1102ak95L0J681O4j457qM6j099j45J013j337j080J523M20p73N64l48j814j75J432
1122a759J043J045Q95j17o05M31j77J1Q82K26n44J39K29j554l76j01j76kO90r40
1142g60j955N00P68J38J637N40r03j127N11k19O97J812k17j68N40l7j486j49M22
1161E44r26M63J519r9j009M74k80r20N68J90j003o9R11N77J73J61j456j576N3
1180a705l6P19J312l07r10m1j7m94L52J128k80K81J492k73p45J45O12j89N63M04
1200B011j348j525K97J11M22J025j80j198j091J46R3L89J032j55M93R29o16o48
1218A87N76p18n75P58P76o55j53j22p51m5J56j006n66P67N6N56J441mj257m11
$$ plain form
1083 1760 305 -209 1352 1847 1183 1480 773 -995 -1217 -976 -385 139 674 57 303 -412 -1007 -1082 -1
1102 -1 -296 -266 1415 1479 22 14 60 -1039 -1184 -171 -1508 -2588 -1065 -645 -1418 -854 -1202 -3016 -3191 -1759
1122 -1759 -716 329 1224 1107 502 933 756 767 1649 1875 1331 1470 1699 145 -231 -332 -508 -510 180 -760
1142 -760 -2715 -2215 -1447 -1309 328 868 -35 -1162 -651 -870 -173 1639 1422 1254 1794 1757 271 122 544
1161 544 -382 81 1600 1501 492 966 686 -234 334 524 -479 -548 363 940 1113 1274 -182 -1758 -1705
1180 -1705 -1741 -1022 290 -17 -927 -968 -985 -1479 -1127 1 -279 2 1494 1221 476 621 1233 1044 1607 2011
1200 2011 663 -862 -565 -454 -32 993 813 -385 -1476 -1330 -1237 -848 184 29 522 1451 835 187
1218 187 763 45 -530 228 1004 349 196 74 -677 -722 -566 -1572 -2138 -1371 -1315 -759 682 678 -579 -990
1238i90L51L96Q71J130o39k93K71p04o30N04N31j082j3P74n31n53L67L83k5O46
1258G64j97n22l68j04O36N89O96m99q17k42n76l38L68K5l11O60k1m73L56k12q76
1279a462j35J278K61L8R25L5j78j50O6n33l86J27m8L25L19l29r06L77l49m47K65
1300i07P34K4J95K81m5m4L49n4o23L38mk73K72K75M3n04J11q00l72J94m4N90O97
1323D33J50J45K90j92m92k5O05j40R0N05l70n59k43k4r44j60R5m92k11P63j5j91
1345i82J32J95k16j7N81j5Q51K20K69K3j00n04k70j28j56m60N76P8l47J11J47
1366a2o62j94M20K7M8R61K87K62%k49q40L11r0j99k1O39l72J64l66m34l52p7L21
1389d28l56O43R3l49J8L45N9k27P9J79p62M0N81J52j51r8l92l9M42n48M9M23L89
$$ plain form
1238 -990 -639 -243 628 1758 1119 826 1097 393 -237 267 798 -284 -297 477 -54 -607 -240 143 118 764
1258 764 567 45 -323 -427 209 798 1494 995 178 -64 -640 -978 -610 -585 -896 -236 -257 -730 -374 -586 -1462
1279 -1462 -1597 -319 -58 -20 905 940 762 612 678 145 -241 -114 -162 163 482 153 -753 -376 -725 -1172 -907
1300 -907 -173 -149 46 327 282 238 587 533 -90 248 244 -29 243 518 561 57 168 -632 -1004 -810 -854 -264 433
1323 433 583 728 1018 826 334 309 914 774 864 1369 999 440 197 173 -771 -931 -836 -1328 -1539 -776 -791 -982
1345 -982 -850 -655 -871 -888 -307 -322 529 749 1018 1041 941 437 167 39 -117 -577 -1 77 -270 -159 -12
1366 -12 -674 -868 -448 -421 -373 588 875 1137 1137 888 48 359 269 70 49 688 316 480 114 -320 -672 -749 -428
1389 -428 -784 -141 -48 -397 -379 -34 25 -202 -123 56 -706 -666 -85 67 -84 -182 -574 -613 -171 -719 -670 -247 142
1412A42j61R08L51q21p7K03n93M43M62j62k84N01m67m86m55r09m88L92M82M73
1432e46R9r0k02r5O26K14l5N87O33oM49J9n79m77J97J09k81L21l48q27k1P9m9
1455b23K2N6n84k1L57K96j7L05L4L1K00k22l27k49J25qM14P21m01o74K32m29m85
1478h47K47N12p1J12R59l87J01l53l72o79L93N55M5J56l36l83m64Q1l49j67M14
1499h33J28K19N40P9q61K82M34k54N41K45n16K45J66k63j45J53l55o30j70J60
1519h35o0J65N62j31R2O36k09k18L24J35N9J001M54m15p5p3n77k98k32pn57L10
1541E1L51o08K48m98p81r6M58J2N56P24j11m49L63P5m36j28K59J10N31P5k27o41
1563a62J42n6n9J65J20n99N02L57j31K88J06m79k89k21o9j69N12J92l51q2q9p37
$$ plain form
1412 142 -19 889 1240 419 342 545 -48 395 857 695 411 912 445 -41 -496 -1405 -1893 -1501 -1019 -546
1432 -546 -447 -537 -739 -834 -208 6 -29 558 1191 1185 1634 1653 1074 597 794 903 622 943 595 -232 -253 -174 -223
1455 -223 -201 -145 -729 -750 -393 -97 -114 191 225 256 456 234 -93 -342 -217 -225 189 910 509 -165 67 -362 -847
1478 -847 -600 -88 -159 -47 912 525 626 273 -99 -778 -385 170 215 371 35 -348 -812 -731 -1080 -1247 -833
1499 -833 -705 -486 54 133 -728 -446 -12 -266 275 520 4 249 415 152 7 160 -195 -825 -995 -835
1519 -835 -895 -730 -168 -299 -207 429 220 2 326 461 520 1521 1975 1560 1485 1412 835 537 305 298 -259 51
1541 51 402 -206 42 -456 -1237 -1333 -875 -863 -307 417 306 -143 220 295 -141 -269 -10 100 631 706 479 -162
1563 -162 -20 -76 -135 30 150 -449 53 410 279 567 673 194 -95 -316 -385 -554 -42 150 -201 -283 -372 -1109
1585a109j3J78j49M04L73L50k51R2L14k84K14M19l82L63j77M05j66Q1k45n68k91
1606d42j99m58M92K75o8K5R4l42j64O83l4N3M80J94k17J41K19o5k44K48o13m84
1628d26L47j00J00M18j24m97m4j54l17K90R43K65J36j2o6p53O58j58l59L25R7
1649E69q20K16K37r4m72K88l73j68L33P9m4K27K10J79k47j72k70m13M91J46j53
1670b51M52m74n84L07J47n37J04J91l6M9Q81L61r3o8N2P7k38M95r6p7O57P5r38
1693D56n1p15n12M00M97m8k43J14m68l29O48K6qK12M6M6L59J74k05j47J04k16
1715A40k71l42j23l6P57k39k11L33m63l90J16O17m27M91N28k77k8L43o6m99K12
1736A65n94L87j06R5K72k85l68J74l66m0J46O6M61M31M7R6k08m47L94J29J1K38
$$ plain form
1585 -1109 -1122 -944 -1093 -689 -316 34 -217 -125 189 -95 119 538 156 519 342 747 581 662 417 -151 -442
1606 -442 -641 -1099 -607 -332 -400 -375 -281 -623 -787 -104 -138 -85 395 589 372 513 732 667 423 671 58 -426
1628 -426 -79 -179 -79 339 215 -282 -326 -480 -797 -507 436 701 837 825 759 6 664 506 147 472 569
1649 569 -251 -35 202 108 -364 -76 -449 -617 -284 -205 -249 -22 188 367 120 -52 -322 -735 -244 -98 -251
1670 -251 201 -273 -857 -550 -403 -940 -836 -645 -681 -632 249 610 517 449 501 578 340 835 739 662 1319 1394 456
1693 456 405 -310 -822 -422 75 27 -216 -102 -570 -899 -251 -225 -233 -21 25 71 430 604 399 252 356 140
1715 140 -131 -473 -596 -632 125 -114 -325 8 -455 -845 -729 -112 -539 -48 480 203 175 518 452 -47 165
1736 165 -429 -42 -148 -53 219 -66 -434 -260 -626 -666 -520 -454 7 438 485 581 373 -74 320 449 460 698
1758F98K18m29n60J12J17n06L5J53j97n9M47l8j41L46K13m45L03r2m36L49K26
1779C14K42j84p2m76m29K44k77j71M79N1j97K4L81K51n39K43K1N8N58p8J15K58
1801H16m77j74r3j03k56K0J97K99k3rj25m05L93l36L40k1M22l3j76O44l08m11
1823A81M16l16k42l6o4J78j83j64m12K97j66j46K5J52L34n5M28P9l35R9M53n21
1845BK26K13l7k5J13m01j91j30N8l14j92N50l09J50K66p1j43j63K40l52N12K79
1867B81r0J60K96j86k66p9l72o6K02j12M4J26P9j15J32J93n12M02R9j3L04K4j58
1890C73qm8j59m14Kj89pP9K61q4l87l1L64m94O6P45k08K77K48J09j42L52n06N4
1914B53j67j9k5K42k10l46J92p9j87Jk6p5R2L11N47k39M2J71k00L5j29O2K20K19
$$ plain form
1758 698 916 487 -73 39 156 -350 -315 -162 -359 -418 29 -9 -150 196 409 -36 267 175 -261 88 314
1779 314 556 372 300 -176 -605 -361 -638 -809 -330 -279 -476 -452 -71 180 -359 -116 -95 -37 521 443 558 816
1801 816 339 165 72 -31 -287 -267 -70 229 206 197 72 -333 60 -276 64 43 465 432 256 900 592 181
1823 181 597 281 39 3 -61 117 -66 -230 -642 -345 -511 -657 -632 -480 -146 -201 227 306 -29 70 523 2
1845 2 228 441 404 379 492 91 -100 -230 -172 -486 -678 -128 -437 -287 -21 -92 -235 -398 -158 -510 2 281
1867 281 191 351 647 461 195 116 -256 -322 -120 -232 -188 -62 17 -98 34 227 -285 117 216 203 507 531 373
1890 373 365 317 158 -256 -254 -443 -450 -371 -110 -194 -581 -612 -248 -742 -676 69 -139 138 386 495 353 705 199 253
1914 253 86 67 42 284 74 -272 -80 -159 -346 -345 -371 -446 -354 -43 504 265 307 478 278 313 184 246 466 685
1938F85j53k03J66m11m11p4k9M9J18L63l50k1J46j2r9J01nj36O86j81R1n9j0l80
1962a29j58L39j09k07K59N3p4J60j86M14j50O9p20N54K63k00j5J78J9o01O0k75
1984d56N7j81J5K29k84L82J66l34J85j54O2K49M28K6K60K43o3j34l93j86j24N23
2006E16J09m05r5k15m32P4n4J20P6O3J85J21L30m18j40N85N5q4J34J1k36p9M3
2029B64K30n35J05k21m32N36j02L7J87j27l7k51L56m3N6K15k0J72k67j0J25m63
2051b25K26j51l1q3O1k56L57J25pj21J78k97p6J88L0M98j37K07k75J2l68l57J30
2074c72L66o09L87J53l25J18L39l03L78j08K2L4J41L97k11o9J30k14o2K02j67
2095B27k67n7J01p7l65p7J07k25n8M04K8M06k64N8J15J09j36n2L04M8r3L46j60
$$ plain form
1938 685 532 329 495 84 -327 -401 -430 -381 -263 100 -250 -271 -125 -137 -236 -135 -140 -276 410 229 320 261 251 -129
1962 -129 -287 52 -57 -264 -5 48 -26 134 -52 362 212 281 -439 115 378 178 163 341 360 -241 -181 -456
1984 -456 -399 -580 -565 -336 -620 -238 -72 -406 -221 -375 -313 -64 364 390 650 893 830 696 303 117 -7 516
2006 516 625 220 125 -90 -522 -448 -502 -382 -306 -243 -58 63 393 -25 -165 420 475 391 525 536 300 221 264
2029 264 494 -41 64 -157 -589 -53 -155 -118 69 -58 -95 -346 10 -33 23 238 218 390 123 113 238 -225
2051 -225 1 -150 -181 -264 -203 -459 -102 23 16 -105 73 -224 -300 -112 -82 416 279 486 211 223 -145 -502 -372
2074 -372 -6 -615 -228 -75 -400 -282 57 -246 132 24 46 80 221 618 407 338 468 254 192 394 227
2095 227 -40 -97 4 -73 -438 -515 -408 -633 -691 -287 -259 147 -117 -59 56 165 29 -23 281 329 236 582 422
2118D22l56K64j00l29j13K30k8J3J10m66L02L42p8k66K84J18k72O69k27k79j09
2139A31K24j98k24j70K15m49K23K9k03RL21l50K59K42n2J37Q3Nk18J68M9m00j15
2162b84J30K22m52J70r9K11K4l04M9MJ44k7K21L38M5N8K38l20l4J61n25J12J44
2185B26j81N1l09n9qK50k28L3n4M10k64M0K71K41j34j10K72m31K51O4K48k46r0
2208B43j59k60K04m54J06n4K17R6P0k59K04p6P3J15M1j27J34q8J30J37k59k59
2230b25n5o0J3L9q0L83K08o58J59K68N1lN9K59J22o6J39k87N1r2J67m2l18k17
2254a85Q7k45J50P0K41q3k30L6J24J58K5J2M0k4q3j61r7K56L1k54K52O3l49j53
2278c19Q7j4k42J3L10K77n54P48j60m1K5m53K03J12N5q2L49j32l75L8l3j43k15
$$ plain form
2118 422 66 330 230 -99 -212 18 -10 3 113 -353 -51 291 213 -53 231 349 77 746 519 240 131
2139 131 355 157 -67 -237 -22 -471 -248 -219 -422 -413 -92 -442 -183 59 7 144 227 232 14 182 231 -169 -284
2162 -284 -154 68 -384 -214 -313 -102 -78 -382 -333 -329 -185 -212 9 347 392 450 688 368 334 495 -30 82 226
2185 226 45 96 -213 -272 -280 -30 -258 -225 -279 131 -133 -93 178 419 285 175 447 16 267 331 579 333 243
2208 243 84 -176 28 -426 -320 -374 -157 -61 9 -250 -46 -122 -49 66 107 -20 114 26 156 293 34 -225
2230 -225 -280 -340 -327 -288 -368 15 223 -435 -276 -8 43 40 99 358 480 414 553 266 317 225 392 350 32 -185
2254 -185 -98 -343 -193 -123 118 35 -195 -159 -35 123 148 160 200 176 93 -68 -165 91 122 -132 120 183 -166 -319
2278 -319 -232 -246 -488 -475 -165 112 -442 306 146 105 130 -323 -120 -8 47 -35 314 182 -193 -155 -188 -331 -546
2301e46L64j10Q3lN4l4K42K51m79K35P9n1J99J18R4j78j66J30n61J60J87m27J25
2324b34L66n57L58r7j46k9M46N3L8J32j16L7j68J75k19Rk10J69p3J53k5K72l44
2347a0j30j72j38L62j08P6K62RJ28n2pn2J20l17j35J36J90J4k64m7j57J74j40
2370b58L90j43l02J08M35K0J92m19J24j54J42j9L2J42K1l06n2k50L0K9k28K58
2392b08J42p4j88M40J61j51J10J5k46L87K6L7j4n3l76J2o6j4K64m90K49j58q6
2415b81R8J76l09J15M4R1J02j46k33P86q2k02J7J22j30l73K34Q2r0j1j30j40K
2438b58k40L26Q0J12p5J64M1M7k5j14O6k8jK26m22%J89k11kp9M7k15L0K72j76
2463b46M34J72k3k09J37l12P2%J72rJ01j21k03P3m16j57J86L61l40J59L74l62
$$ plain form
2301 -546 -182 -292 -209 -212 -158 -192 50 301 -178 57 136 85 284 402 496 318 152 282 -279 -119 68 -359 -234
2324 -234 132 -425 -67 -164 -310 -339 107 160 198 330 214 251 83 258 39 48 -162 7 -66 87 62 334 -10
2347 -10 -140 -312 -450 -88 -196 -120 142 151 279 227 220 168 288 -29 -164 -28 162 176 -88 -135 -292 -118 -258
2370 -258 132 -11 -313 -205 230 250 442 23 147 -7 135 116 148 290 311 5 -47 -297 -267 -238 -466 -208
2392 -208 -66 -140 -328 112 273 122 232 247 1 388 414 451 437 384 8 20 -46 -60 204 -286 -37 -195 -281
2415 -281 -183 -7 -316 -201 -157 -66 36 -110 -343 443 361 159 176 298 168 -205 29 111 21 10 -120 -260 -258
2438 -258 -498 -172 -92 20 -55 109 150 197 172 58 124 96 95 321 -101 -101 88 -123 -125 -204 -157 -372 -342 -70 -246
2463 -246 188 360 337 128 265 -47 25 25 197 188 289 168 -35 38 -378 -535 -349 12 -328 -169 205 -157
2485a57J25L08j58l4j50M51k16R5M1%J9k57J07l74L69j92k31J13J48j39j50J77
2507a05j30J08J31m1J68J35j79k15J65L23m68K10K33j75j70P7j95J41k64L14j66
2528a03j60K51k88K78L13j54j77pK08j06P7j68p8N9q1JJ67j69o3k23J18K34k84
2551c55L23Q4J61k61K75J1j35KJ14j02r3J63l1N7k12k73J8k1m0j90L29M6J57j85
2575a58L94j69p7J33R2M8o3pK5q0j56l0p9m6k47L16l16K43P1j78J5p5K75L31j99
2600F3p7L30m0J33l38J56k88K64j94K81m82J37l7M3P9j92Ok20J68J38K69P0Q8
2623C57j21k1j60p3K6j23K5L99k52J90m02l7L6J24R0l96J42M61n01J88k29L35
2645E8N6j63J72K55k39l5l27L16k48J70j55L1l12M9J48J36j21P3J02p6k5J00p8
$$ plain form
2485 -157 -32 276 118 84 -66 385 169 264 305 305 324 67 174 -200 169 -23 -254 -141 7 -132 -282 -105
2507 -105 -235 -127 4 -37 131 266 87 -128 37 360 -108 102 335 160 -10 67 -128 13 -251 63 -103
2528 -103 -263 -12 -300 -22 291 137 -40 -47 161 55 132 -36 -114 -55 -136 -135 32 -137 -200 -423 -305 -71 -355
2551 -355 -32 52 213 -48 227 238 103 105 219 117 24 187 156 213 1 -272 -254 -275 -315 -505 -176 -130 27 -158
2575 -158 236 67 -10 123 215 263 200 193 218 138 -18 -48 -127 -173 -420 -104 -420 -177 -106 -284 -269 -344 -69 262 63
2600 63 -14 316 276 409 71 227 -61 203 9 290 -192 -55 -92 -49 30 -162 -156 -376 -208 -70 199 269 357
2623 357 236 215 55 -18 8 -115 -90 309 57 247 -155 -192 -156 -32 58 -338 -196 265 -236 -48 -277 58
2645 58 114 -49 123 378 139 104 -223 93 -155 15 -140 -109 -421 -372 -224 -88 -209 -136 -34 -110 -135 -35 -113
2668a13L83j96qO2J04n0J97m75J20l19K62l05N0M38m26K42j12O8J07q8J15L21
2690C77k45J22q5K20p0m8l70K21K24k96m77L36J68m48R2K27m2j6M3l6j66K60L12
2713C03j28j69K9m6J13l9o8J17j61J34l04L95m37j4K79l7j90K02J87j04NJ10N
2736A82m07M83k28p5J79J16M5J35l65j27l1J1j01P4j65M55k39N9pK04N5k40M46
2759D59n95O70l96j09K80m34q0J11k24K70p8k7J22J34k75J11p0j16L33k10N17
2780C93k48L7%m7k68M6o1J20l1L48m77J49k73oN2O7P9L8k18M49Lk01K33k5p3q0
2806FJ72l11L21L6l8j37r8j75LP0J00k43K19J52jJ44Rk35k6J03L84n21J74O6p0
2831A04m3j2qk93J26r4j27K52j99K91k23Q5O2k59J94K46k53K64j22J23j40K6k8
$$ plain form
2668 -113 270 74 66 128 232 182 379 -96 24 -295 -33 -338 -288 150 -276 -34 -146 -78 29 -59 56 377
2690 377 132 254 169 389 319 271 -99 122 346 50 -427 -91 77 -371 -279 -52 -94 -110 -67 -103 -269 -9 303
2713 303 175 6 35 -11 102 63 -5 112 -49 85 -219 176 -261 -275 4 -33 -223 -21 166 62 67 177 182
2736 182 -225 258 30 -45 134 250 295 430 65 -62 -93 -82 -183 -109 -274 181 -58 1 -6 198 253 13 459
2759 459 -136 534 138 29 309 -125 -205 -94 -318 -48 -126 -153 -31 103 -172 -61 -131 -247 86 -124 393
2780 393 145 182 182 135 -133 -87 -148 -28 -59 289 -188 -39 -312 -318 -266 -199 -120 -82 -300 149 152 -49 184 159 86 6
2806 6 178 -133 188 224 186 49 -49 -224 -221 -151 -51 -294 -75 77 76 220 229 -6 -32 71 455 -66 108 174 104
2831 104 61 49 41 -252 -126 -220 -347 -95 -294 -3 -226 -141 -79 -338 -144 102 -151 113 -9 114 -26 0 -28
2854b8j41K38j84N8k3j10P7K13j4n8L30k66j61Mk6J69J0j09J86j71R0j55M4K68
2878B41l42k4O9q0q9K21Kk81K89k12J42K41j80L83k06j67oQ3j18M5k1J02k10K8
2902i0r5M2N9qk22K87k80J00K70j87J97j38K07m37L36J72r0l9L25m49j31j1K3
2925a59r7J71k20J11J14j6Q8P6p9J99k20R0O7j49L30K1k55M9m70L15N4j13r2K22
2949C7k5r7M3J55l09k2K07L0j7L26Kj72J91j69o7L9m03M68r8l04J21J21m38J45
2973b36J75j63L2P4J54L43k19q6N3j23J30k22K17j78m0J54J41k85O3O4k8r4j04
2996a78M4k17L50O8k03M85m74Q4J48j15J3K49m2q8j78J30K8J9k89K14l01R1K57
3019I5n1k74K10L26k76J26l09M18k63K64L9k40j47o7R9j86J54K22l69J03j11L35
$$ plain form
2854 -28 -169 69 -115 -57 -80 -190 -113 100 86 28 358 92 -69 -65 -91 78 88 -21 165 -6 84 -71 -27 241
2878 241 -101 -125 -56 -136 -225 -4 -2 -283 6 -206 -64 177 -3 380 174 7 1 84 -34 11 -10 92 -118 -90
2902 -90 -185 -143 -84 -92 -314 -27 -307 -207 63 -124 73 -65 142 -295 41 213 123 84 409 -40 -171 -182 -159
2925 -159 -256 -85 -305 -194 -80 -96 -8 68 -11 188 -32 58 125 -24 306 327 72 121 -349 -34 20 -93 -185 37
2949 37 12 -85 -42 113 -196 -218 -11 19 2 328 330 158 349 180 113 152 -251 217 119 -185 -64 57 -381 -236
2973 -236 -61 -224 -192 -118 36 379 160 74 127 4 134 -88 129 -49 -89 65 206 -79 -16 48 20 -74 -178
2996 -178 -134 -351 -1 67 -136 349 -125 -41 107 -8 5 254 212 124 -54 76 104 123 -166 48 -253 -162 95
3019 95 44 -230 -20 306 30 156 -153 265 2 266 305 65 -82 -149 -50 -236 -82 140 -229 -126 -237 98
3041I8k05J65rM7j65J62P6Q6K13m61K08P0j36q5q9J20k90K17j71J37o3n4J10j36
3065a55Q4J07Q1j4J4j49J86m1j64O1P9o9j16K52l55K04j36l8q7j9K19J90l19l8
3089b23P0J62Q9r4K48j57lj49J06R3ko1k78K20l01J61O8j48J86oJ46N7k29J10
3113F5o9RM26m98Q7J62p5j8J80k50j37rJ05Q0J1j72Q3j44Q2K97k48K37m25L21
3137A00l7J5K88l92J63k35j20J58JK98l54R7R5j83j37J29k18J72K03n2oJ78J1
3160A74N6k55J89J15L5l41J07L8j36o7J96l47K27o2O3P7j60J8q0M2qJ76J05J29
3184B91l67N5M51l55J80j76j62j07J43j71O5p6K21KN0k44L7J94J32nm2Ok82L44
3208A84p9o7j5J9P4l01p0oL13j67J40j98n8J48j49L1R5J48J45M1k52O1J50O6l92
$$ plain form
3041 98 -107 58 49 96 -69 93 169 255 468 7 215 285 149 64 -25 95 -195 22 -149 -12 -75 -129 -19 -155
3065 -155 -71 36 117 103 117 -32 154 113 -51 10 89 20 -96 156 -199 5 -131 -169 -256 -275 -56 134 -185 -223
3089 -223 -153 9 98 4 252 95 92 -57 49 142 140 79 -199 21 -280 -119 -51 -199 -13 -19 127 184 -45 65
3113 65 -4 5 431 -67 20 182 107 89 269 19 -118 -127 -22 58 69 -103 -20 -164 -82 215 -33 204 -221 100
3137 100 63 78 366 -26 137 -98 -218 -60 -59 239 -115 -18 77 -106 -243 -114 -332 -160 43 -9 -15 163 174
3160 174 230 -25 164 279 314 -27 80 118 -18 -85 111 -236 -9 -71 -8 69 -91 -73 -153 -111 -119 57 162 291
3184 291 -76 -21 430 75 255 79 -83 -190 -47 -218 -153 -229 -8 -6 44 -200 -163 31 163 158 116 122 -160 184
3208 184 105 38 23 42 116 -185 -255 -261 52 -115 25 -173 -231 -83 -232 -201 -106 42 187 228 -24 37 187 253 -139
3233a39L6nm6J03j39L72l61O6K66l47L48j43j08K70m0j1lQ3j33j34j1M8j64K11
3257A9J62j30R4l03P4R8k12L55l75Q7J73M7k54P5M7K59l8r0K39j54j36O1j47O1
3281A2J4j85K36o8k57K96J3j48L58k95J10k40K20K88k39K4j05K13r1j35o3N9k7
3304a0j10l2J7K78k58q2Q5K00j82j36O69m32J46o8j37J35j14Q1m8m4j59jN8j79
3328c23J87j63K90J41k25J91p8K32j08j94K31j97P9l19J95R4m9L9J4p1j65J64
3350c5j10j5K00j11P8J7j41L91m29L34J45k76n7M7J63r4r6N9p4J09m06M28j61
3373c4k11J66L21k03j79L57l92J49J0N7L4K55l53L6L36j58j45K53k43M1M6J33
3395B76m02Q4j10n0K35l59M07k41Q0J77K23k36rL44l31j76K60j26j5l42N2O2M27
$$ plain form
3233 -139 -103 -108 -154 -51 -190 182 -179 -113 153 -194 154 11 -97 173 133 122 119 202 69 -65 -76 -28 -192 19
3257 19 181 51 145 -158 -84 14 -198 157 -218 -131 42 89 -165 -90 -43 216 178 88 327 173 37 98 -49 12
3281 12 26 -159 77 9 -248 48 61 -87 271 -24 86 -154 66 354 115 139 34 247 156 21 -42 17 -10
3304 -10 -120 -152 -135 143 -115 -197 -112 88 -94 -230 439 7 153 85 -52 83 -31 50 2 -42 -201 -202 -144 -323
3328 -323 -136 -299 -9 132 -93 98 20 252 144 -50 181 -16 63 -256 -61 33 -16 23 37 -34 -199 -35
3350 -35 -145 -160 40 -71 7 24 -117 274 -155 179 324 48 -9 38 201 107 11 70 -4 105 -301 127 -34
3373 -34 -245 -79 242 39 -140 217 -175 -26 -16 41 75 330 -23 13 349 191 46 299 56 97 143 276
3395 276 -126 -42 -152 -202 33 -326 81 -160 -80 97 320 84 75 419 88 -88 172 46 31 -311 -259 -197 230
3418B30l96k5J55j49M36k48j53L41k00L6j5J6j17J88L6k3R3l07L45l68J16j60
3440a69n6J71M6M5k52K96J48j41k2M8n0j65L56M0m93J10N0j40L19nk24l3l9J66
3464FJ03J3j03J2K08j36K24l04K18k22Q5j07J98k59MJ35j01p9J13j1J33l48J60
3487e8j63p3J77J58j27K12r1J0J84l72J37mM6n2J87l23K08m3p4Q8j54L03j95n5
3511g4k2L8J61n8J3j45K60r6j07K8K20j00j88L13k79j70K27k27J79J73j23lnj35
3535a20J22n6J8J75j22k8J40r1p8k15N44l99J96k18Q9J25k77M40l06J10o2M1j70
3558a42J25j58J55j64J77J66k22J2o1J41o6j06J51j09Q1Q5k11J64n6j8R2l3p8
3581g5N1R4m4K21M4k74L08l34P2n4J57k4n1k5j13M2n4k74J07K91l0J85Nj79pK70
$$ plain form
3418 230 -166 -191 -36 -185 251 3 -150 191 -9 27 12 28 -89 99 135 112 205 -102 243 -125 -9 -169
3440 -169 -225 -54 -8 37 -215 81 229 88 66 114 64 -101 255 295 -198 -88 -38 -178 141 136 -88 -121 -160 6
3464 6 109 122 19 31 239 103 327 23 241 19 104 -3 195 -64 -60 75 -26 -105 8 -3 130 -218 -58
3487 -58 -221 -294 -117 41 -86 126 35 45 229 -143 -6 -10 36 -16 171 -152 56 13 -61 27 -127 176 -19 -74
3511 -74 -96 -58 103 45 58 -87 173 77 -30 -2 218 118 -70 243 -36 -206 21 -206 -27 146 23 20 15 -120
3535 -120 2 -54 -36 139 17 -11 129 38 -40 -255 289 -110 86 -132 -43 82 -195 245 -61 49 -13 28 -142
3558 -142 -17 -175 -20 -184 -7 159 -63 -51 -112 29 -37 -143 8 -101 -20 65 -146 18 -38 -56 36 3 -75
3581 -75 -24 70 26 247 291 17 325 -9 63 9 166 142 91 66 -47 -5 -59 -333 -226 65 35 220 225 46 39 309
3607C09k85Q1l1jK3n9j87L4J23K9l31L05l9J06j36n4K14j16Ok5J73j08k36J00
3631a05K01N7n8k74K95N7j1Lj50k48K89J26k24O7k40JJ3K62l1J27j43j91L57k1
3655A59k21N5J9J16m09J70Q3j3Q7l24K03K35l82p0L17k05M57j77k0j83QL84k67
3678B2L2R6K3j60J2J56r8j31l4kp3J97j01J19J30J3j57jK1k5J7k8R8k14J97j82
3704g3M5j48K94j32j11K65k21k52J03L36Ro8k28K16Q1j59K4r0L21J1Q7j77k11
3727g8J28J45l87K02M1K7Qj60k8J82j82K32J53l17p5K76m5l23M25j99o4O6J62
3750A89l29J78l0n2k64N9K78K1l7J57J61m52J83j82M3l0J22J40q9J82m66K26R2
3773A00k70j29J10K89Q1j93j6J71j04J6j15N7RN2m44M56o8j6J16j08J0nk13N7
$$ plain form
3607 309 24 105 74 73 96 37 -150 -116 7 36 -295 10 -29 77 -59 -113 101 -15 -9 -34 139 31 -205 -105
3631 -105 96 153 95 -179 116 173 162 165 15 -233 56 182 -42 25 -215 -214 -201 61 30 157 14 -177 180 159
3655 159 -62 -7 12 128 -281 -111 -28 -41 46 -278 -75 160 -222 -292 25 -180 277 100 80 -103 -95 289 22
3678 22 54 150 173 13 25 181 83 -48 -82 -84 -157 40 -61 58 188 201 44 43 64 39 56 28 126 -88 109 -73
3704 -73 -28 -176 118 -14 -125 140 -81 -333 -230 106 115 47 -181 35 116 -43 -19 -109 212 223 310 133 -78
3727 -78 50 195 -192 10 51 78 86 -74 -102 80 -102 130 283 -34 -109 167 122 -201 224 25 -39 27 189
3750 189 -140 38 8 -44 -308 -249 29 50 13 170 331 -121 62 -120 -77 -107 15 155 66 248 -218 8 100
3773 100 -170 -299 -189 100 181 -12 -28 143 39 55 -60 -3 6 58 -386 70 2 -14 102 -6 4 -1 -214 -157
3797a57j8K96k75p2K39n3j57R5P4j34L19j42M8l7l8K16Q3k34k63J47j58J17k09
3820c13L33k75J26j6J82j32P3q1L0K11j11K7K20k18P6k96J23Q5k41J51J04j38
3842h0J47j92rM5j3J91j79R6J99k58j90N63j15j67O1k53K78L4k44j06K03j43J04
3865b8j99K36j39l8J80m7j36J57J39r4J5K7K4j35R0p1n3J02j04j01L2J51r4O4
3889b2q1R3o9K32l0P6k77j08K38Pj07j28L42Kj82J96l33K91rj45j55r2L53k32
3913a40K16m0k2R6k43K84j34N4P0j81R7Q1p8j62j1K17j77j35J32QJ47j48l7J53
3937D7L6L2k01R0K4K91j40j04O3L8r6k71M6J82mlL8p8k11J41j46J06J16Rq2K76
3963A99r2p3J23k00O0Kl14J77q4K92j83K38k17K60j52j79L44l84l7L09j96K97
$$ plain form
3797 -157 -175 121 -154 -226 13 -40 -197 -102 -28 -162 157 15 63 26 -12 204 287 53 -210 -63 -221 -104 -313
3820 -313 20 -255 -129 -145 37 -95 -22 -103 -73 138 27 54 274 56 132 -164 -41 44 -197 -46 58 -80
3842 -80 67 -125 -134 -89 -102 89 -90 6 205 -53 -243 320 205 38 99 -154 124 158 -86 -192 11 -132 -28
3865 -28 -227 9 -130 -168 12 -35 -171 -14 125 31 46 73 97 -38 52 -19 -72 30 -74 -175 -143 8 -86 -22
3889 -22 -103 -10 -79 153 123 199 -78 -186 52 59 -48 -176 166 168 -14 182 -151 140 131 -14 -169 -261 92 -140
3913 -140 76 36 14 110 -133 151 17 71 141 -40 57 138 60 -102 -113 104 -73 -208 -76 -68 79 -69 -106 47
3937 47 83 115 -86 4 28 319 179 75 138 176 80 -191 -145 37 33 30 68 -10 -221 -80 -226 -120 -4 5 -77 199
3963 199 107 34 157 -43 17 19 -295 -118 -202 90 -93 145 -72 188 36 -143 201 -183 -220 89 -107 190
3985A90k55K35j19k3Q6Mn4Q3q5K37l15l1j34J93j95O4L27j99p5J55qj30O2j69
4009a56J11j24K01J5P0k02J56M4r1j34nj83L71k48l2R3R2j33Q9K45j41RRM8j04
4034@P2j52j81M57k61J01o1j49K97j75j58K14l6k61L45l75O17m16L09j42l2j20
4056a07nP4j8K49p4q4n6r4J5j16M1J38k95J91p0J88L0k4P9J5k11J49j64J77Jr1
4082f2R5m5n4k54K69J87j18J43m94L56j99K90l4j95J51k87M45l37J58q3j75M81
4104B38k40r6j92K74k6j22L82k85P1J63K8k16J43K91l81J20N9j15J50j29k07k
4126i2J50P1k9K01l74j3K4J27p4L6q6K9mN3j60K82p3J17j08p6L23k61R0L2j88
4151cJ43o2N9Nk23J4J43on4m8j11J24q2J02J9J26K86m75m5L24j37O7l80J99K11
$$ plain form
3985 190 -65 170 51 28 114 118 64 147 62 299 -16 -47 -181 12 -183 -119 208 9 -66 89 81 -49 13 -156
4009 -156 -45 -169 32 47 117 -85 71 115 24 -110 -115 -298 73 -175 -207 -114 -22 -155 -66 179 38 47 56 104 0
4034 0 72 -80 -261 196 -65 36 -25 -174 123 -52 -210 4 -32 -293 52 -323 294 -122 187 45 13 -107
4056 -107 -112 -38 -56 193 119 35 -21 -115 -100 -216 -175 -37 -332 -141 -211 -23 7 -17 62 77 -134 15 -149 28 29 -62
4082 -62 33 -12 -66 -320 -51 136 18 161 -333 23 -176 114 80 -115 36 -251 194 -143 15 -68 -243 238
4104 238 -2 -98 -290 -16 -42 -164 218 -67 4 167 195 -21 122 413 32 152 211 96 246 117 -90 -92
4126 -92 58 129 100 301 -73 -86 -62 65 -9 27 -59 -30 -34 19 -141 141 68 185 77 1 324 63 153 185 -3
4151 -3 140 78 137 142 -81 -67 76 70 16 -32 -143 -19 -101 1 20 146 432 -43 -88 236 99 166 -214 -15 196
4176A96N0l87J70M0Q7R6k03jj94L31k06K89j17p8L1j18P9m1J85l42j03K31M3j44
4200a06J22M6K56l55p1j55L93P6j83k0j63K66j84J88k13N9R9L2n1Q4k3r3j20J5
4224a01J21l2l29M60K09j59K1o6J59l50L08j09j36j4Q6L9k31P9RJ61k21J44jj32
4248h5j4J84n2N5M8O4Q2j60j79J68r3L5k3j00J82k84K91l40p7M03l38N42m62J36
4272a7K07j06k97K38L12k80L1K7r2K16k48j11J74m6m6J20r1q6n3O1r0m2K01j5
4296c3m1q6K2K61j40J33l68M54j58q6K43k34K88l24J20j9j2J3k03N8K54k71O4
4319f5J12m6M9P9j63J04j19J65m2n5L8o8r5m2m9j32M8J96Q7O4k26L60L7j21k16
4344a00P5j01P1J79PN8n3k25Nj64M95l76Q6K78k75J70K8m28J66J50q3J36k03p2
$$ plain form
4176 196 246 -141 29 69 156 252 49 48 -146 185 -21 268 151 73 104 -14 65 24 209 -133 -236 -5 38 -106
4200 -106 16 62 318 -37 -108 -263 130 206 23 3 -160 106 -78 110 -103 -44 55 87 36 120 97 4 -116 -101
4224 -101 20 -12 -341 119 328 169 190 124 283 -67 241 132 -4 -18 68 107 -124 -45 -36 125 -96 48 47 -85
4248 -85 -99 85 33 88 136 200 282 122 -57 111 18 53 30 -70 112 -172 119 -221 -298 105 -233 309 -153 -17
4272 -17 190 84 -213 25 337 57 88 115 23 239 -9 -120 54 8 -38 82 -9 -95 -148 -87 -177 -219 -18 -33
4296 -33 -74 -160 -138 123 -17 116 -252 202 44 -42 201 -33 255 -69 51 32 20 33 -170 -112 142 -129 -65
4319 -65 47 1 50 129 -34 70 -49 116 74 19 57 -11 -106 -148 -197 -329 -281 -85 2 66 -160 200 237 116 -100
4344 -100 -25 -126 -55 124 131 189 136 -89 -84 -248 247 -129 -43 235 -40 130 158 -270 -104 46 -37 99 -104 -176
4368a76K35j99K84n5J8k93K64M3N8p1j09K67j90j03K37k49J6l36L61K0j48J16
4390a0n7K26Nk63K38j85j0rJ9j38J41j78K63j08J9N9L9K00l01L08j38Q7j52O4
4414A19%J74l9l49O0O7k3k74M93l02k38P0J49K14k27N7l7J5N3k27K06j42J62j18
4438a37J75J30k20j5j47J22K00k25L5J78l1j19P0j60Q3O3M4J24k27P5k4r7J09
4461FM5n7j6j66P7K03Qk63J11J01k04J71J30j59O8R0M1j90J53r3m2PP5L9q2l58
4487c05J96J04j60J98M0j16L33m17J53j01J97j56k4K00k4k79r7L94J10j37j33
4508b4RKJ26j45O2p6j67K97j63l7J38K61j94j79N5m0J90O3j96O9N5J35l25j4J23
4533B5k21P7R7j50M8Q8K4mk05L03k61M18j77O6j20K6p2K18j23j88L77k64j59J01
$$ plain form
4368 -176 59 -140 144 89 107 -186 78 121 179 108 -1 266 76 -27 210 -39 -23 -359 2 22 -126 -10
4390 -10 -67 159 164 -99 139 -46 -56 -65 -46 -184 -43 -221 42 -66 -47 12 51 251 -50 258 120 207 55 119
4414 119 119 293 254 -95 -35 32 9 -265 228 -74 -312 -242 -93 121 -106 -49 -86 -71 -18 -245 -39 -181 -19 -137
4438 -137 38 168 -52 -67 -214 -92 108 -117 -82 96 65 -54 16 -144 -61 2 46 170 -57 18 -6 -103 6
4461 6 51 -6 -22 -188 -111 92 100 -163 -52 49 -155 16 146 -13 55 145 186 -4 149 56 14 21 96 135 53 -305
4487 -305 -109 -5 -165 33 73 -43 290 -127 26 -75 122 -34 -58 142 118 -161 -258 136 246 109 -24
4508 -24 -15 -13 113 -32 30 -46 -213 84 -79 -116 22 283 89 -90 -35 -75 115 178 -18 51 106 241 -84 -98 25
4533 25 -196 -119 -22 -172 -124 -36 -12 -16 -221 82 -179 239 62 128 8 34 -38 180 57 -131 246 -18 -177 -76
4557g6J44j98K50K2k33p9j91O18k74l03K01J75M0l0j74Q7J22k92J09k14L38N4
4579I6J26l08J50j59R2l28J94Q9K08k9l50K28K04o6r9N0m8o1J81j53r3O1k64K47
4603c2J31j70j22L08j25K66k57p3L03j21m1l6K35j63j56J51m5j14j30j20L52k19
4625a78K35k10o3M5P9P1P9J21j46r7R3j31J25L67m76J28j26M1K09j36K91l72J58
4648A07Jk73N2k7P9R7J8J7q2K17l98K31J41k07J05k9J23j85m6N7K5l11P7LL56
4673A48k69J74K10j81j43j35K0lJ92M1k49L08K68n44J4J92j43J30j81J31kJ93
4695A71j01j21L7K76j15q0k37j0K95q4o6L9j3Q6k23J20Nq7j0K53l81K17j24K71
4719A18j80P2M7R3j84k2K39m30M19N8k81p5J90k46L25k14q8K5M9K14n2m11J95
$$ plain form
4557 -76 68 -130 120 142 -91 -170 -361 257 -17 -320 -119 56 96 66 -108 -21 101 -191 -82 -296 42 96
4579 96 222 -86 64 -95 -3 -331 -137 -48 160 131 -219 9 213 147 48 98 50 -11 170 17 -76 -15 -279 -32
4603 -32 99 -71 -193 115 -10 256 -1 -74 229 108 67 31 266 103 -53 98 53 -61 -191 -311 41 -178
4625 -178 57 -153 -216 -171 -92 -21 58 179 33 -64 29 -102 23 390 -86 42 -84 -43 166 30 321 -51 107
4648 107 108 -165 -113 -140 -61 36 54 71 -11 206 -192 39 180 -27 78 49 172 -13 -59 -2 23 -288 -211 -208 148
4673 148 -121 53 263 82 -61 -196 -176 -179 13 54 -195 113 381 -163 -149 43 -100 30 -151 -20 -22 171
4695 171 70 -51 -14 262 147 67 -170 -180 115 31 -35 4 -9 77 -146 -26 -21 -108 -118 135 -246 -29 -153 118
4719 118 -62 10 57 150 -34 -56 183 -247 172 230 -51 -126 64 -182 143 -71 -159 -134 -85 129 77 -334 -139
4742a39J83j79N5j1L3K20m46K88J13rk03M1j47L21j11j80m2m7J49q1J03K90k74
4765g3J33L3n3J45j35j21pJ0J27Q9o8j08l1O3M4L7r0J3l5R2J17j94k4J25l17J
4791b27M56l46L96j19j55R8Pk48L69O4k20j31r6K54l10J91j8P4J08J56l49M0Q6
4814H0j77R0qj64J71L31l85L29m64K37k21K05N2mj67m3R1Q4k36J52q9O7J95R3
4838B19j86R4l04K99P4j90J19k52m2L33m05J44K13Jj66R4P3j73J63M8Rk16J94
4861A43R8l99L32l24J61K78o14M23j35O4n3k0K2N5o1o9p7K67K1j09J13J58P2l56
4885a0J00O4q9l31M26j56r6M5m8J2n9j8L01j61j9M9J17K3Q3Q0k29p5K06k23K3
4910A5j34n3J64K6n6m8m8r7P4L03l41J45J51k39K92j19J76j37j64N2n2K89l46
$$ plain form
4742 -139 44 -135 -80 -91 -58 162 -284 4 117 108 -95 -54 -201 120 9 -171 -213 -260 -111 -192 -89 201 -73
4765 -73 60 93 40 185 50 -71 -78 -68 59 148 80 -28 -59 4 48 85 -5 8 -27 65 182 -12 -36 89 -228 -227
4791 -227 229 -117 279 160 5 103 110 -138 231 295 75 -56 -152 102 -208 -17 -35 39 147 303 -46 -6 80
4814 80 -97 -7 -15 -179 -8 323 -62 267 -197 40 -181 24 76 72 -95 -138 -47 37 -199 -47 -136 -69 126 219
4838 219 33 127 -177 122 196 6 125 -127 -169 164 -241 -97 116 117 -49 45 118 -55 108 156 165 -51 143
4861 143 241 -158 174 -150 11 289 -325 98 -37 27 -26 -46 -24 31 -30 -99 -176 91 112 3 116 274 346 -10
4885 -10 90 154 65 -266 160 4 -92 -47 -95 -83 -142 -160 141 -20 -39 10 127 150 233 313 84 9 215 -8 15
4910 15 -119 -172 -8 18 -38 -86 -134 -231 -157 146 -195 -50 101 -138 154 35 211 74 -90 -38 -90 199 -147
4933a47K43p5l2O3rJ66l02L8Q2O8k04P1J05m7J8o1M5m3J45r7P2q2J71r4j61O0
4959go1J56l44K06J24j20m8K46k26J9J60l1r5l8L9l1P3L2m0M6j55J48j27J82n26
4984d18J87J24K58R1k91O2N4R0k16NP3N5l20O05m10j43L08n5K17p3l50J09L0k7
5008c5m6O6k6Q3J91k44L07l08R8k35K53J69j45j11j86K71j05m5K08j95K48k70
5030e7J2J72q0j0KM4j93k53L51J69l58K59p3j0q2qN2P1J19l30J21qJ34n1l3k5
5056f5k46M88k45K72Pj14k18J65j83J23j63K02j2J4q2q1O3N3j61L42k89L2K74
5079A76j74R0j00m5R6j18K1K26m6j17k71J57J13j61q0J37K53q8l12L43j06o1K
5102f5J81k4K0k40n1K21l46L48r1rj1Nj00J35J92k22L10l38n0J85N7r8p5K74m33
$$ plain form
4933 -147 96 21 -11 52 43 209 -93 -55 27 95 -109 -38 67 20 38 -23 22 -21 124 27 99 17 188 94 -67 -7
4959 -7 -68 88 -256 -50 74 -46 -94 152 -74 -55 105 74 -21 -59 -20 -51 22 54 14 60 -95 53 -74 108 -418
4984 -418 -231 -107 151 242 -49 13 67 157 -59 -54 19 74 -246 359 -51 -194 114 59 276 203 -147 -38 -8 -35
5008 -35 -81 -15 -41 42 233 -11 296 -12 86 -149 104 273 128 17 -169 102 -3 -48 160 -35 213 -57
5030 -57 -45 127 47 37 39 83 -110 -363 -12 157 -201 58 -15 -25 -107 -115 -63 8 127 -203 -82 -90 44 -7 -40 -65
5056 -65 -311 177 -68 204 211 97 -121 44 -139 -16 -179 23 11 25 -57 -138 -75 -22 -183 159 -130 -98 176
5079 176 2 92 -8 -53 43 -75 -54 172 126 9 -262 -105 8 -153 -233 -96 157 69 -243 100 -6 -67 -65
5102 -65 116 92 112 -128 -179 42 -304 44 -47 -56 -67 -62 -162 -27 165 -57 253 -85 -135 50 107 9 -66 208 -225
5127b25L44J81r3j41J06j00k49J00n5jJ06M6j7l5j32K17L8K4p5N9o3l2j67K58
5151I4q8p0K53j35j62J76m0mkL1j16J08J60k37j9k92J95L51p3k28l29L33J36n7
5175a5m3p2K82k14K1J32Rj41N3l58J13K97k72L66o09L54K60k08j3O0J9J82K9j49
5199H3k22p4K82l9m1j24Q7K83k97mK2J1K0k62K70J37J30l24K1R3o0j5k05J76K64
5224B12l52N1K24l66L25k5j90K20P6l24L20j39RO7J82j22or8N1o4j53R7l8r8J11
5249c0k85L41R4K4j16j13J61j4m4K8J5j4k58L62n8M1nj46K83j77J9j01J38k32
5273h7J94K5k15J78m16L64K1k05J77m42L80k0r9n8J99J44pmJ3j67l7rJ09J77l38
5298a23K73k01J38l82J98k84O07o5j47L33m40K83j87j2Q2j30j85K78L7k42J96
$$ plain form
5127 -225 119 300 207 66 172 72 -177 -77 -132 -133 -27 19 2 -33 -165 52 90 114 39 98 35 3 -164 94
5151 94 6 -64 189 54 -108 68 28 24 22 53 -63 45 205 -32 -51 -343 -148 203 130 -98 -427 -94 42 -15
5175 -15 -58 -130 152 -62 -41 91 100 -41 12 -346 -233 64 -208 158 -451 -97 163 -45 -58 2 21 203 232 83
5199 83 -139 -213 69 30 -11 -135 -48 235 -62 -66 -44 -33 -13 -275 -5 132 262 -62 -41 52 -8 -23 -228 -52 212
5224 212 -140 -89 135 -231 94 69 -121 99 175 -149 171 32 41 108 290 168 162 64 115 51 -102 -5 -43 -141 -30
5249 -30 -315 26 120 144 28 -85 76 62 18 46 61 47 -211 151 93 134 129 -17 266 89 108 7 145 -87
5273 -87 107 132 -83 95 -321 43 64 -141 36 -406 -26 -46 -145 -203 -4 140 133 129 142 -25 -62 -71 38 215 -123
5298 -123 150 -51 87 -295 -97 -381 226 161 14 347 -93 190 3 -9 73 -57 -242 36 73 -169 27
5319B7Q7k12J77k62K52j35jJ1q1N3J66jk67J19K37L0k88N3jr7j31J90k42L54j44
5344a06j93M08R5j08J62l21J69J61m04J61P9j07N9j8L2j63j00K89k73L74k37R5
5366E4Q0l16K0K22k02K87l4j3j17J78j61j49Q6k4M61m65L88l07J65k47J06K02
5388B14l89L5J29j33J96r0j5j62K46k13K42k08%J1J24J62k56L39k22j5k67J22
5410a50M9k8K54l36J29J69R9q3k26L10k69J20o9L6r0k2K45j55P1k68K66k87L88
5433A53k74o2K04J60j8m8l6n7PL6R5m6p8j94n3K04L01m67K75k65J9J31n1K06k23
5458h1R6K66m53J91j78L08m8l6Q2j88K9o3Q5m3O9j07j59K70k99K76K0j42J39l15
5482b81K40K11j33Q0p3k2M9j51J06J6OP3n6j76K04j25J9k11L01k35J36K6l9q2
$$ plain form
5319 27 114 -98 79 -183 69 -66 -67 -56 -137 -84 82 81 -186 -67 170 200 -88 -35 -36 -133 -264 -74 -316 38 -106
5344 -106 -299 109 204 96 258 -63 106 267 -137 24 103 -4 55 37 69 -94 -194 95 -178 196 -41 54
5366 54 134 -182 -162 60 -142 145 111 98 -19 159 -2 -151 -65 -89 372 -93 295 -12 153 -94 12 214
5388 214 -175 -140 -11 -144 52 -38 -53 -215 31 -182 60 -148 -148 -137 -13 149 -107 232 10 -5 -272 -150
5410 -150 -101 -129 125 -211 -82 87 186 103 -123 187 -82 38 -31 5 -85 -107 138 -17 54 -214 52 -235 153
5433 153 -121 -183 21 181 163 115 79 22 29 65 160 114 36 -158 -211 -7 294 -173 102 -163 -144 -13 -64 142 -81
5458 -81 15 281 -172 19 -159 149 101 65 147 -41 -12 -75 10 -33 36 -71 -230 40 -259 17 37 -105 34 -281
5482 -281 -41 170 37 117 44 22 71 -80 26 42 48 121 65 -111 93 -32 -13 -224 77 -158 -22 4 -35 -117
5506a17M6K65L0j57j20J1J65j12j37Oj91J37m2J91j02J48P5r7J54j92P7J02m8
5529I2l0j88L49k91L05j61j37J56M5j96J81k60P9J22j80K42j59K81j45p1j6J2
5551C0J22r0K15k91r5N9L8K01l56J07O0M5K64k35j81M8J95L0j85J14L2k27J3N7
5575c0J26K12l75j3K41j84p9K31k65j74K54J4j57R5O0Rl0N9r5M2j52K71L4m2k44
5600a92K40N1n8k8j2q8J2k03L75p1p5m6q6J84P5m7Q9j61K22j90j02Q5Q5j61L9
5625f3J73J0k85L03k13lL5J71k14m5L61l08j10K59M35m30Jj33M4p2J56j81L36
5648B27l66P5J10k07J70J56k42K75l06J3K90k64N6QN0j1k28L6K49l59M15j96P0
5671B1j40j15K15l7j53M61j68j22K27j15J78M3k58l07K89j97K53r3L84k88J36
$$ plain form
5506 -117 -71 194 224 67 -53 -42 123 11 -126 -120 -311 -174 -216 -25 -127 21 96 -1 153 -39 38 140 92
5529 92 62 -126 223 -68 237 76 -61 95 140 -56 125 -135 -56 66 -114 128 -31 250 105 34 18 30
5551 30 152 62 277 -14 -109 -50 -12 189 -167 -60 0 45 309 74 -107 -59 136 166 -19 95 127 -100 -87 -30
5575 -30 96 308 -67 -80 161 -23 -102 129 -136 -310 -56 -42 -199 -104 -44 -35 -65 -6 -101 -59 -211 60 94 52 -192
5600 -192 48 99 41 13 1 -87 -75 -278 97 26 -49 -95 -181 3 78 31 120 -41 181 -9 -111 -26 59 -102 -63
5625 -63 110 120 -165 138 -75 -78 -43 128 -86 -131 230 -78 -188 71 506 76 77 -56 -12 -84 72 -109 227
5648 227 -139 -64 46 -161 9 165 -77 198 -108 -95 195 -69 -13 -5 45 34 -194 -158 91 -268 147 -49 21
5671 21 -119 -234 -19 -56 -209 252 84 -38 189 74 252 295 37 -270 19 -178 75 -18 366 78 214
5692B14k04q4n9L20k49J0P2q6P6J99m2l3j03j7J96k32Q6Q4r0r2L7j08J18m3j3
5717d3R3J3lk44O5J37%m7j0K47l51J27J52k18J52K01k82R2J84k49P0k56K12r5
5741e3J76m5j92j5Kn5K16k76J87j2J22l96L77k12%K91k73p1K88M6k81J17J58n1
5765D8J98j95j84J38k2j6j67J6J53j7R1J28q6j20O5O9j26j43K73k25j68J94K21
5788A25oK7p4l08p0J06L32k56J99k03J91k62L10j48j68K22K24m46P8K51ll18J07
5811i0K03k36J26j84P5J61j27j3L23j88o2R4k77L54J69k82j10l5J83l69K32n3
5833a06K00j95J84k3j21j7J83l10L62k80L32j43k98M36j12j48j4J01q8J59J51
5854B53l80K10q3P4J10j23k82J02K12l30rM05j84L99k92K6j20p8J89n8j27K56
$$ plain form
5692 214 10 -74 -133 187 -62 -52 20 -66 10 209 167 134 31 14 210 -22 64 148 58 -34 3 -105 13 -30 -43
5717 -43 50 63 60 -184 -119 18 18 -29 -39 208 -143 -16 136 -82 70 271 -11 81 265 16 86 -170 42 -53
5741 -53 123 78 -114 -129 -127 -182 34 -242 -55 -67 55 -341 36 -176 -176 115 -158 -229 59 105 -176 -59 99 48
5765 48 246 51 -133 5 -17 -33 -200 -184 -31 -48 43 171 85 -35 30 99 -27 -170 103 -122 -290 -96 125
5788 125 119 146 72 -236 -306 -200 132 -124 75 -128 63 -199 111 -37 -205 17 241 -205 -127 124 121 -197 -90
5811 -90 113 -123 3 -181 -106 55 -72 -85 238 50 -12 82 -195 159 328 46 -64 -99 84 -285 -53 -106
5833 -106 94 -101 83 60 -61 -78 105 -205 157 -123 209 66 -232 204 92 -56 -70 31 -57 102 253
5854 253 -127 83 0 74 184 61 -221 -119 93 -237 -246 159 -25 374 82 108 -12 -90 99 41 -86 170
5876A70k65o7L25k57O6j5o6K0K27m63M01J53n4j77J41j61J77K5j72J00q7q1qp3
5900a41K26k05K6KL12j96N3ol66K10J53OK31k82j41K26j58P7j90o3J04j53J3J81
5924h1J07l53J42M26p8q9k09K18j56J5%mJ76j20p7K31m5r2Q2J64m27L7K79j87
5948d1K36k57K53N5m65K26k8Qm7O5k11J81Q5r4k15K68m1n6O5k54K46l07K77P7
5972B6n4K3j50J67O5K8j82J79j8q0m7J25o4J41k61K93j67o9o9J20j7j60J05J55
5996H9j03L34n50%J71M6N00k84q8L1l11L10J3m01q1M04K36k24k73R4J09k9J69
6019A62k4j1p3j56Q3K1J14j98K9m2p0J84q6kqj81K51j9m7l6m8L01NK4k02P2J47
6046A90j64k6q8J21l5p2L30l75l2K5P7P3Q0j18o1M1q7K55k32J7Q7PK77o02L98
$$ plain form
5876 170 -95 -162 163 -94 -28 -43 -109 -89 138 -325 76 229 175 -2 139 -22 155 180 8 108 21 -60 -68 -141
5900 -141 85 -120 -94 -92 220 24 77 71 -295 -85 68 74 305 23 -118 108 -50 27 -163 -226 -122 -275 -262 -81
5924 -81 26 -327 -185 241 163 74 -135 83 -73 -58 -58 -62 114 -6 -83 148 103 11 93 257 -170 -133 146 -41
5948 -41 195 -62 191 246 -219 7 -21 -13 -60 5 -206 -25 60 -34 -249 19 -22 -78 -13 -267 -21 -328 -51 26
5972 26 -28 -5 -155 12 77 105 -77 102 84 4 -43 82 18 159 -102 191 24 -45 -114 6 -11 -171 -66 89
5996 89 -14 320 -230 -230 -59 -13 487 203 115 146 -165 145 158 -243 -324 80 316 92 -181 -87 22 -7 162
6019 162 138 127 54 -102 -19 2 116 -82 -53 -95 -165 19 -67 -69 -77 -258 -7 -26 -73 -109 -157 144 149 173 -29 43 190
6046 190 26 0 -88 33 -2 -74 256 -119 -151 -126 -49 24 104 -14 -75 -34 -121 134 -98 -81 6 13 290 -312 86
6071H6J34l86K20j17m0O8L5LNQ8P3q1q7q4k7J52q5k24K36J83l28K7J29R9%m9n4
6098b4J0j44L31j00kM5O4m47L60l52K31j57k4J65L6J53j82rm4L3J70k41O5j17
6122a80P5J97k75K21l7K16j79O7j04K07k09n7K12j45j4K18l73Q9J27j25J97r5
6144C3J25p4j69L7J70k03J11p3K33l16M3K78k60J10Oo3j82L53j86J94k25J22j09
$$ plain form
6071 86 220 -166 54 -63 -103 -35 0 3 8 96 169 88 1 -83 -110 42 -43 -267 -31 152 -176 -149 -20 79 79 30 -24
6098 -24 -14 -158 173 73 71 116 180 -267 93 -259 -28 -185 -209 -44 -8 145 -37 -46 -90 -57 113 -128 -63 -180
6122 -180 -105 92 -183 38 1 217 38 105 1 208 -1 -58 154 9 -5 213 -160 -71 56 -69 128 33
6144 33 158 84 -85 -48 122 -81 30 -43 190 -126 -83 195 -65 45 51 -12 -194 159 -27 167 -58 64 -45
$$ [...]
8191c1
##END NTUPLES=NMR FID
##END=
