##TITLE=1H_LR-758-R4-KA5-CR14
 CDCl3
 8 sc, 
 29.12.2023
##JCAMPDX= 6.0         $$ Bruker NMR JCAMP-DX V2.0
##DATA TYPE= NMR FID
##DATA CLASS= NTUPLES
##ORIGIN= UXNMR, Bruker Analytische Messtechnik GmbH
##OWNER= root
$$ XWIN-NMR		Version 3.5
$$ Fri Dec 29 14:05:59 2023 Russian Standard Time (UT+4h)  she@DPX200
##.OBSERVE FREQUENCY= 200.1313
##.OBSERVE NUCLEUS= ^1H
##.DELAY= (6, 6)
##.ACQUISITION MODE= SIMULTANEOUS
##.ACQUISITION SCHEME= undefined
##.AVERAGES= 8
##.DIGITISER RES= 18
##SPECTROMETER/DATA SYSTEM= spect
##.PULSE SEQUENCE= zg30
##.SOLVENT NAME= CDCl3
##.SHIFT REFERENCE= (INTERNAL, CDCl3, 0, 15.7039)
##AUDIT TRAIL= $$ (NUMBER, WHEN, WHO, WHERE, WHAT)
$$ ##TITLE= Audit trail, XWIN-NMR		Version 3.5
$$ ##JCAMPDX= 5.01
$$ ##ORIGIN= Bruker BioSpin GmbH
$$ ##OWNER= she
$$ F:/spectra/data/she/nmr/H-F/1/audita.txt
$$ ##AUDIT TRAIL=  $$ (NUMBER, WHEN, WHO, WHERE, WHAT)
(   1,<2023-12-29 14:04:33.76 +0400>,<she>,<DPX200>,
      <created by zg, POWCHK disabled, PULCHK disabled
       configuration hash MD5:
       00 E9 B6 7A A2 85 ED C7 34 08 36 98 17 FE 4E 26
       data hash MD5: 16K
       19 8A 56 83 F6 04 94 60 74 04 41 3B 52 B2 49 C4>)
$$ ##END=
$$ 
$$ hash MD5
$$ 71 46 BF F5 24 4D CC 46 F5 02 BC 5F 93 3B 10 88
##$RELAX= 
##$RELAX= 
##$RELAX= 
##$RELAX= 
##$RELAX= 
##$RELAX= 
$$ Bruker specific parameters
$$ --------------------------
##$DU= <F:/spectra>
##$EXPNO= 1
##$NAME= <H-F>
##$PROCNO= 1
##$TYPE= <nmr>
##$USER= <she>
##$AMP= (0..31)
100 100 100 100 100 100 100 100 100 100 100 100 100 100 100 100 100 100 
100 100 100 100 100 100 100 100 100 100 100 100 100 100 
##$AQSEQ= 0
##$AQ_mod= 1
##$AUNM= <au_zg>
##$AUTOPOS= <>
##$BF1= 200.13
##$BF2= 200.13
##$BF3= 200.13
##$BF4= 200.13
##$BF5= 200.13
##$BF6= 200.13
##$BF7= 200.13
##$BF8= 200.13
##$BYTORDA= 1
##$CFDGTYP= 0
##$CFRGTYP= 5
##$CHEMSTR= <none>
##$CNST= (0..31)
1 1 145 1 1 1 1 1 1 1 1 1 1 1 1 1 1 1 1 1 1 1 1 1 1 1 1 1 1 1 1 1 
##$CPDPRG= <>
##$CPDPRG1= <>
##$CPDPRG2= <>
##$CPDPRG3= <>
##$CPDPRG4= <mlev>
##$CPDPRG5= <mlev>
##$CPDPRG6= <mlev>
##$CPDPRG7= <mlev>
##$CPDPRG8= <mlev>
##$CPDPRGB= <>
##$CPDPRGT= <>
##$D= (0..31)
0 1.2 0 0 0 0 0 0 0 0.06 0 0.03 0 0 0 0 0.0002 0 0 0 0 0 0 0 0 0 0 0 0 
0 0 0 
##$DATE= 1703844273
##$DBL= (0..7)
120 120 120 120 120 120 120 120 
##$DBP= (0..7)
150 150 150 150 150 150 150 150 
##$DBP07= 0
##$DBPNAM0= <>
##$DBPNAM1= <>
##$DBPNAM2= <>
##$DBPNAM3= <>
##$DBPNAM4= <>
##$DBPNAM5= <>
##$DBPNAM6= <>
##$DBPNAM7= <>
##$DBPOAL= (0..7)
0.5 0.5 0.5 0.5 0.5 0.5 0.5 0.5 
##$DBPOFFS= (0..7)
0 0 0 0 0 0 0 0 
##$DE= 6
##$DECBNUC= <off>
##$DECIM= 32
##$DECNUC= <off>
##$DECSTAT= 4
##$DIGMOD= 1
##$DIGTYP= 9
##$DL= (0..7)
0 120 120 120 120 120 120 120 
##$DP= (0..7)
150 150 150 150 150 150 150 150 
##$DP07= 0
##$DPNAME0= <>
##$DPNAME1= <>
##$DPNAME2= <>
##$DPNAME3= <>
##$DPNAME4= <>
##$DPNAME5= <>
##$DPNAME6= <>
##$DPNAME7= <>
##$DPOAL= (0..7)
0.5 0.5 0.5 0.5 0.5 0.5 0.5 0.5 
##$DPOFFS= (0..7)
0 0 0 0 0 0 0 0 
##$DQDMODE= 0
##$DR= 18
##$DS= 0
$$ [...]
##$SUBNAM2= <"">
##$SUBNAM3= <"">
##$SUBNAM4= <"">
##$SUBNAM5= <"">
##$SUBNAM6= <"">
##$SUBNAM7= <"">
##$SUBNAM8= <"">
##$SUBNAM9= <"">
##$SW= 18.0517328524113
##$SWIBOX= (0..15)
0 0 2 0 0 0 0 0 0 0 0 0 0 0 0 0 
##$SW_h= 3612.71676300578
##$TD= 16384
##$TD0= 1
##$TE= 0
##$TE2= 300
##$TE3= 300
##$TEG= 300
##$TL= (0..7)
0 120 120 120 120 120 120 120 
##$TP= (0..7)
150 150 150 150 150 150 150 150 
##$TP07= 0
##$TPNAME0= <>
##$TPNAME1= <>
##$TPNAME2= <>
##$TPNAME3= <>
##$TPNAME4= <>
##$TPNAME5= <>
##$TPNAME6= <>
##$TPNAME7= <>
##$TPOAL= (0..7)
0.5 0.5 0.5 0.5 0.5 0.5 0.5 0.5 
##$TPOFFS= (0..7)
0 0 0 0 0 0 0 0 
##$TUNHIN= 0
##$TUNHOUT= 0
##$TUNXOUT= 0
##$USERA1= <user>
##$USERA2= <user>
##$USERA3= <user>
##$USERA4= <user>
##$USERA5= <user>
##$V9= 5
##$VALIST= <valist>
##$VCLIST= <CCCCCCCCCCCCCCC>
##$VD= 0
##$VDLIST= <DDDDDDDDDDDDDDD>
##$VPLIST= <PPPPPPPPPPPPPPP>
##$VTLIST= <TTTTTTTTTTTTTTT>
##$WBST= 1024
##$WBSW= 4
##$XGAIN= (0..3)
0 0 0 0 
##$XL= 0
##$YL= 0
##$YMAX_a= 157854
##$YMIN_a= -177007
##$ZGOPTNS= <>
##$ZL1= 120
##$ZL2= 120
##$ZL3= 120
##$ZL4= 120
##$ABSF1= 10
##$ABSF2= 0
##$ABSG= 5
##$ABSL= 3
##$ALPHA= 0
##$AQORDER= 0
##$ASSFAC= 0
##$ASSFACI= 0
##$ASSFACX= 0
##$ASSWID= 0
##$AUNMP= <proc_1d>
##$AZFE= 0.1
##$AZFW= 0.1
##$BCFW= 1
##$BC_mod= 2
##$BYTORDP= 1
##$COROFFS= 0
##$CY= 11.3945322036743
##$DATMOD= 1
##$DC= 2
##$DFILT= <>
##$DTYPP= 0
##$F1P= 15.7292609196834
##$F2P= 12.9074282941183
##$FCOR= 0.5
##$FTSIZE= 0
##$FT_mod= 4
##$GAMMA= 1
##$GB= 0.15
##$INTBC= 1
##$INTSCL= 1
##$ISEN= 128
##$LB= 0.24
##$LEV0= 0
##$LPBIN= 0
##$MAXI= 10000
##$MC2= 0
##$MEAN= 0
##$ME_mod= 0
##$MI= 1.114404
##$NCOEF= 0
##$NC_proc= 0
##$NLEV= 6
##$NOISF1= 3.799351
##$NOISF2= 2.8
##$NSP= 1
##$NTH_PI= 0
##$NZP= 0
##$OFFSET= 15.70392
##$PC= 1
##$PHC0= -24590.91
##$PHC1= 9.85273
##$PH_mod= 1
##$PKNL= yes
##$PPARMOD= 0
##$PSCAL= 0
##$PSIGN= 0
##$REVERSE= no
##$SF= 200.130013532006
##$SI= 16384
##$SIGF1= 3
##$SIGF2= 2
##$SINO= 400
##$SIOLD= 16384
##$SREGLST= <1H.CDCl3>
##$SSB= 0
##$STSI= 0
##$STSR= 0
##$SW_p= 3612.71676300578
##$SYMM= 0
##$S_DEV= 0
##$TDeff= 0
##$TDoff= 0
##$TI= <>
##$TILT= no
##$TM1= 0
##$TM2= 0
##$TOPLEV= 0
##$USERP1= <user>
##$USERP2= <user>
##$USERP3= <user>
##$USERP4= <user>
##$USERP5= <user>
##$WDW= 1
##$XDIM= 8192
##$YMAX_p= 0
##$YMIN_p= 0
$$ End of Bruker specific parameters
$$ ---------------------------------
##NTUPLES= NMR FID
##VAR_NAME=  TIME,          FID/REAL,        FID/IMAG
##SYMBOL=    X,             R,               I
##VAR_TYPE=  INDEPENDENT,   DEPENDENT,       DEPENDENT
##VAR_FORM=  AFFN,          ASDF,            ASDF
##VAR_DIM=   8192,          8192,            8192
##UNITS=     SECONDS,       ARBITRARY UNITS, ARBITRARY UNITS
##FACTOR=    0.0002768,     1,               1
##FIRST=     0,             0,               0
##LAST=      2.2672688,     0,               0
##MIN=       0,             -177007,         0
##MAX=       2.2672688,     157854,          0
$$ Real data points
##PAGE= N=1
##DATA TABLE= (X++(R..R)), XYDATA
0@%%%%%%%%%%%%%%%%%oJ4j6J6j6J6j7K5l2L2l8M6n0N7o5P3q2R3j05J17j32J48
39G8j65J83k01K21k44K71k99L29l64M00m41M85n32N87o49P19p97Q87r93J115j261
60f71J440j662J949k334K875l688N037p656J4423o0929j25791K07953P5731j44516
74c7839N3450J42243j13254j11537J05389N1959q2096J2688O6025l2800m4006
85A0222K4725j0492o1853n539O2461J9280m4122m189L3429m4752n2382P0632N4192
98E1612q4559k7692Q9369l69n4179N5831K2472r4455k909P5958k8017j5311Q1435
111F9186k3065r5897M9496N7470q9121k5932R9015K39p2157L0920L7977o3403
123b5272l8945M7914L7082j0783j8807q465m166r086L872L6066J8662k9030j3260
$$ plain form
0 0 0 0 0 0 0 0 0 0 0 0 0 0 0 0 0 0 0 -6 8 -8 8 -8 8 -9 16 -16 16 -22 24 -26 31 -34 39 -43 50 -55 62 -70 78
39 78 -87 96 -105 116 -128 143 -156 173 -191 209 -232 253 -279 308 -341 378 -419 468 -525 590 -671
60 -671 769 -893 1056 -1278 1597 -2091 2946 -4710 9713 -51216 -177007 30946 106677 -37839
74 -37839 15611 157854 44600 -66937 38452 90411 8315 21003 87028 54228 10222
85 10222 34947 24455 -37398 -42937 19524 38804 -5318 -9507 23922 -20830 -73212 -2580 51612
98 51612 -32947 -60639 28730 28361 -25818 30013 52485 -41970 -44879 31079 3062 -12249 69186
111 69186 46121 -49776 -280 57190 -31931 -57863 41152 41391 -30766 154 38131 -25272
123 -25272 -64217 -16303 20779 9996 -8811 -17276 -21442 -30528 -26656 9410 28072 -958 -14218
136a4218J1251j5651j692L5407n398k4379L3624J3607n1340p580L3018k3531j5531
149c2413N0390P155m2208Q939J6063k6826J1693L3486l0618j9411M4409P629k8381
162i3K4119K0017m5395k2690L1976Q052j5043P544Q189j0755j4290j0854p90O177
176a3836o581n74K0195J421k1267K504J0334q022R681K0431j2590j0654J7834
189H876j518r415K6511J1935k8265l202J5413j7842p424K7961R58j9101J2331
202A7218K143k9419q32J9704j3286r596K1767m66k2707L536J2275j1192p273R546
216h582K478o507o92O827P335J88k727N660L25j3652J457J7469n93m798J4047
231A8235j944k1531M087J3388j5878q137J7904l689j5339J4876J0802k0979p494
$$ plain form
136 -14218 -2967 -18618 -20310 15097 9699 -14680 18944 32551 -18789 -26369 6649 -16882 -32413
149 -32413 17977 25132 -17076 -8137 7926 -18900 -7207 26279 -4339 -23750 20659 28288 -93
162 -93 24026 44043 -1352 -24042 7934 15986 943 8487 16676 5921 -8369 -19223 -20013 -13836
176 -13836 -20417 -20991 -796 625 -20642 -18138 -7804 -15826 -6145 14286 1696 -8958 8876
189 8876 7358 -2057 24454 36389 8124 4922 20335 2493 -4931 23030 23988 4887 17218
202 17218 19361 -10058 -10890 8814 -4472 -14068 7699 7233 -15474 -11938 337 -10855 -18128 -8582
216 -8582 -6104 -12611 -13303 -6476 859 1047 -1680 3980 4305 -9347 -7890 9579 8986 4188 18235
231 18235 16291 -5240 -1153 12235 -3643 -11780 6124 2435 -12904 1972 12774 -8205 -15699
244a5699J2679o522p858J5842P924r128L929J0546p149r527M55j277J76J0319
258D710R612j410r324r408k452K577J732M548L508n549k936Q156J335q514J505
273a910M298m436L698J1256p016j3191O431O948m078M665N363j5955j1347J1658
287c616N800n736N156N268r770j751J0743l169j4217k08Q185L758O710Q113o515
302H751j6497o343N827M525M79L855M577k973j740N084l958j4660j870J4461P380
317F898K913P094n887j7500j550J2512M7m437N277l69p272L965O822r875j0163
332a1525M854N090J309L917q18j0742m887Q028Q737J372k300n047n899O0N642
347b209L605j635j492K528M092j20l202n865o159J927J3411J0305n25m355o174
$$ plain form
244 -15699 -3020 -9542 -17400 -1558 6366 -2762 1167 11713 4564 -4963 -4508 -5785 -5609 4710
258 4710 14322 12912 3588 -5820 -8272 -5695 -3963 585 4093 -1456 -4392 3764 5099 -3415 -1910
273 -1910 2388 -2048 1650 12906 5890 -7301 -870 6078 2000 6665 12028 -3927 -15274 -3616
287 -3616 2184 -3552 1604 6872 -2898 -4649 6094 2925 -11292 -11500 -3315 443 7153 15266 8751
302 8751 -7746 -14089 -8262 -3737 -3258 597 5174 2201 461 5545 1587 -13073 -14943 -482 6898
317 6898 9811 16905 11018 -6482 -8032 4480 4527 90 5367 4998 -2274 1691 8513 -1362 -11525
332 -11525 -6671 -1581 -272 3645 2827 -7915 -12802 -4774 3963 5335 3035 -2012 -7911 -7851 -2209
347 -2209 1396 -239 -1731 797 4889 4769 1567 -4298 -10457 -8530 4881 15186 14661 10306 4132
362D132q473n68Q343R87l755L653M827l313k190k797j2392q264R196J1214K053
377B653O57k539q832m324O888N050j473J99L478K777J057J340k667n546j904N914
393B728O061j907n797k846j587L83O890M557o649o700J687J619q28M421K784m571
409B45J63P161j15o445l690l002q77N746O754n64l902m367n246r43J687j767p1
426i233M705L779J483R08m832q690j272N492N177N657L730l757m847J050J446
441G96m8J533J603j00K438J423q46N27j158l362J331L218m874n608L388J327l003
458a415K368J632p675n556J601J119J600N292M14j921L088K018j966K835L611
473G045j013K35M024J727Q45J776k276l277j027m596n995J925L439l166o97K38
$$ plain form
362 4132 -4341 -4909 3434 4421 666 4319 9146 5833 3643 846 -11546 -19810 -10614 600 2653
377 2653 3310 771 -8061 -12385 -5497 -447 -1920 -1721 1757 4534 5591 6931 4264 -1282 -3186 2728
393 2728 8789 6882 1085 -1761 -3348 -2965 3925 8482 1833 -4867 -3180 -1561 -2389 2032 4816 245
409 245 408 7569 7454 1009 -2681 -5683 -6560 -814 5940 5376 1474 -2893 -8139 -9082 -7395 -9162 -9233
426 -9233 -4528 -749 734 1642 -3190 -11880 -13152 -7660 -2483 3174 6904 3147 -1700 -650 796
441 796 748 2281 3884 3784 6222 7645 6799 7326 6168 2806 4137 7355 2481 -3127 261 1588 -1415
458 -1415 953 2585 -5090 -10646 -9045 -7926 -6326 -1034 -620 -2541 547 2565 599 3434 7045
473 7045 6032 6267 10291 12018 12863 14639 12363 9086 8059 3463 -2532 -607 2832 -334 -1031 -793
489g93o050o044j448k69J997N366J74j928L533j72n748L137Q482j690m207M262
505a398K085j952M174M723j385k037l596n576K939P356p30K44N231k824q962j877
521c585J253j654K660M883R52l89l214p814j426O889J225j803L058q91m436K157
537b135N061l03L75k191o503J259P862j340n527O135K119q880j005O099l146m762
553f882M296M741J132n31l293M98O870J438l106J364k36o675J630J1255M038n117
569A1422n707p874n742K605K849O18M147O69p880l363R25m814k171P412P337L484
585C917K788m931p731M003O163j235M159O348p397p704P780N788n762l740n70
600A876l917j322K407m30j036r05m658j305M327j814n841R68L682k96R77P43l317
$$ plain form
489 -793 -6843 -12887 -14335 -14604 -12607 -7241 -7067 -8995 -5462 -5634 -11382 -8245 237 -1453 -5660 -1398
505 -1398 687 -1265 2909 7632 6247 4210 614 -4962 -2023 5333 4603 4847 10078 7254 -1708 -3585
521 -3585 -2332 -3986 -1326 3557 4509 4120 906 -6908 -8334 -1445 -220 -2023 1035 144 -4292 -2135
537 -2135 2926 2623 2998 807 -5696 -4437 3425 2085 -3442 2693 4812 -4068 -5073 1026 -2120 -6882
553 -6882 -2586 2155 3287 2756 -537 -39 6831 8269 5163 6527 6291 -384 1246 12501 16539 11422
569 11422 5715 -2159 -7901 -5296 -2447 -1829 2318 2987 -4893 -8256 -7331 -12145 -14316 -6904 433 3917
585 3917 6705 1774 -5957 -1954 4209 2974 7133 13481 6084 -1620 6160 11948 6186 2446 1876
600 1876 -2041 -3363 -956 -1386 -2422 -3327 -7985 -9290 -4963 -6777 -12618 -11650 -7968 -8264 -7287 -6544 -9861
617i861J331O180J177J123J850o624m960R594J0834J851M8j136q798m504M596
632B701K856J639N105j210n706L0l269r572j295P061K709J477K558m604p799M50
648f869L502K422L739N0m849R14O039L58j091J97l850l381K918K162m91K00j855
665A15l261K140J737m574r08L692o50m95M663r67n289K611N735p27l55k81p012
682c826l506O523M633Q22R58l196q011k343K688L08J818M568J08j407M71l173
698b565m253N09L069K694M461P67m085j747J186j109J760K759k950k432L748K061
714C873k77J713l12n485r11L260j134l87L029j081l749J621J00m555n77K064j022
731c830o9K327j049j737K388J944n08J413J62l165J83L792K774J326J011k146
$$ plain form
617 -9861 -8530 -2350 -1173 -50 1800 -4824 -9784 -190 10644 12495 12543 11407 2609 -1895 2701
632 2701 5557 7196 12301 11091 5385 5415 2146 -7426 -8721 -1660 1049 2526 5084 480 -7319 -6869
648 -6869 -3367 -945 2794 2844 -2005 -1091 4948 5306 4215 4412 562 -2819 99 2261 1770 1970 115
665 115 -3146 -1006 731 -3843 -4751 -1059 -1709 -2204 2459 1492 -3797 -1186 4549 3822 3467 3186 -3826
682 -3826 -7332 -809 3824 4646 5604 2408 -5603 -7946 -5258 -4950 -3132 1436 1544 137 608 -2565
698 -2565 -6818 -6309 -3240 -546 3915 4682 597 -1150 36 -1073 687 3446 496 -1936 1812 3873
714 3873 3596 5309 4997 -488 -1399 1861 727 340 3369 2288 -1461 160 260 -4295 -4872 -2808 -3830
731 -3830 -3899 -1572 -2621 -4358 -1970 -26 -534 879 1041 -2124 -1941 1851 4625 5951 6962 4816
747D816k651j571j862R55L250j27j278J282q07n028q89K233j166M0L438J18k113
764a360J534J338k866j33K356k889j652L043J271j382J589Q76k758k297l64j49
780c843J613K529J095P15N88j981j329J484j38j189J411J817l69J025L33k721
796A040j678q4r39j69K125M01j093J296J216k075j213P19j811O70L481Q95j667
813A114K67o34k267N25J886j614k178N36L62K77J430N83j042r06kk62N79J39n12
832a719K342K901K99l95j136l990j863K622K468P76J078Lk660p82O24j824j948
849c204J820J664J509K565k41m047k954o6L60J708J643r10j286L96J96q08j084
866b739o04o73J755L062J270n67n87j008R79K810J053j442q79j106p12J762J597
$$ plain form
747 4816 2165 594 -1268 -313 2937 2810 1532 2814 2007 -3021 -3910 -1677 -2843 -2803 635 753 -1360
764 -1360 174 1512 -1354 -1487 869 -2020 -3672 -629 642 -740 849 1725 -1033 -3330 -3694 -3843
780 -3843 -2230 299 1394 2109 2697 716 -613 871 733 -456 955 2772 2403 3428 3761 1040
796 1040 -638 -722 -1661 -1830 295 696 -397 899 2115 40 -1173 -454 -2265 -1595 1886 2781 1114
813 1114 1381 747 -1520 -995 891 -723 -2901 -2365 -2003 -1726 -296 287 -755 -1661 -1663 -1925 -1346 -1207 -1719
832 -1719 623 3524 3823 3428 2292 -1698 -3561 -939 1529 2305 3383 3386 726 -56 568 -1256 -3204
849 -3204 -1384 280 1789 4354 4113 66 -2888 -2954 -2594 -886 757 -153 -1439 -1043 -847 -1655 -2739
866 -2739 -3343 -4016 -2261 801 2071 1504 917 -91 888 3698 4751 3309 2430 1324 612 2374 3971
883C971k144j382m57j242r35l57k382j565J907L040J186L07j200m293j056L077
899c525K516J525K376N17j294O17K0k314j988J231J763K476J997n02l532k449
915e66q87N52J664O75o72J44R41n04l68q53k975r99K948K003l61m7j312k558J213
934a962K690K52j365R5j050j94K601J052j418R17Q92r71m89n71j992j444K389
951e68K493J062k16k151l221p99J486J177J743J466k64J4Q35o31j986r37o64O41
969e20K313J091j900j569j606k597o39J069j164j060K200J551p09N11m25k297
985e751O52L348J623J209K021p11j327J907J284r51J92K25j613m74J109n20n84
1002A639L88n82j329k24j619k237J010K323N43P81M79k352j425M54M27Q67K845
$$ plain form
883 3971 1827 445 -12 -1254 -2189 -2546 -4928 -6493 -4586 -1546 -360 -53 -1253 -5546 -6602 -3525
899 -3525 -1009 516 2892 3409 2115 2732 2752 438 -1550 -319 1444 3920 5917 5415 1883 -566
915 -566 -1453 -901 763 1438 766 910 1851 1347 979 126 -2849 -3848 -900 1103 742 695 -617 -3175 -1962
934 -1962 728 980 -385 -290 -1340 -1534 1067 2119 701 1618 2510 1539 1050 479 -1513 -2957 -568
951 -568 1925 2987 2771 620 -2601 -3400 -1914 -737 1006 2472 2208 2222 3057 2426 440 -497 -1161 -520
969 -520 1793 2884 984 -585 -2191 -4788 -5427 -4358 -5522 -6582 -4382 -2831 -3540 -3029 -3454 -5751
985 -5751 -5099 -1751 -128 1081 3102 2391 1064 2971 4255 3304 3496 3721 2108 1634 2743 2223 1639
1002 1639 2027 1445 116 -108 -1727 -3964 -2954 -631 -88 693 1172 -1180 -2605 -2151 -1724 -857 1988
1019A988k00o80J610J140j822J20J572j305o47K504O16q01J152k50k613q58j46
1036A380k865m32K328j97j510J37q65l376p75J300J3Q59J359J9L87P33p48N98
1054a655J701l05r41Q89N21j04K060O03j948p68q94k736K29L003N48j286J785
1071G02M37l327l05J859l92N51K985Q5j000N17n46r34J429R33k040j371J18r98
1089a297J84K191Q6j549q04j711j060J529R15M1J895J328j611j41O02j577l94
1106a373K439Q20K12J057j17k109J005J776k233j434J491r17k19L782R56l194
1122A942j601j347j993O53K527l61m97P82j471j955k4m51l00K180J912n6J45m93
1140d08j196J182L188M65q51L40j732j664K414K232j253p72N1l276j581J498o53
$$ plain form
1019 1988 1788 1108 2718 3858 2036 2156 3728 2423 1776 4280 4896 4095 5247 4997 2384 1526 1380
1036 1380 -1485 -1917 411 214 -1296 -1159 -2024 -5400 -6175 -4875 -4862 -4003 -2644 -2625 -2238 -1505 -2253 -1655
1054 -1655 46 -259 -1200 -311 210 106 2166 2769 821 53 -841 -3577 -3348 -345 203 -1083 702
1071 702 1139 -2188 -2493 -634 -1026 -475 2510 2595 1595 2112 1566 632 2061 2994 954 -417 -299 -1297
1089 -1297 -1113 1078 1164 -385 -1189 -2900 -3960 -2431 -1516 -1475 420 1748 137 -4 598 -979 -1373
1106 -1373 1066 1886 2098 3155 3038 929 1934 3710 1477 43 1534 617 398 4180 5136 1942
1122 1942 341 -1006 -2999 -2346 181 -180 -677 105 -1366 -3321 -3345 -3796 -4096 -1916 -4 -60 85 -408
1140 -408 -1604 -422 2766 3231 2380 2720 988 -676 1738 3970 2717 1945 1996 -1280 -2861 -1363 -2016
1157b016j228J783Q41j283L46r1k250O5K263N53N00J838p11p46J502O82k020o36
1175f08Rp69J983K699p1j332j392k069j187K530J272l94J802L71k079l23N8j475
1193i75j22K169Q03r07Q3j713k122J637J824l29q97K21j633q54K517J476m84J68
1211H62l76j478K24L67p46PJ558j02n6P63j186j868J95O86L03J450L02q74J160
1230A191J128p39q11J80j175n77K595J862o36p90p68k682q38J170r9J17J572k21
1248D79j527K53l4j943L18J979N32K86M21q42m83J081N15k82N4q24j677L73J800
1267D79l15K80M49r94j097P47m52l61J556R5j34J324P07j900p27O38k75j035J298
1286B83L74j149P11K58q83p73m6r66k91K563J074m52P47l08j215P9L6M7Q33Q57
$$ plain form
1157 -2016 -3244 -1461 -620 -1903 -1557 -1648 -3898 -3833 -1570 -1017 -517 1321 610 -136 1366 2048 28 -608
1175 -608 -599 -1368 615 3314 3243 1911 519 -1550 -2737 -207 1065 671 2473 2844 765 442 500 -975
1193 -975 -1097 1072 1875 968 1051 -662 -2784 -1147 677 348 -549 -328 -1961 -2815 -298 1178 694 862
1211 862 486 -992 -768 -401 -1147 -1140 418 316 260 1023 -163 -2031 -1836 -1150 -847 603 905 31 1191
1230 1191 2319 1580 769 949 -226 -803 1792 3654 3018 2228 1460 -1222 -2060 -890 -989 -872 700 479
1248 479 -1048 -795 -829 -2772 -2454 -475 57 343 764 -78 -561 520 1035 753 807 -17 -1694 -1321 479
1267 479 164 444 893 -101 -1198 -451 -903 -1264 292 387 253 1577 2284 384 -343 295 20 -1015 283
1286 283 657 -492 219 477 -406 -1179 -1225 -2191 -2482 81 1155 703 1450 1142 -73 6 42 89 922 1779
1306A779q7l96L00j142j046P42n04p50O35O81o50r5P49o31k29L59o27o33J073
1325d72N74m56J200J45j251j112N05n73j14J039M01j13P09J4j320L32N19o11L82
1344b02J163N61m94O88j87r15k95L4o05j34P48o18N31O58o14q83L81l83p69J135
1364b00R79o17N95O97p47l5K25j122j146N30L53o3P99L47j334o15J2p70J6P81
1384a315M46Q14J464M9n73j87j55k84P93J126M20m08L56q36r11J59o25j148L28
1403d87M40k77N0J10r92q28O88J72j72M72k80j51J009P22k57j64N4o89j64Q30
1423H6K45n38O40L69J9N65r6j426o24J20L52O81R79l50j118K03n21j450J16p2
1443a820l25Q37J339l08o16k21j207l82J552J375k3R28N66p73J79N18n68m94M27
$$ plain form
1306 1779 1692 1296 1596 454 -592 150 -354 -1104 -469 212 -438 -533 216 -415 -644 -285 -912 -1545 -472
1325 -472 102 -354 846 991 -260 -1372 -867 -1440 -1554 -515 -114 -227 482 496 -824 -492 27 -584 -202
1344 -202 961 1522 1028 1716 1529 614 319 353 -252 -386 362 -256 275 933 319 -564 -183 -566 -1335 -200
1364 -200 779 162 757 1454 707 672 897 -225 -1371 -841 -488 -551 248 595 -739 -1354 -1342 -2112 -2096 -1315
1384 -1315 -869 -55 1409 1458 885 698 543 259 1052 2178 2598 2190 2546 1710 799 958 333 -815 -487
1403 -487 -47 -324 -274 -164 -1156 -1984 -1296 -1124 -1296 -824 -1104 -1255 -246 476 219 55 109 -580 -744 86
1423 86 331 -207 433 802 821 1386 1290 -136 -760 -640 -288 393 1372 1022 -96 107 -414 -1864 -1748 -1820
1443 -1820 -2145 -1308 31 -277 -893 -1114 -2321 -2703 -1151 224 201 1129 1695 922 1101 1619 1051 557 984
1462I84J34J13L45k88j283o89Q18p92J85Q6k42n71J252N87n65Q13k61p23N85N93
1482A081l31k53N13j68Q5Q80q72j413l42n35k5Q58P38o02k5L11o20l54L82o20
1502a312J27J532J364j97j15n98j078j13Q50J66j56R04n59p35O10k04j086n6N12
1521a44o17J03P16k96p30M22m62o40K47l74o22N71P94k44L81J21m84k12R49M04
1541a17j31P59M59j94Q93Q28q45o40L05p90j74M80L46o08M03o18j114o09K50j042
1561b159L17J487J2K87L72l6j006O20O08j15P82O80m06j05N97q04n76M51o81p92
1581d67O27L67n15M00L39p64l05J30o94l89J210M00l5K36K39r71m33N15m11j34
1601f55P36Qn76M72N3p00L77K26r27L03N34k10L65R97n29n76j25l07o60L56P11
$$ plain form
1462 984 1118 1231 1576 1288 5 -684 134 -658 -473 -387 -629 -1200 52 639 74 887 626 -97 488 1081
1482 1081 750 497 1010 842 927 1807 935 -478 -820 -1355 -1380 -522 216 -386 -411 -100 -720 -1074 -692 -1312
1502 -1312 -1185 347 1711 1514 1399 801 -277 -390 460 626 470 1374 815 80 690 486 -600 -656 -144
1521 -144 -761 -658 58 -238 -968 -546 -1008 -1648 -1401 -1775 -2397 -1826 -1032 -1276 -895 -774 -1258 -1470 -521 -117
1541 -117 -248 511 970 776 1669 2497 1652 1012 1317 527 353 833 1179 571 974 356 -758 -1367 -1117 -2159
1561 -2159 -1842 -355 -343 -56 316 280 -726 -106 502 387 1169 1849 1443 1338 1935 1131 555 1006 325 -467
1581 -467 160 527 12 412 751 -13 -318 -188 -882 -1271 -61 339 304 540 779 -192 -625 -110 -521 -655
1601 -655 81 89 -487 -15 38 -662 -285 -59 -986 -683 -149 -359 6 1003 474 -102 -227 -534 -1194 -838 -127
1622a27K34r6N57r33j98O6Oq7J141K71p10L97M61n44M35K79p20r32L62j90l87
1643g15J534k58j177l80j28j143M37R43K86J85O41q2n32L54J55O3O61O31k16l7
1663A222K36k77n18N46l26q49j34l4k15O73O32p30m52k53m69M0Q67J81n02R20
1683E58M8j070J1K94m79o2N84l26n43O71n5k21Q76J27r94l79O0J41O56J379K89
1704A565n59j92q41n77K67R0P7N23M06o70m73n6o41O8J087M7l03M07J39m06P06
1725F64P65j130n88O68k28j41J119J8j010J94k95p08l0N76K0j20M96J63p26K92
1745aK57k66M01J73m85K05j38l11L62M48n51p00j05r77K5Q04P95k79K42j55p22
1766i78k65P02o4J98P61M69k82M1K51r06l70O81k11l29Q50k44k18J88L99p43j68
$$ plain form
1622 -127 107 11 568 -365 -563 -497 -491 -578 563 834 124 521 982 438 873 1152 432 -500 -138 -328 -715
1643 -715 819 561 -616 -996 -1124 -2267 -1830 -887 -601 -416 225 143 -389 -35 120 183 844 1475 1259 1222
1663 1222 1458 1181 663 1209 883 34 -100 -134 -349 324 956 226 -226 -479 -948 -908 -41 140 -362 558
1683 558 606 -464 -453 -159 -638 -700 -116 -442 -985 -314 -369 -590 286 413 -581 -960 -900 -759 -103 1276 1565
1704 1565 1006 814 -27 -604 -337 -247 -170 353 759 89 -384 -440 -1081 -1013 74 121 -182 225 364 -42 664
1725 664 1429 299 -289 379 151 10 1129 1147 137 331 36 -672 -702 -126 -106 -226 270 433 -293 -1
1745 -1 256 -10 391 564 79 284 146 -165 197 645 94 -606 -711 -1688 -1663 -859 -64 -343 -101 -256 -978
1766 -978 -1243 -541 -605 -407 354 823 541 582 833 -73 -443 238 27 -302 548 304 86 274 673 -70 -238
1787b38K47Q1J47J237j36l90J66n53o1j8k74j04K95K3l35o9J79q89l00Q87n42
1808f47m16K25L87k26Q29M45o91p9J85o84LR86L66k58Q1J0p82k56J82k96n9R17
1830B22K5j67M15k02m79K3J37l50O64M4j20L09M9o74k01j11l90m5O69L89j59M05
1852D53j10m42j96O02k40j89O45M05r8J60O9q64j8J65j79m24K49k70l76L53J72
1873a33m87j04m2k28N53K27L26M7M66Qo35J86k39l85P33Q7q7j35K73p29m41J22
1895f17j38k61N90K33l36K94O23l30p0M80o03p1P46N6n26N85K97q29l66K16M5
1916A8o29N09nj80M79j22j92N8o5k66J70K63k6L09K11n06N4j95k94l72N06J70
1938a05j62N22N15p14J9L50K9k52Q05O1j79J6M72p32p9J08o33k34K04n95J76J33
$$ plain form
1787 -238 9 90 237 1474 1338 948 1114 561 500 482 208 104 399 422 87 18 197 -692 -992 -105 -647
1808 -647 -1063 -838 -451 -677 152 597 -94 -173 12 -672 -669 317 683 425 506 516 -266 -522 -340 -636 -695 222
1830 222 247 80 495 293 -186 -163 -26 -376 288 332 212 521 570 -104 -305 -416 -806 -851 -182 207 48 453
1852 453 343 -99 -295 307 67 -122 523 928 830 990 1059 195 177 342 163 -261 -12 -282 -658 -305 -133
1873 -133 -620 -724 -766 -994 -441 -214 112 159 625 633 -2 184 -55 -440 293 380 293 158 431 -298 -739 -617
1895 -617 -755 -1016 -426 -193 -529 -235 388 58 -12 468 -135 -206 540 596 70 655 952 123 -243 -27 18
1916 18 -611 -102 -107 -287 192 70 -122 -64 -129 -395 -225 38 12 321 532 26 80 -115 -409 -781 -275 -105
1938 -105 -267 255 770 56 75 425 454 202 1007 1068 889 905 1377 645 566 674 41 -193 11 -584 -408 -275
1960b75j96jl9j77l56L57M8P1O43P20m78K84o9k04j96K11Q8l99M00N3m73p3l20
1983c81l70j57K29J82k96N52K09k40J00j1r0p4J81k28J8R33K0l02j85k09m62M07
2005a74j71L04j1J64j1M7Q7j14k24L60l39o7K77K82K28l81M13o86l00J79j39Q
2027b68L43R7J9J31o1k35j2L07l35J15O60K7l9k13K1l86m99J07j04k73N13r4j56
2050c35J17j36o60K60K95j81N61L71K20j41J42k2o35O90qk5n0Ml45K0Ll80l67
2073f02J11j67l76L84K50l79L74M78o33J73L42m31l3N25L31o2P2Q3m12l02K55
2094a9k30m4L35j37K73L72j37q9p1k49j93L68L60r9M0Lk15m48Lj67mL09O4QK36
2119B69m89J28k64L67o1k5N56m37k2P4L54l71Q7j04m87J24k4R6j66K79J06m90
$$ plain form
1960 -275 -471 -472 -511 -688 -1044 -687 -639 -568 75 795 317 601 532 328 132 343 431 32 432 485 12 -61 -381
1983 -381 -751 -908 -679 -497 -793 -241 -32 -272 -172 -183 -273 -347 -166 -394 -376 557 577 275 90 -119 -581 -174
2005 -174 -345 -41 -52 112 101 148 235 121 -103 257 -82 -149 128 410 638 257 670 -16 -316 -137 -276 -268
2027 -268 75 172 191 322 261 26 14 321 -14 101 761 788 749 536 557 171 -328 -221 -325 -598 -85 -179 -335
2050 -335 -218 -354 -1014 -754 -459 -640 -79 292 512 371 513 491 -144 546 538 513 463 467 122 142 145 -235 -602
2073 -602 -491 -658 -1034 -650 -400 -779 -405 73 -560 -387 -45 -476 -509 16 347 285 357 440 28 -274 -19
2094 -19 -249 -293 42 -95 178 550 413 324 253 4 -189 179 539 440 480 483 268 -180 -177 -344 -348 -39 25 33 269
2119 269 -220 -92 -356 11 -50 -75 481 44 22 96 450 79 166 62 -425 -301 -325 -229 -395 -116 -10 -500
2141e00Q7M4k49M0Q68l70L99J28m35K9K88J22n05O37r0o17L51J63j22l17J2o53
2163f90R2J01Q8N13q4M29m88j70L98l25k94R10j30K03J8l72k81J79j53j22o2M19
2185A79l81o1L12j15k09K53k55j44L77j51J54J01K75l03l98J35k10j38K47J93
2205a39J28l45M16n50N00j33n5J97J24Q0l0M41l40Q9K74m2m62q3mN9L05J66l35
2228B61j62j21J37m54m7L45k98K39K71o6J24J9k87%%J32j42j8J66k43J81J0o56
2251f09j16K4J9L08N57L5q2nP7l72J27M67k56J46L07n47O3Ok40r2O4P3l9j15K31
2276C1k1j50N08j38l63K64N8k09J80L95J08j86J36m24k89o5K37l37L24j26n7j43
2298b67Q5p6k00m5K85n0L16Q2J74K84l05r0l63l9J93j47K84k8k17q1J18p61K39
$$ plain form
2141 -500 -413 -369 -618 -578 290 -80 319 447 12 41 329 451 -54 583 493 -124 227 390 268 -49 -37 -690
2163 -690 -598 -497 -409 104 20 449 -39 -209 189 -136 -430 480 350 553 571 199 -82 97 -56 -178 -240 179
2185 179 -202 -263 49 -66 -275 -22 -277 -421 -44 -195 -41 60 335 32 -366 -231 -441 -579 -332 -139
2205 -139 -11 -356 60 -490 10 -123 -178 19 143 223 193 634 294 383 657 615 153 70 66 125 430 596 261
2228 261 99 -22 115 -339 -386 -41 -339 -100 171 105 229 248 -39 -39 -39 93 -49 -67 99 -144 37 47 -609
2251 -609 -725 -701 -682 -374 183 218 136 131 208 -164 -37 430 174 320 627 80 143 149 -91 -183 -119 -46 -85 -200 31
2276 31 10 -140 368 230 -133 131 189 -20 160 555 663 477 613 189 -100 -165 72 -265 59 -67 -124 -267
2298 -267 -182 -258 -458 -503 -218 -268 48 130 304 588 283 193 -170 -209 -16 -163 121 93 -124 -205 -87 -848 -609
2321f09Q9j39N57K28k18J53Q0l21J76Q8P7l33L15L60k61N7j29k52m4%j41J0N66
2344C09l82K02L13o8j09l31K47p3j37J66J52k35J38q6j0k88r5l57M59q6J15m4
2366b00J05j31k01L77o9R2J60K17j19K49j24j89k0M6l36O1Q1J79j66j85J19k60
2388c14K02j81l9k8M59K1p7K00m9k35J46Q4j79J25J84J22l02M9j71R0n3j57j19
2411b22L59K3l15J1L81p2j61J6k3k48N03k35k01M89k57q2k21J50l43J03K10R7
2433c8Q9J52L0k46j68M13l52j13O13m55M56R5l51k13J2l29M6k42L07j25K48J62
2455ip1k28J62j67J21L06l33L01K82K6o2j35J5j88j3J25j66L8r5K1j41J44j88
2478b55k55J95K9K78n5K80J56m36L29n6Q0j85l6N0J21K03k12r3K5j53n2j7J43
$$ plain form
2321 -609 -520 -659 -102 126 -92 61 141 -180 -4 84 161 -172 143 503 242 299 170 -82 -126 -126 -267 -257 309
2344 309 -73 129 442 374 265 -66 181 108 -29 137 289 54 192 106 96 -192 -287 -644 -185 -271 -156 -200
2366 -200 -95 -226 -427 -50 -119 -27 133 350 231 480 356 167 147 193 -143 -82 -1 178 12 -173 -54 -314
2388 -314 -112 -293 -332 -360 99 120 43 243 194 -41 105 189 10 135 319 441 139 188 17 107 54 -103 -222
2411 -222 137 160 -155 -144 237 165 4 20 -3 -251 252 17 -184 305 48 -34 -255 -105 -448 -345 -135 -38
2433 -38 51 203 233 -13 -181 232 -120 -233 380 -75 381 476 125 -88 -76 -405 -359 -601 -294 -419 -171 -9
2455 -9 -80 -308 -146 -313 -192 114 -219 82 364 390 328 193 208 20 7 132 -34 4 -91 -70 -211 -67 -255
2478 -255 -510 -315 -286 -8 -63 217 373 -63 266 210 290 105 69 119 240 443 231 138 163 10 -42 -59 84
2501H4j91o1N70k45k66L27pl32K37J40k51J29k6k17K06J18m33j7j00J1J37K22
2523C5j87R0K84m24J51j19L1K42j23K93K4l24K18j92l22j77K14k96N11J18k62
2544b15J22r0l0k19K94J36Q2O2J84o6j6J47k80k0K0j29j40K45j88j0j9p9n9k1
2568b89Q3l20J67K57J24r6J63M27o12R6RL9J46j3p6j8pn7j07J4k2k87M31O4J42
2593B58j57L2j3LL04l42j69L63j9k46j63R9K80m05n2J61j62K75j03l52L16K51
2615A59r9l47M54j13n6L95k22m0J95l8k79J1j40j85N5K39l47K86m8K5k44J59J17
2638f3j50K37J37k7K60j92m5k26J24P9l48M31l56K24K04k10l25M8j18J27k12N28
2660A27K2j15M40j50k60J0J16k61L24Q7j42j15%l26J3j12J79j43P1J61k49L46
$$ plain form
2501 84 -107 -168 402 157 -109 218 211 -121 116 256 5 134 108 -109 97 215 -218 -235 -335 -324 -187 35
2523 35 -152 -62 222 -202 -51 -170 -139 103 -20 273 297 -27 191 -1 -323 -500 -286 -582 -71 47 -215
2544 -215 -93 -183 -213 -432 -138 -2 80 142 326 260 244 391 111 91 111 -18 -158 87 -101 -111 -130 -209 -268 -289
2568 -289 -206 -526 -359 -102 22 -74 89 516 -96 0 9 48 194 181 105 87 80 23 -84 -70 -92 -379 52 116 258
2593 258 101 133 120 123 427 85 -84 279 260 14 -149 -50 230 -175 -227 -66 -228 47 -56 -408 -92 159
2615 159 60 -287 167 54 -2 393 171 131 326 288 9 20 -120 -305 -250 -11 -358 -72 -120 -95 -339 -180 -63
2638 -63 -213 24 161 134 394 202 157 -69 55 134 -214 217 -139 85 289 79 -246 -198 -316 -189 -401 127
2660 127 149 34 474 324 64 74 190 -71 253 340 198 83 83 -243 -230 -342 -163 -306 -235 -74 -323 23
2682B3K0j63K27J17n56L48j53M7P9L31j92l50K2Mk71L17J9j7j36K76R9m49K04
2705a54J20k8L78k60k5K16K30j63l24M09n19J14j52k8J37J41O6p2k16K51J5k83
2727a47K58r3L09M0J52l02J17l24L5p3J27o9j35N4N52m49l74Q3l1O7K5R1j09J67
2751b9J07rk4MM2j69K07k05k9M50m88K18l42k0j35J96k64J45L89n6L3L1J34j08
2775G8K6j4K2l2K37j07K18k28j63j28P7m72M47p2k31N63m40L12q6l64M16m9j34
2798a24K09J55k5L7j07j02j8j17j06LJ89p3K0m9J0k4J89j78O8j17K92l2k20K08
2822H8K05m84K80Q8l68N2J22J85j76R8K7j05k97j22M56j8j18M62j57j94J08J4
2844A46j27J80k69n8K99m08J72n2K5j88j15K02J57j71L9J33p6J76M3q2J67k8p2
$$ plain form
2682 23 43 -120 107 224 -332 16 -137 -90 -11 320 128 -222 -200 -196 -467 -150 -131 -148 -284 -8 91 -358 -154
2705 -154 -34 -62 316 56 31 247 477 314 -10 399 -120 -6 -158 -186 -49 92 158 86 -130 121 136 -147
2727 -147 111 18 327 367 519 217 334 10 45 -28 99 30 -105 -51 501 52 -322 -239 -270 -203 -178 -87 -196 -29
2751 -29 78 69 45 49 91 -78 129 -76 -105 345 -143 75 -267 -287 -422 -226 -490 -345 44 -12 21 52 186 78
2775 78 104 90 112 80 317 210 428 200 37 -91 -14 -486 -39 -111 -342 221 -219 93 7 -357 59 10 -124
2798 -124 85 240 215 252 145 43 25 -92 -198 -195 -6 -79 -59 -108 -98 -122 67 -111 -43 -160 132 100 -120 88
2822 88 293 -191 89 177 -191 -139 -17 168 -8 90 117 12 -285 -407 49 31 -87 375 218 24 132 146
2844 146 19 199 -70 -128 171 -237 -65 -117 -92 -280 -395 -193 -36 -207 -168 -35 -111 65 108 26 193 165 93
2867I3K25n3m13L41l27R7L50n45q1O1N9K01k78K61q1n4J94l02J28J12J83l0o8
2890G3N6j02n8N6K34j18j63j30L06l26k0J54k47J87j81K17J1L97l28j1J53m83
2912c23K53K8k02K15N6j35r1J62LJ50m24K13n5m1O7K01L6j3j23j09K55N9k3j54
2936En7N3J67O0j13k37o2q5j86K82J01J2j3J63O5l14L24j95n8M12j40N9k14J45
2960A74p9j31M4k23J45Rn2R9L7j62k8K4N0k07M4M16j73J30q8J53j03j63K43l9
2984A20j72L82l31J35k65K66k31L7j09j08L65j31l46N09L0j99KJJ15p3K19l53
3006a37R1J78l05M01n18oj10J78M66k20o1O1mj65L56k0j30j70K55m1j94j8N3j8
3030g8r4K31l32J54k44M3L55K47m04K31J86m2k97M6K60k67J92l45L50o3k85L17
$$ plain form
2867 93 318 265 -148 193 -134 -37 313 -232 -313 -252 -193 8 -270 -9 -90 -144 50 -252 -124 -12 171 141 73
2890 73 129 27 -31 25 259 141 -22 -152 154 -172 -192 -38 -285 -98 -279 -62 -51 346 18 7 160 -323
2912 -323 -70 -42 -244 -29 27 -108 -199 -37 -34 116 -308 -95 -150 -191 -124 77 113 100 -23 -132 123 182 159 5
2936 5 -52 1 168 228 115 -122 -184 -269 -455 -173 -72 -60 -73 90 155 -159 165 -30 -88 324 184 243 29 174
2960 174 95 -36 8 -215 -70 -61 -113 -14 23 -139 -167 -143 -93 -300 -256 160 -13 117 29 182 79 -84 159 120
2984 120 -52 330 -1 134 -131 135 -96 -59 -168 -276 89 -42 -388 121 151 -48 -46 -45 70 -3 216 -137
3006 -137 -46 132 -173 228 -290 -296 -406 -228 238 18 -43 18 14 -151 205 185 55 -115 140 99 -95 -113 -60 -78
3030 -78 -172 59 -273 -119 -363 -320 35 282 -122 109 295 253 -44 2 262 -5 187 -158 192 129 -156 161
3052A61n5O4k68K9K18m58K20Qo4K5l0K29k7k5J04j89R6J64p7k00L80l46J64j36
3076a3j93J35O4Q7l31n0k9K93j78J86m0J95m6J05n8k80L79l3j18j07J96j00j38
3099g4p4P9MN0r5k5K47j93J20J33m8j71N4L96o66O43j62k13L0j24J70o52N93R8
3123A20k93K97j29k51N2K70k02K23Q6j40j45M13m4k60R3OO8l39K13m8O2k02L3
3146a17J27j47J5J00j01K98j28q7O3J39r4n0j42K72N3k7l13J75j0j32L6K53j59
3169B4K4r1r0L9J60j18K33K10l22j36J36P9l1P2j2k52J87P4k95P1r2j27m1K26
3193g2N9j17J74K5k52K52M6k21J94k47J69R9r1k98J76r4J38k0j51K09k4J83j57
3216b0M5j89L98k16j01L02j20K0ON1Mk90M01k36l13J30l25K21L70l40J76lk11
$$ plain form
3052 161 106 170 -98 -69 149 -309 -89 -81 -145 -120 -150 79 52 27 131 -58 38 202 125 -75 305 -41 123 -13
3076 -13 -206 -71 -7 80 -251 -301 -330 -37 -215 -29 -69 126 80 185 127 -153 226 193 75 -32 164 64 -74
3099 -74 -148 -69 -65 -15 -110 -135 112 -81 39 172 124 -47 7 403 -263 380 218 5 35 -89 81 -571 22 120
3123 120 -173 124 -5 -256 -204 66 -136 87 173 33 -112 301 257 -3 90 96 164 -175 38 -10 52 -150 -117
3146 -117 10 -137 -122 -22 -123 175 47 -40 23 162 68 18 -124 148 201 174 -139 36 26 -106 -70 183 24
3169 24 48 -43 -133 -94 66 -52 181 391 69 -67 69 148 117 189 177 -75 112 186 -109 -38 -130 -257 -298 -72
3193 -72 -13 -130 44 69 -183 69 115 -106 88 -159 10 109 18 -280 -104 -198 -60 -80 -231 -22 -46 137 -20
3216 -20 25 -164 234 18 -83 219 99 119 125 176 180 -110 291 55 -258 -128 -453 -232 138 -202 -26 -29 -240
3239b40K53k12K41N9L69j42r1l17J24k06J61Q5n3j52Q9LJ5J40l02O8j47rJ95n4
3263a23j1J73J17j1l1pj18K16R0r6l78J16L04j50Q5m94J30J59j34J83q8l7j4J87
3287F8l22K06K22j96o9J07p5K50j45m8j92K05j59LK40k66J04J40Oj50J10J47k16
3310c0N3rj08J19k53J40m4J29P5Q7j67j90Q6j2K87l10R9k06K86J75k54OJ23L5
3334A17r0R4j75P2n2J66l32K78n7j04J8r1no2J66J14k42J50L2J79k64J77J5J94
3358B98k05j91M32m81K07k26k6J92l7o9j97M63l08o5K87o0m1r3K01l45L07q5J6
3381b6J91L2m3J80l3k19L0j4j25j20j8K37k80K57j35p6j81L00j39L43l09K11l2
3404C1j37J35k01K42k15j31J48K22j62J3l1j62J0m1J91K17j84j65L30J85j33p9
$$ plain form
3239 -240 13 -199 42 101 470 328 237 -80 44 -162 -1 84 31 -121 -32 -29 -14 126 -176 -108 -255 -264 -69 -123
3263 -123 -134 39 156 145 114 107 -11 205 295 199 -179 -63 241 91 176 -318 -188 -29 -163 20 -68 -105 -119 68
3287 68 -254 -48 174 -22 -91 16 -59 191 46 -2 -194 11 -148 -145 95 -171 -67 73 79 -71 39 186 -30
3310 -30 23 14 -94 25 -228 -88 -132 -3 72 159 -8 -198 -112 -124 163 -147 -48 -254 32 207 -47 -41 82 117
3334 117 27 121 -54 18 -34 132 -200 78 21 -83 -65 -156 -161 -223 -57 57 -185 -35 -3 176 -88 89 104 298
3358 298 93 -98 334 -147 60 -166 -192 0 -37 -106 -303 160 -148 -213 74 14 -27 -120 81 -264 43 -42 -26
3381 -26 165 197 154 334 301 82 112 98 -27 -147 -165 72 -208 49 -86 -162 -343 -43 -182 161 -148 63 31
3404 31 -106 29 -172 70 -145 -276 -128 94 -68 -55 -86 -248 -238 -279 -88 129 -55 -220 110 295 162 83
3426H3M3J64l39j5j09L70l71J48R3q6l68N03l15K87k7m24M66j45Q1K30m7L7k39
3449B0k93N99k81j40m5K91r5k01J49N3k05P9J03r3P7K10l13J90n3j02j6r7P7J89
3473A03J38j80k25P1Jm8j5L63k07qq3J89m0k43K64l1m9q6J98M6r6j12K07q1j79
3498a03J15j18j3M0jj3k0j3k94L54N7pj07J7L05j57J24j71J23J05l41J97j4J9
3522H4j21o3j22M8J44mj6L1Q8Q4m5j56N3M7jL5k0J59k87L1K42m38K94j77m0Q7
3548f3j63M6K65Mm7j36p4K87j61M65k46k86K21m1jm1j72O1J12j07O9j85K51kk95
3573b39K66m2jJ51k38J18M3J27k09r6J43K8K9qNN7m35J99K6k04L17q3J02l22R3
3598a73M3J20k59L74l13L39k41J37J54j62o0j00R2p6J64J2r5k9J06o5j35n9J54
$$ plain form
3426 83 126 290 -49 -64 -173 197 -174 -26 67 -19 -387 116 -199 88 61 -363 103 -42 39 269 222 259 20
3449 20 -273 326 45 -95 -140 151 56 -145 4 57 -148 -69 34 -59 18 228 -85 105 52 -50 -66 -163 -86 103
3473 103 241 61 -164 -93 -92 -140 -155 208 1 -7 -90 99 59 -184 80 49 0 -86 112 158 62 -50 157 76 -103
3498 -103 12 -106 -119 -79 -80 -93 -113 -126 -420 -66 -9 -16 -123 -106 199 42 166 -5 118 223 -118 79 65 84
3522 84 -37 -100 -222 -174 -30 -34 -50 -19 69 153 108 -48 5 52 51 86 66 225 -62 -31 211 -227 67 -110 -150 -63
3548 -63 -226 -180 85 89 42 -94 -168 119 -42 423 177 -109 112 71 70 29 -143 -82 30 -77 -8 -193 58 56 -239
3573 -239 27 -15 -16 135 -103 15 58 185 -24 -120 23 51 80 72 77 134 -301 -102 -76 -280 37 -46 56 -266 -173
3598 -173 -130 -10 -269 105 -208 131 -110 27 181 19 -41 -141 -49 -125 39 51 -44 -73 33 -32 -167 -226 -72
3621g2j05L43l02K56k9r0L9J10j88J25r0K54k19N7p1j71J66l18J96R9n4j17J53
3644b8K96j88nJ97j61q7J34j2l98K61k15j9j0K11o4nj75K35j12J42l4N2k02N1
3668a36N06l38l8o6K67k87K13mL3j30J19l6j04P8k14j25J60J37J9J16j95J01K11
3691B87r2k52L72k06k91R4K46k55j50L70j01O3N7l39K29o1K8l9k9J46j5k92K48
3714A8J53OJ87q0j69K45m02Q9lK10l35n3K2K38r3pR6k55L7J51j21M3J43j43O1
3739C8m9o1J49r8J56l38L47L2l40j2J93Q0k25OJ18pq4K37j63P7r9K55j52j3o1
3764a4L2R7k19Q5j16O0J28jO6n07L24m8j2Q0L36k51J2r9P5Om7J97k27j7k8J69
3790H1q9j6p3L1K80l78R7R2Q3n5k39J76Lj81J9J41m3J01n3j01jQ7Kj45%J85LJ8
$$ plain form
3621 -72 -177 166 -136 120 91 1 40 150 -38 87 -3 251 32 89 18 -153 13 -305 -109 -10 -64 -181 -28
3644 -28 268 80 75 272 111 24 158 146 -252 9 -206 -225 -235 -24 -88 -93 -268 -33 -145 -3 -37 15 -187 -136
3668 -136 370 32 -6 -72 195 -92 121 117 150 20 139 103 -1 77 -137 -262 -102 35 54 170 -25 76 287
3691 287 195 -57 315 109 -182 -88 158 -97 -247 123 22 85 142 -197 32 -29 -1 -40 -69 77 62 -230 18
3714 18 171 177 364 284 115 360 -42 47 44 254 -81 -134 -112 126 33 26 122 -133 -96 55 -66 -23 120 -23 38
3739 38 -11 -72 77 -21 135 -203 144 176 -164 -176 17 97 -128 -122 -4 -11 -95 142 -21 56 -43 212 60 47 -14
3764 -14 18 115 -104 -19 -135 -75 53 52 118 -389 -65 -113 -125 -45 291 40 52 -47 28 34 -13 184 -43 -60 -88 81
3790 81 -8 -24 -97 -66 214 -164 -67 25 108 53 -186 -10 -7 -188 -169 -28 -71 30 -23 -124 -125 -38 -36 -181 -181 4 7 25
3818B5J12j75Jj20K24J6j73j58J89L30l44O7j39J84%rk01J17M9j5k22K68n6j55
3842a85J58J43k62J94k22L86l27K66k00Q3O4j87J40qO3j69j8J13k40j87J30L42
3864G7o2l6m3L10j99n2J66o0j49K35j75J4J19j16K00k10OJ88k31l12M47k78K43
3887H2j57k02M05j29L2K3k7K46k88j0J73r9j59Q4l52J78K65k15j52Q3K83j28K81
3910B17l64J43J15Q8r3j04j05L12l67J59m8Q4q9jj80L40n1O2m5n3O4j08J7r4L92
3935B91m00L27q1j73q3J16m1M08k80P6l76P0j27K39P1j23K74j37l5j82J25r2L30
3958A97j09n1M1j41K20k65K78j46j59J30M7n5l11K53L08l25p1j2K17j07J34O3
3980A36l15L70k87K27n9o8J89R2k23K59n4m30j1K11r5J29k03L74l32j35J5k0K71
$$ plain form
3818 25 137 -38 -37 -157 67 83 -90 -248 -59 271 -73 -6 -145 39 39 30 -171 -54 -5 -20 -242 26 -30 -185
3842 -185 -27 116 -146 48 -174 212 -115 151 -49 34 98 -89 51 43 106 -63 -81 32 -208 -395 -265 77
3864 77 15 -21 -64 246 47 -5 161 101 -48 187 12 26 145 29 229 19 25 213 -18 -330 117 -161 82
3887 82 -75 -277 128 -1 31 54 27 273 -15 -25 148 49 -110 -26 -378 -200 65 -150 -302 -219 64 -64 217
3910 217 -147 -4 111 199 106 2 -103 209 -158 1 -47 37 -52 -53 -233 107 56 118 73 20 84 -24 -7 -101 291
3935 291 -109 218 137 -36 -119 -3 -44 364 84 160 -216 -146 -273 -34 37 -86 188 51 16 -166 -41 -133 197
3958 197 88 37 78 -63 157 -108 170 24 -135 -5 42 -13 -324 -71 237 -88 -159 -171 46 -61 73 136
3980 136 -179 191 -96 131 72 4 193 285 62 321 267 -163 -174 37 -58 71 -132 242 -90 -225 -210 -230 41
4003D1j93J74l0j00K66J55k18n1j53J12K26m18k3M73j03j74o3j72rK03Q2J64m26
4026b37M20l55L66j67j50P2Q3j36N6lj55O1J82K3k08K03o9J62kj65K8J4J43k10
4050d4J14j1o1p0K11R2m17J35J67J8k83J2j2N9jR5k1J34j53K08J0N5k00M6j09
4075b6N5l66L71o0pJ96l37J48K90k18j72m5P8L47k55j03L07k61L2N2QK96j09l25
4099a04J23j75K22j97J63r4R4P7M8k39N2J1k2O9j22J69j43L07j3k43K93k89K44
4122B31ml33K55p2J8j39n7k43K45M0k76M05k6n8p6J56j10Q8j14M2K18l9n6l3r
4147E3M6j13o4l04M24j6j05O4j08N06k44q4j26N6J88p1k61Q6J1k9L04j41Kj7k19
4172a62N7J56O6R2k93N9J65L3J5k84K20R8j9l07Q2J76j88n6m8K1K39p1k57L94
$$ plain form
4003 41 -152 22 -8 -108 158 313 95 44 -109 3 229 -189 -212 261 158 -16 -79 -251 -260 -57 25 189 -237
4026 -237 183 -172 194 27 -123 -51 32 -104 -48 -51 -206 -145 37 60 -148 55 -14 148 146 -19 9 23 166 -44
4050 -44 70 59 -2 -72 139 231 -186 -51 116 134 -149 -137 -149 -90 -91 4 -17 117 -36 172 182 237 37 83 -26
4075 -26 29 -337 34 -26 -33 163 -174 -26 264 46 -126 -171 -93 254 -1 -104 203 -58 -26 26 34 330 221 -104
4099 -104 19 -156 66 -131 32 -62 32 109 157 -82 -30 -19 -41 28 -94 75 -68 239 226 -17 276 -13 231
4122 231 227 -106 149 77 95 -44 -101 -344 -99 -59 -335 70 44 -14 -90 66 -44 44 -70 -28 190 151 95 62 53
4147 53 99 -14 -78 -382 42 26 -79 -15 -123 383 139 55 -71 -15 173 102 -159 -73 -62 -91 213 72 74 57 -162
4172 -162 -105 51 117 209 -84 -25 140 173 188 -96 124 222 203 -104 -22 154 -34 -90 -138 -117 122 51 -206 188
4196A88k28J29J61l71M70n07J12J87k61J26n7L17m05J67J5PJ19j76j78L54m41
4217b72N45m35n9K49j96J32JJ18j88L24q8k0k65K06J28j43n9J32j00n6K4NP5J2
4241G0m1k61M45l39K6J90nj30K4k4J45j52N1J42j01k12L17k67p5K33P5q2J05l02
4265a68K36n4j20M3J94rp7j37N9P0qo3M8L65k79m2N2k40p0Q2J25Rk2l7M9q3j06
4292a83K79L6j53J56J04k93p9K84j74J75j0k21r0J8N09j38k96J35R2k02j13K07
4314D3J37r0j98M4J09k93L59P4j09j56P9j22K58l9j94p8k8n5N74l90j6Q3k11J29
4338i0P2j16O3L41j96p5k86J16K34j03K10k27J29j04J7j48R9j51K55j50K69k13
4360e4L5K55l69L7N73n19K48j64j68M20m02L77l06n2L3K57k52Q5J63k34n4J28
$$ plain form
4196 188 -40 89 250 -121 349 -158 -46 141 -120 6 -51 266 -139 28 43 50 169 -7 -185 169 -272
4217 -272 273 -162 -221 28 -168 -36 -35 83 -105 219 131 111 -154 52 180 37 -22 110 10 -46 -22 -17 58 70
4241 70 29 -232 213 -126 -100 90 85 -45 -21 -45 100 -52 -1 141 40 -172 145 -122 -197 36 111 29 134 -168
4265 -168 68 14 -106 -63 131 122 45 -92 -33 37 29 -34 14 379 100 58 110 -130 -200 -118 7 16 -6 -43 6 -77 -183
4292 -183 96 132 -21 135 239 -54 -133 151 -23 152 142 -79 -169 -151 358 220 -76 59 151 -51 -164 43
4314 43 180 90 -108 -64 45 -248 111 185 76 -80 -1 -123 135 96 -98 -176 -204 -259 315 -75 -91 -8 -219 -90
4338 -90 -18 -134 -71 270 74 -1 -287 -171 63 -40 170 -57 72 -32 -15 -163 -64 -215 40 -110 159 -54
4360 -54 -19 236 -133 -96 477 -42 206 42 -126 294 -108 269 -37 -89 -56 201 -51 34 197 -37 -91 37
4382C7k88K77Ko7L8J74k21M80m75J72j15j46l69L91%L29l58k35L70l52J60K07
4404A1j92L32j95J25k94K48n7j39L89k20L6m6m1K07k39P6NJ45j68k27J44K7P9
4427Fj1m6P9mlQ2p6n6K4k17R7K57l6K5j01J27j35n5J5L0m3j10k5K48l56L99j69
4454e4l4K3J51K26l00j07l5k9M56m35O0J57Q6m49K47J02J8K04l62M7J5N7q5K96
4478B55j40k12Q8J46k86P6j02J27K0r9r6N8K13J71j65l2j52OJ47j08K20q2K40
4501B93k19M6k05K4J29k38Q7J39n6j3J17j56L1J33j05j1L9J72n0j74j0J48O6k25
4525c8J02o5L2K81k31p0J18p2j46j18J68J37j72N7k21J38K25J6p6j95R4J87q5
4548F6o9j9k36J76j7J75r8J84l28J50J05M5m27M33r5J2q6j42J58J74k87J94K14
$$ plain form
4382 37 -251 26 28 -39 -1 173 -48 432 -43 129 14 -132 -501 -110 -110 219 -139 -374 -4 -356 -196 11
4404 11 -181 151 -44 81 -213 35 -22 -161 228 8 44 -2 -43 164 -75 1 6 151 -17 -244 -100 -73 6
4427 6 -5 -51 28 24 21 103 27 -29 -5 -222 -125 132 96 121 20 147 12 -43 -28 2 -41 -151 -176 72 -284 115 -54
4454 -54 -88 -65 86 312 12 -95 -130 -159 297 -138 -78 79 165 -284 -37 65 83 287 -75 -28 -13 44 -41 255
4478 255 115 -97 -9 137 -149 -73 -175 -48 -28 -127 -223 -165 48 219 54 22 -130 -124 23 -85 135 53 293
4501 293 74 120 -85 -61 68 -170 -83 56 0 -13 104 -52 -21 112 7 -4 35 207 157 -17 -27 121 187 -38
4525 -38 64 -1 31 312 81 11 129 57 -89 -207 -39 98 -74 -17 -238 -100 125 141 65 -130 -36 151 66
4548 66 -3 -22 -258 -82 -99 76 -22 162 -166 -16 89 134 -293 140 45 57 -29 -171 -13 161 -126 68 282
4571B82l83K32l80J99q9L66l11J51r4L73k32qQ5k75N6M1M4J33K2L7k96L3J58k67
4595a23n5N7j41K54J2j64R4R2k25o7J30J92p0R0kk5K76k92j22J4K99k73m9l01
4619c99L59n4j28L64k34j25p6L11K0p5R5k35J31P7J56j46L12l39O6j03l2J13L1
4642H9J24k70J12J0k43J22J70J6j80M1K6J97L1J3k26K13N4j76j76P6k92k2J27
4665a64L14j2j98m1J42J0j72k8K98k07j99L53J29l23J50K47k93J08j26J19k48
4686a41j65J41K22L2K3k67L33k53J14l56M43R8o4K2k96K38k22K57k69L3o0K41
4708A04o4J56p6m46K18J1j20J62J22j71j10K07P3O9l13p5O1K38r0N8n8j55K3K86
4732A10r1J29j35j80j18M0N9K46r9Rp9K04o9K9J02J55m88K13p7M4J38k59L19l58
$$ plain form
4571 282 -101 131 -249 -50 -139 227 -84 67 -27 346 114 106 191 -84 -28 13 57 190 212 249 -47 -14 144 -123
4595 -123 -178 -121 -262 -8 4 -160 -66 26 -199 -266 -136 56 -14 76 74 49 325 33 -89 -75 224 -49 -98 -399
4619 -399 -40 -94 -222 142 -92 -217 -293 18 38 -37 58 -177 -46 31 187 41 353 14 80 -23 -55 58 89
4642 89 213 -57 55 65 -178 -56 114 130 -50 -9 17 214 245 258 32 245 299 123 -53 23 -269 -291 -164
4665 -164 150 138 -60 -101 41 51 -121 -149 149 -58 -257 96 225 -98 52 299 6 114 -12 107 -141
4686 -141 -306 -165 57 89 112 -155 178 -75 39 -317 126 224 160 182 -114 124 -98 159 -110 -77 -137 104
4708 104 40 196 120 -326 -108 -97 -217 -55 67 -104 -214 -7 66 135 -178 -253 -192 46 -44 14 -44 -199 -176 110
4732 110 19 148 13 -167 -285 -245 -186 60 -39 -30 -109 95 26 55 157 312 -176 37 -40 4 142 -117 202 -156
4756a56L3J31j37J02N4j44j7r4J07K56p5J79L2Q7k16j02K6j99q0p1L04n4J69n7
4780G8j24J76j53N3J33l05K00j69J65k5j8j26J01j30K9J07J8Q8m33J61l9L9K16
4803D2L9k27J91j52L20j37r0N0J01k11K3r4K89P7m16J85m9N9m1J02M5j60k52L60
4827E4k00K19n6L44j88m6j43MK95l39K40j96j3j01k8J73O1j53J64k43J89J55Q8
4850B80j96l95M15jk24L01m2N3j30R9J24m46K87k35n1K25J1j91J91j22l3M8J7
4873a5K40k08K1j10MM2Q0j71M27k43k95K79J12k52J9J47jn6J74J8j13k79L22j06
4897C6JL0M7m6QJ55k06K3p7j48J28K7J1R5j12L0j14J1m9J62O5j99N8K6K32q4l36
4924b26L44K2j91L9N7j50K43R0k52L5l90N14l51J45R9j16J50j03j41J86j46J55
$$ plain form
4756 -156 -123 8 -129 -27 27 -117 -134 -228 -121 135 60 239 271 358 142 40 66 -133 -213 -284 20 -34 135 78
4780 78 -46 130 -23 30 163 -142 58 -111 54 29 11 -115 -14 -144 -115 -8 10 98 -335 -174 -213 -174 42
4803 42 81 -146 45 -107 213 76 -14 36 137 -74 -51 -145 144 221 -195 -10 -59 0 -41 61 106 -54 -306 54
4827 54 -146 73 17 361 173 127 -16 -12 283 -56 184 -12 -25 -126 -154 19 80 -73 91 -152 37 192 280
4850 280 84 -311 104 103 -121 180 138 191 61 160 284 -162 125 -110 -161 64 75 -116 75 -47 -80 -32 -15
4873 -15 225 17 38 -72 -68 -26 54 -117 310 67 -228 51 163 -89 -70 77 76 20 194 212 99 -180 142 36
4897 36 37 67 114 68 76 231 25 48 -29 -177 -49 -22 -11 84 -28 2 -112 -101 -150 12 77 -122 -64 -38 194 110 -226
4924 -226 118 140 -51 -12 45 -105 138 228 -24 11 -379 135 -216 -71 28 -88 62 -41 -182 4 -142 13
4946A3J38q5k49K91k46M7j4j28M06m83M77j87K7k5p2R3k1P1J63m0k15K64l08M5
4970c8M9k4M9j08q0J08j96L35l51J86J24j3j27K33k67M0K23j86O9p9O8J85k05
4993en1K71o4K60m80mJ82j08Q7l12N3OK74k18J22rK8j27m9J39j73J55J13Q4m32
5018b58M41j70K54j92j49p3Q7k0j31L55l8k03m7J58L0R0j26K12j97K2q0j36L06
5041A35k26M1M3J23k40M15l14r3J26j12J55j78J55k48K80J51j32j17O4j48Q9p8
5063a09J0K7K36p9R9k83J60J61k92K17k65J79M1j08m1N9P2J12k30J19QM8k34M8
5087d5j73L12j79q3L56k64k7j3l4l0K39j8K2l23J99k57N76j38p0r6J57j68k11
5110b68K97O3M1l03q0J03M9R5J83Pl62J17J23k09L25n27L24J77k19J00J91j93
$$ plain form
4946 13 151 66 -183 108 -138 -91 -105 -233 173 -310 167 -20 7 -18 -90 3 -18 53 216 176 -39 225 -83 -38
4970 -38 11 -13 36 -72 -152 -44 -240 95 -256 -70 54 41 -86 147 -120 -80 143 -43 26 -53 15 200 -5
4993 -5 -56 215 151 411 -69 -73 109 1 88 -224 -171 -165 109 -109 13 4 32 -95 -144 -5 -178 -23 90 174 -258
5018 -258 183 13 267 75 -74 -147 -60 -80 -211 144 106 -97 -144 14 44 134 8 220 23 45 -35 -171 135
5041 135 -91 -50 -7 116 -124 291 -23 -116 10 -102 53 -125 30 -218 62 213 81 -36 28 -120 -31 -109
5063 -109 -99 -72 164 85 184 -99 61 222 -70 147 -118 61 102 -6 -47 12 84 196 -34 85 93 141 -93 -45
5087 -45 -218 94 -85 -168 188 -76 -103 -116 -150 -180 59 41 63 -260 -61 -318 258 120 50 -46 111 -57 -268
5110 -268 29 92 133 -170 -250 -147 -98 -3 180 187 -175 -58 65 -144 181 -346 -22 155 -64 36 227 34
5132C4p9M3JJ17j33j11L76r3j02M5p9J88k13N1J94j49J95l08K87j23p2k22mJ58
5156AJ63m4j51k35L28k21J41M12l49nK11m31L5N0k8K49m44L93m04L67K5n0l62
5179c49L40K37m17J78j16j61R5L64k25n3J32J82l59J89OJ75k83J09k7J36k84K15
5201H4j61o0K1R9m4R1l0j43P6O8L96k24n1N1j28k51J01M8J67m3j13Q8r9J46J22
5226B11l74J08k8l3P3j17J76N4R2j90K2J51J2Qq1k4M5k0k02J80r4p6J48pR3k20
5252i3n5K88K4m91M46j95l8K84j17lN6l74R4L80n7j03k18p3J08Q2j28k5L27l5
5276H4k82J43j7J6l2l6r8J54o9M8n3n8J35lJ07j95J92j56P1k71L73l85M86j7O6
5301B03r5j0o9m7J06j00J54l01K55l7j11J5j00n1L46m91K91k88N41k16k32L30
$$ plain form
5132 34 -45 -2 -1 116 -17 -128 248 155 53 98 19 207 -6 45 239 90 285 -23 264 141 69 -153 -157 1
5156 1 164 120 -31 -266 62 -159 -18 394 45 40 251 -180 -145 -95 -123 126 -318 75 -329 38 63 13 -349
5179 -349 -9 228 -189 -11 -127 -288 -193 171 -54 -107 25 207 -152 37 43 218 -65 44 17 153 -131 84
5201 84 -77 -137 -116 -17 -61 30 0 -143 -67 1 397 173 122 173 45 -206 -105 -57 110 67 -46 42 -57 89 211
5226 211 -163 -55 -83 -116 -43 -160 16 70 162 -28 -6 145 157 165 84 60 105 85 -117 63 -31 -107 41 34 127 -93
5252 -93 -148 140 164 -327 119 -76 -114 170 53 50 106 -268 -174 206 149 46 -172 -245 -137 -55 -183 -208 119 84
5276 84 -198 -55 -72 -56 -88 -124 -222 -68 -137 -89 -142 -200 -65 -68 39 -156 36 -120 -49 -320 53 -332 154 137 203
5301 203 108 98 29 -18 88 -12 142 -159 96 59 -52 -37 -137 -188 158 -333 -42 -330 211 -5 -237 93
5323I3m0N4Pj42l6R7K3k35K94j31M6l04J28M8R3L4l83J53M98l87J86Jm3m7l09
5348c02J26J12J18j26K74l85N29m55K62k07J20P0j12K16m17R2q3J07N13k64m5
5369A43j54j08L70l1q6r5j79J42J26J1j7j45l0o8m4K35J7K4M9j97j31K42M3j99
5393h2L36j16J53n33R6n8J20Lk2QJ17r5o4j8K09o6k19L32r8m3N5%K42j63J0p4
5419C0j06rm2mJ32q2LJ32j84K96j22L5l9j34J58p4k43K05k1J78j15k00N02j51
5443A45p1p4P7j5j10n5rj08K89Rmj40L23n1j89O7K3L4k13o6kJ75K70l52Q7P8k23
5470a05rL32j64j71R6K56l67M8J15r6J6J85J28o5j63J38k44K1J02k8O0j58L43
5493B70j27j93L8L5k3K6N8K26k31J7j67P2k5J06N1m0k32J38k01L55j10j04m9R0
$$ plain form
5323 93 53 107 114 -28 -64 33 56 -179 115 -16 30 -274 -146 -98 -5 29 -354 -201 297 -90 96 97 54 7 -302
5348 -302 -176 -64 54 -72 202 -183 346 -109 153 -54 66 136 24 240 -177 -85 -168 -61 452 188 143
5369 143 -11 -119 251 220 134 39 -140 2 128 139 122 -23 -53 -121 -165 70 87 111 160 -37 -168 74 117 -82
5393 -82 254 138 291 -242 -146 -204 -84 -81 -103 -95 22 -73 -137 -155 54 -12 -231 101 3 -40 15 15 257 94 104 30
5419 30 -76 -85 -127 -131 1 -81 -78 54 -130 166 44 79 40 -94 64 -10 -253 -48 -69 109 -6 -206 296 145
5443 145 74 0 77 62 -48 -103 -112 -220 69 78 74 -66 257 206 17 84 107 141 -72 -138 -140 35 305 -47 40 118 -105
5470 -105 -114 218 54 -117 -21 235 -132 -84 31 -65 -49 136 264 199 36 174 -70 -49 53 25 85 -73 270
5493 270 143 -50 -12 23 0 26 84 310 79 96 -71 1 -24 82 133 93 -139 -1 -202 153 43 -61 -110 -20
5517b0J5R3J07j72j01L11j65J5k98o0L90j88n2PL7P0J54l49J28J63p1k04R1mn2
5542a55K21j77J33k5K21q1p8J53l79K70n8j99K56m5k70J62j26k4J90n2n1J56n1
5565im1j56J91j83J86q7K41k2k97K14J02n2k48J17P1k11R7J93j04j32J93j54O0
5588c1J16op2P0L8k38K81j35L14j3K7k32j97K13l00l0K33k60J44K64k6k24J45
5611H1k3K55k10k37K96l08K40R1n2j54J68k84PK2L6Q4j47K86k03P3l1J2k2J33
5635A13j21j63R8pK52k56j3J61Nl5m4l2M2Pk53L63q2L4j43K84n6l11L03m6j24
5660b4m0K36p5k87J51J41r1o8o0P3J53Q4Lj77K64j21J43k84L04k05J79l02J54
5683A51j13l5jK25k03k27M37l46j01j4R0J6J44J07l42J18K67k87J47J95l14%J66
$$ plain form
5517 -20 -5 88 195 23 -78 233 68 83 -215 -275 115 -73 -125 -118 -81 -11 143 -206 -78 85 14 -190 -99 -103 -155
5542 -155 66 -111 22 -3 218 137 59 212 -167 103 45 -154 102 57 -213 -51 -177 -201 -11 -63 -114 42 -9
5565 -9 -50 -206 -15 -198 -12 -99 142 120 -177 37 139 87 -161 -44 27 -184 -87 106 2 -130 63 -91 -31
5588 -31 85 79 7 77 115 -123 158 23 337 324 351 119 -78 135 -165 -195 38 -222 -78 186 160 -64 81
5611 81 58 313 103 -134 162 -146 94 185 133 -21 147 -137 -130 -108 -72 12 -135 151 -52 21 -10 2 -20 113
5635 113 -8 -171 -73 -80 172 -84 -97 64 69 34 -10 -42 0 7 -246 117 35 69 -74 210 154 -157 146 100 -24
5660 -24 -64 172 97 -190 -39 102 11 -57 -117 -44 109 193 196 19 283 162 305 21 325 120 299 -3 151
5683 151 38 3 2 227 24 -203 234 -112 -213 -227 -137 -121 23 130 -212 -94 173 -114 33 228 -86 -86 80
5706H0nj0j17OJ72m31P7L46o2K27l54j78K03o2l6L22k60R9J67l64L95k17q9J88
5730I7k12O1J0O1M9k34K66p7Qj35L28k32l20L92o4j18K14K06l33J84L8k03P8O5
5754A29m43J13Q8k01L66j53J08k37J28O8j57M7J95Q8q5J5r1m1K26O4j36r4k07
5777b10J57J05j27P6j51J59j01J8J43j31N9r2J56n6N6lr9L25m29N8J29m09M74
5800A07O8m37J54K97m58J96J19k04p6M17k34PoQK02qm15M69j81j02J70n6K96q7
5824B46k41j42J1J61o2J2Q2k54M55k29M8k35L30j82p0J40J07k05J96m0k60K86
5846A54j60j51O9k5J08j83J29K9j20J30K7l0j53L69j91j22P2j09M24l69P5R3k
5869F4r9K3l56K91j8o6j01J10K35k02J21j66L03l12N4J52M7R2l6k64j35J64jj17
$$ plain form
5706 80 75 65 -52 -46 126 -305 -228 118 56 283 -71 -249 -46 -108 -144 178 -82 17 184 -180 215 -2 -91 97
5730 97 -115 -54 -44 17 66 -168 98 21 29 -106 222 -10 -330 62 -2 -120 94 300 -33 151 189 -14 64 129
5754 129 -314 -201 -113 -314 52 -101 7 -230 -102 -34 -191 -144 51 139 54 69 -22 -63 163 227 91 -3 -210
5777 -210 -53 52 -75 1 -150 9 -92 -74 69 -62 -3 -95 61 5 61 58 -41 284 -145 -87 42 -367 107
5800 107 175 -262 -108 189 -269 -73 46 -158 -234 183 -51 -44 -50 -42 160 152 -263 206 25 -77 93 37 333 246
5824 246 5 -137 -126 35 -27 -15 67 -187 268 39 87 -148 182 0 -70 70 177 -28 168 128 -132 154
5846 154 -6 -157 -88 -113 -5 -188 -59 -30 -150 -20 7 -23 -176 193 2 -120 -48 -157 267 -102 -27 66 64
5869 64 -35 -12 -368 -77 -95 -161 -262 -152 83 -119 2 -164 139 -173 -119 33 80 172 136 -128 -263 -99 -100 -217
5893b17K13J32k07J43K20l32K19k03l9L5Nj28J33j28p8J60J94j38k56M4M58k97
5915f7J71l41J03j6k4M64j38O0k26L1Lj07J73p6M8MJ59r7l11N7J80J8r9j31K08
5940D6q9j65J52Q4L1k3K66l26J21j05K28n29L31O7j39r3L8J90k2n3l54Q6L14J45
5964B01l78J01m3J8Q0J58l38K3M38j8k70k1n0J27R9Q6j40p2K56m69J28L53l84
5987a15k2J50o6K5J36j8K2Q3l34k5P7R7M1p2P7l1k75J32K26j01k35M2J51j78J18
6012i5K21m12L81n3k80K51J06j23j8J48k00K39j86o6J18j13K23Q1j44k59N8L55
6034B32j90K8k42J91p4J81k3J69k57L03k47j4r4L2Nk7K7p2p8K33k61j0M47m14
6058a55K41k70M28k10oN9Ln3P1J40k45j6J44k59J56R1J1o4k02R2n3m0J23J9J13
$$ plain form
5893 -217 -4 128 -79 64 284 -48 171 -32 -71 -36 -31 -159 -26 -154 -232 -72 122 -16 -272 -228 230 -67
5915 -67 104 -237 -134 -150 -174 290 152 212 -14 17 20 -87 86 10 58 62 221 124 -187 -130 50 68 -31 -162 46
5940 46 -43 -208 -56 28 59 36 302 -24 97 -8 220 -309 22 89 -50 -143 -105 85 63 10 -344 -258 56 201
5964 201 -177 -76 -119 -101 -21 137 -201 -178 260 242 -28 -49 -99 28 127 213 73 1 257 -212 -84 269 -115
5987 -115 -137 13 -53 -28 108 90 112 195 -139 -164 -87 10 51 -21 56 25 -250 -118 108 7 -228 -186 -35 -213 -95
6012 -95 126 -286 95 42 -238 13 119 -4 -22 126 -74 165 -21 -87 31 -82 141 222 78 -181 -123 232
6034 232 42 70 -172 19 -55 126 103 272 15 318 71 57 -37 -5 0 -27 0 -72 -150 83 -178 -188 259 -155
6058 -155 86 -184 244 34 28 87 90 37 108 248 3 -13 131 -128 28 119 130 66 -136 -44 -97 -137 -14 5 118
6083A18rLk02K3L7j10J02J53k6j69j6o8J23N7k3r0L3J48j10j81M45m19L78j94
6107Cq8K02j6pk0j62p6L58j56j77K98k73M2K34r1j90J00k4M2j24K71l6L7mk41
6132i8J66j51R9j14K86j79J33j07m0j71K31j47Lj53L17o1K07k80j6m5L23l56J49
6155dQ4%k58J45j98J84L8nP1J59m24J21K12m20K37J46k59J38J67k8l6n0L9J63
6179B22l36o0L87l74K05P2R5j06j8m32K27K98k89J13r6K05m7j0k73M57o1j52k19
6202a92J78R0j09Q4j49kk42L73J61j76j32K3L35k67L0r0J37l59K19O8J97R3k32
6225C8j90P0K23k71P2j20j17L28K36k64J96l2L0k51K34j36j9k0L2pJ97l18p6J32
6249c3p7N4N0J16j06K34r3l62K5K87j18j23L06k30J92o5K66k13m3l34L73j04J10
$$ plain form
6083 118 109 112 -90 -67 -30 -140 -38 115 89 -80 -96 -164 -41 16 -7 -97 -64 84 -26 -207 238 -181 197 3
6107 3 -85 117 101 94 74 -88 -164 194 38 -139 159 -114 -72 162 71 -119 -19 -43 -1 -125 146 110 147 143 -98
6132 -98 68 -83 16 -98 188 9 142 35 -5 -176 55 -92 -89 -242 75 14 221 -59 -75 -120 203 -153 -4
6155 -4 80 80 -178 -33 -231 -47 -9 -14 57 216 -208 -87 125 -295 -58 88 -171 -33 134 106 70 20 59 222
6179 222 -114 -174 213 -161 44 116 211 105 87 -345 -118 180 -109 4 -92 113 66 56 -217 240 179 27 -192
6202 -192 -14 76 -33 51 -98 -100 -342 31 192 16 -116 -93 242 -25 5 -85 52 -307 -88 -20 177 270 38
6225 38 -152 -82 141 -130 -58 -178 -295 33 269 5 201 169 199 -52 182 46 27 7 39 32 229 -89 -165 -33
6249 -33 -110 -56 -6 110 4 238 145 -217 -192 95 -23 -146 160 -70 122 57 323 110 67 -267 106 2 112
6272A12j61p3QP8j10j1J45K48l90J11N6j01O5L77j63k63K41j85O1J80l43k4J10
6295c2j55J79k30M24k78K72m0mJ34l81n8M77k18l62K52K17k89J30p1j46K79j47
6317d7N7m9j28J64l7L02k38lj19J69m0k6J28k0Jj34K3k09k3J38Oj66pK35m8J34
6343F3j5R4j61o3J54j16q7L37k76J63ol1j68j53M0J17J13o0o8J44J9l18M43j02
6367F3j02m7L93n81M59L2l0J5j82m4j1M5mq7R1j6L5j47R7l9P5k81K06q0J44K9
6393C3K26Pn5k74N4j18qK67j34n9j9L1j26K35J03L9j73po5j62N07n26K85M2j56
6418e3m1J25j87J20NJ1K47k15j89K86k62M3J61J90n1m59L81p4j75K69L9l1l43
6441b03J1K31J58k14K4M7j60L73j6j36m8k34K8J94q4J02J1j83J02j3J00q8R4q9
$$ plain form
6272 112 -49 -122 -114 -36 -146 -157 -12 236 -154 -43 13 -88 -23 354 191 -72 169 -16 45 225 -118 -142 -32
6295 -32 -187 -8 -238 186 -92 180 140 136 270 -111 -169 308 90 -272 -20 197 -92 38 -33 -179 100 -47
6317 -47 10 -39 -167 -3 -40 262 24 21 -98 71 31 5 133 113 114 -20 3 -206 -229 -91 -85 -251 -258 -23 -71 63
6343 63 48 142 -19 -82 72 -44 -131 206 -70 93 87 56 -112 -265 -225 -108 5 -55 -123 21 40 -278 165 63
6367 63 -39 -86 307 -274 185 217 187 202 20 -24 -35 10 6 -81 10 -6 29 -118 -21 -60 15 -266 -60 -140 4 33
6393 33 259 266 211 -63 -9 -127 -135 132 -2 -61 -80 -49 -175 60 163 202 29 22 -43 -205 302 -224 61 103 -53
6418 -53 -94 31 -156 -36 -31 -20 227 12 -177 109 -153 -110 51 241 190 -269 112 38 -137 132 171 140 -203
6441 -203 -192 39 197 -17 7 54 -106 267 251 115 67 -167 -139 55 -29 73 84 -99 3 -10 90 2 96 7
6465Gj62L99k56M9k4j34J44j43m8L0N7J58m53M81j3k71K90k03J61N3m3k4l1j36
6489a12j72M57N1N8j83j17j15k6K24l40L17R0k36K01j81K34k12N8q7L3J70j41
6511b9K4k8K50l7j99rl1N6j12J39l2r5L83j21k83o6J10k3nK4K3J9K70r2K05n68
6537b27J72m8K93m70J10J04K20j27O6k06N5K23r0k16J16N5kK46n67K76o0O2j36
6560a51J41j0j89j72L09J01kJ33k79K43j20n6j87Q9L41j73L91l75j71J8l1L73
6582B23m4m21K12K0M1k5Q0q1O9J66l88K46k79o5K54k27J23K16%k04K70k34L46
6605B98l68K57l07K65n06L52j4j05M62l13L5J01N1j29Q7j45O8M6l4J02q1j71j20
6628a69K07l2l3L0j75K75k11J69l3j56L4J63j60o9L70l02J22lJ44j78J82qp8k47
$$ plain form
6465 7 -155 244 -12 37 13 -121 23 -120 -168 -138 -81 77 -376 105 92 -179 111 -92 69 122 79 55 24 -112
6489 -112 -284 173 224 282 99 -18 -133 -159 65 -275 42 132 -104 97 -84 150 -62 -4 -91 -58 112 -29
6511 -29 -5 -33 217 180 -19 -28 -59 -3 -115 24 -8 -103 280 159 -124 -190 -80 -103 -108 -84 -61 -42 228 136 341 -227
6537 -227 -55 -103 190 -280 -170 -66 154 27 93 -113 -58 165 75 -141 -25 30 28 274 -293 -17 -77 -15 -151
6560 -151 -10 -20 -209 -381 -72 29 27 160 -119 124 4 -52 -239 -150 191 18 409 34 -137 -119 -150 223
6582 223 179 -242 -30 -10 31 6 86 5 74 240 -148 98 -181 -246 8 -219 -96 120 120 -84 186 -48 298
6605 298 -70 187 -120 145 -361 -9 -23 -128 334 21 56 157 208 79 166 21 89 135 101 203 122 -49 -169
6628 -169 38 6 -27 3 -172 103 -108 61 28 -128 -94 69 -91 -160 210 -92 30 27 171 -7 175 167 89 -158
6652a58J25J92k67L9J22j41K63j34j27J05J08P1j12J9k61K40k56L71r9r7Q4r8
6674a1L5j07J62j70j15J93j7mK71o0j43j04r1J23J3J94l45J86K5k51J92j80L16
6697A12m5k89K78j96J60P7nK9N7j72q3K92k13j61K59N4Q2j26J3k71j25K67q8L64
6721B70k05O3l72m0L83q8Q3j39k9R1P9j14o4P9n1m1L06l40nn4J44K4K19l67J84
6746A6j8m4j23Q7R1r8K87l94M87l89J70j25R9r7J05Q3P0k2j13N1r3n5J90l34K15
6771D6k64L47j32N1J00k79J16R4n7K05m03Q5n5j9J38J76K3m28Q4K43pM0j08P6
6795G2k81K1N1J03L03m08R1J45k02M4M5Q0p4Q0N8J5P4M8l03K19m8k07J8O2J30
6820A36r6l7k8k0L4j1J61j34rM6j18J34J58l44K59J03l81M35k18r9j9K11l55L51
$$ plain form
6652 -158 -33 159 -108 -69 53 -88 175 41 -86 19 127 198 86 105 -156 84 -172 199 100 3 87 -11
6674 -11 24 -83 79 -91 -206 -13 -30 -34 237 177 34 -70 -161 -38 -25 169 -176 10 35 -216 -24 -204 112
6697 112 67 -222 56 -140 20 97 92 121 178 6 -77 215 2 -159 100 154 236 110 123 -148 -273 -6 -94 270
6721 270 65 128 -244 -284 99 11 94 -45 -74 17 96 -18 -82 -3 -54 -95 211 -129 -134 -188 -44 -20 199 -168 16
6746 16 -2 -46 -169 -82 9 -89 198 -196 291 -98 72 -53 46 -51 54 137 207 185 72 123 30 -25 165 -169 46
6771 46 -218 129 -3 48 148 -131 -15 79 22 227 -176 -91 -146 -165 -27 149 172 -256 -172 71 64 104 -4 72
6795 72 -209 -188 -137 -34 269 -139 -48 97 -105 -61 -16 64 -10 70 128 143 217 265 -38 181 133 -74 -56 6 136
6820 136 40 3 -25 -45 -11 -22 139 5 -4 42 -76 58 216 -128 131 234 -147 288 70 -29 -48 163 -192 159
6844A59L5m02L57N9m82L41K7j78J1J48l93J61K83m37K67J05L2J09j26J52l29Q0
6866b1j05n9J95l19L34J54k86J14n8J97J07m76J44K2L05k55m7J07Oj92R7K01j94
6889b9J35j95J64lj64K63k57J35j66K03k85j92J19K45J14K97k24k57K42j84J71
6910A32k02J58r7J75j05k15N14l09k37J58r6o5L15q1pm2R2k34P3K38j1n34M25
6933D5o2L0O8k30l5K28j78J25K15l37q4L01j08l5J61k07J98L4l04K4K38M9rr4
6957C3L32l03O8K9q2J55j74J5k10R2L3m1K47n2j24K11R4k36K6k99K09J27k79J6
6981a13J12J6p2P5J07k48K79p9oL5k44M12k44o8j46J01K82L3j53k6J17j94j2J52
7005A16j78L7K1r6J73k0k3J06l43N4J43o5r6k93L90j7K23O7k30o3j76M10j08j19
$$ plain form
6844 159 194 -208 149 208 -274 67 94 -84 -73 75 -318 -157 126 -311 -44 61 93 202 76 228 -101 -21
6866 -21 -126 -185 10 -309 25 179 -107 7 -51 146 253 -223 -79 -57 248 -7 -54 53 59 -133 -36 165 -29
6889 -29 106 -89 75 72 -92 171 -86 49 -117 86 -199 -391 -272 -27 87 384 160 -97 145 -39 132
6910 132 -70 88 -9 166 61 -154 360 51 -186 -28 -124 -189 126 45 38 -4 88 -146 -73 165 154 -380 45
6933 45 -17 13 81 -149 -184 44 -134 -9 206 -131 -215 86 -22 -57 104 -103 95 129 -175 -151 87 136 127 33
6957 33 365 62 130 159 77 232 58 73 -137 -45 -12 -53 194 142 18 229 323 87 113 -186 23 150 -129 -113
6981 -113 -1 15 -57 18 125 -123 156 77 71 106 -138 274 30 -38 -184 -83 199 232 79 53 170 -24 -36 116
7005 116 -62 -25 -4 -100 73 53 30 136 -207 -153 -10 -75 -171 -464 -74 -91 132 199 -31 -94 -270 140 32 -87
7029h7j05J76j51L81l7m07K81j17J95m0k69J61N4QR1J04k90l9Q1k0R5K8%q9k21
7054b17L24k8q7p8K50k42K56k12N8J68k69J01j22R7o3K35r8K4m38M09O5q1m3j4
7078eo0k34L14J62m0l24J38J05o6k2KK56l83K07K70l57M17l99k5J57j81L10k61
7101a9L2O2k16J01mm4j11K79k44L00P7j10N0k54m8r2L54j73J1jJ59m17J58O8M6
7126c6q0k00L66j78Ok3R7M6j08K34K6j87J73K5K40m27M1j54K87p9q8Q1k66J6L39
7151A51k28J91J34k04J22k85M11j78n4J62j16K9J68m30Q3j13Q5J16L4j00k16M70
7173B32j72M1J49q2k10k21K96kk03L12J20l26m3L4Q6k33L13r6K1l4K29j00j17
7196fJ45j07PK5R3k68M40k47N6j97N1K9j89O04m35r8J41j01O0k11K25n9j02K5
$$ plain form
7029 -87 -192 -16 -167 214 177 -230 51 -66 129 89 -180 -19 35 43 134 238 -52 -91 -10 -30 65 93 93 4 -217
7054 -217 107 79 -8 -86 164 -78 178 -34 24 192 -77 24 -98 -1 -64 171 73 97 -341 68 133 52 9 -5
7078 -5 -65 -299 15 177 137 -187 -49 56 -10 -32 -30 226 -157 50 320 -37 380 -19 -44 113 -68 242 -19
7101 -19 13 75 -141 -40 -44 -88 -199 80 -164 136 213 103 153 -101 -149 -241 113 -60 -49 -50 109 -308 -150 -82 -36
7126 -36 -116 -316 50 -128 -122 -145 -48 -2 -110 124 150 -37 136 161 401 -26 15 -139 148 69 -19 62 -204 -188 151
7151 151 -77 114 248 44 166 -119 292 114 60 222 106 135 303 -127 -44 -157 -72 44 78 -22 -238 232
7173 232 60 101 250 168 -42 -263 33 31 -172 140 260 -66 -109 -75 11 -222 91 -5 16 -18 211 111 -6
7196 -6 139 32 39 64 157 -111 329 82 138 -59 -8 21 -168 436 1 -97 44 -57 3 -208 17 -42 -144 -119
7220a19J3j12Q9J68k3O6J77l82L18k62K11j70K51j69j04J59l78K94P4l15J84j43
7242a73J60Q4R9j71O0p4k08N15k85Rj58K6l2K24O1k63L21oj56l4K7J61nk70K21
7267A33k85J27PkQ7N9m63M25j48K28o7P1L2l00l9r6M09l98J14j64K37j1p9KJ04
7292a7j98L06k21P6J10J26j43K0k47q0Q7L49l27K69l38K37q8k04L28oJ36k49q3
7315a57L42j36l37J65n8K2l2M2K33j78J1q4J31o9K06m4Q8k37J21L1j3J49J12k58
7339E0j17L82l97J12J42j03P6j32o8K0R6j66Q2K84j72k6q2R9K35p7j97l64L26
7362CJ16J03j84n0J74k18J2l9K07k67O1K66k03j8K62l07O7N1j8J32l69N4jJ77
7386A1n2K36k37j20N9j04P9K55p4j6k9K9J03m3%J21l9n7k74K47j00N3k9j01K49
$$ plain form
7220 -119 -106 -218 -129 39 16 82 259 -123 195 -67 144 -26 225 56 -48 111 -267 27 101 -214 -30 -173
7242 -173 -13 71 170 -1 59 -15 -223 292 7 16 -142 -116 -148 76 137 -126 195 189 33 -1 26 187 182 -88 133
7267 133 -152 -25 -18 -20 67 126 -337 88 -60 168 101 172 204 -96 -135 -231 178 -220 -106 -270 -33 -44 -123 -121 -17
7292 -17 -215 91 -130 -54 56 182 39 59 -188 -268 -181 168 -159 110 -228 9 -79 -283 45 39 175 -74 -157
7315 -157 185 49 -288 -123 -181 -159 -191 -149 84 -94 -83 -167 -36 -105 101 57 145 -92 29 60 47 196 308 50
7339 50 -67 315 -82 30 172 69 145 13 -55 -35 61 -105 -23 261 89 63 -19 80 315 238 41 -323 3
7362 3 119 222 38 -12 162 -56 -44 -83 124 -143 -82 184 -19 -37 225 -82 -15 36 18 150 -219 -165 -166 11
7386 11 -41 195 -42 -162 -103 -207 -128 127 53 37 8 37 140 97 97 218 179 122 -152 95 -5 48 19 -82 167
7411A67Rk26p3R0L1J03l31J67J07K8j63N0P3k62K71J65k76L69l37j71K60m4J37
7434A44M4k46mJ63k19J30L29l78K5L8r4J30j36mJ94j70j15K89j48o5lj83N4J20
7458a05L4R3j95J3K73l59M27j18k8l2J10j94J00O2o3L0m7J25K0l94Q8J85Rj55
7482a21K9M8p1K53n00L44J28p0o8k54J72J90k8k81L41l24J23q6R2J79j73Q3m7
7505d1J96n6j65J90j36n7p2K19j72n7K56j29k5J04k41L24K05l99Kj31L43k07J03
7528E4J9j77Q2O0MR6j66K9J5K15m4m33K43j85K85O3k66K18k20n4K54K0j32l4P0
7553A6j65J01J47r0k06K10p5J00J64j45q1J29L4k46mJ07J58j57j2J95l94K27L4
7576D7j24k78M57k54J78J47pj79K55m52K10O3Q5l1k27P5n4L1J26j78K6L9O2K83
$$ plain form
7411 167 176 -50 -123 -33 -2 101 -230 -63 44 72 -91 -41 32 -230 41 206 -70 299 -38 -209 51 7 144
7434 144 188 -58 -62 101 -118 12 341 -37 -12 26 -68 62 -74 -78 116 -54 -169 120 -28 -93 -96 -279 -225 -105
7458 -105 -71 22 -173 -160 113 -246 181 63 35 3 113 -81 19 81 18 48 1 126 146 -248 -160 25 34 -121
7482 -121 -92 -44 -115 138 -362 -18 110 40 -28 -282 -110 80 52 -229 112 -212 -89 -175 -83 96 -77 6 -41
7505 -41 155 99 -66 124 -12 -69 -141 78 -94 -151 105 -24 -49 55 -186 138 343 -56 -54 -185 158 -49 54
7528 54 73 -104 -22 38 42 138 -28 1 16 231 187 -246 -3 -188 97 160 -106 112 -108 -162 92 112 -20 -54 16
7553 16 -149 -48 99 9 -197 13 -62 38 202 57 -24 105 139 -107 -111 -4 154 -3 -15 180 -214 13 47
7576 47 -77 -355 102 -152 26 173 166 -13 242 -210 0 63 148 117 -110 -35 -89 -58 68 -110 -84 -45 17 300
7600C00j31o9j91L1K04j93N7q7J09j92L5L13l4j40N9P4j55j32J88K08k66L9j54
7623a27L04j21K65m45L65k58K30R5r3q3j92K90l86J28J48P3l86K57j75J98N9j18
7645B8j00J89j06k00M1K24J09p1k77L29j94J0q1p2K78j60P2R8Jj85%j49M02j01
7669H5m7km0R2N2k59L4R0o0K04j63j45J58P9P1k84M8J6J30j35K6J03j22K11J07
7694B49l60L07q9L9q3j65R9k50K36N3m8n5K57l43J17o7Q3Q9r2q3l7O8L46l52J38
7719E7r4J17q0J33l02L64l65J91q4rN7m1kK15Lp4J26j29L0m8N1k08Q8j00J81m7
7745C0j10j50J05J90l4q7j74J85L43l85P4Ko5L40k08O9j3Q1r3o1j96K22P3j58
7769b0M2M0q9mj9j54J33J58j3o8P1o5J10k64oL19k39q5j7R8j9l0K50n2k25J08
$$ plain form
7600 300 169 100 -91 -60 144 -49 8 -79 30 -162 -127 186 152 12 71 145 -10 -142 46 254 -12 27 -127
7623 -127 177 56 321 -124 241 -17 213 308 215 132 -60 230 -156 -28 120 193 -193 64 -111 87 146 28
7645 28 -72 117 11 -189 -148 76 185 114 -163 166 -28 -18 -99 -171 107 -53 19 117 118 -67 -67 -216 186 85
7669 85 38 36 -4 88 140 -119 -85 5 -55 149 -14 -159 -1 78 149 -135 -87 -71 59 -76 -50 53 -69 142 249
7694 249 -111 196 107 146 63 -102 -3 -253 -17 36 -12 -67 190 -153 -36 -103 -20 69 -23 -106 -143 -75 271 -81 57
7719 57 -37 80 0 133 -169 195 -170 21 -63 -72 -15 -56 -58 157 160 86 212 83 113 65 116 -92 -4 -104 77 30
7745 30 -80 -230 -125 65 31 -56 -230 -45 298 -87 -13 -11 -76 264 56 125 112 193 100 39 -157 65 138 -20
7769 -20 22 62 -27 -31 -50 -204 -71 87 74 6 77 12 122 -142 -148 171 -68 -153 -170 -72 -91 -121 129 77 -148 -40
7795d0K18k29J45P1l81K50K7k4k8j34J58j44J0K09k73R6j89L85j98J07m6L7j26
7818i9O5k21L41J20k36O1n9K28j90lr4r2J97J04k21J05o1K18k44kJ75k28J05M06
7842C75m59j31J25k23N75j54k55R7p9J6L02k76L06m80J3N1J25J34n2L2j07q8J19
7865c4o1J93L36l14k04J54j60K6J74j26K83j90J6M7n5j06qO1N2k07R7P7k20J21
7889d8j20J41j2J9j85K80o5n4K6N7p6j44J65j29K3K26k52J52j58J33q0K3M8K11
7913A81k64J16J20l55J92k1J59k21P3K84j81k01J93o3J26j32J51j32M0q3j87J66
7935c9P7k7p0j67L74P1k04N9j16J03p8L2l01J29pK72k37O66n64P5Q8k13K21l32
7959a88K71j67K03j08j38K70l00J99o6J55l33K88j01j12J53j40K58k23Q9J9rj09
$$ plain form
7795 -40 178 -51 94 165 -216 34 61 37 9 -125 33 -111 -101 108 -165 -69 -258 127 -71 36 -10 27 -99
7818 -99 -34 -255 86 206 -30 31 -28 200 10 7 -87 -179 18 122 -99 6 -55 163 -81 -83 92 -136 -31 375
7842 375 -84 -215 -90 -313 262 108 -147 -50 -129 -113 189 -87 219 -261 -248 -197 -72 62 10 42 -65 -153 -34
7865 -34 -95 98 434 120 -84 70 -90 -64 110 -16 267 77 93 140 85 -21 -29 32 84 -123 -26 51 -169 -48
7889 -48 -168 -27 -39 -20 -205 75 10 -44 -18 39 -37 -181 -16 -145 -122 104 -148 4 -154 -21 -101 -78 -30 181
7913 181 -83 33 153 -202 -10 -31 128 -93 -20 264 83 -118 75 12 138 6 157 25 65 -18 -205 -39
7935 -39 38 11 -59 -226 148 219 15 74 -42 61 -17 15 -286 -157 -164 108 -129 537 -27 48 136 -77 144 -188
7959 -188 83 -84 119 11 -127 143 -157 42 -24 131 -202 86 -15 -127 26 -114 144 -79 10 29 20 -89
7981h9L38k37K17r3j15k1Q9j88j08L23k31k%R8P5rj51R1J5o7J64k68L82j61q3
8006c1qj43P4M2m3J74k1K11m10L43k43Q5j8Pq2J73k50J78k6r6J03Q6l73L15j67
8031a20Q2L3m5J5OP1P8j33Q2k47NJ55Q0j98Q3m6j15L16j22J90n3n3l4j12j2K18
8057A24j32J18n2J37l64K05J9k30m9K05k3p4J32jj14J2M0N6R8j45J27k45J54l0
8081c2K13l61K60j49J20J69j80l14L31L1R5k4k89J05K41m37K42j38M3k34K56J1
8103d1j45J85K9j18R0p4J61p4j60J19L2J30o1N4j56N6J22q0o2j80L07O5k65QJ86
8128A28k86L26k02r0K69J29m13N6J23J34m03J42K31k96J00J54k42j17M80j09l29
8149b15N6L32j78j27J03j42K16j45J78P0k58J44M7l1nj95l7L00k02OL25p1p7j24
$$ plain form
7981 -89 249 12 229 136 21 0 89 -99 -207 116 -115 -117 -117 -19 56 47 -104 -13 2 -65 99 -169 213 52 -31
8006 -31 -39 -182 -108 -66 -109 65 44 255 -155 188 -55 30 12 19 -63 110 -140 38 12 -84 19 105 -268 47 -120
8031 -120 -38 -5 -50 -35 -29 42 120 -13 69 -178 -173 -18 62 -136 -53 -99 -214 102 -20 170 117 64 30 -82 -94 124
8057 124 -8 110 58 195 -169 36 55 -175 -224 -19 -42 -116 16 15 -99 -87 -47 9 107 -38 89 -156 -2 -32
8081 -32 181 -180 80 -69 51 220 40 -274 57 88 183 159 -130 -25 216 -221 21 -117 -74 -308 -52 -41
8103 -41 -186 -1 28 -90 0 -74 87 13 -147 -28 4 134 73 127 -29 27 149 69 7 -173 134 199 -66 -58 128
8128 128 -158 168 -34 -124 145 274 -139 -83 40 174 -229 -87 144 -152 -52 102 -140 -257 223 114 -215
8149 -215 -159 173 -5 -132 -29 -171 45 -100 78 148 -110 34 81 50 45 -150 -187 113 -89 -83 242 171 94 -30
8173c0J23q2j52K63q0j03q8k9J72KJ70r7J1N7j20J45j52j22
$$ plain form
8173 -30 93 11 -141 122 42 -61 -149 -178 -6 -4 166 69 80 137 17 162 10 -112
8191a12
$$ Imaginary data points
##PAGE= N=2
##DATA TABLE= (X++(I..I)), XYDATA
0@%%%%%%%%%%%%Qj6J6j6K4l2L2m0N2o0P2q8J04j20J37j61J88k13K44k82L20l62
34a93M10m62N21n84O53p30Q13r04J005j114J231j361J503j657J826k012K219k446
52a282K695k973L281l627M021m470M991n602O326p203Q295r696J1567j4211J8257
67A0369k5292M0985j41764M1075J65882j88889K1843J36853p6432j39270J23813
78c0827Q0882p9786r955R4603j6996m1777K9991J7771n0453J928N5143J1412n7664
91D272j2498L7708j5722m4868N4935M5016q9828n2842Q7536J7189o7431L4066
103b467M3390p7610j3627Q6957j4684n0112N5931k362q6964M5620Q7830o5992
115E910m1341R3133N894r5003J2812N5935m3857k8575O5365L8593l6447m0745
$$ plain form
0 0 0 0 0 0 0 0 0 0 0 0 0 0 8 -8 8 -8 16 -16 16 -24 28 -32 40 -48 56 -64 73 -88 100 -113 131 -151 169 -193
34 -193 217 -245 276 -308 345 -385 428 -476 529 -585 646 -715 788 -869 957 -1055 1164 -1282
52 -1282 1413 -1560 1721 -1906 2115 -2355 2636 -2966 3360 -3843 4452 -5244 6323 -7888 10369
67 10369 -14923 26062 -115702 -74627 91255 -97634 -75791 61062 -15370 -154640 -30827
78 -30827 50055 -29731 -39686 54917 37921 -3856 26135 43906 -6547 -4619 50524 61936 4272
91 4272 -8226 29482 13760 -31108 23827 68843 -20985 -73827 13709 30898 -36533 -2467
103 -2467 40923 -36687 -50314 36643 21959 -28153 27778 25416 -61548 -15928 71902 5910
115 5910 -35431 57702 63596 -31407 -18595 37340 -6517 -35092 30273 68866 32419 -8326
127h326j3571j509J401J0464L0612J3469l2917k0929J4880o286j0767K5930K189
140D640k5420K5925K6113m1220j2798M0617j3348l0403L5389J0423m7336M142
152b3276L4216j7618m171K6291k9109l2624L8416J8319l1051J6391L0931l2587
164e872j9268M0775J4430k5009N2J2623o345o594L957P596N799q692j2899M510
178E063n573k4784J829K0252k613J63J1386j8181k3634J2416O195r352K2339J8979
192A4485k3079n415K2861r293j3613K3657O132k1155J1681J6879j8130N25K3904
205B9439j1175j9811J3877K901k1903N527K1350o036j1175N660k490j5111o091
218a5038M776N867J133j782M478Q50j2889k862J3405j398r384J2260P525j2552
$$ plain form
127 -8326 -21897 -23406 -22005 -11541 19071 32540 -377 -21306 -6426 -12712 -23479 2451 4640
140 4640 -20780 5145 31258 -9962 -22760 17857 4509 -25894 9495 19918 -27418 -23276
152 -23276 10940 -6678 -10849 15442 -13667 -46291 -7875 10444 -20607 -4216 26715 -5872
164 -5872 -25140 15635 30065 5056 5108 17731 11386 4792 8749 16345 22144 13452 553 5063
178 5063 -510 -25294 -23465 -3213 -5826 -5663 5723 -12458 -36092 -23676 -17481 -26833 -4494 14485
192 14485 -8594 -14009 8852 -441 -14054 9603 15735 -5420 6261 23140 5010 5535 29439
205 29439 18264 -1547 12330 15231 -6672 -1145 20205 14169 2994 8654 6164 -8947 -15038
218 -15038 -10262 -4395 -3262 -5044 -566 284 -12605 -15467 -2062 -3460 -12844 -584 6941 -5611
232e611O714J9509j2140j4769J3766K94j6081J1692J7021j7137r592J5639m240
245E065j6210P441N033j3300J461J4418k338q249L611K295k356M278M249n565
259a67p017l31P258Q487J933k698m877r623o432P584N333m545M321Q375m259l956
275f14M013r019j2959J0128J6309M44K455N000j3743j3318J0300O468r439K010
289a965Q629m399k049J0080l839j7117j742J0072L674K282N082m054j1179j15
303f640R512L458n979k806J598k271j052N790K77j0499m35J2286K347p450r06
318b770l326r473P300J9764L041r554j111j613q600K632R870l492m727R217P837
333A4995n007o578o337j0653j055J3449J1714j89m935o046n780o01L281J033k367
$$ plain form
232 -5611 1103 20612 8472 -6297 7469 7763 -8318 3374 20395 3258 -6334 9305 5065
245 5065 -11145 -3704 1329 -11971 -10510 3908 1570 -6679 -3068 -773 -3129 1149 5398 -167
259 -167 -7184 -7515 -257 8230 10163 7465 2588 -7035 -13467 -5883 -550 -5095 -774 7601 3342 -614
275 -614 3399 -5620 -18579 -8451 7858 8302 10757 15757 2014 -11304 -1004 5464 -3975 -1965
289 -1965 6664 2265 216 10296 6457 -10660 -12402 -2330 1344 3626 8708 4654 -6525 -6640
303 -6640 2872 6330 351 -2455 -857 -3128 -4180 1610 1887 -8612 -9047 3239 5586 -1864 -2770
318 -2770 -6096 -15569 -8269 11495 14536 4982 3871 2258 -6342 -3710 6160 2668 -2059 7158 14995
333 14995 9988 3410 -2927 -13580 -14635 -1186 10528 10339 5404 -642 -6422 -7023 -3742 -2709 -5076
348e076N33N580N590j407p030o627n476K775J1081O682m133n087j225p38L202
363a356P773l07p292J795O644j077o55J536m740l694Q338O763p737q659l721l970
379a0359J470J0790N299o219o253r76j156j259J758J966J581M139P750K798o948
394D381j0041k856K803M405Q189N455o092p511J484N37m535p1K018j712K922R850
410I226J437p813l794j059M5M575N662j004k583j004k55Q02L95l500l868J697
426a041J625r32L18k448m554Q78N114N74k514k745n144k742N628O177J295q3j347
443a941l467j562N91J33L110M517J535L497L852n285p104K612L179j192K824M910
459A0209m442m615J847j061m432j478k798m160K383M462j205O58J581m084l568
$$ plain form
348 -5076 -4543 1037 6627 5220 -1810 -8437 -13913 -11138 -57 6625 2492 -2595 -3820 -4558 -1356
363 -1356 6417 6110 -1182 613 7257 6180 5525 7061 2321 -1373 6965 13728 5991 -2668 -6389 -10359
379 -10359 -8889 1901 7200 981 -5272 -6248 -7404 -8663 -6905 -4939 -3358 781 8531 11329 4381
394 4381 -5660 -8516 -5713 -1308 6881 12336 6244 -1267 217 754 -3781 -3852 -1834 -3546 -624 9226
410 9226 10663 2850 -944 -2003 -1958 2617 8279 7275 4692 3688 3433 4235 4630 1130 -2738 -1041
426 -1041 584 -348 -30 -2478 -7032 -6154 -1040 -466 -2980 -5725 -10869 -13611 -7983 -1806 -511 -594 -1941
443 -1941 -5408 -6970 -6379 -6246 -3136 1381 2916 6413 10265 4980 -2124 488 3667 2475 5299 10209
459 10209 5767 1152 2999 1938 -2494 -3972 -6770 -10930 -8547 -4085 -5290 -4632 -3051 -7135 -10703
474a0703K898L067K532N684L863J079K724l46m086K242M688k352q46L458j604
489A2298m088J16m21k535j603m511n777J266K564l282K287O827n385r742P47K452
505h787j683M401O931k63k064j985l219J933N610j170k628M929J131n351J754
520d61N102j003j111J551k276l138p10j620L017Q691N03p397l049k761m847L134
536f375P714J718q39k8m709o28N786k809o989N360N673n243k21P261k881q475
552e685K63K488l047j947J87K811P128J102o299k741j1l782L461J3917N340n239
568G946l219j614j072M546L729j677k94j71n973k471L684k085m425L447J643m735
584b741m133m199l645P935R999j336j831K165p396o662J0720J0755l006j667M387
$$ plain form
474 -10703 -7805 -4738 -2206 3478 7341 8420 11144 10798 6712 8954 13642 11290 10444 13902 12298
489 12298 8210 8326 7905 5370 3767 -744 -6521 -5255 -2691 -5973 -3686 3141 -2244 -11986 -11239 -8787
505 -8787 -10470 -6069 862 599 -1465 -3450 -6669 -4736 874 -296 -2924 2005 3136 -2215 -461
520 -461 4641 3638 2527 4078 1802 -1336 -2046 -3666 -649 8042 8545 1148 -1901 -4662 -9509 -6375
536 -6375 1339 3057 2218 2190 -2519 -3147 2639 -170 -7159 -1799 3874 -1369 -1590 5671 2790 -5685
552 -5685 -5422 -2934 -5981 -7928 -7741 -4930 2198 3300 -2999 -5740 -5751 -9533 -6072 7845 13185 7946
568 7946 4727 3113 2041 6587 10316 8639 8345 8174 2201 -270 3414 1329 -3096 351 1994 -2741
584 -2741 -6874 -11073 -14718 -6783 3216 1880 49 2214 -5182 -11844 -1124 9631 6625 4958 9345
599I345r0j548J476j773l163l01o97K048N421o31q053j682Q99m485l402N8j464
616h042K097O169p59n403l122p267m920R496J1451r06l198J49m546j213P870L888
632A744l34K254K30l264K742L014m807P2P389k37n524j815m062m680M440P060
648D222P80j719l720p088o80O097J912l70K659K26j266L227J439l876k182m65
664h04p90M314M314l213k099J610k822m918J153J78l451N064Q171r58l725j424
680F00n722k856P859O598r16l8j126n445l55L834l34j916J178q99k352J144k68
697a014k283J547K693r38q89j431m214P5M631K451J113J423m172m870K018K646
713a214p73J448K617j842N00L997j346l086J214q38j821L440L652k265m49J741
$$ plain form
599 9345 9255 7707 9183 7410 4247 3946 3249 5297 10718 10087 2034 352 1251 -3234 -6636 -6578 -8042
616 -8042 -5945 224 -535 -5938 -9060 -16327 -21247 -11751 -300 -1206 -4404 -4255 -8801 -10014 -2144 1744
632 1744 1410 3664 3894 630 3372 6386 1579 1651 9040 8803 3279 1464 -2598 -7278 -2838 4222
648 4222 5002 3283 -437 -7525 -8205 -2108 -196 -566 2093 2319 1053 4280 5719 1843 -339 -804
664 -804 -1594 2720 7034 3821 1722 3332 510 -4408 -3255 -3077 -6528 -1464 6707 5749 2024 600
680 600 -5122 -7978 -119 6479 5563 5525 4399 -1046 -1401 2433 2099 183 1361 462 -1890 -746 -1014
697 -1014 -3297 -1750 943 5 -884 -2315 -6529 -6454 -1823 628 1741 3164 -1008 -5878 -3860 -1214
713 -1214 -1987 -539 2078 236 736 4733 3387 301 1515 677 -1144 2296 5948 3683 3234 4975
729D975k723l827k09j685j439K899L347j263q43j401m553j368L576K045J056J517
745A04O35q61R68L45K06J584p76k169J999J462k060N66L160k117l248P98j228
762f32l566K286L937q11L72J850k710l814J920Q99j296J791K587j498j501on20
779g12p34j08j295l03R62k7O91K053M79k316k38R1m27P49K263j50N06K140n82
798C042k028J61j272k644J471K613n01j52J211r76j288J096l39k924O37K326Q59
815A292K509K134k690l721q04k10p3J665J310o88m8L23j882j240j775j182J935
832c145L124J070m79q3k063j051K541J339j425m03P94o86Q66K303r07k640N91
849b54Q36j79N63J81k013Q5K840J665J92q67k752k401N56J517M44m7L64j063J28
$$ plain form
729 4975 2252 -1575 -1784 -3469 -4908 -2009 1338 75 -768 -2169 -6722 -8090 -4514 -2469 -1413 104
745 104 739 -122 846 1191 1397 2981 2205 36 2035 3497 1437 2003 5163 3046 -202 596 -632
762 -632 -4198 -1912 2025 1214 1586 3436 726 -3088 -1168 -269 -1565 226 2813 1315 -186 -192 -712
779 -712 -1446 -1554 -2849 -3152 -2190 -2217 -1526 527 1006 -1310 -1548 -1457 -1884 -1135 1128 978 1484 3624 3042
798 3042 1014 1175 -97 -2741 -1270 1343 842 690 1901 925 -363 733 394 -2530 -1893 433 1292
815 1292 3801 5935 3245 -476 -1280 -1490 -1563 102 1412 724 676 999 -883 -2123 -3898 -5080 -3145
832 -3145 -21 1049 570 487 -1576 -2627 -86 1253 -172 -575 219 -467 399 2702 1795 -845 -254
849 -254 582 403 966 1147 -866 -781 2059 3724 3916 3049 297 -2104 -1548 -31 413 366 730 -333 -205
868b05k48k288l200l77J034L292M416P72k353k333o14J35J931K968L94M59J762
885E545M39j643j472k841k066J582K872K05j398j714l258j355K334P48j687q6
901c795L45m07J341K392j055j561J207J586N10M43p93j994O36K220K135O03j082
918B731k965q11P39N07N04J278m53K12K027l16l636k087o57j64K728L966P0k856
936H17j393k211j349J513J311k28J472K831n47j011m62k028k047K626L152J18
952B564l33j181j944mJ316j26r31k36n28P8K471Q34j100J67P85K09J183O16j461
971B379l66J768m3N05R65j844l637J00q5j977o87M51j129l43K161j066k882k07
989e937j359l63L405L791L22j9N48j166j278J184R99M89J931J415l77k25j446
$$ plain form
868 -205 -453 -2741 -5941 -6318 -5284 -1992 2424 3196 843 -1490 -2104 -1969 -38 2930 3324 3783 5545
885 5545 5984 4341 2869 28 -2038 -456 2416 2621 1223 -491 -3749 -5104 -2770 -2022 -3709 -3795
901 -3795 -3450 -3857 -2516 -124 -1179 -2740 -1533 53 563 1006 213 -1781 -1145 1075 3210 3813 2731
918 2731 -234 -1045 -306 201 705 1983 1530 1742 3769 3453 -183 -2270 -2927 -3091 -363 3603 3673 817
936 817 -576 -2787 -4136 -2623 -1312 -1540 -68 2763 2216 1205 743 -1285 -3332 -706 2446 2564
952 2564 2231 1050 -894 -898 418 292 -639 -875 -1403 -1325 1146 1980 880 1047 1832 2041 3224 3840 2379
971 2379 2013 3781 3738 4243 5208 3364 -273 -173 -258 -2235 -2922 -2471 -3600 -3943 -1782 -2848 -5730 -5937
989 -5937 -7296 -7659 -4254 -463 -141 -160 388 -778 -2056 -872 127 616 2547 3962 3585 3360 1914
1006A914k833j19J436l06p5O41j336j256R31K72j209m6j139j768J913K077n07
1023a410L18J917j157k100J342J235o73K133K432n38P29J366j777n12J956l84
1039D877j785Q91N65j753J12J072j444k115j091j816j123J294P67M26J528r44
1055e39k274k65O57k14K018J998o17J01O66j603n81J668o11k617Q65J311k311
1072b348N5K761o38j801N28n73k173J320J951Q61K616J378k109k549L51l32L33
1089c69K926O90j139p70p10j327M75l50j597L33R29j049r7J543p66j311J398r6
1107a287j507N09J105o78K180K367j659k203J135j38o80L009J722k440n37J675
1123B573l61N45J426r11k411k12j64n52J016M22n78k00n10k731j824m6k7K156
$$ plain form
1006 1914 -919 -1038 398 92 17 658 -678 -1934 -1003 -731 -1940 -1986 -3125 -4893 -2980 -903 -1410
1023 -1410 -1092 825 -332 -2432 -1090 145 -528 1605 4037 3499 4228 5594 3817 3305 5261 4877
1039 4877 3092 3983 4548 2795 2907 3979 2535 420 -671 -2487 -3610 -2316 -1549 -1123 405 -539
1055 -539 -2813 -3078 -2421 -2635 -617 1381 764 865 1531 -72 -653 1015 404 -2213 -1348 -37 -2348
1072 -2348 -2293 468 -170 -1971 -1443 -2016 -4189 -2869 -918 -57 2559 3937 1828 -721 -370 -702 -369
1089 -369 2557 3247 2108 1338 628 -699 -224 -574 -2171 -1838 -909 -1958 -2055 -512 -1278 -2589 -1191 -1287
1107 -1287 -2794 -2285 -1180 -1858 322 2689 1030 -1173 -38 -176 -856 2153 3875 1435 898 2573
1123 2573 2212 2757 4183 3272 861 649 485 -67 949 1371 793 593 83 -2648 -4472 -4518 -4545 -2389
1141b389L915nk399m69j200r93L026L577m75m0J476j050j227J271o88k469J040
1158I01J082j133j87N13j789j237J251j052j276L68J96l95K326J741j920r94J41
1175a464n40J052K115j45j889J86j09J75J943L48k068m63M99j713P71K109M26
1192A233k43J825m11k483j292j84j65K577L466j044j828q59j828j682J873J655
1208F10n23J84O84p86r7O27j814p26J466J92j52J275J14j620J92L01j099m77j45
1227a794q17J194K039n10r93M76l87j040J769K149j126l33O03l43K23J816l3j849
1245A044J96n87j790P32J223o22j19J273m04k344p51m16J92K068J786j29k7n09
1263H16k105k69J303J8LR40J63n61M91n29j521J81O6p42J136J249l09o97J713
$$ plain form
1141 -2389 1526 1521 -878 -1347 -2547 -3540 -514 3063 2588 2548 4024 2974 1747 3018 2330 -139 901
1158 901 1983 850 663 1176 -613 -1850 -599 -1651 -2927 -2559 -2363 -2758 -432 1309 -611 -1605 -1464
1175 -1464 -2004 -952 1163 1018 -871 -685 -794 -619 1324 1672 -396 -859 -360 -2073 -1302 807 1233
1192 1233 990 2815 2404 -79 -1371 -1555 -1720 857 4323 3279 1451 592 -1236 -2918 -1045 610
1208 610 87 271 955 169 72 699 -1115 -1841 -375 -183 -335 940 1054 -566 -374 -73 -1172 -1649 -1794
1227 -1794 -2611 -1417 622 112 -881 -405 -792 -1832 -63 2086 960 627 1230 887 1110 2926 2893 1044
1245 1044 1240 653 -1137 -405 818 196 77 1350 946 -1398 -2149 -2565 -2373 -305 1481 1352 1325 816
1263 816 -1289 -1558 -255 -237 -234 706 869 308 799 270 -1251 -1070 -1004 -1746 -610 639 330 -367 1346
1282A346Jj721K58L31q97Q95J462m86o83J46j254j229J272O5j106L14N84m01M17
1301f86J019l23k04J1k53j77J319L37j83J319L72j509n66o8j246L32J327K46n11
1320E56O56o59j424K79J00m34L90J285o92r2J084k77j202M76n61j004K35Q16q1
1339e49K97P68r61p91J97o21q5R61O03K50P44P10r41l44r9n23P3P66J60j62L80
1360H33r0j238L80j57j233M1J722j32O48J070m77j517L65L33o34O19O95m17m45
1379C66N65o87r62j98n05o73L16N72n81M35J89L62J15Q54o59n86Q20O95L31J606
1399B375K16p07o6Q9r69o90N31l41P9J135J58r77p06q81r70K14J105j6K88Q49
1419G16m57o36J30m33j117N21R43K0J171M36j043r12N67R6j45R23J98n68R65M39
$$ plain form
1282 1346 1347 -374 -116 215 -682 213 1675 1189 506 652 -602 -1831 -559 -494 -1600 -1286 -702 -1103 -686
1301 -686 333 10 -194 -183 -436 -613 706 1043 860 2179 2551 1042 476 408 -838 -506 821 1067 556
1320 556 1212 553 -871 -592 -492 -926 -536 749 57 -35 1049 772 -430 46 -515 -1519 -1284 -468 -549
1339 -549 -252 516 -445 -1236 -1039 -1660 -1745 -784 -181 69 813 1523 582 238 139 -384 -311 455 615 453 833
1360 833 743 -495 -115 -272 -1505 -1464 258 126 774 1844 1367 -150 215 548 -86 533 1228 811 366
1379 366 931 244 -718 -916 -1421 -2094 -1778 -1206 -1787 -1352 -1163 -801 -686 168 -491 -1077 -257 438 769 2375
1399 2375 2591 1884 1818 1907 938 248 779 438 517 1652 1810 833 127 -754 -1724 -1510 -405 -421 -133 716
1419 716 259 -377 -247 -680 -1797 -1276 -333 -313 858 1294 251 -661 -94 2 -143 780 978 410 1375 1814
1439A814p86m72M53j077q8N29n14q30R4q2m90R36k02j229o67K07L5Q57J388J98
1459G4l26O13J44n45M6N6j38N33J476n7n44m43j654n91K64M10l55O76L01j62K1
1480b01N43r21o39N28M93R12J159K16p66n06kn61L26R6m67J62K17k54m06j88l34
1501e93p71K96J059o53j84N57j06N83J071j93p85K5l09m81J061J106q04K85N44
1520A708l92r72N0M0q5O03R42n97J53n24j220k52J60p24J31K25m01k1K94k24j257
1541b363j69J96l31J094J150K88l77N30K48q85R13M24j56O35R10o83o77K14q40
1560A21l16J85k64j246L46j04k70M74J095p01m90O0j07L0J070Q14J15P32q9j205
1580B50o9O72p99N66P18k70o53O59n40n06K98q1q87M92Q14p34N90J071m81o73
$$ plain form
1439 1814 1028 556 1009 -68 -156 373 -141 -971 -877 -959 -1449 -513 -715 -1944 -2611 -2404 -2369 -1512 -124 74
1459 74 -252 361 505 -40 6 62 -76 457 1933 1876 1332 889 -765 -1356 -1092 -682 -1037 -361 -60 -222 -201
1480 -201 342 -579 -1218 -690 -197 715 1874 2090 1324 818 816 255 581 677 210 372 589 335 -71 -259 -593
1501 -593 -1364 -1068 -9 -662 -846 -289 -395 188 1259 1066 281 306 -3 -484 577 1683 879 1164 1708
1520 1708 1316 344 394 434 349 952 1894 1297 1450 926 -294 -546 -386 -1110 -979 -754 -1155 -1176 -882 -1106 -2363
1541 -2363 -2532 -2336 -2667 -1573 -423 -135 -512 18 266 -619 294 718 562 1197 2107 1424 747 961 121
1560 121 -195 -10 -274 -1520 -1174 -1278 -1548 -1074 21 -680 -1170 -1110 -1217 -1187 -117 697 812 1544 1455 250
1580 250 181 853 54 620 1338 1068 415 1074 534 28 326 245 -642 -150 664 -70 520 1591 1110 437
1600D37j56o94o00P87Q65L1J66K80j369o88M22l95L11P01L62m07J05L26n25N6
1620A5J37m91l56O30k54j55P38J30p29l16l86n62K47J218K80K08Q99p33p43M13
1640A90K67l03Q69K42m55m63O49r91k45K94m21r03M26o1p96O18N72l25k14L32
1660g18o92l9Q15M32Q52O90O6p20k47P1l43L37M46o77n9Q77m20k67K30n01r66
1681h33O70J81l63N93J101n13k34Oq27o42L99K65J33M98M51j162n73o8mJ43P93
1702A4l8l13J55M59m36L63L37o57O4M28n79p0M93R1k98K37k89r90j97K76k68Q46
1724c72J115o19q01Q00nq07Q61K32k39J30O72j16J75n8r97o83K11K09j52N66M96
1745F18j2qk43o63n06M48K90P22J112k21j015k07J17q16L49M24k54o22N15m21
$$ plain form
1600 437 281 -413 -1013 -226 639 670 836 1116 -253 -941 -519 -914 -603 98 460 53 158 484 -41 15
1620 15 152 -339 -695 -65 -319 -474 264 394 -335 -651 -1037 -1599 -1352 -134 146 354 1253 520 -223 190
1640 190 457 154 1023 1265 810 347 996 5 -240 54 -367 -1270 -844 -905 -1701 -1083 -511 -836 -1050 -718
1660 -718 -1410 -1449 -634 -202 650 1340 1406 686 439 510 167 504 950 273 214 1091 671 404 634 133 -833
1681 -833 -163 18 -345 248 1349 836 602 608 -219 -861 -462 -197 -64 434 885 -277 -850 -918 -922 -779 14
1702 14 -24 -337 -182 277 -159 204 541 -116 -52 376 -203 -273 220 311 13 250 -39 -1029 -1226 -950 -1218 -372
1724 -372 743 124 -677 123 118 -689 172 404 165 295 967 851 1026 968 -29 -712 -501 -292 -444 122 618
1745 618 606 598 355 -308 -814 -366 -76 646 1758 1537 522 315 432 -384 -35 389 135 -487 28 -393
1765c93m62O53p1q60M34J80n50L81O27lk80Q48j77r88O5N6q5L89K77r2l77J59
1787b69l98j45N11k78N1M75J88K98O07j16l21q6n7k56M12N85n9k45N13o21j269
1808d80J65J4n38M32P69K7o77K63l67m34N26L66n05L29N50m25L58J83k76p44L35
1829a29k19k06L56O4k33O09K26m23l46P5k46L5Q67j3k19Q0Q2m94N8j03n65pN13
1852b38m19K46P22l42o63N82l21k93L02R48J40j0J002p00o51K77j46l87L49K86
1872F84l35j14P5m55k28m2l06j56N10j61L57L35J61k87J59q2m30K01L16J18j86
1893A34O10k54n85q5J31r64J78M80k16Q9P60k10p78K52p4j0L60M11k36L90K64
1914F47l41M1j85n41N1K05K69j42L09R0m16P7k14l48m6O37k2l44Q02j86o37Q4
$$ plain form
1765 -393 -855 -202 -273 -1133 -699 -519 -1069 -688 -61 -64 -344 504 327 -661 -596 -540 -625 -236 41 -51 -428 -269
1787 -269 -667 -812 -301 -579 -528 -53 135 433 1040 924 603 517 460 204 616 1201 1142 897 1410 789 -480
1808 -480 -315 -301 -839 -407 362 389 -288 -25 -392 -826 -300 66 -439 -110 440 15 373 556 280 -464 -129
1829 -129 -348 -554 -198 -134 -367 242 468 45 -301 -226 -472 -437 430 417 198 278 360 -134 -76 -179 -744 -751 -238
1852 -238 -657 -411 311 -31 -694 -112 -433 -726 -424 524 664 654 1656 956 305 582 436 49 398 684
1872 684 349 235 310 -145 -373 -415 -721 -877 -367 -528 -171 164 325 38 197 115 -315 -114 202 320 134
1893 134 744 490 -95 -180 -49 -1013 -835 -355 -571 -482 278 68 -710 -458 -532 -542 -182 229 -7 383 647
1914 647 306 347 162 -379 -328 -123 146 4 313 403 -13 64 -150 -498 -544 93 71 -273 529 343 -294 -210
1936b10N2q45K37L36k95j1Q67k37k62J13j24k75j6J056K05L37L80k3m69K19k37
1957G98k50R0o8k59N26l31j70n11j44l80j06M09l7j8L09K95l29M09j61Q6j0L26
1979D74J0j05M10l80rL85k77l52j45P1n46O0Q59l57l00N9j37k56J55O0m42Q14
2001E1l8K82n5l1m56n47K44N5r9N53j6j39K73l58j88j34L12l6J15P10J95o21K9
2024A01r6j82j11M85m61L4J26R1k29N63p04j09J48L79j91L36N65k68K79J04j19
2045G41n62K48M1k89j51M97n36L6r4m34Pl2j5m20N05M71K3J54L67m12k18L18k56
2068a1L85N70j3l77L4J2n89L0j14l59L19K38k50j86J34r1m34K98J56k32M99p5
2090e6k83O88r3l30m16L29l81L1K53L93k34j11M51n11L5K38R0r6J83K08k19O5
$$ plain form
1936 -210 -158 -1003 -766 -430 -725 -736 131 -106 -368 -255 -379 -654 -670 386 591 928 1308 1285 816 1035 798
1957 798 548 638 570 311 837 506 336 -175 -319 -699 -805 -396 -433 -451 -142 153 -176 233 72 158 148 474
1979 474 484 379 789 409 400 785 508 156 11 82 -464 -404 455 98 -202 -143 -280 -536 -381 -321 -763 51
2001 51 13 295 240 209 -247 -794 -550 -495 -594 -41 -57 -196 77 -281 -469 -603 -291 -327 -212 498 693 72 101
2024 101 5 -177 -288 197 -264 -230 -104 -13 -242 321 -383 -492 -344 35 -156 180 745 477 756 860 741
2045 741 179 427 468 179 28 525 -11 25 -69 -503 -496 -528 -543 -963 -458 13 36 190 557 145 -73 245 -11
2068 -11 374 944 931 554 588 600 11 41 -73 -432 -113 125 -125 -311 -177 -268 -702 -404 -248 -480 19 -56
2090 -56 -339 349 256 -74 -490 -161 -542 -511 -258 135 -99 -210 241 -270 -235 3 93 -3 180 388 169 234
2112B34J52j39r4M5n04j01L49J07K3K71n7n03k84Q1L6K98L71jO8M23l28l98L39
2135C88l54k58M26j43o6P3l2m88P1J63m02k15K54K26j71M97R6p4PJ49m21L45K84
2158C55N8J17K13m19k61j17j2m57J45L05l92L65J90k12l92L68J23k06J99L90j07
2179B53N62p4m53p1%l76k12M89m2O9J55J23m76n6J11l76L78Q6n8O3K21K31m55
2202I2K01P6l66j73j86J6K68Pn1l96J54j64m6m7K66O7M24J16k20p8J53j49L60
2225C24k1J00Lj20j29R5j52Q4m08k25L01J7j26M43R9j6J05l50k69K33L11k82K76
2248B93K32l07l37M10l97N8j8k34k18L14N8j80Q3K62j79j68M13j12k08M71K29
2269D65p6J57l21k56m02K83l11L01K58R6l02p4J07q53O15K79M0q0L98K02k83J36
$$ plain form
2112 234 386 247 153 198 -306 -407 -58 49 72 343 286 -217 -501 -420 -384 -86 285 284 352 775 447 49 388
2135 388 34 -224 202 59 -7 66 34 -454 -383 -220 -622 -837 -583 -357 -528 -31 65 -9 -2 147 -274 71 355
2158 355 413 530 743 324 63 -54 -66 -523 -378 -73 -465 -100 90 -122 -514 -146 -23 -229 -30 360 253
2179 253 815 741 288 217 217 -159 -371 118 76 145 300 423 -53 -109 2 -374 4 90 32 95 316 547 92
2202 92 293 369 3 -170 -356 -340 -72 -65 -116 -512 -358 -522 -568 -615 -349 -282 142 258 38 -40 113 -36 324
2225 324 303 403 406 286 157 252 100 184 -224 -449 -148 -131 -257 186 285 269 374 24 -245 -12 299 17 293
2248 293 525 218 -119 291 -106 -48 -66 -300 -518 -204 -146 -326 -243 19 -160 -328 85 -27 -235 236 465
2269 465 389 546 225 -31 -433 -150 -461 -160 98 194 -108 -182 -75 -928 -313 -34 6 -74 324 526 243 379
2291C79J31m52K92j44j59K39J69k86QJ10k29m80L48j33MK81j20K3K04J83n7k70
2313D1P6k22K57n9Kj3o5J2l92J38l2m68K61L45n6jK87o1k65R5J7k08J77M24l3
2338B57k90K97l23o2k40o2N6J39J48j65K05J14Kr1K10k46l4L79L37m91J67L58
2360F65m76j1k86K20l83J23j68j80K37p7P5k99K86j77N9M28q7L6N19k45O1k78
2382D2K05m06J67L52j70Q6j17k66k65qk14K01K24Q1lL24o9k53J57j77J53j02K25
2405A67P0n5M0P1m35J80M8m09K69j07j6L43K4k08j48L38o4j26l4K70j63J35N6
2428B46j94R9q9k27K5J88o3k00J94K56k50j04K43j82q9K65r3J36J90K4k39J14
2450B50j61Kl26J80l48p4L15n2l8k41P2O4L5Q6R1M5L45L02m45K64l6m79M27j49
$$ plain form
2291 379 510 58 350 206 47 286 455 169 177 287 58 -422 -74 -207 -203 78 -42 -19 185 368 311 41
2313 41 117 -105 152 93 95 82 17 29 -363 -225 -257 -725 -464 -119 -175 -176 111 50 -215 -120 -103 -311 -134 290 257
2338 257 -33 264 -59 -121 -361 -423 -367 -228 -80 -245 -40 74 76 -15 195 -51 -85 294 631 140 307 665
2360 665 189 178 -108 112 -271 -148 -316 -496 -259 -336 -261 -560 -274 -451 -392 36 -51 -15 504 259 320 42
2382 42 247 -159 8 360 190 276 159 -107 -372 -380 -594 -393 -169 -88 -91 233 164 -89 68 -109 44 -58 167
2405 167 237 182 222 293 -142 38 86 -323 -54 -161 -177 166 190 -18 -166 172 108 -18 -52 218 55 190 246
2428 246 52 151 62 -165 -140 48 -15 -215 -21 235 -15 -119 124 -58 -147 118 25 161 351 375 136 250
2450 250 89 91 -235 -55 -403 -477 -162 -214 -252 -493 -421 -357 -322 -236 -145 -100 245 547 102 366 330 -149 278 129
2474A29m3M9J5l08k4J06j05l78K14j3Q8J70k01O38l24P7J14k59K4K17j22L91j95
2497B60J2k54l1m2k32K37q1J63K29k16L4J59l6l29L35j5k79K61J7R8q7L7k61k83
2521c04K68k46K74L6k04Q2K05l86J97Q9%K89l49M37j07k0j03Q8j85k21J04m2m0
2544a38K50j78k63J46j1l86M00n1j25K5N28j70L8J16k77J60O4K29j61J61k79m1
2566C7j86K61L7n61K21p1j39J06M68l21J36p3J69M6j60mJ00NO8q1L6Pj23K3K2
2591B3k05J94J65j6k39K00j57j08J31J80o0j31K25j18j9L28j47m03J18j53o2J53
2613a01Q7m6l5K53j87k66K60j50J28K97J33r4j88L31r7k0j84k80Q5K28m67L81
2635F8k60n6J2Q6L2m16L31J27j60R4K39K10m76K77j55q4L19k39L5J56l8p1k16
$$ plain form
2474 129 86 135 150 -158 -182 -76 -181 -559 -345 -358 -270 -100 -301 337 13 90 204 -55 -31 186 64 455 260
2497 260 272 18 -13 -55 -287 -50 -131 32 261 45 79 238 202 -127 208 193 -86 175 192 290 203 240 -21 -304
2521 -304 -36 -282 -8 28 -176 -94 111 -275 -78 11 11 300 -49 388 281 261 158 246 61 -160 -56 -98 -138
2544 -138 112 -66 -329 -183 -194 -580 -180 -231 -356 -331 197 27 65 181 -96 64 128 357 196 357 78 37
2566 37 -149 112 149 -412 -191 -262 -401 -295 173 -148 -12 -85 84 130 -30 -34 66 71 139 58 94 101 -22 1 23
2591 23 -182 12 177 161 -78 122 -35 -143 -12 168 108 -23 202 84 65 393 246 -157 -39 -192 -254 -101
2613 -101 -14 -60 -95 158 -29 -295 -35 -185 -57 240 373 279 91 422 325 305 121 -159 -74 154 -313 68
2635 68 -192 -248 -236 -150 -118 -534 -203 -76 -236 -142 97 307 -169 108 -47 -131 188 -51 -16 140 102 31 -185
2658a85O4M6j34K60j53K1K28o3J54k13K69j92J4J29K36k09o0J94j64j85j36P4
2680ej58Q5Q0J28j5k46K0K59j25rK53k06%pJ48k09M9o2k62k16O01m17J66J17j52
2705a83m8q2L94l93j25L81Mo8L67J43l26J20K6l30j37J95k92J85K97l59J77N6
2727Bj18k65K18J64k56L76L87k36j05lM1k1j18R0K1J34j12l13Q8Q9n6j73K24j11
2751e3j43J75j01N8P3M4K4L0j04R1q7J84mk44KK25n20N9K25k69pK74o1j99K00
2776a28l7j05J67J4J88n7J08M9P3R7j63m01L29k05J23k5k41K03l1k10m3J13J51
2799c1k84K99J47J52j62J6N2j99J0J39j10l32L06K1q3j0M5k29j64K17j03K28J11
2822C6j61K29J61j98l00R7J82n8K8M4j88K81j80Mp4j36J78l93J27N19o1J5j34
$$ plain form
2658 -185 -121 -75 -209 51 -102 -81 147 84 238 25 294 102 116 245 481 272 212 406 242 57 -79 -5
2680 -5 -163 -78 2 130 115 -131 -111 148 23 14 267 61 61 54 202 -7 42 -20 -282 -498 103 -314 -148 -31 -183
2705 -183 -231 -313 81 -312 -437 -56 -52 -120 247 390 64 184 210 -120 -257 -62 -354 -169 128 -231 -54 2
2727 2 -116 -381 -163 1 -255 121 508 272 167 164 205 184 66 156 177 311 199 -114 -26 63 7 -166 58 -53
2751 -53 -196 -21 -122 -64 9 53 77 107 3 94 7 191 187 -57 -55 170 -350 -291 -66 -335 -342 -68 -129 -328 -128
2776 -128 -165 -270 -103 -89 99 42 150 199 272 369 206 -195 134 -71 52 27 -214 -11 -42 -252 -295 -182 -31
2799 -31 -315 -16 131 283 121 137 189 -10 0 139 29 -303 3 24 -59 -69 -24 -253 -417 -200 -303 -75 36
2822 36 -125 104 265 67 -233 -136 46 -12 16 60 -128 153 -27 -23 -97 -233 -55 -448 -321 198 137 152 18
2845A8K7J01L0k81j24M76j51L62k16k3k63l7J01j0k23O3J58l58M2K92l11J58P9
2868i0R7j90L96k69M47L1l15LJ36k89J1M9P9r6j9k45N8m3K78o4l8J10J4K66l58
2893d1J29J5o2k10M15r4K81l24r5n8J98n96L67k73J27K48R3j38n2K57O8l75L52
2916B32j65j82J58N9o4q8J29q5P5l66J24k39K27J6K7j2K16o9q0R0j03M9K71O1
2940B81l02J91j02j11m7j06J33Kj54mL07j17j7M7q5K24k02N8P1l8n3J24J31j71
2964F0J12O4m82K42j12j09K18O8nj41J86m57J85R1J27J27j56J49k31K18J42k17
2986G9k93M53m62J45K02j34jL14l14p7j10L44j50K2L5n0M8K29o1l32M1R3J84j3
3010A92m2q2Q7k37J12k25q9K7m8L21J0r2J93o0K2M6j45J01J8L50o08J91J60m54
$$ plain form
2845 18 45 146 176 -105 -229 247 96 458 242 219 -44 -81 20 10 -213 -150 8 -350 -308 -16 -327 -169 -90
2868 -90 7 -183 213 -56 391 422 107 110 246 -43 -32 17 96 0 -19 -264 -206 -249 29 -35 -73 37 51 317 -41
2893 -41 88 103 41 -169 246 152 433 109 14 -44 154 -442 -75 -348 -221 27 120 -18 -70 187 255 -120 232
2916 232 67 -115 43 102 38 -50 79 -6 69 -297 -173 -412 -185 -169 -142 -154 62 -7 -87 3 -100 -51 220 281
2940 281 -21 170 68 -43 -90 -196 -63 -61 -215 -219 88 -29 -46 1 -84 140 -62 -4 67 29 -24 100 231 60
2964 60 172 236 -246 -4 -116 -225 -7 61 56 -85 101 -356 -171 -80 47 174 18 167 -64 154 296 79
2986 79 -214 239 -223 -78 124 -10 -11 303 -11 -88 -198 146 -4 18 53 3 51 280 219 -113 -72 21 205 192
3010 192 150 68 155 -82 30 -195 -284 -257 -305 16 26 -66 127 67 89 135 -10 91 109 459 -149 42 202 -252
3034b52K18qr9Nk00J79k82L78J15j42J95l0l57K99j42J16K11J29j34l69L25K60
3056D15k06l23k9j5R4j16K41k49Q4n2J85j55K46M0q2K5J32l66K38j01J1J27J5
3079A59j35J6j73P7j6L7j07k15N70k05J25J28k38j2o5K05j08j02K32K4m2j78J74
3102A51k8l22J62j28J03J8J68r7O8m2j1q4K81j77n3L88l54M2J81r5l07M09m31
3125a58j01n7M19p9j54K51k94J30j72L34k7j25J54K52j48j15P1l1n5Q8j78O7j21
3148d9j75J51j26K23j51rn8K24j86K13j05qO1k37M44J4l24J39j28K03j9j95O4
3171c4K06k88L9P1n6J1l19J90K22k4j32J78N2j38o5%Q0M03j63j04k58K00j82k55
3195c66L80J01k60K00j14n6Q1J42o4m4jJ73J36j61q9j92N7RJ74j40J3k26K98k83
$$ plain form
3034 -252 -34 -42 -141 -136 -336 -157 -439 -61 54 -88 107 77 -280 19 -123 -7 204 333 199 -170 155 415
3056 415 209 -114 -143 -158 -64 -180 61 -188 -104 -156 29 -126 120 160 78 103 235 -131 107 6 17 144 159
3079 159 24 40 -133 -56 -72 -35 -142 -357 213 8 133 261 23 11 -54 151 43 -59 173 197 155 -23 151
3102 151 123 -199 -37 -165 -62 -44 124 27 95 53 42 -42 239 62 9 397 43 85 266 171 -136 273 -158
3125 -158 -259 -316 103 24 -130 121 -173 -43 -215 119 92 -33 121 373 225 110 181 150 95 183 5 72 -49
3148 -49 -224 -73 -199 24 -127 -136 -194 30 -156 57 -48 -56 5 -232 212 226 -98 41 -87 116 97 -98 -34
3171 -34 172 -116 -77 -6 -62 -51 -370 -180 42 18 -114 64 116 -22 -87 -87 -7 396 233 129 -129 71 -111 -366
3195 -366 14 115 -145 55 -59 -115 -34 108 44 0 -1 172 308 147 58 -134 -77 -68 106 -34 -21 -247 51 -232
3219b32J60O0k72L64j98r3K87R5n9K2mm0j1J81j03l01P5j15L05k66O5R8k10j24
3243c16K73K7JO7l07K23j19K62qr5l9j03r5J97K50j37l40L58j27n0N5j18L3KK38
3268A32k65N3J83l03K43J37m28J95n0L40k1j07J5K2l99N9L9J22L5J19MN0k6j71
3292b2k6K29j52n8M16j42M9k20j16m5K77l35j68J69J9L5J01J1k07K85jjj45K6
3316b1K36l58M30p3j19R3j85K94o38L44k51J90L9l8k76K23J52k07J73o7J07L8
3338H6J74k57J61j65J56J8j42j24K1Mj40K4J0J12K89k24O6j75K7rJ42j10rK05
3362A40k22J04Q5J05j56J0k5o9K15j32j12l3k51J68J03L6J63j13J19j62L4L47
3384C54k82p3k7R8J40k83J06o5o2k5N2l28L16qm1R9k03J08N9Q7j60K10M4j00P6
$$ plain form
3219 -232 -72 -12 -284 80 -118 -211 76 171 112 134 130 90 79 260 157 -144 -69 -184 121 -145 -80 18 -192 -316
3243 -316 -43 -16 -15 52 -255 -32 -151 111 103 8 -31 -134 -229 -32 218 81 -259 99 -28 -78 -23 -141 -108 -106 132
3268 132 -133 -80 103 -200 43 180 -248 -53 -103 237 216 109 124 146 -253 -194 -155 -33 2 121 125 175 149 -22
3292 -22 -48 181 29 -29 387 245 294 74 -42 -87 190 -145 -313 -144 -125 -90 11 22 -185 100 99 98 -47 -21
3316 -21 215 -143 287 214 95 188 3 297 -341 3 -248 -58 -19 -57 -333 -110 42 -165 8 -59 48 86
3338 86 260 3 164 -1 155 173 31 -93 -72 -68 -208 -184 -174 -62 227 3 69 -106 -79 -88 54 -56 -65 140
3362 140 -82 22 107 212 56 66 41 -28 187 55 -57 -90 -341 -173 -70 -34 129 16 135 -27 7 354
3384 354 72 -1 -28 70 210 -73 33 -32 -94 -119 -67 -395 -79 -87 -128 -29 -232 -124 -65 22 -138 72 116 16 92
3409I2m9p1P1k15J79k6J27k0L0K1l51L0M6QJ19k4N8Q0k96K03J40O3l50K77l9J91
3435B94O9p3j40j53k22R7J34p4J9k79J76o5P0J85j6N0P1n1j97J18J99k12J51K2
3459A73mk76k69L96k17J14K57m42J78l5M3o1K41k39M69j76mj6M9k70K26j28OO2
3483G7Q7j51J67k49j36L17j88J11l1J41k65p2J67r9j30K91k9J49J16l77J17K06
3505B19l81j61K63N4J04j41J03j28mR1q1J25K0m9j14J49n4J73l90J12K97l43k1
$$ plain form
3409 92 43 -28 43 -172 7 -19 108 88 118 139 -212 -182 -136 -128 -9 -33 25 105 -191 12 152 215 -135 142 103 294
3435 294 363 290 150 -3 -225 -128 6 -68 -49 -328 -152 -217 -147 38 22 72 143 92 -105 13 212 0 151 173
3459 173 169 -107 -376 20 -197 -83 174 -268 -90 -125 -82 -143 98 -141 328 152 148 132 181 -89 137 9 15 77
3483 77 164 13 180 -69 -205 112 -76 35 4 145 -120 -192 -25 -124 -254 37 8 157 273 -104 13 219
3505 219 -162 -323 -60 -6 98 -43 60 -68 -72 19 -62 63 83 34 -80 69 15 188 -202 -90 207 -136 -157
$$ [...]
8191H2
##END NTUPLES=NMR FID
##END=
