##TITLE=1H_LR-758-R4-KA5-CR12
 CDCl3
 8 sc, 
 29.12.2023
##JCAMPDX= 6.0         $$ Bruker NMR JCAMP-DX V2.0
##DATA TYPE= NMR FID
##DATA CLASS= NTUPLES
##ORIGIN= UXNMR, Bruker Analytische Messtechnik GmbH
##OWNER= root
$$ XWIN-NMR		Version 3.5
$$ Fri Dec 29 13:59:34 2023 Russian Standard Time (UT+4h)  she@DPX200
##.OBSERVE FREQUENCY= 200.1313
##.OBSERVE NUCLEUS= ^1H
##.DELAY= (6, 6)
##.ACQUISITION MODE= SIMULTANEOUS
##.ACQUISITION SCHEME= undefined
##.AVERAGES= 8
##.DIGITISER RES= 18
##SPECTROMETER/DATA SYSTEM= spect
##.PULSE SEQUENCE= zg30
##.SOLVENT NAME= CDCl3
##.SHIFT REFERENCE= (INTERNAL, CDCl3, 0, 15.7039)
##AUDIT TRAIL= $$ (NUMBER, WHEN, WHO, WHERE, WHAT)
$$ ##TITLE= Audit trail, XWIN-NMR		Version 3.5
$$ ##JCAMPDX= 5.01
$$ ##ORIGIN= Bruker BioSpin GmbH
$$ ##OWNER= she
$$ F:/spectra/data/she/nmr/H-F/1/audita.txt
$$ ##AUDIT TRAIL=  $$ (NUMBER, WHEN, WHO, WHERE, WHAT)
(   1,<2023-12-29 13:57:53.60 +0400>,<she>,<DPX200>,
      <created by zg, POWCHK disabled, PULCHK disabled
       configuration hash MD5:
       00 E9 B6 7A A2 85 ED C7 34 08 36 98 17 FE 4E 26
       data hash MD5: 16K
       09 55 3C BA D9 FE E0 A6 BF E8 9D DF 8A 35 7B 8F>)
$$ ##END=
$$ 
$$ hash MD5
$$ 83 32 45 D4 37 DA 78 C4 5B 30 D3 2E 94 2B 80 CC
##$RELAX= 
##$RELAX= 
##$RELAX= 
##$RELAX= 
##$RELAX= 
##$RELAX= 
$$ Bruker specific parameters
$$ --------------------------
##$DU= <F:/spectra>
##$EXPNO= 1
##$NAME= <H-F>
##$PROCNO= 1
##$TYPE= <nmr>
##$USER= <she>
##$AMP= (0..31)
100 100 100 100 100 100 100 100 100 100 100 100 100 100 100 100 100 100 
100 100 100 100 100 100 100 100 100 100 100 100 100 100 
##$AQSEQ= 0
##$AQ_mod= 1
##$AUNM= <au_zg>
##$AUTOPOS= <>
##$BF1= 200.13
##$BF2= 200.13
##$BF3= 200.13
##$BF4= 200.13
##$BF5= 200.13
##$BF6= 200.13
##$BF7= 200.13
##$BF8= 200.13
##$BYTORDA= 1
##$CFDGTYP= 0
##$CFRGTYP= 5
##$CHEMSTR= <none>
##$CNST= (0..31)
1 1 145 1 1 1 1 1 1 1 1 1 1 1 1 1 1 1 1 1 1 1 1 1 1 1 1 1 1 1 1 1 
##$CPDPRG= <>
##$CPDPRG1= <>
##$CPDPRG2= <>
##$CPDPRG3= <>
##$CPDPRG4= <mlev>
##$CPDPRG5= <mlev>
##$CPDPRG6= <mlev>
##$CPDPRG7= <mlev>
##$CPDPRG8= <mlev>
##$CPDPRGB= <>
##$CPDPRGT= <>
##$D= (0..31)
0 1.2 0 0 0 0 0 0 0 0.06 0 0.03 0 0 0 0 0.0002 0 0 0 0 0 0 0 0 0 0 0 0 
0 0 0 
##$DATE= 1703843872
##$DBL= (0..7)
120 120 120 120 120 120 120 120 
##$DBP= (0..7)
150 150 150 150 150 150 150 150 
##$DBP07= 0
##$DBPNAM0= <>
##$DBPNAM1= <>
##$DBPNAM2= <>
##$DBPNAM3= <>
##$DBPNAM4= <>
##$DBPNAM5= <>
##$DBPNAM6= <>
##$DBPNAM7= <>
##$DBPOAL= (0..7)
0.5 0.5 0.5 0.5 0.5 0.5 0.5 0.5 
##$DBPOFFS= (0..7)
0 0 0 0 0 0 0 0 
##$DE= 6
##$DECBNUC= <off>
##$DECIM= 32
##$DECNUC= <off>
##$DECSTAT= 4
##$DIGMOD= 1
##$DIGTYP= 9
##$DL= (0..7)
0 120 120 120 120 120 120 120 
##$DP= (0..7)
150 150 150 150 150 150 150 150 
##$DP07= 0
##$DPNAME0= <>
##$DPNAME1= <>
##$DPNAME2= <>
##$DPNAME3= <>
##$DPNAME4= <>
##$DPNAME5= <>
##$DPNAME6= <>
##$DPNAME7= <>
##$DPOAL= (0..7)
0.5 0.5 0.5 0.5 0.5 0.5 0.5 0.5 
##$DPOFFS= (0..7)
0 0 0 0 0 0 0 0 
##$DQDMODE= 0
##$DR= 18
##$DS= 0
$$ [...]
##$SUBNAM2= <"">
##$SUBNAM3= <"">
##$SUBNAM4= <"">
##$SUBNAM5= <"">
##$SUBNAM6= <"">
##$SUBNAM7= <"">
##$SUBNAM8= <"">
##$SUBNAM9= <"">
##$SW= 18.0517328524113
##$SWIBOX= (0..15)
0 0 2 0 0 0 0 0 0 0 0 0 0 0 0 0 
##$SW_h= 3612.71676300578
##$TD= 16384
##$TD0= 1
##$TE= 0
##$TE2= 300
##$TE3= 300
##$TEG= 300
##$TL= (0..7)
0 120 120 120 120 120 120 120 
##$TP= (0..7)
150 150 150 150 150 150 150 150 
##$TP07= 0
##$TPNAME0= <>
##$TPNAME1= <>
##$TPNAME2= <>
##$TPNAME3= <>
##$TPNAME4= <>
##$TPNAME5= <>
##$TPNAME6= <>
##$TPNAME7= <>
##$TPOAL= (0..7)
0.5 0.5 0.5 0.5 0.5 0.5 0.5 0.5 
##$TPOFFS= (0..7)
0 0 0 0 0 0 0 0 
##$TUNHIN= 0
##$TUNHOUT= 0
##$TUNXOUT= 0
##$USERA1= <user>
##$USERA2= <user>
##$USERA3= <user>
##$USERA4= <user>
##$USERA5= <user>
##$V9= 5
##$VALIST= <valist>
##$VCLIST= <CCCCCCCCCCCCCCC>
##$VD= 0
##$VDLIST= <DDDDDDDDDDDDDDD>
##$VPLIST= <PPPPPPPPPPPPPPP>
##$VTLIST= <TTTTTTTTTTTTTTT>
##$WBST= 1024
##$WBSW= 4
##$XGAIN= (0..3)
0 0 0 0 
##$XL= 0
##$YL= 0
##$YMAX_a= 178799
##$YMIN_a= -190729
##$ZGOPTNS= <>
##$ZL1= 120
##$ZL2= 120
##$ZL3= 120
##$ZL4= 120
##$ABSF1= 10
##$ABSF2= 0
##$ABSG= 5
##$ABSL= 3
##$ALPHA= 0
##$AQORDER= 0
##$ASSFAC= 0
##$ASSFACI= 0
##$ASSFACX= 0
##$ASSWID= 0
##$AUNMP= <proc_1d>
##$AZFE= 0.1
##$AZFW= 0.1
##$BCFW= 1
##$BC_mod= 2
##$BYTORDP= 1
##$COROFFS= 0
##$CY= 11.3945322036743
##$DATMOD= 1
##$DC= 2
##$DFILT= <>
##$DTYPP= 0
##$F1P= 15.7292609196834
##$F2P= 12.9074282941183
##$FCOR= 0.5
##$FTSIZE= 0
##$FT_mod= 4
##$GAMMA= 1
##$GB= 0.15
##$INTBC= 1
##$INTSCL= 1
##$ISEN= 128
##$LB= 0.24
##$LEV0= 0
##$LPBIN= 0
##$MAXI= 10000
##$MC2= 0
##$MEAN= 0
##$ME_mod= 0
##$MI= 1.114404
##$NCOEF= 0
##$NC_proc= 0
##$NLEV= 6
##$NOISF1= 3.799351
##$NOISF2= 2.8
##$NSP= 1
##$NTH_PI= 0
##$NZP= 0
##$OFFSET= 15.70392
##$PC= 1
##$PHC0= -24591.6
##$PHC1= 12.05273
##$PH_mod= 1
##$PKNL= yes
##$PPARMOD= 0
##$PSCAL= 0
##$PSIGN= 0
##$REVERSE= no
##$SF= 200.130013532006
##$SI= 16384
##$SIGF1= 3
##$SIGF2= 2
##$SINO= 400
##$SIOLD= 16384
##$SREGLST= <1H.CDCl3>
##$SSB= 0
##$STSI= 0
##$STSR= 0
##$SW_p= 3612.71676300578
##$SYMM= 0
##$S_DEV= 0
##$TDeff= 0
##$TDoff= 0
##$TI= <>
##$TILT= no
##$TM1= 0
##$TM2= 0
##$TOPLEV= 0
##$USERP1= <user>
##$USERP2= <user>
##$USERP3= <user>
##$USERP4= <user>
##$USERP5= <user>
##$WDW= 1
##$XDIM= 8192
##$YMAX_p= 0
##$YMIN_p= 0
$$ End of Bruker specific parameters
$$ ---------------------------------
##NTUPLES= NMR FID
##VAR_NAME=  TIME,          FID/REAL,        FID/IMAG
##SYMBOL=    X,             R,               I
##VAR_TYPE=  INDEPENDENT,   DEPENDENT,       DEPENDENT
##VAR_FORM=  AFFN,          ASDF,            ASDF
##VAR_DIM=   8192,          8192,            8192
##UNITS=     SECONDS,       ARBITRARY UNITS, ARBITRARY UNITS
##FACTOR=    0.0002768,     1,               1
##FIRST=     0,             0,               0
##LAST=      2.2672688,     0,               0
##MIN=       0,             -190729,         0
##MAX=       2.2672688,     178799,          0
$$ Real data points
##PAGE= N=1
##DATA TABLE= (X++(R..R)), XYDATA
0@%%%%%%%%%%%%%%%%%nJ3j6J6j6J6j7K4l1L2l7M5n0N6o3P1q2R2j01J14j30J44
39G5j60J78j97K19k42K67k93L22l57L95m34M78n26N79o40P09p87Q77r81J103j249
60f64J428j651J940k329K877l708N096p806J4862o3056j37718K28513Q0606j63473
74d5083O7864J56018j38528j17047J32586M6833j04947K5502P4762n7946m8834
85h820M5324j1793p1345P420O7138Q13m6476R946L4171m6868m0207P5416L6350
98E1069r0344j0570R0998j7525n3622O6687J0231j03820J5602Q2677m9899k1249
110b9765R4947k5141j00289O2674O1796r9458k1169J07504q845p4906M0678L4037
122D2063o9498k6448N0844J7485j6168p224r776r006p38M050K2432J7298j6867
$$ plain form
0 0 0 0 0 0 0 0 0 0 0 0 0 0 0 0 0 0 0 -5 8 -8 8 -8 8 -9 15 -16 16 -21 24 -26 30 -33 38 -44 48 -53 61 -69 75
39 75 -85 93 -104 115 -127 140 -153 169 -188 207 -227 251 -275 304 -336 373 -414 463 -518 585 -664
60 -664 764 -887 1053 -1276 1601 -2107 2989 -4817 10045 -53011 -190729 37784 118390 -45083
74 -45083 22781 178799 40271 -76776 55810 102643 -2304 23198 97960 40014 -8820
85 -8820 36504 24711 -46634 -39214 27924 28737 -17739 -7793 26378 -20490 -60697 14719 51069
98 51069 -39275 -49845 41153 23628 -29994 36693 46924 -56896 -41294 41383 -8516 -29765
110 -29765 65182 40041 -60248 2426 64222 -35236 -56405 51099 42254 -32652 8026 42063
122 42063 -27435 -53883 -3039 14446 -1722 -8946 -18722 -27728 -28466 -24416 -1984 15314 -1553
135a553j0056Q849j0703L74K8367n084j5597L2228O031m8266R40K6595l1767r805
149b9447N0351m844m1854K0971J0918l8210J8888M0355l7077j8751N2400K535
161B6235l5261L2972K6288n0285k1058L6666K105k0512J3123J0942j8087j5761
173a2633m807J05J707n660L692J7383m079j6297J0451O836j1887J6061K1913k1285
187A500j1072K5263n181j6126L0194J3183l7036m371K2079j9018j2171L1037J968
200B0249k4490J2574Q219k6266k71K0657j2228j0076J9905J71j9918N432R410
213C368j3303n487Q169j923o278L549M540K821K029m9K815L80o541L156J1593
228H839q45KJ2137m831j4899P053N660j8525k381J6460j0342j2359J9122L103
$$ plain form
135 -1553 -11609 -2760 -13463 -13089 15278 10194 -5403 26825 32856 -15410 -14470 12125 -19642 -29447
149 -29447 20904 16060 -25794 -4823 6095 -32115 -13227 27128 -9949 -28700 23700 26235
161 26235 -9026 23946 50234 -51 -21109 15557 17662 -2850 10273 21215 3128 -12633
173 -12633 -17440 -17335 -15628 -21288 -17596 -213 -4292 -20589 -10138 -3302 -15189 872 22785 1500
187 1500 -9572 15691 10510 -5616 24578 37761 725 -3646 18433 -585 -12756 18281 20249
200 20249 -4241 8333 16552 -9714 -9985 10672 -1556 -11632 8273 8444 -11474 -6042 3368
213 3368 -9935 -15422 -7253 -9176 -15454 -11905 -7365 -4544 -2515 -2564 251 631 -5910 -2754 8839
228 8839 7994 7996 20133 15302 403 7456 13116 -5409 -7790 8670 -1672 -14031 5091 8194
242H194k5173J117J5449j2706n940K2168K496j3896J1026J4103j2221q565O930
255B982l244o642J0999J1811n687j0721l827j755l990L16Q387L259q167p2J0383
270D032j986q837P417O883p941K623J3159q172j3826R053P582p830J921O151j4445
285d216j1451J0496N883o022M440M908o965O57P885l409q574o6L613M976R402
300A1557L953q430j0382n918j607M868M848J7n08J430q53q60k037n570j770Q366
316b896Q618M918K699m836r965J95P080m27k194K072l764m382O916K773j0957
331d150o829M531R63J821Q142j422j2520j576J0682M659O85J955m134q758M47
346e504P280K57m348Q84L785j8j894j330n256p552L223J4318P792k083j992k837
$$ plain form
242 8194 -16979 -15862 -413 -13119 -19059 3109 5605 -8291 2735 16838 4617 -3948 2982
255 2982 -262 -6904 4095 15906 10219 -502 -4329 -6084 -10074 -9758 -1371 1888 -6279 -6351 4032
270 4032 2046 -6791 626 7509 -432 2191 15350 7178 -6648 2405 9987 2157 4078 10229 -4216
285 -4216 -15667 -5171 712 -5310 -870 4038 -2927 -2270 5615 2206 -6368 -6434 -2821 2155 11557
300 11557 15510 7080 -3302 -9220 -10827 -5959 -1111 -1094 -1602 -172 -1025 -1885 -3922 -9492 -11262 -2896
316 -2896 5722 10640 13339 8503 -1462 -1267 5813 5386 3192 5264 1500 -2882 4034 6807 -4150
331 -4150 -10979 -6448 -5485 -3664 4478 3056 -9464 -11040 -358 4301 4986 6941 2807 -5951 -5504
346 -5504 1776 2033 -2315 -1431 2354 2336 442 -888 -6144 -13696 -10473 3845 11637 9554 7562 4725
362D725p271k78Q510J306n328L349N987l476m845l032r024p622O155R764J737
377F57k239k284m508j870M230M812J571m37J580M093K763j706k056m29k259M42
393B360M634o80p569k736J469n0K596L590l509o087J314K938R32K520J866j761
409A827J911M596o29l846l437n054j219O440L697j922j388l515p015j007L647
424f914j719j506O186M019j84J401j468p243k196M775M332M080J993l461m003
439a908N93l01l99K393nj150L239K616j592J288J619k353N49M573l289n896K351
456B328K829k631M91Q45n857o325r57J199J520K434q30k4L416J8o23M078K301
473D212j219L141M473l78J301L644k190l770N22m498p407J462L858k684j672M66
$$ plain form
362 4725 -2546 -2824 5686 6992 1664 5013 11000 7524 2679 -353 -9377 -16999 -10844 -1080 657
377 657 -1582 -3866 -8374 -10244 -6014 -1202 369 -68 1512 5605 8368 6662 4606 4177 1918 2360
393 2360 6994 6314 -1255 -3991 -2522 -2572 24 3614 105 -5982 -4668 -1730 -798 1722 3588 1827
409 1827 3738 8334 7705 3859 422 -4632 -5851 589 4286 2364 976 -2539 -9554 -10561 -6914
424 -6914 -8633 -10139 -3953 66 -118 1283 -185 -7428 -9624 -4849 -517 3563 5556 2095 -1908
439 -1908 -1315 -1616 -2015 378 373 -777 2462 5078 3486 4774 6393 4040 4589 9162 5873 -23 2328
456 2328 5157 2526 3017 3862 -1995 -8320 -9277 -8078 -6558 -4124 -4954 -4978 -1562 -1544 -2167 1911 4212
473 4212 2993 6134 10607 10229 11530 15174 12984 9214 9736 5238 -2169 -707 3151 467 -1205 -739
489g39n109n662j141J29K678M713o70r31M106m56n439M771O400m100l728L978
505a200k28k017O048L094l909j433k675n238M387P623j290O0N820j793p264N84
521E69J276l063K059M214k92j69k653p689j701N744l69l010L559p92m479L625
537c171N097p02J049J05n483N89P401j775m107O067J767q975j262L908l725l682
553f899L170K978K79j25k710J224O791J377l365K312Q45n638K555J1187K004n188
569A0797l989o489o279J626K393l33L235p5o743k946L61l747q04O289N915M265
585C476K670n080m625N366L825j435N071L939r599n193Q471K451n480l17k134
600A406n580N71K710j695R1J724m452q19N172k231o446J831L349j433R85j77l710
$$ plain form
489 -739 -5848 -11510 -12651 -12522 -9844 -5131 -5801 -6732 -2626 -3082 -8521 -3750 2650 -1450 -5178 -1200
505 -1200 -1428 -3445 2603 5697 1788 355 -2320 -7558 -3171 4452 3162 3222 9042 7249 -15 569
521 569 1845 -1218 841 5055 4763 4594 1941 -5748 -7449 -1705 -2074 -5084 -1525 -2317 -6796 -3171
537 -3171 1926 1224 2273 2378 -3105 -2516 4885 3110 -997 5070 6837 -2138 -3400 508 -3217 -6899
553 -6899 -3729 -751 -472 -597 -3307 -2083 4708 6085 2720 5032 5877 239 2794 13981 15985 10797
569 10797 6808 319 -5960 -4334 -1941 -2274 961 886 -5857 -8803 -8442 -12189 -12993 -6704 -789 3476
585 3476 6146 1066 -3559 1807 5632 4197 9268 13207 3608 -1585 6886 9337 3857 3540 1406
600 1406 -4174 -3603 -893 -2588 -2497 -773 -5225 -6044 -872 -3103 -9549 -7718 -4369 -5802 -4817 -4994 -8704
617h704J194M541l82N33J292o774l867J0302R254L17K069m88q055k260O160J479
633F611J006M675j341n084L50l438r757q91N551R83J382K073n627n623K735K769
649c626J239M850n5n155L302O289r66o92J827l926m216L256J181l265l49o1k771
666c138J372J625l576j533K471O32L36L350o51k420L353L480m75N11j878o766
682c307j586N869K083q0J745m098p188q81J973n89K520M418J52k12N28k101l093
699c847J041J752K207L422n96l995j51j65j987J573K430m399k221M773J287p54
715C70L175J91n093M80L935j087l59L009p90l063J459j67l997j135M95j553J90
732c940P09j751q8K815O01O7K548j313k919K254M467Q42K141J995k878l375k73
$$ plain form
617 -8704 -7510 -2969 -3351 -2818 -1526 -8300 -12167 -1865 7389 7706 9775 9287 1232 -1028 5132 6611
633 6611 7617 12292 10951 5867 6217 2779 -6978 -7869 -2318 -1335 47 2120 -3507 -9130 -6395 -3626
649 -3626 -2387 2463 2408 -2747 555 6844 5878 5186 7013 3087 -1129 2127 3308 43 -306 -367 -3138
666 -3138 -1766 -141 -3717 -5250 -2779 -2147 -1811 1539 888 -1532 1821 5301 4826 5337 3459 -3307
682 -3307 -4893 976 3059 2979 4724 626 -6562 -7443 -5470 -6059 -3539 879 1031 819 1347 -754 -3847
699 -3847 -2806 -1054 1153 4575 3979 -16 -167 -332 -2319 -746 1684 -2715 -4936 -163 1124 370
715 370 3545 3736 -1357 -877 3058 1971 1612 4621 3831 768 2227 2060 -1937 -3072 -2577 -4130 -3940
732 -3940 -3231 -4982 -5070 -2255 -1654 -1587 961 -352 -3271 -1017 3450 4292 6433 8428 5550 2175 1902
749A902j462j155K639K52j952Q38n90m248m30J683r76J87L327J59j000K767Q20
766B761k265J205O77l471j246L034l10j425K100K64l932j771K47m82M49L078J635
783E48o0J207J0m32M88J55p31J038R34j68J217m50l155j043o7k549p1K142k59
802a246j132J979J780k231l21J411p88K86K692Q74j307n6O6j353L37l64j517j747
820b637q79L8J258J144k83n51L84j008j15K056J22j237L282L358n63r33J30l831
838b65k754K206J938j94N45O3k032n97O02j876j330J808J662J837L073l76l555
855G55j565M16m50J271K042k125k042J431l29j863k29q70j228J367K873N48j027
872a025J50L48J748L117O77j263j286q95J14K087J005k168j305j19k140j734j86
$$ plain form
749 1902 440 -715 1924 2176 224 1062 472 -3776 -4206 -2523 -3499 -3312 15 174 -826 1941 2761
766 2761 496 1701 2378 -1093 -2339 695 385 -1040 1060 1324 -2608 -4379 -4132 -4614 -4165 -1087 548
783 548 488 1695 1705 1273 1761 1916 1185 2223 3157 2989 4206 3756 601 -442 -509 -3058 -3129 -987 -1246
802 -1246 -2378 -399 1381 -850 -1171 240 -548 -262 2430 3304 1997 1941 2007 654 991 627 -890 -2637
820 -2637 -3516 -3478 -2220 -1076 -1359 -1910 -1526 -2534 -2649 -593 -471 -1708 1574 4932 4369 3436 3566 -265
838 -265 -3019 -813 1125 931 1476 1539 -493 -1090 -488 -2364 -3694 -1886 -224 1613 4686 4310 755
855 755 -810 -394 -844 427 2469 344 -1698 -267 -596 -2459 -2688 -3558 -4786 -3419 -546 2 -1025
872 -1025 -875 -527 1221 4338 5015 3752 2466 1571 1685 3772 4777 2609 1304 1185 -955 -2689 -2875
889b875k632j824K646L574J36J64r25k786j253L295L000M60J377J444n12k07m90
906B592j885j986j17K171K040P17j185k322j166p52J135J633Q7n73J268J502p74
923B385p8o51k465p24K230O79j315l62j478j611Q44K322k84j036K17j020O8K848
941E69R67k47J233J220j411p29k1k804p56K496J722%k10k282l443p20J136Q21
959b459J686J476J43P70J093q46r14M16j088O23K626O7k122j75q99l617j154J334
977c040j913j878K307J516j522P14P79k324P70L468J434L89K112k70r39J511J938
994E052j003j044O3j620q00O59k80k0J90p62q43o2j441j430J025J836J066J151
1012A737P51k082j396J13n00P84J261K42r89R89O01j450M04R56j064k98K820L66
$$ plain form
889 -2875 -5507 -7331 -4685 -1111 -975 -811 -1736 -4522 -5775 -2480 520 980 2357 3801 3289 3082 2592
906 2592 707 -1279 -1396 775 2815 3532 2347 25 -1141 -1893 -758 875 962 389 1657 3159 2385
923 2385 2307 1656 -809 -1533 697 1376 61 -301 -1779 -3390 -2546 -224 -508 -1544 -1327 -2347 -2279 569
941 569 1536 1289 2522 3742 2331 1602 1581 -1223 -1979 517 2239 2239 2029 -253 -3696 -4416 -3280 -2459
959 -2459 -773 703 846 1616 2709 1863 949 1365 277 900 3526 3593 1471 1296 397 -3220 -4374 -3040
977 -3040 -4953 -6831 -4524 -3008 -4530 -3816 -3037 -5361 -4591 -1123 311 700 2812 2542 1603 3114 5052
994 5052 4049 3005 3068 1448 648 1307 1027 1007 1197 435 -408 -470 -1911 -3341 -2316 -480 586 1737
1012 1737 2488 406 -990 -877 -1377 -593 668 910 -79 910 1511 61 465 1421 357 59 2879 3245
1030C245R3J968K5j853j2p04k524k80J784l29j844L15j533l056o17N66q5j1R07
1049c945M65N51P63L71J425J243q13m20R94K39K31K117K79k371m38j059l054K3
1067c399K768k88j415K444J90l029P71J965o34N06L064p9j120J030m62j120J329
1084B521L99k447j437j28j574O57J967K63j486r12r75j025J509J246L86J820J564
1101B348j112l95N76j189r29J574R26n46P91p86j362J053P73j824q42J082k71
1118a33M77L509O17k019r86o65j643L82J890o15q29K87j089j815m34l78p31R76
1136c199J650J13j4m1n07J733K774N95j29Q9j649q60K193J463j117l74j192k909
1154a381j015O32j199r71J682J230r79L63j88j858J60K361O53J005R39l94l14
$$ plain form
1030 3245 3338 5306 5331 3478 3466 2762 238 -42 1742 1413 -431 -116 -1649 -4705 -5322 -4756 -4841 -4852 -3945
1049 -3945 -3480 -2929 -2166 -1795 -370 873 60 -360 634 873 1104 3221 3500 1129 691 -368 -3422 -3399
1067 -3399 -631 -919 -2334 110 300 -2729 -1958 7 -627 -121 2943 2864 1744 2774 2312 1192 2521
1084 2521 2920 473 -964 -1092 -2666 -2009 -42 221 -1265 -2177 -3152 -4177 -2668 -1422 -1036 784 2348
1101 2348 1236 841 1417 228 -701 873 1799 1253 2044 1258 -104 949 1722 -102 -944 138 -133
1118 -133 344 3853 4470 2451 1465 800 -843 -461 1429 814 -15 272 -817 -2632 -3066 -3444 -4175 -3199
1136 -3199 -1549 -1436 -1450 -1491 -1998 -265 2509 3104 2975 3064 1415 555 2748 4211 3094 2720 1528 -1381
1154 -1381 -2396 -1764 -2963 -3934 -2252 -1022 -2001 -1638 -1826 -3684 -3524 -1163 -510 495 1434 1040 726
1171G26J784l70j830o07p92p51J642K156o18q42n90k232m88K729Q42l74J719J287
1189C391j744m54R13j536m74J712J55j229r1j105k211R86J724j007q36M82j509
1206b833n87K745J248J33J013m34j149N3P96j137m08J522k0p37N28j032j888n77
1224b764R42J07Q09O57k56J587J297n57o07L59j360k22K452J766o20q64j078k440
1242g92r25O50m21l15J350l69j164L57L60j049N3J985Q04K79K11m40o6J287j07
1261A688j88j80j516j218K9P07M69r5L23j110n53Q49l62j79J628P78k14J050J010
1280B916j472m96L14r12p87P25j17j110Q45j3j387pl30j203L83K294O29K56Q16
1299A344K2j018K15Q69n02L73R86n44n24J57j037j179J69j61j001N6Q33j52L10
$$ plain form
1171 726 2510 2140 310 -297 -1089 -1840 -198 1958 1340 498 -92 -2324 -2812 -83 759 385 2104 3391
1189 3391 1647 1193 2106 570 96 1808 1963 734 643 -462 -2673 -1687 37 -970 -1806 -1324 -2833
1206 -2833 -3420 -675 573 706 1719 1285 136 189 985 -152 -560 962 942 205 733 -299 -2187 -2764
1224 -2764 -1822 -1715 -906 -249 -505 1082 2379 1822 1215 1574 214 -8 2444 4210 3590 2726 1648 -792
1242 -792 -1717 -1067 -1488 -1803 -453 -822 -1986 -1629 -1269 -2318 -2265 -280 524 803 1014 574 508 1795 1688
1261 1688 1500 1320 -196 -1414 -1385 -678 -209 -304 19 -1091 -1644 -795 -1157 -1336 292 1070 856 1906 2916
1280 2916 1444 948 1262 350 -437 288 171 -939 -94 -107 -1494 -1501 -1831 -3034 -2651 -357 272 528 1344
1299 1344 1366 348 563 1432 930 1303 2289 1745 1221 1378 341 -838 -669 -830 -1831 -1775 -942 -1094 -784
1318g84J006k97j41N84n45n22R53O26k13N97L16j371r42q7p46n87J071R7m93N99
1338h79N87o78L0P87k09K87J117L78J69O72J72p78m61o13o18p1l46j97J97N32
1358G8n33q00P22l66n09Q42Q93j34Q33P68N0k53l5p18j232j3L02r8K05mj075r66
1380b043K4o36n2R09O1J119J466K2p0M53k27l78R76J210n89k52M96o34j291K67
1400H31r43j436J35L28j32L73O08j180R1O68P6j25M01K53n06R49P99m91j67k36
1420B96p36q16J084m31p34P98P20m9N87K68j276m66P07M13N63J159j53q40L9q28
1440C05j157n54J7q53P13R57k60o13m08o67k75J156J422L06M92Q16j01K65O65
1459B226o82m70L61Ok66p8l14q94l17R4r01K44j04n51R6J412O53J51JM67q00P25
$$ plain form
1318 -784 222 -75 -216 368 -177 -699 254 880 667 1264 1580 209 -733 -820 -1566 -2153 -1082 -985 -1478 -879
1338 -879 -292 -970 -940 -153 -362 -75 1042 1420 1589 2261 2433 1655 1194 581 -37 -108 -454 -651 -454 78
1358 78 -455 -1255 -533 -899 -1408 -566 327 193 1026 1794 1844 1591 1556 838 -394 -407 -105 -203 2 -2 -1077 -2043
1380 -2043 -2019 -2655 -2707 -1798 -1737 -618 848 870 800 1253 1026 648 1624 2834 2245 1993 2489 1855 564 831
1400 831 -112 -1548 -1413 -1085 -1217 -844 -236 -1416 -1325 -657 -581 -706 -305 -52 -558 391 1190 699 532 296
1420 296 -440 -1256 -172 -603 -1337 -539 181 132 719 987 -289 -755 -48 365 928 2087 1934 1094 1133 305
1440 305 -852 -1406 -1389 -2242 -1529 -572 -832 -1445 -1853 -2520 -2795 -1639 -217 89 581 1397 1296 1561 2226
1459 2226 1544 1074 1435 1441 1175 1097 783 -111 -428 -334 -1235 -991 -1095 -1646 -1550 -138 515 666 667 1134 334 1059
1481A059M63m61k82M50j29K1L09n37j588m68m89k27P24O79j14N00L95q29p5N76
1501b3m20M0J711R05j96o5l84j531o49J081j99o98Q09m97m34N23J93j265K35N91
1521b73l69M12Q57j9n60K72j53o67j77n43q71K09M79k28m68N54m18j38O15M60
1541a026J40N45R20K01R00J167q27n05J03n04o27L93M9o96K31n0j406m40l1q80
1561b343P3J252Q14O5Q49k25o24M39J243n01L68O19l05j37J78k71r64r4l77r02
1581h43k18P31j54N78L09l69m12L9k77J51R99N35j83M56l03o98o65M08q60m73
1601a249L97ln82P86Q0k52K79Q3o46M03Q30l39J093P38q9r88J58o87r13L47O57
1622A03n62k09N76j207n66R06j05j16J055L43j83M17J133m61L74K66p98q31L66
$$ plain form
1481 1059 1522 1061 779 1229 1100 1121 1430 893 -695 -1163 -1652 -1879 -1155 -476 -590 -90 305 -524 -599 -23
1501 -23 -443 -403 1308 2213 2017 1952 1568 37 -612 469 270 -428 381 -116 -550 -27 166 -1099 -864 -273
1521 -273 -642 -230 627 608 48 320 167 -500 -677 -1220 -2091 -1882 -1403 -1631 -2099 -1545 -1963 -2101 -1486 -1026
1541 -1026 -886 -341 579 780 1680 2847 2020 1515 1618 1114 487 880 929 233 464 414 -992 -1432 -1463 -2343
1561 -2343 -2270 -1018 -204 -139 710 485 -139 300 1543 1042 1410 2029 1724 1587 1765 1494 530 436 59 -843
1581 -843 -1061 -330 -484 94 403 34 -378 -339 -616 -465 534 1069 886 1342 1039 341 -324 84 -776 -1249
1601 -1249 -852 -855 -1437 -651 -571 -823 -544 -461 -1107 -704 126 -213 880 1618 1529 541 699 12 -901 -554 103
1622 103 -459 -668 -92 -1299 -1865 -959 -1064 -1180 -125 218 35 452 1585 1124 1498 1764 966 135 501
1641E01n43k82R48k49r84p02j87j132l5J265K01N9Q06N78p13N86O03m87R40P92
1661A965l82k38K75l70m26M94o82j185j46O7k21P84K98l51k56K07j91k17J091
1680E16J23o20Q45K62o56l92J67p19n44P19o46m23J18M39j54N68K81m80m35M38
1700e93K49Q67R33K59k18k73o54p40J56m3j40J1N98q49k97J9q21J03O16K86J66
1721c65N37O49l36O23O10o69n18N02n75j49Q80k76j033j63j60m96j48O53l48l47
1741a129Q82L26k36O02jj11M49N06q24k15L75j15n3N86q80j094k98o58l46P10
1761a524J039l25K59K76o24k52Q20K41j41J141K63m54J26K21j064j53JJ68p49
1780g31N96n1m06M78L52p09j12N79j80O77Q46R9n1L23r0p50O9j65m64l0k3n22
$$ plain form
1641 501 -42 -324 624 375 -609 -1311 -1498 -2630 -2665 -1400 -1199 -1140 -334 244 -469 117 720 233 1173 1965
1661 1965 1583 1345 1620 1250 824 1318 636 -549 -695 -628 -849 -65 233 -118 -374 -167 -358 -575 516
1680 516 639 19 864 1126 470 78 245 -474 -1018 -299 -945 -1368 -1250 -811 -965 -397 -116 -596 -1031 -593
1700 -593 -344 523 1456 1715 1497 1224 570 -170 -14 -57 -197 -186 412 -437 -734 -715 -1536 -1433 -817 -531 -365
1721 -365 172 821 485 1108 1718 1049 531 1033 458 309 1189 913 -120 -283 -443 -939 -1087 -434 -782 -1129
1741 -1129 -247 79 -157 445 444 333 782 1288 464 249 624 509 456 1042 162 -932 -1230 -1888 -2234 -1524
1761 -1524 -485 -810 -551 -275 -899 -1151 -331 -90 -231 910 1173 719 845 1066 2 -151 -150 18 -731
1780 -731 -135 -186 -592 -114 238 -471 -583 -4 -184 493 1339 1438 1387 1710 1620 870 939 774 310 280 257 -265
1802b65l73K91n84k67J91o7l86K19O67lQ62N16j2k80o9n26mR33j26j15k9l03r05
1825f35k9R5n90J14O92J72R9M09K6m44Q76j63k13L07K37l53k58N08q14j83k88
1846d35n65m18P17J15j78K64N85n58l1J001O7l70P32K60k66K92N22o83l51J06
1866H06r53m52J19p6m64N03J34m14l1N3j18P7P10J06L49P42j71l14L28m96l87
1887E1K92J48o60m8K30p37n70M52l03k11L36N85j43P49L76j52j74M81Qm25K74
1908E59o6J8J54K81j186r6L4n04K03o0J71k7L37L67p2J64l16q0O7N92k77J86K61
1931G10m16r9q5p67l24J68K97K7Q1N27m41K88K16m5L46J60N63k82O03J12m16j08
1953A115p2q20l62J15n24j98O6l12n8L66j27j52J00L88j54M00J094j19J82K90
$$ plain form
1802 -265 -638 -347 -931 -1198 -1007 -1074 -1460 -1241 -574 -577 285 801 789 509 440 -86 -90 843 717 602 573 270 -635
1825 -635 -664 -569 -1159 -1045 -353 -181 -82 327 353 -91 785 622 409 716 953 600 342 850 36 -147 -435
1846 -435 -1000 -1418 -701 -586 -764 -500 85 -473 -504 497 564 194 926 1186 920 1212 1734 1051 700 806
1866 806 -147 -599 -480 -556 -1020 -517 -383 -797 -828 -775 -893 -816 -106 0 349 1091 920 606 934 438 51
1887 51 343 491 -169 -217 13 -724 -1294 -842 -1145 -1356 -1020 -435 -578 171 547 395 221 702 710 285 559
1908 559 493 511 665 946 -240 -336 -302 -806 -603 -663 -492 -519 -182 185 113 277 -39 -119 -52 540 263 449 710
1931 710 294 195 110 -657 -981 -813 -516 -489 -408 119 -322 -34 182 137 483 643 1206 924 1527 1639 1223 1115
1953 1115 1043 223 -139 -24 -548 -746 -680 -992 -1050 -684 -811 -963 -863 -475 -629 -229 865 746 928 1218
1973A218l76l04L47l94o10J55K61n49l11K83p08k77K12j0M3P18N18n33L76L19
1993C78l60m87O20k4p4M72pm24l26r1k16k93L26j00r5N00p1L35L49l4K7j50M36
2016F91m07J09L49j25K66m81k44n51r4k48o5M20J46M3K48J45m56K44M07j19J96
2037D74K87M91M9l85P8p36k80J1m17p1j27J18m07J41R5m65K06L01m4O16O02k1
2059E16l4K24M4K9L67p24j69N0N2k56k18K2m26m11J97l18j77K15M32K71L72M41
2081D99l96j09J5K6M8M23l1k67K51l99m77j05J38n99L08M49j96K35M98k04j98
2102i1N24J74m43M45J50Pm1J76l85p88J42L2o47L98N4j30N5J7k7L0L73J14k03
2125f4K71K97m19N35L89k73k32k05o10j24Q3q6l38O30l40l87K01L3l61M87N70
$$ plain form
1973 1218 842 538 885 491 -119 36 297 -252 -563 -280 -988 -1265 -1053 -1063 -1020 -302 216 -317 59 378
1993 378 18 -469 151 127 53 525 518 94 -232 -323 -539 -832 -506 -606 -701 -201 -272 63 412 378 405 255 691
2016 691 284 393 742 617 883 402 158 -393 -487 -735 -800 -380 -234 -191 57 202 -254 -10 397 278 474
2037 474 761 1252 1301 916 994 258 -22 -11 -428 -499 -626 -508 -915 -774 -679 -1144 -938 -637 -681 -65 537 516
2059 516 482 706 750 779 1146 422 253 303 355 99 -119 -97 -523 -934 -737 -1055 -1232 -1017 -585 -314 58 499
2081 499 103 -6 9 35 83 506 475 208 459 60 -417 -522 -384 -983 -675 -226 -422 -187 311 107 -91
2102 -91 433 607 164 609 759 766 725 901 516 -272 -130 -98 -745 -347 -293 -423 -368 -351 -378 -348 25 139 -64
2125 -64 207 504 85 620 1009 736 504 299 -311 -435 -352 -438 -776 -146 -486 -873 -672 -639 -1000 -513 57
2146E7m6K31O73L2l0q6j15k57j0m5o75M12Q2n86K3n9l70O5k8K97k22R13R8n9j70
2171A25J35m2j7N35j2k66K48j86n62M8k6o45M1P9j78J85K34K57l3L09j81n62P27
2194B13O3l0L52L19n09m81r3j79n99K73M25m58J71R8k69K58M57n6k65M78K26n86
2216a92Q93Q0J38r1K00l14o03N6k3m14L03j43m57N0j69R8j29N81j64P7N94L17
2238F88l15J50Q4o1l06k11j90K6L30m89J0J1k72n66K04K11j47Q44J94l03M72p8
2260B86pl8M82k02j19L10j28m23J24j9o72k93M97k79k71L12K84j65M30J01l20
2281a10O01K7j45N00k5j00P1L8n67m08L85m62j97P4j73K00j2J23k29K7K47p0P2
2304a33O94k77K32L60k23k97k84l2m6j53L21l75k95K75l96l19J84N09k90M10K69
$$ plain form
2146 57 11 242 915 947 917 831 716 459 449 404 -271 141 223 -363 -340 -399 -769 -704 -732 -435 -657 256 354 295 125
2171 125 260 218 201 736 724 458 706 520 -42 6 -20 -665 -624 -545 -723 -538 -304 -47 -80 229 48 -514 213
2194 213 276 246 598 917 408 -73 -166 -345 -944 -671 -246 -704 -533 -435 -704 -446 11 -45 -310 168 394 -192
2216 -192 701 781 919 828 1028 714 111 167 144 -270 33 -110 -567 -517 -686 -588 -717 -136 -300 -223 371 688
2238 688 373 523 607 546 240 29 -161 -135 195 -294 -284 -273 -545 -1111 -907 -696 -843 1 195 -108 364 286
2260 286 279 241 723 521 402 712 584 161 285 266 -406 -699 -202 -481 -752 -440 -156 -321 109 210 -110
2281 -110 491 518 373 873 848 748 819 857 290 -118 267 -195 -392 -318 -491 -291 -303 -180 -409 -382 -135 -205 -133
2304 -133 561 284 516 876 653 356 72 40 -6 -159 162 -213 -508 -233 -629 -948 -764 -255 -545 -135 134
2325A34k09O1R60m42k97M70l70k24K12l7k84mP9m18j03K32j89j07K29K00j22N77
2347C48j3l5O2M6q2J60j84L38l88K3j96n77J26m9o55L1K00l8L97L17R0k34K28
2370h5r0J31L30N69k2j59M6l48L1l31n7k35PJ43m82K16J81k12r5j25K39K37K30
2393A19J21J31O5L23r6r8J19l45l57K04j16j93M28m96k47K03l7k48K38N2j6L46
2415A00M75j22k17M43k62l88J45L25m58r1L3k36m53K95n5k58R5K31J94J83K76
2436B55k40K07L28l59K42j75J75j83K03n37j31R8j42l46l50K91J9j2N26k49J31
2457b49J71J90q6M27K0j12K95K01o24K32J1l06l34J75m4l40L9n7k4j29K97j89
2479d36JJ77K1M63q5J54J72J23r5p3l26L28l66J57N4k15k36R8k76J25O9Qj22K18
$$ plain form
2325 134 -75 -14 946 504 207 677 307 83 295 258 -26 -30 49 -369 -472 -240 -429 -536 -307 -107 -229 348
2347 348 335 300 362 408 326 486 302 640 252 275 79 -498 -372 -421 -1076 -1045 -845 -883 -486 -169 -79 -313 -85
2370 -85 -175 -44 286 855 833 674 720 372 403 72 15 -220 -213 -70 -552 -336 -155 -367 -462 -587 -348 -111 119
2393 119 240 371 436 759 663 565 684 339 -18 186 70 -123 305 -191 -438 -235 -272 -520 -282 -230 -246 100
2415 100 575 453 236 679 417 29 174 499 41 -50 -17 -253 -706 -411 -466 -724 -629 -398 -204 -21 255
2436 255 15 222 550 191 433 258 433 250 453 -84 -215 -117 -259 -605 -955 -664 -645 -657 -131 -380 -249
2457 -249 -78 112 26 453 473 361 656 857 233 465 476 170 -164 11 -33 -373 -334 -391 -415 -544 -247 -436
2479 -436 -435 -258 -237 226 141 295 467 590 495 422 96 424 58 215 269 54 -182 -84 -360 -235 -166 -158 -280 -62
2503f2N85n38L26k7Qm2oj23j22K55n8m09o0o5l53l8K63j19M2K67L88o1k20N41
2527C72j50J88L2l7Q4r0J01n01L20m52k94J05m37O8J00P0M6J50J60j27J18J79
2549EN5L87r3J41q3j29K85k46j86q6l55j55K12j09l2J40N1l10p2L86j50J25Q11
2572E92k26J45QJ0l43l3P6l86j03M49k53p4K75m35L8L6M3j60L1N10j08O5K16L7
2596D10k63M30k66k15J79K22j03k73J07n16o4J7m94L39K85M03l98J25K39J13J87
2617D64j38j0O8J1p0o8K75j07m22k10k22q0p7K29l14K37K53l39K28K48j16j6M87
2640C11n4m6Q2L60l61J7jn47K66r2o6k38J61J94k98m5L27m30J50K54O07l63L66
2663E54O9j63l72K13j11j28K89m21n23N79l26k17L41l36o2N6K55j47M13K60R6
$$ plain form
2503 -62 523 -15 311 284 292 250 244 121 -1 254 196 -213 -273 -338 -691 -729 -466 -585 -543 -276 112 51 -169 372
2527 372 222 410 442 405 489 399 500 -1 319 -133 -427 -322 -759 -691 -591 -521 -475 -325 -165 -292 -174 5
2549 5 60 447 354 495 412 283 568 322 136 50 -305 -460 -248 -357 -389 -249 -198 -508 -580 -194 -344 -219 592
2572 592 366 511 519 529 186 153 229 -157 -260 189 -64 -138 137 -298 -260 -224 -181 -341 -310 200 92 157 373 410
2596 410 147 577 311 96 275 497 394 121 228 -288 -352 -335 -829 -490 -205 198 -200 -75 164 277 464
2617 464 326 316 384 395 325 257 532 425 3 -207 -429 -509 -586 -357 -671 -434 -181 -520 -292 -44 -160 -176 311
2640 311 257 211 293 653 292 309 308 -239 27 -65 -131 -369 -208 -14 -312 -357 -30 -460 -310 -56 551 188 554
2663 554 623 460 88 301 190 62 351 -70 -593 -14 -340 -557 -216 -552 -614 -558 -303 -450 -37 223 319
2684C19l1j25k06J7L12j3m80J52K20m18p6K54l41k21J07L7L13K2J83j42P6N12
2706D71k67M1K01o3P6Oj05Q2q9o09J16l33K88l1j5J71p6j81K20M9r4O61k73O3
2730C09J67M7j08j12L28n15k57P0jj40k62K97j87n0Q7k87L59k4K16J93K62n3j03
2753B36K96o35L65j99j51K6k58M52m13j8p7J08l67J44k17J3O46P6J1K19K51j53
2775C55k47M88j79k54R6K46n84J10J39m19J9J19k26k00L25J77l07L94m2M6K73
2796C29j5l7J01l5p9J47k00k41p1j30j91O4J45J47j56j67L23k19J74O5M4J06j4
2819I0L74k22j23M78m68k08K1N0j15n9j40J17K35l97J26j88L76j03O2J99L95l89
2841A11O36l15l78L06J06l41Q4r9N1o9j61j16m25P6K34r4K38J72k27L56J70o7
$$ plain form
2684 319 288 163 -43 -26 286 273 -207 -55 165 -253 -329 -75 -416 -637 -530 -493 -180 -158 25 -117 -41 471
2706 471 204 245 446 383 459 465 360 442 353 -256 -140 -473 -185 -216 -231 -60 -136 -317 -97 -48 -142 519 246 309
2730 309 476 523 415 303 631 116 -141 -71 -72 -212 -474 -177 -364 -414 -327 -614 -255 -279 -63 130 392 339 236
2753 236 532 -103 262 63 -88 -62 -320 132 -281 -299 -376 -268 -635 -491 -708 -695 -49 27 38 257 508 355
2775 355 108 596 417 163 259 505 -79 31 170 -249 -230 -111 -337 -537 -212 -35 -342 52 10 56 329
2796 329 314 277 378 343 264 411 211 -30 -101 -231 -422 -358 -213 -66 -222 -389 -66 -285 -111 -46 -2 104 90
2819 90 464 242 119 597 129 -79 -58 -8 -123 -182 -322 -205 30 -367 -241 -429 -53 -156 -94 105 500 111
2841 111 747 432 54 360 466 125 209 110 161 92 -69 -185 -610 -534 -300 -394 -156 16 -211 145 315 248
2863B48l9J88K9j88K89q6n6j16k43l02J71J17m41r4K96j82L9K17J97K02J63j08
2885C01l64Q8M26j54n1n2pR8m58J69o2k80K5j08J68j44L55j26K0J36k1o3j3N17
2909D00r0J3l01K71k65L0k46N5k3l9j26K15l16J65J05k19K91J07K15k61J05J56
2931B42J33P1m27J13m2kMj63N0j3J56k61N8j27J8N0j61M16L52l53JJ30R1J87j63
2956C60q8J46q4k03J6pk84k60J08M5j03q2J37n3K06P2LK06q6J82O2o1K85k51m8
2981B18l5j06j48K51k87j50p9O5K79j57j27J89m4o8J95K08j1L94m24K25mk20k47
3004h3P8k50J71J01k44J43j55m6Q9J59k05j24M79n9J07k8R8P8K5Q0j55l78K32
3027A13p9k75K73j22q3r6j24J33J10J32j6O9m6J20j32QJ65K19p9J6m3o2N6q2k28
$$ plain form
2863 248 209 397 426 238 527 441 385 269 26 -276 -105 12 -429 -523 -227 -409 -370 -153 44 246 409 301
2885 301 -63 25 451 297 246 194 187 285 -173 -4 -66 -346 -321 -429 -261 -405 -50 -176 -156 -20 -41 -104 -117 400
2909 400 310 323 22 293 28 58 -188 -133 -156 -195 -321 -106 -422 -257 -152 -371 -80 27 242 -19 86 242
2931 242 375 446 19 132 90 88 92 -71 -21 -34 122 -139 -81 -208 -190 -140 -301 115 467 114 115 245 336 523 360
2956 360 272 418 334 131 147 140 -144 -404 -296 -251 -354 -436 -299 -352 -146 -74 -71 135 49 231 293 232 517 266 218
2981 218 183 77 -71 180 -107 -257 -336 -271 8 -149 -276 -87 -131 -199 -4 204 193 587 163 388 384 164 -83
3004 -83 -5 -255 -84 17 -227 -84 -239 -285 -196 -37 -242 -366 113 54 161 133 231 309 334 414 259 -119 113
3027 113 34 -241 32 -90 -173 -269 -393 -260 -150 -18 -34 35 -11 109 -23 -15 150 369 290 306 263 201 257 175 -53
3052e3j32mj43J49nL6P5l2L7j94L44J14j36J13J0o5M2R6N6l34j61j48nJ08J26
3077a06j35R7q3n7J07l5L59j18%J79o5N1K95k98q4o1m4k68l9K73j95J15N1j53
3101b14j65J45k50N68j31J69KK31m9k19J13J52k92j5J11j55O0l55J58k47n8K88
3123a53l33M25p0L37k47k8R2K48l6j26P7M3k77K68p8k73L0K3M1J54k07j53J18
3146a25o6L0R5R0K6j2M0K35M0j84K27m0k67K4q4K2l6Q7K4l56j2J78r1J32k04K49
3172B2M6o1l8K92j37J68N9j64j56J06k39j56J49k40K54k00J10K26l86J13j15J97
3194a50M14k43J40J10K05Ol22K4j09J68l37J64J26M8l81p6n1Q9P4j75K11O8R0
3217I3j35R6J15J08j40J95j14J6j51j02J34j94J08Mk40J7j06Q9j83K31R6k55J90
$$ plain form
3052 -53 -185 -189 -332 -183 -188 -152 -77 -109 -72 -266 78 192 56 169 179 114 156 252 308 -26 -187 -335 -340 -232 -106
3077 -106 -241 -144 -227 -284 -177 -212 147 29 29 208 143 194 489 191 107 46 2 -266 -305 -32 -227 -112 -61 -214
3101 -214 -379 -234 -484 84 -47 122 124 355 306 87 200 352 60 45 156 1 61 -294 -136 -383 -441 -153
3123 -153 -486 -61 -131 206 -41 -69 23 271 235 109 186 229 -48 220 142 -131 -101 -78 -37 117 -90 -243 -125
3146 -125 -191 -161 -66 24 50 38 78 313 353 169 396 356 89 113 29 51 15 102 126 -230 -242 -64 -155 -23 -227 22
3172 22 68 7 -31 261 124 292 351 187 31 137 -102 -258 -109 -349 -95 -295 -185 41 -345 -232 -347 -150
3194 -150 264 21 161 271 476 482 160 184 75 243 -94 70 196 244 -137 -213 -264 -175 -101 -276 -65 3 93
3217 93 -42 54 169 277 137 332 218 234 83 -19 115 -79 29 33 -207 -190 -296 -207 -390 -159 -63 -318 -128
3240a28o5J93J97p9j93L07J22m7k02J75k79R1l76K32j62K7l18K59j7jj13L47J81
3263A51j05K04j57J15K22l8l14O8K36m39n3J21k13o3K0K73l57R3m3j12K91K6Q0
3286Fj38O23k97J83j85k22o4L72k40p7J36k37k88K97l9j80J88N1K47k94J83J32
3308A57j03J91k79J21P8J76j04j1k01j7j56L5O6l23K61J9J42m12J39J08M5Q5K05
3331B22noL2P5j57J7o6kj21j32j34nK44k68J40q3O1K45q4N8j78J66L51l17J31
3356A84Qj99K57O8l08J81j58l19K80k64m4J27k98K78r5L56q8j9Q4J62OQ3o6Nl7
3381A84q7J47k06q0j05l4j07J81q7O8k61J40J7L05j51J48mJ82o8K60l60O5k3j08
3405A6m0k3j32R1J59m32J61r7K30j31K53j95J88J34j61J85r4J39j18L87k59j2
$$ plain form
3240 -128 -193 0 197 118 -75 232 354 307 105 280 1 92 -284 -52 -214 -187 -505 -246 -263 -264 -377 -30 151
3263 151 46 250 93 208 430 392 78 146 382 -57 -110 11 -202 -265 -245 28 -329 -236 -279 -391 -100 -74 6
3286 6 -132 491 194 377 192 -30 -94 278 38 -39 97 -140 -428 -131 -170 -350 -162 -111 136 -158 25 157
3308 157 54 245 -34 87 165 341 237 226 25 8 -148 -113 -47 -370 -109 -90 52 -360 -221 -113 -68 17 222
3331 222 217 211 243 318 161 178 112 110 -11 -143 -277 -282 -38 -306 -166 -249 -188 57 -27 31 -147 19 370 53 184
3356 184 192 -7 250 318 10 191 33 -286 -6 -270 -314 -187 -485 -207 -302 54 -34 -53 31 193 199 282 216 221 184
3381 184 97 244 38 -42 -147 -181 -288 -107 -194 -126 -387 -247 -230 75 -76 72 68 250 182 442 82 147 124 16
3405 16 -24 -47 -179 -88 71 -361 -200 -297 -67 -198 55 -140 48 182 21 206 112 251 133 520 261 249
3427B49J12j31k7j87j79P2O8m5k34P6o2R2J36J90J1j16J13P4J96n67K80qk37N35
3451D11l62j13j35O1K6j0r7k45R1J15K47k49J24M73j83jk52%K80o2Jj91J10j00
3475f1P2l85L58l18J41K3j03L3Q3N1P0K30j1p0P4M1k9p1k07L65j82j73K5k50J38
3500a56K34l27j15M86k35j39M03j56J21k02M69j11k25j6J93n2J71m56J27j48j20
3521b54J81R7l10J98K4k31J46L26m15J73J94K03R4q2j96n4m2J13l45J2K31j9m0
3544DJ91k60l41J02J65P4Q8j49K32k70J84m9K68j67J74k0o8j21r0J19q8l24K68
3567g8m11K70K19j12M9Q7j1K5p0O6k68N01q3J17k18M5l9J57l95k0L23m27K42l12
3591c43K54j89J76l2Q0K28r2j29P3J18J39o2r4k0P4l15K71j04k30L56k40p3k01
$$ plain form
3427 249 361 230 203 16 -163 -91 -23 -68 -302 -226 -288 -196 -60 130 141 25 138 212 408 -159 121 113 -124 411
3451 411 49 -64 -199 -138 -112 -122 -219 -464 -373 -258 -11 -260 -136 337 154 153 -99 -99 181 119 120 -71 39 -61
3475 -61 11 -374 -16 -334 -193 -170 -273 -240 -157 -106 -36 194 183 113 187 228 199 128 -79 286 104 -69 -44 -294 -156
3500 -156 78 -249 -364 122 -113 -252 151 -5 116 -86 383 272 47 31 224 172 343 -113 14 -134 -254
3521 -254 -73 24 -286 -88 -64 -295 -149 177 -238 -65 129 332 426 344 148 94 52 165 -180 -168 63 44 4
3544 4 195 -65 -406 -304 -139 -65 23 -126 106 -164 20 -29 239 72 246 226 158 37 -53 66 -22 -346 -78
3567 -78 -489 -219 0 -112 -63 24 13 38 -32 34 -234 267 184 301 83 128 89 246 -149 -169 154 -273 -31 -343
3591 -343 -89 -278 -102 -134 -54 174 82 -47 26 144 283 221 127 107 181 -134 137 33 -197 159 -81 -154 -355
3614c55L87p5j65K02j74M40j61k62L15J96j73j08l0J68M4j58j97L6J25r1j66J12
3636i0J90j31M3j30P8QJ92K2o9JL81l41J17P3j11k29R3J9J6k41q3r2P6J62j8M2
3662b2k3K20k42K11J39k85K8J70k22P4Q2M9j84o5l08M72l58L9K7n6K79k31J68
3685c8K69k42o1J44L06j86j33l3m4J03j6Ol54K97j06L30k16n8k99R4K33o9J50
3708G7k50J45P3K20J4j37P1j74L6N4J34k27j61J03m0j40j88K04l0PJ83P3K07k47
3732GJ20l6k5J13m5N1q9q2L1K52n7l00j88P4j43L06j89P7r7J77M3Q2J40j58P4
3757A38Q7R5j98K22k19l24j3L45k38Q3J2m6l77K20J11j52J83j05K61J39j75O1
3779A10J27k09J16J23j41O3j92J41j04J10j83j28j17J37J23j63ql8K53J32j99
$$ plain form
3614 -355 32 -43 -208 -6 -180 260 99 -163 152 348 175 67 37 205 249 91 -106 -70 55 -36 -202 -90
3636 -90 100 -31 12 -118 -40 -32 160 182 113 114 495 154 271 344 233 4 97 116 132 -109 -192 -284 -208 -46 -64 -22
3662 -22 -45 175 -67 144 283 -2 26 196 -26 48 130 179 -5 -70 -378 94 -264 -225 -198 -254 25 -206 -38
3685 -38 231 -11 -72 72 378 192 59 26 -18 85 69 75 -279 18 -88 242 26 -32 -331 -237 -4 -73 77
3708 77 -173 -28 45 265 279 142 213 39 75 129 263 36 -125 -22 -62 -202 -390 -186 -216 -209 -26 47 254 7
3732 7 127 91 66 179 134 185 96 14 45 297 240 -60 -248 -174 -317 -11 -200 -123 -220 -43 0 82 222 64 138
3757 138 225 320 122 344 125 -199 -212 133 -105 -22 -10 -56 -433 -213 -102 -254 -71 -176 85 224 49 110
3779 110 237 28 144 267 126 189 -3 138 34 144 -39 -167 -284 -147 -24 -187 -195 -233 20 152 -47
3800d7N0L26j3k96j42K74j02J65j14k59m0J62l13k4K73J21k51rL31j33O1R7o1
3823E6J69r3k9J35j23Q6p8k5m32J4L49j49k00P2L77m06K68j35K47mj40NK34mK48
3848D42l46J72j74o8k06K79J62k69n7N4j83L1l3J48J6R5J9N2K93l75J7K29k12
3871H6J14l9j23J82n17K94Q7n6k22K52r2m9O3j91P4L6J50N2M5k57L23j61PM9J22
3896B29p5k29k79L56j40l1l0J07l1j02L51k43K84j65K4O3L1j88p9K12m1J78j01
3919A01j43M17l26k37k42M80l28M0L67j1j74R4P7P0j67J5k6J99m0j75N9j73K27
3942A04l6o3o0mj03j3K49j88k14L06j30J57m0J81j97K4J39l7J62L0j53m6l83K21
3966i4Q2j18J83l14N0L45n13L71j06O2Q1K46j38k29L19J9k47J69Q3k93j10P2J15
$$ plain form
3800 -47 3 329 316 20 -122 152 50 215 101 -158 -198 -36 -349 -373 -100 21 -230 -239 92 -41 20 117 56
3823 56 225 132 103 238 115 201 123 98 -334 -320 29 -120 -320 -248 129 -277 -9 -144 103 99 -41 -36 198 194 442
3848 442 96 268 94 26 -180 99 261 -8 -65 -11 -194 -163 -196 -48 -32 63 82 134 427 52 69 298 86
3871 86 200 161 38 220 -297 -3 84 28 -194 58 -34 -83 -20 -211 -137 -101 49 101 146 -111 212 51 58 107 229
3896 229 154 -75 -354 2 -138 -169 -199 -92 -123 -225 126 -117 167 2 26 89 120 -68 -147 65 24 202 101
3919 101 -42 375 49 -188 -430 50 -278 -238 129 118 -56 38 115 185 18 33 7 206 166 -9 50 -123 104
3942 104 68 5 -55 -59 -162 -175 74 -114 -328 -22 -152 5 -35 146 -51 -27 112 75 237 267 114 68 -315 -94
3966 -94 -12 -130 53 -261 -211 134 -379 -8 -114 -52 29 275 137 -92 227 246 -1 168 251 -42 -152 -80 35
3989C5l90K83M3Q7j37N6k92L79j15q9K97k09N2K22R7q8j41o7J04o1q4J31l67K53
4013ak36K24l41K28J21n7M5J40M0p6K27j93M2K6n5q3Q7l9j06J5k6Rp5l6j4m5O9
4040a10m7j27L65l9j42K97q1q1J29k94M3Q5o7K00l21j72K63K67l24n9K5j76M06
4063D0q0q1n5J09K39j1P8k76N8J19j68M6j7r4J43k60j96J62O7M44k51j99O7O2
4087e4J33j21K05j34J73k34K12k36M5J25l01K26l03J39K35l22pJ37M2J16m03M39
4109A12l29K20J38L2Q1k18Q3J34l57J46j0J95l85oJ08O6m2j08J56J3R8k04J60
4132H3j48K58M8l8K3j41j50L09l2K6j84L1j10k27N4pK30k21M0J07K5n4Q5o7J33
4157G3J29O9m2j76L02l73j1R2j67K28k4j58r7l0p9L3J80K00l2j71K20j96K80r6
$$ plain form
3989 35 -355 -72 -29 58 -79 -23 -315 64 -51 -140 157 -52 0 222 319 231 90 23 127 66 -18 113 -254 -1
4013 -1 -237 -13 -354 -126 -5 -62 -17 123 163 87 314 121 163 189 134 51 138 99 -7 8 -18 -9 -84 -120 -134 -179 -110
4040 -110 -157 -284 81 42 -100 197 116 35 164 -130 -87 -2 -69 131 -190 -362 -99 168 -156 -215 -190 -366 40
4063 40 -40 -121 -176 -67 172 161 239 -37 21 140 -28 18 1 -93 50 -210 -406 -244 -177 267 16 -183 -116 -54
4087 -54 79 -42 163 29 202 -32 180 -56 -11 114 -187 39 -264 -125 110 -212 -219 -82 -40 76 -327 112
4109 112 -217 3 141 173 254 36 119 253 -104 42 32 227 -158 -164 -56 10 -32 -140 16 29 127 -77 83
4132 83 -65 193 241 203 226 85 -65 244 212 238 54 85 -25 -252 -198 -205 25 -196 -156 -49 -24 -78 7 -60 73
4157 73 202 271 229 53 355 -18 -29 63 -104 124 100 -58 -155 -185 -264 -231 -51 149 117 -54 166 -30 250 154
4181A54Q3J97l31j20RL05m86O7o7K36k38L13k24K58q4N7m38J57K86K11l12j14
4203h1L70j53j34P2m9P1N5l48J02k10K36L2R8o7l5k80K22J32q2K56k04o7M89k87
4227A38j25J74k74K35j36J00j5k77J82q9L5j56Q3k12J63L81k28O6j08K05k41M60
4249C61j77j50j54J38J72m1Lj40K19l36k40Q7L03N4k13k19J69M09j02M9J78k13
4271A57j31p0Q2L12l24M6K3m9k06J57k04O3J9J64k33J68K88M2k87r1Q8J33K67
4294D14l31J27J08m01L31k69k0J07k37j85L07k50K66R8n23M23Q5q0O5J37N2r4
4316A30j28o8oJ54j69K3J38j60J19r2k60K47j46J90p0J00J39r0j96J71m7O0l6
4339Cp5j2J63l44K77Oj06j3L0j70J4L48l59K84J7l2K5j69J63Q1k7K33m33J33J90
$$ plain form
4181 154 237 434 103 -17 -8 297 -189 -122 -189 47 -191 122 -102 156 72 129 -309 -152 134 345 33 -81
4203 -81 289 136 2 74 25 96 151 -197 -95 -305 -69 -37 61 -6 -41 -321 -99 33 -49 207 3 -64 425 138
4227 138 13 187 -87 148 12 112 97 -180 2 -87 -52 -208 -125 -337 -174 207 -21 45 -63 142 -99 361
4249 361 184 34 -120 18 190 149 152 12 231 -105 -345 -258 45 99 -114 -333 -164 245 143 192 370 157
4271 157 26 -44 38 350 26 72 95 46 -160 -3 -207 -144 -125 39 -194 -26 262 304 17 -74 14 147 414
4294 414 83 210 318 -83 248 -21 -41 66 -171 -356 -49 -299 -33 65 -458 -35 50 -30 35 172 224 130
4316 130 2 -66 -72 82 -87 -64 74 -86 33 -59 -319 -72 -218 -28 -98 2 141 51 -145 26 -21 39 3
4339 3 -72 -84 79 -265 12 18 -88 -101 -71 -241 -227 121 -238 46 63 31 56 -113 50 131 104 337 -96 37 227
4364B27p7j8j22j82J44j90J19m5k65J53J96L1j48K17J56m0Rn2j51J76n3n4k48
4387b17L14l28q9M0J47J29k01K0P2K8o8K62k69J24O3J81k32K97qk53K11l3m57
4410b67K43m1P0R4j82j53J5K99k83L77l9N6j48J06m4j10J39j12p9J60j00J79K0
4433B00j77j03p8L10k80j0j67K96Mj17K21k41K79o0m3J9j51J91R3K5l48K20J46
4456B29k22n0L3K43l61J57M0m16K49L46j29j64Q7K3O6o2J77k17m1kK7j37q3K00
4480gm4k12n6n2J25L57k6lk34L07q5k64L12p4K15j49K9j05K03m52r5M35k60J91
4504E6j32k63N04k73Q0J73q2O6j56Q0lJ84m4j80rM2J35l37J60m40J72K48k48K07
4528f0R4k05m0O9L30l30K33m6j02N4P8j11K01k75KL63k61R5j92K36l11j44L89
$$ plain form
4364 227 150 132 10 -172 -28 -218 -99 -144 -409 -256 -60 -29 -177 40 196 156 165 113 -38 138 85 31 -217
4387 -217 97 -231 -320 -280 -133 -4 -205 -185 -113 -85 -153 109 -160 -36 27 208 -24 273 265 12 223 190 -267
4410 -267 -24 -65 5 99 -83 -236 -221 78 -205 172 133 189 41 147 103 -7 132 20 -59 101 1 180 200
4433 200 23 -80 -158 152 -128 -138 -305 -9 -5 -122 99 -142 137 77 34 53 -98 93 186 211 -137 83 229
4456 229 7 -43 -10 233 -128 29 69 -347 -98 248 119 -45 42 65 131 69 246 29 -12 -14 13 -124 -207 -7
4480 -7 -51 -263 -319 -371 -246 111 85 82 -152 155 70 -194 118 44 259 110 139 34 237 -215 -310 125 -135 56
4504 56 -76 -339 165 -108 -28 145 63 129 -27 53 50 234 190 10 1 43 178 -159 1 -439 -267 -19 -267 -60
4528 -60 34 -171 -211 -142 188 -142 91 45 -57 -3 75 -36 165 -110 -108 255 -6 89 -103 133 -178 -322 67
4551F7l0pj6L0R4jj19n6J46J00j79J15Rq1k4Q2k09K78l03N3k94N6K56K83l70q7
4577b07K95l18L47q3j03J14K00j6q7o1o6PJ98m64J58J77l56L25k0k53L20j57L8
4600a2Q2n9m2N7l5J64j18K39l5k92m2j88j5J23K21k88J31M0K93j96j78P5n4M88
4624C59k66K6J92l11Q8j10k00K92j60K12j72J28m19L96R9r5j17mn0k05K21K69
4646A73j1j16O9j25K68M9k45k92L14j78R6j44M0N4P0j49J85l11K57jJ51j64J13
4669A03qLJ74n8j18r5Om2J14N5l18J53O1k14J53l2P2o9r9J85j07K75k69J39q2
4694a8K21o4r7K20k94k15K61J0J0l98K19J50P7k25kM7J09O1N8L6k28L1J41K62
4718C72j17K1k57K40l12r7K21k5k61lN3J52P1l99K89j97M69k47M5j2O8J44k43
$$ plain form
4551 67 37 30 14 44 138 137 18 -38 108 208 29 144 153 72 48 130 -79 199 -104 -51 -345 -289 -33 250 -120 -207
4577 -207 88 -230 117 34 -69 45 245 229 142 81 15 22 220 -244 -86 91 -265 60 40 -213 107 -50 -12
4600 -12 70 11 -31 26 -9 155 37 276 241 -51 -93 -281 -296 -173 48 -240 -109 -69 224 28 -150 -75 -129 359
4624 359 93 119 311 0 88 -22 -222 70 -90 122 -50 78 -341 55 154 59 -58 -62 -112 -317 -96 173
4646 173 162 46 115 -10 258 307 62 -230 84 -94 2 -142 -102 -48 22 -127 58 -253 4 3 154 -10 103
4669 103 95 98 272 214 96 1 7 -35 79 134 -184 -31 30 -184 -31 -63 9 -60 -159 26 -81 194 -75 64 -18
4694 -18 203 139 42 262 -32 -247 14 24 34 -364 -145 5 82 -143 -145 -98 11 72 130 166 -62 -31 110 372
4718 372 255 276 19 259 -53 -150 71 46 -215 -218 -165 -13 58 -341 -52 -249 220 -27 18 6 74 218 -25
4741b5K42k48q5J47j61kJ03L0l31J38j98M73p9jp5K1M28k88p1l1P2R4r4P2j96
4766f5N8m7L2L2r5N9j15L00j9l32J16J06J43k06J91k85M8R4K32k66j53J91J00
4789A19Qp9p8K3l71K15M11j65r0l01L09K31k67J03j80L24R1j05k94Q0l8n6O2n7
4813a05K09L6m57J67p8J23j55j00L01J39O8J6k8J35k45J22k11N5J94l46k9K9K64
4836A04k4mk25J54Q8k64J62l0OJ92r5j01K36j77J43n2P8p6l41K6K27p5n4J22m5
4861b5j6J96k02p9J25l4J25j21J14q0j14K12J5p5L6n4rp8P1j47l6J44j8j25n7
4886b32L2M23k88k2j8J93q6J34QM2j73k8k21K39q1K42j19r4j78K34m8m1r0J47
4910b5rJ07p0o5J42K9M0O9k38%L52j83J28n31K33J9m9j86P5J22Q0J42l07j1p1
$$ plain form
4741 -25 217 -31 -116 31 -130 -132 -29 1 -330 -192 -390 83 4 3 -72 -51 377 89 18 -13 59 153 59 131 -65
4766 -65 -7 -54 -22 10 -85 -26 -141 159 140 -192 -76 30 173 -33 158 -127 -79 15 247 -19 -172 19 119
4789 119 127 48 -30 -7 -378 -163 248 83 -7 -308 1 232 -35 68 -112 212 303 198 -96 -16 -54 -110 -48 -105
4813 -105 104 140 -317 -150 -228 -105 -260 -360 -59 80 148 164 136 271 26 148 -63 -8 186 -160 -189 -160 104
4836 104 80 76 -149 5 93 -171 -9 -39 -33 159 64 -37 199 22 165 113 191 115 -226 -200 27 -48 -102 20 -25
4861 -25 -41 155 -47 -126 -1 -35 90 -31 83 3 -111 101 116 41 77 23 14 -64 7 -140 -176 -32 -50 -175 -232
4886 -232 -200 223 -65 -87 -105 88 2 136 144 186 13 -15 -236 3 -78 164 45 -49 -227 7 -41 -82 -172 -25
4910 -25 -34 73 3 -62 80 109 149 218 -20 -20 332 149 277 -254 -21 -2 -51 -237 -162 -40 40 182 -125 -136 -207
4935b07M61j26N5j98o1o4K75k2o2j04J41p0k93lK45r9J61l74Q06l62k40J30r5
4958a06Q5L56l63P6K01j85L50m96J79J45l5k22L0J0k81K3J5O9j24J63K38p5QJ65
4982B26r6K2L9m7M9q8j75L0o7l9L51L3k12k79L67k12q7K25m92M07P8ON7l13L38
5007A21j38K17o1j74P7k07K29p9j83J18J87j54L6l9J37Lk39p3N32j78m07L95K3
5030A43j37j03j04L0K15O8m54L06Jj77j7J55O3M8J66k96p0K14kL8K76k34Q4k7
5054A86k58K0K05l65J25l39M79p6n7K2o4J74J6l25RN22j31j34P6j34R0Q5k46J34
5078A4K72j63k15j60J46q9K84q1P4m09J19K74J03j63k1o9L52l60P9JL43l92M1
5101b0J06l49J96K44j77j24J00j41j1o0N48m40K7L23k59M72m54O1J02p0J30r0
$$ plain form
4935 -207 254 128 183 -15 -76 -140 135 113 51 -53 88 18 -275 -278 -33 -132 29 -345 461 99 -141 -11 -106
4958 -106 -21 335 -28 48 249 64 414 -82 97 242 207 -15 15 25 -256 -233 -218 -149 -273 -110 128 53 61 226
4982 226 130 152 191 144 193 105 -70 -40 -107 -146 205 238 26 -253 114 -98 -185 40 -452 -45 33 39 96 -217 121
5007 121 -17 200 139 -35 42 -165 64 -15 -198 -80 107 -47 -11 -50 87 90 -149 -222 310 132 -275 120 143
5030 143 6 -97 -201 -171 44 112 -342 -36 -35 -212 -229 -74 -11 37 203 -93 -163 51 49 87 363 129 213 186
5054 186 -72 -52 153 -212 -87 -426 53 -23 -80 -58 -122 52 68 -257 -248 274 143 9 85 -49 41 126 -120 14
5078 14 286 123 -92 -252 -106 -195 89 8 82 -327 -208 66 169 6 -15 -84 268 -92 -13 -12 331 -61 -20
5101 -20 86 -263 -67 177 0 -124 -24 -165 -176 -236 312 -128 -101 222 -37 435 -19 42 144 74 204 114
5123A14J0J84n05M08j84k49K89k79J52O5P1k88L23j43K31k22p3J03K65q3l3j04
5145E2k73qN1J42P8ql8J06k03mK98j95j73K87J03r4n2j41J57k6k3K62m08J17P0
5170G7J25l14J04j60Q5j05L10r5K8j54Q1K40k63J32p8J93m32L03M3j34L4Nk74
5193b49J69m6q8J39P6N7j58J7L1j52L63j84RJ56j13r6Q0m9k27K20j93J57Q0j53
5217a54k8K93j99L54j76p5K5J7P4j00P1j06O1J67j90P3o3l96J54P4J83k24qJ40
5241c3m0J53l75O71k79p8J05k84K53J28j28j85J59j14O7j02K20j55j75O1j1k01
5263c43K08J10L67k79L6k64R6J23q1K06j50N3j0j74K20r0n1N0m0J95l20q9M72
5286B45k97L4j17J81M7k5J85k97P1m2J00R8k27K25j87j1J13l2l83J63p1K97j0
$$ plain form
5123 114 124 308 -197 211 27 -222 67 -212 -60 5 76 -212 111 -32 199 -23 -96 7 272 189 156 52
5145 52 -221 -229 -178 -36 42 34 -4 102 -101 -105 193 -2 -175 112 215 121 69 -72 85 59 36 298 -110 7 77
5170 77 202 -112 -8 -168 -83 -188 122 27 55 -99 -18 222 -41 91 13 206 -226 77 120 -14 20 25 -249
5193 -249 -80 -126 -214 -75 1 58 -100 -83 -52 -204 159 -25 -16 140 27 -69 11 -38 -265 -45 -238 -81 -1 -154
5217 -154 -182 111 -88 266 90 15 40 57 131 31 102 -4 57 224 34 107 44 -352 -198 -124 59 -165 -173 -33
5241 -33 -73 80 -295 376 97 19 124 -160 93 221 93 -92 67 -47 20 -82 138 -17 -192 -131 -142 -343
5263 -343 -135 -25 342 63 99 -165 -69 54 -27 179 29 82 72 -102 118 28 -23 27 -13 182 -138 -227 245
5286 245 -52 -18 -135 46 93 68 253 -44 27 -15 85 183 -44 181 -6 -17 96 64 -319 -156 -227 70 60
5309F0k1j49K60L2m8k77%Q5J43K3k03M2K94n00J32K37j45k08J40Q7j11L82k86
5332c1O5k17K34j67J00K1J41j53J05M7P0k14J56k60L24k37p6o%j8m0J09p0r6J43
5357g0r9n4m9K94J98j06j63K9K81k20J82j11k28K87l28K0J74k6l29L69j25J19
5379D5j31Q9j73L98k86J07K4j14K64m72M33k27K6O5k43K50j97J48K73m70M4K18
5401G1P7l54J45J1J29M5j15n6J43j25J24j79N1N6O9q7N4q1r4J10l15L80q1j90
5425b12L5J30J70K5r9O3j03K02l60L25k12K4K18m1k13M0k11K18k1k15K99j54R2
5448@J70j0P0k68m4K12l06K28K27k06j49N7j21j34L8K20O4k65J07K54k83J9nQ6
5472c9p9J3O9J38j51J00k38K90q0j14J09M7M1p4k82K92l30K00Q4l3R2Q9p7L1j43
$$ plain form
5309 60 39 -110 150 182 134 -143 -143 -58 85 108 -95 -53 241 -259 -127 110 -35 -243 -103 -16 -127 255 -31
5332 -31 34 -183 51 -116 -16 5 146 -7 98 145 215 1 157 -103 221 -16 -92 -98 -98 -116 -156 -47 -117 -213 -70
5357 -70 -169 -223 -272 22 220 114 -49 -20 261 41 223 112 -116 171 -157 -137 37 11 -318 51 -74 45
5379 45 -86 3 -170 228 -58 49 73 -41 223 -249 184 -43 -17 48 -195 55 -142 6 279 -191 -147 71
5401 71 148 -206 -61 -50 79 124 9 -47 96 -29 95 -84 -33 23 92 5 59 -22 -116 -6 -321 59 -22 -212
5425 -212 -177 -47 123 148 49 112 9 211 -149 176 -36 -12 206 165 -48 -8 -219 -1 -22 -237 62 -92 0
5448 0 170 160 230 -38 -82 130 -176 52 279 73 -76 -19 -140 -274 -236 -16 48 -217 -110 144 -139 -120 -125 -39
5472 -39 -118 -105 -36 102 -49 51 -187 103 23 -91 18 65 106 32 -250 42 -288 -88 -4 -37 55 144 67 98 -45
5497d5%j24J34J92j99L50o38L08J39Q0k39M9k32R5j61M39k0o5P3pp4m9L1J50k23
5522c6J3Q6l5Mo6r7j19K73M0R4j74k34J52Q0P3J13j17J20m1j47QJ54n9m3l5N3
5548F0k40K89k62N3J87lq8Pj54J8J27P7J51k19R7k61L51l36J78j89J72j91K70
5571I4j42q9K58m12J40K20O9n2N7m2J05m11K8M67j84l16L03N3j85J45J7k88J36
5594b9Q5k22r9R5K9j83L15R9J33k20M9k05K11j75q8M9l0L94j81Mj71J64k0j25
5618a21LJ21j50O7j40J66r9L23j64nL4J04mj21K44l28K72j24j39K15k19j01o7
5641b33L11p5J68k24J30M7l1J37j20j01J85l12K92j91k57M44j18Op6O9k79L16
5663H8N3k57o9K21j6j5pl0M4o8L03n6k92K18L2r1K41l3j53j92n4J46J33j02k53
$$ plain form
5497 -45 -45 -169 -35 157 -42 308 -330 -22 117 197 -42 7 -225 -130 -291 148 128 63 136 129 55 6 37 187 -36
5522 -36 -23 63 28 32 -34 -131 -250 23 63 157 -17 -251 -99 -19 54 167 50 170 129 -18 -10 144 85 42 7 60
5548 60 -180 109 -153 -100 87 84 -4 3 -151 -133 -6 71 222 3 100 -161 190 -146 32 -157 15 -176 94
5571 94 -48 -137 121 -291 -151 69 138 86 143 101 206 -205 -177 290 106 -210 93 146 -39 106 123 -165 -29
5594 -29 56 -166 -265 -170 -141 -324 -9 90 223 3 52 -153 58 -117 -205 -156 -186 208 27 31 -140 24 4 -121
5618 -121 -118 3 -147 -80 -220 -54 -153 170 6 1 35 139 135 14 258 -70 202 78 -61 154 -65 -166 -233
5641 -233 78 3 171 -53 77 124 93 230 110 9 194 -118 174 -17 -274 170 52 58 -18 51 -228 88
5663 88 141 -116 -185 36 20 5 -2 -32 12 -56 247 191 -101 117 149 58 299 266 113 -79 -133 13 146 44 -209
5688b09J6L35j24j08j47P7N9N2J52q9K4m4K57j26p1j58l0K59o0j82P1K04l01k4
5712a67J53l65M21L6j31J27j84K30K16m83K8K00l3O3j2N2l13O0R7J30j41l7k13
5735b66K64k3m1Q7R8o7m56M97q6k4K55m25J44qK55j52K4L8r1N7k20J94j79p2L68
5760A71j13k25J19K54r3k43n9K56k24J99o5n1Q9Q6o5P0j06J98k3k13k5J41k20
5783a42P6K87k56O6R5o0l16K59n0j95L38j78J96K1k97n8J45j53J26Q5J65j92p0
5806a08K30j48m2J67k35J35M51n27R5J6j54K66j12l8L0r9J75j11j8R2o2Q2j37
5829e2q6J79j3n3O6j01j26L7K20j60k55L13L1J6j93L33m14L91j01J63j65o5K9
5852fRMP0pj58J75r2j45J54J56k34O2J34m50P9P4K33k2k15K00N7p2k19L66k3q8
$$ plain form
5688 -209 -193 142 18 -90 -237 -160 -101 -49 103 14 38 -6 251 125 54 -104 -134 125 65 -117 -46 158 -143 -167
5712 -167 -14 -379 42 78 -53 74 -110 120 336 -147 -119 81 48 111 99 151 -162 -102 -5 125 -16 -53 -266
5735 -266 -2 -25 -66 21 119 52 -404 93 7 -17 238 -187 -43 -51 204 52 76 114 23 80 -140 54 -125 -197 171
5760 171 58 -167 -48 206 113 -130 -189 67 -157 42 -23 -74 15 101 36 106 0 198 175 -38 -63 78 -142
5783 -142 -66 221 -35 31 126 66 -250 9 -41 -236 102 -76 120 141 -156 -214 -69 -222 -96 -11 154 -38 -108
5806 -108 122 -26 -68 99 -136 -1 450 -77 18 34 -120 146 34 -4 26 -73 102 -9 -27 65 3 85 -52
5829 -52 -138 41 28 -25 41 -60 -186 -149 71 -89 -344 -31 0 16 -177 156 -258 133 32 195 30 -35 -6
5852 -6 3 7 77 70 -88 87 -5 -150 4 160 -74 -12 122 -328 -249 -175 58 36 -179 21 78 6 -213 153 130 42
5878D2k2Q9j09M3j56L35k80k1K3R1J54k23J99o37L63J75j55L04j81J28Ln1k70
5901a56J85p6J32q7Q4l6l27K31j22K62j89K68k22Q2j57j7J75K15rj49Nk72J95
5924A5r0Q4J07l8l48P3R0L4j7J31k30K64j71J60o0J80k77K73rk33J50RJ32k75
5948d6K41k22j35L82m4k4l31L36j18k22K43m50M25J39j80k4N9J10k28m3J09lJ01
5971G5O6r5k25K98j7o2p1l1o5J00o1j46L90l33K66N6k35L85l1r2k90O5M7O9o4
5996ak7j75K14R6J04m9p3l49P7K20Mp3j09K16K8r5J75p2l24J96L2j16J20p7j3
6021g1P7L4k9K4l11PP1K75o4J91j58O2j61Q3Q6q7j92J65J7j47M0j06NP2k31J74
6047a74N6M4M1j74M15j97J16p3r4k08L16r6j29J10p6K18j61L57m30j00J93m0m7
$$ plain form
5878 42 20 109 0 43 -113 222 -58 -79 -56 35 189 -34 165 -472 -109 66 -89 215 34 162 165 114 -156
5901 -156 29 -47 85 -2 82 46 -281 -50 -172 90 -99 169 -53 29 -128 -145 30 245 236 87 92 -180 15
5924 15 -75 9 116 78 -270 -197 -107 -73 -90 41 -189 75 -96 64 4 184 -93 180 171 -62 88 97 229 -46
5948 -46 195 -27 -162 220 176 152 -179 157 39 -183 60 -390 35 174 -6 -30 29 139 -89 -132 -23 -26 75
5971 75 141 46 -179 119 102 40 -31 -62 -127 -27 -88 -234 156 -177 89 145 -90 295 264 172 -118 -53 -6 63 -1
5996 -1 -28 -203 11 107 211 162 89 -260 -183 37 41 -32 -141 75 103 8 183 111 -213 -17 15 -101 19 -58 -71
6021 -71 6 40 11 35 -276 -269 -198 77 13 204 46 108 -53 30 116 29 -163 2 19 -128 -88 -194 -189 -117 -348 -174
6047 -174 -118 -74 -33 -207 208 11 127 54 -40 -248 68 -28 -157 -47 -123 95 -66 291 -139 -239 -46 -86 -133
6070a33J90j15K30l47J75J82k50L9K3J91k64K48m65J19J43L9k86L88kJ6j25p9
6092h3J94j82Q2O8J64j46j59J71j30J13P7k11K72k02k8j14J04j0J21m20L34o4
6114d9L5J44j63r0q7L71k44K21j96N0n2K52k21l50K00K69q8m6PP6m7J20j80Q0
6138A2j95J86q6L47O1l96O0J28J90k75Q3J21m05N65k64k54O6Q8k1q8l0jL0k3q
6163a09J75J07l22K01k08K36m7J86j05K5j07K03j25k24J41k98K36m0L3J95q7o4
6185Bj77L49j4l15o9L00j23O0J0l01K80j4k41J42J37m8qk22M99k98K7k12M55j99
6209B0j44L06j71R6l56L45l38M07j69k5K20k5k14J25j51R4J9r2M0JJ47j90j5J39
6233F9Q6L7l21q2J10J64m1k12J14J72j00k73J65L55k49j03k1J24M1k77M37q7j05
$$ plain form
6070 -133 57 -58 172 -175 0 182 -68 -29 -6 185 -79 169 -296 -177 -34 5 -281 107 105 121 -4 -83
6092 -83 111 -71 11 79 243 97 -62 109 -21 92 169 -42 230 28 0 -114 -10 -20 101 -319 15 -49
6114 -49 -14 130 -33 -123 -210 161 -83 138 -58 -8 -60 192 -29 -379 -179 90 2 -44 -37 39 -8 112 -68 12
6138 12 -183 3 -83 264 325 -71 -11 117 307 32 115 236 -169 396 132 -122 -56 32 11 -77 -107 -108 -78 -101 -109
6163 -109 66 173 -149 52 -156 80 33 219 114 139 32 235 110 -114 27 -271 -35 -75 -42 153 66 2
6185 2 -175 174 160 -155 -224 76 -47 13 23 -278 2 -12 -253 -111 26 -22 -30 -252 247 -51 -24 -236 219 20
6209 20 -124 182 11 107 -249 96 -242 165 -4 -29 191 166 -48 77 -74 20 39 -53 -13 -12 135 -55 -70 69
6233 69 155 192 -129 -211 -101 63 22 -190 -76 96 -4 -277 -112 243 -6 -109 -130 -6 35 -242 195 108 3
6256CK9N6o9K31m63J26J88N4j75N0q2R9J18n2l3J12n29N41j62Q8q2j5r5J12J89
6281B39j64j49j65J78J41j37J54j93K25N1q5l8k46K33j10lp2M62m15k7J22j20
6303a19K9J39p8J22P9k15N0K4r9L05j66k0P9l85K36j87Q4j03J37J65n1Qn6J25
6327A03j12j31K48q9q1P7J12p3Q3J1j05L9J74k06j13J6j95K51m5k0K15J55J6q
6351C22k65j55r3J28O3O4K9kj73J26L16l80m3j21L62k83N8r6J29N3j48J27J82
6374B00k30K61k57q7J60J13K0pn73K05L32o4k14J66K55l45r4L47j62J55N6l1l79
6397a73OL34J24l21J69p6k22J69L6m2r7L77j57j55k4K05Q3k58k8k19K31J3r6J90
6421F9j71K07k02K40j12J76j85j56K04mj04K0L29k24j25l4JL3j95L14R2j93rr1
$$ plain form
6256 3 32 88 19 250 -213 -87 101 155 -20 30 -52 47 165 113 80 192 -337 204 42 130 48 33 -62 50 239
6281 239 75 -74 -239 -61 80 -57 97 -96 129 180 95 57 -189 44 -66 -69 -141 321 -94 -121 1 -119
6303 -119 -90 49 -29 93 172 -43 7 31 -68 237 71 51 130 -255 -19 -206 -122 -225 -88 77 26 34 -22 103
6327 103 -9 -140 108 19 -62 15 127 54 137 148 43 82 256 50 -63 -47 -242 9 -36 -56 159 314 330 322
6351 322 57 -98 -191 -63 0 64 93 91 -82 44 360 -20 -63 -184 178 -105 -47 -143 -14 39 -109 18 200
6374 200 -30 231 -26 -113 47 160 180 173 -400 -195 137 73 -141 25 280 -65 -159 188 26 181 237 206 -173
6397 -173 -167 167 291 -30 139 63 -159 10 46 4 -93 284 127 -28 -52 153 236 -22 -50 -269 -38 -25 -121 69
6421 69 -102 105 -97 143 31 207 22 -134 70 66 -38 -18 311 87 -38 -72 -71 -38 -233 81 173 -20 -29 -120
6445a20O2j61P5J96k56n6L15J82l02N4n5K15l18K54m8k9J14k15p3M06J06l38q3
6468g5N9P5j52M9J58j56q9K46j97p2J88q0K33N1m37Q0J77j4R1k43K64k07K8j96
6492b19J44J29l4N7K10k37J55k03J37Km7j47j63K66R4k36J71J08j37N5l11K63
6514E7O7j96j27J11m6J59M5j48j15L23k21J40or0j96P6p4J23J15P6k30O3K43j31
6538A8j89L02k07j51M54j45J8P2j08J08k86J71J29l01K39p4o2j0J1L3j3Qp3O8
6562A2O0k02K02j88M9K69R8k19j00lJ16j4k29j1K27l3J8Q9j49r9L75l67J3K14
6586A28k88k5L32j61P6l8r3P1R6P2l39K55m1K08j76j61J58j31l2K68m84K81J98
6609A74k78J73l5K0O0l24J05n8K15j84J76Q1k83J35No9L42k15l62K17o7O1L50
$$ plain form
6445 -120 -58 -219 -144 52 -204 -260 55 237 -65 -11 -66 149 -169 85 37 8 122 -93 -166 240 346 8 -75
6468 -75 -16 59 -93 -44 114 -42 -131 115 -82 -154 34 -46 187 238 -199 -119 58 44 135 -108 156 -51 -23 -219
6492 -219 -75 54 20 77 287 50 205 2 139 141 94 -53 -216 50 144 -92 79 187 50 105 -206 57
6514 57 124 -72 -199 -88 -134 25 70 -78 -193 130 -91 49 43 -47 -243 -167 -241 -118 -3 73 -157 -94 149 18
6538 18 -171 131 -76 -227 227 82 100 172 64 172 -114 57 186 -115 124 50 -12 -22 -11 22 9 17 -56 12
6562 12 72 -130 72 -116 -67 202 300 81 -19 -22 94 80 -149 -160 67 34 52 141 -8 -107 268 -99 -86 128
6586 128 -160 -185 147 -14 62 24 -69 2 98 170 -169 86 45 253 77 -84 74 -57 -89 179 -305 -24 174
6609 174 -104 69 34 54 114 -210 -105 -163 52 -132 44 125 -158 -23 -18 -87 255 40 -322 -105 -172 -111 239
6632B39k85M3L11j95j40K03Q1l16p2K94l57J43N9p8K16p9j90J38j43J15J47l64
6654b30M02j27K4p2R2R7j25k04M1J2Q5j69J55J4M6k60L72k20N9J61p7P1k59P5
6678c7K4L2J53j99k16L36j05M44m75J18M6j65k9l10L30K26l50L02L3Ll20K81j07
6701A5l85P8L59l00M11j92q9M6M5r7L16l13O7L44m39JK51j16J36l04J80L7Q6j06
6725C1q4J2o7J81K8k07o9L98m85J55k42K33O8O0QK19m91J67N1p9k93M27j16J5
6749h0L06k48K43l17K35l74K40j13K46m10M66l6j62P6k36pq7L75j89K03k56J02
6771b3j2J2K7k14Q7L75r4q0k40L00j44j85J9J01M0J63l34K11J2K92k22O2k37L03
6795B19j83R1l6j47L58m41j61K80J85j77p5J66m0J41j74j89J96Q3j78L30l46K32
$$ plain form
6632 239 -46 -3 308 113 -27 176 257 -59 -131 163 -194 -51 8 -70 146 67 -123 15 -128 -13 134 -230
6654 -230 172 45 69 -3 89 186 61 -143 -102 -90 -5 -174 -19 -5 41 -219 153 -67 -8 153 76 147 -112 -37
6678 -37 -13 19 172 -27 -243 93 -12 432 -43 75 121 -44 -73 -383 -53 173 -177 125 158 161 -159 122 15
6701 15 -370 -292 67 -233 178 -14 -103 -57 -12 -109 207 -106 -39 305 -134 -133 118 2 138 -166 14 51 137 31
6725 31 -53 -41 -108 73 101 -106 -175 223 -262 -107 -349 -116 -48 12 20 239 -252 -85 -34 -113 -406 21 -95 -80
6749 -80 226 -22 221 -96 139 -235 5 -108 138 -272 194 158 -4 72 -164 -171 -258 117 -72 131 -125 -23
6771 -23 -35 -23 4 -210 -123 252 158 78 -162 138 -6 -191 -172 -71 -31 132 -202 9 21 313 91 153 -84 219
6795 219 36 127 91 -56 302 -139 -300 -20 165 -12 -87 79 39 180 6 -183 13 96 -82 248 -98 134
6817A34k09J72k79L55J44l21K0k6K3l4k35K83m2k92J99K22p4J09j75L32m20p7
6839a91K50o7p6j71K55o0M6q1j02M37j85j07L08k40j55J6J91j78J29Q4l8J88J17
6862C70j63l40J78l90L32j24R6OJ19k66K49n5Q2o6M9J06n9k06J26p7k11J88J11
6885E5J28j00p4M8J69j70N1j24Q2j17L8k19M97k62J16M9j15R9N1k69R5j49J09
6908a2J86q2j93k3K04j62O8n4j88L02p2k8L2j04J93k6J16k94J86ok0q6J42m7M5
6933G7j07l5J7j32J72p3J8K52k59J73l93L27j23r5K37j36M7K27p4j26J0jK1K17
6957B41o37M67Pj39O8K0j4k18N9P6Q8JM7r2PK60n8m25J66j22J10J78Q6l00J04
6982b0J76j48J20l2j14p3L3P3m3J6K72j19J5o1k20J33J05Jp2R1k55K8K42lJ57
$$ plain form
6817 134 -75 97 -182 173 317 -4 16 -10 13 -21 -256 27 -15 -307 -108 114 40 149 -26 306 -114 -191
6839 -191 59 -8 -84 -255 0 -60 -14 -95 -197 240 55 -52 256 16 -139 -123 68 -110 19 103 65 253 370
6862 370 207 -133 45 -345 -13 -137 -41 -35 84 -182 67 12 94 28 77 183 124 -82 44 -33 -244 -56 55
6885 55 183 83 9 57 226 56 107 -17 65 -52 -14 -233 264 2 118 167 52 151 202 -67 28 -121 -12
6908 -12 174 92 -101 -124 80 -82 -14 -68 -256 46 -26 -54 -22 -126 67 41 157 -137 49 43 23 -63 79 32 77
6933 77 -30 -65 -48 -180 -8 -81 -63 189 -70 103 -290 37 -86 -181 56 -80 -33 194 120 -6 4 3 24 241
6957 241 -396 71 78 -61 7 27 13 -205 -146 -70 18 19 66 -26 -19 241 183 -242 -76 -198 -88 90 176 -124 -20
6982 -20 156 8 128 96 -18 -91 -58 15 -28 -12 260 141 156 95 -125 8 113 114 42 133 -122 -94 148 145 302
7007C02l65o0M5j35J54J86j07j29K1R7j3j15K16k65R3L6L5Rn7QK49k52j43L13
7031A23k87M0N0j91M40l39J59P1m0r5K76m7l90L96J4qk9j47J47k29J77L8k3l26
7055b20L79j03O2Nk32J97k53m1r0K56L5N5j87P2J39j51L17j94j17J90j65J51k2
7078H3l73L79O6p1j9l82M93j23o2J60n2o8L4j25K67k71J6O9J17r7R4J87l80k9
7102h7M2r5K77j76Q1j89j06K84%j24R4J48j04J3p0l7j1n4M2ml05L03M5J12j39
7127f0J08j63j0K15J53l71j30L60Rj69N4K54k37q6J2J16l3K48l74J23m8M9O3Q8
7151A71k35P0P5j15R4q8j32j2K25l48N22k99j0J60p6K07j45j93L0L2K86l77P7
7174h1L29j33K39k54K13l55J10l38M19j56j65L96m24J72j44K66q1K56o5j68%o3
$$ plain form
7007 302 -63 -123 -78 -213 -59 127 20 -109 -88 9 -4 -119 97 -168 -75 -39 -4 5 -52 -44 205 -47 -190 123
7031 123 -164 -124 -74 -265 175 -164 -5 66 26 -69 207 160 -230 166 180 172 143 -4 143 -86 91 129 106 -220
7055 -220 159 56 118 123 -109 88 -165 -206 -296 -40 -5 50 -137 -65 74 -77 240 46 -71 119 -46 105 83
7078 83 -290 89 155 84 65 -317 176 53 -9 151 99 31 65 -60 207 -64 -48 21 138 41 135 322 -58 -87
7102 -87 -45 -140 137 -39 42 -147 -253 31 31 -93 1 149 45 58 -12 -49 -60 -114 -72 -76 -381 -78 -33 79 -60
7127 -60 48 -115 -125 90 243 -128 -258 102 111 -58 -4 250 13 -73 -61 55 22 270 -104 19 -29 20 83 171
7151 171 -64 6 81 -34 60 -28 -160 -172 53 -295 227 -72 -82 78 2 209 64 -129 -99 -67 219 -158 -81
7174 -81 248 115 354 100 313 -42 68 -270 149 -7 -172 224 -200 -28 -172 94 13 269 204 36 36 -27
7196b7KN1L5k53K87M3j13m4O9K23k35J45j84j00K59j13P8l80K81l8j46J92J78
7219B10k21l0mK9R5o2lO8K3q7P7J29l77K38l40L05j15J51p1L36l99j38J60N8L36
7244C68m90K8J31j69K60j77k3J%L48k87J44rqk72K16J62pj74j14P2O1O1l44J76
7269d6N8j71R5K68j17j34n8J37J79l20M07m00L6J20j55K98p9j09m4J20p8O8j48
7292g3K58l55Q1J87N3j19n4m2k75L66K0j74P8o1L04j44j28P0j5j50K54J60k73
7315c2K64l50K6J26J32p0k65k9K39OP0No2j00J95j23L0j89j26M25o9O4l04L11
7339A74k98J23K5M6k06K87o2k44L28k10p6k10M14p7M9J27l06o9K20m3k64M10j73
7362c5l27K64K62n7k73J66J98j5j18LJ09k63J21jj95L6P0O9n8K50l31j47J44O5
$$ plain form
7196 -27 -25 26 61 -192 95 138 25 -19 50 273 38 183 -1 -101 158 45 123 -257 24 -14 -160 32 210
7219 210 -11 -41 -45 -16 79 17 14 82 105 18 95 224 -153 85 -255 50 -65 86 15 351 -48 -186 -26 32 368
7244 368 -122 -94 37 -132 128 -49 -72 -71 -71 277 -10 134 125 117 -155 61 223 216 42 -72 0 61 122 -222 -46
7269 -46 12 -159 -64 204 87 -47 -105 32 211 -109 298 -102 -66 54 -101 197 118 9 -35 85 7 75 -73
7292 -73 185 -170 -89 98 151 32 -22 -64 -339 27 47 -127 -49 -110 194 50 -78 -8 -23 -173 81 241 -32
7315 -32 232 -118 -92 34 166 96 -169 -198 41 47 117 122 60 -40 155 32 62 -127 -253 172 103 167 -137 174
7339 174 -124 -1 24 70 -136 151 89 -155 173 -37 -113 -323 91 14 63 190 -116 -185 35 -8 -272 138 -35
7362 -35 -362 -98 164 107 -166 0 198 183 65 68 177 -86 35 34 -161 -125 -55 14 -44 206 -125 -272 -128 -63
7386f3L2n7K35k26L02m9L11n63p1K05j27J37q8J86K3p0j68M63l79m6k2K35J5j97
7410A8j03M7K2p9J04J53j74J0J57l88J21K26j5j32J06l4n1j85K94Qnj10J24j96
7434h2r8L43j40K8M6l82L91j26l5J09JN7j7k24K54k87K01jk34q2L57q6n6L54l80
7459h9l9J11P7j31P6N2N8l41J82K94k25k49K13n8k31M98j66O1l27J50J99n5o8
7482hK69j94q9M1j32J16J01m24K99J40j69J84j43m13L85j68K03j96J48J04k05
7503a51K40l09M55l69K56k38J04q2mJ43j48R8l4J35n3N1q8k10R4L2pJ58J4j49
7527f2J20J96j05j37j71L38j26j43J56j9j49J04k61K82j92J54J93l54J67j7J24
7548I8j88O6K74l28K77l10j32L86q9m7J24j69J06k03R9K6L0k53K38j31J5r6K47
$$ plain form
7386 -63 -31 -88 147 -79 223 174 485 -78 -149 56 -71 66 -22 164 187 117 -51 412 33 -13 -35 200 215 18
7410 18 -85 -38 -16 -95 9 162 -12 -2 155 -233 -112 114 99 -33 73 39 -12 -197 97 105 100 -10 114 -82
7434 -82 -180 163 23 51 97 -285 106 -20 -55 54 55 112 95 -129 125 -162 39 38 -196 -278 79 -7 -63 291 -89
7459 -89 -128 -17 60 -71 5 57 115 -226 -44 250 25 -224 -11 -69 -300 198 32 93 -234 -84 115 60 -8
7482 -8 261 67 -22 19 -113 3 104 -320 -21 119 -50 134 -9 -422 -37 -205 -2 -198 -50 54 -151
7503 -151 89 -220 235 -134 122 -116 -12 -94 -98 45 -103 -5 -39 96 43 94 6 -204 -110 -78 -85 73 87 -62
7527 -62 58 254 149 12 -159 179 53 -90 66 47 -102 2 -259 23 -169 -15 178 -176 -9 -26 98
7548 98 -90 -24 250 -78 199 -111 -243 143 54 7 131 -38 68 -135 -36 -10 20 -233 5 -126 -111 -207 40
7571D0j6K72k05K6k13K04N4l83K21O7k6j79J23o0l5K60N9j66M8k37R6J66k99K11
7595B8j04J54Mk35L09j01m6J87j37r8K79k37jJ86l74L22k6l54K46m3p2Q0q7L63
7619B43k54k6l4L14m68n8N31l24O4Lj12oK85k52R4O2j04r0K8J05l21J55J3J08
7643d4J05K2j06j8J64k21n9J09J31m0j05l4K42k51qO7j75J66J62j82O6rjk55J55
7668a19oK53l37J13K75q8j95K36k00J65k11j51M39k97J29n8J64k22J41j16K28
7689A43r1j40K23k71P8O6L3R3K3j65qJ63j06J89l91K15j61K10k03m5L10k71L45
7712B39m41O8P5Q9m1j28J45o4o0L54k48N0o0k11J64p0K09K3K35k51P3k07k15K44
7736b8l9Q5K41n84K27J35J42p6k44J65k66K54j22K15m1k48J97K54k24Q4j03N8
$$ plain form
7571 40 24 296 91 117 -96 108 162 -221 0 67 41 -138 -15 -75 -110 150 209 43 91 -146 -50 116 -183 28
7595 28 -76 78 82 -153 156 55 9 196 59 -39 240 3 2 188 -186 136 110 -244 2 -41 -113 -33 -120 243
7619 243 -11 -37 -71 243 -225 -283 248 -76 -12 -9 -121 -127 158 -94 0 62 -42 -132 -104 1 -320 -165 -152 -44
7643 -44 61 83 -23 -41 123 -98 -157 -48 83 43 -62 -96 146 -105 -113 -46 -221 -55 107 -75 -9 -18 -19 -274 -119
7668 -119 -125 128 -209 -96 179 91 -104 132 -68 97 -114 -265 174 -123 6 -52 112 -110 31 -85 143
7689 143 52 -88 135 -136 -58 8 41 134 157 -8 -16 147 41 230 -161 54 -107 103 -100 -145 165 -106 239
7712 239 -202 -134 -59 30 -11 -139 6 -58 -118 236 -12 38 -22 -233 -69 -139 70 93 328 77 150 -57 -272 -28
7736 -28 -67 18 259 -325 -98 37 179 103 -141 24 -242 12 -110 105 64 -184 13 267 43 127 24 82
7758H2k34J42j6o9k12K40K23J09k97j85L01Lp9p2q2J10J35k14P5L5m3J0j19K04
7782D7j06K44j68m29N05k10oj45K08O2m3o6L10k64K53j38r1k3p8R1pj04L23m5
7806A20j18j99J39J23j30j29J62L8J1j87N4l5K82j38O0Q3j08mP2k71J39k6j65
7829b27L86j99Q7O1l9J54k69oJ00M7l9j60j28K5K43N6q8K92j51j89K56j62N5p3
7853C2m8J6j30r2K44Nk06K40m7j88J92J6L6J1j43K10k77K50p7j95K11k58O6J67
7877C5m6J52k48K61l47J79L00k04j21J92q7Q6j76J3KR9k45K83k44l8J96M0q3r1
7901i2k4q3K12m4q4lL42j49j47K09k7k88K77j65K50J5k08q8R3k25J89J01M3p3
7925C1Q4r4K31k76j44K49o8r6J47N9k08j44J65k55L58j05J08m5l36L36L8M8j60
$$ plain form
7758 82 -152 -10 -26 -95 -307 -67 156 265 -32 -217 84 87 8 -64 -146 -36 99 -115 -40 -5 -48 -38 -157 47
7782 47 -59 185 17 -412 93 -117 -123 -268 -60 2 -41 -107 203 -61 192 54 -37 -60 -138 -47 -54 -158 165 120
7806 120 2 -197 -58 65 -65 -194 -32 6 17 -170 -116 -151 131 -7 53 136 28 24 96 -175 -36 -62 -227
7829 -227 159 -40 47 108 69 223 -46 -52 48 95 56 -104 -232 -207 36 92 4 296 145 -44 212 50 105 32
7853 32 -16 0 -130 -222 22 27 -179 61 14 -174 18 34 70 81 -62 148 -129 121 44 -151 60 -198 -132 35
7877 35 -11 141 -107 154 -193 -14 286 82 -39 153 66 152 -24 -11 -9 90 -155 128 -116 -154 42 82 -1 -92
7901 -92 -116 -199 13 -31 -115 -118 224 75 -72 137 110 -178 99 -66 184 199 -9 -97 -4 -229 -40 61 104 31
7925 31 115 21 252 -24 -168 81 13 -83 64 123 -85 -229 -64 -319 39 -66 42 -3 -339 -3 35 83 -77
7948g7m7K69Pj01k7J65k42Q1l90O8K76Q3M2j37P1j74N3L7MJ43J94l96j36J36M9
7973d9k3L61k54L09k82O2l54L90j15N3q8k85O56J8l77j3k5j30J60M0r4p6j3m6
7997a75K21k08M13m34P6oL70j22jk94K74l69K08j81L70j82Q5j34j12O7J24j3J54
8020A31p6j35K7r5J02K58J8j08J63k14l8J66k93O8r5P2mM7j7P0L7J9p7K3M7j41
8046d5N6j46Q7J24j02M8K40j06k1q4P6l66M33m88L28l00O06k75k29O9R6l1O2M6
8070G8K03l48J47n6M8K3l33K60j22m8N4J02p9J35J34j07k68k7K20K57k20l4K08
8093B27l15%Q1J71j84oK7j2K89m74RL1L81l71Q6J63l5m2m3L8Q7KN4J91m66M6m0
8120a05l0M1J80o7j12K18K2r9l50L17k53K08Q1J21j75J47r3q4J7L3J7M5q4K04
$$ plain form
7948 -77 -124 145 152 51 24 189 -53 28 -362 -294 -18 65 107 -30 41 -133 -80 -43 -39 104 298 -98 -234 -98 -49
7973 -49 -72 289 35 344 62 124 -230 160 45 98 10 -275 381 399 22 9 -16 -146 14 54 -40 -116 -129 -175
7997 -175 46 -162 251 -183 -107 -113 257 135 134 -160 114 -255 -47 -228 142 -40 45 -89 -201 -134 -10 -23 131
8020 131 55 -80 -53 -148 -46 212 230 122 285 71 33 199 -94 -26 -121 -49 -53 -6 -23 47 84 103 26 49 96 -45
8046 -45 11 -135 -48 76 -26 22 262 156 135 51 127 -239 194 -294 34 -266 340 65 -164 -95 1 -30 32 78
8070 78 281 -67 80 24 72 95 -238 22 -100 -148 -94 8 -71 64 198 91 -177 -204 16 273 53 19 227
8093 227 -88 -88 -7 164 -20 -26 1 -11 278 -196 -187 -156 225 -146 -60 103 68 26 -17 21 108 110 164 355 -111 -65 -105
8120 -105 -135 -94 86 19 -93 125 147 48 -302 15 -238 -30 51 172 -3 144 51 -33 -16 17 34 79 -5 199
8144A99j06J24j15k3j88K32l20K78K4l7k03M0RJ04K21k66K10K4j14k0m5J02n7
8167G3P9k49k4J93j33j08j9K96k62M09Pk32j94O2Q6J05k6k37K04K13j26r9J78
8190A96j72
$$ plain form
8144 199 93 217 102 79 -109 123 -197 81 105 68 -135 -95 -86 18 239 -27 183 207 93 73 28 130 73
8167 73 152 -97 -121 72 -61 -169 -188 108 -154 255 262 30 -164 -102 -16 89 63 -174 30 243 117 18 196
8190 196 24
8191B4
$$ Imaginary data points
##PAGE= N=2
##DATA TABLE= (X++(I..I)), XYDATA
0@%%%%%%%%%%%qJ6j6J6j6K4l2M0m8N6p2Q0q8J07j31J52j76K05k34K69l07L47l93
34b09M45n03N66o32P06p91Q83r81J090j208J337j478J631j801J986k188K408k652
52a391K924l225L563l939M364m855N421o082O868p822R010j0533J2567j5440J9839
67A1269k7489M4526j52822M5014J80206k12357K8618J52856r3646j46645J56044
78a4426Q2992j03318m94J08503l9566n0143N2510J8320o6331Q548O0390o536o3269
91a2820L246L9092k3610l8355N9848L1440r1298l1977R4120P69o7737M7872L6453
104D7043q9272K052R4609l6521n8781P2804k369r8741N0809R0614p9034m0277
116d7064J04794N76r8227K4815N6814n0937j9883O9584K2285l9526k3027j0251
$$ plain form
0 0 0 0 0 0 0 0 0 0 0 0 0 -8 8 -8 8 -8 16 -16 24 -24 32 -40 40 -48 59 -72 80 -96 109 -125 144 -163 184 -209
34 -209 236 -267 299 -333 373 -418 465 -516 574 -634 703 -775 856 -945 1041 -1147 1261 -1391
52 -1391 1533 -1692 1871 -2068 2296 -2559 2862 -3220 3648 -4174 4836 -5697 6870 -8570 11269
67 11269 -16220 28306 -124516 -79502 100704 -111653 -83035 69821 -23825 -170470 -14426
78 -14426 68566 -34752 -35246 73257 33691 -16452 36058 54378 -11953 -3405 56985 50449 -12820
91 -12820 -9574 29518 5908 -32447 27401 58841 -32457 -64434 29686 30455 -37282 10590 47043
104 47043 -42229 -40177 54432 17911 -40870 31934 29565 -69176 -18367 72247 -6787 -47064
116 -47064 57730 58306 -39921 -15106 41708 -9229 -29112 40472 62757 23231 204 -10047
128a0047r883M227J0011J5349R783k0800j9508Q143n077p528K1123J689j7193
141a9711K6390J9039l7514j962L7696j9645k2995M0274J083m8741J4457K9037
153A7408l1379M51L5079l6265l6411M4839J3711l9771K3041L7512l8487k0346
165c0618M7448J1936k8541P203J6664j3924q646R513Q102K94r212q427K363j0099
179e944k1189Q032J5431q606N211J6192k3526k1834K2759N591j6459K5398K2171
192B3227l0227o870L0440r444k0708K4659O504k7583Q814K1484j7540l497K3443
205B2702r850j9180J4362M851j8941O881J9156p824q444P873m196j3917j695K363
219e859l72J010N94M44q27p261k126P224k220l665J1584M422p897J0631J3200
$$ plain form
128 -10047 -19930 -15703 -5692 9657 19440 -1360 -20868 -12725 -17802 -25330 -4207 -2518 -19711
141 -19711 6679 25718 -11796 -13758 23938 4293 -18702 21572 22655 -26086 -11629 17408
153 17408 -13971 -13520 21559 -14706 -51117 -6278 7433 -32338 -9297 28215 -10272 -30618
165 -30618 16830 28766 225 7428 24092 10168 1522 11035 19137 19431 10219 1792 4155 -5944
179 -5944 -27133 -19101 -3670 -12276 -7065 9127 -14399 -36233 -13474 -7883 -24342 1056 23227
192 23227 -7000 -13870 16570 7126 -13582 11077 17581 -10002 -1188 20296 2756 -741 22702
205 22702 12852 -6328 8034 12885 -6056 825 19981 12157 3713 11586 7390 -6527 -8222 -5859
219 -5859 -6231 -5221 -4627 -4183 -5010 -12271 -14397 -7173 -9393 -13058 -1474 2948 -4949 5682 18882
234A8882j3959o384J5933n211j4942J6140R235k2189k031J8402j1959j5951J3119
247i15N93j9067P245J8549q226q364J0662J633p742P006R467p383q948L517P011
262E038J706L29K410m383j3781n290Q290Q89o609Q206J0612p913m540P744p911
277e203j3018J2709J6536l042O88P445j1534j2790R028N718r290k63O984m036
291f8j075P300m357j1670l93N654M162O116L558o602n010J984L433L798Q17n164
307B483m638R2R21Q9o03l739k027N024K999l571l874l531k908P955J3768K397
323A0837n024r80l231m873N614N472o577k715R598L076n016j683o982j3752L29
338a5907J4957P247j609j17l456p613N25O744o9m535K694P287J825l386l646n659
$$ plain form
234 18882 4923 -1461 14472 9261 -5681 10459 19694 -2495 -4526 13876 1917 -14034 -915
247 -915 -322 -19389 -12144 6405 -1821 -10185 477 2110 -5632 1374 10841 3458 -5490 -1973 5038
262 5038 6744 7073 9483 5100 -8681 -13971 -5681 -4792 -11401 -3195 7417 -496 -5036 2708 -5203
277 -5203 -18221 -5512 11024 7982 8670 16115 4581 -8209 819 6537 -2753 -3016 3968 -68
291 -68 -1143 6157 1800 -9870 -10263 -4609 -447 5669 9227 2625 -2385 -401 3032 6830 7647 2483
307 2483 -2155 -2063 -1142 -1053 -1656 -5395 -7422 -2398 601 -2970 -6844 -10375 -13283 -5328 8440 10837
323 10837 5813 4833 1602 -3271 2343 7815 1238 -1477 8121 11197 6181 4498 -2484 -16236 -15907
338 -15907 -950 6297 4688 4571 1115 -6498 -5973 771 702 -3833 -1139 6148 7973 4587 941 -4718
354d718o845J696J0486L619p101l280K099j669J603Q237N93p078K371Q099q50
369G262k549K084j430l288O065N462o276j0550m356j431J855O164L732l011o002
384f269l191N65J355k77K025N622L796L031L219k888q893l446M588K762K544L717
400H260k950o210n74J107l865j766O52M00M069O872J483m262k240j918L04O144
416E506M287k791j351M79l416m2L201m085n749J405K001k910K93O43l348k05N513
433e69J762k952k093l641j751M918M483O31M33j932n037q50N91k064J672M976
449a423Q07J788M437k661o739K521N038J24J844M470j960m112J134l8l289k850
465i09l932k552J856N76j705J591N55n013j091K964j59J961P250L579L83M136
$$ plain form
354 -4718 -11563 -9867 619 4238 -2863 -6143 -4044 -5713 -4110 4127 4720 -2358 13 8112 7262
369 7262 4713 6797 5367 2079 8144 13606 7330 -3220 -7576 -9007 -7152 -988 2744 -267 -6269
384 -6269 -9460 -8895 -7540 -7817 -5792 -170 3626 6657 9876 6988 -1905 -5351 -763 1999 4543 8260
400 8260 5310 -900 -1474 -367 -4232 -5998 -5346 -4946 -877 5995 7478 3216 976 -942 -638 5506
416 5506 9793 7002 5651 6130 2714 2672 5873 1788 -3961 -2556 -555 -3465 -3172 -2529 -5877 -6082 -569
433 -569 1193 -1759 -3852 -7493 -9244 -4326 157 788 1221 -711 -5748 -6598 -6007 -8071 -6399 -1423
449 -1423 -616 1172 5609 2948 -3791 -1270 3768 3892 5736 10206 8246 4134 5268 5230 1941 -909
465 -909 -4841 -7393 -5537 -4961 -6666 -5075 -4520 -9533 -10624 -7660 -7819 -5858 1392 4971 5354 9490
481I490P56m647K533N228k183j661K460j647l533J70m12k458j492m624m979K358
497d641J733k755M259O017n728p633K526J146k356N972M800l381j789j99l943
512e972J301N242l639l681N327J310m288K789N248j669l08K954j791k290L37j654
528g84K495P835l75p315j916k701o518K792O611n70m63J240m057j432N896j837
544a099n522O013N695n312Q0P293k436o699J264J78l987j765p84J701O518J96
560A334o932j516P35m216L697J2549L973m990q12N14j162M214M021k286n60l73
576H190n548k605K519j976k999K115l48l883l628m584j982Q709P971j653P24J690
592B712q340l933J1195P419l655Q44K988l398K38K622l796l248J715j528n1O179
$$ plain form
481 9490 10246 5599 8132 13360 11177 9516 11976 10329 6796 6966 6554 4096 2604 -2020 -6999 -4641
497 -4641 -2908 -5663 -1404 4613 -1115 -8748 -6222 -5076 -7432 -1460 3340 -41 -1830 -2029 -5972
512 -5972 -4671 571 -3068 -6749 -1422 -112 -4400 -1611 3637 1968 1660 4614 2823 533 870 -784
528 -784 1711 9546 9171 1856 -60 -2761 -9279 -6487 124 -446 -909 331 -3726 -5158 738 -1099
544 -1099 -6621 -608 5087 -225 -145 7148 4712 -1987 -723 -545 -4532 -6297 -7081 -5380 1138 1334
560 1334 -5598 -7114 -6379 -10595 -6898 5651 9624 4634 3822 4336 3174 7388 11409 9123 8563 8190
576 8190 2642 37 2556 580 -2419 -304 -652 -4535 -8163 -12747 -14729 -6020 1951 298 1022 2712
592 2712 -5628 -9561 1634 9053 5398 6242 9230 5832 6070 8692 4896 1648 3363 1835 1784 7963
608G963q4o850J99K338m222k612N15j419K225N523j470m786k580p471m819R038
624h512P731l908k066N10m406L16P899L308j628L144N20k308L567K885l886J238
640D404O360j418n415j654n282m137N192M591j289m38l375p603R80O753k0j128
656c479M974J220j722M220J966m936k291J685j086J959L564k747k501P93j906
671b87l937l02o17j394M651N957m59j318j541m788p8P135L464j253O20j727m562
688d36O25L652k627j808P96j887k273J661J53r29J917J997l36K40k036l381J934
705b738M291K82J378J805n193m494K509J053k941J755K204k689M70N135j433l453
721b059J719Q00k135L927L903j319j22J408k281k816q26k795q79K798O71j299
$$ plain form
608 7963 7879 1029 1228 3566 -656 -3268 -2753 -4172 -1947 3576 2106 -2680 -5260 -12731 -17550 -8512
624 -8512 -781 -4689 -6755 -6245 -10651 -10335 -2436 872 -756 2388 2908 600 4167 7052 3166 4404
640 4404 10764 9346 3931 2277 -3005 -7142 -1950 2641 1352 914 -2461 -10064 -9084 -2331 -2351 -3479
656 -3479 1495 2715 993 5213 7179 2243 -48 1637 551 2510 6074 3327 826 1619 -287
671 -287 -4224 -4526 -5143 -6537 -1886 4071 3612 2294 753 -4035 -4113 3022 6486 5233 5853 4126 -436
688 -436 189 3841 1214 -594 202 -1685 -3958 -2297 -2144 -3073 -1156 841 505 745 -1291 -4672 -2738
705 -2738 1553 1835 3213 5018 -175 -4669 -2160 -1107 -4048 -2293 -89 -2778 -2308 2827 1394 -2059
721 -2059 -340 460 -1675 2252 6155 4836 4714 6122 3841 1025 199 -2596 -3475 -677 -6 -1305
737a305L70k000m962M29L415k54J047L331n9q07K918R80r17J110N27k305K05J807
755C530j962m5K342j579l417R5j302k457J958L291j151J581K471k306k406K331
771I74M37j907K310K156k431r37J076j343k288N3j023j627M91N87R20J467Q97
788a88j067J44M71l04J228J102o4J791J891j388j543K01k004l318J267K022j764
805a523K07J868o66j780J145j30j890Q28K697J249K268J273j452k432j181l98
821H3LM99l33j90P61j385j665j41j414k025K033L630j39n33J828q30j745L064
839A501J846k130p35M63q25L66K054j214k096R3J64j104Q67m25j868J122L779
856A858J062M92L69k693k613J772J441m2N2Q35j288p80o7l392l238l80J096K806
$$ plain form
737 -1305 -935 -2935 -7897 -7468 -4053 -4307 -3260 71 12 -795 2123 3103 2186 3296 3823 1518 1723 3530
755 3530 1568 1523 3865 2286 -1131 -1036 -2338 -4795 -2837 454 -697 884 3355 1049 -1357 974
771 974 1411 -496 1814 3970 1539 602 1678 335 -1953 -1900 -2923 -4550 -4059 -3472 -2552 -1085 -188
788 -188 -1255 -1111 -640 -944 284 1386 1322 3113 5004 3616 2073 2274 270 -3048 -1781 241 -1523
805 -1523 -1316 552 -114 -1894 -749 -879 -2769 -1941 756 2005 4273 5546 4094 1662 481 83
821 83 86 585 252 62 823 -562 -2227 -2368 -3782 -5807 -3774 -144 -283 -816 1012 182 -1563 1501
839 1501 3347 1217 482 945 120 486 2540 1326 -770 -677 -513 -1617 -750 -1175 -3043 -1921 1858
856 1858 2920 3412 3781 1088 -1525 247 1688 1646 1698 2533 1245 465 398 -2994 -6232 -6612 -5516 -2710
874b710L490M64k201j409k1O06K450K294o9O41K726j42j622m37k495k606J368
891C27K474j468j919o46k098j698K394Q96k092o07J074N41J021J738j73p50Q22
908a64J445N16r87j684j149P91J615J590K82j476k550k35J020m48P46J923J73
925A408R04K612o95l241j605n77j04K417K968q20k352j505k072j228R02M62l49
942b875J800K236m90j14O2j487p83K974K024o30j43o34j905L02R48p83j269p98
960a565j155j26J786M80m23J091J94j11K171M69j732J287J639k82Q90J968k134
977D447l706K91k52l083o88J172j741l67K136o47l336k20j32m51L087L486N03
994D99l16Q07o94p05O28M71J47J253J054o22j9j398k457j28R25j76j22Q95r93
$$ plain form
874 -2710 780 1244 -957 -2366 -2387 -1781 669 2963 2894 3535 6261 6119 4497 4060 1565 -1041 327
891 327 2801 1333 -586 -1232 -3330 -5028 -2634 -1738 -3830 -4437 -3363 -2822 -1801 -63 -236 -986 -164
908 -164 1281 1797 810 -874 -2023 -1232 383 1973 2255 779 -1771 -2006 -986 -1434 -688 1235 1408
925 1408 2312 4924 4229 988 -617 -1194 -1298 1119 4087 3267 915 -590 -2662 -3890 -2988 -2526 -2875
942 -2875 -1075 1161 671 557 619 -868 -1651 1323 3347 2717 2574 1940 35 337 1285 502 -767 -1565
960 -1565 -2720 -2846 -1060 -580 -1003 88 282 171 2342 2811 1079 2366 4005 3723 4613 6581 4447
977 4447 741 1032 780 -2303 -2991 -1819 -3560 -3927 -1791 -2438 -5774 -5994 -6126 -6577 -3490 -4 499
994 499 183 990 296 -409 219 690 837 2090 3144 2522 2503 1105 -1352 -1480 -555 -731 -853 42 -951
1013i51m35J700K85m86R7j500j428Q95J322m91O13Q06j348j816Q11P2q11J991
1031f74J944m16J497J289j011J74K330j29j599J022N79j292j31J213j145k328
1047A323k050j667q95L57J27J044J141j366j181J57M45j75K568J616q73R14J079
1064B564j404n31K099j373l228Q40N62k684R62K505j076j798J223q70j875J183
1080b901K173J113K417J668k023j688Q5m07J48K384J88j770p90o84j283L03J74
1097h93j748j88P96j60q7J703J04o18J100K30j458L4M87o7J426J762j820j778
1115a175M30n23l26J949J140k202L52J672J90R30J773j418j554K88R3m29R57P51
1133B898r48n62q97k322j940q07Q0J788K998P7j652q32r01M1K853K587j6J72J245
$$ plain form
1013 -951 -1386 314 599 113 210 -1290 -2718 -1823 -501 -992 -379 427 -921 -2737 -1926 -1854 -2665 -674
1031 -674 1270 854 2351 3640 2629 2803 5133 5004 3405 4427 5006 3714 3583 4796 3651 1323
1047 1323 -727 -2394 -3289 -2932 -2805 -1761 -620 -1986 -3167 -3010 -2565 -2740 -172 1444 571 1485 2564
1064 2564 1160 629 2728 1355 -1873 -1033 -471 -3155 -2193 312 -764 -2562 -1339 -2209 -4084 -2901
1080 -2901 -728 385 2802 4470 2447 759 844 437 585 2969 3157 1387 597 -87 -1370 -1067 -893
1097 -893 -2641 -2829 -2033 -2193 -2280 -577 -473 -1091 9 239 -1219 -1185 -698 -765 661 2423 603 -1175
1115 -1175 -745 -1268 -1594 355 1495 -707 -355 1317 1507 2437 4210 2792 1238 1526 1619 1190 2147 2898
1133 2898 1950 1388 491 -1831 -3771 -4578 -4498 -2710 288 365 -1287 -2119 -3020 -2979 -126 2461 2445 2617 3862
1152C862p42l70J029j280k030R40K90j444l64M71k011n71J245q26j260L27J91
1169b543K63K417J228j224o72K39k95R99J009r69j232L08p29K83J782J7k818P0
1187a867L35j011L96L010M67j11J947k41k398m77K00p55K285K359j023j758q75
1204D83j816j839J706R96j064N69O44m37N35P96j298j77J325M02l09J322J79j783
1222B34q4O20j285j256l81k77J60J396j31p28O78k59l40J775J650r93j87J145
1240A737k72Q58J745m76j938j33p47j844K34R27n64j45J241p15j596j200L5O49
1258b204K108J528J84M81o91j580L36O74j68n85N70j83o98M88n14j335r1K33j102
1277b549J088J335j36J72J591q2q24N59J8q57P71J037o90n53L50j920p10O88o98
$$ plain form
1152 3862 3120 2750 3779 2499 469 1409 1699 255 -109 362 -1649 -2220 -975 -1801 -3061 -2734 -2543
1169 -2543 -2280 137 1365 141 -531 -292 -587 412 1421 452 -780 -472 -1201 -918 864 881 -1937 -1867
1187 -1867 -1532 -2543 -2147 863 1330 1219 3166 2925 527 50 250 -505 1780 4139 3116 1358 483
1204 483 -1333 -3172 -1466 -470 -1534 -965 -321 -758 -223 573 -725 -902 423 825 516 1838 2017 234
1222 234 150 770 -515 -1771 -2152 -2429 -2269 -873 -1004 -1732 -1054 -1313 -1653 122 1772 779 592 1737
1240 1737 1465 2323 4068 3592 1654 1521 774 -1070 -836 91 -473 -618 623 -92 -1688 -2888 -2853 -2204
1258 -2204 -96 1432 1616 2097 1406 -174 162 836 668 83 653 470 -228 260 -254 -1589 -1680 -1447 -2549
1277 -2549 -1461 -126 -262 -90 1501 1419 595 1154 1172 315 1086 2123 1433 880 1230 -690 -1400 -712 -1410
1296a410j059O40K38n10J333J317p77p0P47n62l7J212N64k21J211L37j425j120
1314D08m5j548Q8Q15N16o06O21m38j024N75L08m42O83J279k67LJ062j63j210M3
1334F58k46j773J2P33m10Q0P79o72j011P2o2j8N49J018O51R74L91k38l34j7o12
1355E24j02N95m26j60J01K7j304j42j2j083j24J394M93O57N26L02o45K55L95r2
1375A179L69k4n14o1K85p95o36n68r77n07K00l1n33Q71K75K13P10P17n24k10O27
1396F6O74P29J190L60r71j93n4j512O4o9q04J20J043K60j002k1m59j235O10J075
1416a29Q5J04J144n9m74K32p99j299K41Q60j21L27M91j258o01N44J64R5P19K10
1436D76o20J530P76m82j59J12m17k98L25o34j048j60n9l08K39p1j588o78J84K04
$$ plain form
1296 -1410 -2469 -1829 -1591 -2101 -768 549 -228 -298 449 -113 -150 1062 1626 1405 2616 2953 1528 408
1314 408 363 -1185 -1097 -282 234 -372 249 -189 -1213 -638 -330 -772 -89 1190 923 926 1988 1825 615 658
1334 658 412 -1361 -1349 -616 -1026 -946 -167 -839 -1850 -1778 -1840 -1858 -1309 -291 360 1334 1725 1487 1153 1136 524
1355 524 422 1017 591 431 532 559 -745 -887 -899 -1982 -2106 -712 -219 438 964 1266 621 876 1271 1179
1375 1179 1548 1524 1010 949 1234 439 -197 -765 -1742 -2249 -2049 -2080 -2613 -1742 -1467 -1254 -544 173 -351 -561 66
1396 66 740 1469 2659 3019 2048 1855 1801 289 353 284 -520 -400 643 903 -99 -120 -579 -1814 -1204 -129
1416 -129 -44 60 1204 1145 671 903 104 -1195 -954 -94 -215 112 603 -655 -1256 -712 -548 -453 266 476
1436 476 -144 1386 2162 1680 1521 1633 1216 918 1243 609 -439 -599 -658 -966 -727 -798 -2386 -3064 -2880 -2676
1456b676M92J470M09oO16O26m96j8J65j37N72J083j85o86k57j549q79J22J08l35
1476a561M32M48n8J67L82m73l09L49J038N38J426l23l31k64k67m52k22l50q13
1495f43K41J84l75m8k48n36l9R63K82m46J64O89K11L74J573m47j355J32r6j149
1515e69R18J049n07k26L90l01j032o4O4J11Q22J052J8M5j39p95n86L87n00m25
1535b88K50l76o96P12p19j579q3J13m79O63J340L77j12Q93K84n61P50M53k55L31
1555A018P47k74o06N11j076p71M30q64j053L13k90k4N16J090k10p43O05J06j04
1574f79J138Q90j63N83K72p62q14K20o66Q0K16j47l32K39q5n07J93K16l33L01
1594a40P38l43R53O88j61p09j32o33p08O04M40l09k44K27o17p71J97j84j21R36
$$ plain form
1456 -2676 -2184 -714 -305 -311 305 931 435 417 582 445 1017 2100 1915 1229 972 -577 -1456 -1334 -1226 -1561
1476 -1561 -1129 -681 -739 -572 -190 -663 -972 -623 415 953 2379 2056 1725 1461 1194 742 520 170 -643
1495 -643 -402 -218 -593 -641 -889 -1425 -1464 -501 -219 -665 -501 188 399 773 2346 1899 544 676 580 -569
1515 -569 349 1398 891 665 1055 754 -278 -342 -278 -167 655 1707 1725 1770 1631 836 250 637 137 -288
1535 -288 -38 -414 -1110 -398 -1117 -2696 -2779 -2666 -3145 -2482 -1142 -765 -877 16 300 -261 489 942 687 1018
1555 1018 1765 1491 885 1396 320 -451 -21 -885 -1938 -1625 -1915 -1939 -1423 -333 -543 -1286 -681 -575 -679
1574 -679 459 1349 1186 1769 2041 1279 465 685 19 99 315 168 -164 75 -10 -517 -324 -108 -441 -140
1594 -140 598 255 1208 1896 1735 1026 894 261 -447 157 597 288 44 271 -346 -1117 -920 -1104 -1225 -289
1614b89K04j86P45N01n87L73K64q25k36M87n06k51O31l74n22k16p72p15J44R36
1634a194L64O95J020j10n96N03J84l35Q46P00j069J05J3m20m01lq69j365K10M9
1654a673m41M59R40m79l5P80n51l45R20Q02J73J193Q3r51K19k18n10k64M29p02
1674a71m95P42K8n14O01rq75K8R28j16K15J452l23m09J80l53j075k15N81N6J2
1695B68mo34j039J51r0Q1N26J22m7M54M22j4M83M70r00K28L45m65l51M75K7q28
1717c20K37j58j444J19J01k27N20J206n4l59Q62K54o74O28L15n84L33P99l87l71
1737G96K76r39q92K39o1p27P65P23m64J41N84o10n90R24K73M72Q79K45j184O7
1757I17j1o66K92j18m95o72L19l65m47O61j71q59P68K04p64O21J269k32J08J007
$$ plain form
1614 -289 -85 -271 474 975 388 761 1025 200 -36 451 -55 -306 325 -49 -571 -787 -1559 -2274 -2130 -1194
1634 -1194 -830 -135 885 775 179 682 866 531 1377 2077 1008 1113 1126 706 305 302 -567 -1932 -1722 -1673
1654 -1673 -2114 -1655 -715 -1194 -1229 -449 -1000 -1345 -425 377 550 1743 1826 875 1094 876 366 102 531 -171
1674 -171 -666 76 104 -410 191 182 -693 -665 263 147 362 1814 1491 1082 1262 909 -166 -381 200 256 268
1695 268 264 -370 -1409 -1258 -1348 -1267 -741 -619 -666 -212 210 196 679 1149 249 477 822 357 6 481 508 -320
1717 -320 -83 -241 -1685 -1566 -1465 -1692 -1172 34 -20 -379 483 737 63 691 1006 422 755 1554 1167 796
1737 796 1072 133 -759 -520 -581 -1308 -543 180 -284 -143 441 -169 -759 165 438 910 1789 2034 850 917
1757 917 906 240 532 414 -81 -753 -434 -799 -1246 -585 -756 -1615 -847 -643 -1407 -786 483 251 359 1366
1777A366k68j052k63K45o41J85P96o71m63K46o19l00N40j00k02P36P56o9R14L41
1797A477n36l27N95m06M5N27q9l85R0n29j076m57L3j58P5P31o4k6K21l14K39R09
1819E75J68n12Q8L25J43j49J76n10o58K08j58p68K73P9j41N31K23l19m3N19l87
1840c37K10Q53K16l5M38l21p34J62k95q24j32J88k51k85P77l97k91L12om20O26
1861e46J080J15J77N19J79n39j26j01l04n0J98m76q8l6n21l86q9j07n2N17J94
1882d42N3P28J77p4j0L06l19J19N09m02k05J80j04n86m09Lo91l04Q79k05j56R41
1904a2j13k61M3M67k98K90M20K46k73N12k62m16k13l65m17Q1J97j13Q3M24o38
1925f18K03K47k88p1O35j67M68L23N3k82j25j38r22R1N5j73l45N67kk40M2J45
$$ plain form
1777 1366 1098 46 -217 28 -613 -428 368 -303 -766 -520 -1139 -1439 -899 -999 -1201 -465 291 222 1136 1477
1797 1477 941 614 1209 803 848 1375 1286 901 991 462 -614 -1071 -1038 -1196 -1121 -390 -454 -480 -259 -573 -334 575
1819 575 743 231 319 644 787 638 814 304 -354 -146 -304 -1072 -799 -720 -861 -330 -107 -426 -469 50 -337
1840 -337 -127 726 942 907 1345 1024 290 452 157 -667 -799 -611 -862 -1147 -370 -767 -1058 -746 -752 -1172 -546
1861 -546 534 649 826 1345 1524 985 859 758 454 404 602 126 38 2 -519 -905 -994 -1101 -1153 -636 -442
1882 -442 -389 339 516 442 432 738 419 538 1047 645 440 620 516 -70 -479 -476 -1167 -1471 -592 -797 -953 -12
1904 -12 -125 -386 -343 124 -174 116 536 782 509 1021 759 343 130 -235 -652 -571 -374 -487 -404 20 -618
1925 -618 -415 -168 -456 -527 108 -59 409 732 785 503 378 240 -682 -591 -536 -709 -1054 -487 -489 -729 -687 -542
1947e42m27K36O99R3R60L82P5k50J29n8o42j39K53m96J12J0m69m48K2n14m1M83
1969e72l29j89Q25K63J09N81K6m29M18K72j47k28L89j26o19L6J14j100l7L68m96
1990h71JN43k2N3L63r9l76K87N26n12J94P09k43R1k8m86j005J73j01J7L77J64
2012b45j69k60M80l31l3L96l3M04M62j34J20r2l34r3K1O1k72j91p0o7k47K49j08
2035d86m13O04n1O2N19L19L94j00N02m36p0K11j19p16j58L33m11q2L6m40p6j94
2057g72m32J24L77K50J84M44L82k96R5L56l30L24N99m36l16M6Q4o72m29J62k45
2078e01j87K94j6q6L71J5k05K58J10j34M54p6j8K18K89p95l54K12q4m69L01k9
2100d32k98K61L79n51K39L03j15J55M95J85n2N24P3n86j27J91p97K04k77j72L
$$ plain form
1947 -542 -969 -733 -34 59 1019 1401 1476 1226 1355 1297 655 516 769 273 385 395 -74 -522 -500 -1014 -1055 -572
1969 -572 -901 -1090 -265 -2 107 688 714 285 703 975 828 600 989 863 244 280 394 -706 -743 -375 -871
1990 -871 -870 -327 -349 -296 67 -32 -408 -121 405 -107 87 796 553 644 616 130 -875 -702 -803 -786 -409 -245
2012 -245 -414 -674 -194 -525 -558 -162 -195 209 671 537 657 565 231 138 159 220 -52 -243 -313 -380 -627 -378 -486
2035 -486 -899 -295 -346 -284 235 554 948 848 1350 914 844 1055 936 220 62 395 -16 -98 -62 -502 -578 -772
2057 -772 -1204 -1080 -703 -453 -269 175 557 261 356 712 382 706 1305 869 553 599 683 11 -418 -256 -501
2078 -501 -688 -394 -410 -496 -125 -110 -315 -57 53 -81 373 297 279 497 786 -9 -363 -151 -235 -704 -403 -432
2100 -432 -730 -469 -90 -641 -402 -99 -214 -59 436 621 569 1093 1166 580 453 644 -153 51 -226 -398 -395
2121c95O11p58P1j78J33l53N27M23K7N01q3O7j20J14j14l64L41M5m02L6K0p38
2143e89N4L7n44j82N56Qk32P59K28k19K58L45l31J9O67L4j83k08J01n52l04p3
2165c51l33o8J50j33jK33J15K29J66k4J48j93N66n9J59K41j74Jm82j52o05N44
2187b3R2l89M07l64l55J81L32k22J44L70K59k57L82K55l66N24n61k52j56Lm98
2208d94j81O46o32j16j10K67m55K48O66m27N92L12o8n9M29j00j90J09J52m42K57
2229D04K25p90J0j33r4l63J77J18j79M86N44k36j96M07j24m1M63k54O1L44m51
2250C78m61N4m5m06j9j90j36R9K88k64J07N54Nk71L30K1j63O96J56N9l09K05l93
2273B95m90J72m61q9L08k14o4m7J2K2R9J70q9L89L95J16n6K39K01n76j6J66m67
$$ plain form
2121 -395 216 -542 -471 -649 -516 -869 -342 81 108 609 526 593 473 587 473 109 450 495 93 129 149 -589
2143 -589 -535 -498 -1042 -1224 -668 -660 -892 -133 95 -124 134 479 148 167 834 868 685 477 578 26 -278 -351
2165 -351 -684 -752 -602 -735 -736 -503 -388 -159 7 -17 131 -62 504 445 604 845 671 672 190 38 -567 -23
2187 -23 69 -320 87 -277 -632 -451 -119 -341 -197 173 432 175 557 812 446 970 409 157 1 4 -494
2208 -494 -675 -29 -661 -777 -887 -620 -1075 -827 -161 -588 4 316 248 189 618 518 328 437 589 147 404
2229 404 629 -161 -151 -284 -378 -741 -564 -446 -625 -139 405 169 -27 380 256 215 678 424 485 829 378
2250 378 -83 -29 -74 -480 -499 -689 -825 -726 -438 -702 -595 -41 -36 -307 23 44 -119 577 733 792 483 688 295
2273 295 -195 -23 -484 -573 -265 -479 -543 -590 -578 -556 -457 -287 -376 13 408 524 468 707 908 332 316 482 15
2296A5J75J4l07k29L36n16l63K47N37m50M43L53k03L45O5J83l42L62l60j00q2
2317A23J36k05J02O3p41j42J12m04J94L50P0K04J58M02m84j57J78M10j25K71P6
2338E91k29j37j70k95j65J52l42J22J89m8K35l9J15m4O8J78k7J84M88j17k6K45
2360I28n33k07M1l92k01O9j04k54PK74k1J04N3q7K01R2L80J22K77p0q3k75J54
2383D75k44k50J97j71j71K54k82l96N1L0k16L55M9N1K07L96l3j49O4j24L3L64
2405D90j63k65N5j42j26J89m34j26J42K18k72J92L88k12n9M53J19J0n3j54J41
2426C91l8K77m53k58J04k24n90K16L31l24J12N06k02J65L5Ol09L31L31R0N7K23
2448G77k52l2Mn44p6k01j72M7J7o4k09Q3J63o6l1L66L32k0O27m4j43m2J9k13q1
$$ plain form
2296 15 190 204 -103 -332 4 -512 -875 -628 -91 -541 -98 255 52 397 462 645 303 665 305 205 123
2317 123 259 54 156 219 -522 -664 -552 -956 -762 -412 -342 -138 20 422 -62 -219 -41 369 244 515 591
2338 591 362 225 55 -240 -405 -253 -595 -473 -284 -332 -97 -136 -21 -65 3 181 154 338 826 709 683 928
2360 928 395 188 229 -163 -364 -295 -399 -653 -646 -372 -393 -289 -236 -323 -122 -30 350 472 749 679 596 321 475
2383 475 231 -19 178 7 -164 90 -192 -588 -537 -507 -723 -368 -319 -268 -61 335 302 153 217 93 126 490
2405 490 327 62 117 -25 -151 38 -396 -522 -380 -162 -434 -242 146 -66 -125 328 447 457 404 250 391
2426 391 353 630 177 -81 23 -201 -791 -575 -244 -568 -456 50 -152 13 48 54 -255 76 407 497 554 777
2448 777 525 493 497 -47 -123 -324 -496 -449 -432 -496 -705 -622 -459 -525 -556 -190 142 122 749 705 562 520 539 326 245
2473B45Qk2l16K30j77o15J95r9l01J38K53j7J72M81j31J18j7K19j78J88r7J36
2495D13p4j8J6n68J06k88K0J17l63K83O12l74Q9m6L89j36O3J52k0J88M9j61l60
2518H9J40n3o81M84k46n03M52J86O4j98L84mj27J36M4Q5J03L38l33L11p7n53j72
2541a31K08j69j86L7j47k69L18J3l27L08J36p7M66N4J16r8L53m4j16k9r3j89J03
2564B37P0l76l63K63k06k87rO4O8K91J11n9J74J34q9J24Op8RR6K57k05l6k3l64
2589a91r7k59N2p1L12k9M36o4J2m1k5K96j29L5K08P8m42L58l92Q0l29j54J19l7
2613b74j67J86k27L17p6m9K20J38J35M0J96j5K15l03J70l94J69l52r2J74j25l58
2635d72J28j21j44O0j45N2L16L51J76J2K0J80n54M04mm28L63J25n18N8K4k13m1
$$ plain form
2473 245 253 231 -85 145 -32 -647 -452 -551 -852 -714 -461 -478 -306 175 44 162 145 364 186 374 277 413
2495 413 339 321 337 -231 -125 -413 -393 -276 -639 -356 256 -118 -29 -75 314 178 241 393 373 561 610 449 89
2518 89 229 176 -505 -21 -267 -770 -318 -132 -68 -266 118 114 -13 123 167 252 355 693 360 671 594 41 -131
2541 -131 77 -92 -278 -241 -388 -657 -339 -326 -653 -345 -209 -286 180 234 350 252 605 561 445 416 323 134 237
2564 237 307 -69 -432 -169 -375 -662 -671 -607 -539 -248 -137 -196 -22 112 23 147 153 75 84 180 437 232 196 173 -191
2589 -191 -288 -547 -495 -566 -254 -283 153 89 101 60 35 331 202 237 445 523 81 439 47 127 -202 -356 -237 -274
2613 -274 -441 -255 -482 -165 -241 -290 -70 68 203 243 439 424 639 336 506 112 281 -71 -163 11 -114 -472
2635 -472 -344 -465 -609 -549 -694 -642 -326 25 201 213 233 413 -141 263 259 -169 194 319 -199 -141 -117 -330 -371
2658c71j01J79j03n3L34J0k0L50K01k34K24J41Ok5k53j61L17M2n72m4L4l96J30
2681c65KlpL12P5l09J57K81n9J5N4J68q9j02L26m46K00m51q2j02J20l54L58J2
2705b89N9l02K48q0J9J85K17J76J68L7n1j66J62l11K10k67j44k43J93r2j05L7
2727c39k72L64L4Q3j8L35p6K16J27J06J69k25j99L7l62L45p6l79Q0j85l7k13o7
2750e52M12q2Q4J11K44LK7k78K13q1K5L01l77l6n0j46J39l32J12j98K28n03L84
2773c52J1qL58j9MK90J70j60R7J53k18R3j01j10ql90J19n09L36K22n00M05J42
2796B5k70J20J77o0p9L76j53M5L15l45J57J3k32j51P5j13j86J28k23J25k24P9
2818d01j8J98K04L18k54K69J62l42J99o8o2q2K47l74j9k39O3J23l97L87l22N3
$$ plain form
2658 -371 -472 -293 -396 -449 -115 -105 -125 225 426 192 416 557 563 538 285 124 441 483 -89 -133 -99 -495 -365
2681 -365 -363 -366 -373 -61 14 -295 -138 143 84 99 153 321 232 130 456 10 210 -241 -323 -425 -305 -659 -301 -289
2705 -289 -230 -532 -284 -364 -345 -160 57 233 401 438 387 221 383 72 282 15 -129 -372 -179 -271 -376 -339
2727 -339 -611 -247 -213 -130 -148 187 111 327 454 560 729 504 305 342 -20 325 249 -130 -50 -235 -272 -485 -552
2750 -552 -140 -222 -138 -27 217 220 247 -31 182 101 126 427 50 14 -36 -182 -43 -375 -263 -461 -233 -736 -352
2773 -352 -341 -349 9 -10 -6 284 454 294 391 544 326 419 318 208 200 -190 -71 -580 -244 -22 -522 -117 25
2796 25 -245 -125 52 -8 -87 289 136 181 496 151 308 321 89 -62 13 -100 -286 -158 -381 -256 -480 -401
2818 -401 -419 -221 -17 301 47 316 478 136 335 267 205 123 370 -4 -23 -262 -199 -76 -473 -86 -408 -355
2840c55j17L54p1N24j83J19m3L0r4j06O04n97q4n4M1j36j60K33n16J93J01k4J74
2863a67K9J53k4M00m56K13L24o3r7J7L39l72kr1k72k50Q2J28j43j9l6J97n13N39
2887h4L7j07K84K41m98M34O6o9k61L15n7r0l32n3m8L6k7J21p3J71m60L77R1j42
2911a28M03L6k14q4L62j20j65M7K22l90J06k66Q0j55q6Q1m5K63j88R5M4K22pK00
2935C13j21Kj13K21R7l00J13j61k72K76n01j21K20n9J64r5J36j1Q6K50l9k03J33
2958A5K22L1N2K15k09K5k30K2n03J35j99n7L31j81j70L39n6n6J03L66k28J52K02
2981C21m3J05O4J13k85j01O6J43k19k29J16m18J22q4J33p3K38k91O18Qj47j39
3003A8J99J3j56J52k07J44j35q6K85j48j55l82J32K3jM2o1N15k74p3K23J62j30
$$ plain form
2840 -355 -472 -118 -189 335 152 271 228 258 164 58 662 65 -19 -73 -32 -168 -328 -95 -611 -418 -317 -341 -167
2863 -167 -138 15 -9 391 -65 148 472 409 312 329 668 296 294 203 -69 -319 -237 -109 -252 -271 -307 -110 -623 -84
2887 -84 -47 -154 130 371 -127 307 373 304 43 358 301 211 -121 -174 -222 -186 -213 -92 -165 6 -454 -77 14 -128
2911 -128 275 311 97 13 375 255 90 137 359 -31 75 -191 -111 -266 -352 -271 -316 -53 -241 -146 -102 120 113 313
2935 313 192 194 81 302 399 99 212 51 -221 55 -446 -567 -347 -406 -242 -337 -201 -212 -126 124 85 -118 15
2958 15 237 268 320 535 326 351 121 143 -360 -225 -424 -481 -150 -331 -501 -162 -218 -274 -171 195 -33 119 321
2981 321 278 383 447 560 275 174 240 383 164 -65 51 -367 -245 -329 -196 -269 -31 -322 296 304 157 18
3003 18 217 230 74 226 19 163 28 -58 227 79 -76 -458 -326 -303 -304 -262 -323 192 -82 -155 68 230 100
3026A00L15p6m63N64l56j5k23Q8m2j27m2q0R5P8L31l85J37j64J15%M50j74k6K37
3050C37rj33P7j6n08K24m2k40O8M58l74K2l07J34M3J73k32R1L68J36PQ9L2m23
3074b5N19j80m80R7M2K55n20J46j45J0m8Rj01N83m76M08J92J0k67K58o7k47K98
3097B71R3k17k01j91L04l55m9J52m08M17K28j26j47N31j48j72oK05J00nk9j65
3119H2J15m3N5l51j10o7M7o7L06j00k77K54j6J14J18n4J86N3O9J8k33K67j85j15
3143F6J8k9j31J8R3l43K07k65n2K99J02j50J11m8K68Q2k61K13k5K98j30m80K96
3166A57J3j88L6L4j74N1m04N95j99j97L34j83L53j28K25n3j63J75k8j32r6J21
3188A49J60l64j6j05o6k37K26r0j11Q42l80p5M5k35K67j24J98K48k02j51r1N91
$$ plain form
3026 100 415 339 -124 440 84 69 -154 -66 -108 -235 -277 -357 -262 -184 147 -238 -101 -265 -150 -150 300 126 100 337
3050 337 328 195 272 256 -252 -28 -70 -310 -242 216 -158 -136 -443 -309 -266 -93 -325 -234 134 270 277 366 398 -25
3074 -25 494 314 -166 -69 -27 228 -292 -146 -291 -281 -329 -320 -421 162 -314 94 286 296 29 287 220 -27 271
3097 271 364 147 -54 -245 59 -296 -345 -193 -601 -184 44 -82 -229 302 154 -18 -24 181 281 276 247 82
3119 82 197 154 209 -142 -252 -319 -272 -339 -33 -133 -410 -156 -172 -58 60 6 192 245 314 332 99 366 181 66
3143 66 84 55 -76 -58 35 -308 -101 -366 -418 -119 -17 -167 -56 -104 164 246 -15 198 173 471 341 -139 157
3166 157 170 -18 18 52 -122 -71 -475 120 -79 -276 58 -125 228 100 325 272 109 284 256 124 28 149
3188 149 309 -55 -71 -176 -242 -479 -253 -343 -454 388 8 -67 -22 -257 10 -114 84 332 130 -21 -112 479
3210D79m90J50Jk24j42M9j03L3OM01k96K16p3k60N22j0k22M49j95N6k07J07pm6
3234A94l37R5l42J73J96j05j55J94l9K9M7j82M59j18r9L41j69m4l1j37m9q4J55
3257hq3k51K8L2p9j25J74L21k69P1J13J18N0m0K65j49J79j58j06K83q0l94J74
3280F6j58m2Qn5kj09k0L48k67L64J85n6l5j22L0K99M8j72j48o8J49j46k91p5k4
3305b93k7R7l9L65k39n6L70p2J30k22J61j16L8L26m9k99j83J15n5j16j42L41l79
3328c44K02J78o3j75J8J10K78k9j28R1K0J28n0o4PQ8q1k14J39j19J80k88j39m8
3352c03K28P9k74K10o3K68kJ80k92M9J71o2r6J8P2k08Q7M0j55k49J5R6q6J32j21
3377b66L5J17L54j09J87l72J97j28L02k30L5l81K36j61J35n5p3Q2K30k24l4M9
$$ plain form
3210 479 -11 139 140 -84 -226 -177 -280 -247 -241 160 -136 80 7 -253 269 259 37 486 291 347 140 247 240 194
3234 194 -143 -48 -390 -217 -21 -126 -281 -87 -126 -97 -50 -232 227 109 10 351 182 138 107 -30 -79 -163 -8
3257 -8 -91 -342 -314 -282 -361 -486 -312 9 -260 -189 -76 42 92 52 317 168 347 189 83 366 286 -108 66
3280 66 -92 -134 -126 -181 -183 -292 -312 36 -231 133 318 262 227 105 135 434 482 310 162 94 243 97 -194 -269 -293
3305 -293 -320 -223 -262 103 -136 -192 178 106 236 14 175 59 97 423 374 75 -108 7 -48 -164 -306 35 -344
3328 -344 -142 36 -27 -202 -184 -74 204 175 47 138 158 286 236 172 179 267 186 -28 111 -8 172 -116 -255 -303
3352 -303 -75 4 -270 -60 -123 145 143 323 31 80 251 189 93 111 183 -25 62 102 -53 -302 -287 -191 -277 -145 -266
3377 -266 -231 -114 240 131 318 -54 143 15 317 87 122 -259 -23 -184 -49 -104 -177 -95 135 -89 -123 -74
$$ [...]
8191B
##END NTUPLES=NMR FID
##END=
