##TITLE=1H_LR-758-R4-KA5-CR11
 CDCl3
 8 sc, 
 29.12.2023
##JCAMPDX= 6.0         $$ Bruker NMR JCAMP-DX V2.0
##DATA TYPE= NMR FID
##DATA CLASS= NTUPLES
##ORIGIN= UXNMR, Bruker Analytische Messtechnik GmbH
##OWNER= root
$$ XWIN-NMR		Version 3.5
$$ Fri Dec 29 16:31:44 2023 Russian Standard Time (UT+4h)  she@DPX200
##.OBSERVE FREQUENCY= 200.1313
##.OBSERVE NUCLEUS= ^1H
##.DELAY= (6, 6)
##.ACQUISITION MODE= SIMULTANEOUS
##.ACQUISITION SCHEME= undefined
##.AVERAGES= 8
##.DIGITISER RES= 18
##SPECTROMETER/DATA SYSTEM= spect
##.PULSE SEQUENCE= zg30
##.SOLVENT NAME= CDCl3
##.SHIFT REFERENCE= (INTERNAL, CDCl3, 0, 15.7039)
##AUDIT TRAIL= $$ (NUMBER, WHEN, WHO, WHERE, WHAT)
$$ ##TITLE= Audit trail, XWIN-NMR		Version 3.5
$$ ##JCAMPDX= 5.01
$$ ##ORIGIN= Bruker BioSpin GmbH
$$ ##OWNER= she
$$ F:/spectra/data/she/nmr/H-F/1/audita.txt
$$ ##AUDIT TRAIL=  $$ (NUMBER, WHEN, WHO, WHERE, WHAT)
(   1,<2023-12-29 16:30:32.28 +0400>,<she>,<DPX200>,
      <created by zg, POWCHK disabled, PULCHK disabled
       configuration hash MD5:
       00 E9 B6 7A A2 85 ED C7 34 08 36 98 17 FE 4E 26
       data hash MD5: 16K
       81 E7 B0 11 B4 E8 34 09 29 95 EB C2 A9 93 F9 D8>)
$$ ##END=
$$ 
$$ hash MD5
$$ D5 7D D9 0C F8 F3 2E B2 E3 46 73 46 75 F6 A8 CC
##$RELAX= 
##$RELAX= 
##$RELAX= 
##$RELAX= 
##$RELAX= 
##$RELAX= 
$$ Bruker specific parameters
$$ --------------------------
##$DU= <F:/spectra>
##$EXPNO= 1
##$NAME= <H-F>
##$PROCNO= 1
##$TYPE= <nmr>
##$USER= <she>
##$AMP= (0..31)
100 100 100 100 100 100 100 100 100 100 100 100 100 100 100 100 100 100 
100 100 100 100 100 100 100 100 100 100 100 100 100 100 
##$AQSEQ= 0
##$AQ_mod= 1
##$AUNM= <au_zg>
##$AUTOPOS= <>
##$BF1= 200.13
##$BF2= 200.13
##$BF3= 200.13
##$BF4= 200.13
##$BF5= 200.13
##$BF6= 200.13
##$BF7= 200.13
##$BF8= 200.13
##$BYTORDA= 1
##$CFDGTYP= 0
##$CFRGTYP= 5
##$CHEMSTR= <none>
##$CNST= (0..31)
1 1 145 1 1 1 1 1 1 1 1 1 1 1 1 1 1 1 1 1 1 1 1 1 1 1 1 1 1 1 1 1 
##$CPDPRG= <>
##$CPDPRG1= <>
##$CPDPRG2= <>
##$CPDPRG3= <>
##$CPDPRG4= <mlev>
##$CPDPRG5= <mlev>
##$CPDPRG6= <mlev>
##$CPDPRG7= <mlev>
##$CPDPRG8= <mlev>
##$CPDPRGB= <>
##$CPDPRGT= <>
##$D= (0..31)
0 1.2 0 0 0 0 0 0 0 0.06 0 0.03 0 0 0 0 0.0002 0 0 0 0 0 0 0 0 0 0 0 0 
0 0 0 
##$DATE= 1703853031
##$DBL= (0..7)
120 120 120 120 120 120 120 120 
##$DBP= (0..7)
150 150 150 150 150 150 150 150 
##$DBP07= 0
##$DBPNAM0= <>
##$DBPNAM1= <>
##$DBPNAM2= <>
##$DBPNAM3= <>
##$DBPNAM4= <>
##$DBPNAM5= <>
##$DBPNAM6= <>
##$DBPNAM7= <>
##$DBPOAL= (0..7)
0.5 0.5 0.5 0.5 0.5 0.5 0.5 0.5 
##$DBPOFFS= (0..7)
0 0 0 0 0 0 0 0 
##$DE= 6
##$DECBNUC= <off>
##$DECIM= 32
##$DECNUC= <off>
##$DECSTAT= 4
##$DIGMOD= 1
##$DIGTYP= 9
##$DL= (0..7)
0 120 120 120 120 120 120 120 
##$DP= (0..7)
150 150 150 150 150 150 150 150 
##$DP07= 0
##$DPNAME0= <>
##$DPNAME1= <>
##$DPNAME2= <>
##$DPNAME3= <>
##$DPNAME4= <>
##$DPNAME5= <>
##$DPNAME6= <>
##$DPNAME7= <>
##$DPOAL= (0..7)
0.5 0.5 0.5 0.5 0.5 0.5 0.5 0.5 
##$DPOFFS= (0..7)
0 0 0 0 0 0 0 0 
##$DQDMODE= 0
##$DR= 18
##$DS= 0
$$ [...]
##$SUBNAM2= <"">
##$SUBNAM3= <"">
##$SUBNAM4= <"">
##$SUBNAM5= <"">
##$SUBNAM6= <"">
##$SUBNAM7= <"">
##$SUBNAM8= <"">
##$SUBNAM9= <"">
##$SW= 18.0517328524113
##$SWIBOX= (0..15)
0 0 2 0 0 0 0 0 0 0 0 0 0 0 0 0 
##$SW_h= 3612.71676300578
##$TD= 16384
##$TD0= 1
##$TE= 0
##$TE2= 300
##$TE3= 300
##$TEG= 300
##$TL= (0..7)
0 120 120 120 120 120 120 120 
##$TP= (0..7)
150 150 150 150 150 150 150 150 
##$TP07= 0
##$TPNAME0= <>
##$TPNAME1= <>
##$TPNAME2= <>
##$TPNAME3= <>
##$TPNAME4= <>
##$TPNAME5= <>
##$TPNAME6= <>
##$TPNAME7= <>
##$TPOAL= (0..7)
0.5 0.5 0.5 0.5 0.5 0.5 0.5 0.5 
##$TPOFFS= (0..7)
0 0 0 0 0 0 0 0 
##$TUNHIN= 0
##$TUNHOUT= 0
##$TUNXOUT= 0
##$USERA1= <user>
##$USERA2= <user>
##$USERA3= <user>
##$USERA4= <user>
##$USERA5= <user>
##$V9= 5
##$VALIST= <valist>
##$VCLIST= <CCCCCCCCCCCCCCC>
##$VD= 0
##$VDLIST= <DDDDDDDDDDDDDDD>
##$VPLIST= <PPPPPPPPPPPPPPP>
##$VTLIST= <TTTTTTTTTTTTTTT>
##$WBST= 1024
##$WBSW= 4
##$XGAIN= (0..3)
0 0 0 0 
##$XL= 0
##$YL= 0
##$YMAX_a= 276362
##$YMIN_a= -296753
##$ZGOPTNS= <>
##$ZL1= 120
##$ZL2= 120
##$ZL3= 120
##$ZL4= 120
##$ABSF1= 10
##$ABSF2= 0
##$ABSG= 5
##$ABSL= 3
##$ALPHA= 0
##$AQORDER= 0
##$ASSFAC= 0
##$ASSFACI= 0
##$ASSFACX= 0
##$ASSWID= 0
##$AUNMP= <proc_1d>
##$AZFE= 0.1
##$AZFW= 0.1
##$BCFW= 1
##$BC_mod= 2
##$BYTORDP= 1
##$COROFFS= 0
##$CY= 11.3945322036743
##$DATMOD= 1
##$DC= 2
##$DFILT= <>
##$DTYPP= 0
##$F1P= 15.7292609196834
##$F2P= 12.9074282941183
##$FCOR= 0.5
##$FTSIZE= 0
##$FT_mod= 4
##$GAMMA= 1
##$GB= 0.15
##$INTBC= 1
##$INTSCL= 1
##$ISEN= 128
##$LB= 0.24
##$LEV0= 0
##$LPBIN= 0
##$MAXI= 10000
##$MC2= 0
##$MEAN= 0
##$ME_mod= 0
##$MI= 1.114404
##$NCOEF= 0
##$NC_proc= 0
##$NLEV= 6
##$NOISF1= 3.799351
##$NOISF2= 2.8
##$NSP= 1
##$NTH_PI= 0
##$NZP= 0
##$OFFSET= 15.70392
##$PC= 1
##$PHC0= -24593.52
##$PHC1= 13.25273
##$PH_mod= 1
##$PKNL= yes
##$PPARMOD= 0
##$PSCAL= 0
##$PSIGN= 0
##$REVERSE= no
##$SF= 200.130013532006
##$SI= 16384
##$SIGF1= 3
##$SIGF2= 2
##$SINO= 400
##$SIOLD= 16384
##$SREGLST= <1H.CDCl3>
##$SSB= 0
##$STSI= 0
##$STSR= 0
##$SW_p= 3612.71676300578
##$SYMM= 0
##$S_DEV= 0
##$TDeff= 0
##$TDoff= 0
##$TI= <>
##$TILT= no
##$TM1= 0
##$TM2= 0
##$TOPLEV= 0
##$USERP1= <user>
##$USERP2= <user>
##$USERP3= <user>
##$USERP4= <user>
##$USERP5= <user>
##$WDW= 1
##$XDIM= 8192
##$YMAX_p= 0
##$YMIN_p= 0
$$ End of Bruker specific parameters
$$ ---------------------------------
##NTUPLES= NMR FID
##VAR_NAME=  TIME,          FID/REAL,        FID/IMAG
##SYMBOL=    X,             R,               I
##VAR_TYPE=  INDEPENDENT,   DEPENDENT,       DEPENDENT
##VAR_FORM=  AFFN,          ASDF,            ASDF
##VAR_DIM=   8192,          8192,            8192
##UNITS=     SECONDS,       ARBITRARY UNITS, ARBITRARY UNITS
##FACTOR=    0.0002768,     1,               1
##FIRST=     0,             0,               0
##LAST=      2.2672688,     0,               0
##MIN=       0,             -296753,         0
##MAX=       2.2672688,     276362,          0
$$ Real data points
##PAGE= N=1
##DATA TABLE= (X++(R..R)), XYDATA
0@%%%%%%%%%%%%%%%qJ6j6J6j6K1k9L2l3M1m8N6o5P3q7J00j10J22j39J59j78J97
37A04k22K50k77L05l41L78m18M62n07N59o16O78p48Q23r05R99j105J223j356J509
57G95j689J900k148K455k840L334l994M925o332Q673j3217K4954j05971k07598
71b96753L72053R3233k68752J43597K32984k67577j52073K62792L6715j96307
81d0088Q7214J20258j48405o6509J20925k8799j16488N3736R3090n7304o7465
92d9835M7635L3015o8930p622J03367j3062j28861L9118J18549p1809n6739J25722
104G0548k0877j62624Q1373J32243j35631m8357J76239l8617j61366J18578R9860
115A11369j75037k7121J78806l4915j25814Q3927M9026j15592m194R0383k7898
$$ y = [0, 0, 0, 0, 0, 0, 0, 0, 0, 0, 0, 0, 0, 0, 0, 0, -8, 8, -8, 8, -8, 13, -16, 16, -17, 24, -24, 32, -33, 40, -47, 53, -57, 65, -74, 85, -93, 104, -118, 132, -145, 160, -181, 197, -221, 241, -266, 293, -323, 355, -393, 430, -475, 524, -581, 642, -714, 795, -894, 1006, -1142, 1313, -1527, 1807, -2187, 2738, -3594, 5079, -8138, 16816, -89155, -296753, 75300, 168533, -100219, 43378, 276362, 8785, -143288, 119504, 156219, -40088, 47126, 167384, 18979, -47530, 73395, 44596, -71892, -18156, 74934, 17630, -49835, -2200, 30815, -38115, -45737, 57630, 44568, -84293, -45175, 73374, 1565, -55174, 70548, 49671, -112953, -31580, 100663, -34968, -83325, 92914, 54297, -107069, 11509, 111369, -63668, -90789, 88017, 53102, -72712, 11215, 60241, -55351, -59545, 30838, 2940]
126B940m7746L3758L067k9400J3905J3792q912P282J1640O066K758j6125J388
139e587K5497j3251j0520M8796j481o5523J7228L9423o1277j7358P9316j5698
151A9565o6158M8082K1705q0121J8795Q3143m5751m3597P0351J313o4710M8830
163A1447N6437o3456l1807M8172q534l1048L5271J8529l7083j4067Q455n846r86
176a4516P599M022N498o736q730J4925J940j5521K4963K3273l8255j1441L9103
189B6124j5796k8222M9662J4794o6836K73M7818l4162k4282N6949j706n8491K3420
202a0455L5892m2632q044M6472j7579l8235L1751J7920l4131K548K8231j6620
214d882k1775J6216P829j4169K924J6167N09r849J669J2167Q84q586R748J1378
$$ y = [2940, -44806, -11048, -7981, -37381, -23476, -9684, -18596, -11314, 326, 6392, 9150, -6975, -5587, 19910, 6659, -3861, 44935, 43454, -22069, -4841, 34582, -26695, -44053, 35263, 19565, -46593, 1489, 23194, -56927, -38132, 45011, -740, -44337, 26014, 27327, -37383, 11447, 67884, 4428, -27379, 20793, 12259, -18789, 16482, 35011, -2072, -16139, -7684, -13530, -14516, -6917, -2895, 2603, -4133, -12863, 2062, 4002, -11519, 13444, 36717, -1538, -12979, 26124, 10328, -17894, 31768, 46562, -20274, -20001, 27817, -6345, -30627, 26322, 24616, -33875, -10455, 25437, -17195, -25239, 21233, 3654, -34581, -2830, 15090, -19041, -16493, 11738, -4882, -26657, -10441, -2612, -16781, -13857, 2310, 2819, -7030, -5361, 6806, 7690, -896, 8852, 20230]
228B0230j4568m918K2396j730k0746J3282Q600l2426o476K8931r687j8983K4464
241H369L171l6811M449K7956j6441q297K8325m262k5295J7868K0112j7695l173
254a724J5741j3800j6450J6825J0507j1331Q02N750j2501j1668N478P077J088
267d206J049M784k72q919k827J1925N366o705N399P891j2821p625J5904K148j3773
282b682Q747Q847k0254p070J9086l156j3665J4419P845j9250J849J9286q504j3622
296h124R945m5j1455J1919J6228r783j3244m77o451m389J1853Q048n321l425k58
311d979k734J21K086K1K415M894J502J036Q90m481q12Q070R17p651k697Nj991
328c388P141R197p111j3352k570K728L762R076L509r184p086L758N139L561K373
$$ y = [20230, 5662, 744, 23140, 21410, 664, 13946, 22546, -9880, -16356, 12575, 2888, -16095, 8369, 11540, -25271, -20822, 7134, -9307, -17604, 10721, 6459, -18836, -968, 19144, 1449, -1724, 14017, 217, -16233, 592, 11099, -232, 570, 6320, -6181, -17849, -12371, -5294, -4206, -3157, 1627, 1355, -7564, -10391, 1534, 6900, 195, 5594, 13485, 664, -6961, 8943, 11091, -2682, 6065, 14912, -5342, -12412, 6674, 3518, -10147, 4272, 12117, -7133, -5284, 14002, 5498, -8124, 1821, 1776, -9679, 2240, 18468, 8685, -4559, -5036, -11487, -15876, -4023, 4025, -1296, -4721, -4979, -7713, -7592, -5506, -5485, -3070, 1824, 3326, 4362, 5252, 771, -41, 8029, 8946, 1295, -1402, -1397, -3388, 3753, 12950, 5839, -7513, -10083, -7355, -3593, 5483, 8992, -192, -7278, -3520, 1619, 5180, 7553]
343G553k690m910j17J476r48j280n57O69L469J358n356o731k566J934O961P314
359E579N45l964k554n58R51J605j512k373L797M474M69j031n210j0987k678P233
375f214L081M62M019l373p541L121O085k297J069P725q23l501N491J325m855K956
391F730M715n525m387J521l630k213M838R89n014p36j549l374K815M491j272J338
407b63K136l678O1P462J513k986O68l486p961K603P553j384j299R42p741o008
423a1868M548J897k740L005K868j700K587K964m599k651K533O05K432O001j015
438D867n607J681J196m215J186L147k090M27N499m20k966J971J110l83K760N5
454H218m062j714Q04k0J501j368n099k754j880m044J658L692m591r47Q573k12
$$ y = [7553, 4863, -47, -164, 1312, 364, -916, -1473, -804, 2665, 4023, -1333, -8064, -10630, -8696, -1735, 5579, 6124, 2160, -394, -952, -1, 1604, 92, -2281, 1516, 5990, 6459, 5428, 218, -10769, -13447, -6214, -3133, -2671, 1348, -2025, -9566, -6445, -360, -2657, -1588, 6137, 5314, 1813, 7304, 8629, 3774, 6730, 11445, 5920, 1533, 3054, -576, -2789, 2049, 3038, -1976, -2712, -4261, -7635, -4820, -329, -1601, -263, 1873, -1805, -1744, 5718, 7231, 4245, 4913, 1427, -6534, -3931, 3622, 2238, 939, 1881, -5860, -11868, -7320, -5423, -8163, -5158, -2290, -3990, -1403, 1561, -3038, -5689, -3156, -2551, -119, 5882, 4867, -740, 941, 2137, -2078, -892, 2255, 165, 592, 6091, 5671, 2705, 4676, 5786, 5403, 8163, 8218, 4156, 2442, 3246, 3226, 4727, 3359, -1740, -4494, -6374, -10418, -8760, -5068, -9659, -10606, -2033, -2245]
470b245o878N827N808m769M296J0823m229n659Q967J847p094L915J757j2147l198
485b979P295k976l848L927l121p592J34N57j733N089L185l723L008K697o321J255
501e146J0586k440o745K733q28m117P429N780p586k221J402o750K087J1975k300
516C859p156P206L960p552K735N624q012l530Q115j42l371L155l793p967L510
531c359L048n443J238N007l930o52M989p09o67N942k44m264L362K29m532M446
547D461N461n673m821l51l282j031L724j013p18K857m082l920R039L505p047L234
563C43P763p256m677Q982J438l802L481p32j0107k667J471l419L431O738m254
578c267l792K577l586m003O620N398K339P331O72q619Q91N348k888M109R236q784
$$ y = [-2245, -9123, -3296, 2512, -2257, 2039, 12862, 8633, 2974, 11941, 13788, 6694, 10609, 12366, 219, -2979, 4316, 1340, -2508, 1419, -1702, -9294, -9160, -8603, -10336, -5247, -2062, -5785, -2777, -80, -6401, -5146, 5440, 3000, -3745, -1012, -1840, -5957, 1472, 7252, -334, -2555, -1153, -7903, -5816, 6159, 3859, -3297, 3909, 7869, 317, 3052, 8676, 664, -2866, 5249, 5107, 1736, 4891, 1098, -6869, -3359, -311, -5754, -4516, 491, -3439, -4091, 898, 189, -478, 5464, 5220, 956, 4318, 4547, 15, 4461, 9922, 4249, -572, -923, -4205, -5236, -1512, -2525, -3243, -386, -4468, -8388, 651, 4156, -2891, 343, 8106, 850, -3827, 5155, 6593, 2791, 6272, 5540, -4567, -7234, -5763, -9182, -5751, 987, -3267, -7059, -4482, -8068, -12071, -5451, -53, 2286, 9617, 10289, 1670, 2561, 7909, 5021, 9130, 18366, 9582]
594I582j1352N869J953n682N133J758j3483j981Q651m280l661R494j771r153P033
609a890N651j0428k678Q704j327j909M483k791o171L425L079r13M130j235q129
624g999K707Q779M4J284M812m407m800N176R5m961L342K745m046J921J475j0756
640d589o794N083J187l98O755j151p621J729M123r95K682M613l293q75O411K41
656G108l595K476m97n217K286J607n351j305K337k753o18L470k549l510K760K328
672a023j254K840J639k217J798K552j863J938J208n745j749M197j677k125N770
687D289n27p916J139L693o121qQ520j467l736O112N94p186J646L571m676J74N976
704D077l016m372L028j184m181L033J080n017J920M279j347R88M022l287k632
$$ y = [9582, -1770, 4099, 6052, 370, 5503, 7261, -6222, -8203, 448, -3832, -7493, 2001, 230, -8923, -1890, 3761, -6667, -9345, -641, -1968, -3877, 606, -2185, -8356, -4931, -1852, -2765, 1365, 130, -7999, -5292, 3487, 3531, 4815, 9627, 5220, 420, 5596, 5691, 730, 4072, 6817, 2771, 4692, 6167, -4589, -11383, -6300, -5113, -5511, 1244, 93, -7528, -5799, -1676, -2671, 11, 4624, 1331, 456, 6867, 7108, 3513, 5989, 5492, 275, 2561, 4168, -1183, -2488, -151, -2904, -3522, -52, -2601, -6111, -3351, -1023, -2277, 563, 2202, -15, 1783, 4335, 2472, 4410, 5618, -127, -1876, 2321, 644, -1481, 4289, 3762, -4154, -3015, 678, -5443, -5451, 3069, 1602, -2134, 3978, 4572, -2614, -968, 2603, -2073, -1899, 4077, 1061, -3311, -283, -1467, -5648, -2615, -1535, -6552, -4632, -353, -1700, -712, 3310, 23, -2609]
719b609M395O06k296L899J396n494Q66L687m221k706L033j775l035L183Q69m063
735d265K065L352j490N61L035k413k063L708J346p22K133L26l695k83j51l397
751a953K10K310k165j268K844j519l670J676J233j616J338L316o29m80K029K43
767A899j170R20o16j376J68j60j73J402n66j396L85r50k391J790K980k023L45
784i32M054l44k359K530J186m181l2M078j470j693K662p71m291L25L43k568K90
801c173K473r91k29J846p26r21J614Q8n49K329M7j747J544Q62k558L41K010k915
819f55k278J977q62k354K859K117l091K28K319j858m65M307m13k277K737J953
835D244k665J125J455l371k373K736m36k011K382Rl281J335K080l491j809K651
$$ y = [-2609, 1786, 2392, 96, 3995, 5391, -103, 763, 4450, 229, -2477, 556, -1219, -4254, -1071, -202, -4265, -2200, 1152, -338, 223, 3258, 845, -1218, 2490, 3836, 3114, 5247, 5573, 1878, 1595, 1444, -1953, -1743, 567, -1598, -2866, -22, -1541, -5211, -3535, -2302, -3918, -2580, 736, 107, -373, 1656, 1899, 729, 1649, 1033, -343, -175, -335, -508, 894, 328, -1068, -683, -1633, -4024, -2234, 746, -1277, -932, 3122, 2778, 419, 2949, 4135, -46, -78, 4000, 2530, 837, 3499, 2728, -1563, -1238, -895, -3463, -3173, -700, -1691, -1920, -74, -800, -1721, -107, -19, -568, 1761, 1808, 61, 1605, 2467, -91, 250, 2260, -655, -2933, -956, -1818, -4172, -1313, 804, -2287, -2059, 260, -1598, -2063, 2244, 1831, -446, 2291, 4244, 1579, 2704, 4159, 788, -1585, 1151, 715, -1296, 1086, 1095, -2186, -851, 1229, -2262, -4071, -1420]
851a420j22M78M345R98m110j352J315r21k16K343l39j743l01Q95j536j633q96
868d215J433J251R75J079k14k197j15M172K003j138j88J72k688L08L708j186l609
885d49O82J045k545q24N23k759j384K976K686p08K27L51j271K96J921R42j30K26
903A805J492J461o75k092j614p99r16J371K122j247k459J365K51k021P38J432
919B14k108K57M623P11k012J385p16m328J041L080k119m62K085k017l237J559
935b044M51k575K398K638k636j235K901q92j316L890J374k791J62J005k713j564
951b947K434M10q22J094j62l022j646R10R70J554J564N51J20l19N71J127L44k023
969G08M81J679m73o53J002j041l486l7J142k107j201K871R65j120J738O95k157
$$ y = [-1420, -1542, -1064, 3281, 4279, 169, -1183, 132, -789, -1005, 1338, 999, -744, -1045, -150, -1686, -3319, -4215, -2782, -1531, -556, 523, 309, -1888, -2003, 2169, 4172, 3034, 2846, 3018, 330, 638, 4346, 3160, -449, 233, 1278, -1267, -2091, -1568, -4327, -5711, -2735, -49, -757, -530, -179, -1450, -1154, 767, 1709, 1579, 1805, 3297, 4758, 4083, 1991, 377, -422, -1338, 33, 2155, 908, -1551, -186, 65, -1956, -1218, 214, -1894, -1637, 2986, 3697, 1685, 3070, 2354, -1974, -933, 2147, 28, -434, 1651, -366, -3603, -2044, -1593, -4168, -1770, 868, -1768, -3003, -102, -994, -2310, 1580, 2954, 163, 325, 1330, -1383, -2947, -513, -103, -925, 169, 7, -3015, -4661, -3751, -2781, -1227, 337, 888, 1008, 689, 1260, 2387, 2731, 708, 1189, 2868, 2395, 1742, 2744, 1703, -1783, -1820, -678, -2785, -3986, -1115, -150, -1270, 468, 1163, -994]
986i94k77L017J678K97O98K2j201J64Q99m18k069j623J91m24r50j19k32j935p19
1005c995K410O50k330k36J773o44P95L709m53k678O64N53j800L21K441j788j165
1022a773K366k43k080Q61Q90j569J408K081q58n60K752l24j159J059j185k574
1038i08K37J918j195j177J137j969k192L19N24o47Q49J267j19J058Q32pP49K083
1056B759o37N8R52j100p01J931K59k109K10p65l457k91K786q09j181K464M36k622
1074a817O39K569j629k34L152O03j751j19P61j835j89J128q30j913o60J84n48
1091b489J38J109M40p87p29R40R08m11J096J682P0n41J390n18k331q7Q93p91k35
1110b53J054j240j598R83M71j224N96R21j121O98K432J47n7M45q61j290P27J40
$$ y = [-994, -1271, 1746, 3424, 3721, 4419, 4441, 3240, 3404, 4303, 3885, 1816, 193, 384, -40, -990, -1109, -1341, -3276, -3995, -1585, -935, -3265, -3501, -1728, -2372, -1577, 2132, 1679, -999, -335, 218, -1582, -1261, 1180, -608, -1773, 593, 350, -1730, -869, 21, -1548, -140, 1941, 1083, 523, 3275, 2951, 1792, 2851, 1666, -908, -671, 1247, 52, -1125, 12, -1957, -4149, -3830, -3306, -3953, -3104, -1837, -1956, -898, -66, -73, 676, 2759, 2122, 2180, 3132, 2032, 1331, 3262, 3521, 1412, 1622, 857, -2600, -2891, -105, -914, -2095, 369, 805, -1817, -1178, 1391, -238, -472, 2680, 3283, 1532, 1413, 2174, 339, 150, 1278, 448, -1465, -2125, -1941, -2489, -2351, -1242, -802, -1589, -2318, -1378, -470, -881, 215, 1897, 1967, 1426, 2816, 2298, -33, -120, 773, -18, -253, 801, -439, -2037, -1054, -583, -1807, -1211, -290, -1411, -713, 1719, 1866, 1809, 2254, 1393, 103, 830, 970]
1128I70j238K92J289q98j081M5j764j392K076J453J15J118r3j969M35K269P12
1145B339m55O08j660q56J245P2j605K69o90j861L68P78k278p30K353K44p29K290
1163b98N94k313R53K934j082o60K281m6j414J701J040k876j557P46k70o81J991
1180A043M80j359r83L18K70q1O93L49Q57P02k86j49o71r34l43M50j55p94Op36
1200a323q85J25R07j149m09R28r7K85J178O71P7J6N75J30O0Mm32J16o1q77M31
1221B70M81j092j29k4l24n27J176O52j042J344J384o81k56O03j244j060J206J184
1239A921n43K71n49j882p78K1p42K91J309k69m84J151j85j652J409J037k47P49
1257H28J238j782o73J679L8j526Q64n0k665K2J866j95j135J210p9j552Q01J086
$$ y = [970, -268, 24, 1313, 415, -666, -621, -2385, -3777, -1701, -248, -133, 985, 892, -1077, -642, 1627, 2339, 1884, 2492, 832, -24, 1221, 1293, -312, -43, -733, -2594, -2226, -1448, -3726, -4456, -2103, -1859, -2588, -298, 296, -2017, -1064, 1870, 788, 128, 2409, 2363, 949, 2650, 3690, 814, -743, 3, -267, -948, 1043, 1523, 164, -819, -501, -231, -312, 381, 730, 1587, 2289, 2003, 1854, 1183, 249, -94, 356, 201, -593, -587, -1323, -2208, -2083, -1176, -2325, -2734, -1806, -1903, -1618, -440, 231, 308, 324, 899, 1029, 1089, 1093, 661, 777, 716, -161, 270, 751, -341, -470, -494, -818, -1345, -169, 483, -559, 785, 2169, 1488, 1232, 1835, 591, -469, 737, 1921, 1378, 1649, 1100, -782, -1560, -1539, -2281, -1990, -681, -950, -1434, -283, -468, -2120, -711, 326, 79, 828, 2066, 284, -389, 1290, 1328, -198, 666, 616, -2049, -2027, -161, -356, -1491, -281, -360, -1912, -1111, -25]
1275b5k93K96J177k93RQ77j50r11Q06k52j416K62j24r18L09J094n19r60J82q29
1295a678l19J649R96Q2K82M08p97j69N39Q4o07J27q8m4j77o27o03m48L8o72M09
1316a615L03n0N70M81K19j2M53P3m30O61K22r0M36M9m19p26k22o60L0j2L7K22
1338d80O29j09l89Q83o49m37J284O10j129R88R31q01r10O02n01k001P01Q12j282
1357a248k17J510j006j031J017K26r54J160J205p42J49Q66k89l90J367l08j063
1374B52j92j41p15Q05M52q73k00K18p43n10R60L68k89J401Q23o03m35O23m42l45
1394D14J166N5j010m19J80p72m60K91j149n29L44N38M8O28J47l18L86N90M5M52
1414F27O95o87N2J109k96q26on42p86M78J53o82m19M73N29n4J4J08j38l26M70
$$ y = [-25, -318, -22, 1155, 862, 871, 1748, 1598, 687, 1493, 1241, -175, 87, -37, -955, -646, 448, -71, -1031, -849, -1678, -1997, -348, 648, 730, 1012, 1420, 623, 454, 993, 1077, 470, 597, 509, 465, 288, -339, -942, -1390, -1352, -2024, -1615, -1312, -1362, -792, -311, -92, -104, 349, 422, -8, 653, 875, 785, 1221, 1270, 851, 125, -97, -757, -727, -739, -702, -480, 149, 40, -349, 534, -115, -552, 732, 1342, 213, 1201, 2132, 1331, 421, 1023, 522, -1479, -778, 34, -1248, -1465, 45, -961, -1992, -975, -749, -1703, -543, 662, -80, 69, 935, 646, 256, 1623, 1315, 252, 60, -81, -796, 9, 461, -412, -612, -394, -1137, -1647, -687, -319, -608, 793, 1616, 1013, 578, 1201, 759, 414, 1580, 1635, 625, 206, 386, -386, -846, -555, -1704, -2233, -1889, -1351, -1303, -675, -528, -846, -460, 130, 175, 627, 1322, 635, 687, 1796, 1500, 674, 668, 126, -660, -182, -29, -711, -1130, -657, -128, -182, -168, -60, -198, -524, -54]
1435e4Q31j97p6K23K63k73o05J40j093j089Q68R45m08LK44j076n51J158P30l15
1455c32Q93J029k58k33K72m93p00N99M8m58J19m53p38P9L09q27l94R44o91n3K234
1476H96j19o75P46Q50j164L29J312o23r13M87j3q92j22J84r82l63N51o59m36R24
1496f82K44j37P64P26o16J79L68q58N87Q82k63o85L11n72j341J49l2j287N95P82
1516h86o66l29Q05m2n71O75M53o3K04J395n67k52L38J10n18k85J48l52j28J68
1536c63R2J91l54R1K76L68l57P54O52Jj53J025j22q67K95j01q64J05n4p89k72
1557d46N37k01m93L24r29k18Q74P82J08N30N37r50P3N45k42J8M67l60j204R67
1577G19k19j269k98K75p77l75J106Pl84J295J16p79N96K97p35O42O13o85r0N70
$$ y = [-54, 777, 580, 504, 727, 990, 717, 112, 252, -841, -1930, -1062, -117, -525, -522, -278, -1354, -1905, -747, -17, -332, 561, 1590, 1332, 1099, 1371, 878, 178, 777, 825, 367, 486, 33, -705, -626, -317, -1144, -1538, -594, -1285, -1338, 896, 777, 102, 848, 1698, 534, 863, 2175, 1552, 639, 1126, 1113, 221, 99, 283, -699, -1062, -511, -1170, -1606, -682, -438, -575, 189, 915, 299, 478, 846, -12, 575, 1457, 1194, 509, 820, 248, -1093, -944, -976, -2263, -1668, -886, -1552, -1881, -1076, -1118, -1689, -1014, -561, -624, -420, 975, 408, 156, 494, 604, 86, -199, -51, -403, -531, -363, -271, -80, -434, -343, -67, 301, -56, 698, 1350, 1351, 1198, 2223, 2101, 1234, 1529, 1428, 564, 669, 615, -174, -446, 91, -110, -603, -279, -1208, -1426, -552, 230, 338, 868, 1405, 455, 528, 1073, 831, 849, 1316, 956, -248, 719, 500, -769, -1067, -792, -1569, -1944, -838, -831, -1215, 80, 196, -583, 13, 310, -425, 217, 830, 145, 55, 625]
1597F25n32r70M93m27j377O14R53j204O3J224n98o38J361R78j051P75R38o64O6
1616F29J595m94j417P23o1j257L67N68n44R1M60q97j20P6J67m7O51K96r5L16K71
1637A278p87O14M5r16k91L36o66l85R29o44o63M74l96l92L93Q03r1K28J040p9
1657H30j1P9k12N8L05k50m57Qk1q18R4K46p33n18L91j07k42J301o8m54N89M8m74
1680d16Q32N44n63L12M73p44j08J24k47j347J098m0r74N51P30j244k42K163p01
1699B01j032J070N44r95R11Q00q27n54R15o04j136O68O5j183L76O47p20j3P76
1718i1q10o6R21k38K87N25M23m44P01J99j003j57M68p46o0P88m56p23K42j83j104
1739a527O79M31l39J85R55l67o16O69Q0l06N50M85n74k68J01n38Q3L71o33m9K17
$$ y = [625, 93, -877, -384, -811, -2188, -1574, -621, -1825, -1762, -538, -1136, -1774, -413, 565, -486, 289, 1227, 563, 629, 2224, 1730, 313, 1036, 975, -282, 85, 653, 109, 200, 660, -237, -357, -281, -114, -161, 490, 786, 691, 1007, 1278, 491, 1105, 1150, 234, -57, 279, -387, -772, 157, -487, -1150, -676, -1072, -1464, -1071, -268, -359, -131, 909, 830, 819, 898, 686, 744, 1049, 799, 342, 350, 329, -489, -395, -149, -882, -1400, -1009, -1116, -1358, -57, -125, -579, 10, 58, -416, 416, 960, 397, 709, 1182, 438, 330, 454, 207, -1140, -42, -82, -1056, -505, 225, -1019, -1261, 902, 201, -831, 239, 783, -212, 699, 1499, 672, 118, 1033, 429, -707, -39, 26, -1157, -781, -134, -854, -867, -91, -901, -967, -46, -284, 3, 528, 951, 507, 1208, 1407, 404, 247, 715, -31, -91, 697, 241, -482, -240, -423, -1527, -848, -417, -756, -571, 384, 17, -599, 70, 150, -156, 394, 879, 305, 37, 138, -400, -317, 54, -579, -628, -411]
1760d11o63k76N48N31l39J004N5m39M78J99Qj40M32L67n45K69n60l52O9k65k75
1781c05m8L04n98L70M04m83N0N09m07k31J110K59p10M86L85j160l52P09m94j168
1801a370J074K59j212L47M56j096M18J129m97j5N59J64k12N92N19n82L04K21r53
1820A05k11J021p67k78K58j3q90M23L56j343M92J092p58K51Q82J47q56M83M23
1839H17p30K11O65p17m10M91l38o82L01j07m40K20J22k9K52L09k96J87N80k56
1859A50o7O79J32l49J75J24m05l77J16k74m61M10mm77K39R1J7J81k63J33L32k49
1881a47L19O24J70q32K75M1q39q1M69l04n44M74J76q23J7N88n57O3J106j68k50
1902b23M98O80m51K58k0m03J7P8j34k73J57r3o63o4K6n28L39O10m17K47J161n41
$$ y = [-411, -1074, -1350, -802, -271, -610, 394, 449, 10, 488, 687, 695, 555, 987, 1354, 809, 1078, 518, 166, 235, -30, -305, -353, -49, -647, -277, 127, -356, -306, 203, -204, -435, 675, 934, 224, 710, 1095, -65, -417, 292, -202, -1370, -296, -37, -1249, -902, -446, -1542, -1124, 5, -492, -507, 52, 216, 4, 596, 1115, 533, 837, 1058, 105, -106, 915, 148, -130, 128, 115, -775, -352, 4, -1339, -847, 245, -513, -262, 620, 767, -89, 394, 817, 87, 298, 963, 246, -164, 327, -11, -693, -392, -499, -939, -719, -597, -626, -374, -65, -361, -174, 406, 150, 83, 762, 894, 545, 720, 844, 439, 62, 178, -96, -557, -147, -151, -628, -389, -298, -281, -100, -363, -230, 102, -147, 172, 796, 966, 134, 409, 450, -389, -470, -1, -305, -849, -375, -199, -1022, -1005, -417, -974, -911, 195, 27, -223, 275, 955, 504, 762, 742, 339, 356, 434, 300, 27, 184, 91, -572, -636, -610, -1138, -799, -189, -606, -359, 802, 261]
1924B61l60J189j08p83N94L87o51N4M80n74j72N1n67p37M03o5k43N00M05n30k4
1945d90N70m94J06L92M48l54N03P5j203L71K22m88l13L13k05l40K26L84l41o4
1965f82M70n3K17J05K48J14J17JK65l51n20l1R2k45l08O98k18o00K34K55m94j33
1987h19Q09k18o8R21J40n01K37N69p23j42L73j51l94M5L6k22M4o11m09L51J28
2008f05l16Q14J88k6o8Q35m30l29J113l16l69L22J52r61J98M97p60k58M19m04
2028c04o36N27K05k74o2M58l56k3O04k19j99P27l4n01K34J48n17j03L78o28m67
2049a042J142l93n57M23O24q49K06M83J02J55M07l8m26N34j00j72j22j69k85J50
2069G3k33J6Q6p7o45J36L09n8J59M66K12k64N29K94n92p6L41j88n86M13K6p27
$$ y = [261, -99, 1090, 982, 199, 793, 1180, 529, 583, 1063, 489, 317, 368, -199, -936, -533, -598, -841, -341, 64, -466, -490, 80, -414, -308, 84, 532, 178, 681, 756, -447, -76, 146, -342, -655, -342, -547, -887, -661, -277, -618, -682, -212, -265, -48, 57, 305, 419, 536, 537, 802, 451, -69, -100, -8, -253, -561, 137, -81, -681, -447, -192, -686, -819, -10, -228, -296, 625, 765, 264, 501, 1070, 347, 205, 578, 427, 33, 78, 114, -108, -64, -675, -1084, -733, -605, -921, -107, 81, 55, -13, 822, 392, 63, 1176, 860, 491, 813, 965, 4, 202, 699, -61, -319, 100, -304, -940, -413, -208, -482, -544, -86, -442, -465, 139, -80, -279, 448, 414, -87, 147, 295, -222, -325, 53, -575, -1042, 100, -293, -850, -427, 197, -652, -446, 37, 139, 294, 701, 663, 237, 771, 671, 499, 377, 208, -77, 73, -160, -144, -58, -135, -780, -644, -335, -393, -234, 232, 444, 180, 709, 1003, 411, 335, 676, 488, -98, 315, 341, -386]
2091c86M60l74m19M9J49m22J42N29k58L64P7L4l8Q07L8o26M32J71p19K91L86p93
2113a06m38M46l29o11P22M1m68L66M43o86K26N45k9j05P00k1p44R47p4p61N5O17
2135G36q59l41O71m83k16O91O9r07K69O78o31L51N06k51j43O44k05n92J76J4n18
2156c41J99K17o24j15M66l02j31L18j52j12O70m6PL43L49m00Q0N11l70m24L79
2177E22K22r04L83j35n42j42N10m79k49L82J31j92L24j21L38K35K7N7o4O4k51
2198A16M72k21j21j77O5m34r3J03j49L40R2l8l64K59M23n58L64M33j43J65K95
2219H29l70m11N61n1p81j10M50o14K8M92m05k09N10j22p82O52O96m41J75O78k81
2240D94m88O22n1o62K37Q7p36K80K96n52J25L03l18l41O31l03j2L08L97k23L99
$$ y = [-386, 74, -300, -719, -670, -521, -943, -801, -272, -530, -166, -89, -55, -93, 714, 752, 126, 558, 729, 10, 301, 687, -106, -544, -98, -427, -1038, -316, -275, -743, -377, 66, -620, -394, 151, 122, 17, 717, 696, -48, 899, 825, 64, 119, 736, -123, -464, 207, -276, -492, 199, 268, -639, -370, 308, -323, 28, 534, 283, 140, 784, 579, -13, 163, 177, -341, -142, 75, -549, -664, -198, -500, -631, -313, -465, -577, 93, 47, 54, 397, 746, 346, 426, 937, 567, 143, 522, 744, -160, 223, 88, -454, -596, -86, -565, -814, -432, -301, -493, -169, -290, 48, 283, 310, 367, 303, 367, 116, 588, 367, 246, 69, 134, -300, -393, -290, -439, -99, -7, -45, -409, -150, 273, -285, 79, 512, 369, 534, 829, 459, 48, 609, 558, -223, -333, 117, -497, -469, 23, -382, -591, -81, -203, -985, -333, 363, -78, 97, 775, 494, 6, 628, 577, -85, 152, 239, -497, -217, 79, -473, -348, -45, -363, -704, -73, -376, -388, -80, 317, 94, 493]
2261D93L91o66n9M93m34k6K15j62k03j82J02l04j34M39q4l02N97j0l92M64J70
2282D06m81L09K36n8l68M40m06j0j46j40l80J30n2k28M42J98l41L4m3J24p0N46
2304A42j71R5O2L2q5L55J02l31k3P4o40L1J06JP6L6j79l01M58N11o09O24K82j57
2328D91j91P03m52l70J67K41n85J61J97l80j00j11j33m18L05J99j96M73j29m05
2348e33Q06k5j38N2Q4L2k08J23k14j48J10k04k04J49L78k49l70P20k39j11J69
2369b0L70n01N24K20l41K86l5k11jJ83l19m22K19j70K1l39J03J32j06N78j98l02
2391c29L46K92m25K50M34k43L6j00r4k46j23J69n02J63j11k04K04O2r8qJ79k00
2413e48L08K53K4Q5L23j20P9K71l22m08K51J43k96R1k03J63k93J97k23j56k1K97
$$ y = [493, 884, 218, 159, 652, 218, 192, 407, 245, 42, -140, -38, -342, -476, -37, -121, -423, 174, 164, -228, 236, 406, -75, 234, 470, 412, 44, 484, 78, 68, -78, -218, -598, -468, -520, -748, -306, -108, -449, -415, -458, -334, -404, 142, -29, 66, 128, 160, 75, 430, 532, 201, 178, 252, -388, -357, -251, -250, -174, -138, -317, -618, -160, 351, -258, 366, 648, 491, 300, 1003, 551, 181, 348, 589, 4, 165, 362, -18, -118, -229, -362, -780, -475, -276, -472, 1, -128, -533, 273, 248, 110, 162, 246, 278, 70, 193, -21, -169, -59, -263, -467, -318, 60, -189, -559, 161, -78, -189, -20, 350, -151, 373, 593, 252, 538, 503, 292, 291, 474, 155, -267, -48, -218, -197, -536, -433, -301, -407, 171, -27, -329, 17, 309, -116, 134, 568, 325, 361, 261, 167, -79, -202, -33, -535, -372, -483, -687, -483, -421, -519, -527, -348, -548, -240, 13, 37, 122, 445, 325, 404, 675, 353, -55, 196, 339, 43, 134, -69, 94, -199, -2, -225, -381, -402, -105]
2435a05l18L32J99OJ74K05l68K00N1p8m0j72j7l56J71K41m80%N02m30j85P32j11
2458A53k26K78R6l98Q7N50n89K61L47j84o48L90l6n20RJ65n2k17L37j57jN96l06
2481f5r9N02j83m1L63K55m54j38L50l67m37L84l39j06j53N72p04L42R9n39L15
2502d43J70J94K03J56K09j96K00l12J11R7L8k12l93L33j19l49M57l65l41L39K15
2523hl08K41K47q0k8L7K87j81O7L2O2j19J06l33Q5Q2o68K96k02K8M1L61l15K58
2547a2J78J06m92N45j30p5M7L56m76l3K48m16l79M66j52m55N05L2l56L7N87k92
2569a61K98K02j1j05O0L79k45j50P0m3j02J26l18k72N7j96J02K14j22k46J84J17
2591a62L0J23L99k71p9J82p4j17K60n7k17l7J81k07r1O0j60r8K47p5m45M02J51
$$ y = [-105, -423, -91, 108, 114, 288, 493, 125, 325, 376, 298, 258, 86, 69, -287, -116, 125, -355, -355, 147, -283, -468, 264, 153, -73, 205, 301, -97, -10, 540, -49, 212, 559, 375, -273, 117, 81, -439, -430, -265, -317, -534, -197, -354, -355, 241, -65, -164, 338, 155, 114, 477, 732, 278, 140, 490, 123, -314, 70, -269, -375, -528, 44, -660, -318, -219, -758, -443, -273, -79, 124, 280, 489, 293, 493, 181, 292, 389, 427, 215, -178, 155, 36, -313, 144, -221, -562, -223, -8, -316, -75, 172, 92, 64, 101, 388, 207, 274, 306, 368, 249, 355, 22, 107, 189, -479, -183, -385, -357, -316, 45, -270, -12, 166, 272, -220, 325, 195, 120, 167, 523, 47, 14, 262, -154, -533, -67, -219, -674, -169, -137, -493, -456, 131, -161, 137, 339, 328, 223, 283, 662, 417, 267, 337, 294, 192, 318, 0, -272, -215, -411, -309, -95, -217, -463, -279, -162, -132, -9, 390, 119, 40, 222, 148, 31, 291, 234, 17, -20, 161, -46, -137, -77, -237, -335, -88, -163, -608, -206, -55]
2614e5L3J49J44l35oL69o0j87J96R7j66j71l63J00K6K5rk95M85k59R9M62k57l18
2638b96P12Jn14N63j71l7k59Q7r3j54L36k85l77K11K70m47J29J85O7k96M58M2
2660A32l11O28on78N33J67m32J34M3l32m3J28k21l98N23l32m9L09K90m41mL77
2682A17l78K54L18j9j19J49J69n52M3r4P8J30r2k71nK61j52k75K57J91l08K70
2704b8L34m58K42K67Jj02r5K53l19P0k7k07k9k6n0Q4l00Q0K13j9J53m3J36q9j74
2729a33L77n7%n5K09m54L79r2k40j76J98n1k51K55O5l25J19L04l50j12L84R3j2
2752G5J61J11k69K36k2k59l32M28l09j30L48k64l1r2R9%K65r2J32p1L60m3k76
2775B5K84J96k32j06K66n54J24K68n38R2J73l40k71M44j31M18q8J57l85K79R1
$$ y = [-55, -22, 127, 271, -64, -70, 299, 239, 52, 248, 345, 179, 8, -355, -255, -229, -204, -213, -508, -23, -282, -183, 279, 22, -296, 416, 417, -97, 466, 295, 258, -1, 86, -7, -161, 175, -110, -487, -276, -6, -453, -324, -139, -72, -368, 90, 132, -179, 449, 443, -135, 398, 565, 133, 267, 310, -22, -65, 63, -158, -556, -33, -365, -414, -105, 185, -256, -260, 117, -261, -7, 311, 292, 173, 322, 491, -61, -18, -112, -34, 96, 4, -267, -272, -11, -163, -438, -181, 10, -298, -28, 306, -152, 90, 357, 358, 256, 161, 414, 95, 165, 138, -69, -98, -124, -174, -90, -390, -310, -97, -116, 37, -6, 130, 41, -133, 244, 187, 187, 132, 341, -113, 266, 174, -66, -242, -44, -95, -346, -91, -26, -351, -232, 72, -278, -390, -6, 87, 75, 236, 347, 78, 314, 292, 33, -299, 129, -180, -310, 38, -226, -257, -349, -250, -250, 15, -77, 55, -16, 344, 301, 25, 309, 505, 273, 167, 433, -121, 3, 271, -267, -175, -2, -342, -613, -169, -300, 118, 30, 187, -198, 81, 172]
2796A72k03K9K09J67l02J27M0j84j26K91m45N9N1q3k43L12ol44N21MK76k55J92
2819B59N8j15K20q3j0J21m40l26R1N5J01J02K3o7p0r5pR8K4K52j52R2L14m00O3
2844A08J81p9K7l17J16j87K11j10k61J33l46N07n5j08J22o8L10q3j59n6M02j39
2866A49M0p1J2k66K57l13J45J73k62n9R3R2j33J1P2N8L44n8l51oN33r5k42J78
2890C01J09n57J88J51l49J44j71J56m07L26J8O7j90J84R2J09J46l51O7K47J05
2911C85Lq5j40K0j10l9J05j94M3l4j25L5j31k4K81j91M0R0K34Q5J1O9k21J11Q
2936B26j80m5J39k96j6P8j68j94K28J78j65P6K84Q6p3J14j14J24j12l8R4k56K57
2959B27m79J21J6K2N2j78n7L8n1Q4qJ65J53n8k1K07o1r4L33j48l03J38j32j59
$$ y = [172, -31, -2, 207, 374, 72, 199, 239, 55, -71, 220, -225, -166, -115, -198, -441, -129, -135, -479, 42, 46, 322, 67, 259, 317, 202, 422, 339, 329, 450, 10, -316, -225, -170, -69, 33, 56, -11, -81, -176, -183, -85, -61, 191, 39, 131, 445, 45, 108, 289, 210, 237, -80, 36, -151, 60, -50, -311, -178, -524, -17, -72, -180, -58, -126, 184, 101, -58, -114, 288, 149, 189, 118, 130, -136, 121, -192, -47, 126, -136, -195, -102, -10, -143, -132, -60, -2, 342, 284, -67, -73, 460, 365, 123, 301, 410, -147, 41, 192, -157, -13, -184, -28, -435, -109, -91, -24, -214, -30, 62, 171, 317, -34, 33, 280, 385, 388, 303, 163, 183, 73, 34, 139, -55, -12, -46, -171, -136, -267, -291, -10, -201, -161, -71, 163, 248, 259, 328, 107, 218, 226, 46, 1, 140, -156, -172, -94, -262, -456, -228, -50, -215, -139, 145, 231, 158, 272, 158, 282, 170, 132, 226, -30, 227, -252, -131, -115, -93, -41, -219, -276, -238, -289, -205, -213, -48, 105, 47, 26, 233, 172, 78, 411, 263, -40, 98, -34, -193]
2983a93K85m46K50k54K37r9k38Q4L09j31J9J99l4J26L46l18J14j04L5k90K01j58
3005f0K5N0j85Ql62K27R9p6J13R0n0mL61k72Q3J75j26o2M44j66l29J28j20J39
3029A30k75L22l88J44k32j30K73k4P9J40j11K13m13L95J33l57J03QR6k22K54m08
3051b70J07J63l5j09k05J28NJ52j90M37P3m46K39R2J17n2j83J81j44o1K0R4k91
3074a78J02K1l16L42l6K8K5Q9J4k28N0L81l54M58m50K46k74L98k72j56J90p5L
3097HK7j36j16K0nJ30p6j35n7K55J5L42M2j07j26o4j15M29k38K28n47N78o48L35
3121C9j53J2M9j71m6K20J39k6J13j85L43k69qJ21l2j41j44P8P4N9j26j63K2q8
3145b83M8Q1J00N4j76L65k57L10Lk32mj12L5L18k84K2j5J20l22n2J42J41k62J06
$$ y = [-193, 92, -354, -104, -358, -121, -220, -458, -374, -65, -196, -177, 22, -12, 114, 460, 142, 256, 152, 187, -103, 98, -60, -35, 15, -170, -162, -524, -297, -198, -274, -161, -71, -121, -125, 236, -36, 47, 222, 96, 34, 478, 312, -17, 111, -9, 130, -145, 177, -211, -67, -299, -429, -156, -180, -101, 39, -72, 141, -272, 123, 256, -101, 2, 10, 106, -116, 138, -270, -163, 0, -35, -144, -349, -221, -216, -64, -254, 183, 256, -190, 49, 141, 258, 206, 23, 204, 60, -1, 19, 113, -178, -76, -55, -371, -29, -65, -37, -12, 77, 91, -137, -87, 294, -60, 398, -52, 194, -80, 318, 46, -110, 80, 5, 8, 35, -101, -217, -197, -202, -72, -148, -283, -340, -85, -70, 272, 314, 207, 81, 17, -98, 331, 93, 321, -226, 352, -296, 39, -114, -102, -53, -224, -270, -50, 89, 63, 176, -9, 334, 65, 57, 178, 146, 5, -139, -61, 13, 72, -54, -217, -195, -283, -235, -154, -54, 0, -176, 189, -68, 242, 245, 13, 9, -103, -68, 250, -34, -12, -27, 93, -229, -281, -139, 2, -260, -154]
3169a54O1j48K91k14K61l34M13L6j66o5J86J34m12M0Q5Jj19l3N8j26Q2j86J70
3192a39Q2j74N4J87k57R9J03J93q8J6O8n7k97K69K59n02J50q1J20j84K86m3l81
3215c17K44m0J04J88L3l36K77j30K17j34M3j18K8J59j72k52L8J27l2k28n5K03
3237a53m5J97j10K49K15j28j4j32Jj80L31j64K00R8n16K11k02j86K00M5L2o0N5
3260e6k69K44J22o5J24J16j05J52Pj49r8R1K5k30N9K49p6k54J77l51J68n4K38
3283F5j23K97J25k0j29K3jl9K0k63J60p9n2M4j57R8j79K30q8k03Q2L0K32J94k73
3308fj4L55rl62K14K18j85n6l06J1pj57M5J28O4R8j23l24J95K03p0J02r8J04K85
3333C05j08j92O4J86j77l64K13oO5L5o5o1r4J64j8p9r6L58o4o6O0j54K10l1p5
$$ y = [-154, -93, -241, 50, -164, 97, -237, 176, 212, 46, -19, 167, 301, -111, -71, 14, 15, -104, -137, -79, -205, -123, -309, -139, -57, -231, -177, 10, -247, -148, -45, 148, 60, 76, 144, 87, -210, 59, 318, -184, -34, -115, 5, -179, 107, 64, -317, -73, -113, -9, 179, 212, -124, 153, 23, 240, 106, 149, 31, 59, 218, 46, -206, -168, -41, -73, -301, -356, -153, -198, -1, -111, 138, 353, 225, 211, 79, 80, -100, 231, 67, 267, 365, -151, 60, -142, -328, -128, -83, -51, -111, -56, -325, -81, 41, -24, 100, 216, 111, 263, 270, 121, 23, 114, 139, -91, -32, 217, 141, -113, 64, -287, -119, -173, 65, -58, 239, 364, 344, 215, 238, 237, 198, 218, -45, 115, 36, -16, 28, -129, -31, -210, 20, -68, -271, -189, -159, 73, 267, -6, -20, 335, 326, -36, 178, 396, 211, 155, -151, -140, -147, -304, -259, -131, -67, 31, -92, -416, -221, -18, -88, 14, -84, 20, 305, 197, 5, 69, 255, 78, -286, -73, -79, -14, 21, -44, -105, -199, -35, -53, -132, -228, 130, 66, 0, 60, -94, 116, 85, 10]
3358A0P8J18j29p1J09k56Q3j81l4K4J87j45j49K90jj35K69k03L97k88p9L65j60
3381I9P9q9k71K17j19m4%k41K90L7k15J95%K15l28P8M22k90L47l61N1M5M0J05
3405B62k37qK40r5k71k0j93L52k30J64j30K59N2k02J17rQ8k5j24K48j72K61k04
3428A23p4Pr6q1J79j58J96j69l8M5p0J51R4k04K54p0k63J76l2L20k65J19k98K6
3452a28L1OQj3M3j9j88K11k6J98r8l7L8R0N6j11j7K30J4n85K27K9o3K45l09q8
3478b56L99j43j92J34J6J57l31O6Q3l9L69p7j81K90k91L11k08l04J15P2j39j56
3500c05J42R9j00j25k0J80J11j2r2M1Q2j64L24m5Q0l2j80j3K88n44L15j88J64
3523FJ08n00J94J61K86k30o3K31m7Q6j74m3l2J0q1K99l25J59J32l25P5o3K40k54
$$ y = [10, 88, 206, 77, 6, 115, -141, -58, -239, -273, -249, -62, -207, -356, -66, -67, -202, 67, -136, 261, -27, -106, 259, 99, 178, 89, -182, 35, -84, -128, -128, -369, -79, -42, -257, -62, -62, 153, -175, -97, 325, 35, 382, 21, 72, 117, 157, 262, 25, 17, 257, 162, -109, -129, -322, 30, -200, -36, -166, 93, 145, -57, 60, 51, 139, 114, -10, 238, 66, 327, 123, 49, 56, -40, -121, 58, -100, 96, -73, -111, -66, -136, 15, 109, -95, 159, 89, -174, 2, -30, 290, 25, 144, -154, -128, -97, -91, -83, -96, -53, -72, -260, -49, -75, 123, 25, -12, 26, 116, 172, 61, 44, 274, 288, -297, -70, -41, -104, 141, -168, -256, 143, 0, -192, -58, -42, 115, -216, -150, -67, -106, 263, 186, 5, 295, 4, 315, 107, -197, -82, -10, -149, -305, -163, -64, -164, -289, -309, -129, -18, -30, -122, -81, 1, -163, 161, 116, 196, 164, -16, -29, 259, -285, 30, -158, 6, 114, -386, -192, -31, 255, 25, -38, 193, 146, 232, 58, 15, -17, -7, -88, 211, -114, 45, 177, -148, -73, -136, 104, -150]
3547a50J19j13M1R9LJ1j13K58P6k73M33K3k57j86J94p2j04J24q2k54K0J45j34
3570a92j06M63k57R5J64r9L56k34j14p6l1K07j14j10j74P4K62k14l6J22k40K55
3592Aj53m4J39oJ97j96R1Q1j58K34l71J73K95j95K00q2r6J9j29j93L87m18p7J88
3616a13j04K82K08k14P0o9J9O2j05J07J8%j33J36j75k8J7M0j76J26j42m5K68r6
3640d7k08M09j75j1J40j43J43O3K0k17P2m7R1j00j35MJ77J38m65K70j51pK18J2
3664E1J73k02qJ49Q2l13K70J07k20N7k62J58k08l4j81M27k62J04J08M9j29N4j00
3687a30J40J78j63M3K12J3k03J35k86j6J71j89k70L89j98n2J11K20r2j4L32n27
3709a96K16J5O7J15k71J69p4l2j31n2K21J6k60J19K98l15J15k62J26N2k43J81
$$ y = [-150, -31, -144, -103, -4, -1, 10, -103, 155, 231, -42, 391, 414, 157, -29, 165, 93, -11, 113, 31, -223, -203, -58, -192, -298, 165, -92, 3, 167, 68, 424, 190, 76, 0, -31, 176, 62, -48, -222, -148, 114, -100, -136, -14, -254, 1, -152, -196, -57, -63, 134, -62, 29, 110, -48, 186, -185, -12, 283, 88, 288, 206, 110, 129, 0, -193, 194, -224, -301, -113, -217, 65, 273, 59, 129, 60, 79, 141, 36, 143, 161, 161, 28, 164, -11, -39, -22, 18, -158, -32, -174, -219, 49, -47, -255, 154, -21, -32, 108, -35, 108, 171, 191, -26, 46, -1, 90, -10, -145, -141, 36, 174, -291, -21, -172, -179, 39, 51, 224, 22, 14, 163, 245, -68, 202, 309, 89, 146, -116, 42, -166, -200, -381, 46, -216, -112, -4, 45, -84, -30, -130, 10, 188, 25, 68, 280, 293, 90, 225, -61, -77, 94, -95, -365, 24, -174, -226, -115, 105, 13, -1, 331, -196, 20, 35, 102, 217, -54, 115, 41, 9, -122, -174, 47, 63, -197, -78, 220, -95, 20, -242, -116, -64, -307, -126]
3731a26K58mq0J39R4j14k82K67k84k4K79j51O4j29j15M1K62r5p9j78O3r4M91j17
3755H6q2L35L0n33K02J15M4j85J80k71o0R3l3J01m71J98K35q8Q8j8O0p6J60K37
3779C47k75m8M4k7j45J05n4Q6q7k23J48o6l0K38j21O1K32r4l27L57j26K54l3j34
3803H2o0J42r7J36N0m98K51l6M5p0Kq1R4K47k92Q5K4N7j75K97j30k67J93J19j68
3828e0J84q8j27L30j08k90J28j65K45j48K52M6k52J42%k61K96k8j19%M4J23k01
3851d7Q5j67j13K09o5q6L40j65O4j01L0k33K48j28J86R3q6j85O8j47m0K44J15
3874A19k47J21j66R8J58k83K63n2j07J6N5k90L18J60j26m2P5K03j03k99k7K72
3896A16j67J86l95M06j17j48p8r5L52k55O4K4M4M9Q0J19m06J65J4o1j04M38l28
$$ y = [-126, 132, 128, 48, 187, 281, 167, -115, 152, -132, -156, 123, -28, 36, -93, -208, -167, 95, 0, -79, -257, -194, -288, 203, 86, 4, 339, 369, -164, 38, 153, 197, 12, 192, -79, -139, -46, -79, 22, -449, -251, -16, -104, -16, -34, 26, -50, 110, 347, 72, 24, 68, 41, -104, 1, -53, 33, -54, -277, -129, -195, -225, 13, -108, -47, 185, 91, -236, 121, -5, 249, 216, 82, 22, 164, 67, 203, 253, -245, 6, -30, 15, -55, -53, -134, -40, 207, -85, 0, 24, 81, -94, 203, 73, -194, -1, 118, -50, 134, 46, -81, 249, 141, -149, -21, -186, 59, -89, 163, 209, -43, 99, 99, -162, 134, 106, -13, -13, 31, 154, -47, 38, -129, -242, -33, -98, -184, 156, -9, 55, -46, -16, -249, -1, -129, 57, 150, 64, -121, -53, -200, -240, 4, 119, -128, -7, -173, -75, 83, -200, 63, 11, -96, -80, -25, -315, 3, 163, 37, -5, 70, 273, 170, -129, -156, 116, -51, 135, -260, 146, 29, -119, -197, -292, 60, -195, -131, -107, -63, -14, 66, 185, -221, -56, -42, -103, -207, 231, -97]
3919i7PJ61k6j88j46P7J66Q7n5J55J08j99j44N2K6J46J05k00lL72k99j83P2j85
3943a91J57R6j42j28J15J05k38J00K7pK63j69j96L72j56k3N1J67k00J86l2l55
3965a98L1J87k39J57jL4L3P3J38j52r0j51k1J25K02R4q9j12Q5j82P1j54N5N7J26
3990G9k89J17K52k88L00j90j29K92J38m17P3J49q6R0k57K87k57K16m0j62R5k36
4012b63K51R5j30j96J19oK40j80J25j23R3j02K2M62m75K66k08J27k1j05q4p3L00
4035A34k70l09N11k58K09k29K18q3P7K22j28J3M5j14j32J89k71K96j93J73j97
4056i7q9l6J32j13J53J5j02J86k6r0K99J2j44j53L02K0j88k32L02l84K10J65r1
4079E1J1j44Nj22J13Q5K34j68k30J08J17N9K3k32J83j86J84j38J87k12O3o5j57
$$ y = [-97, -90, 71, 45, -143, -289, -212, -46, 41, -14, 141, 249, 50, -94, -42, -16, 130, 235, 35, 32, 404, 105, -78, -6, -191, -34, 62, -80, -208, -93, 12, -226, -126, -99, -106, 157, -12, -208, 164, 8, -15, 36, 203, 3, 189, 157, -198, -167, 20, -219, -62, -63, -29, 4, 77, 215, 63, -27, -178, -199, -74, 128, 222, 133, 21, 106, -76, -5, -159, -104, -47, 79, -210, -93, 159, -129, 171, -19, -148, 144, 282, -135, -62, 87, 1, 91, -166, 121, -136, 80, 40, -122, -27, -263, -12, 83, -47, -243, -124, -130, 110, -70, 55, -68, 25, -77, -55, 407, -68, 198, -10, 117, 96, -9, -93, -166, 134, -136, -445, 66, -192, 17, -212, 6, -77, 0, 222, 94, 107, 152, 38, -94, 95, -176, 120, -73, 100, -97, -186, -222, -90, -203, -50, -35, -137, 49, 23, -67, 232, 244, 100, -53, 249, 269, 81, -151, 151, -233, -23, 142, 51, 62, -82, -77, -199, -86, -1, 233, 65, -165, -57, 60, 119, 142, -90, 93, -93, 91, -47, 140, -72, -9, -74, -231]
4102b31J14L8Lj20L07J10j43n3N4j88O1L05l42L06m19K62r1qO3R3j73J41p1k54
4126b36L33n3j10J23k6l45M67l1o0K26l24j2M6q5J61Kj05o8Q6k09L4j1J68N6r4
4151f7j38q5O06l83j27K59r1K03J21m34L68j26q2J6J56m24L44j19m2k3nk6J96
4174I7l5j15K05k84K27j50L03j76J43k59K6q9P2J7j04L86k52r8O7k27J98J50k51
4197a49K95k71p7R1J61K67l8j21r4P3k07K56o5k15J18J28j17k41K36k12j34K18
4219i8N1j37K42l52M05l79K08J04m5N8MN0Q9j85l6l9o5L0Q9M4k08J77K1j80K7
4244a25L18k76L77l75L01j05k26J22R5J00J9m40KL60j84p6N0q1K21p5j27j20L16
4267G1J34m9L9j98K09k05k02J84K68j91J4j91M0J65j77k8j09J16M7p5r9K96j34
$$ y = [-231, -117, -79, -76, -196, 111, 221, 78, 25, 79, -109, -48, 257, -85, 221, -198, 64, -27, -35, 28, 121, -52, 89, 18, -236, 97, 44, -66, 57, 31, -314, 153, 122, 62, 288, -36, -48, -2, -87, 74, 76, -29, -97, -11, -220, -186, -197, -29, 27, -67, -205, -290, 316, -67, -194, 65, -26, 177, 298, -136, 232, 106, 24, 40, 196, -228, 116, -3, -45, -68, -73, -99, 97, 62, -53, 152, -132, 95, -55, 248, 72, 215, -44, -18, -107, -35, -18, -122, 264, 12, -86, -19, -246, -48, 102, -149, 146, -125, -202, -111, 50, 317, 279, 158, 64, 137, -70, 186, 121, -94, 24, 152, 35, -206, 30, -182, -316, -98, -47, -184, 58, -294, 111, -268, -60, 44, -1, 57, 61, 111, 200, 15, -21, -60, -125, -95, -6, 38, -170, 7, 28, -152, -125, 193, -83, 294, -81, 220, 115, -111, 11, 106, 206, 225, -215, -213, 147, -37, -113, -63, -144, 77, 2, -125, -245, 71, 205, 156, 195, -3, 206, 1, -201, -17, 251, 60, 74, -117, -77, 88, -89, -117, -226, -110, -63, -138, -237, 59, -75]
4290g5K93j86J82j51p1K60m01K91l09L6J66L5j29n4J07j84J03q2J57J17j40o9
4312a04J0q2M26l94O7J81j46j47J66j14K55l5l05M7n7J04O7P7K23k02p4J68j46
4335a5R0J63n11J38K93k13L4QN7K18j49m8k54J59j16j52K27J23L2j53P4K0K6j3
4359C8R9Qj17K50k44P9j93r1K97m1o4m0l3J30l10K50j77J34QK19O3O3m43J86N2
4384A23n3j72J17K1n7j46K87J13j33M0j20k01J13k4R6n0J01k61L04Q5P0j36j04
4407A3K10j56J4n1j19j2j3J0K19j88j42K16k88O1M54j5l20M97o41O7J82K34k92
4430f0rL37l45P9J01l9k84K65l36J71j0J50J41l40K17N7O2J7j7l56L34P9j33k36
4454a55K30o6j29j8P0J38J36n69M09Q6k91L35r2k08L57j61l4K14M3k94L00m09
$$ y = [-75, 218, 32, 214, 63, -8, 252, -149, 142, -167, -131, 35, 70, -59, -113, -6, -190, -87, -169, -12, 105, -35, -104, -94, -176, 250, -144, -77, 104, -42, -189, -23, -137, 118, 83, -222, -175, -232, -128, -61, 16, 239, 37, -37, 131, -15, 75, 238, -273, -135, 158, -55, -21, -13, 44, 262, 113, 65, -189, -30, -146, -298, -71, 52, 84, -69, 5, 25, 51, 38, 137, 145, 28, 278, 34, 113, -80, -171, 126, 85, 21, -19, -52, 78, -232, 18, -159, -25, -17, 202, 265, 328, -115, 71, 123, 70, -102, 15, 36, -21, -167, 120, 233, 100, 140, 20, -181, -68, -92, 4, -46, 55, -206, 98, 183, 253, 117, 13, 223, 67, 81, 30, -89, -101, -114, -104, 115, -73, -215, 1, -287, -226, 228, 213, -107, 390, -251, -184, -2, 232, -60, -69, 268, -77, 2, 103, 64, -220, 45, -291, -120, -130, 20, 161, -179, 38, 95, 157, 174, 157, -199, 135, 214, 81, -155, 75, 9, -120, -138, -68, 70, 206, -363, 46, 132, -159, 176, 84, -124, 233, 72, 38, 252, 295, 1, 301, -108]
4476a08J06K63J5j84j79J0k39L14n1N7m9K64k01j46J30j01k0K21M3j43k81M04
4498A25q8j70K54j89J03j49K9R0R1J30m11J58j0K49L1k52L1J12j21J16J29l10
4520e2m0J58j87j73K01P4J4J59l30M11m57J67L94j15j08j0M7o1o7j02N16m10l2
4543ck86K12J70l03K72k33J59j22M4k06J16K73k3j6m9k4j50L97k94J84k6k38J49
4566CJ54K5k72PR6k48M3Q3j12R9Q8Ok02K67L14l70r1L25l11J62l26L39l17j13
4590c51N54k82P4j15J8J39j17j4p1J61L3j11N3J19M2m0j01J19q7P1k31O2l5J84
4614G4j42L6m1K20j84JK5Q0l3L2P8k88J25J3N2J45K5k81m7J75k55J29J95L7k22
4639e1r2J09R1r9m3p9J4J70j54J92k89M15m56J88K23j00J68k79J23j97K26j93
$$ y = [-108, -2, 261, 276, 92, -87, -77, -316, -2, -53, 4, -45, 219, 18, -128, 2, -99, -119, 102, 145, 2, -279, 125, 37, -133, 121, -68, 35, -114, -85, 5, 96, 226, -185, -27, -37, 212, 243, -9, 22, 134, 13, 129, 258, -52, -92, 66, -121, -294, -93, -19, -5, 154, -176, 235, -222, -55, 339, 224, 116, 106, 153, 92, 25, -77, 439, 29, -3, -289, -77, 93, -210, 62, -171, -12, -134, -90, -296, -180, 93, 70, 54, 5, -19, -169, 228, -66, 118, 92, -146, 3, 157, 182, -90, -83, 13, -235, -192, -109, -221, -122, -34, -28, -230, 37, 351, -19, -110, 215, -96, 66, -260, 79, -238, -351, 203, -79, -5, -120, -102, 37, -80, -94, -165, -4, 29, -82, -29, 90, 132, 92, -9, 110, 23, 94, -137, -75, -110, 74, -68, -32, -73, 147, -37, -36, -11, 69, 36, 68, 146, -142, -17, -4, 48, 193, 218, -63, -110, 65, -190, -61, 134, 171, -51, -143, -34, 57, -42, -85, -164, -150, 20, -134, 58, -231, 184, -272, -84, 139, 39, 207, -72, 51, -146, 80, -113]
4661a13j3J00q2K7O6j8J51k6K0k19M3J53L27k88p7M56m43j80K8Q9k12K33K3j73
4685a28k00K18K38m67M14j2j34K49l42K90K57l03J6k34K8J49k40J13j01L35o9
4706G7K0m53K69k77M36r3K23j86J56j01J3j18O0k8q3J00K62l31J50k52N7j30J29
4729a00R7m0L53l40J5r8o2L29r0l2l0r5K13j01n0J8j8j69Q0j72Q8K55k10K2K73
4754A36k63L41j23J37m5o0n0oO2j34R5k29J45L81n66O9P0j04R2k31L02k07M36
4777B48m02K84k01J47J9L1n3k81N03k86k82M47k01K1j23p9K96j63j57JK17J24
4799A10j27n6K0r4P5O8J54m5j79J78pj5l47J90O1K14k70J04j80o3R8j2J9L31J51
4824C78l82Q9j04l6pK4j35K73m9P5j93L34l46N2j06k39K71K49j73J43k71K29j04
$$ y = [-113, -126, -26, -108, -81, -15, -33, 118, 92, 112, -107, -64, 89, 416, 128, 51, 507, 64, -116, -88, 1, -211, 22, 45, -128, -328, -110, 128, -339, 75, 63, -71, 178, -164, 126, 383, 80, 96, -138, -110, 39, -201, -88, -189, 146, 77, 97, -356, -87, -364, 72, -21, 202, 16, 172, 71, 84, -34, 26, -2, -85, 15, 277, -54, 96, -156, -99, -229, -100, -3, -43, 310, -30, -15, -113, -175, 154, 64, 32, 2, -93, 120, 19, -31, -13, -31, -200, -120, -292, -204, 51, -159, -137, 136, -127, 214, 91, 228, 183, 123, 73, 67, 129, -5, 90, -139, 6, 387, -179, -110, -40, -144, -52, -283, 19, -188, 248, -154, 130, -71, 76, 95, 126, 73, -208, 295, 9, -273, 174, -27, -6, -129, -208, 88, -75, -232, -231, -14, 110, -17, -73, -53, -147, -72, -4, 150, 105, -74, 104, 97, 82, -265, -75, -14, 200, -70, 34, -146, -209, -111, -123, -104, 227, 378, -4, 85, -19, -55, -62, -38, -173, 100, 51, 126, -67, 267, -79, -27, -133, -372, -101, 148, -25, 118, -153, 76, -28]
4847b8j76K73K47m85L32m78J54l0L95pj25j99Q5l6J54k86L84j26J35j79j19L08
4869A93j35k04L07k76Q9J16j7J9J91l80K3j58K40k80J48P4q2oj24J59J93j69p2
4892a51K03K24m8k22j25PO7rK21j82j17k30K91K0l7J14m9J85J9j89J54o6p0J12
4916A22M6k58J2j18J81l4J45O8j90N7Qk40J79N6k01K72j3Kj27j66n3k7M92k23
4940a0J22Q4j73K31l66qr3L00l13M6J70o4J0k1N8J98k63NJ24l06L98m8j73L44
4964B52p4k54M98o02J28R2j89J41j33J04j26M02r4j54k8j33L44l54J10K47k38
4985f1J58rr6M7m3j20P1O1P1kJ57k58k34L10n1Op3L01j22j91Q4p6J91j5p0K09
5011B45l69J69j4k90J62J42J0j05J94l95L30l33J32L0o3K18k09j17M53j59k3k1
$$ y = [-28, -204, 69, 316, -169, 163, -315, -161, -191, 204, 197, 72, -127, -42, -78, 76, -210, 174, 48, 183, 4, -115, 193, 58, -146, 161, -115, -26, 90, 73, 92, 283, -97, -74, -232, 8, -272, -124, -50, -132, -138, -262, -103, 90, -79, -151, 52, 276, 228, 6, -119, -112, -45, -54, 167, -15, -132, -362, -71, -51, -88, 26, -23, 162, 181, -8, 146, 80, 10, 122, 168, -90, -78, -196, -15, -49, 96, 164, -26, 31, 39, -201, -22, 34, -167, 105, 92, 94, -33, -199, -252, -279, 213, -10, 112, 196, 23, 254, -112, -120, -213, 87, -226, -180, -10, -74, -64, -85, -27, 171, -92, -87, 37, -269, 129, 81, -92, 252, 178, -76, 422, -180, -52, 40, -149, -8, -141, -37, -163, 239, 145, -9, -37, -170, 174, -180, -70, 177, -61, 97, 88, -8, 39, -4, -124, -53, 8, 79, 77, 234, -24, -258, 52, 1, 7, -66, 235, 113, -78, 6, -70, 121, 106, 36, 245, -124, 45, 31, -259, -97, 45, 55, -50, 144, -251, 79, -254, -122, -92, -155, 63, -146, -263, 190, 31, 8, -13]
5033a3p8K7L16l46J76r6j89J85P5k4o7Qpm5J3J42j54J18K0pK66m80J26j91K31
5058FO6k11N2N7j80J89R4j50m6K43m5J02K8j97mJ32k9J6o2O2l2n4m0j8j86K74
5084F7j78j28J86j73J95O2k27J81J75k9l04K11l17J86P8L6q7K10j64j03O5M9J71
5107A62k23Q2k79J66k29K64J32j09L13k4k27J97N3j53j49J46l34m2K40k77K68
5128b3J06j76N2L2J16M5k79K06k60r5J20J23K22j67J11k25J21r7n8kJ03J26M5
5151A46j47o6J59k63K15kK4j19n2l6K93k07J46r6NJ7l4R7M2j45j54K25r2J42n5
5176D3l9j58K15k3J89l42K23J95l23L7K47k1l70j48K19j42K81r6J38PM1l18L6
5199a09pO0Jj1K52k82M14l37J70k3o2J44k72J32j63M9M5k77M33j73l75L24j0J06
$$ y = [-13, -91, -64, 252, -94, 82, -14, -203, -18, 57, 33, -34, -26, -33, -78, -65, 77, -77, 41, 61, 54, 320, -160, -34, -225, 6, 72, -139, -87, -30, -210, -21, 73, -77, -123, 120, 75, 177, 205, 8, 4, 136, 107, 123, 61, 123, 91, 37, -3, -21, -207, 67, -111, -239, -53, -226, -31, 31, -196, -15, 160, 131, -173, 38, -279, -93, -15, 21, -66, 144, -20, -123, -58, -9, 162, -61, 21, -258, -92, -321, -57, 75, -34, 279, 255, 28, 225, 278, 125, -24, 122, -212, -254, -14, -291, -23, 83, -93, -41, -9, 107, 152, -127, 79, -181, -276, -156, -33, 189, 22, 133, -92, 29, -68, -126, -128, -25, 101, 146, -1, -67, 92, -171, 44, 42, 66, -53, -105, -141, 152, -55, 91, -5, 0, 17, -17, 80, 122, -23, -177, 48, -44, 98, 43, 4, -154, 61, 38, 227, -115, 108, 303, -20, 17, 264, 243, -127, -275, -56, -198, 83, -13, 125, 132, 173, -145, -109, -116, -56, -55, -66, 186, -96, 318, -19, 151, 128, 66, 210, -62, 70, -93, -44, 1, -276, 157, -16, -391, -67, -77, 29]
5223B9k19l1j21M46j22J95j60k67N08k62r8P9J32k60R3pj55L70j77J10o6p7K9
5246c1R2j9k9o1J13j10L69j51j53J00P7l10L27k20J6j25J07J00k18K74l79j21
5268c52M26l8J76k57M69o02J56P3r8K27j22lM6l08q1K34o1l5K53j59K2J40p6L8
5292F8k91K50j27K58l11K57Ql7j47j65L49o3j08J64j89N2J11l61L80k33J43o2
5314e4j00L18q8j03J11J07J00m50O3J66Jq1k08J51P1K6j68P0Q1k4nQ6o9p4j54
5339b27L01P8n5M7k6j08N6j7N3p4Q6L1k73J74L0o3L00m41K38k12K5J09K49k97
5363a6j9k3K82j18j57O5J18m32K73J1o3J14p2J37k57J2R0j05m1K75o8P1j09j09
5387a41L41j18k47J60j5J83j88O2j87pK11j59M8J36k11K64n9lQ0J44m31J05J17
$$ y = [29, -190, -221, -342, 104, -18, 177, 17, -250, 258, -4, -102, -23, 109, -151, -58, -65, -220, 150, -27, 83, 17, -60, -31, 61, 42, 13, -48, 65, -45, 324, 173, 20, 120, 197, -113, 214, -6, 10, -115, -8, 92, -126, 148, -231, -352, 74, 36, 212, -45, 424, -178, -22, 51, -47, 180, 58, 55, 101, -207, -288, -54, -115, -150, 103, -56, -34, 106, 30, 68, -223, 27, -100, 158, -153, 104, 112, 75, -72, -237, 112, 49, -59, 105, -84, -32, 79, -282, 98, -135, 8, -54, -154, 164, 76, -27, 84, 191, 291, -159, -96, 70, 71, -10, -218, -67, 4, 30, -138, -68, 13, -11, -16, 70, 1, -73, -227, 74, 152, 97, 144, 118, 10, 66, 49, 102, 28, 114, 145, -128, 46, 76, 13, 313, -128, 110, -102, -77, 32, 281, -16, -35, -58, 224, 106, -51, 14, 132, -300, -27, -16, -79, 35, -37, 100, -157, -145, -55, -160, -201, 74, 6, 77, -32, -141, 200, 82, -165, -5, -20, 163, -25, 37, -150, -157, 54, -105, -57, 79, -132, 132, 73, 70, 150, 294, -137, -32, 85]
5410H5J31j32j91J90j83K81Q8k18q3J00k5M8k6j44K11j96J54k42L84m76N33l32
5432d3n5K73k06j27j57L72j68j79J91P5k06L03j47Lk0oL9J38j99N7J36k00M8K97
5456B19n49M36j60J39j95K82j59n5O6m4J04k13K9J37Rj38J32M23m36O8j93O8J44
5479A14k39K20q0j86K44j41O4j05J7j28M43n30L35mJ22l29N22j94K61m53m4J95
5501A04m0j40J05J43l05K12R2j33j21nk28L45K5j89j6J16k8J19L3Rr7J03k82J61
5525a7j3j7MR3j36J23Ml15M37k98k38M34j18j76M42l63J54K5P7k91M0K04k49P5
5549a19J85k16J27l4J3K87j57m1Nq8J49l15K66K9k83L29j63J50J02pr6j83j77
5572b37N1M13m30J04L15l68K52J2K2pp9r6J43P1K9O6j31n0k81J3j27K75P8j78
$$ y = [85, 216, 84, -107, 83, -100, 181, 269, 51, -32, 68, 43, 91, 65, -79, 132, -64, 90, -152, 232, -244, 289, -43, -98, 175, -31, -158, -315, 57, -111, -290, -99, -24, -230, 73, -74, -71, -91, -97, -58, 80, -119, -62, 74, -126, -78, 219, -330, 106, -54, 85, -110, 172, 13, -42, 24, -20, 84, -129, -100, 37, 46, -92, 40, 463, 27, 95, -98, -30, 114, -125, 95, 15, -171, 73, -68, -4, -109, -92, -220, 223, -307, 28, 24, 146, -183, 339, 145, 406, -47, -91, 104, 64, -76, 29, 172, -133, 79, 171, 38, -83, -88, -316, 29, 54, -135, -151, -35, -63, 56, 89, 98, 1, 104, -178, -17, -30, -47, -43, 50, -86, 37, 41, -274, 163, -135, -373, 61, -57, -233, 209, -154, 0, 25, 102, -189, -149, 55, -194, -119, 66, -150, -23, -57, -44, 243, 86, 45, 50, -38, 111, -204, 62, 91, -192, 137, -26, 124, 226, 219, 123, -60, -237, -186, 227, -203, -99, 216, -152, 100, 112, 134, 127, 48, -48, 95, 166, 195, 261, 130, 80, -201, -188, -315, -40, 38, -140]
5596a40O5J25j36K01j30J68k83K23j46J51m0O3q6J09n8K65k43N6k26j5j19J66
5618c0O8J56n80L43J90qk76K00j30L51m7k60J00j08J11qj06PP2k30J88q2J21j86
5642a44J26oL7J9q9p4J08K9R5j41Ko6K38j31R1n2P8j57J05K4o7R0k85J89k03Q9
5668i5K67k63M4J45j17J43l62L51j94J67o9N4J50k56k6nJ89k2l25Q5L10l91K13
5691gj19J16l3m18O74p6l84L49j49N2k07K46q5J55j94K5%J4j7J02j00L36n63L18
5715C5j67Q4P3J10j15k89M17k10N8J29k20J08m6M5l4j00K36j61m1J56k35M5J66
5738D4j72jJ94K3p6j56K11n6K5R5k54o6J79J05k14P1J77k83m9M45k94m3K13j38
5762b0J04j89J19K32j95k38K21N9l7k20K53m9Qk82J31O7j56L92j21k11J11l9M51
$$ y = [-140, -75, 50, -86, 115, -15, 153, -130, 93, -53, 98, 58, 121, 35, 144, 86, 351, 108, 164, -62, -77, -196, -30, 38, 194, -386, -43, 147, 139, -137, 63, -67, 284, 237, -23, 77, -31, 80, 72, -34, -27, 45, -185, 3, -79, 42, -144, -18, -24, 13, 32, -57, -131, -23, 6, 101, -40, -38, -104, 134, 3, 94, 42, 120, -37, 68, 92, 25, 115, -170, 19, -184, -95, 172, -91, -47, 98, -19, 124, -238, 113, -81, 86, 17, 71, 221, -35, -61, -66, 123, 101, -224, -139, 171, -220, -7, -126, -10, -43, -461, 213, 137, -247, 102, -47, 5, -202, 44, -41, 114, -80, -55, -55, -41, -58, 44, -56, 280, -283, 35, -132, -48, 25, 135, 20, -269, 148, -62, -4, 125, -95, 13, -33, 12, -22, -122, 114, -47, -88, 68, -167, -122, 44, -128, -129, 65, 88, 12, -144, 67, 11, 36, 131, -123, -189, -10, 95, -119, -48, 129, -154, -203, 242, -52, -95, 118, -20, 84, -105, 14, 246, 51, -187, 34, 93, 56, -164, 89, 40, 48, -234, -103, -36, -192, 200, 79, -132, -21, -60, 391]
5785C91l06o5lJ78k23L40k18J00m27l2M52p9o8p6l5mM3O0O0K4j17K56k73J56Q1
5810B15k8n3r8j05Q1j04qJ16j05j15M81k06k24J23K44j96K4P0n1j60N6K5j42K20
5834F0P7r7l66N25m23L50nm18K17o2J83l5j7J25j10p1l4n5M0K64l40K96k63NP7
5859g7L4J01N3O4l40J30j23K41j51J5J4P9k81K5K41k0q8K34j19pj05R6l06K15
5883g5J71j19J66j03m8N8M1j95K80m02J59n1Q5J40J3j78kk6P3J92k41j15M6J48
5907A7M0j43Q9k20J84j55M93l32j72L49l42J70L50k29J1J25j57O3n9Q8k23K06
5929A53k03k6P1J52r6P6j08MP4J04l06J36J8k99K09k29L32j51O0N6J91k92J36
5952F2j21P9Q4l02J55Q1K34l26j7Orj4k05K16K46l5j6j40J52j48O9n0k9L8k18
$$ y = [391, 85, 20, 17, 195, -28, 312, 94, 194, -233, -265, 187, 108, 40, -36, -71, -75, -32, 28, 88, 112, -5, 251, -22, 134, 215, 187, 134, 36, -69, 12, -92, -100, 16, -89, -204, 277, 71, -153, -30, 214, 18, 42, 112, 61, -99, -43, -18, -160, 60, 137, 40, -326, 199, -224, 126, 121, -297, -80, -142, 41, 6, -11, 114, 4, -67, -101, -156, -116, 148, -192, 104, -159, -154, -77, -43, 58, 111, 175, -165, -35, -158, 83, -68, -53, -39, 40, -241, -216, 25, 5, -83, 151, 32, 25, -80, 16, -290, -75, 96, -23, 143, 40, -8, 50, 91, -104, 176, -226, -67, -118, -33, 107, 120, -58, -60, -86, -13, 179, -62, -177, -131, 17, 57, -86, 3, -217, -33, -188, 305, -27, -199, 150, -192, -22, 328, 99, 110, 235, 78, 141, 82, 170, -53, 153, -50, -76, -5, 147, 51, 127, 19, 23, 97, 201, -105, 31, 49, -250, -41, -270, 62, -89, -29, 27, 218, -74, 62, -59, 20, 104, -198, -43, 38, 272, -54, -71, -65, -74, -88, -293, -77, 169, 134, 118, -22, 130, -18, 51, 1, -28, 10, -208]
5977b08J86Q9k0m7K2L2j5K63k68K2k18L70k40P0k64j08M07k33K14p6Qk03N45l20
6001Hj03K76k36L75p4k78J54j04L25k48L1j21j17K90l50J64J24k35K62m72L07
6022b2J11J4j06k7J71q7kO3j43Pj47J3L22j24j7j56L54l04k60J88K91M8l83J21
6046g5J41k09J06j81J89r3K12l7k44L14p7Q4J45m02M5J77J3j03l7J38q3Pl7j48
6070a55R7j95L68j41J58J42o21N64k65Q3mJ05q9K02l77j31K94k04L76k43r4J1
6092a19n8L44J03l51N2n8L5j21J26L69j33k66Q0j5k25L40n0j04K06j11m2J04j28
6115b2Q0j14L0o%J08q8O8J06j2K5k04p4J82j98J08o6l7K94k07J3O3j90K06n0L76
6141C91l48L24n23M0M29l21J07j76M0K19j36l39K15L7k0K55k27J73l88K85PL8
$$ y = [-208, -22, 67, 47, 0, 22, 54, 39, 302, 34, 56, -162, 208, -32, 38, -226, -334, 73, -160, 54, -22, -14, -217, 328, 8, -95, 181, -55, 320, 246, -32, 122, 18, 343, 95, 126, 5, -112, 178, -172, -8, 116, -119, 143, -329, -22, 89, 103, -3, -30, 141, 54, 52, 115, -28, -21, -168, -155, 167, 43, 26, -130, 224, -80, -340, -152, 139, 187, -196, -75, 66, -143, -37, -218, -29, -122, 90, 53, -191, 123, 46, 130, 275, -127, -82, 95, 108, 5, -32, 106, 23, 30, -7, -155, -58, -253, 115, -26, 132, 274, -347, 217, -48, 35, 31, 136, 47, 249, -128, -259, 35, -169, 207, -36, -130, -119, -177, 167, 270, -81, -29, -87, -52, -173, -47, 322, 189, -77, 3, -12, -237, 103, 53, -51, 155, 44, 2, 106, -22, 58, -56, -26, -32, -32, 76, -12, 56, 162, 150, 175, -29, -103, 79, -119, -11, -77, -114, 180, -27, -14, 49, -141, 65, 15, 391, 43, 367, -156, -116, 313, -8, 99, -77, -37, 182, 46, -293, -78, -41, -61, 194, -33, 140, -248, 37, 44, 82]
6163H2L36l69p3J50l1j30k17N76j12k10o0j16J27J89k98J85O8j02R8O7p7j2j13
6186d2l1J56k76Q3L03J00n12K84j9J09j77L0n3J42j50m0K07k9l72K4J72J88q1
6209A6m5K1M4j00j41K40K30l65J87K09l97J44o0j10J70j76q3J32j23J28L08k45
6231a6j34LK59l9R9j45J41k28kM6M0j16K30k33J09K12n03K89j06ko3K58J53k04
6255D8j76K81j09k1l3RJ40O1k62J73m33M24J15k25P0j06L34q6J5k99K53q6j89
6278a02J79j09L0n3j99L60j17J88N9k93N4J4NJ62M3n2l67P1J25k5K9J06j75M2
6302b5J10J62k36N0J01j00j38QK6J2k8N9KJ4k9N0p9n7j54J49J3K60j37j27J06
6327A2J98l88K70k26O7j80K58J31j46j56O12l99l7K1J14l8l18Q5J0O7O1J38k88
$$ y = [82, 418, 49, -24, 126, 95, -35, -252, 324, 212, 2, -58, -174, -47, 142, -156, 29, 97, -5, 93, 160, 83, 71, -42, -73, 83, -193, -110, 193, 293, -219, 65, 46, 155, -22, 8, -45, 97, -53, -93, 114, 85, -287, -263, -91, 97, 16, -29, -8, 36, -64, -205, 35, 265, -100, 87, 296, -101, 43, -17, -127, 43, -133, -216, -84, -207, -79, 229, -16, -150, -147, 112, 73, 172, 27, 168, -60, -62, -16, 24, -92, 138, -95, 14, 226, -277, 12, -94, -96, -159, 99, 252, 48, -128, 153, 44, 23, -10, -1, 139, 200, -62, 111, -322, 102, 217, -8, 62, -44, 290, 204, 219, -80, 173, 87, -102, 77, -32, -2, -55, -254, 106, -11, 177, 236, -57, -3, 11, 16, 178, 221, 169, -198, -127, -2, -27, 2, 108, -67, -25, 85, 247, 11, 61, 162, 62, -76, -68, -42, -30, -58, 1, 3, 17, -12, 38, -41, -98, -252, -103, -90, 170, 33, -94, 12, 210, -178, 92, -134, -67, -247, 11, 142, -4, -160, 452, 53, 16, 37, 151, 113, -205, -120, -110, -43, 18, 156, -132]
6350a32J98k7j60J88j70j81K0L34k1k42O6J18l6j07K93q2R0k74k9L6J90J44k26
6373a0mq1k04K20J89n8k3N0J1j95N9R3M1j01O8K3P4L6k8L2r4r3k2O4k25L71m29
6400b36J65J2P2L0J76o7j16p1K3L13q5j81n6K06k34J18j2r6j53J93k67K70K40
6423B44j0k53j07Q3J9J80k81N8N6j05J24n3M9K2J64j89J46j38j15J50r4J24j55
6446h1K13j78J6K9o7j72O3j09K08K9K60r0j23j42K32k1k48N1R2q5M1l7R0k53K47
6471c5q4R1o3j6J37o9J87j85j29l8L26j74J00j11q5N8K71j79N3k55K61J98k87
6494b8j12J50j06r4M10l12K15j54L3Qq4J39n0N0j67K60n9r8r6J24j88K38l02J01
6518a22oJ37k5J66n3jj18N7J79k16J4q3rK73j68j82K95j70L7l0O5l61M05m28L33
$$ y = [-132, 66, 39, -121, 67, -103, -284, -264, 70, 49, -193, -127, -9, -45, -152, 141, 59, 149, -125, -154, -118, 72, 216, -10, -14, -95, -299, -79, 110, 52, 29, 79, 90, -105, -46, 47, 88, -13, 55, 78, 152, 188, 160, 192, 98, 5, -17, 47, -178, 193, -236, -71, -59, 13, 43, 219, 152, 36, -35, -12, 301, 216, 35, -21, 185, -49, 69, 57, -39, -192, 1, -266, 4, 244, 234, -19, -126, -43, -24, 156, -125, -67, -11, -116, 8, -45, 4, 26, 190, 1, 147, 9, -106, 44, -50, 74, -81, 132, -46, -30, -1, -68, -240, -177, -286, -78, -49, 211, 121, -2, -144, 88, 67, -181, -130, -38, -123, -82, -119, -29, -282, -35, -119, -28, -91, -107, 30, -39, 148, -37, -166, -204, 122, -52, 48, -63, -148, -90, 181, 2, 55, -200, 61, 259, -28, -140, 10, -96, -190, 220, -92, 123, -31, 2, 10, -74, 65, 15, 65, -102, 158, 99, 1, -95, 29, -159, 79, -223, -122, -128, 9, -16, 150, 97, 96, -22, 35, 214, -2, 12, -71, -80, 193, 25, -157, 138, -32, 5, -25, 40, -321, 84, -344, -11]
6543a1R3l33K49J59j54j31J55L4k8j6k72M86k58M7qJ1K17k1j39j55J17Q3q8k14
6567a77K49k61qm6J52R7p6n4JR7J85p0J13k25o0j64K44p9M2K56m25O21n55M8p2
6592a67J69J04n1k09K61j66k40L26J55j24r9Rm1K80k45p4L8pM3K57j20j60Q2l3
6616a2K10l05J06j95K15J6j41K00L1op4n9p2l5K88k15P0O7J2m8j99J73j17K43
6640A53r7j71K62l21Q2K57k83Q7jKKQ4L8n3k39K20n6J22j10J71j26lQ4j78K07
6665A33j00l13J12J53q2J71k32K36L08m66n0O9O9p3Q8r6K88j61j15L69o17K18
6687i1m0Q3J34J2j99K15k14j20N9L34k14q1r8n0L45K1rl66O04l19M1m1n3Q8K6
6712F7k70L00m3j53L6k4J26K36L1k97j14K67j47j50L96k12pk72K46j26K20k72
$$ y = [-11, 82, -251, -2, 157, 3, -128, 27, 61, 33, 17, -255, 231, -27, 20, 12, 23, 240, 219, 80, -75, 42, 125, 37, -177, 72, -189, -197, -243, -91, 6, -70, -124, -123, -26, 159, 89, 202, -23, -83, -247, -3, -82, -40, 216, -209, 412, -143, -95, -167, 2, 106, 55, -154, 107, -59, -299, 27, 182, 58, -41, -32, -73, 207, -38, -112, -74, -81, -38, 219, 99, -61, 21, -12, 198, -107, -1, -196, 19, 35, -106, 94, 125, 119, 45, -14, -86, -121, 167, -48, 22, 89, 101, 53, -146, 27, -90, 153, 56, -115, 147, -174, -92, 165, -118, -31, -32, -30, -28, 56, 94, 41, -198, 22, -34, 88, -22, 149, 23, 20, 104, -74, 133, 33, -280, -168, -15, -97, 74, -158, 78, 386, -80, -130, -61, 8, -65, 23, -73, 215, 54, -61, 308, -309, -91, -131, -48, 86, 98, -101, 114, -100, -220, -161, 173, -41, -122, -220, -270, 75, 96, 87, -279, 325, 6, 47, 6, -47, 41, 67, -203, 97, 54, -99, -63, -87, 39, 275, 306, 9, -105, 162, 15, -135, 261, 49, 42, -230, 16, -110, 110, -162]
6734a62K62M3k10mj3n4K3K23J12j87QJ68k9m25K67l9k8J28J54j26j23j21J65j08
6758g6r7n8K29J16O4k75r7L42k60L23r6j32j36J25K8j7mj29M7J49k34M26m50J70
6782d2P4N5k46L1K98k86j11N20j54k45L78l88L57k01q8J26o8J04j65J12k47K2
6804a64K14O8j42NJ63j79O1K47j85J74k56k85L24K6k7j15J72j07J78q8q2j15O4
6827d9o6j08J72q3Q0qj33L29n1p3K9q1j5J22K90k99m2L6q4Lj03k2K69j47P4O0
6853A00M3j50m8JK45m58L59l12L46j52j44J65J0J05j04j88J94Nr3J76j30O3l56
6876c23J85O7mL20p2j76J28j97j04J37R7q8k63J22J4K15j2j99J7J07m1j80J96
6899e4N9J3j57K57j94P2K7K0N8O8k06K33o9J0j21l61M98P6j37J64l53O1J16k12
$$ y = [-162, 100, 143, -67, -71, -84, -138, -115, 108, 220, 33, 41, 209, 180, -245, 22, -17, -45, 83, 237, 111, -12, -133, 32, -76, -173, -231, -2, 114, 178, -97, -194, 148, -112, 211, 115, -17, -153, -28, 0, -17, -21, -150, -103, 46, -188, 238, -212, -42, 32, 87, -159, -128, 170, -116, -227, 293, 139, -106, 272, -116, 241, 40, -48, 78, 10, 114, -51, 61, -186, -164, 50, 118, -24, -19, 144, -35, 26, 273, 88, 262, 6, -279, 45, 71, 44, -71, 101, -6, 172, 84, 2, -113, -49, -115, -223, -51, -134, -54, -62, -195, 134, 83, 10, 39, -42, -57, 65, 355, 56, 14, 50, -34, -31, -134, -156, 113, -34, 40, 100, 143, -7, -55, -54, 191, -267, 92, -220, 126, -26, -170, -5, 5, 110, 6, -182, 12, 17, -76, 100, -30, 33, -323, -138, -71, -75, 245, 173, -3, 125, -72, -176, -39, 58, -30, -293, -171, -157, 58, 46, -153, -136, -29, -70, -250, -54, 5, 18, -139, 118, -76, -4, 23, 43, 101, 169, -37, 196, 127, 137, 16, -345, 153, 229, 92, 256, -97, -36, 80, -132]
6923a32m5P5j16J80lK29p6k05P7J67l64J29mN7N7J33k26J51r5j4j5Q1R9l11K69
6948I8M7K11l78p3J33J5J58r3j11J38j72K70l93L33j93J06P8j91K08l39K81N7
6970A90j94J98p4j45M9j10O3M4J03q5O3j82N7M4k63J65N3J80%j62r7j24M01p0
6994A04J38m33J09J01J30k04j66J83j45l5M29j12Nn1k42K73j02J03j82K79k73
7015i1K8j44K63r2K3k70J97J36r8pJ44o4J6P0k70K27k56O4J04J64j38j55q1K13
7039a7k4J49J2j66J90r0rQ4r5Q0m2k61J97j4J62k00J48K0j72j9q0K62l4p3M9M7
7065A04j31J62j99lR5r0M6n3J7J64r7l85M76l8j73j1J85l27J49n1L5J02K20j04
7089I3j43l5p6L63l35J03M5P9k49K41k33J76L1O9l97J86J4OR2J66q8j89K50Lj02
$$ y = [-132, -177, -102, -218, -38, -41, 188, 112, -93, -16, 151, -213, -84, -88, -31, 26, 159, -67, 84, -11, -25, -40, 41, 140, -171, 98, 145, 356, -22, -95, 38, 53, 211, 118, 7, 145, -27, 243, -150, 183, -10, 96, 174, -17, 191, -148, 133, 190, -4, 194, 120, -25, 24, -86, -23, 21, 124, 39, 102, -80, -23, 21, -242, -77, -24, 156, 156, -6, -103, -227, 174, 104, 242, -191, -82, 19, 149, -55, -221, -38, -183, -218, 211, 99, 104, 53, -189, 84, -18, 85, -97, 182, -91, -63, -207, 56, -36, -13, -283, -86, 50, -48, -55, 89, 25, 41, 111, -159, 68, -188, -124, -20, 144, 6, -149, -230, -17, -41, 108, 120, -46, 144, 54, 45, 129, 34, 114, 72, -189, 8, -6, 156, -44, 104, 124, -48, -67, -147, 115, 81, 8, 57, 104, -27, 135, -64, -67, 28, -62, -16, -69, -52, 112, 15, -370, 106, 68, -105, -116, 69, -258, -109, -160, -125, -23, 197, 93, -50, -85, -161, 202, -133, -30, 15, 94, -155, 86, -147, 29, 60, 129, -268, -82, -68, -62, 30, 196, 108, -81, 169, 172, 70]
7114G0j97J99n37N59J4J80k89K78k76K40m10J98J82m90M46l50J1M1M44k11n3P1
7136A20j37k82K86j86K17l6j51K61l9n6M6j73J23r7J0k49M29J81l14J15J05j23
7158E0N8l21K84J30l41J85J53k54j18J94j06R4k4N8J00j97J62j20kJ80k30PL5
7181b3j88K22J18k15O8J4q4j08M07k07o7j9k81L52k12J35M6J55m7l58K98n5k1
7204g0l2J43P2Q1k37j15K14q1J08j67K64Ol00K69l11J12K21r0lj43p0K25l22M10
7228A84k77P9k13K82N1k0l09P7J47J78k31n9r3K92P7m12L96q5n5j46K08o5n1o3
7252a08p2K67o1J78M1l04r8K30k4j9J86k45K95m2l43M0J10p7J44J08j93K7k45
7275b05L84j95l9o4K59k16K81l17J04m7J78j61J05j4k51L33r7r9K79j03j68J03
$$ y = [70, -127, 72, -465, 94, 108, 288, -1, 277, 1, 241, -169, 29, 211, -279, 167, -183, -172, -131, 313, 102, 49, 120, -17, -299, -13, -199, 18, -18, -169, 92, 53, -3, 43, -130, -7, -104, -94, -343, 86, 267, -47, 68, 173, 50, 108, -213, 71, 201, -140, 45, 198, -56, -174, 20, -86, 8, -16, 42, 142, -55, 107, -13, -15, 165, -65, -58, -23, -211, 11, 129, -86, -18, -4, -88, -196, 211, 4, -63, -82, -363, -11, -223, -88, -42, 113, 66, -292, 6, -49, -70, -102, 41, 113, 194, -43, -158, 56, -25, 83, -84, 180, 186, -114, 155, -156, -44, 177, 87, 84, -59, -129, 96, -226, 184, -93, -14, -227, 55, 106, 86, -223, -146, 1, 179, -52, -111, -204, 88, 165, -247, 149, 64, 9, -137, 71, 6, -45, -108, -180, 87, 26, 204, 245, -59, -157, 73, 49, 30, 216, -29, 266, 224, -119, -79, 31, -46, 98, 206, 13, 40, -205, 179, -16, -55, -119, 140, -76, 205, -112, -8, -55, 123, -38, 67, 53, -198, 135, 38, -61, 218, 115, -53, 50]
7297E0k41K37Q1p2r6J39o5L9r5Pk31M41j96J39p4k4ml3j16L79R1k91k35M3O1k24
7323b90K65k45J77J95j60%L32L1k35j82j57K27J39j00J85k64N5J82n48N05j06
7344FJ51k6k27K64l20M8K00j11M7j31L47j42k19L1j00J15Q3K5j46K32q0J44j46
7367D5j15j7J4K43m47J78J24J67o1k03J43j27j27Q5Q8J14M1k98J35Pk7J23L2q4
7391C3M7k07J66n3J1k2J86j91J09j04j03PJ36q4n2L52l60J10M3l22L78R5J32k85
7415B2J36L3k04R6j17lq8J08J25N9k85L92l15J14j60L46j22Nn2jk44J30Pj9K7
7440a0q2K50j76o4O0K6k15J36j16K62m2N2q4o9j33K21L4l4K1N0k04K36j62J38
7464I5J63l30ln2L2K16q1j23Kj7j28K67n0q2O4o3r5J35J49j49m9R0k2o5%M9m2
$$ y = [50, -191, 46, 127, 55, -41, 98, 33, 72, -23, -16, -247, 194, -2, 137, 63, 39, 35, 2, -114, 265, 356, 65, -170, -127, -66, -290, -25, -270, -93, 102, -58, -58, 274, 305, 70, -112, -269, -42, 97, -3, 182, -82, -27, 155, -393, 112, 6, 157, 131, -96, 168, -152, -104, 96, -15, 32, -99, 248, 106, -113, -82, -182, -67, 16, 41, -105, 127, 47, 191, 45, -70, -87, -73, 170, -277, -99, 25, 192, 131, -72, 71, -56, -183, -98, -10, 104, 145, -153, -18, -11, -38, 85, 117, 33, 80, -127, 39, -14, -3, -25, 161, -30, 79, -25, -128, -121, 15, -69, -121, 231, -129, -19, 24, -298, 80, 175, 307, 22, 158, 191, -13, 83, -34, -37, -125, -17, 108, 167, -118, 274, -41, 73, -87, 259, 137, 142, 90, 89, -155, -25, -18, -37, -10, -92, 158, -18, -82, -22, 4, -211, -75, -191, 71, 29, 81, -3, -72, -205, 16, 50, 16, 37, 87, -117, 119, -43, 95, 258, -72, -75, -127, -95, 121, 40, -83, -81, -98, -226, 41, -9, -91, -27, -90, -185, -50, 99, -50, -99, -9, -31, -96, -96, -47, -89]
7491h9j40K86j29J32o2n7Q7P3r8k49L60j43K36k74n0L45k93O3K15k80j34N6K77
7514A32k63Q6J66j34J93j94j38K13l4J81j55K42j74l01L71l17J81j22p6K74k37
7535a06J24K4J5k32K41k77J65j21Q2k8k4k4j7L3J10O7Rj80J78j69J1K30q4j7j75
7560a65K96j24p2N7J40K04m06kJ66J58j89L8J48m77K01K36l26l6KJ38j16K03j66
7583i2L5K22j50j1R3KK58k33j87J04k4k30J01K16j33K11j94K34j98J54l06j45
7605b73K38J68J44m00J60R5l53L24l66L01M0k34O4J76O5q1j83L1J95j81L5j56
7627a91K08J67r0p0j22Kk0L27k66K75j30q0Q5j23j51K54j0j46R3j4j24P4M9J04
7651A01k39K97O9k05J42k34K81k63o0K09M4j91m0M33k88j15K0N6K8j10j3m4K24
$$ y = [-89, -229, 57, -72, 60, -2, -59, 28, 101, 3, -246, 114, -29, 207, -67, -117, 228, -65, -2, 213, -67, -201, -145, 132, -131, -45, 121, -13, 180, -14, -152, 61, 27, 208, 53, 295, 121, -180, 191, -126, 55, -67, -143, 131, -106, 18, 42, 57, -175, 66, -211, -46, -167, -85, -113, -137, -161, -178, -145, -35, 32, 41, -139, 39, -130, -119, 111, 27, 10, -165, 131, 7, -65, -8, 132, 336, -70, -72, 94, 252, 63, 101, 249, -228, -27, 209, -117, -153, -151, -13, -129, 74, -92, -57, 165, 15, 4, 97, 99, 357, 124, -63, 41, 17, -213, -112, 104, -29, 182, -12, 222, 24, 178, -128, -273, -35, 133, 277, -123, 37, 132, -221, 103, -263, 38, 78, -156, -92, 84, 149, 68, -115, -84, 111, -70, -35, -191, 17, 184, 94, 24, -98, -96, -116, 211, -55, 220, 90, 10, 95, -28, -179, 75, 65, -81, 12, -2, -126, -52, -3, 101, -138, 159, 228, 23, 165, -69, 212, -51, -111, 98, 142, -49, -89, 344, 56, -59, -39, 17, 45, -65, -78, -122, 102]
7674A02p9K70k36l2j59J88r2R7j60K12q7J6Q5k22R8l77L32j1K98j36l1j47J76
7697A05L6j88j00J07k02N03j52j57m1m1J60J20K2K1k99m0J52J2J7r7K12k24K26
7720A52k00K00J6k4l65K28j96J39l2L10j61j68O7J56O7k00j02N9J00m7j99L40
7742A40k31L3J56p0n3j32J28KK59k81Q7P2l77N30k30J09J0k32R9o2Q0j42k64M38
7766F9m02K56J69n4J22o2Nj97L89l61R7l9L1j76O5J74j41J64n3k19K52j23NJ22
7790I3K6k94J3L79j93j15o6J20L8Jj31P8N1J01k32r2J21n3K80k48J16K8j66J88
7814D3Q6j92J4Pr5J54lj15J76j25Q9n2J46l56J38J8M0j60J57k83L02P0j27K50
7838A82m9k42P6K23l7j92Q0N4j21J92K31n25n6L56l07J22J41k89K23L87o36J13
$$ y = [102, 23, 293, 57, 25, -134, 54, -38, 59, -101, 111, 24, 40, 125, -97, 1, -376, -44, -55, 243, 107, 76, -71, 105, 141, -47, -147, -40, -242, 261, 109, -48, -89, -130, 30, 150, 172, 193, -106, -146, 6, 18, 35, -62, 150, -74, 152, -48, 152, 168, 144, -221, 7, -189, -50, -82, 228, 67, -101, -34, 122, 189, -11, -113, -54, 46, -1, -200, 140, -91, -58, 98, 28, -25, -157, -29, -27, 232, -49, 38, 110, -267, 263, 33, 142, 152, -80, 19, -43, 37, -105, -369, 69, -333, -77, 92, 38, 160, 98, 103, -94, 295, -66, 31, -8, 23, -153, -88, 86, -55, 109, 56, -163, 89, -34, -29, 93, 119, -175, -162, 217, 24, -91, -157, -37, 1, 2, -129, -51, 0, 101, -131, -223, -102, -155, 125, -123, -7, 21, -145, 43, 129, -63, -49, -42, -137, 17, 14, -101, 75, -50, 39, -13, 133, -223, -85, -67, -27, -187, -30, -313, -11, 59, -68, 182, 133, -109, -33, 190, 153, -39, 41, 95, -26, 166, 397, -128, -184, 172, -135, -13, 128, -161, 62, 449, -187, -74]
7860g4K74k22OJ28l1l38k0K92J89j78j6j46O6K63j03m64K35N8N3n7P0J08o3J0
7884D0n8K05k00k78L61j56L7K67j70M4q3J21j95J43j30J37j31q6jL11K50j85k98
7907e5j84qJ76J35l34J08J20l7n5P6N6J14p0j10J54m1j18j61J41L50l48J43p1
7930a9rK7j5k80L20n4n3p1J94K3r5L55j5k80J5J35j56J71k18m5K60j83q9J17K7
7955F2L4j50M6j63M6L64l98m1M2L37k35l8J77k51l3O3P3l4J77j19q9J4M8n0K04
7980H6j36Or8O2J50M5l4j06N8j05j88L95k81P3k3K84j05J1o1q8o3K06K8j1J46
8005B51M7j58J27j88j68R6LM0o1J11l14J64L22j66m6J53k66RP7j72K06N7k5r6
8029Cl61L61J63Qm29K45J62k49nJ07k97K58j6J00j45J61j38J64k2N9N3k71M1J7
$$ y = [-74, 200, -22, -16, 112, 81, -257, -277, 15, 204, 26, 10, -136, -70, 193, 90, -374, -139, -81, -28, -85, -15, 93, 30, 40, -18, 187, -13, -291, 70, -86, -49, 218, 48, 92, 9, 130, -65, 78, -52, 85, -46, -132, -133, 178, 428, 243, -55, -239, -247, -71, 64, -270, -162, -42, -79, -134, -58, -2, 112, 42, -68, 86, 45, -73, -234, -93, 257, -91, 52, -19, -28, -1, -16, -296, 24, -30, -83, -154, 40, 63, -32, 323, 308, 28, 43, 178, 22, 193, -25, -70, 190, 7, -82, 35, 62, 96, -54, -8, -171, -125, 239, -159, -200, -158, 179, -56, -94, 83, -168, -201, -138, -65, -99, 78, -41, -130, -116, -68, -118, 86, -50, -44, -142, -80, 70, 115, 81, -25, 33, -72, -260, 135, -146, -73, -96, 188, 83, 94, 33, -55, -118, 88, 116, 105, 251, 298, 140, 267, 79, -89, 7, 10, 50, -11, 100, -214, -50, 272, 106, 60, 213, -53, -44, 33, -139, 67, 124, 99, 3, -358, 3, 166, 174, -255, -10, 152, -97, -102, 5, -292, -34, -50, 50, -95, 66, -72, 92, 70, 129, 182, -89, -48, -31]
8053c1j7R8K28k50k53J47L6M7j68K73q9j31Q5j1j08J00R9k39J43j51L20J55n61
8076b78J59j22K26J52J77k67M0k68P0J3P4J02j24K77j30j83j30Q6K41k27L0K29
8098A47j51o7J67j19k7K29l27K83k79j25J58O7j28J67j18R0K54k66n8L91l24m2
8120g8J82J6J35m0k01J39m8P7k07J66k58J81j23j2K99j23l14M6L57j99K43m29
8142a91L19j12j45M60k76O7j43J31j2p3p1j65J18J7lP7J04M9l65J5K89o2P5o2
8166D1j30L7r4r2K49p2Q5k9O5j5j50j23n9K62J19l67K08Q0K6k44J22J28k05P5
8190h3l8
$$ y = [-31, -48, 50, 278, 28, -225, -78, -42, 5, -163, 110, 21, -110, -25, -36, -144, -44, 55, -184, -41, -192, 128, 283, -278, -119, -241, -15, 137, 314, 47, 87, -181, -111, -98, -24, 78, -46, 231, 101, -82, -212, -126, 115, -112, -82, 147, -4, -71, 96, -23, -50, 179, -148, 135, -144, -269, -111, -44, -172, -5, -123, -33, 221, -45, -103, 288, -36, -78, 104, 120, 255, 215, 14, 153, 105, 182, -25, 141, -117, 64, -59, -71, 228, 105, -209, -163, 194, -5, 238, -191, 128, 16, -129, 331, 55, 122, -21, 110, 98, 25, -46, -211, -93, -76, -79, -2, 102, 151, -214, -199, 90, 28, 103, 41, -89, -52, -146, -238, 11, -61, 24, -5, 60, 45, -105, -228, -287, -25, 94, -273, -65, 15, 41, -203, -81, 47, -158, -83, -121]
8191a21
$$ Imaginary data points
##PAGE= N=2
##DATA TABLE= (X++(I..I)), XYDATA
0@%%%%%%%%%%Qj6J6j6K4l2M0m8N6p2Q8j04J20j37J61j92K24k57K97l44L93m48
32b39N11n79O54p37Q28r29J039j159J294j439J596j771J961k167K392k639K910
49A526l207L532l890M286m726N219n773O399p115P942q910J0061j1456J3190j5412
64h334J8378k2560K8941l9981O4366k16171R6330K49118l54606O8611K37405j93446
76g1949k02939L02562R8059k09703L5787J79222j23324p9095J38620K3652j26056
87c5164M4882R3390o2098q8585N2107M7583n2551k2166Q4335j0314j24349J9468
99e3462J30912n1459q6492J01632K1465j49535N1863J50863j14070r8695J58942
110F1964M871j73459Q4627J39555j48153o1033J83261q098j59332O2637Q9664
$$ y = [0, 0, 0, 0, 0, 0, 0, 0, 0, 0, 0, 8, -8, 8, -8, 16, -16, 24, -24, 32, -40, 48, -56, 64, -73, 88, -104, 120, -137, 160, -184, 209, -239, 272, -307, 347, -390, 438, -491, 548, -611, 683, -756, 840, -931, 1030, -1137, 1255, -1384, 1526, -1681, 1851, -2039, 2247, -2479, 2740, -3033, 3366, -3749, 4193, -4717, 5344, -6112, 7078, -8334, 10044, -12516, 16425, -23556, 40810, -175361, -79031, 170087, -184519, -115908, 121497, -71949, -274888, 27674, 125733, -83970, -48183, 131039, 7715, -71380, 67240, 90892, -35164, 9718, 103108, 41010, -47575, 4532, 52115, -436, -22602, 61733, 51419, -72930, -53462, 77450, 25991, -60501, 41131, 62596, -86939, -35076, 115787, 1717, -96978, 61964, 66835, -106624, -21997, 117558, -30595, -91628, 91633, 83535, -75797, -13160, 76504]
121G6504r9175j8615J11682j4945p5496K4013J3632m0912L709K0149j3644j086
133a4184J0318m419p860j4346l546K4334o16j2642L9571J3676n3864J0781N5505
146D2708m0973l1440P1748p1p8422L0673M5250o8827n337Q0202l9853p1296N7653
159g985K3507o6777L1118O8376n5018m2233O0051J3019l8030K5177K5275l7615
171a135j4192K5203L152o251L224m858p700j0318j1009J1860J0205j2486J2848
184a457K0024l3755j9515M1183J639l1355L8242K7519n7591o750N9919j8302l9325
197a9524M4418Q542o1306J4717N1571l2768k2173M4368p991m6142K3982K8055
209B5749l3137n147L4273j0743k7072J5305J0935j9783n953J2025l149j2148J902
$$ y = [76504, -22671, -41286, 70396, 55451, -20045, 3968, 17600, -23312, -19603, 546, -13098, -14184, -3866, -8285, -16145, -30491, -34037, -9703, -10319, -22961, 16610, 30286, -23578, -12797, 42708, 1735, -29705, 42043, 41972, -36450, -5777, 39473, -29354, -34691, 45511, 5658, -65638, -7985, 15522, -51255, -20137, 48239, -6779, -49012, 11039, 24058, -13972, 11205, 36480, -1135, -15327, 9876, 13028, 6777, 10001, 5143, -2557, -12875, -23884, -12024, -1819, -14305, -1457, 18567, -15188, -34703, 6480, 8119, -23236, 15006, 42525, -15066, -21816, 38103, 19801, -19524, 24894, 33436, -27870, -13153, 38418, 5650, -16523, 27845, 19854, -26288, -2306, 25749, -7388, -12535, 21738, 10995, -16077, -772, 10163, -9620, -15573, -3548, -6697, -18845, -16943]
222a6943J2020K24j0643L092R838j2078o078K4530Q158j7213J1205J7425k3376
235A61q350L1114k688k5538J6846J0679l3170o4L2365j3191k2638J8327j373k8457
249b5977J3694K6844j4756r690J8857o258j7103J6296J4729j3016l798R215o720
262B317q715Q847P675n886o703k445l293o784K91J3355P323q793j860N304j1117
277a0484p322J7607R058j1710N958J2995j5819j0692J7595K98j8019R311J2067
290A0843j6034j231K0478o503j8467P542O288r468Q936J6929r578j3836N677K654
304D230l571Q305M012j1358p152J772K66R06K745k218j885Q7k567k763J183n71
320h579L112R917K804p995k843L068l17L842O481n932j0696L392Q642K112J88
$$ y = [-16943, -4923, -4699, -15342, -12250, -2412, -14490, -20568, 3962, 12120, -5093, 6112, 23537, 161, -8189, 22925, 20237, -5301, 11545, 22224, -10946, -11010, 21355, 8164, -14474, 3853, 2480, -25977, -12283, 14561, -195, -9885, 8972, 2714, -14389, 1907, 16636, 3620, -178, 9037, 2317, -6398, 2449, 10124, 4238, -2465, -4910, -8203, -14987, -14696, -1341, 5982, -2811, -4671, 633, -10484, -17806, -199, 8859, -2851, 3107, 16102, 283, -10409, 7186, 7484, -10535, -1224, 10843, -5191, -6422, 14056, 7553, -10914, -3372, 2916, -6552, 2384, 19313, 9735, -4101, 1576, 4230, 659, 8964, 12976, 1618, -5534, -3762, -3496, -2590, 155, -2063, -3948, -3861, -6428, -9191, -8008, -8579, -5467, 4450, 7254, -741, -3584, -516, -833, 3009, 9490, 3558, -7138, -3746, 4896, 7008, 7196]
335G196l339j2681o594P936R156L583P69l059n109K38K468r90q36K345L668M380
351I131J0o134o894j300K172L569K679k826m808k86K583J976R27j648k190L342
367C03M919K60j234j811m336J394Q868P75p020l113m510o765M088Q550k509l294
383e435L486l140p458L541M880j710M783R095k120m101L487k97l175L682J619
398G137m620m38J897k033Q15J676n733m933R41j564J170Q676L236l973j04j103
414A047n776L976R649m84k716J549l488m556M644J796o588j844J153l182m0L369
430a491k661k096K663P01r54K047j322n313L036N169j391J47K790l462l743K829
446c051r19l244K495M278J501K277M68l805p01L491K629K375J856j592k89J408
$$ y = [7196, 3857, -8824, -15418, -7482, 1674, 5257, 6026, 2967, -2142, -1904, 564, -426, -1262, 1083, 4751, 9131, 9141, 3007, -3887, -5187, -3015, 554, 3233, 407, -4401, -4687, -2104, -128, 799, -849, -3039, 303, 5222, 5482, 4248, 2437, -1899, -505, 8363, 9138, 2118, -995, -5505, -12270, -8182, 368, -2141, -5435, -1949, -5089, -12547, -9006, -4126, -5836, -1053, 8042, 5922, 1821, 5308, 5011, 1836, 5518, 7137, 2517, 2079, 3976, 1943, 2758, 4434, -1299, -6232, -5291, -6855, -5685, 2991, 6227, 2254, 2150, 1047, -4729, -753, 8896, 8412, 5696, 7245, 3757, -799, 3845, 5641, -947, -2791, -1638, -4820, -4860, -1491, -4152, -6248, -3585, -2884, -3838, -1791, -3113, -8426, -5390, -221, -1612, -1465, 1325, -2137, -5880, -3051, -3970, -7214, -4719, -441, 1060, 3337, 3805, 0, -701, 2790, 5419, 7794, 9650, 8058, 7769, 9177]
462I177l250j580Q22o243m916N338q28r083K387N705p354j947P795m079o268J0009
478d315Q177l976M363O496p546k110J0662O9n535L732Q17p289O74J961l933l10
494A937o7o668j579L942l093J070R648j995r819J860K607l331N186O779p069l683
510d275L797l112j604Q269l712j1140N537P554o274J345P852n272l900R177J551
525E793n870K979J175n156M220O030o341l465K673n709m712M888J002j718M318
540A07m8n113J805K202k952M065P729l077l906L909P99j128K511k632m998L31
556c96k357l564P273M031q514j502O215o472n690J0948O450l869K947K943o955
571A488j546N260j472k10M595n367p612J953j353n282L714L209m510J0j005p632
$$ y = [9177, 5927, 4347, 5169, -1074, -5990, -652, -1480, -10563, -8176, -2471, -9825, -11772, -3977, -8056, -14324, -4315, 3862, -114, 4249, 10745, 3199, 1089, 11751, 11820, 6285, 10017, 10834, 3545, 4219, 6180, 2247, 1937, 1870, -4798, -6377, -2435, -5528, -4458, 5190, 3195, -6624, -4764, -2157, -5488, -302, 6477, -592, -4275, -478, -3590, -5194, 3075, -637, -11777, -6240, 1314, -4960, -3615, 4237, -1035, -4935, 4242, 5793, -77, 2902, 4077, -1079, 3141, 9171, 2830, -635, 2038, -3671, -8383, -3495, -2493, -4211, 107, 59, -5054, -3249, -1047, -3999, 66, 7795, 4718, 812, 4721, 5520, 4392, 6903, 4271, -727, -396, -2753, -6317, 956, 4987, -3527, -5029, 1186, -5286, -10976, -28, 6422, 2553, 5500, 8443, 1488, -58, 5202, 3730, 3520, 8115, 2748, -4864, -2911, -4264, -9546, -5832, -2623, -7133, -7123, -8128, -15760]
587a5760K997J1279J306J833P376p366j0478R120R053l727L567M471j0120l562
601a1J0230l211q199N588Q16r794M918Q962q976m858Q509k41o432K383p18m872
617e906M545N464k805j474l250q676J069R049l39k818L695j775l849N548L595
632B073m498L075N862k626J072M392n872m918P272K550n350J75k418r272P18O703
648a062j507j116K386m521l273N692J848l565M107M465j652K819L525m946k877
663C23L278j215j911L859r40n044J633J094m027j317L59k198J499M514L99M78
679G84J794l179k247N058P34l104M403J842o763N13N192n288l415O196j620o117
695e217N205L249n898R11O461l250k162N200k029m908M358K129l457J796J810
$$ y = [-15760, -12763, -1484, -178, 1655, 9031, 1665, -8813, 307, 9360, 5633, 9200, 13671, 3551, -11, 10219, 7008, -1191, 4397, 5213, -4581, 337, 9299, 323, -4535, 3974, 3733, -2699, -316, -1034, -5906, -1361, 4103, 1298, -176, -3426, -12102, -11033, -1984, -2323, -5141, -1446, -3221, -7070, -1522, 2073, -2425, 650, 6512, 3886, 4958, 9350, 3478, -1440, 5832, 8382, 3032, 3207, 789, -8483, -7765, -1062, -2569, -3685, -1299, -5820, -9093, -3401, -1553, -5118, -1011, 3454, 1802, 4621, 8146, 3200, 323, 3601, 2386, 475, 4334, 3394, -1650, -17, 1077, -2950, -4267, -3908, -6106, -4607, -93, 306, 784, 2578, -601, -2848, 2210, 2944, -160, 4243, 6085, -678, -165, 5027, -261, -3676, 2520, 900, -5217, -12, 3237, -2661, -1750, 4711, 1461, -701, 4499, 2470, -2438, 1920, 4049, 592, 2388, 4198]
710D198n816j882K940k653j891L457j410k760M984J892l883J473K091m050J271
725b039O079j108k564M169l44m761R71L07m447O10L613j728p10K153k283l473
741e555K564J829p99K284K353j646J128K582j578n95K174j661k475K526k19l837
757i25J241J954l117j575J414j855j610K041J591l67J700Q36j511m00L10K53R84
774I64O41j303P87K29k417o9J344k939j736K735K20k133K460K699k893p80M437
791B246q21k137K810J247k600J432K816k532j311J175k129k026J063l01j153J852
807c69N01j053K56J29k120J095K178q32J197L373j493k605J823n63l523J457K121
824A572l125l85K902j789k446K120k86l715K074L241j539J310L041j975j698L383
$$ y = [4198, -1618, -3500, -560, -3213, -5104, -1647, -3057, -5817, -833, 1059, -2824, -1351, 740, -3310, -2039, 4040, 2932, 368, 4537, 4193, -568, 403, 710, -3737, -3127, 486, -1242, -1952, 201, -2082, -5555, -2991, -1162, -1961, 323, 2676, 1030, 2158, 4740, 3162, 2567, 4741, 3080, 605, 3131, 2912, -925, 316, 2270, -847, -2422, -1008, -2863, -4473, -2432, -841, -1208, 492, 1328, -183, -583, -273, -20, 964, 1605, 302, 1089, 1318, -1099, -1168, 176, -2763, -4499, -1764, -1544, -3677, -1217, 1482, -1411, -2191, 2246, 1425, -712, 2098, 3345, 745, 2177, 4993, 2461, 1150, 2325, 196, -1830, -767, -1068, -2221, -369, 132, -921, -665, -536, -2656, -1561, 617, -215, 982, 4355, 2862, 257, 2080, 1517, -2006, -549, 1572, -1553, -1938, 964, -825, -3271, -1151, -1437, -5152, -3078, 163, -1376, -66, 2975, 1000, -698, 2685]
840B685Q9k781J801J071k483P35K672l061l135J932J72j365J908J007l521m67
856b741L611P02k87J587o43k788M56J663n25j408L43J288k5j375k258j811j920
873f131Q59M168K377k014p19O65j253J73L872M67k164J721L312j542j675O10k524
890B02k697K276J742k249j516N29p98o92R59N1j332N37J579J978N01p18n6J327
908A623k34P07J254j862k506J285J418j554k31J291k133j587L178K07k952J193
924i03K151j722J678L830j710k592J728j035k610K273K352j886k36J905l810l639
940d226K286k7j388L396K536k488m32J903j887j922L094J323j255J280K04k870
956d73j488J118p1q38l75r83p59M18J138Q15O49r73k23K324J29l87J627J187j913
$$ y = [2685, 2774, -7, 1794, 2865, 382, 1117, 3789, 728, -2407, -475, -303, -1668, 240, 1247, -2274, -2741, 870, 1572, 1285, 2872, 2229, -559, -103, 1560, 1035, -373, -30, 1258, 1233, -142, -2400, -4211, -6131, -5272, -1104, 1273, -741, -1460, -795, -2048, -1875, 1997, 2464, 300, 2021, 5333, 3791, 2116, 2726, 202, -2495, -219, 1523, -726, -2242, -1713, -2511, -3203, -2244, -2193, -3525, -2988, -1409, 569, 1070, 352, 296, 1623, 1389, 2096, 3350, 1488, -1018, 267, 1685, 131, -100, 1191, -942, -2529, 649, 856, -2096, -903, 1248, -474, 1204, 5034, 3324, 732, 2460, 1425, -1185, 1088, 3440, 1554, 1318, 3223, -587, -4226, -1940, -1967, -3355, 41, 2577, 89, -343, 1560, -327, -2249, 845, 2168, 913, 2193, 2397, -473, -1961, -843, -914, -1752, -2127, -3110, -3869, -3451, -2313, -1498, -849, -1822, -2045, 279, 408, 21, 1648, 2835, 922]
975I22R86J893k148k542J174m88k603J64Q72j894n88K927N82j741j69M21l1J994
993b69L100J069n45k39J292Rj064q15K50o96k99J981j50l401j975P02j035j12
1011b197K748k02k503J068J970j193j02J790j801j674K475L13k462R14J677k161
1027a340m20R88j644j040K690J391p38J538Q88j956M66L165j094j351J055k40
1043B358j806R83O17k076r56p46j456p54L82j77P98J534l00o58O37l78n1L022
1061I73J660j407O50J252k402k97K493j310k877J333L88l168N84K658j073j556
1077b099J974M88k287P39K231P3R60J870k08k521p06N72k30m28M67J65j567j162
1095a669L10J05j403l81J495k8k08J641J005j023L08J672n79n93O69l14j409J349
$$ y = [922, 1908, 3801, 1653, -889, 285, -203, -2806, -2642, -1770, -3664, -4252, -1325, -743, -2484, -2653, -2232, -2263, -269, 2831, 3900, 3355, 3116, 4408, 4417, 3353, 2538, 2788, 2092, 1793, 3774, 3624, 223, -1752, -1050, -2085, -2197, 551, 349, -2154, -1086, 884, -309, -411, 1379, -422, -2096, 379, 692, -1770, -856, 821, -1340, -1760, -772, -2416, -3456, -766, 625, -113, 1425, 2313, 357, 823, 3988, 2894, 1543, 2598, 2358, 552, 1535, 2152, 76, -880, -1626, -3082, -3836, -3454, -3631, -2833, -1299, -1599, -2257, -1620, -1998, -2049, 973, 2633, 1226, 1876, 3128, 726, 429, 2922, 1612, -1265, 68, 456, -2712, -2128, 530, -543, -2099, -125, 363, -1924, -1185, 1046, 1119, 2079, 3949, 3741, 1220, 514, 1086, 856, 428, 895, 1060, -507, -1669, -1359, -1254, -2657, -3038, -1543, -1571, -1779, -138, 867, -156, 152, 1824, 1245, 652, 1321, 1007, -402, 947]
1113I47R49j742r10L50j466n84J876J48p07P66N82q76J356Q76r15L44J070o66
1131A398q34N68l12j582J755N50j773j690o42r93J073L211K36o05L32o45q86J911
1149A072J060m32O44Q72q42l54Q42k375k140J284p9j971J074N89k533l9J835p27
1167b220j710J817J085r71J907K219j848j304J636O11r85Q34L38j782o30R57k76
1184c22J7J87k78l49K43M9M69Q27K87O54J127j64j018k28j80p86L35R43r03p34
1204A76K14p40j705j26K53k41qJ016P85M21K18j053M66Nk00Q31J044m84m70K72
1224F74n82j073j1K03j121L89J333m14p7Q59l45j064J703J202m47J66O79r27L98
1243A545N35m04o46K41q94j706O45J67j149P44J429j211o11J037j030j107K375
$$ y = [947, 1896, 154, -756, -406, -1872, -2456, -580, -432, -1139, -373, 209, -667, 689, 1565, 650, 994, 2064, 1398, 564, 1132, 820, -762, 993, 1543, -230, -1920, -2562, -3555, -2482, 729, 965, 360, 692, 47, -839, 1072, 2132, 1700, 2344, 3216, 2374, 2020, 2862, 487, -1653, -369, -448, -2419, -1345, -756, -3289, -3328, -1493, -2220, -3930, -2113, -1028, -1999, -92, 2127, 279, -1025, 611, 1222, 237, 1071, 1409, -373, -1003, -46, -322, -305, -118, -396, -745, -502, -453, 16, 843, 1130, 1784, 2911, 2747, 1729, 1501, 1321, 535, 870, 1813, 910, 176, 390, -350, -2055, -2181, -1928, -2169, -2177, -1161, -376, 45, 263, -790, -324, -319, -519, 312, 1356, 872, 402, 674, 92, -981, -992, -789, -1910, -1521, -188, -602, -679, 180, -165, -1229, 474, 1676, 1229, 1395, 2074, 1147, 1545, 2080, 1676, 1030, 1271, 377, -1329, -684, -517, -1666, -922, 507, -704, -1315, -278, -1308, -2415, -40]
1260d0J386m69O84N44k128m95J687l53j728R70M81j563j70J422j085q87M97l03
1278a550k67J045N91K65Q16P46j097j07K99n62M0J415l17j084J82p13j296R66
1296f28N21j230l51J050j07O2J292L82m28n9L61j50K07L83k12K28j3o22j56o69
1316a39r30l05O52m4k11L23k30m55L24N65j92J7P85J97N1N57K00k85l41p91m82
1337g34K61k38o9O53k06p51O67o4r09M11J301M6k44J234M24j325O10J203j510
1356G60n27J125o29j320P95M49j372j12M82j366m43J196M25n9J354J67q30KK71
1375C68m45Q38O10o48p81R75r63r61P60k87r97K55R06r88J20J067N76l56Q53N14
1395A416j031L70Q88l93K19O26p84p84j8j46r46j47m90m27K81Q37j76m26K20m60
$$ y = [-40, 1346, 877, 1561, 2105, -23, -518, 1169, 816, -912, 58, 539, -1024, -1194, 228, -857, -1744, -1247, -1550, -1817, -772, -181, 84, 900, 1646, 549, 442, 741, 179, 219, 1634, 1317, 233, 415, -298, -1594, -628, -107, -1337, -1688, -638, -745, -683, 609, 991, 563, 504, 865, 715, 922, 1305, 1093, 1321, 1308, 686, 530, -139, -1069, -1374, -722, -766, -977, -654, -884, -1339, -1015, -450, -642, -625, 160, 357, 408, 965, 1165, 880, 539, -252, -734, -473, -711, -780, -127, -333, -1084, -417, -481, -1390, -979, 322, 368, 124, 1358, 1782, 457, 1067, 2270, 760, 233, 1358, 729, -591, 204, 653, -719, -831, -349, -1715, -2158, -962, -537, -596, 758, 925, 95, 97, 368, -77, 761, 1371, 723, -58, 917, -46, -1007, -247, -534, -1531, -1276, -370, -1358, -1238, -171, 405, 49, 902, 1416, 385, 755, 1643, 1250, 1469, 2095, 1311, 527, 509, 363, -583, -730, -1220, -1647, -1366, -529, -705, -1131, -911, -1371]
1415a371R7J111N93n12Q22O55j80k3J44j089o85K78M40k26j89kl73n18L60J18
1435e50r5j14O96Q87K67r2j13m54n35O34P26n17q23J23j86j298J032K76j256j36
1455a528K75R9l06J001L31k89R72O47l82j39j29o53N53P40k25j012K32p04j036
1474a553Q25l7j166N97J130m55J8J405k06q18N22Q90n17N39J201q90o79O60n44
1493I22j438L66J83o82L50N22q57j12O51m05K51R09K59l32R21n3l17K27Q19j164
1513A020k04K97j026p64P20k83r66K8P57p98n13P01j80l53O19J154l72J92R2j84
1533f3j18r1l31j84J18k83K28J26q91o3K05k71j19J290N02k64Q05N68m25k49O70
1554A160l33j73Q20mn23m7p83n92nJ85l15jK31m22J90R66L13l21L80J45m79P68
$$ y = [-1371, -1274, -163, 430, -82, 740, 1395, 1215, 1192, 1336, 247, -438, -160, 280, 54, -135, -137, -510, -1028, -668, -550, -645, -759, -63, 824, 1091, 999, 886, 432, -103, 531, 1257, 740, -83, 40, -146, -1444, -412, -136, -1392, -1528, -1253, -1154, -1460, -459, -128, -417, 555, 1202, 820, 681, 552, -101, 452, 1192, 967, -45, 187, -517, -1553, -728, -765, -1931, -1334, -204, -659, -641, 764, 558, -260, 262, 1152, 635, 1174, 2375, 1485, 806, 1466, 922, -516, -150, 33, -649, -299, 223, -634, -746, -95, -500, -249, 660, 919, 587, 1508, 1455, 1138, 1365, 2184, 1020, 816, 1113, 87, -677, 43, -240, -1206, -1178, -421, -1219, -1732, -1031, -1211, -1564, -945, 209, -163, 29, 121, -63, -181, -272, -603, -787, -669, -952, -724, -598, -1489, -1552, -1347, -1618, -1737, -447, 55, -209, 596, 1164, 739, 490, 1160, 827, 654, 1474, 1470, 947, 900, 117, -475, -480, -295, -610, -611, -380, -802, -612, 354, 667, 346, 726, 871, 392, 1160]
1576A160R49o04k64J005j352q35N53k42j095M16M79j118L23N66m53mQ16l70j9
1595h9R26J24o64J025K10q58n12R75j401o10J016q67j174J079M39j607j23R00
1613a211p31K80J492J85r19R53O78q80K92N82k19p08K93N3k04K76l64l76J95n2
1633c85m37N64L02j26Q22O54m14k47K43m19j95J044j12q34n2J57j201r7L84n82
1653i31k19N24M9j54M77K15j15O46J64l44J80O18m41k4J038q87l87M06n78r27
1673f90L23J9p68J18N91m59M57M94o85k11Q72J67l08J190l73l85K92K67j415j5
1693e19J106j321l63J642n88j281N34O55j362K88J616l46m14J195L99j110Q54
1710I85L07j383J42P82n04p99O91l26q00K68R3q77M96O5k38Q15P88q68M61P22
$$ y = [1160, 2109, 1505, 1241, 2246, 894, 59, 612, 370, -725, -309, 170, -948, -625, -59, -512, -516, 300, -70, -89, 837, 961, 297, 1322, 1532, 674, 162, 1137, -264, -874, 142, -725, -1899, -820, -381, -1988, -2111, -1211, -1942, -1662, -170, 15, -904, 49, 727, -153, 139, 721, 502, -206, 87, 140, -64, 212, -152, -528, -333, -385, -822, -258, 44, -82, 740, 1394, 980, 733, 976, 557, 362, 1406, 1294, 460, 408, 565, -636, -733, -349, -931, -1150, -626, -577, -731, -254, -39, -154, 492, 656, 312, 492, 1110, 669, 645, 1683, 796, 409, 815, 237, -690, -367, -348, -1116, -998, -407, -866, -409, 85, -600, -811, 61, 228, -80, 1110, 737, 352, 644, 911, -504, -519, 587, -734, -1097, 545, -43, -1324, -790, -135, -1497, -1209, 407, 61, -353, 842, 1241, 131, 985, 1292, -91, 51, 833, 329, -470, 221, -105, -905, -637, -544, -1421, -925, -860, -1098, -283, 505, -363, 98, 820]
1730H20m77K9J012m02p49M98K44p02p9L37o48p07P39k95o40O18N77l86M62L64
1750F15n28l01L67n0J99O67j34n84J31n31n05ML47n16j75L09j68l91O66L5m11
1771i54Q52P5l52P27K38k5M51n3k38l97J78n14J89M38m86m47M80j78j236J094
1791a58J029j325K72J081l98m98J188L7j019O97J87j357MQ94n71n51M66l27r57
1810a306N1L01n75N40Q89m65K17N17l52n4O96j60j63O22K13p63J45K56o25l90
1830d06N42n68o78O46M86o01M76J42n01L73L77M0j61P14N1o13L58k44m52M0j3
1851Hn86k33O49m84k02N10Q1n73N30l18n2M77O16p1J70M13k87o2j80j93n6j00
1873E7K2j65j24k49k07K77j91j83M94L39n70P34N20k80j58M59J26j044L92O30
$$ y = [820, 343, 372, 1384, 982, 233, 731, 975, 273, 194, 531, -117, -824, -85, -380, -1020, -402, 175, -211, 251, 615, 87, -214, 153, 103, 302, 969, 835, 251, 382, -149, -654, -650, -303, -819, -994, -685, -853, -1244, -578, -543, -954, -102, -27, -379, 348, 586, 561, 1012, 959, 721, 324, 502, -12, 177, 615, 129, -318, 162, -16, -1252, -158, 871, -454, -182, 899, 501, 3, 1191, 1228, 209, 906, 1093, -264, -260, 634, 63, -488, -22, -349, -1306, -1255, -954, -1529, -989, -100, -565, -348, 169, -183, -237, 459, 299, 136, 758, 971, 208, 353, 609, -16, -406, 136, -432, -1110, -464, 22, -579, -103, 39, -462, -89, 288, 328, 167, 881, 932, 319, 677, 433, -19, 21, 8, -578, -811, -162, -646, -848, -338, -257, -830, -300, -618, -670, -193, 423, 352, 522, 935, 648, 586, 406, 213, 157, 57, 79, -86, -210, -459, -666, -389, -580, -763, -269, 70, -500, 234, 754, 474, 316, 775, 901, -143, 249, 879]
1893H79j082J1K37k14r49P90P3q83M55M06k95M35K38M3k0K11k60j23P05q6l53
1914B18L78J13p52J42Q1q18j96K49k91l65P97L68n88M05L75m34K54Q29l96PR48
1935A324n10m72K62J78p55m2M40q33j5P26m52n94Q46J27m45K93M68o60L82O15
1955H83j56k86r0K88q70R4J02l42L21J08k59o04K35N8L5j35J20M78Q6j43L34L06
1977E63k73k33K62L97p53Q3L78n82m09J60j18n23L55K06j69K58M63k19q9O47j84
1998B20J2L87k6j43nJ79l91K80k99o23J55q5l25j80N54J6n66O47N06r89O61O38
2020F23l19KR85k38n31M29M7r38N67j24r51R8M22l31k35O35l27n75P86J35p22
2041e62P01Q24o91n37J044n34o01O44r0p94O04Nq90J06K56k14L7R2K93l50M29
$$ y = [879, -203, -192, 45, -169, -1118, -328, -255, -1138, -683, -277, -572, -137, 101, 144, 124, 335, 75, -48, 657, 571, 218, 596, 709, -43, 99, 180, -638, -834, -585, -876, -1241, -444, -76, -664, -259, 116, -318, -64, 765, 369, 376, 1324, 814, 342, 604, 782, 27, -15, 425, -408, -423, 303, -149, -743, 103, 230, -215, 78, 546, -114, 268, 883, 727, 441, 351, 639, -231, -137, -35, -377, -56, 52, -207, -811, -576, -518, -483, -618, -498, -20, 66, -77, 257, 563, 290, 57, 319, 716, -37, 46, 424, -158, -567, -407, -525, -1048, -693, -487, -656, -398, 65, -154, -243, 404, 220, 232, 619, 593, 450, 445, 624, 233, 513, 214, -409, -254, -339, -664, -844, -290, -274, -840, -193, 313, -676, -15, 623, 304, 306, 1291, 1053, 522, 951, 998, 60, 627, 503, -448, -350, 72, -259, -494, 141, -186, -761, 25, 160, -562, 139, 963, 272, -265, 779, 245, -356, 288, 198, -596, 8, 13, -877, -771, -515, -729, -692, -600, -307, -657, -228]
2062b28M10k55O33K42o58K08J64n78m0L63l34J90L0l99k60l7J52o79L12N42J79
2083d3O4M81k44q2L60O8k06L32J88l62l1n5n36j58j38J59m55J61n8l26P60j74
2105b95m26L96O22n04L22O22j37l33N31k10p94N35m3p11J30J00m54l78R53k75
2125c49k54P08m58n18N03L45j51L93N43n55Q2J89k48o72O23L77r58L10L21o83
2145d52j26M98k34l9L26J51k44M93J98n58P35q1l80k64K29q8k94J99Qp94M18j72
2167d71k95J45N49l73n7P16q3J9L75K84l75j04N10o81o0N86k01l54l2j69m17r4
2189e82K90l54K84K50l67K01M50n44k4O59m6J69n7Q0l88K53j80l42R5K6m64J65
2211d26L08k74j37N85l92j10O39k63o5O14O8Pj56N35j001j6P37k19r63O89r2m62
$$ y = [-228, 182, -73, 560, 802, 144, 352, 516, -62, -102, 261, -73, 117, 147, -252, -512, -549, -397, -1076, -764, -222, -43, 21, 502, 258, 176, 536, 604, 398, 730, 918, 556, 525, 470, -66, -224, -362, -203, -658, -497, -555, -881, -121, -295, -721, -325, 297, -207, 115, 737, 600, 267, 798, 588, -206, 329, 286, -425, -295, -195, -649, -1027, -74, -349, -603, 105, -353, -871, -368, -23, -174, 219, 762, 207, 289, 478, 230, -442, 181, 558, -400, -90, 231, -452, -578, -80, -314, -353, -27, 124, -120, 373, 571, 13, 748, 667, 287, 23, 252, 164, -130, 69, 77, -717, -299, -471, -766, -621, -72, -445, -502, 214, 131, 150, 525, 809, 434, 330, 840, 159, 99, 685, 484, 130, 98, -71, -488, -582, -292, -646, -362, -112, -479, -278, 172, -372, -396, 263, 217, 386, 329, 409, 21, 274, 94, -248, -153, -127, -591, -426, -118, -392, -529, 56, -336, -446, 193, -70, -135, 479, 547, 554, 398, 933, -68, -84, 653, 434, -529, 160, 68, -394]
2233c94NK86j71j95M45R9n53O55L29l31K96o3k06l3M58l43q1K89l73l43K81n21
2255d64j10j2L29n03L41L58kk68L94lk12N75M5p08O17M41o37k57P32o20l73J28
2277b09J42n06N99R4k24j33J78j68J95J76L56o3L7K95m36K89k36k55J3P9o02O2
2299c17J44n3k28K64k05l98O28J3l69L92P32m01QJ91j30m54N13k42q7j59L10o29
2321d77M30j47p33K17L49k36P1O77k26J7L84L33n37L40M77m95k07M70j10l55n5
2342A87m6m38L0O5k71Q5K37o3k7K94j86j09L47K3k44K88J22k20J91j6j71m08L78
2365D8l21p33P37K61q66P43K65l13n7L15L14n38O52J30k47Q8L7j81k22P3m72J98
2387h9N0j39k28K61k36J15k01P07o00L44K49j17N0M49R6n89M68m71k00J67J05
$$ y = [-394, -389, -103, -274, -469, -24, 75, -478, 177, 506, 175, 471, 408, 202, 169, 627, 284, 203, 492, 119, -224, 57, -464, -574, -586, -257, -760, -419, -61, -63, -331, 63, 60, -152, 423, 468, -240, 377, 818, 181, -76, 656, 36, -337, -209, -67, -573, 26, 120, -104, -237, -59, -227, -32, 144, 500, 437, 474, 769, 333, 622, 386, 131, 144, 223, -379, -317, -173, -226, -454, -190, -395, -793, -165, -152, -521, -129, 603, 202, 210, 401, 271, -183, 330, 88, 1, -158, 152, -477, -47, -194, -927, -710, -361, -597, -526, 151, -75, -58, 326, 659, 122, 462, 939, 444, 237, 707, 597, 242, 187, 141, -297, -267, -202, -473, -388, -151, -214, -241, 53, -133, -242, 105, 128, -116, 172, 294, 74, 265, 249, 78, -330, 48, -273, -1006, -269, -8, -874, -131, 134, -179, -236, 79, 393, -145, 507, 637, 390, 478, 515, 334, 112, 185, -287, -89, -39, -178, -406, -145, -381, -266, -467, 240, -360, -16, 233, 116, 166, 615, 711, 122, 590, 119, -81, 86, 191]
2408A91k96L18l05k40j46K03l92J58J09K17k66L28J84l46J11M05j08n8K89o5k47
2429D4K7K19n15Q7L8k45j8oJ67q0L04m35K46J03k22K66M17K4l52K32J48o35J93
2452GM05n08j72n4J37j26Q1M44m56k24Q57l65m2N13q8k70K69M21o46%K20m00m8
2475d5J64m74K5L79l24p4p2L40l53K60M01o8l07Q49k48j90K68k03p6j38J69k77
2497Fk38K04j73k97J03m3l39K86p6R9J06K39K11j01J87m10L48K72k98j16N76m77
2519F9o4q1J06l51j84L05l27nL03n2K4K86N3K28k6q3j0J55J61l12pL94o00l0J97
2544A49r6n06L66j16q2L08J05l22N3O88o87L1N38r7m73M69J22l33k63J56m3m78
2566e11M81j91k11k2j32K1k05P21m35M88L79k89J35J67p6k68K19K52m68K06J7
$$ y = [191, -105, 213, -92, -332, -478, -275, -667, -509, -400, -183, -449, -121, 63, -283, -172, 233, 125, 67, 356, 291, 44, 71, 290, -225, -138, -100, -345, -363, -369, -202, -282, 22, -413, -167, -64, -286, -20, 397, 421, 69, 301, 449, -186, 7, 412, -96, -268, -322, -185, -311, -230, 214, -242, -466, 391, 26, -16, 497, 409, 139, 408, 829, 183, 183, 403, 3, -45, 119, -355, -330, 49, -275, -349, -421, -81, -434, -174, 227, 159, -148, 701, 453, 263, 531, 328, 252, 114, 283, 6, -232, -28, -201, -498, -395, -438, -777, -491, -567, -468, -362, -123, 88, -13, 174, -236, 112, 384, 86, -30, 546, 69, 5, -76, 30, -321, -505, -200, -527, -532, -229, -281, -257, 29, 82, 310, 284, 201, 191, 346, 507, 195, 188, 582, -18, -48, 149, 53, -453, -87, -203, -285, 23, 128, -194, -141, 547, -140, -109, 429, 332, -141, 328, 450, 117, -146, 10, -33, -511, -30, -221, -432, -454, -586, -565, -770, -49, -484, 4, 383, 94, 229, 396, 320, 52, 271, 523, 55, 261, 278]
2587B78j92j68r4j8k72L83j07j94R8P3OJ89L5J25K16Pk87M3J9K03m48K00N8l22
2611a69N4J28m95J35J04Pp7J05J45j17j2L12k4k47N14l9oj15j44k56j99J79k5
2634b42J27j65j71L30J37l69J81J17M1j59L17j20M1K63J19l05M03k00l51r0K20
2655A24r5m82N17l13J1J46k36J10J15Q5p2L48N6j32J62L02n54L7J49R9l99j6m1
2678g9j75P3N2j40j26K61mk1r5N89k87J52L57n28J56J88l06j54L31j34k25K40
2700A25l12m6J07k14R1J4L45o8k45L21J16j58j9L36r7j14k0l3K0J7o6j82O2pl26
2725c53j6L52l75O6L66k08M98p2m8l72L96J83k70R7M3q8p0l9l77J03K16j52l65
2748d85L07j65J44J29M9PJ40L31l81P2k25K76J1l24K15k91L29j16k82J69K92l53
$$ y = [278, 86, -82, -176, -194, -466, -83, -190, -384, -286, -213, -207, -18, 17, 142, 358, 365, 78, 121, 140, 343, -105, 95, 153, -169, -115, 13, -482, -347, -243, -236, -313, -208, -63, -180, -192, 120, 96, -151, 363, 324, 318, 203, 59, -197, -396, -217, -242, -115, -280, -451, -121, 16, -353, -172, -55, -14, -173, 144, 24, 65, 328, 447, 142, 545, 345, -6, -96, 124, 29, -453, 64, -249, -238, -92, -328, -218, -103, -18, -90, 258, 314, 182, 344, 646, 92, 129, 278, 377, -22, -38, -79, -254, -181, -129, -269, -395, -134, -138, -159, -254, 335, 48, 200, 557, 29, 185, 373, 67, -87, 244, 110, -115, 125, -187, -233, -126, -340, -249, -235, 110, 42, -203, 118, 234, 76, 57, 393, 296, 182, 162, 129, 149, 166, 100, -82, -20, -27, -353, -369, -17, -392, -326, 40, -168, 330, 258, 210, -162, 234, 417, 147, 244, 287, 199, 129, 90, -287, -184, 32, -120, -485, -178, -343, -199, -70, -21, -14, 126, 457, 76, 148, -77, 199, 210, -114, 101, -190, 139, 23, -259, -90, 202, -151]
2770a51j66J38j31J03L57R5l64K00L02J7l74M68j02l07L76l77KK72l83k57k6J61
2792a47o2j71N06L7l09M04p8k39J97Q5k1j9j42j37j01M04k15r0K65l83r5r9M44
2815C4j76j71K17jN2P3o1J08R0L09j93r9K04l66R4K07k64j87K91k44k37M14l39
2838b45p0J25o1J22l7M99l27L03j53L1J68J34l63K92j32p2l65NK05k04o2K6l53
2861e34L41K7j23K30k48M69k64K97J75k36m6l2K65n04N5L04k01n8m2l20R2L84
2883C1m93K35K00k39O7L06J78o1J24P4k32k77M57l66R8j86j36j66K87R3J02l66
2905b70K09j39r1J33J84LK45n4q0J6K85k28k02k4J21r1J36p3q7q6j32k89K14K76
2929b4m94M37M9j48N4L36m7j49n1K3K22K1O2m08K16q7j27Nj08R6k73M9K90lj09
$$ y = [-151, -317, -179, -310, -207, 150, 245, -119, 81, 383, 400, 26, 494, 392, 85, 461, 84, 86, 358, -25, -282, -308, -147, -209, -380, 126, 163, -146, 258, 180, -59, 138, 223, 202, 183, 41, -96, -197, 207, -8, -98, 167, -216, -311, -410, 34, -142, -313, -96, -97, -45, 28, -33, 75, 165, 474, 281, 182, 386, 20, 114, 321, 57, -130, 161, -83, -320, 94, -245, -315, -190, -251, -129, -166, 333, 6, 309, 156, 187, 355, 489, 126, 418, 286, 214, -151, -146, 59, -145, -207, -181, -534, -193, -166, -289, -59, -307, 162, -102, 195, 370, 134, 88, 56, 321, -183, -128, 176, -25, -83, -125, -445, -353, 31, -462, -227, -27, -266, -199, 107, 285, 224, 348, 422, 190, -87, 370, 4, 102, -84, -220, -386, -99, -6, 96, -270, -61, -200, -291, -158, 26, 29, 274, 220, 140, 156, 441, 213, 11, -13, 108, 17, 153, 80, -7, -93, -225, -514, -300, -24, -518, -81, -32, -180, -126, 210, 163, 14, -37, -14, 208, 229, 291, -117, 99, 12, -115, -110, -218, -122, -395, -346, -56, -59, -168]
2954a68J12o5L14l0k21L60o9O1P2k70j9k92M44l62k19J78J79n8N1n8jqJ65nJ0
2979A01J26k51k2J67L40m0l73J62l25k07J34j78R1K52K0j5k69J1J10j57L30J60
3001A67j58J39q0J57J53l16m8R0R8k01p4m7m9J92k35K68l20O5L02k03NQ4L4N8
3025H1J64K29m71R1J48m30L6L51k36R2M7j72j85M0K80n26N07p7k7J78J88k34M5
3048A19J22j64K7J65j9l13J5j36K00l70J59j53j1K88J5r5j52K11J01o4j81K56
3070B0J32r0j61L22N1j56q4K37j12l93J70j14j71J02L26l61K53J39l3J34k83K90
3092B18j27J22j76J53M0k05L6j51J79j99q6j10J40j9K9J11m7P3j09K51Kk07J49
3115F7M8m22L72j19K4K77j39l12K04k19J47k96J47O0j83L27p4k6J26K3MOJ18R2
$$ y = [-168, -56, -121, 193, 163, -58, 302, 233, 294, 366, 96, 77, -215, 229, -133, -352, -174, 5, -53, -2, -60, -61, -69, 96, 91, 101, 227, -24, -46, 121, 461, 421, 48, 210, -115, -322, -188, -366, -275, -23, -3, -18, -287, -276, -166, -323, 7, 167, 9, 148, 68, 225, 378, 62, 14, 104, 202, 1, -73, -120, -169, 23, -212, 56, -264, -199, 103, -100, -95, -11, 23, 81, 245, 474, 3, 94, 242, -188, -152, 199, -37, 55, 102, -70, -255, -215, 65, -461, 46, -31, -58, 120, 308, 74, 119, 241, 77, 104, 269, 250, -63, -48, -184, 16, -354, -195, -348, -359, -71, -56, -151, -303, -92, 9, -55, -236, 20, 152, 62, -99, 223, 274, 118, 34, 271, 159, -234, -64, -178, -349, -247, 79, -282, -29, 110, 77, 211, -72, 218, 91, 213, 37, 190, 230, 25, 61, -90, 89, -110, -196, -306, -166, -185, -156, -45, -92, -19, -128, 123, 125, -82, 67, 115, -307, 65, -54, -30, 247, 108, -204, 0, -219, -72, -368, -221, -161, -344, -17, -91, -117, 9, 32, 36, 42, 160, 252]
3139B52j42k1O8m30K71p8k9P9m0P9j57j1J41j0Q9J4j75j8J84J72q7r8R0M2k09
3164b4K34K52m51q4J94k03J94j92O6k43J15p4L98K34l26l83K24K91j97K05N8K00
3186D88n74K66k05J90k03P4j17M3n5jr9J80j82K7K03J56j34m2k9j76L54P4k5j84
3210B9Q8k06j17j21M17k52k8Q6J31j70K95J2r4o0J92l38J9K45K32N3m10J34k00
3233f3L0K4l96L42j11mK60l69J52K32k09O1K81j86j25K87Q6j68K07k67J86Ok26
3256C0k6L3l22N08l07k61K00l8k55M01j1k39M98k09J59j31Q3J04l3k86J19K21
3278B38j66j69o4Q9J88k46k2L0J60l1o5K35J22k41j9Oq4L16k01q1m8J10J46j60
3302D3m4L5k84J83K20m71K38o3L7K50k04j06R3J57J02r9n4P4Q3k91L27P8o97J23
$$ y = [252, 110, 89, 157, -273, -2, -80, -109, -30, -70, 9, -148, -159, -18, -28, 61, 75, -100, -118, 66, 238, 151, 53, 143, 185, -24, 210, 462, 11, -73, 121, -82, 112, -80, -14, -257, -142, -216, 182, 416, 90, -293, -69, 222, 25, 230, 288, 488, -86, 180, -25, 165, -38, 36, -81, -38, -93, -94, -193, -13, -195, -168, 35, 191, 57, 15, -14, -190, 164, 238, 213, 29, 117, -89, -206, -327, 90, -162, -190, -104, 27, -143, 152, 164, 70, 10, 202, -136, -117, 128, 360, 413, 3, 137, -63, -33, -9, -405, -63, -174, -178, 82, -287, -135, 97, -112, -51, 230, 44, -81, 206, 292, 124, 331, 64, 250, 256, 30, 4, 37, -285, 223, -84, -345, -145, -183, -438, -37, -48, -287, 211, 2, 161, 30, 113, 217, 184, -102, 17, 238, 72, -97, -161, -72, 116, -130, -152, -122, 38, 7, -58, 177, 299, 58, 39, 45, -39, 277, 76, -5, -53, 57, 203, 43, -1, 34, -250, -67, 153, -318, -80, -143, -106, 144, -60, -166, -73, 84, 186, 87, 33, 107, 190, -101, 226, 304, -393, -270]
3326b70K89j87L78k76j10q1K61Jj08K63Nk06L42j33j83K26l22M9P4J28j49K0M0
3349E1J64m18P3J03k16M4J19O2m6n9L21j40J68m7K6n9L9l05J85N4k75M5k8p3k1
$$ y = [-270, 19, -168, 210, -66, -176, -257, 4, 5, -103, 160, 165, -41, 301, 168, -15, 211, -111, -62, 12, 140, -9, 11, 51, 215, -203, -130, -27, -243, -199, -80, -18, -64, -123, 198, 58, 226, 179, 205, 146, 185, -120, 65, 119, -156, -111, -139, -212, -233]
$$ [...]
8191A27
##END NTUPLES=NMR FID
##END=
