##TITLE=1H_LR-758-R4-KA1K4
 CDCl3
 8 sc, 
 5.10.2023
##JCAMPDX= 6.0         $$ Bruker NMR JCAMP-DX V2.0
##DATA TYPE= NMR FID
##DATA CLASS= NTUPLES
##ORIGIN= UXNMR, Bruker Analytische Messtechnik GmbH
##OWNER= root
$$ XWIN-NMR		Version 3.5
$$ Thu Oct  5 13:41:24 2023 Russian Standard Time (UT+4h)  she@DPX200
##.OBSERVE FREQUENCY= 200.13135
##.OBSERVE NUCLEUS= ^1H
##.DELAY= (6, 6)
##.ACQUISITION MODE= SIMULTANEOUS
##.ACQUISITION SCHEME= undefined
##.AVERAGES= 8
##.DIGITISER RES= 18
##SPECTROMETER/DATA SYSTEM= spect
##.PULSE SEQUENCE= zg30
##.SOLVENT NAME= CDCl3
##.SHIFT REFERENCE= (INTERNAL, CDCl3, 0, 15.7039)
##AUDIT TRAIL= $$ (NUMBER, WHEN, WHO, WHERE, WHAT)
$$ ##TITLE= Audit trail, XWIN-NMR		Version 3.5
$$ ##JCAMPDX= 5.01
$$ ##ORIGIN= Bruker BioSpin GmbH
$$ ##OWNER= she
$$ F:/spectra/data/she/nmr/H-F/1/audita.txt
$$ ##AUDIT TRAIL=  $$ (NUMBER, WHEN, WHO, WHERE, WHAT)
(   1,<2023-10-05 13:40:26.70 +0400>,<she>,<DPX200>,
      <created by zg, POWCHK disabled, PULCHK disabled
       configuration hash MD5:
       00 E9 B6 7A A2 85 ED C7 34 08 36 98 17 FE 4E 26
       data hash MD5: 16K
       10 6E 4F 6E FA 5B 85 B1 E2 42 7A E5 2F E2 8E 70>)
$$ ##END=
$$ 
$$ hash MD5
$$ 51 CE E4 DA 30 86 E8 E2 57 86 FE 85 76 BF 81 08
##$RELAX= 
##$RELAX= 
##$RELAX= 
##$RELAX= 
##$RELAX= 
##$RELAX= 
$$ Bruker specific parameters
$$ --------------------------
##$DU= <F:/spectra>
##$EXPNO= 1
##$NAME= <H-F>
##$PROCNO= 1
##$TYPE= <nmr>
##$USER= <she>
##$AMP= (0..31)
100 100 100 100 100 100 100 100 100 100 100 100 100 100 100 100 100 100 
100 100 100 100 100 100 100 100 100 100 100 100 100 100 
##$AQSEQ= 0
##$AQ_mod= 1
##$AUNM= <au_zg>
##$AUTOPOS= <>
##$BF1= 200.13
##$BF2= 200.13
##$BF3= 200.13
##$BF4= 200.13
##$BF5= 200.13
##$BF6= 200.13
##$BF7= 200.13
##$BF8= 200.13
##$BYTORDA= 1
##$CFDGTYP= 0
##$CFRGTYP= 5
##$CHEMSTR= <none>
##$CNST= (0..31)
1 1 145 1 1 1 1 1 1 1 1 1 1 1 1 1 1 1 1 1 1 1 1 1 1 1 1 1 1 1 1 1 
##$CPDPRG= <>
##$CPDPRG1= <>
##$CPDPRG2= <>
##$CPDPRG3= <>
##$CPDPRG4= <mlev>
##$CPDPRG5= <mlev>
##$CPDPRG6= <mlev>
##$CPDPRG7= <mlev>
##$CPDPRG8= <mlev>
##$CPDPRGB= <>
##$CPDPRGT= <>
##$D= (0..31)
0 1.2 0 0 0 0 0 0 0 0.06 0 0.03 0 0 0 0 0.0002 0 0 0 0 0 0 0 0 0 0 0 0 
0 0 0 
##$DATE= 1696498826
##$DBL= (0..7)
120 120 120 120 120 120 120 120 
##$DBP= (0..7)
150 150 150 150 150 150 150 150 
##$DBP07= 0
##$DBPNAM0= <>
##$DBPNAM1= <>
##$DBPNAM2= <>
##$DBPNAM3= <>
##$DBPNAM4= <>
##$DBPNAM5= <>
##$DBPNAM6= <>
##$DBPNAM7= <>
##$DBPOAL= (0..7)
0.5 0.5 0.5 0.5 0.5 0.5 0.5 0.5 
##$DBPOFFS= (0..7)
0 0 0 0 0 0 0 0 
##$DE= 6
##$DECBNUC= <off>
##$DECIM= 32
##$DECNUC= <off>
##$DECSTAT= 4
##$DIGMOD= 1
##$DIGTYP= 9
##$DL= (0..7)
0 120 120 120 120 120 120 120 
##$DP= (0..7)
150 150 150 150 150 150 150 150 
##$DP07= 0
##$DPNAME0= <>
##$DPNAME1= <>
##$DPNAME2= <>
##$DPNAME3= <>
##$DPNAME4= <>
##$DPNAME5= <>
##$DPNAME6= <>
##$DPNAME7= <>
##$DPOAL= (0..7)
0.5 0.5 0.5 0.5 0.5 0.5 0.5 0.5 
##$DPOFFS= (0..7)
0 0 0 0 0 0 0 0 
##$DQDMODE= 0
##$DR= 18
##$DS= 0
##$DSLIST= <SSSSSSSSSSSSSSS>
$$ [...]
##$SUBNAM2= <"">
##$SUBNAM3= <"">
##$SUBNAM4= <"">
##$SUBNAM5= <"">
##$SUBNAM6= <"">
##$SUBNAM7= <"">
##$SUBNAM8= <"">
##$SUBNAM9= <"">
##$SW= 18.05172834244
##$SWIBOX= (0..15)
0 0 2 0 0 0 0 0 0 0 0 0 0 0 0 0 
##$SW_h= 3612.71676300578
##$TD= 16384
##$TD0= 1
##$TE= 0
##$TE2= 300
##$TE3= 300
##$TEG= 300
##$TL= (0..7)
0 120 120 120 120 120 120 120 
##$TP= (0..7)
150 150 150 150 150 150 150 150 
##$TP07= 0
##$TPNAME0= <>
##$TPNAME1= <>
##$TPNAME2= <>
##$TPNAME3= <>
##$TPNAME4= <>
##$TPNAME5= <>
##$TPNAME6= <>
##$TPNAME7= <>
##$TPOAL= (0..7)
0.5 0.5 0.5 0.5 0.5 0.5 0.5 0.5 
##$TPOFFS= (0..7)
0 0 0 0 0 0 0 0 
##$TUNHIN= 0
##$TUNHOUT= 0
##$TUNXOUT= 0
##$USERA1= <user>
##$USERA2= <user>
##$USERA3= <user>
##$USERA4= <user>
##$USERA5= <user>
##$V9= 5
##$VALIST= <valist>
##$VCLIST= <CCCCCCCCCCCCCCC>
##$VD= 0
##$VDLIST= <DDDDDDDDDDDDDDD>
##$VPLIST= <PPPPPPPPPPPPPPP>
##$VTLIST= <TTTTTTTTTTTTTTT>
##$WBST= 1024
##$WBSW= 4
##$XGAIN= (0..3)
0 0 0 0 
##$XL= 0
##$YL= 0
##$YMAX_a= 71034
##$YMIN_a= -98493
##$ZGOPTNS= <>
##$ZL1= 120
##$ZL2= 120
##$ZL3= 120
##$ZL4= 120
##$ABSF1= 10
##$ABSF2= 0
##$ABSG= 5
##$ABSL= 3
##$ALPHA= 0
##$AQORDER= 0
##$ASSFAC= 0
##$ASSFACI= 0
##$ASSFACX= 0
##$ASSWID= 0
##$AUNMP= <proc_1d>
##$AZFE= 0.1
##$AZFW= 0.1
##$BCFW= 1
##$BC_mod= 2
##$BYTORDP= 1
##$COROFFS= 0
##$CY= 11.3945322036743
##$DATMOD= 1
##$DC= 2
##$DFILT= <>
##$DTYPP= 0
##$F1P= 15.7292609196834
##$F2P= 12.9074282941183
##$FCOR= 0.5
##$FTSIZE= 0
##$FT_mod= 4
##$GAMMA= 1
##$GB= 0.15
##$INTBC= 1
##$INTSCL= 1
##$ISEN= 128
##$LB= 0.24
##$LEV0= 0
##$LPBIN= 0
##$MAXI= 10000
##$MC2= 0
##$MEAN= 0
##$ME_mod= 0
##$MI= 1.114404
##$NCOEF= 0
##$NC_proc= 0
##$NLEV= 6
##$NOISF1= 3.799351
##$NOISF2= 2.8
##$NSP= 1
##$NTH_PI= 0
##$NZP= 0
##$OFFSET= 15.70392
##$PC= 1
##$PHC0= -22067.57
##$PHC1= 10.85271
##$PH_mod= 1
##$PKNL= yes
##$PPARMOD= 0
##$PSCAL= 0
##$PSIGN= 0
##$REVERSE= no
##$SF= 200.130013532006
##$SI= 16384
##$SIGF1= 3
##$SIGF2= 2
##$SINO= 400
##$SIOLD= 16384
##$SREGLST= <1H.CDCl3>
##$SSB= 0
##$STSI= 0
##$STSR= 0
##$SW_p= 3612.71676300578
##$SYMM= 0
##$S_DEV= 0
##$TDeff= 0
##$TDoff= 0
##$TI= <>
##$TILT= no
##$TM1= 0
##$TM2= 0
##$TOPLEV= 0
##$USERP1= <user>
##$USERP2= <user>
##$USERP3= <user>
##$USERP4= <user>
##$USERP5= <user>
##$WDW= 1
##$XDIM= 8192
##$YMAX_p= 0
##$YMIN_p= 0
$$ End of Bruker specific parameters
$$ ---------------------------------
##NTUPLES= NMR FID
##VAR_NAME=  TIME,          FID/REAL,        FID/IMAG
##SYMBOL=    X,             R,               I
##VAR_TYPE=  INDEPENDENT,   DEPENDENT,       DEPENDENT
##VAR_FORM=  AFFN,          ASDF,            ASDF
##VAR_DIM=   8192,          8192,            8192
##UNITS=     SECONDS,       ARBITRARY UNITS, ARBITRARY UNITS
##FACTOR=    0.0002768,     1,               1
##FIRST=     0,             0,               0
##LAST=      2.2672688,     0,               0
##MIN=       0,             -98493,          0
##MAX=       2.2672688,     71034,           0
$$ Real data points
##PAGE= N=1
##DATA TABLE= (X++(R..R)), XYDATA
$$ [...]
1823b3K7K93j9k08j93l8J98j44P7Q1M0k9j28K7m5j3j05K67k63L61k59%j9J67J4
1848F6k34J11J07p6RK07NM7j68j62J0q3K38j37L21k89J46r0L6l36J14q6K49m8
1872d3Q5J03m88j0K63k6K86J19m72N9J51l0j59M94l09r4L48j46p9N8j7k52L6J87
1896F4j41P7k06p6K54j18J75r9Q9l58M65k92K27j20o3J31K97k49L3L0K05q4Jm0
1920B02J55j60K47l27j88L9L34l78j01M24j44m0M1n9j21l11K48R9j7P5q4R5j03
1943g4N5j00j28K42J76l3P8K9k63p3J46PJ90j41l30J52R9J14m22K06K47j24j14
1966f1M58o66K64K7m2P8o1j24j09L44j01p8J35r1j38L83j87l53M89r1L2j20J05
1989I3J7j03j6J7J60l3l64K02O6J37l44J48Q1m1J36M0l09J75n7J02j24j03K75
$$ plain form
1823 -23 4 297 278 70 -123 -161 37 -107 -30 51 91 62 -66 -39 -84 -97 -202 65 -198 163 -96 -96 -115 52 66
1848 66 -168 -57 50 -26 -17 190 195 242 74 -88 -78 -161 77 -60 261 -28 118 28 64 -272 -158 -244 5 -43
1872 -43 42 145 -343 -353 -90 -116 170 289 -183 -124 27 -3 -162 332 23 -71 277 131 52 110 93 -159 -123 64
1896 64 -77 0 -206 -282 -28 -146 29 -70 19 -339 126 -166 61 -59 -122 9 306 57 90 120 325 241 242 202
1920 202 357 197 444 117 -71 -32 302 -76 -177 247 103 63 104 45 -76 -387 -139 -40 -57 18 -66 29 -74
1943 -74 -19 -119 -247 -5 171 138 216 245 -18 -91 55 62 252 111 -219 -67 32 146 -276 -70 177 53 -61
1966 -61 397 -269 -5 22 -20 58 -3 -127 -236 108 7 -71 64 -27 -165 218 31 -322 167 76 108 -12 93
1989 93 110 7 -9 8 168 135 -229 -27 39 176 -168 -20 61 20 156 196 -113 62 5 107 -17 -120 155
2012A55j52J42j44j71NL33q4j23Q4p3j10J13k30K7J51m6K95l37L34o2l22J43J30
2035E8j88R5r1J56q1L3O8J7Nmj1j22M9j2L3r8J92r7J35L5j35o3J17j31K2J94k38
2062f2J42j8j4m9k1m2J35l2j0O0J37m28L52k1k81O5N5k7K32j89N9R2j83K1k4N0
2088al0k9n0Q2j17R5j21p6L46l22K74j45Mo1J73R2k44P1k0O6mj33N6J24j19J27
2114C8k21K89o8l42M33O2j47J84l49K0M25k61J08k83Q3q5N0j5j38J85KoK04k51
2138h3J51k7r1m1oM44n20LJ9j23L27l5j72J85k24J81J07J6J76m62k2N06l97j13
2162b01K24RJ30n6l1q6k65J82J05J24o6q2P0o3R6J29q7j69J44j89P2k40J77n5
2186a28k6M5J37j83j49K07K20j57J1lR8j37K37j60Qk05L32k22j58M19j2j75L1
$$ plain form
2012 155 3 145 1 -170 -165 168 84 -39 45 -28 -138 -25 -255 -228 -77 -123 172 -165 169 107 -215 -72 58
2035 58 -130 -35 -126 30 -51 -18 50 67 72 68 57 -65 -16 -28 5 -93 99 2 137 172 37 -26 91 -40 -18 176 -62
2062 -62 80 62 48 -1 -22 -64 71 39 29 89 226 -202 150 129 -152 -87 -32 -59 173 -16 43 135 -48 -27 -51 -1
2088 -1 -31 -60 -110 -28 -145 -50 -171 -247 99 -223 51 -94 -90 -151 22 114 -130 -59 -79 -13 -17 -150 -94 30 -89 38
2114 38 -183 106 38 -304 129 191 44 228 -121 -101 324 63 171 -112 -29 -114 -64 -79 -217 -32 -30 -36 168 -83
2138 -83 68 41 -50 -91 -97 347 -173 -170 -151 -274 53 18 -154 31 -193 -12 95 111 287 -175 -197 309 -88 -201
2162 -201 23 32 162 106 75 -11 -276 -94 11 135 69 -13 57 -6 90 219 132 -37 107 -82 -10 -250 -73 -128
2186 -128 -154 -109 28 -155 -304 -97 123 -34 -23 -26 72 -65 172 12 20 -185 147 -75 -233 186 174 -1 30
2209C0j58J2K53j88K5j38L03j60K90m30K17j79K8J46o9J07o4%KJ0N4j32k6P9K28
2234B40n69P12l68P7R9L4k73R6R8q5K5j31J49j71j25K0L39k15K30m40L63l3ml7
2258C1j5q4J86p9K2j89L10r3j2k33P2K19k12J35J64l54K49J20k74R0Q2j61J2K55
2282B41j07k94j35M08k24L17k47K43l89q7J69M1j08J34M08l92L3k3l16M60n7j7
2304E8N1O4q6l6j16K05J87k98O8o7j18K04m99M95ok11J61k18J89k94m1mK80q5
2328a17J58jK44j26k42O2P2J28l65K24j26L3pQ2j42L56l99j3J61k23N4L74j15
2351G2O0k99J75m6j26L07m11M79j92M5k23K74j14j47M00k13q8n3K16n0J45j3j94
2374DL3j81j17M84k52R8j37J28k73PL75k88k2J97p4l7Qm4rL7q5J94J34k2j64k01
$$ plain form
2209 30 -128 -116 137 -51 -26 -164 139 -21 269 -161 56 -123 -95 51 -18 89 25 25 27 37 91 -41 -67 12 240
2234 240 -329 383 15 92 191 225 -48 48 146 61 86 -45 104 -67 -192 -172 167 -48 182 -258 105 72 68 31
2258 31 16 -68 118 39 61 -128 182 89 77 -156 -84 135 -77 58 222 -132 117 237 -37 53 135 -26 -14 241
2282 241 134 -160 -295 113 -111 206 -41 202 -187 -274 -105 -64 -172 -38 370 -22 11 -12 -328 132 75 58
2304 58 109 173 87 51 -65 140 327 29 97 30 -88 116 -383 112 106 -105 56 -162 27 -267 -308 -312 -32 -117
2328 -117 41 40 284 158 -84 -22 50 178 -187 37 -89 -56 -63 19 -123 233 -166 -179 -18 -241 -187 187 72
2351 72 132 -167 8 -38 -164 143 -268 211 19 64 -159 115 1 -146 254 41 -47 -100 116 66 211 198 4
2374 4 37 -144 -261 223 -29 69 -68 60 -213 -206 169 -119 -141 56 -18 -55 -47 -91 -100 -63 -148 46 180 158 -6 -207
2400b07J13L76k61P5J06j19l31J94O6JL34m01PK36l55N6J54k0mj11J19j58J53
2423B3k9j00Q1R1M6k86K86j33M1k4ql6L21n05K81P7j11k28L27k07L42k46K48j85
2447F6q2k07K61J12l36J93p4J8J38p1O9j96L8K31KJ34l33J84l06J80Q1j8k8J40
2471A96N2j84k4j5O4k03L46k98J24O1mJ2k45N1M1K8j54J57Op5l5p9K44k01J06
2496b9J31m55M66k4j57N9Q2J02j25j59L27j46J27j98L25k02k16Q2j0N6m1k73K72
2519fj22K21o3k09L86j43qJ15k19K03j29j3L32j93p9j47n8L33k19M2O7M8l92L30
2543G7J00l38K68P8j61J65l22J05K4O8K0j61K27k10K32q8k14K65k92q7K74J9O3
2566A12l13L55n3J9k41k54L90k3J23n7k68R4J90j08P2L3q3l04M09j75m5J37J58
$$ plain form
2400 -207 -94 282 21 96 202 83 -248 -54 12 13 347 -54 -47 189 -166 -110 44 24 20 -91 28 -130 23
2423 23 -6 -106 -25 66 112 -174 112 -21 20 -4 -12 -48 273 -232 49 126 15 -213 114 -93 249 3 251 66
2447 66 -16 -223 38 150 -186 7 -67 -49 89 18 87 -109 -71 160 162 296 -37 147 -159 21 102 84 56 196
2471 196 248 64 40 25 89 -114 232 -66 58 119 115 127 -118 -67 -26 2 -152 5 11 -64 -99 -178 66 -135 -29
2496 -29 102 -353 113 89 -68 -9 73 175 50 -109 218 72 199 1 326 124 -92 -10 -20 36 -5 -278 -6
2519 -6 -128 93 30 -179 207 64 56 171 -48 155 26 13 345 152 73 -74 -132 201 -18 24 91 139 -253 77
2543 77 177 -161 107 185 24 189 -133 -28 -4 64 84 -77 150 -60 172 84 -130 135 -157 -244 30 49 112
2566 112 -201 154 101 120 -121 -375 15 -8 115 58 -210 -116 74 -34 38 71 -12 -316 93 -82 -127 10 168
2589A68j33J10j51k60K03K20k14R9K05j51k65K30j23Pj2K90k55j81N03m95J67
2610c8K66l29O7q5l9J73m7K8l6J52P7j57j24N5K12K12l48m5K72k38p7L14l17Q4
2634C2K13k41P6o0J60p2j48o3P5k33K05J41j57j2N0Mr0P6J79k41k97O38k09J99
2658B25j42K69k23k18J77J2j78K30k04O5j0j02J22J16k16J35k08K42j10K00p8
2679A04k37M50k44j60J91p3k00R0K25J11j58M8j02R0o4O2m10M14p3R2k84J19J01
2702I2k69K52j2m9j15q5R8J91J55l56J6K76j65j24J4J23P0j13q7L71j71N1k3k51
2726a11L45l00j36K13j13N0L20l21l8L27r5k72L39j54j08pK42k46J9j22J37j09
2748a40K24j36N6J65k17J38k20k4L1J90j79L45k53J19m02M71k13j0j15PL24k32
$$ plain form
2589 168 35 145 -6 -266 -63 157 -57 42 247 96 -169 61 -62 -55 -67 223 -32 -213 290 -205 -38
2610 -38 228 -101 -34 -119 -158 15 -32 -4 -40 112 189 32 -92 -37 175 387 39 -6 266 28 -49 265 -52 32
2634 32 245 4 80 20 180 108 -40 -103 -28 -261 -56 85 -72 -84 -34 -30 -120 -44 135 -106 -403 235 26 225
2658 225 83 352 129 -89 88 100 -78 152 -52 13 3 -99 23 139 -77 58 -150 92 -18 182 104
2679 104 -133 317 73 -87 104 31 -169 -79 146 257 99 147 45 135 71 133 -277 137 64 156 -128 -9 92
2702 92 -177 75 63 14 -101 -186 -88 103 258 -98 -82 194 29 -95 -81 42 112 -1 -88 283 112 163 140 -111
2726 -111 234 -66 -202 11 -102 -52 268 -53 -91 236 141 -131 208 54 -54 -61 181 -65 -46 -168 -31 -140
2748 -140 84 -52 4 169 -48 90 -130 -154 -123 67 -112 233 -20 99 -303 168 -45 -55 -170 -163 161 -71
2770g1Jj60M21j70O6PP2k6m3j08J91n1k60J13J18p3k9l9O9J52p0P6l29J43p5J07
2796C2J66j68o3J51j68Kl7J16l72M42k08J4p3R0R5P6P3k73K81j16RJ27n4p5j20
2821e3N7L5K2j14K5J02p9l53L23J79j13P7l04K99Om33L24J09k87K95P2j87J66
2844A68j74J22P3l69K93k52J36J74j86l03K15J44P9k10q6L67k13q7J74m6j43J79
2866E5j78j48J18J69L18k53l95J71J60J43k27PJ9J08j14j77K07J56k33L64k12
2887E8J03J63l84L88p26M35N1j13N3Q5q8j01K64J4k67n3P2j49K27j31R9P3p4n4
2911e5lM3j12jL51l88K25j55ML80k90r4K25L5k45K02p9qj20J02j59M6M9k2O1J07
2937I9k20Q6mJ23M3j74K50k40j51K42j57M7p3K49j20M0j08L76n16j7J20K62k8
$$ plain form
2770 -71 -70 -230 191 21 87 94 166 140 97 -11 180 129 -131 -18 100 27 -2 -41 28 180 110 186 -143 0 -75 32
2796 32 198 30 -33 118 -50 -48 -85 31 -341 101 -107 -93 -166 -76 19 95 168 -105 176 60 69 196 142 67 -53
2821 -53 4 39 61 -53 -28 74 -5 -358 -35 144 31 108 -196 103 109 -324 0 109 -178 117 189 2 168
2844 168 -6 116 189 -180 113 -139 -3 171 -15 -318 -103 41 120 -90 -176 191 -22 -109 65 19 -124 55
2866 55 -123 -271 -153 16 334 81 -314 -143 17 160 -67 -60 -41 67 -47 -224 -17 139 -94 270 58
2887 58 161 324 -60 328 -398 37 88 -25 28 113 25 -76 188 202 -65 -118 -46 -195 32 -99 0 73 -1 -55
2911 -55 -58 -15 -127 -128 223 -165 60 -95 -91 289 -1 -95 130 165 -80 122 43 35 -85 17 -142 -96 -47 -69 -8 99
2937 99 -121 -35 -39 84 127 -47 203 -37 -188 54 -103 -56 -129 120 0 40 -68 308 -208 -225 -105 157 129
2960A29l07K65j75j7m9k54L64Q9p1K12k92p5J47k32J52K11k81K75r9K50l85L18
2982A75m0M7J52j85O1j72K37k99j48n9M02j55l57M61k23J21K28j96j0Rk07J50
3004hj68L8K23R6j72%J44lk40J15P5j12m8J0J75p7k0m3j15M7q4M43n21L50p8K1
3030D8r1N3J38q6J32k61p3J61M4N6K05l62KO1l89K50j46J61K00j68J33l4j02K86
3054B18n49M14Nl0P9j01j03N9j41J68J20L8j76l07J56J58j66L8r7J26j3L58k96
3077d2k07L04J7L3j12p6O9K3J21j06m3j05J76j20k82M04N2j56M2J75l66J00K80
3100A81k47J89k26k16L18L3J06k11J5Q6m9L8M8k45K17K10j73L00k87k1k21L96
3122B41m48L07j04J42p8j02J23r1j9J5kj52J02J39oNj85M2K27j78M8K1j35J20
$$ plain form
2960 129 -178 87 -88 -105 -154 -408 -44 45 -26 186 -106 -181 -34 -266 -114 97 -184 91 -8 242 -143 175
2982 175 135 182 334 149 210 38 275 -24 -172 -231 171 16 -341 120 -103 18 246 50 40 49 -158 -8
3004 -8 -176 -138 85 181 9 9 153 150 -90 25 100 -12 -60 -50 125 48 28 -15 -130 -83 -167 276 -245 105 27 48
3030 48 -43 10 148 62 194 -67 -140 21 65 121 326 -36 -34 27 -362 -112 -258 -97 103 -65 68 34 -68 218
3054 218 -331 83 88 58 137 36 -67 -8 -149 19 139 177 1 -306 -150 8 -158 -120 -217 -91 -104 254 -42
3077 -42 -249 55 72 105 -7 -83 -14 9 130 24 -19 -124 52 -68 -350 54 106 -50 -8 167 -199 -99 181
3100 181 -66 123 -103 -319 -1 32 138 -73 -58 28 -21 17 65 -180 37 247 74 374 87 66 -155 241
3122 241 -207 100 -4 138 60 -42 81 -10 -29 -14 -16 -168 -66 73 67 72 -113 -71 156 -22 26 47 -88 32
3146C2j16P4J10Pj3J07k27Qk8N4p8j70M81k32M2k47J37q4K14R3k80K71k22L4j5
3171d8J90p3j8J1l02J70K8J32j1j4k1J7j58J88K4K1j38k5K15l1l25j82K56K08
3195A14J06k95M7l6l2J80r8K55j95k6nj22L9K00j88r3j35J84K30k04J77K7j08
3218B2J43l12J30N2j00j17R5K21l70K72n1j07J99l0N6p1j67R2J1KK81j05J11j32
3242A25N8M4l31O9J15q7J83k33j36L04k12O5L40k85o6nk04K09k64M54j92N7J05
3265A13l44N48l7k20N3n7qk59K36Q3k80K44k08K94k60j16K71L9q7Q5j46K7J09
3288H0j89j76O5J35K96j69M9j5j05P8n2Q6p9j55J25j03K68k42N0r9L23l16J70
3311B5r6q7j8O8R5J3L6j58J75R7j38n7o6j76M06R5j18l3J1l00K16k66M28k61Q5
$$ plain form
3146 32 -84 -10 100 107 94 201 -26 -18 -46 8 -70 -240 241 9 51 -196 -59 -143 71 164 -116 155 -67 -33 -48
3171 -48 142 69 51 62 -240 -70 -42 90 79 65 44 61 -97 91 115 136 -2 -27 188 157 -168 -350 -94 114
3195 114 220 -75 -28 -64 -96 84 -14 241 46 20 15 -107 -68 132 -56 -149 -284 -100 130 -74 103 130 22
3218 22 165 -147 -17 35 -65 -182 -87 134 -236 36 -15 -122 77 47 103 32 -135 -43 -32 -30 251 146 257 125
3242 125 183 227 -104 -35 80 -7 176 -57 -193 111 -101 -36 304 19 -47 -52 -256 -47 -311 143 -49 8 113
3265 113 -231 317 280 60 113 56 48 -211 25 108 -172 72 -136 158 -102 -218 53 92 5 90 -56 -29 80
3288 80 -109 -285 -220 -85 211 42 91 76 -29 49 -3 83 4 -151 -26 -129 139 -103 -53 -152 171 -145 25
3311 25 -71 -158 -176 -108 -13 0 36 -122 53 150 12 -45 -111 -287 119 214 96 63 74 -226 -10 -276 152 -109 -24
3336b4j03N9R4Q6Mq4k89L94k50J57j19K9K33k15J13r5M0J60j91k03o4J91r9J29
3360d7j6P1R3j18J90j81J63k18J34k11L23m27K70R9j67J35j50L23m27J97j71K92
3382A57k53Q9M3L3N5j51j29O9J62L8k5J57l24K86m37J40N5Q5R7n8k14J16q4j27
3406b20Q1K84M7j34j13k0oj6J64k36K92k1M7n4j02K6j23pR2ON7J27l7j60j88P7
3432a37j25M01n0r0j10J82j41M8K05m2j60O9K5j83N6J14k09J69j21P5P9k33M58
3455B80k33k33M82l56J66l29L64l19K27J1j84J27k29K48j38q7J37M2q7M7R6k1
3477A1O3m5k81k4M58k15M2j75N6O3K22j5k23jK25l9p1O4j27m7J73l67K39J19o
3502I9M6q7j14M07m33J31j05J30l10K2L64j67j51K31j17m9rj46M82n92P44n12
$$ plain form
3336 -24 -127 -68 26 112 116 32 -257 137 -113 44 -75 -46 187 -28 85 -10 30 190 -1 -204 -268 -77 -176 -47
3360 -47 -63 8 101 -17 173 -8 155 -63 71 -140 183 -244 26 125 -42 93 -57 266 -161 36 -135 157
3382 157 -96 -7 36 69 124 -27 -156 -87 75 113 88 245 -79 207 -230 -90 -35 50 147 89 -125 -9 -93 -220
3406 -220 -139 145 192 58 -55 -75 -81 -97 67 -169 123 102 149 95 -7 19 -104 -111 -19 -13 44 171 134 -26 -214 -137
3432 -137 -262 139 89 -1 -111 71 -70 -22 183 141 -19 50 75 -108 -52 62 -147 22 -99 -24 55 -178 280
3455 280 47 -186 296 -60 106 -223 141 -178 49 60 -124 3 -226 22 -116 -203 -66 -24 -111 -64 32 11
3477 11 74 29 -252 -276 182 -33 9 -166 -110 -47 175 160 -63 -64 161 122 51 115 -12 -59 114 -253 -14 105 99
3502 99 145 58 -56 351 -82 49 -56 74 -236 -214 150 -17 -168 63 -54 -103 -112 -258 224 -368 376 -136
3524a36n5K53j65J18q2RJ16j46J03M3j91J29J38j9j50j14J55J95k40J12lj22O9
3547A7J76n21L76r2pk26L10Q9j82J37k32j47M47q5k21K91n5j02J20j46j54L81
3569A74k06J48j89J30N1K2k33K96k24J19j41Mj7M5J66Mk29J59N2k61Oj74L75k25
3593a48P0j0K03n7K26m23J54J24q5L5j88O4j6K0r9J92k23K97l16J32j05K71j29
3616a1q3P4K9O0n1K94l93Q0NKk66L45l42K21Q1m8j51J33J15j66KR4J4m6K36j20
3642A08j22p4j52M12k64L5K24n3l4j76J94k64Q5K78l34J07j8j85L16j39Q6Q6N6
3665A72j67O8l6K78l78j9o5K75j30Lj82K79j31J26lq4p0J41n6J31J1L9k46J0o
3690d0K09r1J10Q4Jl04Q4pM2o6J84j98p4J03J12j83j37K14j77K17j13j36J46k31
$$ plain form
3524 -136 -191 62 -103 15 -67 -58 58 -88 15 58 -133 -4 134 115 -35 -149 6 201 -39 73 70 -52 17
3547 17 193 -328 48 -44 -51 -277 33 122 -60 77 -155 -302 145 60 -161 130 75 -27 93 -53 -207 174
3569 174 -32 116 -73 57 108 130 -103 193 -31 88 -53 -49 -66 -21 145 149 -80 79 131 -130 -124 -298 77 -148
3593 -148 -78 -88 115 58 284 -139 15 139 54 89 -99 -35 -51 -31 -130 62 -161 136 -180 -48 -153 118 -11
3616 -11 -94 -20 9 69 18 312 -81 -1 4 6 -260 85 -257 -36 45 -3 -154 -21 94 -72 -70 24 38 -8 228 108
3642 108 -14 -88 -240 172 -92 -57 167 114 80 -96 98 -166 -81 197 -137 -30 -48 -233 83 -56 30 116 172
3665 172 5 73 37 315 -63 -82 -147 128 -2 1 -181 98 -33 93 90 6 -64 77 21 152 163 202 -44 -34 -40
3690 -40 169 78 188 272 273 -31 53 46 88 22 206 8 -66 37 149 -34 -171 43 -134 83 -30 -166 -20 -251
3714b51L17n4k4M4l4j28K6O5J43Oq6M5o6p4K07K08k99j0ro5j34Q8O8K4J3N2J8
3741I0N8m8l88L56m4On1k15J32k7K91l8r2j6o7J51J13l01Q9K38j15k04Q5j75J17
3766e5J33J08m64o1K75K46l77Q5j48M4M95l07n6J18o2j8J03k54L12j70k39J03
3788a89L04j52J31J05j88Q2q4Q0k21J31p0J79j37j8J12J4j13k38L31%J5L2q5k5
3812dk75O2J30O9p2l6R4j8p1K01P2Ok33J63q0jj01L84j20j68l4J94k41J60k58
3837a77M34k48p9O0K00k42mN5k97L16j99J99P4r6k67N75j27q2j33j40L29j39P7
3860H9j01P0l89K03L16k21R5m1J7m08N68l32K63j73q3j8K05J50L5m13R2J94k3
3883I5j72J27N1m10K57O6r1oR9l5J88l52J58l8o7J02J03j39K9j52J00J04j37R7
$$ plain form
3714 -251 66 12 -12 32 -2 -130 -104 -39 104 110 24 69 3 -71 136 344 45 35 26 -39 -173 -85 -17 7 20 72 90
3741 90 148 100 -288 68 24 30 -21 -236 -104 -131 160 122 30 14 -53 98 211 -90 -1 237 122 -82 3 -172 -55
3766 -55 78 186 -278 -339 -64 182 -195 -110 -258 -214 281 -26 -82 36 -26 -44 59 -195 117 -53 -292 -189
3788 -189 115 -37 94 199 11 93 9 89 -132 -1 -71 108 -29 -47 65 79 -34 -272 59 59 74 106 21 -4
3812 -4 -279 -217 -87 -18 -90 -126 -32 -50 -121 80 152 158 -75 88 8 7 -94 290 170 2 -32 162 -79 81 -177
3837 -177 257 9 -70 -10 190 -52 -56 -1 -298 18 -181 18 92 -4 -271 304 177 95 -38 -178 151 12 89
3860 89 -12 58 -331 -128 188 -33 62 21 38 -370 198 -134 129 -44 -127 -145 60 210 245 -168 -76 118 95
3883 95 -77 50 101 -309 -52 14 -77 -83 16 -19 169 -183 -25 -63 -130 -28 75 -64 -35 -187 -87 17 -120 -23
3907b3K03k09J7m6J65k3k6kRj14k47L87j49R3N5j73J28J86j24l05OL36m90L02
3931d4K7J31l18J95lm9j62L49j81J0L17l85nL28k31J72j2j73J7m5R4r0j33J90
3955al4L7O4m98N39q8j25Q3j69N2J53K23k66QM3r2J40p0N2j71L85q7l20L97j13
3980A42p2j82O3J29k14K03n5J62l21J62j71J15j64rR6m4K34j09J66k40M7M9n3
4003f6j4J36j87j09K63J09o7O1r0J5n6L17l87J67j9J73j23j99Q2lj42M1J22o4
4027d0J00J58j29k57L74m4j4j61J9Q4J16k25kJ65j64O9l0Kk55K63m6R3j11J36
4051A01nN8o9q2J12jk7k16R2k24K37n2K22j68j16j8K36j05J32k49J1o7J26J23
4075E1Q9j39K24j25J38k54N7j2J08k3p9q7r5l6M07j75m0N7k87K70j39jl1K61j98
$$ plain form
3907 -23 180 -29 -12 -58 107 84 58 56 65 -49 -296 91 -58 35 90 -83 45 231 107 -198 -192 144 -346 -44
3931 -44 -17 114 -204 -9 -12 -61 -223 126 -55 -45 272 -113 -118 210 -21 151 139 -34 -17 -62 32 -58 -191 -1
3955 -1 -35 2 66 -432 107 19 -106 -23 -192 -140 13 236 -30 -22 21 -71 69 -1 51 -120 265 178 -142 255 142
3980 142 70 -112 -49 80 -134 69 14 176 -145 17 -154 -39 -203 -212 -116 -160 74 -35 131 -109 -62 -13 -66
4003 -66 -80 56 -131 -240 23 132 65 126 36 51 -5 312 -75 92 73 246 123 -76 6 3 -139 -98 24 -40
4027 -40 60 218 89 -168 206 162 148 -13 6 90 206 -19 -21 144 -20 49 19 21 -234 29 -17 76 -35 101
4051 101 96 154 85 3 115 114 87 -129 -37 -261 -24 -76 146 -22 -138 -156 80 -25 107 -142 -131 -198 -72 51
4075 51 140 1 225 100 238 -16 41 29 137 114 35 -52 -147 -183 224 49 9 66 -221 49 -90 -91 -122 139 -59
4100e9j00M1J14O5j28O5J6j27J8K25j21j84L25K3J7m65L52L7j6j34J12N9k06R1
4124B0j87P6n4K76l04J34j04K41k18k75N92j44o0j67O4L96l24n5J34R4n7L0q2
4147B6l5R1l31L75j57K14N7l73M5J77k37L33r8j06j64K14J56N2l47M14M0l26p
4170A3j69O7n8J04l6L81k89kM1k19K66N8j4J0k91J84Jk4J21j65Pj1J95j32k83
4195b45J58O4L7K3O6k26K93k99J64k14J73k2r1K12OJ05k89j42K53j35N4J12o8
4218a1m1k08L30ML7l41K32j56J06K75m9j56OJ12m1l3k50J54K3j43J27L1r7P9l5
4243d5J77j78n1J55q2J08L7k83J22J85r4K8R9j82l3L18j97r1K47q3N0j64R4Qp5
4268G0m9j51K31j84k6J42p7J11k32L2J2J59O2j52J2k45L55j61O8L7J6l5n4p2J55
$$ plain form
4100 -59 -159 -118 -4 61 -67 -2 14 -113 -95 130 9 -175 150 173 190 -275 77 114 98 -36 76 135 -71 20
4124 20 -167 -91 -145 131 -173 -39 -143 98 -120 -395 197 53 -7 -174 -110 286 -38 -93 41 135 78 108 26
4147 26 -9 82 -249 126 -31 183 240 -133 -88 89 -148 185 87 -19 -183 31 187 239 -108 306 346 20 13
4170 13 -156 -89 -147 -43 -79 302 13 11 52 -167 99 157 143 153 -138 46 47 23 144 -21 -14 -25 170 38 -245
4195 -245 -87 -23 14 37 103 -123 170 -129 35 -179 -6 -28 -119 93 99 204 -85 -227 26 -109 -55 57 -11
4218 -11 -52 -260 70 74 111 -230 2 -154 -48 227 178 22 28 140 99 66 -184 -30 -7 -150 -23 8 -89 -10 -45
4243 -45 132 -46 -97 58 -24 84 121 -162 -40 145 51 79 178 -4 -37 281 84 -7 240 157 207 43 137 145 70
4268 70 21 -130 101 -83 -109 33 -44 67 -165 -133 -121 38 100 -52 -40 -285 70 -91 -23 14 30 -5 -59 -131 24
4293B4n3J88m51J56l1j0K71J20n4j47J62l66J75k1r4J69J45m37K48q8L94n33K15
4316a8J34J49k65R8j22N2k4J8P5r0j51M2R8j07R0n5lJ37j67K25j6l29K44P3k21
4341a33L72l37q6P6k72J85J89j4p7L09k5o5j47J94j57N3P1l6k4k01J44O0l32J76
4365g7j37j7P5j3L7k6R2J21N2j52j70L25j63K2j59J93J70j02P4k62K45m22K50
4388d4q8J0K39k90L7K07k77L15j33P1K0j28J79k10j19L22n2k20K60k31j14K1J32
4411i3J81N5p2k54k4L35m1l4p2J14K3j28L07m03P3J11j36K04l2n1o4N2r9p8n1
4436a77J78q4P9j26J1J55O0k76K20j12r1J76K6R0Q7j49j62J29J2J2r7j32L14j33
4460A0k35K98k32K6N0J29j09J45J09m9j86j15K30k08L10o3L7O8l05M8m2P0J03
$$ plain form
4293 24 -29 159 -292 -136 -167 -177 94 214 160 13 175 -191 -16 -37 -131 38 183 -254 -6 -94 300 -233 -18
4316 -18 116 265 0 98 -24 28 4 22 97 7 -144 -102 -4 -111 -21 -76 -79 58 -109 116 100 -229 15 88 -133
4341 -133 239 -98 -184 -108 -380 -195 -6 -20 -97 212 187 122 -25 169 12 65 136 100 76 -125 19 79 -253 -77
4365 -77 -214 -231 -156 -169 -132 -158 -66 55 107 -45 -215 110 -53 -31 -190 3 173 71 145 -117 128 -294 -44
4388 -44 -132 -122 117 -173 -136 71 -206 109 -24 47 67 -61 118 -92 -211 111 59 -161 99 -132 -246 -225 -93
4411 -93 88 143 71 -183 -207 128 87 53 -19 95 118 -10 297 -106 -33 78 -58 146 114 63 -1 51 -48 -126 -177
4436 -177 1 -83 -4 -130 -119 36 96 -180 40 -72 -163 13 39 129 216 67 -95 34 46 58 -39 -171 143 10
4460 10 -225 73 -159 -133 -83 46 -63 82 191 142 -44 -159 71 -137 173 110 147 215 -90 -42 -84 -14 89
4483H9L0k96K45k7j22K46k98J3O1K1J51l20K29K38k82K7N1Q3j53q7k0J53j28L4
4507f2P3Q9Q4k25K29k12J45j06r8n1j27K94k28K95k19J4J11j61L00l3K2q3Ml7
4531A8j12O5P2l0j2m5j24R6mjK1J29k4R3k96j53L90j35q5Q8j25J70K30n6k18P9
4557C1n2j57K36K08k79M8R5n3l9j08R0j80K67m51L56LK34q8k2k35N8j84J80J66
4581A24k22J58K5k97J26J9J16o3J36pr4p8L48k39L5J17j63j4j91J76J44J06j75
4604H7j4K17j22j65%p1J59k50J22J93k66J87q2O9J41j95J57n8j19J27J33l20J8
4627e2M5k81L82j32k27M82j30k07J37j47K42KK7k14K77j82j79j54L72j4J13N5
4649B15p6l12K46j05l3R3j40K64n14L82j7j10O1K09q1r1j8K01k47K79k30N5j01
$$ plain form
4483 89 119 -177 68 41 -81 165 -133 -120 -59 -38 113 -207 22 260 -22 5 56 139 -14 -101 -121 32 -96 -62
4507 -62 11 100 184 -41 188 -24 121 15 -83 -134 -261 33 -195 100 -119 -105 6 -155 145 112 134 51 55 18
4531 18 -94 -29 43 13 1 -44 -168 -72 -76 -77 -56 73 49 142 -154 -307 83 -52 -137 -49 -174 -4 226 170 -48 31
4557 31 -21 -178 58 266 -13 35 130 77 38 -70 20 -160 107 -344 12 15 249 161 139 -96 -38 -222 -42 124
4581 124 -98 60 85 -212 -86 -67 49 -14 122 115 21 -57 291 52 87 204 41 27 -164 12 156 262 87
4604 87 73 290 168 3 3 -68 91 -159 -37 156 -110 77 -5 64 205 10 167 109 -10 117 250 -70 -52
4627 -52 -7 -288 94 -38 -265 217 87 -120 17 -130 112 114 141 -73 204 22 -157 -311 61 47 160 215
4649 215 139 -173 73 -32 -65 28 -112 152 -362 20 3 -107 -46 163 82 -9 -27 174 -73 206 -24 31 -70
4672g0r5M34m80q1L41k3k19K11Q9l6J38k59J04j65J69p3kj5J27k15J32J63q9j59
4696g3L3kK75j10k54J12r3K30o2mO6k35K41k09Q2N0K0j09Q0p7q4KL86j51j16q4
4722h6Q4k7Q6j62J02r8J48pj26J99M7m3L2j48J02n3o2n1J32M6j26j1J78j76J00
4747H0j48L11o9j70n9k46M78k29k29N4J22l2J12L3j48l5L67o4n7rn9J52m9k30
4771a24J66J37j16l73M61k64%J0K21l03J74J65k76L6L6j21J27J11J5O0j19J13
4793A36M5m1p5L9j00j22J21J14k91K3R3J91m09L67O8k89K09J67j88l10L70l24
4815b06ML57k7l7j94o9J13n8j80M76Pk35j19L37p2r7J03p0Q4p4k15J50k2L51n74
4840b67J32j63J76Q9j5J20Rk73J49q1j25J46j98M0M98q9N9om46J59p0J79j70K69
$$ plain form
4672 -70 -165 269 -211 -292 49 26 -193 18 107 71 209 -50 54 -111 58 -15 -17 -32 95 -120 12 175 86 -73
4696 -73 -40 -42 233 123 -131 -19 -112 118 56 52 118 -117 124 -85 -3 47 67 -42 38 -39 -123 -121 265 114 -2 -86
4722 -86 -2 -29 57 -105 -3 -101 47 40 -86 113 160 117 149 1 103 50 -12 -63 69 115 -11 -22 156 -20 80
4747 80 -68 243 174 4 -55 -301 177 -52 -281 -227 -105 -137 -25 8 -140 -175 192 128 71 62 3 155 106 -124
4771 -124 42 179 63 -310 151 -113 -113 -103 118 -185 -11 154 -122 -86 -50 -171 -44 67 82 142 23 136
4793 136 181 140 65 104 4 -118 3 117 -174 -151 -58 133 -276 91 159 -130 79 246 58 -252 118 -206
4815 -206 -202 155 128 91 -103 -172 -59 -117 -297 179 186 -49 -168 169 97 0 103 33 117 43 -172 -22 -44 307 -267
4840 -267 -135 -298 -122 -33 -48 72 81 -192 -43 -124 -249 -103 -301 -261 237 148 207 201 -245 -86 -156 23 -147 122
4864A22j14%k8k63L80l05J53J55k6k38J19J27o3J17k25K91k25n5K20j72Q6q4R3
4887F5j69J10J58l14K02j87N6j04K68j96R1m6O2J25j74J01m0kr6Q6q3OK14l51
4911b18K84k81M15j07r5J19j62l3n2K48q9o4l1K26q1k11j3P9N4m4k80L32L3L1
4935F0j36J09j46K45J53m57K35j51K76k56J49K9j00k3L7j5o5j55J11J20qK50o5
4958A97j62J14k63J71j02K70k77m8R1K14M8rk99J84l73K27nJ47j73n2PK15l0k
4982I0j23J02j82J8J37j19p0m1L53k41L05k07K88l57m6Q5n8K9L33k09j74J46R5
5005A54j15m7k86K08J62O2l9j31J16O7k4p3p0n1l5j23K99j4K8K9j0p4p5K02j10
5030E0j77J44r5M5j22L21n1l44J93k80K42J8J68l8oQ3m0L2n6j2K1rJ1j63J22J54
$$ plain form
4864 122 8 8 -20 -283 97 -208 -55 100 74 -164 -45 82 19 136 -89 202 -23 -78 142 -30 56 -28 65
4887 65 -104 6 164 -150 52 -135 -79 -183 85 -111 -20 -66 -4 121 -53 48 8 6 -90 -4 -87 -81 133 -218
4911 -218 66 -215 200 93 -2 117 -45 -78 -130 118 29 -35 -66 160 79 -132 -145 -66 -12 -56 -336 -4 29 60
4935 60 -76 33 -113 132 285 -172 63 -88 188 -68 81 110 10 -13 24 9 -56 -211 -100 20 12 262 197
4958 197 35 149 -114 57 -45 225 -52 -100 -9 205 253 244 -55 129 -244 -17 -22 125 -48 -100 -93 122 92 90
4982 90 -33 69 -113 -95 42 -77 -147 -188 165 -76 229 22 310 -47 -93 -8 -66 -37 296 87 -87 59 154
5005 154 39 -8 -294 -86 76 138 99 -32 84 151 127 54 -16 -67 -102 -225 74 60 88 117 107 33 -42 160 50
5030 50 -127 17 -78 -33 -155 166 115 -229 -36 -316 -74 -56 112 74 68 151 111 143 87 75 96 87 98 -65 57 211
5056B11j86K05l59N26n35J3J05kn1n2J85k29M26l62K03J11m34K68k51L59j56l0
5078c5l1L21j48j18p3n5j15K98l09K58J58J08k46j31K68k13q3L6L29l85J24l14
5100c56L78k64L78l14L61k20m7n1J24l6J29j59N5m8J01n1L1M0j7j60Q0kJ08k20
5124a60K66l22L5K95k06L34k93J44j26O6j41m3K32jj46K27j49j0K07k28k04L85
5146A62k87L10l05K23J51l76j82M83q5j43n0m6J64l1M9m0M3j16K48l18K0p2L75
5169A77J61q8k46l2o2L63l27K64o3k07J69j33J7J96k3j08j57jn9J82r0l2M88m84
5193i5J63O6j49n1J41l9J11l1j15J43k47J36q5j26K09O9o5J68k59K29n7J7P6j88
5217B1J30j81j71L49k10M4j49K85J18n0k79K74k55p4J16r1K83N0j03l42J50K10
$$ plain form
5056 211 25 230 -129 397 -138 -125 -20 -22 -73 -125 60 -169 257 -105 98 209 -225 43 -208 151 -5 -35
5078 -35 -66 255 107 -11 -84 -139 -254 44 -265 -7 151 259 13 -118 150 -63 -146 -110 219 -166 -42 -356
5100 -356 22 -242 136 -178 183 -37 -84 -135 -11 -47 82 -77 -22 -70 31 -20 11 51 34 -126 -46 -48 60 -160
5124 -160 106 -216 -181 114 -92 242 -51 93 -33 33 -108 -151 81 80 -66 161 12 2 209 -19 -223 162
5146 162 -125 185 -120 103 254 -122 -304 179 94 -49 -99 -145 19 -12 37 -3 40 -76 172 -146 -126 -198 177
5169 177 338 250 4 -28 -90 273 -54 210 147 -60 109 -24 -7 189 166 58 -99 -100 -159 23 -67 -99 389 -95
5193 -95 68 134 -15 -66 75 36 147 116 1 144 -103 33 -52 -178 31 100 35 203 -56 173 116 133 209 21
5217 21 151 -30 -201 148 -62 -18 -167 118 236 186 -93 181 -74 -148 -32 -123 160 210 107 -235 -85 125
5239A25j58j1K60j45k10q7L98n0j19Q0m5j83K04J77m79K13l11K37r0L18j94j98
5261b68M22p5j74R5K07j49k69Q7K54j7j20j59J65j5l1N5Q6j37L21o3k19R8j03
5284iJ25m8k6k59N4K61j54R8K01l13q3K34O5l4L0j19LK9J14k96J79K01j56j34
5308c7j01r2J50J20Nj21R2J28j09Q4k75J69j14L62l55l3K02P5k7K0J55n42L48
5331A04J75k00j10M23n04R5O3R1m4n8L29l00Q0j01K6j4j41K1m3j44R6j52L32j90
5355a66q8J04J36l3k23K86k1J43l78J85n6K37k63j10J47pJ90j45J43K34j84j49
5377a8K1r1J50P7k37PM5k3K08j92P5k58M42l31J2N1r9K32J00l29L65kj51R3p3
5402G4k27K27k72K24J23j65Rp0J00Mj25K81k62K85k16o8J31j54K32q9j33J47j73
$$ plain form
5239 125 -33 -44 216 71 -139 -226 172 122 3 83 38 -145 59 236 -243 -30 -341 -104 -194 124 -70 -268
5261 -268 154 79 -95 0 207 58 -211 -124 130 113 -7 -166 -1 -16 -47 8 94 -43 278 215 -4 94 -9
5284 -9 116 68 42 -217 -163 98 -56 42 243 -70 -153 81 146 112 142 23 26 55 169 -127 52 253 97 -37
5308 -37 -138 -230 -80 40 45 -76 16 144 35 119 -156 13 -101 261 -94 -127 75 150 123 143 298 -244 104
5331 104 279 79 -31 392 -112 -17 46 137 93 35 364 64 144 43 69 55 -86 -65 -108 -252 -156 -308 24 -166
5355 -166 -254 -150 -14 -47 -270 16 -5 138 -240 -55 -111 126 -137 -247 -100 -107 83 -62 81 315 131 -18
5377 -18 3 -88 62 139 -98 -91 -46 -69 139 -53 22 -236 206 -125 -113 -62 -161 71 171 -158 207 205 54 147 74
5402 74 -153 74 -198 26 149 -16 -7 -77 23 27 -98 183 -79 206 -10 -78 53 -101 131 42 -91 56 -117
5425a17L8J63j4l37K24K20k58J03J17k55K35j46P3p0k31M01j1J75k56k28J62J7
5447EL2r1j4K77l09J67nl93L76J9J8k04K05k23J14j25K03j31j04K02j24J23k44
5470b26J34J63Pj14P0J01Nj04k07J8L97k83N4j95M6N2J72j79K18l03J83j00j25
5493b16PJ67L61k75Q0o7J41m64J92J61j99K38m7m5k90L10o1Q9j00k65J80J4J08
5516A9pK2p5n0R0J68Q4j21k16j49M61j77M3j12J6j08K31j57j38M30k02M8q9o%
5541Ej89J08K16k2l34K68Q4j51J35j83l7rK76p6j52L9mk2Q0j22Q1l6o1J03pj41
5567a51L76j32K5j03j48L22k33N7P2r7M6J11k43P7R8j09J16j72K39k83J39J57
5589A64j08%q8k00N33l10o9j35L61m07J64m2K24l53L97j08j62J14m5J36N6jk30
$$ plain form
5425 -117 -79 84 70 -267 -43 177 -81 22 139 -116 119 -27 46 -24 -255 146 135 310 54 -174 -12 5
5447 5 37 -54 -68 209 -100 67 62 -331 45 64 82 -122 83 -140 -26 -151 52 -79 -183 19 -105 18 -226
5470 -226 -92 71 78 -36 34 135 140 36 -171 -153 244 -39 15 -180 -134 -82 90 -89 129 -174 9 -91 -216
5493 -216 -209 -42 319 44 124 57 198 -266 -74 87 -112 126 79 34 -256 54 -7 82 -18 -283 -103 -89 19
5516 19 12 34 -41 -91 -1 167 251 130 -86 -235 226 49 92 -20 -4 -112 119 -38 -176 254 52 100 11 5 5
5541 5 -184 -76 140 118 -216 52 136 -15 120 -63 -100 -109 167 91 -61 -22 -26 -48 32 -90 -9 -45 -106 -3 -10 -151
5567 -151 225 93 118 15 -133 189 -44 13 85 -12 34 145 -98 -21 77 -32 84 -88 151 -132 7 164
5589 164 56 56 -32 -232 301 -9 -78 -213 148 -259 -95 -137 87 -266 131 23 -139 -25 -70 66 122 121 -109
5612a09J33K28k90K69m12K97m29K31J8N8J02L0l34M82K7k12R9j01j02J72j56J50
5634A51r5j11J78j9j21J46j5j8R3k08o7j78K51LK19m15M05k27K7j96J43M05l61
5657a0J86J0l91J89j33K22K66n63M46p3k39P4L9j21l03N20J43m54J98O8k50L09
5679A33k93P9K82m39K29M2O4Q1j76j04R9K21m11J09k23K50J19n9j1K15m9k24l4
5702a00J49j21%J96p9M4J19j91Q4q8r9j12r4L65m5J09k20J55j87O9K11k49L29
5725B45l83L08P7k56P2L6r4K62j83K64m29K40j78N4J0k19M07j69r0l0L91l90N7
5748Bk39K44j4j43K2J26R1l2j16M02l21J41k57J72O3k58J84lk04J59Jj55L1J50
5772D6j77K78j26j34R4K39Kj57P1j5K9j78n3o9LO3J16k17K40N0J1j61j64K00J67
$$ plain form
5612 -109 24 252 -38 231 -181 116 -313 -82 -64 -6 96 126 -208 274 301 89 188 87 -15 157 1 151
5634 151 56 -55 123 104 -17 129 114 96 189 -19 -86 -264 -13 -10 209 -206 199 -28 -1 -197 -54 351 -10
5657 -10 176 186 -205 -16 -149 73 339 -224 222 149 -90 -16 23 -98 -401 119 262 -192 6 74 -176 133
5679 133 -160 -81 201 -238 -9 33 97 178 2 -102 -3 218 -193 -84 -307 -57 62 3 -8 207 158 -66 -100
5702 -100 49 -72 -72 124 45 89 208 17 101 13 -86 -198 -292 73 28 137 -83 72 -115 -46 165 -84 245
5725 245 -138 170 247 -9 63 99 5 267 84 348 -81 159 -19 35 45 -174 233 64 -26 -56 335 -55 2
5748 2 -237 7 -7 -150 -128 -2 89 57 -59 343 22 163 -94 78 141 -117 67 64 -140 19 20 -135 -104 46
5772 46 -131 147 21 -113 -19 220 222 65 136 121 150 -28 -81 -150 -147 -84 32 -185 55 105 116 -45 -209 -9 158
5797A58j87K2j7R1k8k42J52N3O2j39j68J13L28r9Q4k47L2j26o5K98n4p6N3rM7
5822C6P7l64P7L00L1J9q9p8J07j83pJ7J21J26j43j78J25q7J38m4j57O7M1L7j31
5847a42K46j10K8j04R8r1J09p2j77L41j92j59J29j6r9L19k69K30l07L45m2j24
5869e9P0j2Q2j86j6K33R8j31j38lJ04j8k57M61j30J64j86Q4l58K67j11P0o1q2
5893a15J42O7j89l5J99j8m4o2k7K97p9pR1p2r7K39m48J50J88r2J17j43o6k05L66
5918A57K7l56K03J7q9J76l11L30j56q6J80n1j20J17P1p1j8k64L13k39j2L0K23
5941G1q0oj38N16l55Q5p9J59k32J59j79lj0O3P8p5Oo7J41q2q5r6j49L84R7j11
5967A2k5Q3j14P8j24O7j48K37k21L2L71l72J90N2o2j11J2Q6o0K41J7m97L25l6
$$ plain form
5797 158 -29 -7 -24 67 39 -203 -51 2 64 -75 -243 -130 198 99 183 -64 -32 -158 -223 75 21 -55 -2 -11 36
5822 36 113 -251 -174 126 157 176 87 9 116 -67 -74 -57 64 190 47 -131 -6 -93 45 1 -156 -89 -48 -11 -142
5847 -142 104 -6 22 -82 16 -75 34 -38 -215 126 -66 -225 -96 -112 -211 108 -161 69 -238 107 65 -59
5869 -59 11 -1 81 -105 -121 112 210 79 -59 -62 42 24 -233 228 98 262 76 160 -198 69 -42 28 -33 -115
5893 -115 27 94 -95 -130 69 51 7 -55 -82 215 136 129 220 148 51 290 -158 -8 180 88 205 62 -4 -209 157
5918 157 184 -172 31 48 -41 135 -176 154 -2 -88 92 41 -79 38 109 38 20 -244 69 -170 -182 -152 71
5941 71 -9 -15 -153 363 8 93 14 173 -59 100 -79 -82 -92 -29 49 -26 -20 -87 54 -28 -113 -209 -358 26 123 12
5967 12 -13 70 -44 34 -90 -23 -171 66 -155 -123 248 -124 66 118 56 -55 -43 43 -17 224 241 -256 69 33
5991C3o9K51k47J69j76o4J57j76Q8J03J1l22L26k06J86j90lK27K7j23k64K21%
6014d1j55J95N3j03J02N6r5k26J01Q5j8k18J18J45J97j89J33p3K1%o8k05K1J26
6038c8Q6j99K61k40RJ79j48J86r6j77L1J99k04N5r8M48n50M13q0J78k65j85J48
6061h7J58L8M3j20r8J17j95L45m2l06P4Q2M8q6j05k2Q1j6J19N7J29j41j63O4n2
6086g8J19K5k23J29J35l0K7k76R9J19m6Q7J47k07j96K20K4k00J84k32k5L01j76
6109g3j63L08pn1j09Q1J36k03J23k48K90k0j91J36K8J15o2k82L52k29J51r2j8
6132b8J58m73N19l43J76nJ47J26k99Q2N0j13R6m00K59J15Q2k39L36r2j48N3k57
6155a98n0J69K32K4q9j53m05L45Q5J96j94k48K73j00K76j44M1p7K52k39l9L67
$$ plain form
5991 33 -36 215 -32 137 -39 -103 54 -122 -34 69 80 -242 84 -122 64 -126 -129 98 125 2 -262 -41 -41
6014 -41 -196 -1 52 -51 51 107 12 -214 -113 -28 -46 -264 -146 -1 196 7 140 67 88 88 20 -185 -164 -38
6038 -38 48 -151 110 -130 -121 58 -90 96 0 -177 -146 53 -151 -96 -194 254 -296 117 37 215 -50 -235 -87
6061 -87 71 109 152 32 -66 51 -144 201 159 -147 -73 9 57 -29 -134 -156 -75 -91 28 85 214 73 -90 -26 -78
6086 -78 41 66 -157 -28 107 77 104 -172 -73 46 0 87 234 27 -169 51 75 -125 59 -173 -198 103 -73
6109 -73 -236 72 65 14 -95 -14 122 -81 42 -206 84 64 -127 9 37 152 90 -192 160 -69 82 -10 -28
6132 -28 130 -343 176 -167 9 4 151 277 -22 60 110 -3 93 -307 -48 67 149 -90 246 154 6 59 -198
6155 -198 -248 -79 153 177 88 -65 -470 -125 -40 156 -38 -286 -13 -113 163 19 60 -17 235 -4 -43 324
6177C24k48j07J92J52m08J2Q0L38n11K04j22P5j37J59j49J48k0O2j79j94J91P9
6199e9N6j22J89j61j2j12L38n9j52r0R4j77N54l40J00k53L39kk09QJ15Jk6r5O9
6224fk1L30j33k84M5J9NJ23qk92J16M6K31k28Q4P2j72K4o1J08l7K0J7M9J01L4
6250A82j15q8j31j17J34Q8l3J51n9n7J4n7K7MJ0J91k36J39j30J52j49J08J92l35
6274a15j9J26M6l38M04j04L73l50J68k4k74M62m15M6k83K38k34J91L11j41K3J79
6296B70l88j33K49L9O9J61m07K33j36j61J51j3n9%J77K23k32R9l53O8J31K1l6
6319b7l9J35k33L77k43Qj40J19J09j78J00j89L1J84m22N11j93J46n1J9o3J00m8
6342A3k65L24k68J85k74L9L28j98J22K03j18J0j40q9K14q6J34j36J86k54J76l84
$$ plain form
6177 324 76 -31 161 313 -95 -83 -3 335 -176 28 -94 -19 -156 3 -146 2 -18 44 -135 -329 -138 -59
6199 -59 -3 -125 64 -97 -109 -221 117 58 -94 -184 -90 -267 287 -53 47 -206 133 131 -78 -70 45 46 20 -75 -6
6224 -6 -27 303 170 -114 -69 -50 -45 78 70 -222 -106 -60 171 -57 27 99 -73 -49 -110 -2 -39 -19 -2 47 148 182
6250 182 67 -21 -152 -269 -135 -47 -80 71 12 -45 -31 -88 -61 -57 -47 144 -92 47 -83 69 -80 28 220 -115
6274 -115 -134 -8 38 -300 104 0 373 23 191 167 -107 355 -60 -14 -297 -59 -293 -102 209 68 91 270
6296 270 -118 -251 -2 37 106 267 -140 93 -43 -204 -53 -66 -125 -125 52 275 43 142 -211 -143 -12 9 -27
6319 -27 -66 69 -164 213 -30 -22 -162 -43 66 -112 -12 -201 -170 14 -408 103 -90 56 5 24 -39 61 13
6342 13 -252 72 -196 -11 -285 -246 82 -116 6 209 91 101 -39 -128 86 0 134 -2 184 -70 106 -278
6364b78L87O8J00k79J23k22RR1l18N90l43k72L60j18J25j9p0j0P0K04l12K37j34
6387a1K20l15M30k94J1k29K50m05L92j70J84k9J25r6p8j29L36j90K2j41J55l19
6409b81L31q8R1J39j24l8J27k48K18j02k75J19O1l4J24n2L2O2n4l78J56R0MJ71
6433E1J16k24L1J09l5j32J56k2k57J38k20L39R9k08M4j3J73j50p5j64K55K9j07
6456f7K23r4K7o4l7j10L21l19K64l04J53R3j93J2J60L7j01J00j42ok31M01o7k42
6480a86K15O8l11J18N4lN3n3k9K10m44L01r3J55J47j69j83Q6P0k39N26n1k88J0
6504c6J04k5p0n9K64J89k47k91K58rk22K53q3j40L5j49K05o6l20L33l0O7J03j10
6528d6L88m18l8J22j11j05P9K42m3j20J07o1k39J96N6O6l1j45N1J69l44L31j8
$$ plain form
6364 -278 109 177 277 -2 121 -101 -92 -1 -319 271 -72 -344 16 -102 23 4 -66 -76 -6 198 -114 123 -11
6387 -11 209 -106 324 30 41 -188 62 -343 49 -121 63 34 159 63 -15 -144 192 2 24 -117 38 -281
6409 -281 50 -38 53 192 68 30 157 -91 127 25 -250 -131 -70 -104 20 -32 0 62 8 -370 -214 -124 -120 51
6433 51 167 -57 -26 83 48 -84 72 50 -207 -69 -289 50 149 -59 -15 -28 145 -5 -80 -244 11 40 -67
6456 -67 156 62 89 25 -12 -122 199 -120 144 -160 -7 86 -107 -95 65 102 1 101 -41 -47 -278 123 56 -186
6480 -186 29 97 -214 -96 -42 -45 8 -45 -74 136 -308 -7 -100 55 202 33 -150 -64 6 -233 293 242 -46 -36
6504 -36 68 43 -27 -86 178 367 120 -171 87 78 -144 109 26 -114 -79 -228 -23 -89 -409 -76 -106 -39 64 -46
6528 -46 342 -76 -114 8 -103 -208 -129 113 70 -50 57 -4 -243 -47 9 75 44 -101 -50 119 -225 106 88
6551H8l5j4L5PN9k50J18j52N43k89k36n7M4J29R2k53P7J43K%J31j01p0J55j75
6576iJ26k56k01M24j69j4J34j75L41l14J13j18J74K2J2o4j46J49j85J79j15J23
6598C1p9r2R4N8j53J5J72j33K93j42j01j62J37J0R4r4j30J17K33L3k79K30mm07
6622b59J36R2JN6j69J68k01J30L53m79J05K4J38q2j92J75k13L14K00r9j99K61
6644B60j62Q4j37j37o5L71j64J25k69J18Q3j33R9j6O9j56j40J49P3j13K08k73
6666a26J24K0O7n8j08K02l83J27Q9l7K34j75Oj0K6J03j03o3R4P0j17o5R9j7k4
6691b5j10P5P5Rj12J20k3j26J57J02l19K33J53r1l12M52l86K48q9J87m59J53j04
6714a92O7j8l0K59j66K81l36K17j04L09m95J65j1K81l88J13K77r5q6k06j01M49
$$ plain form
6551 88 53 39 74 81 140 -110 8 -144 399 110 -126 -183 -139 -10 82 -171 -94 49 51 51 182 81 11 166 -9
6576 -9 117 -139 -340 84 -85 -99 35 -140 201 -113 0 -118 56 78 90 26 -120 29 -156 23 -92 31
6598 31 -48 -140 -46 12 -141 -126 46 -87 206 64 -37 -199 -62 -52 42 -52 -182 -65 168 201 -78 152 148 -259
6622 -259 -123 -31 -30 26 -143 25 -176 -46 307 -172 -67 -43 95 13 -179 -4 -217 97 297 198 -1 260
6644 260 98 182 45 -92 -157 214 50 175 -94 24 107 -26 73 57 126 -30 -170 -21 52 -61 147 -126
6666 -126 -2 18 85 27 -81 121 -262 -135 -46 -83 151 -24 -18 -28 -2 101 -2 -65 29 99 -18 -83 16 -1 -25
6691 -25 -135 -60 15 24 -88 32 9 -117 40 142 -177 56 209 118 -194 258 -128 120 31 218 -241 -88 -192
6714 -192 -125 -143 -173 86 -80 201 -135 82 -22 287 -208 -43 -54 227 -161 -48 229 134 48 -158 -259 190
6736A90k10l69N19k21J65o0j82J50N1j51lK66l46QO0K41l13q4J62J37op6K15j37
6760Fj44K39j45Q7p3r7K87o6k36Q9J60l47M53l86K21L6J06l51J61Q2j20L13n91
6783c16L93J70j42l2Q3k67J20Mj15j68K77j36K17j19o3m4jL35j03m51L56Q3ol7
6807C8j14rO8p5L47j38k29J57rk68M93j37M9o8L4J87l12M8Lp54O75J14n3j14Q7
6832B0o4k16j8K04k24J4L66M4q7r2K5j80L31j56m3q0L18k4J52k59j55O9J63k00
6856i2K2n4l5L87j34L22l07k88P9J50R4j43j78Q2J58j21p1R1k15M87m18N6pJ77
6880D2M0l7k5J36k06N3K5k0j13MJ23Q4j12K5O8k07J51N5n3K71k15j47J4J78j47
6905a3lj3j55K81J01l5k09p9J93R6J4m85J81J83J0j11J7j29P7k04L76J31K1m02
$$ plain form
6736 190 -20 -389 130 -91 74 14 -168 -18 33 -118 -121 145 -201 -193 -133 108 -205 -289 -127 10 4 -72 143 6
6760 6 -138 101 -44 43 -30 -127 160 94 -142 -53 107 -240 213 -173 48 84 190 -161 0 82 -38 275 -316
6783 -316 77 247 105 73 156 -111 9 13 -102 -270 7 -129 88 -31 -94 -138 -139 196 93 -358 -2 81 75 38
6807 38 -76 -85 -17 -92 255 117 -112 45 36 -232 261 124 173 105 139 326 14 62 65 -689 -14 100 47 -67 20
6832 20 -44 -260 -278 -74 -298 -284 82 126 39 -53 -28 -208 123 -33 -76 -156 162 138 290 31 -124 -55 108 -92
6856 -92 -70 -124 -159 228 94 416 109 -179 -100 50 144 1 -177 -95 63 -58 -129 -38 -253 234 -184 -128 -135 42
6880 42 82 45 20 156 -50 3 28 8 -105 -101 22 106 -6 19 87 -120 31 86 33 304 89 -58 -44 134 -13
6905 -13 -16 -29 -184 97 198 163 -46 -125 68 164 178 -307 -126 57 67 -44 -27 -156 -79 -283 93 224 245 -157
6929a57K41k44K9J68o1kq4J99k16q2L52q5j37J18J63j99n7j09J84l4k27K94k41
6952a87k63L24J39nk92L60Mk61P8J72j31J20q1q0J45p3J07p7k49L71k4J5m11K62
6976c7P2k8R2o2j37M7P1p0J8j75M77j92j24J81k6M4n00J68K66k56K40m3j71N0
7000i5l4K54n23M26j06J56j4j47J85q1k8K04k26p0L7j3j28K95k56K35q5J37R5
7023B18k69J15o0O2rl54J47Q4j9j6L60k22KJ8j15j00L0K12m12K78K21l23J91k3
7047A6O1m4r8m6J13K23l7k66Q9L5PJ14l25L58k74M95l57R3n8J0n6j1p3K70k37
7072BJ03l05J79J0J00j98j3J00n3K69j77j2k24L82l70p0K26lJ05k14L10q5m4j06
7096h8J64r8J54j25K7k33K63j09j3k9J40N4j68k28L62K31jj79k65P7J24k72P4
$$ plain form
6929 -157 84 -160 -131 37 -24 -26 -110 89 -127 -209 143 58 -79 39 202 3 -54 -163 21 -13 -240 54 -187
6952 -187 -450 -126 13 8 -284 76 80 -181 -103 69 -62 58 -23 -103 42 -31 76 -1 -250 121 97 112 -299 -37
6976 -37 35 7 99 37 -100 -53 18 -52 -34 -209 268 76 -48 133 107 151 -349 -181 85 -171 69 26 -145 -95
7000 -95 -129 125 -398 28 -78 78 64 -83 102 21 -7 197 -29 -99 -62 -75 -203 92 -164 71 -14 123 218
7023 218 -51 64 4 66 57 -297 -150 -66 -85 -101 259 37 39 57 -58 -158 -128 84 -328 -50 171 -152 39 16
7047 16 77 33 -65 -111 2 225 188 -78 11 46 53 167 -158 200 -74 421 64 157 99 109 53 42 -31 239 2
7072 2 105 -200 -21 -11 89 -109 -122 -22 -75 194 17 5 -219 163 -207 -277 -51 -54 51 -163 147 62 18 -88
7096 -88 76 -22 132 7 34 -199 64 -45 -58 -87 53 107 -61 -289 73 304 303 124 -141 -64 60 -212 -138
7119a38K83nj06o8K7Q3j74J49k64J59J84l25L10rm19J71J4K41P5j44J16p5j84
7142i9o4K32k78M67k05l28R2J28P1O5J93l94q0K92K4k6o6O1k69l2K22J29k08K4
7166d9o8K19J66m96K67j36j4L45k41P1l1J0M59m36j1J18m66K36J05O7p9P8L5K0
7190A69k43J20J41J2k18J0Q0p3K14j07l12oJ33M01l80K11j77j66K83Q4j60J31
7212A47j76l9k3J00k0j20J59j84j0K97j84J63N0l83K91k14K05K16l23L8N6k87
7234b41J30o6N5O8R5N6j73O3r9N7P4j25K1J76j17j21k4J04L8R5Qj26J70n23M10
7259El57L51J8J21q5j03r2j05K83N0m06K55RK24mJ0j21N8M0j21J5r2P7k30L34
7284A34j12o5m46O05l05j31K81J48Jm38L99Q3l49L71k76J18k16K90j55N3j85L30
$$ plain form
7119 -138 145 140 34 -34 -7 76 -98 51 -213 -54 130 -195 115 106 -313 -142 -128 113 188 44 160 85 -99
7142 -99 -163 69 -209 258 53 -275 -183 -55 16 81 274 -120 -200 92 116 90 24 85 -184 -216 6 135 -73 -49
7166 -49 -117 102 268 -228 39 -97 -111 234 -7 64 33 43 502 66 55 173 -293 -57 48 115 36 114 149 169
7190 169 -74 46 187 199 -19 -9 71 -2 212 105 -207 -213 -80 321 -59 152 -25 -191 92 176 16 147
7212 147 -29 -68 -91 9 -11 -131 28 -156 -166 131 -53 110 160 -223 68 -146 59 275 -48 -10 46 -241
7234 -241 -111 -177 -122 -54 41 97 -76 -13 -112 -55 19 -106 -85 91 -26 -147 -171 -67 -29 66 74 -52 118 -405 5
7259 5 -352 -1 17 138 53 -50 -142 -247 36 86 -320 -65 -56 168 164 174 53 111 151 30 45 -47 30 -200 134
7284 134 22 -43 -489 116 -189 -320 -39 109 110 -328 71 154 -195 176 -100 18 -198 92 -63 -10 -195 135
7306A35m23K89p2K4k5l4J35q4k68N07k71J7j2j2J46k12K05q1p0K30L9n8n4m3K52
7331B60k95N3n4R5k1m6k02J62j07K07o3K14l70q1K90j89J14L6k39L65q4k7k63
7354b45M30j18m8J25k91O2K06k61L90k90L6J68j50J1l80K68J07J22Q0j89n4L4
7376A3N7j45K08o5J5o2k02K67m1j46j17K64l31L20r3k4q5K76L9o0Mq5m6N5j95
7401a79J53J91k42p5P6mq2j4K37Nj60J36o0J17k31K48K1n3k9J63r5L8p5Oj15N0
7427B7r0k4J39l54j4L31m6K65j82M7M4j53J21P7Nk81OJ40r8j67m5J03J78m7J31
7452A13p6o5k19K75l0j06J14M0l1p8L5M8r9K72M1j91K98m09J58l3p2J71l33M80
7476C03n70K98k57L22k33K0J72n5L29j25l38m2K76p6K7J10j12K4J70o59N32q5
$$ plain form
7306 135 -288 1 -71 -47 -72 -106 29 -55 -323 184 -87 -70 -82 -94 52 -160 45 -36 -106 124 163 105 51 8 260
7331 260 -35 18 -36 59 38 -8 -210 -48 -155 52 -11 203 -167 -248 42 -147 -33 3 -236 129 45 18 -245
7354 -245 185 67 19 144 -147 -85 121 -140 250 -40 -4 164 14 25 -355 -87 20 142 222 33 -21 13
7376 13 70 -75 133 68 83 21 -181 86 45 -101 -218 46 -285 35 -58 -82 -167 109 148 88 92 7 -39 16 -179
7401 -179 -26 165 -77 -152 -76 -80 -162 -176 61 66 -94 42 -18 99 -132 116 137 84 55 218 123 161 86 92 -23 27
7427 27 -63 -87 52 -302 -316 15 -31 234 52 99 143 -10 111 188 193 -88 -82 58 -40 -207 -252 -149 29 -18 113
7452 113 37 -28 -247 28 -2 -108 6 46 15 -63 -28 20 -79 193 234 43 341 -68 90 57 -15 156 -177 303
7476 303 -267 31 -226 96 -137 -117 55 0 329 204 -134 -176 100 24 51 161 49 73 243 -416 116 31
7498C1j7J05j20N0K08m13Q3m8K65j06j37j3J04j45J35l50J98k5J20K76k51J15
7520F5l29L63m02M29q6K10l73J19p4j5K33k45M7j66O06m60J3K09j63K2Q7J20j30
7543H0k39L01j65M6J83j18j73R1j34K72k08l4qJ29p0R9j30oK3q5L63l34J01O8
7567E2m6j46K66m57K09R6P5J49J23k04k4J42l93L02m8k03Q3K09l63K72j21o9n5
7590a51J13p8J91J84k65L8q3o9J39Rj61Q9M6J21L4k00jO5L8j16R4j36J75p4J46
7615A48j67J0J77r2k97P1K48k03R1O0J23Mk30m9J40J01j04l7r4OJ21l0r9K8K8
7640d6o4J81j26j4K41j65K15K6j48j38J0rj6j23K85j76K7k5k22J38J6K18j34j48
7664a97Q6m3K25R4k66j00J27mK86k2m02J47J20K14k32J90l7J00m19R3J01k87L24
$$ plain form
7498 31 14 119 -1 49 257 -156 -73 -121 144 38 -99 -112 -8 -153 -18 -368 -170 -195 -75 201 -50 65
7520 65 -264 99 -303 126 40 250 -123 -4 -78 -93 140 -105 -58 -224 382 -78 -65 144 -19 3 90 210 80
7543 80 -159 142 -23 23 206 88 -85 6 -128 144 -64 -98 -106 23 -47 52 -78 -84 -61 -146 217 -117 -16 52
7567 52 6 -140 126 -331 -122 -26 49 198 321 117 93 235 -158 144 96 -107 -24 185 -178 94 -27 -96 -151
7590 -151 -38 -116 75 259 -6 32 -51 -120 19 28 -133 -44 2 123 157 -43 -44 21 59 -57 37 -99 76 2 148
7615 148 -19 -9 168 76 -221 -150 98 -105 -14 46 169 173 -57 -106 34 135 31 -6 -100 -94 27 -3 -102 -74 -46
7640 -46 -110 71 -55 -69 172 7 222 248 100 -38 -28 -37 -53 -176 109 -67 -40 -65 -287 -149 -133 85 -49 -197
7664 -197 -111 -154 71 165 -101 -201 -74 -78 208 186 -216 -69 51 265 33 223 186 286 -133 -40 61 -226 98
7687I8j1j34L0K96k80P9J85k24j70L18j10o3j30L53m1p5j08j61J07P6k6J14j58
7710c5J07j85J63Rk28K13j10L9o0R1n2j37L9m4J27J86r1o3L6j22j2R7j58K22n
7735B7O0j05R0o1J45k51p9L00k62L89l10k5M1K9nQ2J63l32K71j71k5K10J6k77
7759h0L9J2P4M7n3k85K47Oj72J03J58P8j74J12O1j33k9J93P0m12M0K98j77r4J84
7784A13K1q8p8l3K7K58j36Q9k21M2j04k4J82N1j18L9J4J53q5M0k1J9k75j47L86
7809A04j88jR6k16M20k03O9K2l8j5n6J54k26P5K30k31J44o6k41L55o3j31J05J5
7833A14Q3j59l8k09J15K24j96P8o1k9l8K35j66J01M8j49J56j85L9n6K24j70M6
7856GJ92q2l30J31j32L35jj10m6K7K82k90N8m0J50k35nj11M09k26N0p0O7l28L01
$$ plain form
7687 98 87 -47 -17 279 -1 78 263 39 -131 187 77 14 -116 237 196 121 13 -148 -41 35 9 123 -35
7710 -35 72 -113 50 59 -169 44 -66 -27 -87 4 -48 -185 -146 -190 -63 123 32 -31 5 -117 -129 -32 -190 32 27
7735 27 87 -18 72 11 156 -95 -174 126 -136 253 -57 -82 -41 -12 -17 65 228 -104 167 -4 -29 181 197 -80
7759 -80 -41 -29 45 92 39 -246 1 7 -165 -62 96 174 0 112 173 40 11 204 274 -138 -98 200 23 -71 113
7784 113 134 46 -32 -65 -38 220 84 173 -48 -6 -110 -134 48 99 -19 20 34 187 102 142 121 140 -135 -282 104
7809 104 -84 -85 11 -205 215 12 81 103 65 50 -6 148 -78 -3 227 -4 140 74 -167 188 125 -6 99 114
7833 114 197 38 0 -209 -94 130 -66 12 -49 -78 -116 119 -47 54 102 -47 109 -76 -37 -93 131 -39 7
7856 7 199 117 -213 -82 -214 121 120 10 -36 -9 273 -17 41 1 151 -84 -89 -200 209 -17 33 -37 30 -298 3
7881Co1r9j3K40K6m07L77m1k17M3l5K5K16j25J23j8J0K42m94M37m16J98Q9k13
7905a10N8o2q3J79K59M9j82k71K75j1m5r2K81k40j80J97K06l77L52k85J48j71
7927a05J57j48J55n7J50J8m08L09n8q7M3J1n1L09j15k28j3m7J25J17P9j27P6j11
7951fJ89k91J62p6K55m08K32k44qM22q9o9kp2j0Kl5M13k13j76N5Q3k8q3qj24K13
7978H4j81R3j89L09j30J05R6k75q9P0Q2O6j07j0J4M5P3j54J93l99J94N5K38j88
8002ej03p9K36L1j97J87m1r0J91K1qj66J87p8J11o4j57Q6n4o1K6j0k23L74j8l08
8028b12J20K53j3j80J44P1l6j38j3k3k09J59j1K59q9k80J78K67j45j17P7j39r0
8051a67K0J26J21k45J54J16l80K50K00m92K00o5l3K35q9Lmj51L82j14k37K9J27
$$ plain form
7881 3 -58 -157 -170 70 96 -311 66 25 -192 -149 -184 -159 57 -68 55 37 47 289 -205 232 -184 14 103 -110
7905 -110 -52 -114 -197 -18 241 290 108 -163 112 101 56 -36 245 5 -175 22 228 -149 203 -82 66 -105
7927 -105 52 -96 59 2 152 170 -238 71 13 -74 -31 -20 -71 238 123 -105 -118 -165 -40 77 156 29 105 -6
7951 -6 183 -108 54 -22 233 -175 57 -187 -195 227 138 69 67 -5 -15 -13 -48 365 152 -24 31 114 86 3 -5 -129 84
7978 84 -97 -4 -193 116 -14 91 187 -88 -177 -107 -25 41 -66 -76 -62 -17 56 -98 95 -304 -110 -55 183 -5
8002 -5 -108 -187 49 80 -117 70 29 -61 130 151 143 -23 164 86 197 133 -24 62 8 -53 -27 -37 -260 114 96 -212
8028 -212 -92 161 148 -32 112 183 147 9 -4 -27 -236 -77 -88 171 82 -198 -20 247 102 -15 62 -77 -167
8051 -167 -147 -21 100 -145 9 125 -255 -5 195 -297 -97 -162 -195 40 -49 -46 -50 -201 181 67 -170 -141 -14
8074a4J3J26k36L83l35P6j29j28K41J26l46K23J84l31J82J18l45N3J22J06r2L50
8096C47l79m0J05K8j47P1J18r7j98R0J61j89R4J37j00J80k77j11K36P5Rj31K45
8119B27j30k5k05L60j19J43k02j76J47j44m5J25r4K84j33k2J86j24J95k45j0l42
8141c49K09J80r2K36k26m9J9m0j11R7m1L37k21qj12L45j24P4k91J56N6j04J17
8164E8j02J92l11OJ15l0K64p1j83J1l3K64k26K86j09p9j13n7L01j08q0L81p14
8187c38M50J6j92k7
$$ plain form
8074 -14 -1 125 -111 272 -63 13 -116 -244 -3 123 -223 0 184 -147 35 153 -192 -139 -17 89 -3 347
8096 347 -32 -72 33 61 -86 -15 103 6 -192 -102 59 -130 -36 101 1 181 -96 -207 29 104 113 -18 227
8119 227 97 72 -133 227 108 251 49 -127 20 -124 -169 -44 -138 146 13 -9 177 53 248 3 -7 -349
8141 -349 -140 40 -52 184 -42 -91 -72 -112 -223 -126 -167 170 -51 -59 -171 174 50 124 -167 -11 45 -59 58
8164 58 -44 148 -163 -157 -42 -72 192 121 -62 -51 -84 180 -46 240 131 52 -61 -118 183 75 -5 376 -338
8187 -338 112 128 -64 -91
8191i1
$$ Imaginary data points
##PAGE= N=2
##DATA TABLE= (X++(I..I)), XYDATA
0@%%%%%%%%%%%%%%Qj6J6j6J7k5L2l9M7n5O3p2Q7j02J18j34J51j70J93k22K52k83
36a50L17l56L98m42M93n49O09o76P48q27R13j006J110j226J352j487J640j809
54i48J995k207K447k720L036l406L846m380N044n896P033q639J1097j5365K4878
69A5815q7515K9868R3241j13857K4891O2600o3048m6266Q7229O961m7650J5073
81b2658K6000k6489J424J3050k724O036K4438n417k2709m207J3192p083M48K8138
95B1439n406m1547K2146M1364l5002k2843L7366j6019k9285M5739J0739n2702
107b4011J2677K8554l0964J1704L8948l9979k3986M1510j3938l5842L7378K0879
119B2930l2358O388J9831l0030j6637K6905J4159r051p920n134o231j126J6140
$$ plain form
0 0 0 0 0 0 0 0 0 0 0 0 0 0 0 0 8 -8 8 -8 9 -16 16 -23 24 -31 32 -40 47 -55 63 -71 80 -90 103 -119 133 -150
36 -150 167 -189 209 -233 260 -289 320 -356 392 -435 478 -528 582 -644 708 -779 861 -948
54 -948 1047 -1160 1287 -1433 1603 -1803 2043 -2337 2707 -3189 3844 -4795 6302 -9063 15815
69 15815 -71700 -41832 51409 -62448 -37557 25043 -38005 -84271 2958 9919 -37731 -22658
81 -22658 3342 -23147 -21723 -8673 -11397 -5361 19077 13660 -9049 -13256 -64 -7147 -6699 21439
95 21439 16033 -25514 -3368 37996 2994 -19849 17517 1498 -27787 17952 28691 -24011
107 -24011 -11334 17220 -13744 -2040 36908 -3071 -27057 14453 515 -35327 2051 22930
119 22930 -9428 -3040 16791 -13239 -29876 -2971 11188 2137 -5783 -10917 -17148 -18274 -2134
132b134J6187j0283j3869P082n113r032J8871N385j9408J2912J6250k3682m665
145a1499K4327q155j0596J6839o589j7402J1742N705n771Q764o149j5385J6293
158B124P789k2530K712J2794j9546l005K7113k543j9875O169P170q384k36P697
172b551K191m091m229L958N042m534L780J1905l842r309K346j463l05J0997R47
187A0842p147M476j900q276J2128O881j4988J052Q574j2343r80J5227m183q285
201A078R770k396r972P303L890q270K420L320p309N98P422k355k322K294l093
216B378m632Q59J455N84o96j121K88k549j359N127R54o418J072J777o155K377
232f059Q242n662l838Q960l77n872O321O33q414L918P075n323O07M952m315q46
$$ plain form
132 -2134 14053 3770 -10099 -3017 -8130 -17162 1709 7094 -12314 598 16848 -6834 -11499
145 -11499 12828 4673 -5923 10916 4327 -13075 -1333 4372 -1399 7365 1216 -14169 2124
158 2124 9913 -12617 -9905 2889 -16657 -19662 7451 4908 -14967 -8798 -1628 -10012 -10248 -2551
172 -2551 -360 -4451 -8680 -4722 320 -4214 -434 11471 7629 -1680 666 -797 -1102 9895 10842
187 10842 3695 8171 6271 -2005 10123 17004 2016 3068 11642 -701 -1681 13546 9363 1078
201 1078 10848 8452 -1520 5783 9673 1403 3823 7143 -166 432 7854 5499 3177 5471 2378
216 2378 -2254 -1395 60 644 -52 -1173 -885 -3434 -4793 334 1288 -5130 -4058 -2281 -8436 -6059
232 -6059 2183 -3479 -7317 1643 1266 -4606 1715 2348 -6066 -2148 4927 -396 211 5163 848 2
248BO229l366m348N127P96m794P79M02m016K145O202J95n151l180m81K22J252
265a985L915J61m861J52L941j137k731M238Q96k771K951j90o959J028O824N12
281C984K13J642o322m416O389J779m069J544Q96l432J735L167m979k509N165K647
297C434j666j106k838l367K647O496J498l112j720K39J28j25R57j060k36L030
313C199K063m335l129P31R92L222L969m581p275J038K685%K393J250m314m61M019
330A466k870l765J947K528J177K096j227o071p06N096L212l8j088l064k347J487
346b167K062n76q35J330J526q02j817k364j811K040N175O72m605j918j79N78L605
363h6K981k908j847K470k08j833O44J014L74L825K195m049l655N64J608K663K100
$$ plain form
248 2 6231 2865 -1483 3644 4440 -354 425 827 -3189 -1044 5158 5353 202 -2978 -3459 -3237 -1985
265 -1985 1930 2091 -2770 -2618 1323 186 -2545 1693 2589 -182 2769 2579 -4380 -3352 3472 3984
281 3984 4197 5839 -483 -4899 1490 3269 -800 744 1640 -1792 -57 3110 -1869 -4378 787 3434
297 3434 1768 662 -2176 -5543 -2896 3600 5098 1986 266 505 633 508 1465 405 169 3199
313 3199 5262 927 -2202 -1471 -479 2743 6712 2131 -5144 -4106 -1421 -1421 972 2222 -2092 -2553 1466
330 1466 -1404 -5169 -3222 -694 483 2579 1352 -4719 -5425 -329 2883 2845 1757 -1307 -3654 -2167
346 -2167 -105 -681 -1516 -186 1340 538 -1279 -3643 -5454 -3414 1761 2433 -2172 -4090 -4269 -3691 -86
363 -86 2895 -13 -1860 610 402 -1431 -787 227 601 4426 6621 2572 -1083 -519 1089 3752 5852
380E852k101l647n57J399P14L39l18m86R7q5j682k602m05L019L065P7k181k342
398a844j600J823L687j10k132L41j3m27J451J71j821J218L015j245j923j318j063
415a790Q45L218O02j840q45j036k15J247j59j044R84J013j113l57j218o91K376
432b3J802j35j258k127j790K009K330j37n98n87j528j66P66m13k41P98n83n66
450b447j08j542L28K753k85j025K69q09q68K224J519q74j60R15J7J685J140j215
468A517M48O44m92O35K050p33r47Q53l24J03P79n72j56j87j391j222J642n0r07
487A690M72o67j391j76j34K80Q99j176j884J170K64j764K510J629l401j646K254
504a071l55q34K051l33k067l78M28J104J723r83j581M57n51r72K145J305j000
$$ plain form
380 5852 3751 104 -453 946 1660 1999 1681 1195 1292 1207 -475 -3077 -3482 -463 2602 2679 498 -1844
398 -1844 -3444 -1621 2066 1956 -176 165 152 -275 1176 1347 -474 744 3759 2514 591 -727 -1790
415 -1790 -945 2273 2875 1035 190 -846 -1061 186 27 -1017 -33 980 -133 -490 -1708 -2399 -23
432 -23 1779 1644 386 -1741 -3531 -1522 808 671 73 -514 -2042 -2208 -1442 -1855 -2096 -1298 -1881 -2447
450 -2447 -2555 -4097 -3769 -1016 -1301 -2326 -2057 -2866 -3734 -1510 9 -865 -1025 -110 -93 1592 2732 1517
468 1517 1965 2609 2117 2752 4802 4069 3122 3975 3651 3754 4533 3961 3805 3618 2227 1005 2647 2597 1690
487 1690 2162 1495 104 -72 -206 74 973 -203 -2087 -917 -653 -2417 93 1722 -1679 -3325 -1071
504 -1071 -1426 -2260 -209 -542 -2609 -2987 -2559 -1455 268 -715 -2296 -1839 -2390 -3362 -1217 88 -912
521i12p7J57j269L66J226R53J563n46k933l82K406Q15M38J282j670j975N31P31
539G04J208O5k161o39K353j217j920K165l9l118J402J884k225j027J904J69q49
556a341j36q7J473J486r39p08J63j521J403L702R58k298j631m42O56K731O06q78
574C197N0j737k007K270J176j748J372P09j990j944r96J10K888J426k535j401
590a160l09j719J125L837j179l745O49J198r15O18R2j078L33P16Oj64q75j729
608d299J710J364j304m2Q36n44j2L96r36L65J506O45O32l51k884m80L894K046
626B542kn22j542j875J893J834N43M91p44j833P55L97j503R87K476j276j217q59
644E45j613k77K515J142j502r79j998K95J742M89j154j45p8l80J448Q9j500J96
$$ plain form
521 -912 -989 -832 -2101 -1735 -509 444 2007 1461 -1472 -1854 552 1367 1805 3087 1417 -558 -27 704
539 704 1912 1977 -184 -823 1530 313 -1607 558 519 -2599 -1197 687 -1538 -2565 -661 -492 -1341
556 -1341 -1477 -1564 -91 1395 456 -252 -89 -1610 -207 3495 4453 2155 524 82 738 3469 4075 3197
574 3197 3247 1510 -497 1773 2949 1201 2573 3282 1292 -652 -1648 -1538 1350 2776 241 -1160
590 -1160 -1469 -3188 -2063 1774 595 -3150 -2501 -1303 -2218 -1600 -1508 -2586 -2253 -1537 -1531 -1695 -2570 -4299
608 -4299 -2589 -1225 -2529 -2571 -1735 -2279 -2291 -1895 -2831 -2466 -960 -315 317 -34 -2918 -3398 496 2542
626 2542 2540 2018 476 -1399 494 2328 2871 3362 2618 785 1540 1937 434 1421 3897 2621 1404 545
644 545 -1068 -1345 1170 2312 810 -169 -2167 -1872 -130 359 -795 -940 -1018 -1398 50 139 -1361 -1165
662a165Q25J72J181m03j580P05R62j034N65R36j211L03J090k005r45P42J090M36
680F64J350k328k279O71J262R52J131p31k278n2Q41j78J094P19j007K63O3j187
698a030k39J280M40q3K9j647p60Q15N70Q45m1j428p11R67K96l41P26n08o85J152
718c53O29j464R84L20o26P66J249p86l19J012l64p46P17L98k08O76l07p61M0p16
738A41L31J149k84q86k82l13n10P59M13n39k81n56j16O94K22l22M26N3j057K42
758g16P43m46K05N10m84j77M66k87r5J011n33r46L67M64q04K16M49m64n52O3K16
779g94L18j62k69j42K50j90P61J87j41k48J89j44K7N83k02j21M48j55l6N44o73
800C0n28P88K34p60J48K27q64K64M69n33m58P09p1K35n8p93j52J200M30n05k32
$$ plain form
662 -1165 -340 -168 1013 610 -970 -265 697 -337 228 1164 -47 256 1346 -659 -1604 -862 228 664
680 664 2014 -314 -2593 -1922 -660 292 1423 692 -1586 -1638 -797 -975 119 838 -169 94 157 -1030
698 -1030 -1269 11 451 368 397 -1250 -2010 -1195 -625 220 179 -1249 -1960 -993 -697 -1038 -312 -820 -1505 -353
718 -353 276 -1188 -204 116 -510 256 1505 719 400 1412 1048 302 1019 1417 1209 1885 1578 817 857 141
738 141 472 1621 1337 451 169 -144 -654 105 518 -21 -302 -858 -974 -280 -58 -380 46 99 -958 -716
758 -716 27 -419 -214 296 -188 -365 101 -186 -281 730 197 -749 -382 82 -722 -506 -57 -521 -1073 -1010 -794
779 -794 -476 -638 -907 -1049 -799 -989 -228 -41 -182 -430 -241 -385 -358 225 23 -98 350 195 159 703 30
800 30 -498 290 524 -236 -88 139 -725 -461 8 -525 -983 -274 -345 -110 -168 -961 -1113 87 517 12 -220
821b20O5l82O22N23K4j72Jq5J91m95m39O52M99j6j19l48j340M11Q25j76J31o8
843H4n60l59J092l37k77N69O7J18K12k85o57O81M93M23K0m28p34r7P07P93q91
864F34K4o6j80Q1l79p30K79K90K78J11j222o87nM56P58L16p98l96rL31n2L86Q2
887d98k20Q05n0q91M2J40Q17L45N34r56p90N98J09J13M04j21o06K80J12l74j27
908c34K19M45M58R0p34n19M88M72L28J2m96k21M0K63L18l08j24J38M84l30p07
929a8k00j65N08P10l25q14m88j06J40M66N7n61K76j2l90J74R4q3M17J044n38n21
951c35k36K35L15O42J16p36q3j3nM77m70RL27J4n63k82J90m95M83K28j99l15k94
974i90m31N95J05m31k35O91k58l13L68k7l06O05K57j99%k70m09M94O72l66K15
$$ plain form
821 -220 -155 -537 85 608 632 460 461 376 567 72 -367 285 784 768 649 301 -1039 -628 197 21 152 84
843 84 -476 -835 257 -80 -357 212 279 397 609 324 -333 348 841 1264 1284 856 122 25 732 1525 634
864 634 658 592 412 493 114 -616 -337 -47 231 342 -880 -1567 -1572 -1116 -358 -42 -840 -1236 -1245 -914 -966 -580 -498
887 -498 -718 87 37 -854 -812 -672 145 490 1024 68 -722 -124 -15 98 502 381 -225 55 167 -207 -334
908 -334 -115 330 788 878 144 -375 113 585 913 925 429 208 248 511 829 521 397 535 1019 689 -18
929 -18 -218 -383 125 835 510 -304 -792 -898 -758 -292 -235 -796 -520 -532 -922 -748 -654 -737 -320 724 186 -335
951 -335 -571 -336 -21 621 737 1 -82 -95 -100 377 -93 -84 243 257 -306 -588 -398 -893 -410 -182 -381 -696 -990
974 -990 -1421 -826 -721 -1152 -1387 -696 -954 -1267 -899 -926 -1232 -627 -370 -569 -569 -839 -1248 -754 -82 -448 -233
995b33j56k25j46O66j10J66j27j57J43l6k15O88K80j38j32M2k67j09P53n1j69
1016D67j31M4m3N71l18k42Q8J40r19N26M9o62K77J27m88j34J23k46q7L07q03k26
1038a580O58j37p4L72j56o23M07L75m3L60mm9K15j15M1L58L06m91l9M60o17M08
1060C2K48l1j23j58k39J81N16m31m59N83p30L56L26l5k51M04k21n19N01K37k11
1081b4N17j11n88l45Q17K65j89M10q58o00O03K61K18K27p62L77r8k90R6L65J87
1102D78m08L48k62m83P13O0k89N35j89k94K83P51o07P7R6l44J56M09o5m44k16
1123C05j11k54O30R0n60L1k34n02L22J98k14J63k8n08Ok1J17N43L85o59n7k32
1145e90j59O77P34m76l12J6J52j84M54K93n30K79p5k15J00R8j41J62K48l92k62
$$ plain form
995 -233 -389 -614 -760 -94 -204 -38 -165 -322 -179 -215 -430 258 538 400 268 310 43 -66 687 636 467
1016 467 336 380 337 908 590 348 436 576 -343 183 232 -430 -153 -26 -514 -648 -525 -771 -858 -551 -1354 -1580
1038 -1580 -922 -1059 -1133 -761 -917 -1540 -1133 -758 -801 -441 -445 -494 -279 -394 -353 5 311 -180 -219 241 -376 32
1060 32 280 249 126 -32 -271 -90 426 -5 -464 119 -611 -255 71 36 -215 189 -32 -551 -50 187 -24
1081 -24 493 382 -206 -551 266 531 342 752 -106 -706 -103 158 376 603 -159 218 120 -170 -74 291 478
1102 478 70 418 156 -327 386 446 157 692 503 209 492 1243 636 713 809 465 621 1030 965 521 305
1123 305 194 -60 570 660 100 131 -103 -605 -283 -85 -299 -136 -164 -672 -666 -687 -570 -27 358 -301 -358 -590
1145 -590 -749 -72 662 186 -126 -110 42 -142 312 605 75 354 279 64 164 262 121 283 531 139 -123
1166a23J57j74L82O5k50j38M81k20L02r5j99k54O54J58l74L18n41m14P69r2J36
1187E48k40j95l80j30L24l50O31l5p1j68k99l85L62O55k34l2j81l84M8L95L04
1208A83j2k24j01L8M00j01j46K22L1k45K13k06j43l3M18q3j14j57q6%K72p21J76
1231d19K91l44M04L1m50j61M35k54K62M93l38l16L43o1j2L51j7j37l02K74j38
1252f5j4L79k0n0m19k33K47M3q4J14J78m05j88L20P1j8O9j3j67K70J93k18r7K85
1276A78J90p2o7j24k12N74r2L3j94k84J06O9j1q4J84m54J76R1j46M9J28mj30K86
1300A90l64j5R1o8L65k81k96M98j41K60m83R9LK66k26K02p3%N1j46o5P1r6K00
1324D2k11K10k65p8M45l74j39M56J19k36l5k57M22k2k24J42j7K31J26n5l6j33
$$ plain form
1166 -123 34 -140 242 307 57 -81 400 180 482 387 188 -66 588 746 372 690 149 -265 504 412 548
1187 548 308 113 -267 -397 -73 -423 208 173 102 -66 -365 -750 -388 267 33 1 -180 -564 -516 -121 183
1208 183 171 -53 -154 -116 284 183 37 259 290 45 258 52 -91 -124 294 211 97 -60 -146 -146 126 -595 -419
1231 -419 -128 -472 -68 -37 -487 -648 -213 -467 -205 288 -50 -366 -23 -84 -96 255 238 101 -201 73 -65
1252 -65 -79 300 280 230 -189 -422 -175 -132 -216 -102 76 -329 -517 -197 -126 -144 -75 -88 -255 15 208 -10 -107 178
1276 178 368 296 229 105 -107 467 375 408 214 -70 36 105 94 10 194 -260 -84 7 -139 -90 38 34 -96 190
1300 190 -174 -189 -98 -166 199 -82 -378 120 -21 239 -244 -145 -142 124 -102 100 27 27 78 -68 -133 -62 -158 42
1324 42 -169 41 -224 -302 143 -231 -370 86 205 -31 -66 -323 99 77 -147 -5 -22 209 335 280 244 111
1346A11K8K99l63P6O5j22npj38p9l4K1P3K3r7m8L16j89o6K37l16K92k2J8j41L86
1372C18l12P4L09k96J50m6J14j15P5mR4K1n11J35J87j0N3j24L2k67m1K84J49k88
1396a9J12j94P6j1J79q8J59k19J4J22j32j48L38j47J77j47m30K44n6L20j56M6
1418D0Q6m58J16kL87n70J02J65K10k35l57K75O0J44K32k11L68m36K7J82j4n0J13
1441A74M6q3J48J6l12K13J15%M2j97l5p5j03J22L01n94M6J98j71m6L05j51j2L9
1465a4j50J22k4n5K35j19K81m83o7J78J01R9k87K79K40j73j82j17l9J53j19K05
1487F4O4k1k63M2j12L93k8L8k19%L2o8L49m03L57j53m6P6m3Q9j14j80P7Q5J12
1512A28j05k99K61Jj57j53J8lL0O7o4nJ97jj03J54J3j62K81r8j40J77l9L8K25
$$ plain form
1346 111 139 438 75 151 216 94 89 82 -56 -135 -169 -148 -75 -52 -149 -197 119 -70 -136 101 -215 77 55 73 -68 318
1372 318 6 80 389 93 243 197 311 196 271 267 361 382 -129 6 193 183 236 112 144 -123 -164 120 269 -19
1396 -19 93 -101 -25 -36 143 55 214 -5 9 131 -1 -149 189 42 219 72 -358 -114 -170 150 -6 40
1418 40 126 -332 -216 -218 169 -401 -299 -134 76 -159 -516 -241 -181 -37 195 -16 352 -84 -57 125 111 61 174
1441 174 220 137 285 301 -11 202 317 317 359 162 127 52 -51 71 372 -222 -176 22 -149 -195 110 -41 -53 -14
1465 -14 -164 -42 -66 -121 114 -5 276 -207 -274 -96 5 104 -183 96 336 163 -19 -136 -175 -22 -141 64
1487 64 128 107 -156 -114 -226 167 139 177 -42 -42 -10 -78 271 -132 225 72 26 102 59 148 34 -146 -69 16 128
1512 128 23 -276 -15 -14 -171 -324 -306 -309 -279 -212 -276 -281 -84 -85 -188 -34 -21 -183 98 0 -140 37 -2 36 261
1537B61j82J99j27P0J9n6K9p5j30K92o0K0j99J6K23j19k45K46j7r7l21M62k86
1560g7o2J00K0j92K38P5q6N0j18j00J84m8M9M5j84J27j00K4O5j56q9lL82k0l56
1585b32j8q5N53l4l54j49K11R4R9l61K18K26l58K89L9j16K36J0n02Q7J82K0L20
1608C75l11K7l3q1j64O0Q6j92J17R4l2n5j0J72o0l68K68j02J95r4K95l32J36p8
1632h7M7K30k00l9J18m46L09J45l2R4K9k69R1J99j77k0J77pj53O5m79Q8J53K24
1656F0l17K8K24oj07P0J03j47j65R3J62J46L7j72J21k96J34J13jk44J15J24k9
1679D6N1j29j92o7L79n46L71j02J97k86K30m0k5J62k73K43J2j07J74k23J0R4J81
1702A60j39J94k61j96L31R0J2l36J26k5j45J01Pj7j36Q3J00J1oj58O9K0m2P8J34
$$ plain form
1537 261 79 278 151 221 240 184 213 138 8 300 240 260 61 77 300 181 -64 182 165 68 -253 209 -77
1560 -77 -139 -39 -19 -211 27 102 16 66 -52 -152 32 -16 33 78 -106 21 -79 -55 10 -146 -235 -238 144 124 -232
1585 -232 -250 -335 218 184 -170 -319 -108 -14 85 -276 -58 168 -190 99 138 22 258 268 -234 -147 35 55 375
1608 375 64 91 58 -23 -187 -127 -41 -233 -116 -22 -54 -109 -119 53 -7 -375 -107 -209 -14 -108 187 -145 -9 -87
1632 -87 -40 190 -10 -49 69 -377 -68 77 45 139 168 -101 -10 189 12 -8 169 162 9 74 -405 -317 -164 60
1656 60 -257 -229 -5 -11 -118 -48 55 -92 -257 -164 -2 144 181 9 130 -166 -32 81 80 -164 -49 75 46
1679 46 97 -32 -224 -291 88 -458 -87 -189 8 -278 -48 -88 -113 49 -224 19 31 -76 98 -125 -115 -21 160
1702 160 21 215 -46 -242 89 179 191 -145 -19 -44 -189 -88 -81 -98 -234 -151 -51 -40 -46 -204 -135 -115 -157 -79 55
1727E5l5k25M00j14k42L38K6N3l57L80k79q5J3m9Q8jj14P0J49j79J65P0k27O3
1751c7q5k17J97L02J15j91P2k23j87K70M9O6K52m48J16j34J29q0J89k39mJ14K4
1774E0o4P2j1L41m86J8p9J52o0m2k70M52o2N5R6j97j76J88k92K07J16J58j97J73
1798A42k90j42M43J51k82m9J37j57J8N3L1k55K08j72J03N1Q2n0J88j33K25k63
1820C9O9k5L71n38j06L25kL8J55j35j46J43j68J86l45O4j24K30J66l11N2N2j10
1843a20K6J96m90K47N18m47M36l64q6j54N1R6q2K10J26k41J17p5N2O0r5n0J60
1866I1K3p2n1P3M8j75l8O2j2J5O1j93J26M8P3K4j75P4j2J11k8K51j90r5r2J96
1892A43k7j71J44j60K90j82M2j22K07k22K24k14O0J3l17M4L76q8Jp2k08K56o5
$$ plain form
1727 55 20 -205 195 81 -161 177 203 256 -101 279 0 -85 -72 -121 -33 -34 -148 -78 71 -108 57 127 -100 -37
1751 -37 -122 -339 -142 160 275 84 156 -67 -254 16 65 131 383 -65 51 -83 46 -34 155 -84 -88 26 50
1774 50 -14 58 47 388 -98 -80 -159 -7 -67 -109 -379 73 11 66 162 -35 -211 -23 -315 -108 8 166 -31 142
1798 142 -148 -290 153 304 22 -27 110 -47 -29 24 55 -200 8 -164 -61 -10 72 22 210 77 302 39
1820 39 108 83 454 -84 -190 135 133 171 326 191 45 188 20 206 -139 -75 -199 31 197 -114 -62 -10 -120
1843 -120 -94 102 -388 -141 377 -70 366 2 -84 -238 -187 -91 -173 37 163 -78 39 -36 16 76 -19 -69 91
1866 91 114 42 -9 64 112 -63 -101 -39 -51 -36 25 -168 -42 6 79 103 -72 2 -10 101 73 324 134 39 -53 143
1892 143 116 -55 89 -71 219 37 79 -43 164 -58 166 -48 12 25 -292 -248 128 40 41 -31 -239 17 -48
1915d8Q3j89K44j30p2K76k33K25p7j75J90N4m07J52R9J54q0J23j87J62n4j18J44
1938A36k64l3%k7p7P6J79J26k36J78o1M1k2j39K88l65R2q8J68j15j14K33j96q7
1962c07K56Q8j42K30n07P0K2J21K44k67RJ48j81J68l4J42J92l63k06K31J84K8
1984A26j87O2M8J05j29j24J10N3o1jK72m17K54p4K3k66L50k31O7j10J09n0j44
2007b15J88R5p9ko6J72r3M0j04J45m9j74K60j33PJ22n9q3j7J48j74J14Q1j16J78
2032A86j55l55M68k63k8K63N1j53N6o0j27K94k96J33k6P4J44j16j76J74J94om46
2055a70J70NK8j40m6P7R3j27J07k40L08m1j41K00l7j24R3m7l0K61L8k87j34K71
2079H7j97J04J02J37R2k54J53j07k02N9P7j12J29m9p5N0J27j54O1n4J15k10qJ96
$$ plain form
1915 -48 35 -154 90 -40 -112 164 -69 156 79 -96 94 148 -259 -107 -8 146 66 189 2 164 110 -8 136
1938 136 -128 -161 -161 -188 -265 -189 -10 116 -120 58 -3 38 16 -123 165 -200 -108 -196 -28 -143 -257 -24 -220 -307
1962 -307 -51 37 -105 125 -382 -312 -290 -169 75 -192 -183 -35 -216 -48 -82 60 252 -111 -317 -86 98 126
1984 126 -61 1 49 154 25 -99 11 64 3 2 274 -143 111 37 60 -206 144 -87 -20 -130 -21 -71 -215
2007 -215 -27 68 -11 -13 -79 93 0 40 -64 81 32 -142 118 -15 -8 114 55 -28 -45 103 -71 43 124 8 186
2032 186 31 -324 144 -119 -147 116 167 14 70 10 -117 177 -119 14 -12 62 206 90 -86 88 282 276 -170
2055 -170 0 5 33 -107 -153 -76 17 -110 -3 -243 65 24 -117 83 46 -78 15 -32 -62 199 237 -50 -184 87
2079 87 -110 -6 96 233 325 71 224 117 -85 -26 51 -61 68 19 -56 -6 121 -33 28 -26 89 -121 -129 67
2103F7l13L02j84K75q6n9J66l23PJ47K43l06R8J77q4l52L48L0J2j96P5NK70j82
2127A37r3k56M6J11J81m37P8L75k34P4l20N1J84J56j54j33L60k33J80R7on6J13
2150B21l12j4R5JL45m11k9j83J49L10l86L05j45K6RL7k20K61r4J22j78K20j56
2173b7M7K55l06J82k72K93j69n9K80k73j40M05l65J64l7j34K36p6P4l57K01lj74
2196b55J57Q1R8k15J62q3Pj31J09J54k15o7L34k2k4k03K9J18j18J11J41k7j59
2219a8o5K23N4Rj70J35k91R3K1J10j51R2j41M1j14K21L4n2J32j94k0J02q5J05
2243G1o4p2J94j86J11j55Q6R1J42Q3l56N3N7j14J88J45j92m5k81R4o7K41o1k24
2267b61O2K33m0K5j36L14j15j37q7K12j06K43J13k28J24l22J84K4j9j25J52j83
$$ plain form
2103 67 -246 56 -128 147 61 2 168 -155 -148 -1 242 -64 34 211 127 -225 123 153 165 -31 44 49 319 137
2127 137 44 -212 -166 -55 126 -311 -233 142 -92 -18 -338 -287 -103 53 -101 -234 126 -107 73 170 164 108 221
2150 221 -91 -105 -10 -9 336 -75 -104 -287 -138 172 -214 91 -54 -28 -19 18 -202 59 -35 87 -91 129 -27
2173 -27 20 275 -31 151 -121 172 3 -56 224 -49 -189 216 -149 15 -22 -156 80 4 78 -279 -78 -81 -255
2196 -255 -98 -17 81 -134 28 -55 -48 -179 -70 84 -131 -198 136 114 90 -113 -84 34 -84 27 168 141 -18
2219 -18 -83 140 194 203 33 168 -123 -30 -9 101 -50 42 -99 -58 -172 49 83 31 163 -31 -51 51 -34 71
2243 71 7 -65 129 -57 54 -101 -15 76 218 301 -55 -2 55 -59 129 274 82 37 -244 -150 -217 24 -37 -261
2267 -261 -199 34 -6 19 -117 197 82 -55 -142 70 -36 207 320 92 216 -106 78 102 83 -42 110 -73
2289g3Pj46K07J46j46j1j83L23j0p5R2j94J12n8k04J13K61J9l73J1K64j71j18
2312b07K55p9J13j14r9K05m6J20k41l0o7K87j15K24m48J55j26L82l73L36P5l41
2334a34J73k53P7L05k90J98J81l80L56j38k44K51Nk30L47j53n1r9k09J63L64k6
2356B13l20L13k33J07K6k5l7m5j52K45j29j67K06k12O4K58r0J16j3k98K08k74
2378b39K50j9K69l08K9j38M6J53j50K92j64LL2k1oj58p8K32k24K12J1p0P6o5j48
2403a83n7L15j87J38k25M37q8J35j30j68J9M6J27l6j1l20O0J92k67K08mJ59k40
2426h0L39k94J63k70J24J72k41j03M1J42j0RJ43j70J13j05pj58N2J12k12K61j45
2449a24PJ33J36k19P8n7J41j04m9K16j45J50j45k25L86l27j6K63j11j8J76j71
$$ plain form
2289 -73 -66 -212 -5 141 -5 -16 -199 124 114 39 131 -63 49 -9 -213 -100 161 180 -193 -182 82 -89 -207
2312 -207 48 -31 82 -32 -131 74 28 148 -93 -123 -190 97 -18 206 -242 -87 -213 169 -204 132 207 -134
2334 -134 39 -214 -137 168 -122 76 257 -123 233 95 -149 102 107 -123 224 71 20 -79 -288 -125 239 213
2356 213 -107 206 -27 80 106 81 44 -1 -153 92 -37 -204 2 -210 -146 112 22 138 125 -173 35 -239
2378 -239 11 -8 261 -47 -18 -156 -110 43 -107 185 21 24 56 35 29 -129 -207 25 -199 13 24 -46 30 -35 -183
2403 -183 -240 75 -112 26 -199 238 150 285 155 -13 6 52 179 143 132 -188 -128 64 -203 5 1 160 -80
2426 -80 259 -35 128 -142 -18 154 -87 -190 -149 -7 -17 -8 135 -35 78 -27 -34 -192 -140 -28 -240 21 -124
2449 -124 -117 16 152 -67 11 -46 95 -9 -58 158 13 163 18 -207 179 -148 -164 99 -12 -30 146 -25
2471b5PN1P6M8k18n2J41L7m8J39m9j35K7j8k20K87m6R6j15j81o4K62R5k53K05
2496D7K12o9k34J19j87J44r0J7Q5k12P5J02J35J19k48L9j61R8N7j52J30lRL7p2
2521cj16K79Q0l75L64l42nJ36J46j17P3j17m63M17K10k01J31j66q4J62J73l16
2543a34J30j46P5O6j41l7P8M2q7L31j60q2j59l0L96k85kK33n8j43J73j85p7L4
2567a68PJ06K20J9k42K03j49L1Q7k0k62J43j41J02Q0KQ1j3K52l83J70j99R7J10
2591A33l78K32K63j80l70N29l91J3K09M6l76L29j50M9k7K22Qm7k99K37L2l27M47
2614B04k14k9kK26k24k27M12k32L3o5L56k43L8r4K1J73j68K02N9k60j86K12k5
2637c3r0j2K48J3k6N3k38m6J61N3o2l19L39j03K81K9m05R1M1j21J05j86Q3K34
$$ plain form
2471 -25 -18 33 109 157 -61 -113 28 65 17 156 107 -28 -1 -19 -239 48 2 98 -17 -198 -262 0 95 -158 47
2496 47 259 190 -44 75 -112 32 -58 -41 44 -168 -93 9 144 263 15 54 -107 -9 48 -104 26 23 32 69 -3
2521 -3 -119 160 240 -135 229 -113 -118 18 164 47 120 3 -460 -43 167 -34 97 -69 -153 9 182 -134
2543 -134 -4 -150 -75 -9 -150 -187 -109 -67 -154 177 17 -65 -224 -254 142 -143 -145 88 30 -113 60 -125 -202 -168
2567 -168 -161 -55 165 184 -58 145 -4 27 114 94 -168 -25 -166 -64 16 18 99 86 338 -45 125 -74 23 133
2591 133 -245 -13 250 70 -300 229 -162 -149 60 106 -270 59 -91 -42 -69 153 161 114 -185 52 84 -243 204
2614 204 -10 -39 -41 185 -39 -266 146 -86 -53 -118 238 -5 33 -61 -40 133 -35 167 226 -34 -220 -8 -33
2637 -33 -123 -135 113 126 100 153 -85 -131 30 83 21 -298 41 -62 219 248 -157 -66 -25 -146 -41 -227 -144 90
2661I0jj65J79J3k98K21J32l16K04J14k60J92j49J52p6n7j14j32L81j14L1r6K32
2684A63k24j02N1J80Q1l02J51n2K5j16L73k97n5J36n2R1j11K70j65j54j21K06
2706b4p7J24Jj63J15J06M8j71lM2L2Jnj4K29n32L88k66L1M9J00p7Q1Q6j08j42
2732a49J65m5N3L3no4j48J62%k09R3K37J8l63K91j36R9j73l2j83M61k14J65K20
2756B76p7k87J09n2P6k9k06L50m63K40K21j87j28J85j93K05r9J23k38K5N8K75
2778A84j0L5p1k59K75j5j9o2l6k00J81j34o9K34P1K1O5l21J36J3K25l46K80l97
2802b19O7N17m16J61M0j54k33K55j37J05Q1L9l96K95j4K01k47n7R8M5j30L70j35
2825A36k10J43k4k9n6J61J29k47jJ9j33K73l35K86j19k15K11N4jp2q3J98l24K04
$$ plain form
2661 90 89 -76 103 116 -182 39 171 -145 59 173 -87 105 -44 108 32 -25 -139 -271 110 -4 27 -69 163
2684 163 -61 -163 -112 68 149 -153 -2 -54 -29 -145 228 -69 -124 12 -40 51 -60 210 45 -109 -230 -24
2706 -24 -101 23 24 -139 -24 82 130 -41 -44 -2 30 31 26 12 241 -291 97 -169 -138 -89 11 -66 15 101 -7 -149
2732 -149 16 -29 24 57 52 -12 -160 2 2 -207 -114 123 141 -222 69 -67 32 -141 -173 -356 105 -109 56 276
2756 276 199 -88 21 -31 45 16 -190 160 -303 -63 158 -29 -157 28 -165 40 -59 64 -174 -149 -91 184
2778 184 174 209 138 -121 154 139 120 58 22 -178 3 -131 -200 34 105 126 191 -130 6 19 244 -102 178 -219
2802 -219 -152 365 -51 110 150 -4 -237 18 -119 -14 67 106 -290 5 -9 192 -55 -112 -14 31 -99 271 136
2825 136 -74 69 45 16 -40 121 250 3 2 21 -112 161 -174 112 -7 -222 -11 43 42 -30 -113 85 -239 -35
2849c5M2q3j58K80m9m12N78j96L4n2Q0l7J08o3k64R7N9J79J19l01l1O1j21J15
2873e0kJ58k17K9k0N2j0J9L02l95M3J86j61N0o1J64L9k74K97O9k91K22j60k56
2897b67J67J01J42o8k49J99j20K11n4j94L78mj46r6p6J97k16M9j88Q4L11k61L00
2920B00l29J59j40l7J98j44m0K67j53n7K9J35M0M7l38K27N5jM0l63J48J21k25
2943a61L26J61p6j33k27J1J63j72J91k0n2q9J68j75J64J51l76J14L70j59n3l15
2965a89J56k6r3L9J45l43M20j60m6K18l22L40J70k90j93R8kon5L14k36P8K9K49
2989B95r1l73J02j87L22k5J47k07L5M7Kj18q3M30k26j77K88j60l1k18J68J53j67
3012g4RJ57o9J33j59j60mL26q6j49R8J67J08l22n0ll5m9K23q5J22O6k40j12LO4
$$ plain form
2849 -35 7 -76 -234 46 -3 -415 163 -33 1 -51 29 -8 100 37 -227 -130 -71 108 227 -74 -105 -44 -165 -50
2873 -50 -52 106 -111 -82 -102 -50 -60 -41 261 -134 -91 95 -66 -16 -77 87 126 -148 149 218 -73 149 -11 -267
2897 -267 -100 1 143 75 -174 25 -95 116 62 -132 246 242 96 0 -76 121 -95 -46 -234 -150 161 -100 200
2920 200 -129 30 -110 -147 51 -93 -133 134 -19 -76 -47 88 128 175 -163 64 119 118 158 -205 -57 64 -161
2943 -161 165 326 250 117 -110 -99 64 -108 83 63 11 -78 90 -85 79 230 -146 -32 338 179 126 -189
2965 -189 -33 -59 -152 -113 32 -311 109 -51 -97 121 -201 139 309 19 -174 -76 -78 -84 -139 175 -61 17 46 295
2989 295 204 -169 -67 -254 68 43 190 -17 18 65 67 -51 -134 296 70 -107 181 21 -10 -228 -60 93 -74
3012 -74 -65 92 23 156 -3 -163 -167 159 73 -76 22 189 297 -25 -75 -78 -113 -162 61 -24 98 164 -76 -188 -185 -121
3038a21L34j86Jr6M7Q8K38j55k03P9J0K0o3O9J83l77K25j76j62M7K89j59J45L0
3062A07k13J8L27k77q2J15J19J70j77j05jo7J24j47qQ0N7r1Q1j13N8J53l69L52
3086A11j37j44J89j48J47P4n2j34K9q4K87N1l0j18J05j15L8k00l2O3l3K1L51j06
3110A33j40lP4j06Q5l3J97j70j04Q8j76J92n0K88l25QJ27l65L31K6k20L31ok74
3134i2j6%j1J26K27l27j36M77m17O8M8j17J12o4N8L5O1J32l94L16R1k65j26L14
3158A00O6k21K68q6j95Q0J72k42J77r8N8k24K04l41P8K63k54L30j82j2O4L1k00
3181a64L44o2j42J10j83K21k1j62K32j84j3J21jl00K73j2k53M8m3O8L29k52R4
3204D8kp0K82L5l53P0j52K84j62j69J36j03R0Q3k47P6M1K45q3K55k43j68P3pm0
$$ plain form
3038 -121 213 27 28 -68 -21 67 305 150 -53 26 36 56 -7 62 245 -132 93 -83 -245 -198 91 -68 77 107
3062 107 -106 -88 239 -38 -120 -5 114 284 107 2 1 -66 58 -89 -97 -17 40 -51 30 -83 -25 128 -241 111
3086 111 -26 -170 19 -129 18 92 40 -94 -65 -149 138 189 159 41 146 31 69 -131 -163 -100 -133 -112 239 133
3110 133 -7 -10 64 -42 43 10 207 37 -67 21 -155 37 -13 275 -50 -42 85 -280 51 77 -143 188 182 -92
3134 -92 -108 -108 -119 7 234 -93 -229 248 -169 -101 -53 -170 -58 -122 -64 -29 32 164 -230 86 177 -88 -214 100
3158 100 166 -55 213 127 -68 12 184 -58 119 21 79 -145 59 -282 -204 59 -195 135 -47 -59 5 36 -164
3181 -164 180 118 -24 86 -97 124 103 -59 173 -11 -24 97 96 -204 69 57 -196 -148 -191 -123 206 -46 48
3204 48 46 -24 258 293 -60 10 -142 142 -20 -189 -53 -156 -66 17 -230 -154 -113 132 49 304 61 -107 -34 -41 -81
3229h1j30L69m00oL02m2O1k20M7N4j04K59k6k40O0J56P0n6k51K40j88K27r5Qj34
3254a20Q4Q3R4j57L8j42K58j36j26n0J57R3l9j05l8K61j23M5k48K57j38J29k2
3277E5j87J34k8k40J47L65l07Nk21K51J63k04K62k83J63r2J45K7k95J23J20j62
3299e9J19K9l6j69Q6K8l7j31J99j06J39r9J03j61N35m83P5J2l73M30j3o2j95K12
3323D3m9m0R3k85J27K40j67J49j77Q1lJ7K9K85n02L66k3P3k47j50L11j59k86K98
3347B4j12mR2k5p1P9K41k52p6j65M51l10J16L8j00m61N72J0m2K79m39K17J57j64
3371E5j19J87k43J92j55o1J86K04n56J22K27j64j61N6K03k91L10J72j4J27l46
3392f9j7J02j10N1oQ2J36k77L27k62kL26l47J41k30QK0O8k4J20K2L8j43n2L7q2
$$ plain form
3229 -81 -211 158 -242 -248 54 12 73 -147 -100 -46 -150 109 83 -157 -97 59 129 73 -178 62 -126 101 6 14 -120
3254 -120 -36 47 141 -16 22 -120 138 2 -124 -174 -17 76 37 -68 -106 155 32 77 -171 86 -52 77 55
3277 55 -132 2 -26 -266 -119 246 -61 -56 -277 -26 137 -67 195 -88 75 -17 128 155 -140 -17 103 -59
3299 -59 60 89 53 -116 -30 -2 -39 -170 29 -77 62 -37 66 -95 440 -43 32 44 -329 101 88 26 -169 43
3323 43 -6 -46 47 -238 -111 129 -38 111 -66 15 12 29 58 343 -159 207 184 257 10 -140 171 12 -274 24
3347 24 -88 -92 0 -25 -96 -17 224 -28 -104 -269 182 -128 -12 26 -74 -535 37 47 5 284 -155 62 219 55
3371 55 -64 123 -120 72 -83 -144 42 246 -310 -188 39 -125 -286 -230 -27 -318 -8 164 150 277 -69
3392 -69 -86 16 -94 -43 -49 33 169 -108 219 -43 -45 281 -66 75 -155 -147 -127 -59 -83 37 59 97 -46 -98 -61 -143
3418a43K11l6k46K57j14J99p1j34k25N19m54R3P0K29j16r1K27k17Q5kR7o9l72
3441c03K82m6j4K59k4k25K34k19K26l6n12K34K49q8j49J47J02Qk11l2M34j28p9
3464A09j23MO0o5l2P2N7J26l33L57o7j17j03J98m7j91k18L33k80K58oJ31l31J09
3488i9j15J59J15J2k98L85q6j77n3oJ97P3l66J39j7J96k80L14j42K07P9l96K44
3511H5k9K16l14L56j52j96r2J71J56j71o2R6J85m10J99J68k76K36j54Q4Nk39K11
3534G3j60N7j30k0Q8J51K5k1K7j44r1k2q6K03L01k56n3M5J26j05M7m99N00J0k02
3559a36P6O4O7j5q8J47j99J65jl18J64Q8N4k4j00J7L31l53O6o6K43q3k37L05m14
3584b47P1K55lj6l00M9J63K13l7k36K27l29J27J31j73j31J17pL1O2n7L00l10J76
$$ plain form
3418 -143 68 32 -214 43 -71 128 57 -77 -302 217 -237 -144 -74 155 39 -52 175 -42 43 41 138 69 -303
3441 -303 -21 -67 -81 178 154 -71 163 -56 170 134 -378 -144 105 17 -132 15 117 125 -86 -118 316 188 109
3464 109 -14 -10 50 -15 -47 25 82 208 -125 232 165 48 -55 143 96 -95 -313 20 -260 -2 -8 123 -208 -99
3488 -99 -214 -55 60 72 -226 159 73 -104 -157 -163 34 107 -259 -120 -137 59 -221 93 -49 158 237 -159 85
3511 85 56 272 -42 314 162 -34 -126 45 201 30 -32 64 249 -161 38 206 -70 166 12 96 101 -138 73
3534 73 -87 -30 -160 -180 -92 59 84 63 90 -54 -145 -167 -253 -50 251 -5 -58 -13 113 8 55 -444 56 66 -136
3559 -136 -60 4 71 56 -32 115 -84 81 80 -238 -74 14 68 44 -56 -39 292 -61 5 -61 182 99 -138 167 -247
3584 -247 -176 79 76 60 -240 -191 -28 185 148 -88 139 -190 -63 68 -105 -236 -119 -126 -95 -33 -90 210 -100 76
3608G6k20Mo5J00Q5J12j58J21J3o5J60k48J67j10j00L11m02L32n3m87O79K8k96
3631a6K8J0Q8N7m42M07q7L8p7R1j09K2R5p6K2j05R9k12K39l11J76L5j21L6L58
3656B45k51l04n1L56o4K02k1l5o8O2l6k34L41j58K72m26j50M49R0j46j15J5J25
3679I8j19o0M4N7K35m89J80K46j47K3r1N0r8K29m6o7j60N6J74o7k02K21K06j67
3703A06j29k3J91j72j89k9K16M2J56K58m28j29J12j1K30l05K07k8k96K03j38O6
3725i0K23q2q5R6j48k9J84Kl48M68l51K82o9j57J34n6r7K2o7K24P6p3j10J85j39
3750ekl08J70M8K7M8K59r4k14M0j3p2P3l0J93J3j21P0k70P0k6J38J09j81L56j39
3776A39j00J17q7R3j56R5J05k43J04L9j81K26k7j57j72K93n5n4k0P1K35k05j60
$$ plain form
3608 76 -144 -140 -205 -105 -20 92 -66 55 68 3 163 -85 82 -28 -128 183 -219 113 60 -427 252 280 -16
3631 -16 12 22 110 167 -275 132 45 83 6 97 -12 10 105 29 51 -54 45 -167 72 -239 -63 -28 -149 -113 245
3656 245 -6 -310 -361 -5 -69 133 112 77 9 71 35 -199 142 -16 256 -170 -320 129 219 73 -42 -27 98
3679 98 -21 -81 -37 20 255 -234 -54 192 45 68 -23 27 -71 158 112 45 -115 -59 115 48 -154 67 273 106
3703 106 -23 -46 145 -27 -216 -245 -29 13 169 427 -1 -130 -18 -29 201 -104 103 75 -221 -18 -156 -90
3725 -90 133 51 -34 62 -86 -115 69 71 -277 191 -160 122 53 -104 30 -26 -123 -101 -168 56 132 59 -51 134 -5
3750 -5 -7 -315 -145 -97 -70 -22 237 143 -71 -31 -44 -116 -43 -73 120 133 12 82 -188 -118 -144 -6 103 -78 278 139
3776 139 39 156 69 162 6 101 206 -37 67 106 -75 151 124 -33 -205 88 33 -21 -41 30 265 60 -100
3799a00%j49K24J78k05K06l15o7K40j39J03k5k8K9RN0k89L80m1J0J3Q6k92K18
3823I6k5j99M20l79j75L02K2j3j90K38R4jr5j66P5J0k1J78k10l6o7M48j06l26
3847a26J71K97m76J19k39J4J96Rm2O8M8k88K81m3L14k06P8j16Q8j35J13j79Q3
3870B9k02K34L2k71K24m6K73j99j43k8J97Pk43k5R8J94j91J32O6p4j05j84J46
3893g9J15r2j4K41Mj69J57j89J5J55J43k33k46J60j1K01k49Q9k7O0j89M36j79
3916I9K17m15n3K72j41j94J01J80k4j26q7J13j9J44r8j51L03J22j91OJ51j16Q3
3939A76p7n6j0R3j26j47R3J81j80n3j04J32J46m3N4k53K84o9r6K71m56M24J0J63
3963C57n24K63j57j12J23J18k21l7K98n9J43k52j34L28LO5j86j92J73J41j84P0
$$ plain form
3799 -100 -100 -249 -25 153 -52 154 -161 -228 12 -127 -24 -49 -77 -48 -39 11 -278 102 61 71 84 170 -122 96
3823 96 71 -128 292 -87 -262 40 62 49 -141 97 191 190 95 -71 4 14 -7 171 -39 -75 -142 306 200 -126
3847 -126 45 342 -134 -15 -254 -240 -44 -35 -77 -9 39 -249 32 -11 303 97 175 59 147 12 125 -54 29
3870 29 -173 61 93 -178 46 0 273 74 -69 -97 100 107 -136 -161 -63 131 -60 72 138 64 -41 -225 -79
3893 -79 36 -56 -70 171 175 6 163 -26 -11 144 287 54 -192 -32 -43 158 -91 -2 -29 31 -158 278 99
3916 99 316 -99 -152 120 -21 -215 -114 66 42 -84 -171 -58 -77 67 -31 -182 121 243 52 58 209 93 176
3939 176 99 43 33 126 0 -147 -54 127 -53 -106 -210 -78 68 25 79 -174 110 41 -55 216 -240 184 194 357
3963 357 -167 96 -61 -173 -50 68 -153 -190 108 49 192 -60 -194 134 137 202 16 -176 -3 138 -46 24
3985B4p2K14k2j56J77l88K13K01o3l75L56o3J17k0q1l1n9j06M4J77o1J67Rq1j63
4010d2L93k54M2j4j31j42L3J03J68j15j21o0J98J8j69N3L19m40L5K01Lm7p3n1
4034i3J72mO1j45l1J51J01n3j50j57L00n28M97k62O2J66j60j5L7j52K34O8j28
4057b9K2l2j70R4N3K26J4l23L78r7K8j89O2l6k12N5J52J22k28K78k61K69k66J13
4081B3r8NL89m57K46j27j8Q7j90J93O3l47J91J53N1l35J48J87k24m3P2j4J64k17
4105i8K90k08L9N0k3l05K64nJ17nn9M1k9k7p8K86j88K6o5J48p1p0P3l51M47k90
4131i1J75Kk87J01J45j30K22J4j22j71L09j93J44k24J77o2r7J2j34K21j98L61
4153A74j45Mp1K05q3j34J31j86J1J2J29j25j77J86K54r9j33J30r5k6N7N9j64K81
$$ plain form
3985 24 -48 166 144 -12 165 -223 -10 191 128 -247 109 46 163 143 62 31 -28 -134 -90 87 26 193 202 121 -42
4010 -42 351 97 139 125 -6 -148 -115 -12 156 41 -80 -140 58 76 -93 -40 279 -161 -126 75 78 31 -42 -93
4034 -93 79 75 136 -9 -40 111 212 159 9 -148 152 -376 121 -141 -79 87 -73 -88 -51 -203 31 99 -29
4057 -29 -7 -39 -209 -115 -62 164 178 -145 233 136 164 -25 37 1 -211 -156 -4 118 -110 168 -93 176 -90 23
4081 23 -75 -70 319 -138 108 -19 -37 50 -140 53 116 -231 -40 113 164 -171 -23 164 -60 -103 -31 -45 119 -98
4105 -98 192 -16 23 73 50 -255 9 4 121 116 57 98 69 42 -36 250 62 88 23 171 100 30 103 -248 199 -91
4131 -91 84 86 -201 -100 45 -85 137 151 29 -142 167 -26 118 -106 71 9 -88 -76 -210 11 -187 174
4153 174 29 33 -38 167 84 -50 81 -105 -94 -82 47 -78 -255 -69 185 86 -47 83 -12 -38 19 78 -86 195
4177A95j34o4j06OL3J18n5q0J67k7j27K07r8j06j37O2p0K22M8j9P6q2m9Kk32K21
4203b9n4%M8l0J46q4L3j38J85r0j17M3K73K37l33m5M5j32m9J80Ok89J9K04N6k15
4229a30L35k72J27r9K1k8q9O2P7k0N1k66L07N1j12J78j79R2n1J47m27J67K19j95
4253c4Qj97L24j63K51k37k61J81O6R6j72j8K78J18o2k05J03P6j81r2Q2K4J44k6
4277A03j10k40M82m70L21n3j57J33L5o9l4oM0Oj9K31m3k01O3Q2J0Kj86k9J54k35
4303a90K18J8k17M91o00J51K39j66j67L32p4K2q2J94l38J24L28k40K1k40k11N22
4325A35j73P5J12k85K03Q9q2J18j4j74k95L36J49k72K58k01q0m3jJ39J02k79K64
4348H1k20J43o3J81j62m5K60l42K11j70R1M8P4q6j42j9J10O6L2J43k42o0Q9M4
$$ plain form
4177 195 61 -3 -109 -103 -70 48 -7 -87 80 53 -74 133 35 -71 -208 -146 -216 6 54 35 111 29 -20 -18 -250 -29
4203 -29 -83 -83 -35 -65 81 -3 30 -108 77 -13 -130 -87 186 423 90 45 90 -42 -91 89 95 -194 -175 29 85 -130
4229 -130 205 -67 60 -39 -18 -46 -135 -73 4 -16 35 -231 76 127 15 193 14 106 55 202 -225 -58 161 -34
4253 -34 -26 -223 101 -62 189 -48 -309 -128 -62 34 -138 -156 122 240 178 -27 76 152 -29 -121 -39 -15 129 103
4277 103 -7 -247 235 -235 86 33 -124 9 44 -25 -59 -65 -25 -19 -38 193 150 -51 12 94 104 106 -80 -109 45 -190
4303 -190 28 46 -171 320 -280 -129 110 -56 -223 109 35 57 -25 169 -169 -45 283 43 64 -176 -387 135
4325 135 -38 37 149 -136 67 156 74 192 178 4 -291 45 194 -78 180 -21 -101 -144 -145 -6 96 -183 81
4348 81 -139 4 -59 122 -40 -85 175 -167 44 -126 -35 13 87 1 -141 -160 -50 16 48 191 -51 -111 -22 22
4372B2j53Q5K49l7l91K67L03m96K66k09L7N2k08R7J98L9L3k34R6J14k31K25K3
4395A47m4k05j36K75K01j28p1m68N92j89J15o7k2J83O2k91l9J10j34M64k72k19
4417a36KJ88p0J21k34o1K0J22K93k01j13o5K18k90K81l21K30O8R4j6q3j77K54
4440A24l92L74k21n1L01k20J94P2l46J20O0J48k11m8KJ07o7q6P5J9J67j92R0j52
4464a33j30K83pQJ9J01l11J65J72j41K8N5n0k29K00j12j22P6K53j49J05K1k78
4487a76J94l62M13K5j96P1k41L06l78K18K85Qk59P7L2J2k05K75k74J14Q6j52M60
4510C33l66J20mq7k12K67j10K46J53n10K69J00l3k53K11j83K99k86R3j15QP3J87
4533B00k1l06O0m8J61l0J86k24j55L20j83j24L55j17N7k33J81n7J06K05k01r3
$$ plain form
4372 22 -131 -46 203 166 -225 42 345 -151 115 -94 -57 -5 -213 -116 82 121 154 -80 16 130 -101 124 147
4395 147 103 -102 -238 37 238 110 39 -429 163 -26 89 22 0 183 245 -46 -85 25 -109 355 83 -136
4417 -136 -134 54 -16 105 -129 -190 -170 -48 245 44 -69 -134 84 -206 75 -246 -16 52 146 130 47 -130 124
4440 124 -268 106 -115 -166 135 -85 109 181 -165 -45 15 163 -48 -96 -94 13 -54 -140 -65 -46 121 -71 19 -133
4464 -133 -263 20 13 21 40 141 -170 -5 167 26 54 109 59 -170 30 -82 -204 -128 125 -24 81 102 -176
4487 -176 18 -344 69 94 -102 -31 -272 34 -344 -126 159 167 -92 -15 17 29 -176 99 -175 -61 25 -127 333
4510 333 -33 87 83 -4 -216 51 -59 187 340 -170 99 199 166 -87 124 -59 240 -46 47 -68 -60 13 200
4533 200 179 -127 -67 -115 46 16 202 -22 -177 143 -40 -164 191 74 131 -102 79 22 128 333 132 39
4555C9j17l02K09Q6k3J70M6j18l41O14m12n5K35K07l88L99j89k65R8K84r8Kok82
4579b07N3j26M69k70J35P0Q8j96K44k79k61Q3J89j18L8j18J39j13K83k07j41J90
4601e5l8k5J29R3l67M63m35L04N4l9o8K6l87N7N16l41K13L4oj37J93l23M33j29
4625A65k36L8J17l33M98r6p2j90PK66J73m97J93P0k31J56K43l68J15k9n0J53j06
4648a4J98k4l30j0L10J16k78j17M0J83M3j25q3J89m71L55n2K07j44j02JK86k09
4671c1p2K09j38p6J79J19k95N1l3N3j09L04l29J91p1Rj39J68J12j51l5J59j7k00
4695a42K25k22n3K88k40K86k33Q4R9L3n1r8K56m63J50q9L02k72J46O1l07L02J22
4718A84j32k9l5pl6m6Q7J19j59k00L46k16q9O4M2J49L6j39K27k64o7K28Nm17L14
$$ plain form
4555 39 -78 -380 -171 -85 -108 62 108 -10 -351 263 -149 -204 31 238 -150 249 60 -205 -107 177 79 81 75 -207
4579 -207 -154 -280 189 -81 54 124 212 16 260 -19 -280 -197 -8 -126 -88 -206 -67 -180 103 -104 -245 -55
4601 -55 -93 -118 11 104 -263 200 -235 69 123 84 16 42 -345 -288 228 -113 100 134 128 -9 184 -139 294 165
4625 165 -71 -33 84 -249 249 153 81 -109 -102 164 337 -160 33 103 -128 28 271 -97 18 -11 -61 92 -14
4648 -14 184 160 -170 -180 130 246 -32 -149 -109 74 117 -8 -91 98 -373 -18 -70 137 -7 -109 -108 178 -31
4671 -31 -103 106 -32 -108 71 190 -105 -54 -87 -34 -143 161 -168 23 -48 -39 -178 -10 102 -49 -84 75 58 -142
4695 -142 83 -139 -192 96 -144 142 -91 -7 92 125 74 -24 232 -231 -81 -170 132 -140 6 67 -240 62 184
4718 184 52 23 -12 -19 -55 -101 -14 105 -54 -254 92 -124 -213 -149 -107 42 78 -61 166 -98 -165 63 68 -349 -35
4743c5r7J28r3O9L24m37M50o64L08q5Q6j25K60Q5k82J18R9K57m73K1J29j81K03
4766F5Q8j69j7J81k55o6j5J16n6R8JN3J06j30ll2K90j41j62j88L39J0j45J14J3
4791I5m3j31L18j60k84J56K32K2m57L78q3q8J68l88N43j49j78J0K8Q0K51k54m2
4814B4n9K7P9N0q3k06K83Q0j83n0j76n0K77J9m6K31j45j13J75k62K71j78n2q6
4838a73J97j45l9N0K24k45J26r6Km1m1P4K12j32oJ17m2K6o1m6L06l05n0J09J49
4863A70j75k28K43j31J40r4M1J61n4j30O5j70oM1M4N5L7j31K71j05k11K54J61
4886B48k54P9K8j7J0l02J42r9M0J06R2J09q8N7k18l4Q7j50J32L44k96p3N8k15
4910b14L87j59l24L36J03r9N3j01k3j4o1J66J31j17L7j90J02N1j49P7No1q3J7
$$ plain form
4743 -35 -132 -4 -97 -28 296 -141 309 -355 -47 -132 -46 -171 89 174 -108 10 109 366 -107 -86 43 -138 65
4766 65 153 -16 -33 148 -107 -173 -188 -72 -128 -30 -29 24 130 0 -3 -35 255 114 -48 -236 103 113 -32 82 95
4791 95 52 -79 239 79 -205 -49 183 205 -252 126 43 -45 123 -265 278 129 -49 -39 -11 69 320 66 24
4814 24 -35 -8 71 121 38 -168 115 195 12 -38 -214 -264 13 32 -14 217 72 -41 134 -128 143 -35 -87 -173
4838 -173 24 -121 -160 -110 114 -131 -5 -101 -99 -140 -181 -107 105 -27 -33 84 42 68 7 -39 267 -38 -88 21 170
4863 170 -5 -233 10 -121 19 -75 -34 127 73 -57 8 -162 -168 -127 -83 -28 9 -122 149 44 -167 87 248
4886 248 -6 73 101 84 94 -208 -66 -165 -125 -19 73 182 94 151 -67 -101 -14 -164 -32 312 16 -57 1 -214
4910 -214 173 14 -310 26 129 30 83 -18 -41 -55 -116 50 181 64 101 -89 13 64 -85 -8 -3 -64 -147 -130
4934a30J52o8p0L08j30j38NJ37k26J94j24NL26k01j67J17jK2r7J20J12l44J23
4957g5k6K25j30J22Q4j75P8Rk01QK6J51k05O6j8K35k31j29K64j97K59k58J05M9
4981C6K21l47j82L15N8k25l8J31O5R0j91J42j78j13M23k15o4J28J8K4J4N2k41
5004g7J00O2mJ63l11J54l93M75k06J65j44K6kK4po8K12j17J58p1j90Q5K13j33
5028A14r1J2J41j62J05j45J9l3j38L42l49J20J24j48l8L25l15J35J74j14j81L26
5050B23j87J1k84K86o9j2n8J9K41j27J95k03L05k82j16j44K32o6N2J21j63k17
5072b43K66k08J39J3o0j01L53k47n0K83j28p0j27L65j30k06MK60J07m36J66J8
5094c2l7L84j53k47n0K28m5J64n1k56K22j66p0J98k01M4M32l50k19J10K3R2J68
$$ plain form
4934 -130 22 -46 -116 192 62 -76 -71 66 -160 34 -90 -85 241 40 -127 -10 -11 11 -86 34 146 -198 -75
4957 -75 -101 124 -6 116 200 25 103 112 -89 -81 -55 96 -109 -43 -61 174 -57 -186 78 -119 140 -118 -13 36
4981 36 257 -90 -272 43 101 -124 -162 -31 34 124 -67 75 -103 -216 207 -8 -72 56 74 98 112 164 -77
5004 -77 23 85 81 244 -67 87 -306 169 -37 128 -16 10 8 32 25 -43 169 52 210 139 -51 34 247 114
5028 114 23 35 176 14 119 -26 -7 -40 -178 164 -185 -65 59 -89 -127 198 -117 18 192 78 -103 223
5050 223 36 47 -237 49 -20 -32 -90 -71 170 43 238 35 340 58 -58 -202 30 -36 16 137 -26 -243
5072 -243 23 -185 -46 -33 -93 -194 159 -88 -138 145 17 -53 -180 185 55 -151 -147 113 220 -216 -50 -32
5094 -32 -69 315 162 -85 -135 93 48 212 161 -95 127 -39 -109 89 -112 -68 364 14 -205 -95 -72 20 188
5117A88k47J16j01J97p1j24o3K74l41J60O0J9k64L8K06P8j75R2O8j49P8j01j02
5140a64M5j0mJ89j02K63k94K68k92K8J64r8J46k00L06J00n41L51j37q2n8M7P7
5163BJ2J22j12J97j99k54L97k77Q7qJ35j12pj65J75J38k36J5K84j71n2j24N8k4
5187a19j40L54R5O2l95J75o9R0j04jm3R1K9k2J78m4q2J44k69J12K06j10n0j07
5211a9J44j80R9j56J52l47J83K03l6r6k39N0K70J58j50j5j4J00l05J82N1k95M87
5234B27l37j08K62R4j48Q4k2J20k25p1K17j40N6p6L11k29j67L52l99P4m9P8P4
5257b2J21j51j53Q0K37k18j09K42%J06j56j64M38j66k0n4m7k2J95j63j79K08j54
5280a51K80n7j09j77M24k88J82M4n2j6j31R3QL4j3j52j6O6K02k12j88Q3J9K28
$$ plain form
5117 188 -59 57 -44 153 82 -42 -105 169 -172 -12 48 67 -197 -159 47 125 -50 42 110 -39 39 -62 -164
5140 -164 -119 -129 -133 56 -46 217 -77 191 -101 -73 91 -7 139 -61 245 345 -196 155 18 -64 -122 -75 2
5163 2 14 136 24 221 22 -232 165 -112 -25 -33 102 -10 -17 -182 -7 131 -105 -90 194 23 -29 -153 -95 -119
5187 -119 -259 95 190 252 -143 32 -37 53 -51 -52 -95 -4 25 3 181 137 55 199 -70 42 248 138 88 -19
5211 -19 125 -55 44 -112 40 -307 -124 79 43 -53 -292 -242 28 186 36 21 7 107 -198 -16 35 -260 227
5234 227 -110 -218 44 138 -10 74 52 172 -53 -124 93 -47 9 -67 244 15 -152 200 -199 -125 -174 -96 -22
5257 -22 99 -52 -205 -125 112 -106 -215 27 27 133 -23 -187 251 85 65 11 -36 -58 137 -26 -205 3 -151
5280 -151 129 72 -37 -214 210 -78 104 148 96 80 -51 42 50 84 71 -81 -97 -31 171 -41 -229 -146 -127 101
5304A01k80Q2J73J82l87P0L42j20k33R8m3K8j40L9qL27k31N9j77k1K4R2nj80O8
5329a40L51j03J6m32M58o4j6K7k80M36k86J36J01j14Qk61K6k27M03q2M9K06k00
5352A2J2k3K11j93J69k94J65j22M4K2k28M3J32j51m0J86k0nM3m1nN4K05j16j33
5377g3O9J08pM5m8jj41R3j37r8J95J65k18J45P8P5m15J73K11l00L18k34J88j33
5401E8K13j27l10J19Oj02J25K2J87j43k1J14l04N7P2j8R4j98m3k3K16Jo2J26l55
5426b96K97K0j24K28m3K10l10Q4Nn4j22n7J64j14L01N2j99j39qq0K52Q3j62oO4
5451D6M5J30m51M53m36L23l2j16q5J35K74k05l5N1Q5m3j41N8Q3l31K85m6m04J82
5475a75J9J33L0J37j49j7j12K16Np0mK9q6J84M2m71L46J49l15p7J91J6j0j06K37
$$ plain form
5304 101 -179 -97 76 258 -129 -59 283 163 -70 28 -15 13 -127 -88 -96 231 0 59 -118 -139 -115 -23 -28 -208 -140
5329 -140 211 108 124 -308 150 86 70 97 -183 253 -33 103 204 90 98 -163 -137 -364 39 -43 6 212 12
5352 12 24 1 212 19 188 -106 59 -63 -19 3 -225 -182 -50 -201 -241 -55 -75 -80 -37 -78 -83 -29 176 60 -73
5377 -73 -4 104 97 142 94 93 -48 45 -92 -190 5 170 -48 97 175 250 -165 8 219 -81 237 3 191 58
5401 58 271 144 -166 -47 -41 -143 -18 4 191 48 27 141 -163 -106 -34 -52 42 -156 -199 -222 -6 -5 -67 59 -296
5426 -296 1 21 -103 125 82 292 -18 66 71 17 -105 -162 2 -112 189 241 42 -97 -105 -185 67 150 -12 -18 46
5451 46 91 221 -230 223 -213 110 78 -38 -123 12 286 81 46 97 182 139 -2 56 139 -192 93 47 -357 -175
5475 -175 -156 -23 7 144 -5 -22 -134 82 87 17 13 42 -44 140 182 -289 57 206 -109 -186 5 21 11 -95 142
5500A42o0J58m72J70J49k25P7N0J55J1P1j85k7r6Q7R4K63j04l19L5k40K62k80
5523b84L62j03J56l30O7K53j3r3k15J53L04l73P6J08l78N32l25P5J04m5j58K32
5545A05J03j44q2r0R6j4j0o0K79j10q3O2q9r8J00k43L39j02j4J26K1lo8J41l08
5570a46J53J88j8l1j46j59J80l01K75L7R6l3j74p3M8K4K98Nl23O5j3j24P6M8J00
5595E2J25j69o5QJ71j48P7O8j43L73k95jj29j9J16K32l07J51m2Q5j06M6M8l0j42
5620d4J85J2n0k5K8l13J05Qj19J91N8R8j60K59j13l62K84l5J21P9j74j11R4L8
5644E4j80J02j22J26k64J39K51J0j93O4oo4J80R1k51K28j08K37k88j21K93j25
5666E3K1Q7k88n3K69k95J80J5K20k59K52l62N1Q1l8R2K84n00L27k00k11J97n3
$$ plain form
5500 142 82 240 -232 -62 87 -138 -61 -11 144 155 226 41 14 -82 5 99 362 258 -61 -26 -266 -4 -284
5523 -284 78 -25 131 -199 -132 121 108 15 -200 -47 257 -116 -40 68 -310 222 -103 -28 76 31 -127 105
5545 105 208 64 -18 -108 -12 -26 -36 -96 183 73 -10 52 -37 -135 -35 -278 61 -41 -55 71 92 89 21 162 -146
5570 -146 7 195 177 146 0 -159 21 -280 -5 32 128 95 -79 -152 -104 -80 218 223 -100 -35 -48 -172 -96 -48 52
5595 52 177 8 -57 -49 122 -26 51 119 -24 349 54 53 -76 -95 21 253 -54 97 55 140 34 80 128 98 -44
5620 -44 141 153 103 78 106 -207 -102 -94 -213 -22 36 134 -26 233 120 -242 42 7 128 207 33 -78 16 54
5644 54 -126 -24 -146 -20 -284 -145 106 116 -77 -13 -19 -83 97 188 -63 165 57 294 6 -115 178 53
5666 53 74 161 -127 -180 89 -206 -26 -11 209 -50 202 -160 -109 -28 -66 26 310 -190 137 -63 -274 -77 -130
5689a30L49l58J97j14J70k82K73m8j99J1k4J98q3J7J43m8J4j45j7L36m64K39O
5712D1p3R2j33J87j14j7J19k19M0q5J62O2j05Lk39J90J19L5n9J06n2J47q2k79
5736a54K24J54j85mj49rK83k71k2J55o4J24l8p4J73k63P2K21j32k63K35l4R2j88
5760a17P3K1J49k10L8R8j01J61j47j76K68L2o3o8J05j02K9j50J20K39O5k80J04
5783H8n3j06J39l01L04j15J87k83o8K28o2j90K60j50P4m4M3j4K56N8j54m50O89
5806C36j98l78L01m8J46q8j83P9J15P2j26k52J23M1n5Q2L1j83O8J11j7K5J8K02
5830B22j56k24J86M0j3k94K37%K40l55K7J20K40k94o6k4J70j81o5J81L8j55M32
5853C06l54nk33M12k75q8Q2K04lJ8k35J03K33k13n9j94M01q9j86K05J46j83j09
$$ plain form
5689 -130 219 -139 58 -56 114 -168 105 57 -142 -131 -155 43 -40 -23 120 72 86 -59 -76 260 -204 35 41
5712 41 -32 60 -73 114 0 -17 102 -117 -77 -162 0 62 -43 -40 -279 -89 30 65 6 112 60 207 125 -154
5736 -154 70 224 39 35 -114 -123 160 -111 -133 22 -42 82 44 -30 143 -120 -48 173 41 -222 13 -21 71 -117
5760 -117 -44 -23 126 -84 -46 52 -49 112 -35 -211 57 89 26 -42 63 -39 -10 -160 -40 199 264 -16 88
5783 88 35 -71 68 -233 71 -44 143 -140 -208 20 -42 -232 28 -122 -48 -92 -49 -63 193 251 97 -353 336
5806 336 138 -240 61 13 159 71 -112 -33 82 154 28 -224 -101 -60 -115 -33 -2 -185 -117 -6 -23 2 20 222
5830 222 66 -158 28 68 55 -239 -2 -2 238 -117 -90 30 270 -24 -90 -114 56 -125 -190 -9 29 -126 306
5853 306 -48 -53 -286 126 -149 -237 -155 49 46 64 -171 -68 165 -48 -107 -301 100 11 -175 30 176 -7 -116
5876a16Q4j54J51N6j27J37r6N8r0R4K5L0J77l14K23q2k93R4K64j97q6M94k50J2
5900I4k61J93M2K0J3j3QN8k53J94jj86P3N1r3J20j31K25M4m02K48J13m0k04K91
5925B03m40K19J13j51o6R1J03k17K92j54j27K25R6j35p1J29k4J8L0k35J53R7k70
5948a21k2J30l55N26j12N7PR8k95J18j00J88j51J13k02J23O2J38k54l1J36k37
5970a84J99j80k8L01k03m5J53j99J54L22n69J71qR8r6k1L41k08j30J48k4m8K72
5993B16l39K25l4k21L10l71L30k12j0J21n8j2L4J33j56J4J43k43M58m43J9N81
6015D85n38J46k53J31r0r9M57k56q3J06q5p1O3K07l30M12k33j20J65j19n9M05
6037B41k49L2P6j82LJ60j99o6K33k8K71l22j8k09L17J8j0k44Q1k64K80k4J66k75
$$ plain form
5876 -116 -32 -186 -35 21 -106 31 -65 -7 -97 -3 22 52 229 -85 138 56 -237 -143 121 -76 -162 332 82 94
5900 94 -167 26 68 88 101 88 96 154 -99 95 94 -92 -19 32 -61 59 -72 153 197 -205 43 156 116 -88 203
5925 203 -237 -18 95 -56 -122 -31 72 -145 147 -7 -134 91 187 52 -19 110 86 104 134 -101 52 149 -121
5948 -121 -143 -13 -368 158 46 103 110 208 -87 31 -69 119 -32 81 -121 2 64 202 -52 -83 53 -184
5970 -184 15 -165 -193 108 -95 -140 13 -186 -32 290 -279 -108 -116 -18 -114 -135 206 -2 -132 16 -8 -56 216
5993 216 -123 102 68 -153 157 -214 116 -96 -106 15 -43 -55 -21 112 -44 -30 113 -130 328 -115 -96 485
6015 485 -53 93 -160 -29 -119 -218 239 -17 -100 6 -79 -150 -87 120 -210 202 -31 -151 14 -105 -164 241
6037 241 -8 24 100 -82 -79 81 -118 -184 49 21 292 -30 -48 -257 60 78 68 -176 -95 -359 -79 -103 63 -212
6061b12J86K4J15j2M3j20k72L76j64p8O9M03j62j30n3J4kJ15j30j70J54l7p2J23
6085HJ84j62j68n5K40K04j09k88M2J07j08J26m8J11j63n5K05P4l43K8OJ28l04
6108c40L95J80k85K66j02qk0J11m91J11o2M51k08j07L7J1K09j39L2J99m1l34j71
6131c06J89J08P7p3k1l05M37j45j29N7J42N8k02K06J99k04n0p2J59j00j58L35
6153B02l8j69R8r7q9J09j49J36k5L28k96j89K85m45N74k19R5L7k05J23k58K91
6175I9P9mk22k40L00j85J46j80mK36l20Q0K79j7j77K85k41L05J17l02M7j18L19
6198B82j50l50L86rk72P8r6j6J90k88J94j6o3j6Q2J9Q9p4o9J20n1Q8K03l82L62
6223B41l17j05N1K68m31l8K09j08p5L95j6q9j50J24j13J05L9J37k20j47L28O2
$$ plain form
6061 -212 -26 -2 113 101 144 24 -248 128 -36 -114 -45 358 196 66 13 27 25 140 10 -160 -6 -43 -115 8
6085 8 192 30 -138 -193 47 251 142 -146 -104 3 -105 21 -27 84 -79 -134 71 145 -198 -170 -164 -36 -340
6108 -340 55 235 -50 216 114 106 86 197 -294 -183 -245 206 -2 -109 -72 -61 148 9 41 240 199 -135 -306
6131 -306 -117 -9 68 -5 -26 -331 106 -39 -168 -111 31 89 -113 93 292 88 38 -34 125 25 -133 202
6153 202 164 -5 93 -4 -93 16 -133 3 -22 306 10 -179 106 -339 235 16 111 148 -57 66 -192 99
6175 99 178 174 -48 -288 12 -173 -27 -207 -211 25 -295 -215 64 47 -130 155 -86 219 336 34 81 -37 282
6198 282 132 -218 168 159 -113 -35 -131 -147 43 -245 -51 -67 -130 -146 -64 -45 44 -30 -99 21 -30 58 261 -121 241
6223 241 -76 -181 -130 138 -293 -331 -122 -230 -305 90 74 -15 -165 -41 -154 -49 -10 127 -93 -240 88 150
6245A50K8k28Q1j14K86k10M3n5J53j15J25m70L38l18L55p6n2J34J96k57p7P2k6
6268c7J4k04R2J08m9K1J87l65nL13m6K23l51k4j4J34K05j01J14l01L28l75K59
6291A26o6R4k74J55j35M0K83j18j06J47k53N8M1K01k56K2K09j16J94l45Jo4K00
6314C8mJ80j50j1J96l70k0J28L21k19k64K1j4K29j6k39K27J53j74M2Q6j16J6J24
6338A64j46l3J39q5m4P5j80K25J99m28J50O9j97RK06k71K98m61P1J97O2pk8j36
6362a52J39O4j60K17j38J30j72K30m62M48l11l6L58r2j87L41k09J31k61j26M60
6383B12k66J09K33l45J67P4k68J27n8j9Lo4J1N06l84L0O0j59q8j8J91k4m9o7J76
$$ plain form
6245 150 178 -50 31 -83 203 -7 36 -19 134 19 144 -326 12 -306 49 -27 -79 55 251 -6 -83 -11 -37
6268 -37 -23 -227 -135 -27 -76 -55 132 -233 -238 75 29 252 -99 -123 -137 -3 202 101 215 -86 242 -133 126
6291 126 60 154 -120 35 -100 -60 223 105 -1 146 -107 -49 -8 193 -63 -41 168 52 246 -99 -98 -162 38
6314 38 34 214 64 53 249 -121 -141 -13 308 89 -175 -154 -168 61 45 -194 33 186 12 54 140 24 40 164
6338 164 18 -15 124 39 -5 70 -110 115 314 -114 36 105 -92 -83 123 -148 150 -311 -240 -43 19 12 -16 -152
6362 -152 -13 51 -109 108 -30 100 -72 158 -304 144 -167 -203 155 63 -124 217 8 139 -122 -248 212
6383 212 -54 55 288 -57 110 184 -84 43 -15 -34 -31 -95 -84 422 38 68 128 -31 -119 -137 54 30 -19 -86 90
$$ [...]
8191D4
##END NTUPLES=NMR FID
##END=
