##TITLE=1H_LR-758-R4-KA1K3IP
 CDCl3
 8 sc, 
 8.9.2023
##JCAMPDX= 6.0         $$ Bruker NMR JCAMP-DX V2.0
##DATA TYPE= NMR FID
##DATA CLASS= NTUPLES
##ORIGIN= UXNMR, Bruker Analytische Messtechnik GmbH
##OWNER= root
$$ XWIN-NMR		Version 3.5
$$ Fri Sep  8 16:16:01 2023 Russian Standard Time (UT+4h)  she@DPX200
##.OBSERVE FREQUENCY= 200.13135
##.OBSERVE NUCLEUS= ^1H
##.DELAY= (6, 6)
##.ACQUISITION MODE= SIMULTANEOUS
##.ACQUISITION SCHEME= undefined
##.AVERAGES= 8
##.DIGITISER RES= 18
##SPECTROMETER/DATA SYSTEM= spect
##.PULSE SEQUENCE= zg30
##.SOLVENT NAME= CDCl3
##.SHIFT REFERENCE= (INTERNAL, CDCl3, 0, 15.7039)
##AUDIT TRAIL= $$ (NUMBER, WHEN, WHO, WHERE, WHAT)
$$ ##TITLE= Audit trail, XWIN-NMR		Version 3.5
$$ ##JCAMPDX= 5.01
$$ ##ORIGIN= Bruker BioSpin GmbH
$$ ##OWNER= she
$$ F:/spectra/data/she/nmr/H-F/1/audita.txt
$$ ##AUDIT TRAIL=  $$ (NUMBER, WHEN, WHO, WHERE, WHAT)
(   1,<2023-09-08 16:14:44.73 +0400>,<she>,<DPX200>,
      <created by zg, POWCHK disabled, PULCHK disabled
       configuration hash MD5:
       00 E9 B6 7A A2 85 ED C7 34 08 36 98 17 FE 4E 26
       data hash MD5: 16K
       75 47 74 11 48 F9 58 E0 DF F7 14 DD 7C 5F 29 76>)
$$ ##END=
$$ 
$$ hash MD5
$$ 18 05 56 1D A7 2E 58 6A 1A 74 9C BA 6C E8 02 B2
##$RELAX= 
##$RELAX= 
##$RELAX= 
##$RELAX= 
##$RELAX= 
##$RELAX= 
$$ Bruker specific parameters
$$ --------------------------
##$DU= <F:/spectra>
##$EXPNO= 1
##$NAME= <H-F>
##$PROCNO= 1
##$TYPE= <nmr>
##$USER= <she>
##$AMP= (0..31)
100 100 100 100 100 100 100 100 100 100 100 100 100 100 100 100 100 100 
100 100 100 100 100 100 100 100 100 100 100 100 100 100 
##$AQSEQ= 0
##$AQ_mod= 1
##$AUNM= <au_zg>
##$AUTOPOS= <>
##$BF1= 200.13
##$BF2= 200.13
##$BF3= 200.13
##$BF4= 200.13
##$BF5= 200.13
##$BF6= 200.13
##$BF7= 200.13
##$BF8= 200.13
##$BYTORDA= 1
##$CFDGTYP= 0
##$CFRGTYP= 5
##$CHEMSTR= <none>
##$CNST= (0..31)
1 1 145 1 1 1 1 1 1 1 1 1 1 1 1 1 1 1 1 1 1 1 1 1 1 1 1 1 1 1 1 1 
##$CPDPRG= <>
##$CPDPRG1= <>
##$CPDPRG2= <>
##$CPDPRG3= <>
##$CPDPRG4= <mlev>
##$CPDPRG5= <mlev>
##$CPDPRG6= <mlev>
##$CPDPRG7= <mlev>
##$CPDPRG8= <mlev>
##$CPDPRGB= <>
##$CPDPRGT= <>
##$D= (0..31)
0 1.2 0 0 0 0 0 0 0 0.06 0 0.03 0 0 0 0 0.0002 0 0 0 0 0 0 0 0 0 0 0 0 
0 0 0 
##$DATE= 1694175284
##$DBL= (0..7)
120 120 120 120 120 120 120 120 
##$DBP= (0..7)
150 150 150 150 150 150 150 150 
##$DBP07= 0
##$DBPNAM0= <>
##$DBPNAM1= <>
##$DBPNAM2= <>
##$DBPNAM3= <>
##$DBPNAM4= <>
##$DBPNAM5= <>
##$DBPNAM6= <>
##$DBPNAM7= <>
##$DBPOAL= (0..7)
0.5 0.5 0.5 0.5 0.5 0.5 0.5 0.5 
##$DBPOFFS= (0..7)
0 0 0 0 0 0 0 0 
##$DE= 6
##$DECBNUC= <off>
##$DECIM= 32
##$DECNUC= <off>
##$DECSTAT= 4
##$DIGMOD= 1
##$DIGTYP= 9
##$DL= (0..7)
0 120 120 120 120 120 120 120 
##$DP= (0..7)
150 150 150 150 150 150 150 150 
##$DP07= 0
##$DPNAME0= <>
##$DPNAME1= <>
##$DPNAME2= <>
##$DPNAME3= <>
##$DPNAME4= <>
##$DPNAME5= <>
##$DPNAME6= <>
##$DPNAME7= <>
##$DPOAL= (0..7)
0.5 0.5 0.5 0.5 0.5 0.5 0.5 0.5 
##$DPOFFS= (0..7)
0 0 0 0 0 0 0 0 
##$DQDMODE= 0
##$DR= 18
##$DS= 0
##$DSLIST= <SSSSSSSSSSSSSSS>
$$ [...]
##$SUBNAM2= <"">
##$SUBNAM3= <"">
##$SUBNAM4= <"">
##$SUBNAM5= <"">
##$SUBNAM6= <"">
##$SUBNAM7= <"">
##$SUBNAM8= <"">
##$SUBNAM9= <"">
##$SW= 18.05172834244
##$SWIBOX= (0..15)
0 0 2 0 0 0 0 0 0 0 0 0 0 0 0 0 
##$SW_h= 3612.71676300578
##$TD= 16384
##$TD0= 1
##$TE= 0
##$TE2= 300
##$TE3= 300
##$TEG= 300
##$TL= (0..7)
0 120 120 120 120 120 120 120 
##$TP= (0..7)
150 150 150 150 150 150 150 150 
##$TP07= 0
##$TPNAME0= <>
##$TPNAME1= <>
##$TPNAME2= <>
##$TPNAME3= <>
##$TPNAME4= <>
##$TPNAME5= <>
##$TPNAME6= <>
##$TPNAME7= <>
##$TPOAL= (0..7)
0.5 0.5 0.5 0.5 0.5 0.5 0.5 0.5 
##$TPOFFS= (0..7)
0 0 0 0 0 0 0 0 
##$TUNHIN= 0
##$TUNHOUT= 0
##$TUNXOUT= 0
##$USERA1= <user>
##$USERA2= <user>
##$USERA3= <user>
##$USERA4= <user>
##$USERA5= <user>
##$V9= 5
##$VALIST= <valist>
##$VCLIST= <CCCCCCCCCCCCCCC>
##$VD= 0
##$VDLIST= <DDDDDDDDDDDDDDD>
##$VPLIST= <PPPPPPPPPPPPPPP>
##$VTLIST= <TTTTTTTTTTTTTTT>
##$WBST= 1024
##$WBSW= 4
##$XGAIN= (0..3)
0 0 0 0 
##$XL= 0
##$YL= 0
##$YMAX_a= 21739
##$YMIN_a= -9389
##$ZGOPTNS= <>
##$ZL1= 120
##$ZL2= 120
##$ZL3= 120
##$ZL4= 120
##$ABSF1= 10
##$ABSF2= 0
##$ABSG= 5
##$ABSL= 3
##$ALPHA= 0
##$AQORDER= 0
##$ASSFAC= 0
##$ASSFACI= 0
##$ASSFACX= 0
##$ASSWID= 0
##$AUNMP= <proc_1d>
##$AZFE= 0.1
##$AZFW= 0.1
##$BCFW= 1
##$BC_mod= 2
##$BYTORDP= 1
##$COROFFS= 0
##$CY= 11.3945322036743
##$DATMOD= 1
##$DC= 2
##$DFILT= <>
##$DTYPP= 0
##$F1P= 15.7292609196834
##$F2P= 12.9074282941183
##$FCOR= 0.5
##$FTSIZE= 0
##$FT_mod= 4
##$GAMMA= 1
##$GB= 0.15
##$INTBC= 1
##$INTSCL= 1
##$ISEN= 128
##$LB= 0.24
##$LEV0= 0
##$LPBIN= 0
##$MAXI= 10000
##$MC2= 0
##$MEAN= 0
##$ME_mod= 0
##$MI= 1.114404
##$NCOEF= 0
##$NC_proc= 0
##$NLEV= 6
##$NOISF1= 3.799351
##$NOISF2= 2.8
##$NSP= 1
##$NTH_PI= 0
##$NZP= 0
##$OFFSET= 15.70392
##$PC= 1
##$PHC0= -21568.41
##$PHC1= 14.05271
##$PH_mod= 1
##$PKNL= yes
##$PPARMOD= 0
##$PSCAL= 0
##$PSIGN= 0
##$REVERSE= no
##$SF= 200.130013532006
##$SI= 16384
##$SIGF1= 3
##$SIGF2= 2
##$SINO= 400
##$SIOLD= 16384
##$SREGLST= <1H.CDCl3>
##$SSB= 0
##$STSI= 0
##$STSR= 0
##$SW_p= 3612.71676300578
##$SYMM= 0
##$S_DEV= 0
##$TDeff= 0
##$TDoff= 0
##$TI= <>
##$TILT= no
##$TM1= 0
##$TM2= 0
##$TOPLEV= 0
##$USERP1= <user>
##$USERP2= <user>
##$USERP3= <user>
##$USERP4= <user>
##$USERP5= <user>
##$WDW= 1
##$XDIM= 8192
##$YMAX_p= 0
##$YMIN_p= 0
$$ End of Bruker specific parameters
$$ ---------------------------------
##NTUPLES= NMR FID
##VAR_NAME=  TIME,          FID/REAL,        FID/IMAG
##SYMBOL=    X,             R,               I
##VAR_TYPE=  INDEPENDENT,   DEPENDENT,       DEPENDENT
##VAR_FORM=  AFFN,          ASDF,            ASDF
##VAR_DIM=   8192,          8192,            8192
##UNITS=     SECONDS,       ARBITRARY UNITS, ARBITRARY UNITS
##FACTOR=    0.0002768,     1,               1
##FIRST=     0,             0,               0
##LAST=      2.2672688,     0,               0
##MIN=       0,             -9389,           0
##MAX=       2.2672688,     21739,           0
$$ Real data points
##PAGE= N=1
##DATA TABLE= (X++(R..R)), XYDATA
0@%%%%%%%%%%%%%%%%%%%%%%%Qj6J6j6J6j6J6k3L1l2L2l8M6m8N5o3O7p5Q4r2J04
$$ 0 0 0 0 0 0 0 0 0 0 0 0 0 0 0 0 0 0 0 0 0 0 0 0 8 -8 8 -8 8 -8 8 -15 16 -16 16 -22 24 -24 31 -32 35 -40 44 -48 56
44E6j15J23j36J52j68J85k04K26k49K73l02L36l73M15m63N20n90O75p82R21j107
$$ 56 -59 64 -72 80 -88 97 -107 119 -130 143 -159 177 -196 219 -244 276 -314 361 -421 500 -607
65f07J374j796K554m327J5833Q708l1128R701R650j6341N62K0460q924j2466Q995
$$ -607 767 -1029 1525 -2802 13031 21739 -9389 312 9962 -6379 -5817 14643 5719 -6747 2248
80B248K447j0932K802N757m232j734M823k863n966L400P006k856l139M790j815
$$ 2248 4695 -6237 -3435 2322 -1910 -3644 1179 -1684 -7650 -4250 2756 -100 -3239 1551 -264
95b64q342N987P894q405l086J0076j716n039P106q12q940M679M669m884L674L126
$$ -264 -8606 -2619 5275 -3130 -6216 3860 2144 -2895 4211 3399 -5541 -862 3807 -1077 2597 5723
111E723r303J285R521n412l758R210j953r156M242L459o186J863P270j145m547
$$ 5723 -3580 -2295 7226 1814 -1944 7266 5313 -3843 399 3858 -2328 -465 6805 5660 1113
126A113j627l80J075J759R82n09l314k080K456J601j16J253j658k472K560n83
$$ 1113 -514 -894 181 1940 2922 2413 -901 -2981 -525 1076 960 2213 555 -1917 643 60
142F0m604L128M086l933M94M038m429j790O344p45m506K745Nk907M520K053n316
$$ 60 -4544 -1416 2670 -1263 -769 3269 -1160 -2950 3394 2649 -1857 888 893 -2014 2506 4559 -757
159g57R94L943k953m36L532k858l996K713J989j538m6J125k03j749j429J016P03
$$ -757 237 4180 1227 791 4323 1465 -2531 182 2171 633 587 1712 1509 -240 -1669 -653 50
176E0j965M79J626k709j542L021N35j156J444q77k690Q92P20q90J946Q94k218
$$ 50 -1915 -1436 190 -2519 -4061 -1040 -505 -1661 -217 -1094 -3784 -2892 -2172 -3062 -1116 -222 -2440
193b440O51J322j432R30J806k524p96K065j300k00L439p38k463K569O49l033J116
$$ -2440 -1789 -467 -1899 -969 837 -1687 -2483 -418 -1718 -1918 1521 783 -1680 889 1538 -1495 -379
210c79K264k239p10K347m63j308J706J593j105j153K49P2r65N10J526r57j529
$$ -379 1885 -354 -1064 1283 820 -488 1218 2811 1706 553 802 874 -91 419 1945 988 -541
227e41J711P83j950O22J228k622p30K430j346j877K429M81k330J514J515k455
$$ -541 1170 1953 3 625 1853 -769 -1499 931 -415 -2292 137 618 -1712 -198 1317 -1138
243a138n36J625j244q53J616L07p17Q91N41o36k39Q5Q4L80J5l16l41l88N05J641
$$ -1138 -1674 -49 -1293 -2146 -530 -223 -940 -49 492 -144 -383 -298 -214 166 181 -135 -476 -864 -359 1282
263A282L05p69o38o60m26O56K42m34K77K45O8K19p22p22J001Q43q52k58m78j258
$$ 1282 1587 818 180 -480 -906 -250 -8 -442 -165 80 148 367 -355 -1077 -76 767 -85 -343 -821 -2079
283b079J138K454n20j249P10k01j086R70K51j884N91K283l69j439K34j73k20J265
$$ -2079 -941 1513 993 -256 454 253 -833 137 388 -1496 -905 1378 1009 -430 -196 -369 -589 676
301F76Q37j784j565P95Q49k45L88O55m19j84R16n12k168L00J962J48j96M98j025
$$ 676 1513 -271 -1836 -1041 -192 -437 -49 606 187 3 919 407 -1761 -1461 501 649 453 951 -74
320g4j090J646J427j164n78M20q55l86Q81M9n19J027R53o13j029o71l47M61J019
$$ -74 -1164 482 1909 745 167 587 -268 -654 227 276 -243 784 1737 1124 95 -576 -923 -462 557
339E57L76m69q86j2O34M92pl9k93m14n8K4m29l9R12Q84O9p84r42n44J11O54N71
$$ 557 933 464 -422 -434 200 692 685 646 353 -61 -119 -95 -524 -563 349 1233 1302 518 -424 -968 -857 -203 368
362C68m65r22J64N77k44o4M04m15k32P50n03j665L45J508N50M31K17j260r99R96
$$ 368 -97 -1019 -855 -278 -522 -586 -182 -597 -829 -79 -582 -2247 -1902 -394 156 587 804 -456 -1455 -459
382d59R18m95k48M74k7kM44o3n49L92J196k94j482o24L31R4J003Q76q68j092O44
$$ -459 459 -36 -284 190 163 161 605 542 -7 385 1581 1287 -195 -819 -488 -394 609 1485 617 -475 169
403A69M14q77j04J61k93K54Q52m96r20M64Q14K41j4n03n34l15K30O27L02k76L09
$$ 169 583 -294 -398 -237 -530 -276 576 80 -840 -376 438 679 665 162 -372 -687 -457 170 472 196 505
424E05O48m68o87N9j1j8P63K04q33k11M83K36L82N27m12o92l26P5J66K42L37L26
$$ 505 1153 685 -2 57 46 28 791 995 162 -49 434 670 1052 1579 1167 475 149 224 390 632 969 1295
446A295j94m24K51%p43J06N66p17o72O52l9n15O82L56j014n20J94j96j02N9k30
$$ 1295 1101 677 928 928 185 291 857 140 -532 120 81 -434 248 604 -410 -930 -736 -932 -1034 -975 -1205
467a205j21L78L69J50p8m05j95K09O2L17J62j60L39O50k30k3P93n5n73K29M8m28
$$ -1205 -1326 -948 -579 -429 -507 -912 -1107 -898 -836 -519 -357 -517 -178 472 242 219 1012 957 384 613 661 233
489B33L96P96J48k02l03k9L01J6m28J04r7p54K63Q78k43j18M67o12p65K36M1j7
$$ 233 629 1425 1573 1371 1068 1039 1340 1356 928 1032 935 181 444 1322 1079 961 1428 816 51 287 328 311
511C11M07n01q46N51N63k94K42J05q59o67L81M3j31K69M31J21m78o49M69N63k34
$$ 311 718 217 -629 -78 485 191 433 538 -321 -988 -607 -564 -695 -426 5 126 -352 -1001 -532 31 -203
532b03Rr3p91l1J145L81n9L8m79j04P76k38q45M24N09m75K78O07n57l82M77n9
$$ -203 -194 -287 -1078 -1109 36 417 358 396 -83 -187 589 351 -494 -70 439 -36 242 849 292 -90 387 328
554C28n44m48l0O56j0q93j57N57j40K89P80r05j463J48P48K48M51J17m51rR3o7
$$ 328 -216 -664 -694 -38 -48 -941 -1098 -541 -681 -392 388 -517 -1980 -1832 -1084 -836 -385 -268 -719 -728 -635 -702
576g02M72L88k93J4k5m51K08O23O12O70k67j242m8N95l70J98J045o45r97P65O56
$$ -702 -230 158 -135 -121 -146 -597 -389 234 846 1516 1249 7 -41 554 184 382 1427 782 -215 550 1206
597A206n15p1J73n03k01J73m1j17j79l8N65J71n58j53j5n66j1Q0m43L34O38l81
$$ 1206 691 620 793 290 89 262 221 104 -75 -113 452 623 65 -88 -103 -669 -680 -600 -1043 -709 -71 -452
619d52k71r0p13O5J208J26j176m12j8J41R57P14l20l53k64j75K94J94j96O39O33
$$ -452 -723 -813 -1526 -1461 -253 -127 -1303 -1715 -1733 -1592 -635 79 -241 -594 -858 -1033 -739 -545 -741 -102 531
640E31m21l91J76O8N09Q27m40r98j37M7M38P01j41o54R9L42j81j56k91k97J22
$$ 531 110 -281 -105 -37 472 1299 859 -139 -276 -229 209 910 769 115 214 556 375 219 -72 -369 -247
661b47K32oR6k87j25N29O7o39J81K03m22J1M04n14N1J067K18m86q9m35n52O47
$$ -247 -15 -21 75 -212 -337 192 259 -380 -199 4 -418 -407 -3 -517 -466 601 819 333 244 -191 -743 -96
683i6O41k49n3n4l71J88M88lP5j71m67j40P3m4L80L72k7j09p4m09j11L95O5j90
$$ -96 545 296 243 189 -182 6 494 491 566 395 -72 -212 -139 -183 197 569 542 433 359 -50 -161 234 299 109
707A09j0k12j99N15K86l02j06k55k38J90Pl08jJ33r6M35K34n89j60L40k49k15
$$ 109 99 -113 -312 203 489 187 81 -174 -412 -222 -215 -523 -524 -391 -487 -52 182 -407 -567 -227 -476 -691
729f91L70j02j0N19m0l19K36L00m0P6p9n10j6M48K96J68n2j40p1j25l4Q6p9k27
$$ -691 -321 -423 -433 86 46 -273 -37 263 223 299 220 -290 -306 142 438 606 554 414 343 218 184 270 191 -36
753c6J89R5l63Q4N72j25k64J23l48l27L65J69j47P5R8p0J38K20j97j59K0r9j49
$$ -36 153 248 -115 -31 541 416 152 275 -73 -400 -35 134 -13 62 160 90 228 448 251 92 112 13 -136
776a36J5J55K74M3k02q3J9j31L5R5l47k25L08J58q7L9R1p8J38m5l35o6M6P8K81
$$ -136 -121 34 308 351 149 66 85 -46 -11 84 -263 -488 -180 -22 -109 -70 21 -57 81 36 -299 -365 -319 -241 40
801D0M7j46J45K05j21m0j40k50J24L43j72j64J22N3J1K57l2m83j49Q2n2l4J98
$$ 40 87 -59 86 291 170 130 -10 -260 -136 207 35 -129 -7 46 57 314 282 -201 -350 -268 -320 -354 -156
824a56J06J06J8m8j28j53L0K77l6k11j5J2p1L01M54k47k53N9k80k46L15or2K14
$$ -156 -50 56 74 26 -102 -255 -225 52 16 -195 -210 -198 -269 32 486 239 -14 45 -235 -481 -166 -172 -264 -50
848e0J71j39q2n5k18J15J98k8j24j54j1K54L73P4j02l8j45RJ30j71q1L41L08L5
$$ -50 121 -18 -100 -155 -373 -258 -60 -88 -212 -366 -377 -123 250 324 222 184 39 48 178 7 -74 267 575 610
872F10j45j65j99J62K70m3k91k63n5J67K06k6n0o9j26J26l58m04O6L52J96L2o0
$$ 610 465 300 101 263 533 490 199 -64 -119 48 254 228 178 109 -17 109 -249 -653 -587 -235 -39 -7 -67
895f7m23m2M06J65l53o7l7j93K00J94j68L3L55J81j79l13k94O8K38K43j2n9j01
$$ -67 -490 -532 -126 39 -314 -381 -418 -611 -411 -217 -385 -352 3 184 5 -308 -602 -534 -296 -53 -65 -124 -225
918b25J51J61r3m5O6m1K8P0j32j41L50L15L3M4k00l30k9R2M8J36Jj34J6O0j71
$$ -225 -74 87 -6 -51 15 -26 2 72 -60 -201 149 464 497 541 341 11 -18 74 122 258 259 125 141 201 30
943C0M8P4k22l9Pk63j92K81J23J12K52j62l25k3Q8Q6P0Q6p4Q7J74R0Lm4N4R2l0
$$ 30 78 152 -70 -109 -102 -365 -557 -276 -153 -41 211 49 -276 -299 -211 -125 -55 31 -43 44 218 308 311 267 321 413 383
970C83j85q9M5K4L30J89k76k26J54r0k41j2q1r0K94J27k95j04nNK11l0l67j55
$$ 383 198 109 154 178 508 697 421 195 349 259 18 6 -75 -165 129 256 -39 -143 -148 -143 68 38 -329 -484
994d84K9N9J12J25l3M3P8j60j71J1n4J47J74j12k04K31J77M0J19o7l20K7Q0J32
$$ -484 -455 -396 -284 -159 -192 -149 -71 -231 -402 -391 -445 -298 -124 -236 -440 -209 -32 8 127 60 -260 -233 -153 -21
1018b1J62%pK59P2j43J29P4j53l9J14r5M6L37q6j04Q9j03j67J52r8l63M0J22k44
$$ -21 141 141 134 393 465 322 451 525 372 333 447 352 398 735 649 545 634 531 364 516 418 55 95 217 -27
1043b7Q7J79j07n0j23j88n9n7O9R9Rk30P5K90n2KP9k30j23K22k9K0K56o5n8J95
$$ -27 60 239 132 82 -41 -229 -288 -345 -276 -177 -168 -398 -323 -33 -85 -83 -4 -234 -357 -135 -164 -144 112 47 -11 184
1069A84L7k42J61O4k12j56J26m8J80K33p0r7j35j66O3J57r6j28J12j20nJ67J78
$$ 184 221 -21 140 204 -8 -164 -38 -86 94 327 257 160 25 -141 -78 79 -17 -145 -33 -153 -158 9 187
1092A87j04L8k20j52%M6J1J86j2j79J79J1r6k3L9j87Q7m5k02K09K93r6n1K03j62
$$ 187 83 121 -99 -251 -251 -205 -194 -8 -20 -199 -20 -9 -105 -128 -89 -276 -189 -234 -436 -227 66 -30 -81 122 -40
1117d0l0L07j07l69J57J70J40L03rl01j7P3L4N2j8j17nL9j45nJ03J12N2j23m69
$$ -40 -70 237 130 -239 -82 88 228 531 522 221 204 277 311 363 345 228 223 262 117 112 215 327 379 256 -213
1142b13k13J51Q1K10J36l00k88K49J50k01M6m6k46J57J03j49J04K52n8J20j8k73
$$ -213 -426 -275 -194 16 152 -148 -436 -187 -37 -238 -192 -238 -484 -327 -224 -373 -269 -17 -75 45 27 -246
1164b46o3K28n9j0R6m8N4K54j13j92N1j08L3J74M2j90pO1L5K51Q9j45pj46j95
$$ -246 -309 -81 -140 -150 -54 -102 -48 206 93 -99 -48 -156 -123 51 93 -97 -104 -43 -8 243 332 187 180 34 -161
1189a61R6J86J5J48M2j79q4N9r2L0K53k39k63l2M6P8K72J37k84j60p1oQ2K4m8
$$ -161 -65 121 136 284 326 147 63 122 30 60 313 74 -189 -221 -175 -97 175 312 28 -132 -203 -209 -127 -103 -151
1214a51M6J41l6O2N6q3K2J80j93n3N6o5J50J80j84n1J76Jr0mk06k33K49K03k9
$$ -151 -105 36 0 62 118 35 57 237 44 -9 47 -18 132 312 128 77 253 254 164 160 -46 -279 -30 173 144
1239A44p5j23j09J83k1p6n3Rj42O8J46q3N8K13m4j42r7j04N1J67J02m0q0j2l6
$$ 144 69 -54 -163 20 -1 -77 -130 -121 -263 -195 -49 -132 -74 139 95 -47 -144 -248 -197 -30 72 32 -48 -60 -96
1264i6J73l2q9l4l0o4m9K7k1J45R6n4qJ1j92P4P6j53j5K30Ll4J71n4q7J22m2j33
$$ -96 77 45 -44 -78 -108 -172 -221 -194 -215 -70 26 -28 -36 -25 -217 -143 -67 -220 -235 -5 -2 -36 135 81 -6 116 74 -59
1292e9P2K9j06J8J63k8Q7L4j97o5m5m7Q2R7j27J9J40p8J3P8p1m8J23j34n1N1P0
$$ -59 13 42 -64 -46 117 89 176 210 13 -52 -97 -144 -62 35 -92 -73 67 -11 2 80 9 -39 84 -50 -101 -50 20
1319B0L2J09m4j53Q7Lq4O1j42o5N2J66j22L9P9j19q0R3j40q3J40nmQ5J4q0J35
$$ 20 52 161 117 -36 51 54 -30 31 -111 -176 -124 42 -80 -41 38 -81 -161 -68 -208 -291 -151 -156 -160 -75 -61 -141 -6
1346fP7j58PL3j6K7Q4l0O8J09oj8m5j00n4Q8m2q9R0J1l1J2j5j12J01nj51ml6N7
$$ -6 71 -87 -80 -47 -63 -36 48 18 86 195 189 171 126 26 -28 60 18 -71 19 30 -1 11 -4 -116 -15 -20 -171 -175 -211 -154
1376a54N4J36r7n1J01k9j5l9n6P4Q8K3J1K5o4J37J16j07k04J1K9J5J17M4j18J39
$$ -154 -100 36 -61 -112 -11 -40 -55 -94 -150 -76 12 35 46 71 7 144 260 153 -51 -40 -11 4 121 165 47 186
1402A86K1k8p1k0r8P9J03j27j3J34k3K6R6j39q0N9o1p9J9m0P9J03L6j65j1q7q2
$$ 186 207 179 108 88 -10 69 172 45 32 166 143 169 265 126 46 105 44 -35 -16 -56 23 126 162 -3 -14 -101 -183
1429a83L7k5l4p9O7k9M8N5k2J3l1r3L9K7k1J16K02r3M2K4l3q1R0O7p5Q2q3o3J63
$$ -183 -146 -171 -205 -284 -217 -246 -198 -143 -165 -152 -183 -276 -237 -210 -231 -115 87 -6 36 60 27 -54 36 103 28 110 27 -36 127
1458A27O9k6K1l9r5oJ6k22R3Q3j2R6k5k11J2J41k3o3m9o4j6J33l5oM3J15k6k7
$$ 127 196 170 191 152 57 51 67 -155 -62 21 9 105 80 -131 -119 22 -1 -64 -113 -177 -193 -60 -95 -101 -58 57 31 4
1486Dj73p5K5J56PJ34j41m9J02Rj23k8O5n1O7R4j40l4J69Q5K4k5j16j11J34mj9
$$ 4 -169 -244 -219 -63 -56 78 -63 -112 -10 -1 -124 -152 -87 -138 -71 23 -117 -151 18 103 127 102 -14 -125 9 5 -14
1513a4L6O4J3m1J3r4LJ4m4o9j3p6j2Q5L8k6mo2j26O6m8r5J07qj8J33N0o4O4j6
$$ -14 22 86 99 58 71 -23 -20 -6 -50 -119 -132 -208 -220 -135 -97 -123 -127 -189 -315 -249 -297 -392 -285 -293 -311 -178 -128 -192 -128 -144
1543a44j10J28J5k5M0O0l6J16J28p6j9lp0qP9o3nJ38mr4K5m2k8Q3n1o4r9K2N8
$$ -144 -254 -126 -111 -136 -96 -36 -72 44 172 96 77 74 4 -4 75 12 7 145 141 47 72 30 2 85 34 -30 -129 -107 -49
1572d9J43j4l4l4K0l8jJ6q8k9J66j16K0P0n3L0l7p5j33J24j2k1M2J5q2J14O1o2
$$ -49 94 80 46 12 32 -6 -7 9 -79 -108 58 -58 -38 32 -21 9 -28 -103 -236 -112 -124 -145 -103 -88 -170 -56 5 -57
1600e7LJ1p8J6O5J5N5R4q0K5oj9oJ44j20j20M9R8k5J03J4j54PKo5%k4n9N1l9K
$$ -57 -54 -43 -121 -105 -40 -25 30 124 44 69 63 44 38 182 62 -58 -9 89 64 167 181 27 34 36 -29 -29 -53 -112 -61 -100 -98
1631i8O5Q0n2l1n6j10K7J54M3N%po0J30L1n1K6n1q8J08k6M6QR8r3%p3p7J26L3
$$ -98 -33 47 -5 -36 -92 -202 -175 -21 22 27 27 20 -40 90 121 70 96 45 -43 65 39 85 93 191 98 98 25 -52 74 107
1661A07p7n9L5M6N3K3m7o4J2l7k2J00p5L1P6nj1L2J6j44K8l1j18N2J46p6l2kq0
$$ 107 30 -29 6 52 105 128 81 17 29 -8 -30 70 -5 26 102 97 86 118 134 -10 18 -13 -131 -79 67 -9 -41 -43 -123
1690a23R9L3j02m0L5l5r4J54KJJ21j0j32K1mK2J17o3n3P2ML1P2n4Mr2M7j13pR7
$$ -123 -24 9 -93 -133 -98 -133 -227 -73 -71 -70 51 41 -91 -70 -74 -52 65 2 -51 21 25 56 128 74 78 -14 33 -80 -87 10
1720A0j4N1Q8j61o9R9J0o3O1r6o7J41M4m5J2M3l0L7jq2MJ6nN4L0lJ5Q3j14j33
$$ 10 -4 47 135 -26 -95 4 14 -49 12 -84 -151 -10 34 -11 1 44 14 51 50 -32 -28 -12 -17 37 67 64 79 162 48 -85
1750h5k2N3L5O6o9p7L0j9J21J9o4j02J5k3m7J26J7QO4M3j71L7R5n2mJ5n1o1J17
$$ -85 -107 -54 -19 47 -22 -99 -69 -88 33 52 -12 -114 -99 -122 -169 -43 -26 -18 46 89 -82 -45 50 -2 -6 9 -42 -103 14
1779A4L2nQk3m3K4j0j63R6K1L2q0Q1l5N5l5r4J5QJ4L9L0p8M4P5j0LK1n1l2K7p6
$$ 14 46 41 49 26 -17 7 -3 -166 -70 -49 -17 -97 -16 -51 4 -31 -125 -110 -102 -88 -49 -19 -97 -53 22 12 15 36 -15 -47 -20 -96
1811i6PO1K4J8m0Mo6R9k4o9%K2o7J39J0m9K9K9k3m4Km1N4L0L9oO2On4N1J1r7M5
$$ -96 -89 -28 -4 14 -26 -22 -88 11 -13 -82 -82 -60 -127 12 22 -27 2 31 8 -36 -34 -75 -21 9 48 42 104 110 56 107 118 21 66
1844F6Nm5J7pl8M7k%l9n1p3nN7p8P3O9j9K0l5Jj2L2j6n6K4O2k8M0j1j6N5m5Ql2
$$ 66 71 26 43 36 -2 45 43 43 4 -47 -120 -125 -68 -146 -73 -4 -23 -3 -38 -37 -49 -17 -33 -89 -65 -3 -31 9 -2 -18 37 -8 0 -32
1878c2j9lN5L6q0L3K6j7Q0o3o2kJ9L2J5O4k8o5J06l5m0k1J8k8MK5m8K7R4m2k1
$$ -32 -51 -54 1 37 -43 -10 16 -1 79 16 -46 -48 -29 3 18 82 54 -11 95 60 20 -1 17 -11 -7 18 -30 -3 91 49 28
1909B8m7K8m5K5po5mK2L8K7l7j6k6O3l9K7k7n1J03J1O8QJ0j6J3ln7KP3m2J06j12
$$ 28 -19 9 -36 -11 -18 -83 -87 -65 -27 0 -37 -53 -79 -16 -55 -28 -55 -106 -3 8 76 84 94 78 91 88 31 33 106 64 170 58
1941E8PO2mrm1J5j8q6KK0o9P6O8q6K4j4n6M1m9L5l7JK0K8m2M0k9M2L3q1k7j0J34
$$ 58 65 127 123 114 73 88 70 -16 -14 6 -63 13 81 -5 19 5 -51 -10 -59 -24 -61 -60 -40 -12 -54 -14 -43 -1 32 -49 -76 -86 48
1974D8n4K2o6M7kk8L8j3n6M6N0j2K2l7NN4K5n7l6O2%oK3k2L4O9K7j19pn2J7L6
$$ 48 -6 16 -50 -3 -5 -33 5 -8 -64 -18 32 20 42 5 10 64 89 32 -4 58 58 52 75 53 87 156 183 64 57 5 22 58
2006E8j2n0K1K6o5Q9j1j00j7%l4m2K6K0L9N8kn6K7m1K7JL6k0P6l7L4j4J19j10
$$ 58 46 -4 17 43 -22 67 56 -44 -61 -61 -95 -137 -111 -91 -52 6 4 -52 -25 -66 -39 -38 -2 -22 54 17 51 37 156 46
2036D6O2l4n3KJ7K7l1N9r3Q1l0l7K1n0l7L8Rk1J7J7l1lP1j01J4J4J9q2M5J2K0
$$ 46 108 74 21 23 40 67 36 95 2 83 53 16 37 -13 -50 -12 -3 -24 -7 10 -21 -24 47 -54 -40 -26 -7 -89 -44 -32 -12
2067a2Q9n5o3J0M3o6J8l6k3L1L4o2N2K4L0k2K4j21L6QQ1l5O7l2J0L3K3lo7L6j2
$$ -12 77 22 -41 -31 12 -54 -36 -72 -95 -64 -30 -92 -40 -16 14 -8 16 -105 -69 -61 20 -15 52 20 30 63 86 83 16 52 40
2098D0KO9j9l1P1q4kj0l9L7j6j07K2MM0M2Ol2p2M8j8L4o2J1l2J03Ol2O8nj5l9
$$ 40 42 111 92 61 132 48 46 36 -3 34 18 -89 -67 -63 -23 19 25 -7 -79 -31 -49 -15 -77 -66 -98 5 11 -21 47 42 27 -12
2130a2M9j13PQ9lJQj6j2M6l6p9N8l8K3J2Nm4K7O5p1Ql8M0J5j1%j3QL5j3Qn4lJ05
$$ -12 37 -76 -69 20 17 18 26 10 -2 44 8 -71 -13 -51 -28 -16 -11 -55 -28 37 -34 -26 -64 -24 -9 -20 -20 -33 -25 10 -3 5 -49 -52 53
2165E3n6j7LM6l7J7Jn0K4KJ1n5qj1K3P6p0R6l1o7M0O6p2m4K2O9j1rN0k1J14n0
$$ 53 -3 -20 -17 29 -8 9 10 -40 -16 -14 -3 -58 -66 -77 -54 22 -48 48 17 -50 -10 56 -16 -60 -38 31 20 11 61 40 154 104
2197A04j17L4L7o0nK6n0N4j5J7n5nk8K9k3oj1N4Mk2K5l4J7M0nl3L7j18P5N7J0
$$ 104 -13 21 58 -2 -7 19 -31 23 8 25 -30 -35 -63 -34 -57 -63 -74 -20 -16 -38 -13 -47 -30 10 5 -28 9 -109 -34 23 33
2228C3j9%M4p0M0jn3n9O9k8j4L5m0N1mo8K7j1m1J06j5q5j7P2O0l9O1l1k9M5Ln7
$$ 33 14 14 58 -12 28 27 -26 -85 -16 -44 -58 -23 -63 -12 -16 -84 -57 -68 -109 -3 -18 -103 -120 -48 12 -27 34 3 -26 19 22 -35
2260c5P0jj8K8Rr7pJ19j00rK6L5o7N2pnj3pj0J9l7k3O6l1j6P0qK9nJ9p3j3L1p
$$ -35 35 34 16 44 53 -44 -51 68 -32 -41 -15 20 -47 5 -2 -7 -20 -27 -37 -18 -55 -78 -12 -43 -59 11 3 32 27 46 -27 -40 -9 -16
2294a6J9p7O6J1J5m6qk0K7j5m2J7O1n9L7K0jm6J7M9J7J0l8j4oQ6k3oM9ml9k2J7
$$ -16 3 -74 -8 3 18 -28 -36 -56 -29 -44 -86 -69 -8 -67 -30 -10 -11 -57 -40 9 26 36 -2 -16 -22 64 41 35 84 80 41 19 36
2327C6l8N0m6J3J5m7l9O2k3L0j06qK3L7J5k9oJQ5o8J0N3o9M6L5q6K8L8O6m1kj0
$$ 36 -2 48 2 15 30 -17 -56 6 -17 13 -93 -101 -78 -41 -26 -55 -61 -60 25 -43 -33 20 -49 -3 32 -54 -26 12 78 37 35 25
2359B5L1nl5MK1n3jN5Ml4J2j8K7m8J9p5N9J7j7M1l1J3L3l1jk4O0j9n6Q7l8K0n
$$ 25 56 51 16 20 41 -12 -13 42 46 12 24 6 33 -15 4 -71 -12 5 -12 29 -2 11 44 13 12 -12 48 29 -27 60 22 42 37
2392C7n6J1j5L1k2L1Pq7R0l5Knn5K4onK7n4K9Q2l7M6ol2O8o7M8p5O3j8M6n9K9
$$ 37 -19 -8 -23 8 -14 17 24 -63 27 -8 -6 -11 -66 -42 -48 -53 -26 -80 -51 31 -6 40 34 2 70 3 51 -24 39 21 67 8 37
2425C7J2k4j4Qk4o0O9k8l8L8L6o0K1P0r7J9NK6m2J5N3k6l6M1Jk1L9k5l9J6j0J08
$$ 37 49 25 11 19 -5 -65 4 -24 -62 -24 12 -48 -27 43 -54 -35 -30 -4 -46 -31 22 -4 -40 1 2 -19 20 -5 -44 -28 -38 70
2457G0l7lk2O3q0J9Np6M1p3O2N9k8rJ9k5L2Lk5J3M0q7N4k1J3J3K9j5J0n1J3rR
$$ 70 33 30 8 71 -9 10 15 -61 -20 -93 -31 28 0 -9 10 -15 17 20 -5 8 48 -39 15 -6 7 20 49 34 44 -7 6 -3 6
2490FO4r2K5K4k6Rp2N0K5n4j1oJ0M6q0P1j6J0j2N4nj18L7K9O8J5mn1K7K0J9r3
$$ 6 70 -22 3 27 1 10 -62 -12 13 -41 -52 -58 -48 -2 -82 -11 -27 -17 -29 25 20 -98 -61 -32 36 51 47 -4 23 43 62 -31
2522c1N3K5n0jN8o7O0J1k1n3j4J3k6K2J9L1n9O3K4o4K9k9K8m6M3l7KM8j0j3n2
$$ -31 22 47 -3 -4 54 -13 47 58 37 -16 -30 -17 -43 -21 -2 29 -30 33 57 -7 22 -7 21 -25 18 -19 -17 31 21 8 -44
2553d4J24p1L3pm8lQN5Rp1Rk3J7k3K4m2L7oK8NK6l5L7m2M5k9pO5o0L5m4L4m1N3
$$ -44 80 9 42 35 -13 -16 -8 47 56 -15 -6 -29 -12 -35 -11 -53 -16 -22 6 11 37 2 39 -3 42 13 6 71 11 46 2 36 -5 48
2587D8M9p7o2K3k1L1m2K8m8L2K0k6K1m8K5K5Jj7j6KN6K9m0K3PJ0m0j4J6NK9rM
$$ 48 97 20 -42 -19 -40 -9 -51 -23 -71 -39 -19 -45 -24 -72 -47 -22 -21 -38 -54 -52 4 33 -7 16 23 33 -7 -21 -5 0 29 20 24
2620B4l9J6O8o5l1Rn6P1J9m8l6R4k8l0Q9m3l6J2k8J1L0k8O8L9r4J7K9k3l2N9p1
$$ 24 -15 1 69 4 -27 -18 -74 -3 16 -32 -68 26 -2 -32 57 14 -22 -10 -38 -27 3 -25 43 82 -12 5 34 11 -21 38 -33
2651c3L7j4O8r1L2J2qJl0Rj4N5j21N2k4N8l8N1l3%j5M8n9N0M2l0L8Lp7M7jm4K2
$$ -33 4 -10 58 -33 -1 11 3 4 -26 -17 -31 24 -97 -45 -69 -11 -49 2 -31 -31 -46 2 -57 -7 35 5 43 46 -31 16 15 -29 -7
2684gl1Q3q7N3o2L4L0p3j6J17j05J9O1n4J7j9NM4j6L8o4K3NLK1J6l8K4OmKk8k2
$$ -7 -38 45 -42 11 -51 -17 13 -60 -76 41 -64 -45 16 -38 -21 -40 -35 9 -7 31 -33 -10 -5 -2 19 35 -3 21 27 23 25 -3 -25
2717b5L4m3qL1K0Pl1K1l7l3L8J8j6j2oM0M2r3Ok2O2m5N9K7p6N5j4K3L5m7M0q6
$$ -25 9 -34 -42 -11 9 16 -15 6 -31 -64 -26 -8 -24 -36 -42 -2 40 -53 -47 -69 -7 -52 7 34 -42 13 -1 22 57 10 50 -36
2749c6M7%Pl3qM6o7N3k7M3q4N3J7k9pJ7m3L5K3J3m7J3L4j9M0k3l1JK4J4J4p3J40
$$ -36 11 11 18 -15 -23 23 -44 9 -18 25 -59 -6 11 -18 -25 -8 -51 -16 7 20 -27 -14 20 1 41 18 -13 -12 12 26 40 -33 107
2782A07q7L1q9K0J4k6K6M3n5MJ3l3J1l6Q0l5PM1j6j6K7Jl5N8Lpk1jLk1L7j2j7
$$ 107 20 51 -38 -18 -4 -30 -4 39 -16 -12 1 -32 -21 -57 23 -12 -5 36 20 4 31 32 -3 55 58 51 30 29 32 11 48 36 19
2815A9L4m9j5K3oJ4p1K0P8n6kroL5m7j2J4K2L8j3j8j6N8l8KJ1Pl1K0M9j6n8L4
$$ 19 53 4 -11 12 6 20 -51 -31 47 -9 -11 -20 -26 9 -38 -50 -36 -14 24 11 -7 -23 35 -3 -1 10 17 -14 6 55 39 -19 15
2848A5m1N4j4p2M5K9j2j3K7m1J8l5N6M3j9l1%K2l7oqmL3qNKrJ8l6J6J7nJ1l6J8
$$ 15 -26 28 14 -58 -13 16 4 -9 18 -23 -5 -40 16 59 40 9 9 31 -6 -12 -20 -24 9 1 6 8 -1 17 -19 -3 14 9 20 -16 2
2883Bl4J8k0K1k5ON3kk4j2L2l9J9j1K0o4M7P8p2j4O0k7l0O6l4pK6K1j2M5j44K8
$$ 2 -32 -14 -34 -13 -38 -32 21 19 -5 -17 15 -24 -5 -16 4 -60 -13 65 -7 -21 39 12 -18 48 14 7 33 54 42 87 -57 -29
2915b9K2l0J0K7k6OM8l0J8q5N1pjk8N5K6m2J3Nk7O9m5n0O3m1J8J3M4l4k7K%j1
$$ -29 -7 -37 -27 0 -26 -20 28 -2 16 -69 -18 -25 -26 -54 1 27 -15 -2 3 -24 45 0 -50 13 -28 -10 3 47 13 -14 -12 -12 -23
2948b3j9M4j5NK9l2Qj5J1j6M6m9J0k6O9o9J1N3J4PN1p8L6r5K6N5p2O4k7l7OL4
$$ -23 -42 2 -13 -8 21 -11 -3 -18 -7 -23 23 -26 -16 -42 27 -42 -31 22 36 43 94 16 52 -43 -17 38 -34 30 3 -34 -28 6
2980Fk8j9K9J5j7l0J5oRO0m1J8J6j7j3rk3M4L9K7p5N7l4k2J5o0M6j5oO7k8l0L9
$$ 6 -22 -41 -12 3 -14 -44 -29 -35 -26 34 -7 11 27 10 -3 -12 -35 9 48 75 0 57 23 1 16 -44 2 -13 -19 48 20 -10 29
3013B9l0Lm9J7mJ4M3l0j2M4l6J3K6m4Lk4O4M1m6j3pj4M7Olk6qk3M7j6m0P9k9n6
$$ 29 -1 2 -47 -30 -34 -20 23 -7 -19 25 -11 2 28 -16 -13 -37 27 68 22 9 2 -12 35 41 38 12 4 -19 28 12 -28 51 22 -34
3047c4J7K1j1L9k1l9J4L0o3J11k6p3OM0rMl5K1K6o3J03l7K9n0K7Rl9L0l9K5p3
$$ -34 -17 4 -7 32 11 -28 -14 16 -47 64 38 -35 -29 11 2 6 -29 -8 18 -45 58 21 50 0 27 36 -3 27 -12 13 -60
3078f0O6J2j0l0N3mp2J2N4m6K9k1KJ1K7l3K5Nm2M8oo3Q1m6K0J5rj4jK5k9K9j7
$$ -60 6 18 8 -22 31 27 -45 -33 21 -25 4 -17 -15 -4 23 -10 15 20 -22 26 20 -43 38 -8 12 27 18 4 3 28 -1 28 11
3111A1p4j0M8P1n6PL3m9o7O3K1J2M1q1NmM1j9J9l6K0%l3j1M8L3m0Jk8PJNk1M7
$$ 11 -63 -73 -25 46 -10 -3 30 -19 -86 -23 -2 10 51 -30 -25 -29 12 -7 12 -24 -4 -4 -37 -48 0 33 -7 -6 -34 -27 -26 -21 -42 5
3145Em7l2N0nK2M7j32N2k6O8m1k5O3m5M6K9k2Kj0k7K5L0Rr0L8k8j9k0R5jL6m6
$$ 5 -42 -74 -24 -29 -7 40 -92 -40 -66 2 -39 -64 -1 -46 0 29 7 9 -1 -28 -3 27 36 -54 -16 -44 -63 -83 12 11 47 1
3177Aqk1K5K2k3lj1knL1o6J1M6lk4K5l4N2j9k8M1K6l6K2o2N3qoM4q5PK6Qj3k7
$$ 1 -7 -28 -3 19 -4 -7 -18 -20 -25 6 -60 -49 -3 -6 -30 -5 -39 13 -6 -34 7 33 -3 19 -43 10 2 -4 40 -45 -38 -12 -4 -17 -44
3212d4L2k6M5ol4l9K8L1On7P0k9K5l6LOj0Q6k5m1J4Lmj5N8j7m9L3NK0o2Mj8L5
$$ -44 -12 -38 7 1 -33 -72 -44 -13 -7 -64 6 -23 2 -34 -31 -25 -35 51 26 -15 -1 2 -2 -17 41 24 -25 8 13 33 -29 -25 -43 -8
3246hj6K6k4K8l5J9qK2k6N4nQQK8r0O9q7oL3k4O4oJL2q1rK7n9K9K2k4L5l3j6K5
$$ -8 -24 2 -22 6 -29 -10 -18 4 -22 32 27 35 43 71 -19 50 -37 -43 -10 -34 30 24 25 57 -24 -33 -6 -65 -36 -14 -38 -3 -36 -52 -27
3281b7PL3l6K3J7K%km8L4NLm7M5J7M8k2J3n7K4J0j8m1JpJM9r7O1K0q9R3k1J4K2
$$ -27 -20 13 -23 0 17 19 19 17 -31 3 8 11 -36 9 26 74 52 65 8 32 42 24 -17 -16 -23 -22 27 -70 -9 11 -78 15 -6 8 30
3316C0r%Rk5K0M2r1j3N2nl1J7P4o9LJ1pk7R7r5l7P8k7k2MJ5K6n0M1n0M3Llmk7
$$ 30 21 21 30 5 25 67 -24 -37 15 10 -21 -4 70 1 4 15 8 -19 78 -17 -54 24 -3 -25 -21 -6 20 -30 11 -39 4 7 4 0 -27
3351b7k7L7K8l5N7ok7NL9o4K2j2k4pL9j4J5LL0l5J3m2n4O8K5j0oRl2L2k5L7J0
$$ -27 -54 -17 11 -24 33 27 0 5 44 -20 2 -10 -34 -41 -2 -16 -1 2 32 -3 10 -32 -86 -18 7 -3 -9 0 -32 0 -25 12 22
3384B2jPo3N1l4J9K0Mk5K5oj4K9l7m2M7l1j9JO7l9KL0o1j7Q1n4M6o5K8nM3Opn
$$ 22 21 28 -35 16 -18 1 21 25 0 25 19 5 34 -3 -45 2 -29 -48 -47 20 -19 -17 13 -48 -65 16 -38 8 -57 -29 -34 9 15 8 3
3419Ck7MJ3lJLN6K5r2L9k5j8L3n5K8J7k2M7j7l8K5k0l2M2J7k4k3M0N6n4klM6l2
$$ 3 -24 -20 -7 -10 -9 -6 50 75 -17 22 -3 -21 12 -43 -15 2 -20 27 10 -28 -3 -23 -55 -13 4 -20 -43 -3 53 -1 -3 -6 40 8
3453Hl3J7K3L9m6K2p2P5p5N4pl6M4kn9KL3J1j8l6QN7n2K1L9j0j1nK4J5JK7n7O
$$ 8 -25 -8 15 54 8 30 -42 33 -42 12 5 -31 13 11 -48 -46 -13 -2 -20 -56 -48 9 -43 -22 17 7 -4 -9 15 30 31 58 1 7
3487GL0j3k0k0J8l4J4J9J5k9M1n3L6l1MQL5k8Oj6k5M2j0k5K4LJm3J6L9K4l4L1
$$ 7 37 24 4 -16 2 -32 -18 1 16 -13 28 -25 11 -20 -16 -8 27 -1 5 -11 -36 6 -4 -29 -5 -2 -1 -44 -28 11 35 1 32
3520C2k1M0l2l9M2l9nK8m7N7pj4j4N9o1l3O8o4O2o3Q0lp5R8r5O9J8n0pK1K1LN
$$ 32 11 51 19 -20 22 -17 -22 6 -41 16 9 -5 -19 40 -21 -54 14 -50 12 -51 29 26 -49 49 -46 23 41 -9 -16 5 26 29 34
3553C4l1M4k0J2n9l0O8j5Nl4N2n3nL8Ll0J2K1kK1k0L3j09O7K5j4pjL5l6J7L1p1
$$ 34 3 47 27 39 -20 -50 18 3 8 -26 26 -27 -32 6 9 -21 -9 12 10 31 11 44 -65 2 27 13 6 5 40 4 21 52 -19
3586a9N0oK6j5n4J2K3k1Nk6L2l9m1J4O1l0J2lk3P3n3K9k8L7Ro9M4jj4L7loRM0
$$ -19 31 25 51 36 -18 -6 17 -4 1 -25 7 -32 -73 -59 2 -28 -16 -19 -42 31 -22 7 -21 16 25 -44 0 -1 -15 22 19 13 22 62
3620F2j1rj9Ll2L2m2J0l9N7k4K1Lj7j0oL8MJ5n3L0l0L7m8J6M1k4j1kMrl8Q2j0
$$ 62 51 42 23 26 -6 26 -16 -6 -45 12 -12 9 12 -5 -15 -21 17 21 36 -17 13 -17 20 -28 -12 29 5 -6 -8 -4 -13 -51 31 21
3654B1J3L7p0L7k1J0Ln3M1k3L6n8M2K7l8J4Nl0M5k6j2K4l0L4jJ9k3nk6L5J5m1
$$ 21 34 71 1 38 17 27 30 -23 18 -5 31 -27 15 42 4 18 23 -7 38 12 0 24 -6 28 27 46 23 18 -8 27 42 1
3686An3P1j1Mpj2k6nM1K0k0J4lJ0j2k8K3K6o3qQL3PL5n7P5l2k8J3K0K7%m9%n5
$$ 1 -52 19 8 12 5 -7 -33 -38 3 23 3 17 14 24 12 -16 7 33 -30 -38 -30 3 10 45 -12 63 31 3 16 36 63 63 14 14 -41
3721d1MN9k6n8R0J6k9k5L7J3n0kJ9k4N3l7l6PN6l9K2lnj3k4J03o4J6j0lK6m8L8
$$ -41 -37 22 -4 -62 28 44 15 -10 27 40 -10 -12 7 -17 36 -1 -37 -30 26 -13 9 6 1 -12 -36 67 3 19 9 6 32 -16 22
3754B2j5ol3K3KJ6RrkmoM4n8J5j0J3j0N0%jrk9Km0O3k7KJ0j2K9q2O9nL7q2RK0
$$ 22 7 1 -32 -9 -7 9 18 9 7 3 -3 41 -17 -2 -12 1 -9 41 41 40 31 2 4 -36 27 0 2 12 0 29 -53 16 11 48 -34 -25 -5
3791emK3jq6R8pj7K5l6k5O0J6n2P1m8n6P8m8k4Q8n1kJ8nl6M4j8N4Kq8O0m7K2j5
$$ -5 -9 14 13 -73 25 18 1 26 -10 -35 25 41 -11 60 12 -44 34 -14 -38 50 -1 -3 15 10 -26 18 0 54 56 -32 28 -19 3 -12
3825a2mL4k3O1p2K2J3J5j4l3m1M7L0Qll6L1j5j2m4M1J0lRJ0k3Jj5RK2l1pMrL2
$$ -12 -16 18 -5 56 -16 6 19 34 20 -13 -54 -7 23 31 28 -8 23 8 -4 -48 -7 3 0 9 19 -4 -3 -18 -9 13 -18 -25 -21 -30 2
3860BPL4j4n4J3LJL3m4M3QM1n0km2R5n7k4mJ5Ok0l7J13n4J3n1J6j5J5o6J02j1
$$ 2 9 43 29 -25 -12 -9 -8 25 -19 24 32 73 23 21 -21 74 17 -7 -11 4 10 -10 -47 66 12 25 -26 -10 -25 -10 -76 26 15
3893A5Nl0M8j12O6kNK9k0k1L5N2m5k1L0o7M7mj1Q4p8L1k8J8j9p0K0L8rJ6l6L1
$$ 15 20 -10 38 -74 -8 -10 -5 24 4 -17 18 70 25 4 34 -33 14 10 -1 83 5 36 8 26 7 -63 -43 -5 -14 2 -34 -3
3925cK7m7K6PM1k3Rm0lJ6j6L0n8L8lJ6n6OM9m0L6m4RO0ml7lK6p2O0qk6J9J0j6
$$ -3 24 -23 3 10 51 28 37 -3 -6 10 -6 24 -34 4 1 17 -39 -33 16 -24 12 -32 -23 37 33 -4 -7 19 -53 7 -1 -27 -8 2 -14
3960a4J6N2k6jm0k0J17r1J2Pj6m1J0N2nJ0Ok7OJ0Jk0k3L4K7Kk5m5N1k4qNJ4m0
$$ -14 2 54 28 27 -13 -33 84 -7 5 12 -4 -45 -35 17 12 22 28 1 7 17 18 -2 -25 9 36 38 13 -32 19 -5 -13 -8 6 -34
3994c4J00m6k1Km5L6nN6p7P4Lj5k7M7m4j7N5j6k0PJ0L0o6PnkL9Pm2JL5m0N1j3
$$ -34 66 20 -1 1 -44 -8 -13 43 -34 40 43 28 1 48 4 -13 42 26 6 13 23 53 -13 -6 -11 -13 26 33 -9 -8 27 -13 38 25
4028B5p2N1j5O3j06J06m2K2l4K6l1rM6Lm4j4O3Jo5j6L8Qk4J5K6Ll9pQN6o7oN6
$$ 25 -47 4 -11 52 -54 52 10 32 -2 24 -7 -16 30 33 -11 -25 38 39 -26 -42 -4 4 -20 -5 21 24 -15 -22 -14 42 -25 -31 25
4061B5J8Qj6J8k3K0k5l9mN0n1L5l6N6l0J5J6l9L1l3K2l0J7PRM8p5l0N5m2PJ4k1
$$ 25 43 51 35 53 30 50 25 -14 -18 32 -19 16 -20 36 6 21 37 -2 29 -4 18 -12 5 12 21 69 -6 -36 19 -23 -16 -2 -23
4094b3O0o5rN3j7nJ5k0MoN8o5J4om2O6jqj3p2O0K5n2N0l8Q%P0n1%j4N8l5J4qL0
$$ -23 37 -28 -37 16 -1 -6 9 -11 -7 -13 45 -20 -6 -12 -54 12 11 3 -10 -82 -22 3 -49 1 -37 -29 -29 41 -10 -10 -24 34 -1 13 5 35
4130C5J4p0mL2K6Mj2j0pMm7jJ0M8k8MJ0k8K2J5m1jOK4mpj7O7n0j6j8N7j0jm8R2
$$ 35 49 -21 -25 7 33 37 25 15 8 12 -35 -36 -26 22 -6 -2 8 -20 2 17 -24 -25 -19 5 1 -6 -23 44 -6 -22 -40 17 7 6 -42 50
4166E0m8K4p5M8QM2rn0M0q1M6J8Nk8N6q1P2k8Rl1j6K7K3k4j0Nm9N8O0p2KN4nq1
$$ 50 2 26 -49 -1 7 49 40 -10 30 -51 -5 13 18 -10 46 -35 37 9 18 -13 -29 -2 21 -3 -13 -8 -57 1 61 -11 -9 45 40 -41
4200d1O3l9K6jL6j3l1M8m2k5J1j0jRK7p7O8Jj8M1n7L1J6j5OK5j3k7O1j9kn9P1
$$ -41 22 -17 9 8 44 31 0 48 6 -19 -8 -18 -19 -10 17 -60 8 9 -9 32 -25 6 22 7 13 38 25 -2 59 40 38 -21 50
4233E0o5J0L2NJ7l2pm6K8K7l6%K7J6o1l3jQ7%p1N5k5L8j7O2o8K4K0n4J7j6K2k5
$$ 50 -15 -5 27 32 49 17 10 -36 -8 19 -17 -17 10 26 -35 -68 -69 18 18 -53 2 -23 15 -2 60 -8 16 36 -18 -1 -17 5 -20
4266b0P0oo0l8N8lj3pM8l8J2J2k2J7j2J%k2N2l8k0N8m1N8k3qnK1m3M3Ln3J5M1
$$ -20 50 44 -16 -54 4 1 -12 -19 29 -9 3 15 -7 10 -2 -1 -1 -23 29 -9 -29 29 -12 46 23 15 10 31 -12 31 34 -19 -4 37
4300C7n9L3oM7Jl7j0Qk8k2O3n7N3l2j5kj4M1k8K9j0L1j8oM9o2kj9M7k3j5P3o4
$$ 37 -22 11 5 52 53 16 6 14 -14 -36 27 -30 23 -9 -24 -26 -40 1 -27 2 -8 23 5 -1 48 -14 -16 -35 12 -11 -26 47 -17
4333a7J0J8OoJ7l8j9L6m5L1j7LP2n7M9q6N2m5L3m2N8QJ7k3l6N4o5M8Om5J3K3j1
$$ -17 -7 11 17 11 28 -10 -29 7 -38 -7 -24 -21 51 -6 43 -43 9 -36 -3 -45 13 21 38 15 -21 33 -32 16 22 -23 -10 13 2
4366BJ6o1J3N8m3J8m9PL1jk9Q3k0kl2l2O5k8K5qK1j9kj1QJ2kL4j01O1l4lK6L4
$$ 2 18 -43 -30 28 -15 3 -46 -39 -8 -9 -38 45 25 23 -9 -41 24 -4 21 13 34 15 13 2 10 22 20 54 -47 14 -20 -23 3 37
4400C7o1K2Rk9nM7K1j23L2L5K9k3j3O1l2l4L0j6L0J8Rn0M9n5Q5n3n4O1k6J7n4
$$ 37 -24 -2 7 -22 -27 20 41 -82 -50 -15 14 -9 -22 39 7 -27 3 -13 17 35 44 -6 43 -12 73 20 -34 27 1 18 -36
4431c6mL8K9l9k4O7Mm3k6J3K2l4M2jNk9J7J3l5L0M3p9J5J2K2OJ4l2K2n9L3J7k
$$ -36 -40 -2 27 -12 -36 31 35 -8 -34 -21 1 -33 9 8 13 -16 1 14 -21 9 52 -27 -12 0 22 28 42 10 32 -27 6 23 21
4464B1m1M2l6JoR6o0j4J1Rj2m8L6l5N0m3J2J5nJ9j7N9J7Jn2p3M5Kk3J4N1k6L3
$$ 21 -20 22 -14 -13 -19 77 17 3 14 23 11 -37 -1 -36 14 -29 -17 -2 -7 12 -5 54 71 72 20 -53 -8 -6 -29 -15 36 10 43
4497D3l2n9Q7p1kK0k3R6q4OkM5l4L9l6J4o0O0m8K2oP1m0j0J4m0N5l2L7rk8k3M7
$$ 43 11 -48 39 -32 -34 -14 -37 59 -25 -19 -21 24 -10 29 -7 7 -53 7 -41 -19 -25 46 6 -4 10 -30 25 -7 30 21 -7 -30 17
4530A7mj5N3l9jp1M4J7OM2l9jJ6n3rJ01n8L2rj4kLqm2O9p2J4K3j9O5qJ0lj9k5
$$ 17 13 -2 51 12 11 -60 -16 1 7 49 10 9 25 -28 -37 64 6 38 29 15 13 16 8 -34 35 -37 -23 0 -19 46 38 48 45 26 1
4565Ak3J2LMK3k6J7m9J7L0l4j2QM6l5J3K0N7p1j6j6J8L5J7j6m1M1o3K0P3o6oM5
$$ 1 -22 -10 -7 -3 20 -6 11 -38 -21 9 -25 -37 -29 17 -18 -5 15 72 1 -15 -31 -13 22 39 23 -18 23 -40 -20 53 -13 -19 26
4598B6o2Q3k3l8L1n6JO1k1j1oL9k2k9%M0J9k8J7o0N1j4qj6jQ5l7j5Pm4PL9k1%
$$ 26 -36 47 24 -14 17 -39 -38 23 2 -9 -15 24 2 -27 -27 13 32 4 21 -39 12 -2 -10 -26 -27 58 21 6 13 -31 -24 15 -6 -6
4632fMl8L8J8j6M1j4j2Nn8O0JQn3M4J8q2R5k4NLn8N7l3j5J1k0J1j8J1k9N8l5L3
$$ -6 -2 -40 -2 16 0 41 27 15 20 -38 22 23 31 -22 22 40 -42 53 29 34 37 -21 36 3 -12 -1 -21 -10 -28 -17 -46 12 -23 10
4666A0Nl9N2kMj1K3j5Ql2k0O1k8K4m4J8Qk8j9P9q5M2Rp8N0l3K2jM2o8RN6mM3p3
$$ 10 15 -24 28 26 30 19 42 27 35 3 -17 44 16 40 -4 14 22 -6 -25 54 -31 11 20 -58 -8 -41 -19 -20 22 -46 -37 19 15 58 -15
4701a5K0nl1L9l0mLJ2Pj4j0O4j1j7k0K3k0J9O8m7r4Q6l1k5L1qOpj3rK8J3K0J0
$$ -15 5 0 -31 8 -22 -26 -23 -11 -4 -18 -28 36 25 8 -12 11 -9 10 78 31 -63 23 -8 -33 -2 -10 -4 -11 -24 -33 -5 8 28 38
4735C8qn6P4%n2j1K4J7k2NjJ1J0m0O2n8K1l6kN0l7N7k6k8l0N4o3L3L8l4M1m2L8
$$ 38 30 -26 48 48 -4 -15 9 26 4 9 8 19 29 -11 51 -7 14 -22 -24 26 -11 46 20 -8 -38 16 -47 -14 24 -10 31 -11 27
4768B7q0P3l0kk0L5K6LmkJKk4qj2K7j9jJ1Kj5l8J00o9J3k9K7qK5k9K4j2J3lmk8
$$ 27 -53 20 -10 -12 -32 3 29 32 28 26 27 29 5 -3 -15 12 -7 -8 3 5 -10 -48 52 -17 -4 -33 -6 -14 11 -18 6 -6 7 4 0 -28
4804b8P5m7J2j1l4O7m8K3L0k0j9Nk1L5k6nLnJ9Pn2M3J1n8J9K8k1L2j2j4K3K3n3
$$ -28 47 0 12 1 -33 34 -14 9 39 19 0 5 -16 19 -7 -12 -9 -14 5 12 -40 3 14 -44 -25 3 -18 14 2 -12 11 34 -19
4837a9N1j6k3M7k6M8m3l5ROj9N4k5J1Rm8PM9k8j6k1M4nK6l5J1L5m7Qm3J6L3oj5
$$ -19 32 16 -7 40 14 62 19 -16 -7 -1 -20 34 9 20 29 -19 -12 37 9 -7 -28 16 11 37 2 13 48 1 9 -34 -18 15 9 -6
4871fJ1J9l2m8Q4j7k2k8K8M7k6l4J3RJ4J7n2Q2n4j5K8n7O9k7Jp1O3jJ1k7M5q0
$$ -6 5 24 -8 -56 28 11 -11 -39 -11 36 10 -24 -11 -2 12 29 -23 59 5 -10 18 -39 30 3 4 -67 -4 -5 6 -21 24 -56
4903e6P0j5k9M9p1N4m0M5k4K6L7k7qJ7l9l8O2Rn8NL8j4L3k2m4N2nk6M6k3K9J2
$$ -56 14 -1 -30 19 -52 2 -38 7 -17 9 46 19 11 28 -11 -49 13 22 -36 -31 7 -7 26 4 -40 12 7 -19 27 4 33 45
4935D5j1Kn0K4k1J6l5N3p9L5J8PL7q4J9J5J2jj7%Lk6M3k2K8m4O4n8JO5j2m6L7
$$ 45 34 36 -14 10 -11 5 -30 23 -56 -21 -3 4 41 -43 -24 -9 3 2 -15 -15 -12 -38 5 -17 11 -33 31 -27 -26 39 27 -19 18
4968A8oj1Jk7J00q8pK2j6j3J5K6k9M4l5l0O2j08J25q1m8Q7k1l6M3KON7l8Oo8Q7
$$ 18 12 1 2 -25 75 -13 -20 2 -14 -27 -12 14 -15 29 -6 -36 26 -82 43 -38 -86 1 -20 -56 -13 -11 -5 52 14 20 -48 39
5000C9l6j4RQ0m8nm1JN2m7l1Q7n5j8R5q8j1L9J2J8m1J6K7k2Kmk2J2L9r1O4k7K
$$ 39 3 -11 -2 78 30 25 -16 -15 37 -10 -41 46 -9 -27 68 -20 -31 8 20 38 -3 13 40 18 20 16 -6 6 45 -46 18 -9 -7
5033gRrok6J2QK9n1lL8K7j3j6Nj0k4K9qoM1K1n7L3o5L2jj3LM2nQL0o9Ok2J9j2
$$ -7 2 -7 -13 -39 -27 -19 10 -41 -44 -6 21 8 -8 -3 -13 -37 -8 -16 -22 19 40 -17 16 -49 -17 -18 -31 -28 14 9 17 47 -22 -16 -38 -19 -31
5070c1K3L1Jkl1J2l3Q0o0j2M3l0L3pLj1L0m9N3k5J1l9MmMN3m7K4j0k3Ol1J3J8
$$ -31 -8 23 24 22 -9 3 -30 50 -10 -22 21 -9 24 17 20 9 39 -10 43 18 29 -10 -6 -10 -6 47 0 24 14 -9 -3 -34 -21 -3
5104cJ4j6j3Jj5N3k9l2M4k2K4MnL2k9K0j8l2L2L0j01N8j6jO9o3K5lL0o7mJ1OL5
$$ -3 11 -5 -18 -17 -32 21 -8 -40 4 -18 6 10 5 37 8 28 10 -22 10 40 -61 -3 -19 -20 49 -14 11 8 38 -29 -33 -22 -16 19
5138A9L1m0J8m9J0L9k5m0L0MJ9J7nm5k0M9m1R3q2k8P9l5J9M2l7n7J5J1L3l0Ml3
$$ 19 50 10 28 -21 -11 28 3 -37 -7 -3 16 33 28 -17 -37 12 -29 64 -18 -46 33 -2 17 59 22 -35 -20 -9 24 -6 -2 -35
5170c5rQ3o4l6LN8qK0j7j8j9O4nl8L2kL6q5P4k8MJ5l1pj0L4J0J8o8M8l4L1k4M4
$$ -35 -44 39 -25 -61 -58 0 -8 12 -5 -23 -42 22 17 -21 11 9 45 -40 34 6 10 25 -6 -13 -23 11 21 39 -29 19 -15 16 -8 36
5204C6n4J9J6r1P6mj9K8L2p4NL9o3K7L8o5M2K1NQJ8j4j7J7J6o2m2Q9l7J3J5j8
$$ 36 -18 1 17 -74 2 -2 -21 7 39 -35 -30 9 -54 -27 11 -54 -12 9 14 22 40 26 9 26 42 -20 -62 27 -10 3 18 0
5236@K8m7M4n0M3Mqj4Qpn2P2k3KJ3l8Jj8O2o6L3P7o7J6nnj5K9pl7l0O5k9OJ4K
$$ 0 28 -19 25 -25 18 22 14 0 8 1 -51 21 -2 0 13 -25 -24 -42 20 -46 -13 64 -3 13 8 3 -12 17 10 -27 -57 8 -21 -15 -1 1
5272Aj1mK3K1lj3n3M5rK8k1m5L6J6rL9ok7j0J5O1n5om2Mk4L3J8%J9m7Qkj9L9%
$$ 1 -10 -14 9 30 27 14 -39 6 -3 25 4 -41 -5 11 2 41 35 8 -2 13 74 19 13 -29 -25 -49 -16 2 2 21 -26 -18 -20 -39 0 0
5308@kPk0L9m1P0j8p1M4o5K9K4Ok1nN9j2J9l4n0P5j8l1N5m0%l5L1O1n2n0P5l4
$$ 0 -2 5 -15 24 -17 53 35 -36 8 -57 -28 -4 2 -19 -24 35 23 42 8 -42 33 15 -16 39 -1 -1 -36 -5 56 4 -46 29 -5
5341eK0JK4m8K5j8j9M2j1KK6l8oM9n4K7k8N6n5K2j7mJ8m5M5jj8j1K4k4pL1j4L
$$ -5 15 16 40 -8 17 -1 -20 22 11 13 39 1 -5 44 -10 17 -11 45 -10 12 -5 -9 9 -36 9 8 -10 -21 3 -21 -28 3 -11 -8
5375hM0J8n1j1L6o1M7L0k5o9P1K6o2K3J4m5L5M3r5O6k0rL3m2M8j7%lj07P5j9K2
$$ -8 32 50 -1 -12 24 -37 10 40 15 -54 17 43 -19 4 18 -27 8 51 -44 22 2 -7 26 -16 32 15 15 12 -95 -20 -39 -17
5407a7J6K5Km9pN0K2m1ql6L5j2N6n6nJ4j4MM4Rm6K5N5o2J8o5P1p2P7j4j7JJ6p2
$$ -17 -1 24 26 -23 -30 20 42 1 -7 -43 -8 -20 36 -20 -25 -11 -25 -21 23 32 -14 11 66 4 22 -43 28 -44 33 19 2 3 19 -53
5441e3R2n2J1Rk7lJ8K7k5LK4k3m4K0M6k7J8M0p7M2o7J8L4K4p1M0N2n8J7k0%K1
$$ -53 39 -13 -2 7 -20 -23 -5 22 -3 0 24 1 -43 -23 23 -4 14 54 -23 19 -48 -30 4 28 -43 -3 49 -9 8 -12 -12 9
5473Ij1j5kL6m1J0Q5p7rJ7m1M4p4Q2lj9Jk0mK1MO3n8%Rm7k4K8J7M5j9j4J3j4O5
$$ 9 -2 -17 -19 17 -24 -14 71 -6 -15 2 -39 5 -69 13 10 -9 -8 -28 -32 -11 -7 56 -2 -2 7 -40 -64 -36 -19 26 7 -7 6 -8 57
5508E7m9L9o9P2j04K6N5l7k1J4RL8%J9k4n0O8k2j3J3J5Om4K5J2o1L3K7o0JL1m
$$ 57 8 47 -22 50 -54 -28 27 -10 -31 -17 -8 30 30 49 25 -25 43 21 8 21 36 42 -2 23 35 -26 7 34 -26 -25 6 2
5540BJ9o0P6j7p5M4k4L8j9kknK8J4p2L8m8J12ro1M7o0O8o0K2jK1nn9P7J1m9QJ4
$$ 2 21 -39 37 20 -55 -11 -35 3 -16 -18 -20 -25 3 17 -55 -17 -65 47 38 -23 24 -36 32 -28 -6 -7 14 9 -50 27 38 -11 -3 11
5574A1qJ5j1L8Pl1J3o3pM2J7k6K8rl7K1NNK6okk3qj4Rl0N8Nk8j1L2l2k0jpP4l1
$$ 11 3 18 7 45 52 21 34 -29 -36 6 23 -3 25 16 -21 0 5 10 36 30 28 5 -3 -17 -8 -38 20 25 -3 -14 18 -14 -34 -35 -42 32 1
5611AN6qo5j0M8k6oj5L4q1P4k1L2N1j24N6j5J5qj6K0lK9m2jP3n5l8Q0j8jqk1K0
$$ 1 57 49 -16 -26 22 -4 -10 -25 9 -72 2 -19 13 64 -60 -4 -19 -4 -12 -28 -8 -11 18 -24 -25 48 -7 -45 35 17 16 8 -13 7
5645Gl2P0o1nK8J3K5l7%K3p0M7m7N5o4O2J2o6R2k3l8j7P3m3K1l3m8J1R5o8J7L1
$$ 7 -25 45 -16 -21 7 20 45 8 8 31 -39 8 -39 16 -48 14 26 -40 52 29 -9 -26 47 4 25 -8 -56 -45 50 -18 -1 30
5677C0L4p5K7k1L3p6N5j3J6Mj9lp5Q8n2Q9p8M9J3n4L1l8O6j3o5L8k8K1J5j7K5
$$ 30 64 -11 16 -5 28 -48 7 -6 10 14 -5 -8 -83 5 -47 42 -36 13 26 -28 3 -35 31 18 -47 -9 -37 -16 -1 -18 7
5708GlL7m2K5J2m0m0L5K8j4k3%l7N9K9m9j5K9N1q0J8K1j3L5l6k3M7K3ko8KqK2
$$ 7 4 41 -1 24 36 -4 -44 -9 19 5 -18 -18 -55 4 33 -16 -31 -2 49 -31 -13 8 -5 30 -6 -29 18 41 39 -29 -27 -35 -13
5741a3j0O1l7mk6K8N5q5O6n2qN1l2M6l6O0r9L3Ol2K3J0%j6JoK2k1L7l1N2Lm0L8
$$ -13 -23 38 1 -3 -29 -1 54 -31 35 -17 -25 26 -6 40 4 64 -35 -2 4 -28 -5 5 5 -11 -10 -16 6 -15 22 -9 43 46 6 44
5775D4o1L4%j8l2M3m0K3K7n1P7%l5J3J3p2N3l3J1K0o2N7nn0K9J2j0K6Ml4Q5k8
$$ 44 -17 17 17 -1 -33 10 -30 -7 20 -31 46 46 11 24 37 -35 18 -15 -4 16 -46 11 6 -44 -15 -3 -13 13 17 -17 68 40
5807D0q5M4L1KNm3J1O6m1k1Km9R3n9jj0M5m8k1M2j9Qj3Ko1R2L5j7ro2O3j1J7j8
$$ 40 -45 -1 30 32 37 -6 5 71 30 9 11 -38 55 -4 -5 -15 30 -18 -39 3 -16 -8 -21 -19 -80 12 47 30 21 -41 22 11 28 10
5841A0K3pL0j5l6l0lO1k4j6Oj0PO7ok4l9nJ7J1m6K3kRqmL1k1n%K6mk3LOPk0L9
$$ 10 33 26 56 41 5 -25 -28 33 9 -7 -1 -11 -4 63 57 33 -6 -11 6 17 -29 -6 -8 1 -7 -11 20 -1 -6 -6 20 16 -7 -4 2 9 -11 28
5879B8mo3M4M3q7L9K0k1jM1m1l8M6j1O2ln9J1k2K8K1l1Ml2J4l9O0l1J2qJ0N9k0
$$ 28 24 -39 5 48 -39 0 20 -1 -2 39 -2 -40 6 -5 57 54 -5 6 -16 12 33 2 6 -26 -12 -51 9 -22 -10 -18 -8 51 31
5912C1J2l2j7k9M2j3J0%l6K6JJ7o6M2lL5l9qjK8K9l9j5Q2j9o2P9n3Rl3j0NL5M0
$$ 31 43 11 -6 -35 7 -6 4 4 -32 -6 -5 12 -54 -12 -15 20 -19 -27 -28 0 29 -10 -25 57 38 -24 55 2 11 -22 -32 -27 8 48
5946D8q0P0q1O5m1N0k0j4L0Ljo8N4k9M7kp1LJ2K7j2ojN2k8J4%l3J1J6k1J9K6j0
$$ 48 -32 38 -43 22 -19 31 11 -3 27 30 29 -39 15 -14 33 31 -40 -37 -25 2 -10 -16 -17 35 7 21 21 -12 -1 15 -6 13 39 29
5980B9Km0l2O3j1Lk9rP5l9J9l9m4jO4n6K6lqJ4L4m7Q5p9M3j8j8R4l6l9j3O0n2
$$ 29 31 -9 -41 22 11 14 -15 -24 51 12 31 -8 -52 -53 11 -45 -19 -22 -30 -16 18 -29 56 -23 20 2 -16 78 42 3 -10 50 -2
6013bK0n0kK1j1M3Ml1K6l5K5j0j1M3ml5J5rO2n2j9QL4K0o3m1P6qJ5M7j07K7K3
$$ -2 18 -32 -34 -13 -24 19 23 -8 18 -17 8 -2 -13 30 26 -9 6 -3 59 7 -12 -4 30 50 -13 -54 22 14 29 76 -31 -4 19
6046A9J3l2J9l4J0m3N8j9KpK0l4L4j4K0k3oO1l1l2%O9m0j7JM2J8m9J5k5J1n4q
$$ 19 32 0 19 -15 -5 -48 10 -9 -7 -14 6 -28 6 -8 12 -11 -17 44 13 -19 -19 50 10 -7 -6 36 54 5 20 -5 6 -48 -56
6079e6R2m1rP1n1j6J7j0k3J2K8K2k3NJ1m6K8l2K9lL3n0L7m2K2k0j5L1l1P8l3l0
$$ -56 36 -5 -14 57 6 -10 7 -3 -26 -14 14 36 13 18 29 -17 11 -21 8 5 38 -12 25 -17 5 -15 -30 1 -30 48 15 -15
6111a5J4K3q6R1n6JR6j20N3j6kK3Mj4Ol2N9K4l9mj3L5j1k4K8J4q4M9L3k5j6L1
$$ -15 -1 22 -64 27 -29 -28 68 -52 1 -15 -17 6 10 -4 2 -30 29 53 14 10 -3 32 21 -3 25 39 -45 4 37 12 -4 27
6143B7m7j5O5k0n0L0j3j5L8J2o1O2m2P7J3k3m6k6J0J5J6J7j9J2QK4j7J1n8lj2
$$ 27 -20 -35 30 10 -40 -10 -23 -38 0 12 -49 13 -29 48 61 38 -8 -34 -24 -9 7 24 5 17 25 49 32 43 -15 -18 -30
6174c0K2l3R9j9o3pO5%mK7o4J7j4L3p2J04o3J6nrj4M6j4pm4L6K2q1Q9o2JM3l0
$$ -30 -8 -41 58 39 -24 -31 34 34 30 57 -7 10 -4 29 -43 61 -2 14 9 0 -14 32 18 11 -33 3 25 -56 33 -29 -28 15 -15
6207a5L1J6k0Jk3L1m3l6R7k1l9N2l0Nrl2R8q8lO2Kj6n1R4rp9K5nPm3L8mp3P1K9
$$ -15 16 32 12 13 -10 21 -22 -58 39 18 -21 31 1 6 -3 -35 63 -25 -28 34 36 20 -31 63 54 -25 0 -5 2 -41 -3 -7 -80 -9 20
6242B0m4Q2o5K7l7PK6l8J6J5k9JN0o9k1O3m0N5M1qroMj00KL8J1j1%MJ2K8nm6P8
$$ 20 -24 58 -7 20 -17 -10 16 -22 -6 9 -20 -19 31 -38 -59 4 -36 19 60 52 43 37 41 -59 -57 -19 -8 -19 -19 -15 -3 25 20 -26 52
6277E2o5L3k6l2Q0j8k3MkJ4j5J9n8K8j8K2N6n1j8J4K0j6M5l5M6k1o4R6p3rRO4
$$ 52 -13 20 -6 -38 42 24 1 5 3 17 2 21 -37 -9 -27 -5 51 0 -18 -4 16 0 45 10 56 35 -29 67 -6 -15 -6 58
6309E8p2kk3K8k7L0PK0o0N1nm3K7M4m3k0L1o2J15m9l2M2pnnN8o7L9Pm1M9o5MK2
$$ 58 -14 -16 -39 -11 -38 -8 -1 19 -41 10 5 -38 -11 33 -10 -30 1 -61 54 5 -27 15 8 3 -2 56 -11 28 35 -6 43 -22 -18 4
6343DL5n2qQ0o7rk3N0J5n9M3M3m3LJ3Qm0J3K1j4j4%Oj2jKm7J06n5Ln8J9P9m4P
$$ 4 39 -13 -21 59 -8 -17 -40 10 25 -34 9 52 9 12 25 33 -7 6 27 13 -1 -1 5 -7 -8 -6 -53 53 -2 1 -57 -38 41 -3 4
6378DL1l8l5mP5lj00Q3j7N1m2kJ3nL8j02M3J7l9N6j0nK0%k6Rl7N8J0o1L1j8k2
$$ 4 35 -3 -38 -42 33 30 -70 13 -4 47 5 3 16 11 49 -53 -10 7 -32 24 14 9 29 29 3 12 -25 33 43 -18 13 -5 -27
6411b7J3LL1m2pP5j7j9k0QJ6n3k8K5M6jl9K7mk9K1L8j17J22j6k6k4J5J9LO6j26
$$ -27 -14 -11 20 -22 -29 46 29 10 -10 -2 14 -39 -67 -42 4 3 -36 -9 -13 -42 -21 17 -100 22 6 -20 -44 -29 -10 -7 59 -67
6443f7L2k9J08j5j0nk2L8q6P5l8M1L7q7M7l0n6R8l5m4R1J1n3o9Q0rj7K1j9L0r
$$ -67 -35 -64 44 29 19 14 -8 30 -56 19 -19 22 59 -28 19 -11 -67 31 -4 -48 43 54 1 -68 12 3 -14 7 -12 18 9
6474Io2J9K0K2j7qM4l4M1L5k7q5R9n9jP0q1L5O0o5m3j8J0l0K8L7j9l4O3J8l6J
$$ 9 -53 -34 -14 8 -9 -17 27 -7 34 69 42 -43 56 -3 -4 66 -15 20 80 15 -28 -46 -36 -66 -38 -1 -20 -54 9 27 -9 -8
6506hj1j2L4Lk5N0Om8M6k0k2J9K7o0N9j5l3k3M5L4r1N1pk0qJ9M4o5J7M6j0m5K
$$ -8 -19 -31 3 6 -19 31 37 -11 35 15 -7 12 39 -21 38 23 -10 -33 12 46 -45 6 -1 -21 -29 -10 34 -31 -14 32 22 -23 -21
6539b1j3KLN0Qk1kj7K7k2J7j2Qo1K4L6K2j5mj1m0N9m9K7j3M4m7O3m8MN0m3N4o3
$$ -21 -34 -32 -29 21 29 8 6 -11 16 -6 11 -1 7 -54 -30 6 28 13 9 -2 -42 17 -32 -5 -18 26 -21 42 -6 -2 48 5 59 -4
6573dj7P4p7OL2L3j6r3Q8k5kN5j21Q3JmJ7k2p%lj7J0J7pk8O1l7K8k2j0L4o9J1
$$ -4 -21 53 -24 -18 14 47 31 -62 26 1 -1 54 -67 16 17 13 30 8 1 1 -2 -19 -9 8 1 -27 34 -3 25 3 -7 27 -42 -31
6607c1M6mN2k8k5J7m6P4m0n4oM4O4o8j9P3p7PLk2N9jJ4m9O0o4N9Pk1k9J2L2p4
$$ -31 15 11 63 35 10 27 -19 55 15 -39 -45 -1 63 -5 -24 49 -28 -21 -18 -40 19 18 32 -17 43 -21 38 45 24 -5 7 39 -35
6640c5O6q2M0L1j9m3RK0oL7l6J7K9p3P6J9n0M1Pn6k9L1j1nO4o3L8Op9K3N3pK5
$$ -35 31 -51 -11 20 1 -42 -33 -13 -19 18 -18 -1 28 -45 31 50 0 41 48 -8 -37 -6 -17 -22 42 -21 17 23 -56 -33 20 13 38
6673C8k4o4L9M2Nk0k5J1k7NL3k3M9qRn0J2n1P0l3J9n4P1Qn6K8j5J9M4r0R1l2l8
$$ 38 14 -50 -11 31 36 16 -9 2 -25 -20 13 -10 39 31 40 -10 2 -49 21 -12 7 -47 24 32 -24 4 -11 8 52 -38 53 21 -17
6706a7N6j0Po2L4j8M2n1MmJ2K1L7n9K6o7L0O0k6J4q2P6m8K3NL2j4K3m7J0l1K9
$$ -17 39 29 36 -26 8 -10 32 -19 -15 -19 -7 14 51 -8 18 -49 -19 41 15 29 -53 23 -25 -2 3 35 21 44 -3 7 -24 5
6738Ej7J1LL1pj6Ok7j5N2l0j8N2J7l1MJ6p7L3Pn5J9K1O3m6RJ3k4OnLj2J0k4L7
$$ 5 -12 -1 2 33 26 10 16 -11 -26 26 -4 -22 30 47 16 20 36 -41 -8 -1 -56 -37 -16 47 1 10 23 -1 5 0 3 -9 1 -23 14
6773A4%j0N4m6j7J7k5O4J4m2J4n5RMN8n8kn3M3%k1N6M8r8%Jj4O4n5PL9m7M8o8
$$ 14 14 4 58 12 -5 12 -13 51 65 23 37 -18 -9 -5 53 -5 -7 -60 -17 -17 -38 18 66 -32 -32 -31 -45 19 -36 -29 10 -37 11 -57
6807e7O7K3Ql1k3M2oj2MK6n0j3oL1j6l5L2k6L9L7l4NJ7rK2n7L0j7m0O2ll2K4m3
$$ -57 10 33 41 10 -13 29 23 11 15 41 -9 -22 -28 3 -13 -48 -16 -42 -3 34 0 5 22 13 35 -22 8 -9 -49 13 10 -22 2 -41
6841d1J0QJ9rJ8l5NJ5nJ5RK2m4J7Nj8J7k2k8M0J2nK2l0k4J7L1n4J5O3m9k6L1j0
$$ -41 -31 -23 -4 -13 5 -30 -25 -10 -15 0 9 31 -13 4 9 -9 8 -14 -42 -2 10 5 27 -3 -27 -10 21 -33 -18 45 -4 -30 1 -9
6875iK9n5N9n0L8k3j6K6l4k1Q7rl5rL8l3n6J04j6m2M9l0L0l5L4p1J5L2j7J5j8
$$ -9 20 -35 24 -26 12 -11 -27 -1 -35 -56 31 22 -13 -22 16 -17 -73 31 15 -27 22 -8 22 -13 21 -50 -35 -3 -20 -5 -23
6906b3JJ5L2m4OJ3LK7p6L1nlOK0O0j20J06j07N1M2k3jmpkO9p2J3M8J4m2l5m1Q2
$$ -23 -22 -7 25 -19 -13 0 3 30 -46 -15 -20 -23 -17 3 63 -57 49 -58 -7 35 12 11 7 0 -2 67 -5 8 56 70 28 -7 -48 34
6940C4n2L1j0j1RM5m7QPll2L2Qm6mNQ2o2L5k2n2K3J5k9pM5pLJ3K1k2m1M8m4O1
$$ 34 -18 13 3 -8 1 46 -1 7 14 11 -21 11 19 -27 -31 -26 56 -6 29 7 -45 -22 -7 -36 -43 2 -5 -2 11 32 10 -31 17 -27 34
6975C4q4L7J2L0k2Nrj6J2K1k9M1On3L4Rk3K8j6lL8k9m9J7P%Jj7Qj3K8rj1NN4m1
$$ 34 -50 -13 -1 29 7 12 3 -13 -1 20 -9 32 38 -15 19 28 5 33 17 14 52 23 -26 -9 -2 -2 -1 -18 -10 -23 5 -4 -15 -10 44 3
7011CL2o6N3j7kO8q1MK1k8L9K8p2M7j2j6m3P0l3J0q5Q3k6K5J2j3N4p3N4k0j9r
$$ 3 35 -31 22 5 3 71 -10 -6 15 -13 26 54 -18 29 17 1 -42 28 -5 5 -80 3 -23 2 14 1 55 -18 36 16 -3 -12
7043a2nK0k7J5K7K7j3J0m1k7L1j2M0l3O2n2j3K0J4n6O7Lm5N4k2m0pj9M1j3Nj3
$$ -12 -17 3 -24 -9 18 45 32 42 1 -26 5 -7 33 0 62 10 -3 17 31 -25 42 45 0 54 32 -8 -15 -34 7 -6 -1 -14
7075a4J7JPm9K6L3rm0J3k7N4M3o5M2m4J5j3j0O6o1j0M1Mk4Pm8N7j6j8L3m9J0K3
$$ -14 3 4 11 -38 -12 21 12 -28 -15 -42 12 55 -10 32 -12 3 -10 -20 46 -15 -25 16 20 -4 3 -45 12 -4 -22 11 -38 -28 -5
7108eM9o8N9j5lRk1J8jmo0Q2j1k1m2L4MRmJ4kJ7L2m2Mj7l5Q7m9j6K9n0QM3m4L8
$$ -5 44 -24 35 20 17 26 5 23 22 18 -42 40 29 8 -34 0 4 13 9 23 21 38 70 28 32 15 -20 67 18 2 31 -19 -11 32 -12 26
7144B6m6K3M9o9J9K7k2K0n3N3j6m3N9J4o8O5o2J1k2J7M5m3M2l8j3J1PK2k8K4M3
$$ 26 -20 3 52 -17 2 29 7 27 -26 27 11 -32 27 41 -27 38 -24 -13 -35 -18 27 -16 26 -12 -25 -14 -7 15 -13 11 54
7175E4l6L4k9j4j4L5o3L6k2K4Mo3J7P1M4r2J9L8%p7L3rnL3j7OJ3J2n3Jj2Q2j9
$$ 54 18 52 23 9 -5 30 -33 3 -19 5 9 -54 -37 34 78 -14 5 43 43 -34 -1 -10 -15 18 1 7 20 32 -21 -20 -32 50 31
7208C1qJ5k2J3K8o4L2m7L7K3l4J2npk2P0rk6L0j7k7j6L8j4L3j0l2J2k3N9o9Q4
$$ 31 23 38 16 29 57 -7 25 -22 15 38 4 16 11 4 -18 52 43 17 47 30 3 -13 25 11 44 34 2 14 -9 50 -19 65
7240F5m7J3l8J5Oq1Q5j1k1rK0J8j2M0mn0JK1j6j6k4M8oL6k3M6n0J2p6N3L7k3l1
$$ 65 18 31 -7 8 14 -67 18 7 -14 -23 -3 15 3 43 39 -11 -10 11 -5 -21 -45 3 -3 33 10 56 6 18 -58 -5 32 9 -22
7273b2j6Q4n0J7j1K5j8l2J2L0j4k2K0K5M1q0L0j0l1O5p1J5K6m4N1J1j4k0J2n2
$$ -22 -38 46 -4 13 2 27 9 -23 -11 19 5 -17 3 28 69 -11 19 9 -22 43 -28 -13 13 -31 20 31 17 -3 9 -43
7303d3K9K3m5O8k8j5K9PpK9p4P8k3n5K2J2L5k8oj7M8l6k8K7kRk3j6P0k8n5K8o
$$ -43 -14 9 -36 32 4 -11 18 25 18 47 -27 51 28 -27 -5 7 42 14 8 -9 39 3 -25 2 0 9 -14 -30 40 12 -43 -15 -21
7336b1O5p6pJ3j6K9JJ5l0J2L1k5K7k7kM0l1j2nN7l7k1N8Jo8J3L0j7k1N1j8k5K2
$$ -21 44 -32 -39 -26 -42 -13 -12 3 -27 -15 16 -9 18 -9 -11 29 -2 -14 -19 38 1 -20 38 39 -29 -16 14 -3 -24 27 9 -16 6
7369FK9Oj8o1L3j0j5l4N5mM0m5%k8M1N0m3MK9Jn9N1l0j6J4J8Ll3J4l6L7k6%oN4
$$ 6 35 41 23 -38 -5 -15 -30 -64 -9 -13 27 -18 -18 -46 -5 45 2 6 35 36 -23 28 -2 -18 -4 14 17 -16 -2 -38 -1 -27 -27 -33 21
7404B1j8L5l9K2k8P7l6k1J3k1j1L5l9k0nL0k0L5m2lO5j4J8l9KQ9j02L0k0L0Qk8
$$ 21 3 38 -1 21 -7 70 34 13 26 5 -6 29 -10 -30 -35 -5 -25 10 -32 -35 30 16 34 -5 -3 86 -16 14 -6 24 32 4
7436Dn6O3nNJ1k4J7J8Lm5j4L1J2K6n7l2N5Kkm7J00n9PJ7k1lk2k0J4jK3L2q4O2
$$ 4 -52 11 6 11 22 -2 15 33 36 -9 -23 8 20 46 -11 -43 12 14 12 -35 65 6 13 30 9 6 -16 -36 -22 -23 0 32 -52 10
7470A0K6o5M8l2K0l5kjL5jj5j3j9Q7n1M6qKm0k1N4o7K6kQq1Q7J8l6J8M8k9m1K8
$$ 10 36 -29 19 -13 7 -28 -30 -31 4 3 -12 -25 -44 43 -8 38 30 32 -8 -29 25 -42 -16 -18 -10 -91 -4 14 -22 -4 44 15 -26 2
7504BOj6j6K2k1J04n1ml6j3J1KNk8N1m4QL5M1p0K1J9nm4l7J11p5J4L4rj%n5M3
$$ 2 8 -8 -24 -2 -23 81 30 26 -10 -23 -12 -10 -5 -33 18 -26 -18 17 58 -12 9 28 23 -21 -58 53 -22 -8 26 17 16 16 -39 4
7538Dm1K9k6L5q4N8K6j4M6k6O9j03L5l8K9k5j3L5J9rm6N7k7JOj6MJ8N8p2MoL3
$$ 4 -37 -8 -34 1 -83 -25 1 -13 33 7 76 -27 8 -30 -1 -26 -39 -4 15 6 -40 17 -10 -9 -3 -19 -15 3 61 -11 -7 -13 20
7571B0k5m2R0m9rL9j5k0NLJ9j5K4l1k0L3onL4m3l5Q6ql1j2j6J3K1K2m8%K9o7P6
$$ 20 -5 -47 43 -6 -15 24 9 -11 -6 -3 16 1 25 -6 -26 7 1 -4 30 -13 -48 38 30 -1 -13 -29 -16 5 27 -21 -21 8 -59 17
7605A7J3Nm4J9m9L4K5k6Rrk2N3l0K3Qommm9M5k3j9M1K4j5m3K7l3M5l1M6prk4O0
$$ 17 30 35 -9 10 -39 -5 20 -6 3 -6 -28 25 -5 18 26 20 16 12 -37 8 -15 -34 7 31 16 -27 0 -33 12 -19 27 20 11 -13 47
7640D7p7lpM9j1j2O1q2J6P6l8j15J07n2P7j8K5n9L7ljm5N8Pk5Mm3J2RK3j3j4l
$$ 47 -30 -33 -40 9 -2 -14 47 -35 -19 57 19 -96 11 -41 36 18 43 -16 21 18 17 -28 30 37 12 16 -27 -15 -6 17 4 -10 -13
7673a3L8ml8oN9m9k4J2N7lp5J8K4Lk1Nj3L6O5l9n7J0pP3k3j9p4L2L6L7k7m3K9
$$ -13 25 21 -17 -23 36 -13 -37 -25 32 29 -46 -28 -4 -1 -22 -17 -30 6 71 32 -25 -15 -22 51 28 9 -65 -33 3 40 13 -30 -1
7706arPM6j4j2l1L6n7N2Ok7J3RK4l9M4j9J0o9K7J5J1o8P7p0MN6k7M7p2L6l3K6
$$ -1 -10 -3 43 29 17 -14 22 -35 17 23 -4 9 18 42 3 47 28 38 -31 -4 11 22 -46 31 -39 -35 21 -6 41 -31 5 -28 -2
7739bK1j0k9J2J1rO3k6l7K6J6k6k0l4J6K9POK7j4m0j7M2r0O6Pk6jL2LK1n0N2m8
$$ -2 19 9 -20 -8 3 -6 57 31 -6 20 36 10 -10 -44 -28 1 8 14 41 27 -13 -30 12 -78 -12 -5 -31 -32 0 3 24 -26 26 -22
7773b2J8m5R8p3j1O9m2nK5Ro4L8J6j1k5pL6j5J3Pk6jK2j5L3om5N1k8j9L4LL8l2
$$ -22 -4 -49 49 -24 -35 34 -8 -13 12 21 -43 -5 11 0 -25 -32 4 -11 2 9 -17 -18 4 -11 22 16 -29 22 -6 -25 9 12 50 18
7807A8p4L1L9K9o6j4L5L5q2M2J8m5L5J9j9Lj5l6M6L3k1Nm8qL1P0j02N7Opj7k6
$$ 18 -56 -25 14 43 -23 -37 -2 33 -49 -7 11 -34 1 20 1 4 -11 -47 -1 32 11 16 -32 -40 -9 61 -41 16 22 15 -2 -28
7839b8j9M9L0o6N5k5M4j0k1%J3j8KJ1j0qK5m2J4p4N1J6j1L2k0lpM5l3R9q1Pn6
$$ -28 -47 2 32 -34 21 -4 40 30 9 9 22 4 6 17 7 -1 24 -18 -4 -78 -27 -11 -22 10 -10 -13 -20 25 -8 91 10 17 -39
7872c9Q5Mm5k0jJ7J6l7O7l3Q7j25M2Nk3j5K5ql5MN1l8K5%L5p1k7K4L3mM3r3R2
$$ -39 46 50 5 -15 -16 1 17 -20 47 14 101 -24 18 23 0 -15 10 2 -33 -29 22 -16 9 9 44 -27 -54 -30 3 -1 42 -51 41
7905D1mmq6M4jl2N9k4J2L6j07L9J2J1M6o3j7N7jk0L8n4k7M1K6m6M4On8MO7q1N3
$$ 41 37 33 -53 -9 -10 -42 17 -7 5 41 -66 -27 -15 -4 42 -21 -38 19 18 -2 36 -18 -45 -4 22 -24 20 26 -32 -28 39 -42 11
7938A1L5l5L2k9J1k6j8L7n%l7N2k1Rm6jM3Npp9L9k6L2K6MJ0k4Pj2L5q1P6o6LN7
$$ 11 46 11 43 14 25 -1 -19 18 13 13 -24 28 7 16 -30 -31 12 17 10 -69 -30 -56 -24 2 6 16 -8 -1 -13 22 -59 17 -49 -46 11
7973A1k5j3M9k9JL4J1om6k3M3K0n4RK6k4jK0L3n2L0k7L3K7l3k1k8L9nJ7p2Q3j
$$ 11 -14 -27 22 -7 -6 28 39 33 -13 -36 7 27 -27 -18 8 -16 -17 3 36 -16 14 -13 20 47 14 -7 -35 4 -1 16 -56 27 26
8006B6l6O5j3m7%M9p7N3J7m6mj5N6K1j8j8n9M2j3j0J5j4O9q0L3L6k8M1l9L1n2
$$ 26 -10 55 42 -5 -5 44 -33 20 37 -9 -13 -28 28 49 31 13 -46 -4 -17 -27 -12 -26 43 -37 -4 32 4 45 6 37 -15
8037a5L1k5k0L8jjm7N7o2J7K3J0M3rj7p3N6j0K5m2K7k1J4J4l6P8m2kk1K5k0mj0
$$ -15 16 -9 -29 9 8 7 -40 17 -45 -28 -5 5 48 39 22 -51 5 -5 20 -22 5 -16 -2 12 -24 54 12 10 -11 14 -6 -10 -20
8070b0N4j3k0l3JJ9nN2j2K3p4k7Q2k9O7p5k2j4P9m1RK0k9J5n%lkJ5RJ0k0L1l4
$$ -20 34 21 1 -32 -31 -12 -17 35 23 46 -28 -55 27 -2 65 -10 -32 -46 33 -8 1 21 -8 7 2 2 -1 -3 12 21 31 11 42 8
8104Hl1J4K0j4M7p0M4l7K9k6K6M1o6mk8P1m8PJ2K1l8K8j6k1K7rj0J4K5Nl1M1K8
$$ 8 -23 -9 11 -3 44 -26 18 -19 10 -16 10 51 -15 -19 -47 24 -24 -17 -5 16 -22 6 -10 -31 -4 -13 -23 -9 16 21 -10 31 59
8137E9j18R0n5k3O6o5J0L9l2M5j9j9L6k5J9L4q6j5j2J04m6K0o2JJ16j18O6k2p
$$ 59 -59 31 -24 -47 19 -46 -36 3 -29 16 -3 -22 14 -11 8 42 -44 -59 -71 33 -13 7 -55 -54 62 -56 10 -12 -19
8166a9mlK7j8K3K5n2J6%K1pp2Q6k4L9l0l2lK6OM4j5q7M4k
$$ -19 -23 -26 1 -17 6 31 -21 -5 -5 16 9 -63 23 -1 38 8 -24 -27 -1 5 49 34 -53 -9 -11
8191a1
$$ Imaginary data points
##PAGE= N=2
##DATA TABLE= (X++(I..I)), XYDATA
0@%%%%%%%%%%%%%%%%%%%%%%%Pj5J6j6J6j6J6j6K4l2L2l2M0m8M8n6O4p2Q0q8R7
$$ 0 0 0 0 0 0 0 0 0 0 0 0 0 0 0 0 0 0 0 0 0 0 0 0 7 -8 8 -8 8 -8 8 -8 16 -16 16 -16 24 -24 24 -32 32 -40 40 -48 49
44D9j05J20j33J45j60J76j95K15k36K60k87L17l51L89m32M87n51O24p14Q29r82
$$ 49 -56 64 -69 76 -84 92 -103 112 -124 136 -151 166 -185 204 -228 259 -292 332 -382 447 -535
65e35J196j513K042l155J0083j3046m10K1894j4908k369J8518n647j8890J0119
$$ -535 661 -852 1190 -1965 8118 -4928 -5338 16556 1648 -721 17797 12150 -6740 3379
79C379P814q958M47Q268m805l858L268k149p238L053P137k058n473L091K24o397
$$ 3379 11193 2235 2682 10950 6145 2287 5555 3406 -3832 -779 6358 4300 -1173 1918 2142 -4255
95d255L916P903q960o912R591J499p702M682K260p875L959P573o109j815L876
$$ -4255 -339 7564 -1396 -8308 1283 2782 -4920 -238 2022 -5853 -1894 5679 -430 -2245 1631
110A631o748p87J0101l120o206Q890J559j0172K498O092n057j37O695k427o139
$$ 1631 -5117 -5904 4197 1077 -5129 3761 5320 -4852 -2354 3738 -1319 -1456 5239 2812 -3327
125c327P40L235K258J316n88j576k572j572K250J909p64P76m23k639J728J362
$$ -3327 -2587 648 2906 4222 3634 2058 -514 -2086 164 2073 1309 2085 1662 -977 751 2113
141B113l616J512L654m947k407M612k138k920N780Q63n254K012J812l996K041
$$ 2113 -1503 9 3663 -1284 -3691 921 -1217 -4137 1643 2506 -2748 -736 1076 -2920 -879
156h79K961m914k95N153j499j178M276j398m498K623L074j786p86R44l76o29L27
$$ -879 2082 -2832 -3127 2026 527 -651 3625 2227 -2271 352 3426 1640 854 1798 1422 793 1120
173A120J832J059k060n87J588k188k551K604J358j565Q99j58k808P86K092j248
$$ 1120 2952 4011 1951 1364 2952 764 -1787 817 2175 610 1509 1351 -1457 -671 1421 173
189A73j73m3k852J70K599q72k75J838j635j301K046j076j814K528J7k935J667
$$ 173 0 -43 -2895 -2725 -126 -998 -1273 565 -1070 -2371 -325 -1401 -3215 -687 -670 -3605 -1938
206a938J770k310J006K914k444k167K094L26j638J179J318r95n51J403O93q62
$$ -1938 -168 -2478 -1472 1442 -1002 -3169 -1075 -749 -2387 -1208 110 -885 -1436 -33 660 -202
222b02O4J386p28j982J041J540j196P63K017k020j172K728k31k684J164P33k226
$$ -202 -138 1248 520 -1462 -421 1119 -77 686 2703 683 -489 2239 2008 -676 488 1221 -1005
239a005J071K340k149j258K207l00j402P76k53j442O29P64q07l13Q77O90M69m60
$$ -1005 66 2406 257 -1001 1206 906 -496 280 27 -1415 -786 -22 -829 -1142 -265 425 894 434
257D34j257n55J89Q00J062j78j063P1P02K40L70j6p21o7R2n17j18nK58J337O15
$$ 434 -823 -1378 -1189 -389 673 495 -568 -497 205 445 815 799 78 11 103 -414 -532 -537 -279 1058 1673
278A673j354q49J96p03L46J625q77j470J222O18j038P23Q77j352j34J530q80j762
$$ 1673 319 -530 -334 -1037 -691 934 57 -1413 -191 427 -611 112 989 -363 -497 1033 153 -1609
296a609O98Q56o5J036R81j516j606O64P03m68o0N21n87n63J022L71j356J72J602
$$ -1609 -911 -55 -120 916 1897 381 -1225 -561 142 -326 -386 135 -452 -1015 7 378 -978 -806 796
315G96k78j191N9p21r58J865K040r31j015M28l12l80R96j47j062N12J236l70q66
$$ 796 518 -673 -614 -1335 -2293 -428 1612 681 -334 94 -218 -598 398 251 -811 -299 937 567 -299
334b99j06L18Q29Q29l32j528j147L26J247O47j98j84L5K0J45l66p22j6J079O43
$$ -299 -405 -87 742 1571 1239 -289 -1436 -1110 137 784 586 402 437 457 602 236 -486 -502 577 1220
354A220l84j003l55O88J089N61k85j082r38K57O94l89k32Q63K02l60J51o67j364
$$ 1220 836 -167 -522 166 1255 1816 1531 449 -489 -232 462 73 -159 704 906 546 697 30 -1334
373a334L59J484l89q06J2n00l00J177R08q11n02L70m30o19L01M54N1M97R20k07
$$ -1334 -975 509 120 -686 -674 -1174 -1474 -297 611 -200 -702 -332 -762 -1381 -1080 -626 -575 -78 842 635
393F35j153j19O41m1J24N54o73j062P74Q75l28J32M89p02m99M35n33q93M34R25
$$ 635 -518 -637 4 -37 87 641 -32 -1094 -320 555 227 359 848 146 -353 82 -451 -1344 -910 15
413A5K73j4k84m82l31L61M59j00p12j74M81Q4k08M17J41j59M83K9j233p04O73
$$ 15 288 274 -10 -492 -823 -462 -3 -103 -815 -989 -508 -424 -632 -215 -74 -233 250 279 -954 -1658 -985
434i85N57N11L70m41o57K49N58J51l62j72J63J4j31L47L48r4M62P48p52j102N82
$$ -985 -428 83 453 12 -645 -396 162 313 -49 -221 -58 -44 -175 172 520 426 888 1636 884 -218 364
455C64M49m82L25L92p00m2Q52j08o60k04k74l32Q6j13k28N8o8l6Jk61l8k7n36
$$ 364 813 331 656 1048 348 306 1158 1050 390 186 -88 -420 -334 -447 -675 -617 -685 -721 -720 -981 -1019 -1046 -1582
478a582l76K00p5P5R05j8p07K72M60l50m4L63j59j11K07K20M00L25K6K98l1r58
$$ -1582 -1958 -1758 -1833 -1758 -853 -871 -1578 -1306 -846 -1196 -1240 -877 -1036 -1147 -940 -720 -320 5 31 329 298 -660
500f60RR84M1l76K10q8j55Q28M64n21j45l24o23N39N19m32J82O19m84n37L44K27
$$ -660 -651 333 374 -2 208 120 -35 793 1257 736 591 267 -356 183 702 270 452 1071 587 50 394 621
522F21j98L2j90m68m73o1Q59P38m81n27K7n02k72O88M2m94K12m1j85Q77J62o86
$$ 621 423 455 265 -203 -676 -737 122 860 379 -148 -121 -623 -895 -207 -165 -659 -447 -488 -673 204 366 -320
544c20L46K63p12J4Q90k88l69N36M89r4o6P2J54k24p74j20P27j15J1P69m95j373
$$ -320 26 289 -423 -409 481 193 -176 360 849 755 689 761 915 691 -83 -203 524 409 420 1189 694 -679
566f79J16R37rj18n04r13k49N60M46L80Q3n66l10J17m42j13N24M67L34k13r56
$$ -679 -563 374 365 247 -257 -1170 -1419 -859 -413 -33 50 -516 -826 -709 -1151 -1264 -740 -273 61 -152 -1108
587a108J19J231J93n7L79q67j099J026J203n38k46N44P1K1K52k03m61K5K19L80
$$ -1108 -989 242 435 378 757 -110 -1209 -183 1020 482 236 780 851 872 1124 921 460 485 704 1084
607A084J53n29J56N96j72k53R7k17J39M08p01o90L96J46K72Q62k63j543m72M40
$$ 1084 1237 708 864 1460 1288 1035 1132 915 1054 1462 761 71 467 613 885 1747 1484 -59 -531 -91
627i1o0L20K02n28m67J7KK97L58l17j8j1p57m19P02M12K40N61l37o77Q6L08J77
$$ -91 -151 169 371 -157 -624 -607 -605 -308 50 -267 -285 -296 -1053 -1472 -770 -358 -118 443 106 -571 -485 -177 0
650@L99l1q01J69O10J88O2Oj79p8K02r6j94l56k62N00N04l83M4K53n81j70L88
$$ 0 399 368 -433 -264 346 534 596 602 423 345 547 451 257 -99 -361 139 643 260 304 557 -24 -194 194
673A94n22l72P89L88n76r5qk53O54P88n78p82k05j53M44P90l7k41j8j36J5J3k23
$$ 194 -328 -700 89 477 -99 -194 -202 -455 199 987 409 -373 -578 -731 -287 503 466 225 207 71 86 99 -124
696a24nM60r7l66OJ7K99O35N8o64k36m9j8M35J27l03N4L22J0Q7j40l88N2R1l02
$$ -124 -129 331 234 -132 -126 -109 190 825 883 219 -17 -66 -84 351 478 175 229 551 561 648 508 120 172 263 -39
721c9P2J99l25k1M45k89l16L92j38n40K3j1k68L07M36j16o8O1k69o4K30N8q4N
$$ -39 33 232 -93 -114 331 42 -274 118 -20 -560 -537 -548 -816 -509 -73 -189 -257 -196 -465 -529 -299 -241 -325 -320
745c20J4r1K68K21L12P5n66j8J88j98p3M02r2j92L23J78l73P9J60l36j05O6k29
$$ -320 -306 -397 -129 92 404 479 -87 -105 83 -115 -188 214 122 -70 253 431 58 137 297 -39 -144 -78 -307
768c07N7M46P0j68R5p7KJ09n9q7j44RR1L28n3J2J71j34k86Q0r5k21K01J50j61
$$ -307 -250 196 266 98 193 116 118 227 168 81 -63 -54 37 365 312 324 495 361 75 155 60 -161 40 190 29
793B9K9J42p5K9j02j32j6K3k14P3J90j11J84K43j08n3J19j84k92J02J44j17L30
$$ 29 58 200 125 154 52 -80 -96 -73 -287 -214 -24 -135 49 292 184 131 250 66 -226 -124 20 -97 233
816B33K90l56j87J99J3o2j1j25k50L6J75J51r1k6K70N5l19k05j39o4K77N34j82
$$ 233 523 167 -20 179 192 130 119 -6 -256 -220 -45 106 15 -11 259 314 -5 -210 -349 -413 -136 398 216
839B16l72J02J72kK04j69l59Q7K56k01j86N6J44K74J79l51m28j66J25J34J18j57
$$ 216 -156 -54 118 116 320 151 -208 -121 135 -66 -252 -196 -52 222 401 50 -378 -544 -419 -285 -167 -324
861c24j48K38J41j18lj5j08K78M6k43j90J96K44L62J89o9k71p8NL4R7mJ37J21
$$ -324 -472 -234 -93 -211 -214 -229 -337 -59 -13 -256 -446 -250 -6 356 545 476 205 127 132 166 263 259 396 517
885E17k9m0m4j39J49J53j80k29j10j85q1N37K07k28n0j00l40K7J59j11j15J79
$$ 517 488 448 404 265 414 567 387 158 48 -137 -218 319 526 298 248 148 -192 -165 -6 -117 -232 -53
907e3J50j57k9j22O1J45J30j13l24k94Q4L66J26l6L6m6j21J44j84l17J48L63N8
$$ -53 97 -60 -89 -211 -150 -5 125 12 -312 -606 -522 -156 -30 -66 -30 -76 -197 -53 -237 -554 -406 -43 15
930A5L8r6k16J98L81J52k10j92j70J03J97l7P0K60P2j20kl69l24K74K42M9k21
$$ 15 53 -43 -259 -61 320 472 262 70 -100 3 200 163 233 493 565 445 443 74 -250 24 266 315 94
953I4j77j55J58K93l7k36m8j46L0K8p3J6J96K34N9q0j53l4J69k0L3J19n1n4L42
$$ 94 -83 -238 -80 213 176 -60 -108 -254 -224 -196 -269 -253 -57 177 236 156 3 -31 138 118 151 270 219 165 507
978E07lj42J63J13j10n1m4k81M2K21M9P3J71k75j28J2j38o8J86p7j17k2M3n8K73
$$ 507 504 362 525 638 528 477 433 152 194 415 464 537 708 433 305 317 179 111 297 220 103 81 124 66 339
1003C39j57j68O8j83k86J31R0k8R4J13k41r4O5K0j5q1k88R9J57L0J23R7r5j2K55
$$ 339 182 14 82 -101 -387 -256 -166 -194 -100 13 -228 -322 -257 -237 -252 -333 -621 -522 -365 -335 -212 -115 -210 -222 33
1028C3j54n8R9L0j7K22N0pK71J72k52j3J2j73Q8K22j01j51Q3k1J60Jj47j64p3
$$ 33 -121 -179 -80 -50 -67 155 205 198 469 641 389 376 388 215 303 525 424 273 356 335 495 496 349 185 112
1053A12k02k4J84q5q4K38k01j93J81L2j35Pp1k79L32K12q3N0J62k47q8J92j23
$$ 112 -90 -114 70 -15 -99 139 -62 -255 -74 -42 -177 -170 -241 -520 -188 24 -59 -9 153 -94 -182 10 -113
1076a13m6J70r8j4P1n3Q7K92m4k79r7j67l2L71J05j79q1Q2k1J84l6k27M1k1j03
$$ -113 -159 11 -87 -101 -30 -83 4 296 252 -27 -124 -291 -323 48 153 -26 -107 -25 -46 138 102 -125 -84 -105 -208
1101b08o7J06m3K24Q4j45j68M5j59j8J44k83j65L25J30j06J54j13l39Q9K41j20
$$ -208 -275 -169 -212 12 96 -49 -217 -172 -331 -349 -205 -488 -653 -328 -198 -304 -150 -263 -602 -513 -272 -392
1123c92M1P4j78Q3K35J02J61P7j36j51ko2J21L03J36j6n8j68k9K21np7K9k74k73
$$ -392 -351 -277 -455 -372 -137 -35 126 203 67 -84 -86 -148 -27 276 412 396 338 170 141 362 357 280 309 35 -238
1148b38K44K33k8O9p9l04KM6j20J0K8n5J5J54j31j03K49j3j09M9k20o3K48J05
$$ -238 6 239 211 280 201 -103 -101 -55 -175 -165 -137 -192 -177 -23 -154 -257 -8 -21 -130 -81 -301 -364 -116 -11
1172a1k30J03Q4n3K18ql41k06O8J54K63K2k44j7J38n9R9M5j27N3M3j31j04J60
$$ -11 -241 -138 -54 -107 111 103 -238 -444 -376 -222 41 63 -181 -198 -60 -119 -20 25 -102 -49 -6 -137 -241 -81
1196h1K01J83J36k49l96J31J03O4J00k8k90Q1J71L2n4l5j00J2m2k09J9J82J8O8
$$ -81 120 303 439 190 -206 -75 28 92 192 164 -126 -45 126 158 104 69 -31 -19 -61 -270 -251 -69 -51 17
1220A7J31j72j11J11L1j45O9J8%K83l3j58J10Q3j76J10J34k12n2j8k4J18J35L2
$$ 17 148 -24 -135 -24 7 -138 -69 -51 -51 232 199 41 151 234 58 168 302 90 38 20 -4 114 249 281
1244B81qj11j29j77J13P1j14J10J01j68k3J02K3P9K3j59p5n5nK54J21j12j3mm2
$$ 281 273 162 33 -144 -31 40 -74 36 137 -31 -54 48 71 150 173 14 -61 -116 -121 133 254 142 129 125 83
1269H3J8k8j02p7L1R1jJ4q3k3J69j13j25k2k0n2J37j1q1R9J55j8j3l4j62RJ72
$$ 83 101 73 -29 -106 -75 16 15 29 -54 -77 92 -21 -146 -168 -188 -240 -103 -114 -195 -96 59 41 28 -6 -168 -159 13
1296A3l0K7N3oK8Q0j9o2K8o9j43O4p9K0J96O7j21L4m8o0K6K5m6p7L7Q8O7Q6o2
$$ 13 -17 10 63 57 85 165 146 84 112 43 -100 -36 -115 -95 101 168 47 81 33 -27 -1 24 -22 -99 -62 26 93 179 117
1325A17O2nj52k7Q1o9Q3J4m6l8O0P4p0Qq9k00QJ19r4P6O3l4qM5j00qkK7j1k1J5
$$ 117 179 174 22 -5 76 7 90 104 58 20 80 154 84 92 3 -197 -189 -70 -164 -88 -25 -59 -67 -22 -122 -130 -132 -105 -116 -137 -122
1356a22L8J80J3o2K8m8NJ3n0m6Q4N8K3K3J8j01m6M1j14n0LM0r5R0m5P9QpJ5m8
$$ -122 -84 96 109 47 75 27 32 45 -5 -51 33 91 114 137 155 54 8 49 -65 -115 -112 -72 -167 -77 -122 -43 -35 -42 -27 -75
1386g5k11P4O4o3N5J42rq4O7J7j12Q8K8r2l5Q6k3R4L8m1k6P4j35n8M3k8J10J60
$$ -75 -286 -212 -148 -211 -156 -14 -23 -107 -40 -23 -135 -47 -19 -111 -146 -60 -83 11 49 8 -18 56 -79 -137 -94 -122 -12 148
1414A48m8o2R7J9m4O5n6j31J07J20n1NM9n4Q6N3j54q5j30kO2J15r8p6J08p3l8
$$ 148 100 38 135 154 110 175 119 -12 95 215 164 169 218 164 250 303 149 64 -66 -68 -6 109 11 -65 43 -30 -68
1441f8n8q2o5J41k7j34k0M6R2J50Rj25lj9o0J55M0m8O2J15m5Mj1k8O6M4r7j00
$$ -68 -126 -208 -273 -132 -159 -293 -313 -267 -175 -25 -16 -141 -144 -163 -223 -68 -28 -76 -14 101 56 60 49 21 87 131 34 -66
1469f6J12n1N7J27n1n5K1rj07L6m6k6L4J07rl1K9q2L3N0r2Nm4n2pJ26N2N1J7j31
$$ -66 46 -5 52 179 128 73 94 85 -22 14 -32 -58 -24 83 74 43 72 -10 23 73 -19 -14 -58 -110 -117 9 61 112 129 -2
1499bp1K9q5l7Q7J37j12J09J1j27N9J30m8l7pj27J11J17Pk9Q5jj1L6n8o0J1M6
$$ -2 -73 -44 -129 -166 -79 58 -54 55 66 -61 -2 128 80 43 36 -91 20 137 144 115 200 199 188 224 166 106 117 163
1527A63qL8q9p2J45j1j06p9J1q6K3j3n0k2O9P1Kl4j84P2Qn7L3O1J3k1J42Mj28
$$ 163 155 193 104 32 177 166 60 -19 -8 -94 -71 -84 -134 -156 -87 -16 -14 -48 -232 -160 -152 -209 -176 -115 -102 -123 19 23 -105
1556a05J58M4j30N0l1q9P7J94j11J17k3j02j5O7m1o6P6o2P8M6l1K6M2o9p0L5k9
$$ -105 53 97 -33 17 -14 -103 -26 168 57 174 151 49 34 101 60 -6 70 8 86 132 101 127 169 100 30 65 36
1583C6k7O6lm6M6P4r6K7Jo2J6k6o9L0M8KK8l6o5n9P5K3j37L3q9Q8P1P4k0P2l3
$$ 36 9 75 72 26 72 146 50 77 78 16 32 6 -63 -33 15 17 45 9 -56 -115 -40 -17 -154 -121 -210 -122 -51 23 3 75 42
1614D2o3K4M2r9O8P3n7K4J13n1J06k6j64m5J3l3P6P6j75K9K5M4p5j4j6r1N0j2
$$ 42 -21 3 45 -54 14 87 30 54 167 116 222 196 32 -13 0 -33 43 119 -56 -27 -2 42 -33 -47 -63 -154 -104 -116
1642a16o7J34J02j8no5q6K3M3K9l4N2n1J6O4K5J4kp5P0n0l1l0R3N9r7J3K3J5O0
$$ -116 -183 -49 53 35 30 -35 -121 -98 -55 -26 -60 -8 -59 -43 21 46 60 58 -17 53 3 -28 -58 35 94 -3 10 33 48 108
1672A08Nj18n3N0O6L2J0o6M3J32o1Ql7l3k0L5j18N2J18k5qk7p2j00P3Q6q8o0M7
$$ 108 113 -5 -58 -8 58 90 100 34 77 209 148 156 119 86 66 101 -17 35 153 128 120 93 21 -79 -6 80 -8 -68 -21
1701b1j04Q1J32p3K7n0n0k4%j1Q5N3L2k8J0k0K1P6m4r5N2j5n6Q8M2n2M5j0p4m0
$$ -21 -125 -44 88 15 42 -8 -58 -82 -82 -93 -8 45 77 49 59 39 60 136 92 -3 49 34 -22 66 108 56 101 91 17 -23
1731b3J7q0O6N3r6P2Q6l3j41J40q4L7J5O%j3J2K1R0j1J0j3m4j11l4M2K7J61n8
$$ -23 -6 -86 -20 33 -63 9 95 62 -79 61 -23 14 29 35 35 22 34 55 145 134 144 131 87 -24 -58 -16 11 172 114
1760A14p1r%K0J8j4j28J4N6p4L5R3m1J6N6n7q5L9M5JK9j6n4P0Q0m0p1O5r4%O3
$$ 114 43 34 34 54 72 58 -70 -56 0 -74 -39 54 13 29 85 28 -57 -18 27 28 57 41 -13 57 137 97 26 91 -3 -3 60
1791F0m2olL4j4O0j13Kk1j0r7Q2qL9Q2j1q2L7Pj7Q4k8j26O1L5n5P7N3j9r7K2q3
$$ 60 18 12 9 43 29 89 -24 -22 -43 -53 -150 -68 -76 -37 45 34 -48 -11 -4 -21 63 35 -91 -30 5 -50 27 80 61 -36 -14 -97
1823i7NN0m0K0J2j6m5O4M0r6N0o6n3M9J03m1R2K1n7P4Kl5J6m1l8K9Q4k7P1Mj6
$$ -97 -92 -42 -82 -62 -50 -66 -111 -47 -7 -103 -53 -119 -172 -123 -20 -61 31 52 -5 69 71 36 52 11 -27 2 86 59 130 134 118
1854A18q1N1k8k1l7Pj10N8N0m9M9N5p2n6K4n2J7qK6NM7l3K2M5rm4j1m4N8L5%o3
$$ 118 37 88 60 39 2 9 -101 -43 7 -42 7 62 -10 -66 -42 -94 -77 -85 -59 -54 -7 -40 -18 27 18 -26 -37 -81 -23 12 12 -51
1886e1J23m6k3Ql8m9J25o3r5N6M0j5J09J2q7l1Q1o6rL9M8n7Q3L9j22O0qKL3p9
$$ -51 72 26 3 11 -27 -76 49 -14 -109 -53 -13 -28 81 93 6 -25 56 -10 -19 20 68 11 94 133 11 71 63 65 98 19
1916A9m8j3N3Qm2K7j8J9j8j8r0k1L0O2qjj4J00l9J3m6j1K7K5m3O5Q3j1l1Q4m1
$$ 19 -29 -42 11 19 -23 4 -14 5 -13 -31 -121 -142 -112 -50 -58 -59 -73 27 -12 1 -45 -56 -29 -4 -47 18 101 90 59 143 102
1947A02n9J39q1r4O3J0o7O1ol6J6J1Rq3K6j7oM0oM2m8J6j3L1p6L5nlj2m5M9KJ6
$$ 102 43 182 101 7 70 80 13 74 68 32 48 59 68 -15 11 -6 -12 28 22 64 16 32 19 50 -26 9 4 1 -11 -56 -7 -5 11
1980A1K7l4q6pM0Qm7pM5L3Jk2n2pO7m1K4K2O1p7K1O9j5%M4J7o8P5o9JJ1N9p8M6
$$ 11 38 4 -82 -89 -49 -41 -88 -95 -50 -17 -16 -38 -90 -97 -30 -71 -47 -25 36 -41 -20 49 34 34 78 95 27 102 33 34 45 104 26 72
2014G2l3k9J6K6n8r3R5q3K4Mm6N2O3m3n6l2j8KM2R1r6P9J2M5n5j6k0M2O4o6J0
$$ 72 39 10 26 52 -6 -99 -4 -87 -63 -59 -105 -53 10 -33 -89 -121 -139 -137 -95 -4 -100 -21 -9 36 -19 -35 -55 -13 51 -15 -5
2045eJ3OP0J8r8k8Q0j5o1jlKL7K7j4k3k6L5J2l6k8oK2MlP3l9J9N1o3m8Ro9P2r
$$ -5 8 14 84 102 4 -24 56 41 -20 -21 -24 -22 15 42 28 5 -21 14 26 -10 -38 -44 -22 -18 -21 52 13 32 83 20 -28 -19 -88 -16 -25
2080b5Rl2J7K0n6M5o4j8K7nm1R2k8K5Q8p2K6l0P3n4pM8MK1N6k9n2O2l4m8m3M8
$$ -25 -16 -48 -31 -11 -67 -22 -86 -104 -77 -82 -123 -31 -59 -34 54 -18 8 -22 51 -3 -10 38 42 63 119 90 38 100 66 18 -25 23
2112B3J2l0J5Jj8M5l8J0qj19K7K0K7MJ3Qk8M8k4%m3P4l3M1l4n5P8R0n8Jj0qm0
$$ 23 35 5 20 21 3 48 10 20 12 -107 -80 -60 -33 -29 -16 -8 -36 12 -12 -12 -55 19 -14 27 -7 -62 16 106 48 49 39 31 -9
2145iL0k9m7O7j6j4O1q6KK9Ok0M0kp4R6n0M2mM7m7L5k6o4N3k6K8L3k7m4k6J11
$$ -9 21 -8 -55 12 -4 -18 43 -43 -41 -12 -6 -26 14 12 -62 34 -16 26 22 69 22 57 31 -33 20 -6 22 55 28 -16 -42 69
2177F9o6k6Kj8L5No3M7M2Ln1k3m8J8O1J4l0K6n2Q0K7Pj0%l6J7m2J3L0j3Q2j01
$$ 69 3 -23 -21 -39 -4 1 -62 -15 27 30 -21 -44 -92 -74 -13 1 -29 -3 -55 25 52 59 49 49 13 30 -12 1 31 18 100 -1
2209ajK0L4J9m7l7k8J8l4O9J1K2p7N6K3n1l3O5m2N1Kk8K8K6k7Lm7k0J5K3j1Nj1
$$ -1 -2 18 52 71 24 -13 -41 -23 -57 12 23 45 -32 24 47 -4 -37 28 -14 37 39 11 39 65 38 41 -6 -26 -11 12 1 6 -5
2242ek4j3M3n3nj5L2n0j8Q5m2P5o1rK0L9k9N8n8p1M1N8J7K3K0rj8K1ql1L7k3n9
$$ -5 -29 -42 1 -52 -57 -72 -40 -90 -108 -23 -65 10 -51 -60 -40 -1 -30 28 -30 -101 -60 -2 15 38 58 49 31 52 44 13 50 27 -32
2275c2O2p5j9J05ln5l0lpL8J8k3k2K1L2lK8o7LM8J9n4QoM7M4o0k0J2l6L7K5n7
$$ -32 30 -45 -64 41 38 -17 -47 -50 -57 -19 -1 -24 -46 -25 7 4 32 -35 -32 16 35 -19 -11 -17 30 74 14 -6 6 -30 7 32 -25
2308b5n0J9P9l7Mok1k5M8m1k0N6l6K4K8jNOM4m5j0ql5P4j7L2rJ9l8L9Np3N8m2
$$ -25 -75 -56 23 -14 -10 -16 -37 -62 -14 -55 -75 -19 -55 -31 -3 -4 1 7 51 6 -4 -12 -47 27 10 42 33 52 14 53 58 -15 43 1
2342Al8j3K6k3L1j5J0k5K5Lj4l1l1M5K0J6L4kl9M2J8o8qL3J9J5j7l7M6k7M3j8
$$ 1 -37 -50 -24 -47 -16 -31 -21 -46 -21 -18 -32 -63 -94 -49 -29 -13 21 19 -20 22 40 -28 -36 -3 16 31 14 -23 23 -4 39 21
2374B1l8%K1o2L1L1m0M4Nj0Kk1pK9K7m4J6N4n0P1m1jj7j6k8M5m7%K8M7j7q5L1
$$ 21 -17 -17 4 -58 -27 4 -36 8 13 3 5 -16 -23 6 33 -11 5 59 9 80 39 38 21 5 -23 22 -25 -25 3 50 33 -52 -21
2407b1k1oj2NJJ8K0q2P5JP%J1l8k8Q2k1J5lN0L0j7l6k1lJ6n7J7L3k6N4K1n8O5
$$ -21 -42 -48 -60 -55 -54 -36 -16 -98 -23 -22 -15 -15 -4 -42 -70 12 -9 6 3 53 83 66 30 9 6 22 -35 -18 15 -11 43 64 6 71
2441G1j2n2l9P1p0NJ5k6N7j0m8M8k1K0n2L6o6K7M7N9l7ppJ9L3n6m5L6OOj6j6M2
$$ 71 59 7 -32 39 -31 -26 -11 -37 20 10 -38 10 -11 9 -43 -7 -73 -46 1 60 23 16 9 28 61 5 -40 -4 2 8 -8 -24 18
2474A8k5mj9N2j9k1L3nL5o4J5Q1k7P9j24K8K8Ok2l5L1J2N9m5n7Q2n0k2k9N2q2
$$ 18 -7 -11 -30 22 3 -18 15 10 45 -19 -4 77 50 129 5 33 61 67 45 10 41 53 112 67 10 92 42 20 -9 43 -39
2505c9K6L2o1kL4om4N7l8n8J02Jmj2J3M4k5j5j9J1O1m6Kj8M3J9nn7L7M6o0k5M2
$$ -39 -13 19 -42 -44 -10 -16 -60 -3 -41 -99 3 4 0 -12 1 45 20 5 -14 -3 58 12 14 -4 39 58 53 -4 33 79 19 -6 36
2538C6l3J5mL6M9r1j9j5L7l1Lp4L5P0m1N4l0L9l2QK7m1oKJ8n0N7J3m5k0Q0r7L8
$$ 36 3 18 14 50 99 8 -11 -26 11 -20 -17 -91 -56 14 -27 27 -3 36 4 12 39 -2 -8 -6 12 -38 19 32 -13 -33 47 -50 -12
2571a2k0kK3PPk0P3n0m6O1J5p4J13o4lO9k3j0K1p9R7q3M7L1m9m6M2j4pJ6N4l0
$$ -12 -32 -34 -11 -4 3 -17 56 6 -40 21 36 -38 75 11 8 77 54 44 65 -14 83 0 47 78 29 -17 25 11 4 20 74 44
2603D4k3m8j3j5L7n4M8k2O1l7MkJ9J7j8L3l3J8m7K5L0pK8l3K6q7k9N2L0m2M2j2
$$ 44 21 -27 -40 -55 -18 -72 -24 -46 15 -22 -18 -20 -1 16 -2 31 -2 16 -31 -6 24 17 45 12 38 -49 -78 -26 4 -38 4 -8
2635hK4NJoJlr0P2j2O2m1j0L3j9M5l6M9l5n3K5K4L0j6K8rn8Lo7O4n6N4NK8j0p6
$$ -8 16 21 22 16 17 14 -76 -4 -16 46 5 -5 28 9 54 18 67 32 -21 4 28 58 42 70 61 3 6 -61 3 -53 1 6 34 24 -52
2670e2Q3j0m7nl0L4l1k4Q9K1L5r8M1l4N3l8J5L3k3%K1m4M8j2ok3K0nm2J5J1n4
$$ -52 31 21 -26 -31 -61 -27 -58 -82 7 28 63 -35 6 -28 25 -13 2 35 12 12 33 -11 37 25 19 -4 16 11 -31 -16 -5 -59
2702e9Q8Pk9rj5l3M1k0m4R3j6M3l9rKN8o0o5L8M4J0j9M4o6K9K0l5m7O6Ml8Nj2
$$ -59 29 36 7 -2 -17 -50 -9 -29 -73 20 4 47 8 -1 1 59 -1 -66 -28 16 26 7 51 -15 14 34 -1 -48 18 22 -16 -11 -23
2735b3l3k2R0J2pl7j3k2O0k8L3J5Lj1K8K5j6pm2l6O4l3k6J4L8j2o3P0Nl5jk4%
$$ -23 -56 -78 12 24 17 -20 -33 -55 5 -23 10 25 28 17 45 70 54 47 5 -31 33 0 -26 -12 26 14 -49 21 26 -9 -10 -34 -34
2768c4j2%L8l8M1Ok4K1ln0N8j9J4knM2m8O2k8J8n8N7o7L4p3K3nP3o4N8kl8j4K7
$$ -34 -46 -46 -8 -46 -5 1 -23 -2 -5 -55 3 -16 -2 -4 -9 33 -15 47 19 37 -21 36 -31 3 -70 -47 -52 21 -43 15 13 -25 -39 -12
2802a2k1m3P2M%j3L2J1n6O3j4k2OJ4L5k2J9m1O5n5nn0M7l1L7m9l0M4qL0q5N1j0
$$ -12 -33 -76 -4 0 0 -13 19 30 -26 37 23 1 7 21 56 34 53 12 77 22 17 -33 14 -17 20 -29 -59 -15 -23 7 -78 -27 -37
2835c7l0R2o3j7Q3j4pN3p5N4J1k4o9M9K3L3k1J%j2Pl0j4R1j55R0m0k0K4LL4l7
$$ -37 -67 25 -38 -55 28 14 7 60 -15 39 50 26 -43 6 29 62 41 42 42 30 37 7 -7 84 -71 19 -21 -41 -17 -14 20 -17
2867a7J8o4R8l4J6k8K8m0NN8rl8Jj5JQ0l9n1R1n2K3n3l9J04m8k0MJ5j8J1qL4J
$$ -17 1 -63 35 1 17 -11 17 -23 -18 40 31 -7 -6 -21 -20 60 21 -30 61 9 32 -21 -60 44 -4 -24 -20 -5 -23 -12 -20 14 15
2900A5K5o8K2l4L6K7l3O6j02P0l3J5L1K8m5K0k7rm2M1L4K1p9O7l1n5L3l9LL8n9
$$ 15 40 -28 -6 -40 -4 23 -10 56 -46 24 -9 6 37 65 20 40 13 4 -38 3 37 58 -21 46 15 -40 -7 -46 -43 -5 -64
2931f4M1L4l6K8nk0j7M4n2K7L4jL0o8O8r8J17J7j08Q4j15J6M9lk4L3m0lj2N6l8
$$ -64 -23 11 -25 3 -2 -22 -39 5 -47 -20 14 13 43 -25 43 -55 62 79 -29 55 -60 -44 5 2 -22 11 -29 -32 -44 12 -26
2962b6j6rlL6j5N1jL4m2J2j0kmj5M7Kk2lJ9m3P7p4J1L1o3K3M9p5O4o5L4q0K1K9
$$ -26 -42 -51 -54 -18 -33 18 17 51 9 21 11 9 5 -10 37 39 17 14 33 -10 67 -7 4 35 -28 -5 44 -31 33 -32 2 -78 -57 -28
2996b8l9P2k7n1N4J2k8PM3op4P3o3O7%m7O6j7j8L6M1o4Oqj9oJ6J7j8J3m4L3l2
$$ -28 -67 5 -22 -73 -19 -7 -35 -28 15 9 -65 8 -55 12 12 -35 31 14 -4 32 73 9 15 7 -12 -18 -2 15 -3 10 -34 -1 -33
3029c3J5K1k2J7l2M1P4j13N2Jj0mL7n1NL1m9L9k2L6j17P1L8m0j4N3l2m4K1RL6
$$ -33 -18 3 -19 -2 -34 7 81 -32 20 21 11 7 44 -7 -2 29 -20 19 -3 33 -84 -13 25 -15 -29 24 -8 -52 -31 -22 14
3060A4L8l5m2K0K8J6k5l0KM4j4J7K8o8M6L2m3k0K2m1mQ5k4pJ9l7n8J9K7o7L7N7
$$ 14 52 17 -25 -5 23 39 14 -16 -14 30 16 33 61 -7 39 71 28 8 30 -11 -15 70 46 39 58 21 -37 -18 9 -58 -21 36
3092C6n1M8%m7J3RrK6Pl9Lj6R1o8j2K0JK2pKj5ol5M5Ko7N3j4M2l4L2o3LRpJ1K4
$$ 36 -15 33 33 -14 -1 8 -1 25 32 -7 -4 -20 71 3 -9 11 12 34 27 29 14 8 -27 18 20 -47 6 -8 34 0 32 -31 -28 -19 -26 -15 9
3129IJ0n7N1l1M0Qn8NK5j9O5Rr6J01l9mj1l3L%k4O6l5k6RM5Pl5k1Jj4K1L1rRL3
$$ 9 19 -38 13 -18 22 30 -28 -23 2 -17 48 57 -39 62 23 19 8 -25 -22 -22 -46 20 -15 -41 -32 13 20 -15 -36 -35 -49 -28 3 -6 3 36
3165C6o7N9p8N6k4J1K4rj0L7Qo3j0O2j4k5Ll2Jk3M8KLJ8m3J7j8L3k9nj0R3m9n9
$$ 36 -31 28 -50 6 -18 -7 17 8 -2 35 43 -20 -30 32 18 -7 -4 -36 -35 -58 -10 -8 -5 13 -30 -13 -31 2 -27 -32 -42 51 2 -57
3199e7O9pk2N9j9k3KNJ6j0k2M5j6o4O5k9m5K7l0N0N3o5M0j4m7QQ4r7J25j26O1
$$ -57 12 5 -17 42 23 0 2 7 23 13 -9 36 20 -44 21 -8 -53 -26 -56 -6 47 -18 22 8 -39 -31 53 -44 81 -45 16
3230A6m5J2J4K0m2O9p8K6k1N7J0l2lJj0OJ3m0L8k4k3j7P3n0lN1mMmk8j1J0M5m2
$$ 16 -29 -17 -3 17 -25 44 -34 -8 -29 28 38 6 3 4 -6 0 13 -27 11 -13 -36 -53 20 -30 -33 18 14 18 14 -14 -25 -15 30 -12
3264a2J6JK5J7J6l9m2O7J2p6j9M3j7M3p1N5k3k4M3k8j1l0J9M5j8J2k9J0m3P2k9
$$ -12 4 5 30 47 63 24 -18 49 61 -15 -34 9 -8 35 -36 19 -4 -28 15 -13 -24 -54 -35 10 -8 4 -25 -15 -58 14 -15
3295a5Mjpj0Q4m3k9J4K1k9J8J7m5J4J9m0nL6%k6J7j5OMk5kM8k6rL1L7m2O0o5L8
$$ -15 -11 -12 -19 -29 55 12 -17 -3 18 -11 7 24 -21 -7 12 -28 -33 3 3 -23 -6 -21 -15 -11 -36 -38 10 -16 -25 6 43 1 61 -4 34
3330C4nkk3J3j5pL9K6n4L0n0N0q0K0M4l8L0Rl9%%Mn2N4J7j0L0J9p0K2J4J8J0l3
$$ 34 29 27 4 17 2 -5 34 60 6 36 -14 36 -44 -24 20 -18 12 21 -18 -18 -18 -14 -66 -12 5 -5 25 44 -26 -4 10 28 38 5
3364ErK2K8p0L9l0M5qj5l4K8j2QLJk6L0k4K2j7M2l6K1j7o1P2j6l8J02r6J1N1M1
$$ 5 -4 18 46 -24 15 -15 30 22 7 -27 1 -11 -3 0 1 -25 5 -19 3 -14 28 -8 13 -4 -65 7 -9 -47 55 -41 -30 21 62
3397F2K4o7k4J0M4K0m3k6k4M9K5r1KL4J5ol2NmLM2Pp1N0l9J8K7j9M4o8K1O2o1
$$ 62 86 19 -5 5 49 69 26 0 -24 25 50 -41 -39 -5 10 4 -28 -23 -27 -24 18 25 -46 4 -35 -17 10 -9 35 -33 -12 50 -11
3430a1j2J1J6K5k2j1ML3m8M9m3K2l7K0k9N4oJ1po2N6K1l0q2J68q0lQmm1O0j0q
$$ -11 -23 -12 4 29 7 -4 0 33 -15 34 -9 13 -24 -4 -33 21 15 26 19 -43 13 34 4 -78 90 10 7 15 11 -30 30 20 12
3463A2m0L0O4r2N4J5o9K5n1M0l0M8k2J0j6L0KKK5o3lJ5K2oNJpK4Jkl7M2j6J0k2
$$ 12 -28 2 66 -26 28 43 -26 -1 -52 -12 -42 6 -16 -6 -22 8 10 12 37 -26 -29 -14 8 2 7 8 1 25 26 24 -13 29 13 23 1
3498AK9Ml5qqJ1j3oO1o8L6j8jK3k7rlQ2q5LO0j9L0j7Rk0j3m0J14k0p4rJ3L6k1
$$ 1 30 34 -1 -9 -17 -6 -19 -25 36 -32 4 -14 -15 8 -19 -28 -31 51 -34 -31 29 10 40 23 32 12 -1 -41 73 53 -21 -30 -17 19 -2
3533bN9l9km8k0M3O2q3rK8j9NM7n6M2Rk3JL7n8k5O0KK7l6K0k3M6Jkk1LL4k5J0
$$ -2 57 18 16 -32 -52 -9 53 -30 -39 -11 -30 -25 22 -34 8 17 -6 -5 32 -26 -51 9 11 38 2 22 -1 45 46 44 23 26 60 35 45
3568D5m9k0P9m6L4o5L0K1j7M7n9K2p4M1J2K6J6j3j4j0j3nk0N8K0n8M2m0K5LK0
$$ 45 -4 -24 55 9 43 -22 8 29 12 59 0 22 -52 -11 1 27 43 30 16 6 -7 -12 -32 26 46 -12 30 -10 15 18 38
3599C8m1k3M5n6L7ok2L0J1rk9M1k2n0N9%m7K1L0n6L7L5M8p0J0n2N3L8Qk7r1PO5
$$ 38 -3 -26 19 -37 0 -6 -28 2 13 4 -25 16 -6 -56 3 3 -44 -23 7 -49 -12 23 71 1 11 -41 12 50 58 31 -60 -53 12
3632A2m2OM7j3K4p5M7J9m7J1qK4J1K1p5N1K0L4l2k6J2NP5j12O2n6l0Q1mk6j4k3
$$ 12 -30 -24 23 10 34 -41 6 25 -22 -11 -19 5 16 37 -38 13 33 67 35 9 21 26 101 -11 51 -5 -35 46 42 16 2 -21
3664b1O9n6J0m2N2k9K5l3lM5r0O9pJk0k0O1mj7N7o9O4q0N1J0n3L5k6Mj0J5L8j
$$ -21 48 -8 2 -40 12 -17 8 -25 -28 17 -73 -4 -11 -10 -30 -50 11 7 -10 47 -22 42 -38 13 23 -30 5 -21 -17 -27 -12 26 25
3697B5j7j2l6L0pk0k8L9O0o2K4l5j1K0L8N7r0K2m1P6m6M2n6Q6o1k0M9l3k1qM0
$$ 25 8 -4 -40 -10 -17 -37 -65 -26 34 -28 -4 -39 -50 -30 8 65 -25 -3 -44 32 -14 28 -28 58 -3 -23 26 -7 -28 -36 4
3728DrL1k0Ll1K6o5P2m2L8Jk5J6K4k4K9m0NJ1Pk2K4j4J6m0K7J2J8j4l2K9m0J5
$$ 4 -5 26 6 9 -22 4 -61 11 -31 7 8 -17 -1 23 -1 28 -12 -7 4 11 -11 13 -1 15 -25 2 14 32 18 -14 15 -25 -10
3761a0n8N5M0nm0lJ5J6n7K9L2n2P8n4j5O2l2n1P9j7l5M5J5QL6q0P6n7K2r5Q5o0
$$ -10 -68 -13 27 22 -18 -21 -6 10 -47 -18 14 -38 40 -14 -29 33 1 -50 29 12 -23 22 37 45 81 1 77 20 42 -53 32 -28
3793b8jL3pk1K0k4K7m5j7M6rj1R0o3P6r5K4J7m1K9K4J1l0n7PN5JNp1O7J8j3j5
$$ -28 -29 4 -3 -24 -4 -28 -1 -46 -63 -17 -26 -37 53 -10 66 -29 -5 12 -29 0 24 35 5 -52 -45 10 11 16 -55 12 30 17 2
3826Bk4L3j4kK2L2m1qpl2K7K4Lkll9J8J9J8l1J1k0k5P7k3j9J7K1m8L8m1j7OM5
$$ 2 -22 11 -3 -5 17 49 8 0 -7 -39 -12 12 15 13 10 -29 -11 8 26 -5 6 -14 -39 38 15 -4 13 34 -14 24 -17 -34 -28 17
3860A7Nl5PRm1J6J0k9K0k6N7n8K9k6M2rOKqLN2j2Ln4N1n7J2pP9m8o5M2kjl3J4
$$ 17 22 -13 -6 3 -38 -22 -12 -41 -21 -47 10 -48 -19 -45 -3 -12 -6 -4 -12 -9 43 31 34 -20 31 -26 -14 -21 58 10 -55 -13 -15 -16 -49 -35
3896c5j2k5Q2k2nN4o6jJ9l2L6jk4N5om5j2O7m2K4nMK2o8Nl2M7Pj3j8K0J7k6Rl
$$ -35 -47 -72 10 -12 -17 37 -29 -30 -11 -43 -7 -8 -32 23 17 -28 -40 27 -15 9 4 8 30 -38 -33 -65 -18 -11 -24 -42 -22 -5 -31 -22 -25
3931b5L9j5J8k2K8n1K1oK1K2j35Q0L8j6Ml8N6k9LnK9j5l3jR9p5p1P9J3k3l4K5
$$ -25 14 -1 17 -5 23 -28 -7 -13 8 30 -105 -25 13 -3 1 -37 19 -10 -7 -12 17 2 -31 -32 67 -8 -79 0 13 -10 -44 -19
3963a9k6M2j7mj5jN2qn7K7M3k4K6m5O0k9K3koK4pJ9n2mK7n5JnJ0RoNQj7J9J6j4
$$ -19 -45 -3 -20 -24 -39 -40 12 4 -53 -26 17 -7 19 -26 34 5 28 26 20 44 37 56 4 0 27 -28 -27 -32 -22 -13 -19 -14 -6 -23 -4 12 -2
4000bnPm1k1P6J1N7r4l9K5L1K3j9l3K7Jn1K7j0M0m3K6m3M6N3l5m6K9k3L1k4j3
$$ -2 -7 0 -41 -62 14 25 82 -12 -51 -26 5 28 9 -24 3 4 -47 -20 -30 10 -33 -7 -50 -4 49 14 -32 -3 -26 5 -19 -32
4032c2K1j5K6l6P9q4P1k5Pl5KJ9K0J3lk2l6L4j7O8m2Kk0J5n7LJ2L0lJ5j4k8lM3
$$ -32 -11 -26 0 -36 43 -41 30 5 12 -23 -21 -2 18 31 28 6 -30 4 -13 55 13 15 -5 10 -47 -44 -32 -2 -5 10 -4 -32 -35 8
4066Hk4K7J3o3M2lj0Jj1P9K1q1j4NMk1K3K4q6P1M8k8l3j0NOJ9rK9q3N2k3J6K7
$$ 8 -16 11 24 -39 3 0 -10 -9 -20 59 80 -1 -15 -10 -6 -27 -4 20 -66 5 53 25 -8 -18 -13 -7 12 3 32 -51 1 -22 -6 21
4100B1k7l4M9Om0L6K7l5MJ9q0PM1J7p9J5L9%N7j1n7O9o3O3n2J7N9q2l6Q1p2K1
$$ 21 -6 -40 9 15 -25 11 38 3 7 26 -54 -47 -6 11 -68 -53 -14 -14 43 32 -25 44 -19 44 -8 9 68 -14 -50 31 -41 -20
4132b0L2k9K8m5J8j4N5ok1J0JlqqrJ0J4lJ9pJ3l7K3n2JJ0L6Jk6j9J7OL8l7KL8
$$ -20 12 -17 11 -34 -16 -30 25 19 -2 8 9 6 -2 -10 -19 -9 5 2 21 14 27 -10 13 -39 -38 -28 8 9 -17 -36 -19 -13 25 -12 -10 28
4168B8m7M7kkj0j2K2K8m5l8L7jn0J8L1p4Q6j8Pn6%J2K1K4lL3J4m0NN3l8j5k8J2
$$ 28 -19 28 26 24 14 2 24 52 7 -31 6 5 -45 -27 4 -70 16 -2 5 -51 -51 -39 -18 6 3 36 50 10 15 68 30 15 -13 -1
4202aK4kK7k3Oo3M9k9J1MJ3k5Rj9mNrK0QJ9n6J6L1K3pl9P5n0k2j3jM0n6L3J1m2
$$ -1 23 21 48 25 31 -32 17 -12 -1 3 16 -9 0 -19 -23 -18 -27 -7 1 20 -36 -20 11 34 27 -12 63 13 -9 -22 -23 17 -39 -6 5 -37
4238c7O3k7J4km0O0k3Qj8PPj6K9n7N8oj2l1K8J1Kl3K0k6jJ8L8kn5O3j0Po7K0K0
$$ -37 26 -1 13 11 -29 31 8 16 -2 5 12 -4 25 -32 26 20 8 -23 5 16 18 -15 5 -21 -22 -4 34 32 -23 40 30 37 -30 -10 10
4273A0KPn3K4P0m5j2%j7K6n0P0m2K0mM0j7l1L1m9K0j5J4K0m2l2L9J2N1o5L1Nj8
$$ 10 12 19 -34 -10 60 15 3 3 -14 12 -38 32 -10 10 6 46 29 -2 29 -20 0 -15 -1 19 -23 -55 -16 -4 47 -18 13 18 0
4306@Jn4M0lnk3R2l2k4J2mm0N3k7K0mNJj1J5m9L6M4m7L0o8Q3o4O6n5J9k4NL7j7
$$ 0 1 -53 -13 -16 -21 -44 48 16 -8 4 0 -40 13 -14 6 2 7 8 -3 12 -37 -1 43 -4 26 -42 41 -23 43 -12 7 -17 -12 25 8
4341Hn8O2Ll3J2Rl8J6R1r8J9l5K7lJ8J4j6M3l5l1Jk4N9N9o6km1O3j8j6K1M6J2
$$ 8 -50 12 15 -18 -6 3 -35 -19 72 -26 -7 -42 -15 -18 0 14 -2 41 6 -25 -24 -48 11 70 4 2 -39 24 6 -10 11 57 69
4374F9l8k8n3P6o5K5K5j4%L2l0l9MN1k8J3l4O5o9l8M5M8m6K6oK3qM3k1OJ2p8M6
$$ 69 31 3 -50 26 -39 -14 11 -3 -3 29 -1 -40 -36 15 -13 0 -34 31 -38 -76 -31 17 -29 -3 -9 14 6 49 28 34 46 -32 14
4407A4o8J03o6O0j02QN3J6Rm2K4m9L9Pj1mM6j3m7OLK6m1L7j4nJj4J2J4K8l8RJ1
$$ 14 -54 49 -17 43 -59 -51 2 18 27 -15 9 -40 -1 6 -5 -9 37 24 -23 -17 -14 12 -29 8 -6 -11 -10 -24 -12 2 30 -8 1 12
4441A2mj4K3n4QJ3j7K4ROk9J2K2m2M2l5L6Mn8L2l3N5Ml7M6m2O0r2L8O5l6Nj7O
$$ 12 8 -6 17 -37 -29 -16 -33 -9 0 6 -23 -11 11 -31 11 -24 12 16 -42 -10 -43 12 16 -21 25 -17 43 -49 -11 54 18 23 6 12
4475A2oJl3O5j9k4jQO6n2k7J2l6K2j4M0mm7O8p8K3j4R0o1lQjM8Km2m7J6LkKQJ7
$$ 12 6 7 -26 39 20 -4 -5 3 69 17 -10 2 -34 -12 -26 14 10 -37 31 -47 -24 -38 52 -9 -12 -4 -5 43 45 3 -44 -28 -25 -27 -25 -17 0
4512@j3j8N2p3P7k1k4O1l7n7M1L9qK7lk7n5j5N6K6J0k0k4J9knm1R8q3j8PrM2r
$$ 0 -13 -31 21 -52 25 4 -20 41 4 -53 -12 27 19 46 43 16 -39 -54 2 28 38 18 -6 13 11 6 -35 63 -20 -38 -31 -40 2 -7
4546gL0oj1J5o3M2J2L1j5j7k0L9m6K7k5N7l0Ln0N8l8M1r3P4J5m6J4J0N2n6LJ6
$$ -7 23 17 6 21 -42 0 12 43 28 11 -9 30 -16 11 -14 43 13 16 -34 24 -14 27 -66 8 23 -23 -9 1 53 -3 0 16
4578A6lj9JK0RJ0lk5k5N5o2J1J4K9o3P1m2O0k8j6j5j4m4P4M5q9M4Qj1o8P8lql
$$ 16 13 -6 -5 15 24 34 31 6 -19 36 -26 -15 -1 28 -35 36 -6 54 26 10 -5 -19 -63 11 56 -33 11 19 8 -60 18 15 7 4
4612DlJ1lk5N8j07L4O0L0m4n5jP0m5K3Q0o3k9k5JK7K0j7L6q5K8K8K3k6LO0p5m
$$ 4 1 12 9 -16 42 -65 -31 29 59 15 -40 -41 29 -16 7 87 24 -5 -30 -29 -2 18 1 37 -48 -20 8 31 5 8 68 -7 -11
4645a1O7r1Q5n8k3M8NJ7J8q9J8J4l0P6j7k4K7j6Om3RN2j5k6L8m0L2po9P9Jl7L1
$$ -11 56 -35 50 -8 -31 17 22 39 57 -32 -14 0 -30 46 29 5 32 16 22 -21 -12 40 25 -1 37 -3 29 22 -47 32 33 -4 27
4678B7Rk0J1pk5K9k5l4mM6l5K5ML5o1R7o5j8L1k8k9L5OJ3n3J8M4n3KK6K2J2m7
$$ 27 36 16 27 20 -5 24 -1 -35 -39 7 -28 -3 1 36 -25 72 7 -11 20 -8 -37 -2 4 17 -36 -18 26 -27 -25 1 23 35 -12
4711a2L5m5M4J6k0j3m3rO1J0mj0j3J6j6ok1J9J5kj1QkqL9p6%Q0m3k1m8O9o8P7
$$ -12 23 -22 22 38 18 5 -38 -47 14 24 20 10 -3 13 -3 -9 -30 -11 4 2 -9 -1 -3 -11 28 -48 -48 32 -11 -32 -80 -11 -79 -2
4745bMk1K8L7l9j1L5j5J0mk8M1k4PPm2l3Q3o2K5M8l7j2k3L2o6P3m4L1n2N2Pj5
$$ -2 2 -19 9 46 7 -4 31 16 26 22 -6 35 11 18 25 -17 -50 33 -29 -4 44 7 -5 -28 4 -62 11 -33 -2 -54 -2 5 -10
4778a0J1n0N5NQk8K6l8N9n1KM1n6L5j6J7J1J5l0j0J9jk6L8k8l4O6l9M4o9N5LO
$$ -10 1 -49 6 11 19 -9 17 -21 38 -13 -11 30 -26 9 -7 10 21 36 6 -4 15 14 -12 26 -2 -36 30 -9 35 -34 21 24 30
4811C0m2j4M0j2Q5n8l0PRj6l5Pj7L7K6m4M7jl8nQ1q3k0N7k4K4J0m2k0M3j0oJ3
$$ 30 -12 -26 14 2 87 29 -1 6 15 -1 -36 -29 -46 -9 17 -27 20 19 -19 -24 57 -26 -46 11 -13 11 21 -21 -41 2 -8 -14 -1
4844apM2%po7NK2J8j2M0q2LO3m5L9k1K6k0LL3k3j3J9J8k2jOk8nJ4J6%j6Mj1%M9
$$ -1 -8 34 34 27 -40 -35 -13 5 -7 33 -49 -46 17 -28 11 -10 16 -4 -1 32 9 -4 15 33 11 10 16 -12 -17 -3 13 13 -3 1 -10 -10 39
4881C9m4K8j4oK8o0L8ROj0Lm0J4J5J0n2K2L3Ro4K0O6j06M4O1j3n9K2OK2j8k8L6
$$ 39 -5 23 9 3 31 -29 9 18 24 14 17 -23 -9 6 16 -36 -14 19 28 -36 -16 50 -56 -12 49 36 -23 -1 5 27 9 -19 17
4914A7J1NPj6l9O2j5k6k7l9O3N3q9N6J2m9K1J8Pj9k7J6j5Lk0L7J6n1lN1m2J6L4
$$ 17 28 33 40 24 -15 47 32 6 -21 -60 3 56 -33 23 35 -14 7 25 32 13 -14 2 -13 -10 -30 7 23 -28 -31 20 -22 -6 28
4947B8p6O0K7onJ9K7m2l7j3K7RMJ0p4J04n6n0%O1J0j7N4m1k5K6nk1O%M3q7L0k2
$$ 28 -48 12 39 33 28 47 74 32 -5 -18 9 18 22 32 -42 62 6 -44 -44 17 27 10 64 23 -2 24 19 -2 4 4 47 -40 -10 -32
4981c2M8M3n9J3Nm0m5L1P0m8M5l0Q%l8J2j7N1l2%O9j9o0L9j3K7J9l3j9LOk8O0
$$ -32 16 59 0 13 18 -22 -67 -36 34 -14 31 1 9 9 -29 -17 -34 17 -15 -15 54 35 -25 14 1 28 47 14 -5 -2 4 -24 36
5014C6l0nm0K9%k5j4J3l4P9Q%m7jJ6j9L8l9K5PRk1K4J9j9rrJL2rK5j16R5KK5m1
$$ 36 6 1 -39 -10 -10 -35 -49 -36 -70 9 17 17 -30 -31 -15 -34 4 -35 -10 -3 6 -15 9 28 9 0 -9 -8 24 15 40 -76 19 21 46 5
5050EpK7k2m9L7K8j4k5oL6m7M0k0K4j4k5K5J3j1M8k5m8mP3n9L0Ok2Qm2O9p7P6
$$ 5 -2 25 3 -46 -9 19 5 -20 -26 10 -37 3 -17 7 -7 -32 -7 6 -5 43 18 -30 -34 39 -20 10 16 -6 2 -40 29 -48 28
5083B8p1O2L9r2O8m6ML8l9N4jk5n0j2N5om4J8P7p8L7k2J3J%J4p5N9K8m7K1L4l7
$$ 28 -43 19 58 -34 34 -12 -8 30 -9 45 44 19 -31 -43 12 6 -38 -20 57 -21 16 -6 7 8 8 22 -53 6 34 -13 8 42 5
5116EL0m3L7o2MP6q0O1j6j8%j2J13q5l8M5Pj4m5N9ok9N2Mk4%%mkl4L6j4k7L9k9
$$ 5 35 -8 29 -33 -29 47 -33 28 12 -6 -6 -18 95 10 -28 17 24 10 -35 24 18 -11 41 45 21 21 21 17 15 -19 17 3 -24 15 -14
5151a4O1p0N5q0QO2m2L1j4j4J0j5K6Rm3M7k3K7n7MK5ON5n7N5o7M7j9n6N7L8o2
$$ -14 47 -23 32 -48 -40 22 -20 11 -3 -17 -7 -22 4 13 -30 17 -6 21 -36 -32 -7 -1 54 -3 52 -15 32 13 -43 14 52 -10
5183a0J5R2p8l4ML9L1p7K6Nm3J9kqM6%k1lpM0OJ1k7K0l7j5RK7p2P3l4pJJ5K3M1
$$ -10 5 97 19 -15 -11 28 59 -18 8 13 -30 -11 -13 -21 25 25 4 1 -6 34 40 51 24 44 7 -8 1 28 -44 29 -5 -12 -11 4 27 68
5219F8r5N5m0RM6l9PNLj3%L5r9P2m4j6O3m4%L2j8j4L6k3KL0L8n2o3M1M8j8j1l0
$$ 68 -27 28 -12 -3 43 4 11 16 19 6 6 41 -58 14 -30 -46 17 -27 -27 5 -13 -27 9 -14 -12 18 56 4 -59 -18 30 12 1 -29
5253b9QK0%O0o9N4m3M0j9o9L5Nj3N0n0N8j7m3J7P4p6M0m1Ol7M1J3k7l0l1N5K1
$$ -29 -21 -1 -1 59 -10 44 1 41 22 -47 -12 -7 -20 30 -20 38 21 -22 -5 69 -7 33 -8 -2 -39 2 15 -12 -42 -73 -18 3
5285CNjM8j1j2m6%J2l0M7k5rj0M0nN3Kn7k1J7J8j9N4n1N7o8j5lK3Mj5k7K9PL7
$$ 3 8 7 55 44 32 -14 -14 -2 -32 15 -10 -19 -29 11 6 59 61 4 -17 0 18 -1 53 2 59 -9 -24 -27 -4 0 -15 -42 -13 -6 31
5320C1l4ll2PK2JRJ0J7kj2m8N6l3N0k9m%N8q9M4Kj5LL6J7k6l5J6m1oL7k2lL5n1
$$ 31 -3 -6 -38 -31 -9 -8 1 11 28 26 14 -34 22 -11 39 10 6 6 64 -25 19 21 6 9 45 62 36 1 17 -24 -30 7 -15 -18 17 -34
5356c4M9o9Q1k5j2oO2o4J8K7n3L7J0J2k3M9r5M8mJ2rl9KO9l1n0P1l6PJ7%m4P2
$$ -34 15 -54 27 2 -10 -16 46 -18 0 27 -26 11 21 33 10 59 -36 12 8 20 11 -28 -26 43 12 -38 33 -3 4 21 21 -23 49
5389D9n1L1o5L1N9l6mK7K9p8rK5Kl3O8l1K2pqp0K6pP9k5l6Mj0K4%M4Ko7K5j0j7
$$ 49 -2 29 -36 -5 54 18 14 41 70 -8 -17 8 10 -23 45 14 36 29 21 -49 -23 -30 49 24 -12 -8 -18 6 6 50 52 -15 10 0 -17
5424a7L4qj8RNk8QNJ6ORk4j8L4k0nmK3M2m9L5n5N2m9MO1k2l5J0L2k8nkK8o5J36
$$ -17 17 9 -9 0 5 -23 -15 -10 6 12 21 -3 -21 13 -7 -12 -16 7 49 0 35 -20 32 -17 -13 48 26 -9 1 33 5 0 -2 26 -39 97
5460I7j04M4k2L3Lj19Q3l2M0oK8k8J4J2n1oL3p4K5K7kL7j5Jj5nRk6J6k6L8k0K8
$$ 97 -7 37 15 48 51 -68 15 -17 23 17 45 17 31 43 -8 -14 19 -55 -30 -3 -5 32 17 18 3 -2 7 -19 -3 -29 9 -11 17
5493A7oK0m1pPM3l1m7P2qM4p0M4K0l1k4k2L5Kl4K6k0MlJ9l1J7j6L0j9k8R6p4Q6
$$ 17 11 31 -10 -17 -10 33 2 -45 27 19 63 -7 37 57 26 2 -20 15 17 -17 9 -11 -7 -10 9 -22 -5 -21 9 -10 -38 58 -16 70
5527G0m5l8K1l3L0k7J1J8pl2M4J7o4k2P2J5m0MN3l7L3rl3j3j3O9n9J4J8m7K4K7
$$ 70 25 -13 8 -25 5 -22 -11 7 0 -32 12 29 -35 -57 15 30 -10 -6 47 10 43 34 1 -12 -25 44 -15 -1 17 -30 -6 21
5559B1N9n1k8O0n5m7O6K5o7J4k7N6n9K7J9l3J0j3J5oO1k5j4%m2P2l8M6Qj2n7N4
$$ 21 80 29 1 61 6 -41 25 50 -17 -3 -30 26 -33 -6 13 -20 -10 -23 -8 -14 47 22 8 8 -34 38 0 46 54 42 -15 39
5591C9j5j6Nj2QmJ5JK2k7K0nJ7m7P2r5k1L2L4L3l9l1k0O5m6k2K7L1j3k5K2L3o
$$ 39 24 8 13 1 9 5 20 21 43 16 36 31 48 1 73 -22 -43 -11 23 56 17 -14 -34 31 -15 -37 -10 21 8 -17 5 38 32
5624C2k7J8K6k7l0j5N2K2q3O8n9JN3k5J9m4j2L5J2L6q2L3k8P4o8J0ll1O5p9O2
$$ 32 5 23 49 22 -8 -23 29 51 -32 36 -23 -22 31 6 25 -19 -31 4 16 52 -30 3 -25 49 -19 -9 -12 -43 22 -57 5
5655EJn5nL9J6j4QN5k0JJ3m9Ok8M6no0R3r5K8N7r5J08l5k1Q4o5MJ8om6J9KQJ6
$$ 5 6 -49 -54 -15 1 -13 -5 50 30 31 44 -5 1 -27 19 14 -46 47 -48 -20 37 -58 50 15 -6 78 13 17 35 29 -17 2 4 12 28
5690B8Knl5l7N2l1L5J1j6j2L2rok3k9J8l0O5Rj2j8J7RNk6Jj4M1l4M4l1J0k9m0
$$ 28 30 25 -10 -47 5 -26 9 20 4 -8 24 15 9 -14 -43 -25 -55 10 19 7 -11 6 15 20 -6 -5 -19 22 -12 32 1 11 -18 -58
5724e8N3J9Pp0J22j14J7N5oj6k2M6p9M3l0J7K2J0Okm5N1nJl6k1J9j1M6m2ON0j2
$$ -58 -5 14 21 -49 73 -41 -24 31 25 9 -13 33 -46 -3 -33 -16 6 16 22 20 -25 26 21 22 -14 -35 -16 -27 19 -23 -17 33 21
5757B1j9J7Rk9l8P2n1K8j9L5l5kl0JO6o2jM7m2K1L3m1jJ0J3J4j8n6O3pk2M2k4
$$ 21 2 19 28 -1 -39 33 -18 10 -9 26 -9 -11 -41 -40 26 -36 -37 10 -32 -11 22 -19 -20 -10 3 17 -1 -57 6 -1 -23 19 -5
5790eM3q7J16k4%o6n1O7PL7o7MQL0j9L4j5j6L6k8m4O2rqK4J8l4m3Q4n4n3R5n5
$$ -5 38 -49 67 43 43 -23 -74 -7 0 37 -30 -26 -18 12 -7 27 12 -4 32 4 -40 22 13 5 29 47 13 -30 54 0 -53 42 -13
5823a3j8qL8j4J8j0pQP4r2O7q7J04m3k7M5j1%j1m5qL6K6j1k7%L8K3o8K6J7k2R
$$ -13 -31 -39 -1 -15 3 -7 -14 -6 68 -24 43 -44 60 17 -10 35 24 24 13 -32 -40 -4 22 11 -16 -16 22 45 -23 3 20 -2 7
5856GM2Kn8K8RMo2K9k2N6m3j0QkO8o5l8RM7LJj0Lqn7J1M1j0Q7o7kK8p2O9%l9M1
$$ 7 49 51 -7 21 30 34 -28 1 -21 35 -8 -18 -10 -12 56 -9 -47 -38 9 12 13 3 6 -2 -59 -48 -7 -17 70 3 1 29 -43 26 26 -13 28
5893B8nJ2l0RO2q4MK1o5O7J2l5m1J9k4J4M5J2q0N1L4l0J7qrJ3k4L6kpl4J5K0o1
$$ 28 23 35 5 14 76 -8 -4 17 -48 19 31 -4 -45 -26 -50 -36 9 21 -59 -8 26 -4 13 5 -4 9 -15 21 19 12 -22 -7 13 -48
5927d8N5l1K9j0M0k3K9k4K7l4m1jO0l0R4j19j6J8K8m6K5M5m8J1j8N4pn9O6j5m8
$$ -48 7 -24 5 -5 35 12 41 17 44 10 -31 -32 28 -2 92 -27 -43 -25 3 -43 -18 27 -21 -10 -28 26 19 -40 26 11 -37
5958c7P7k7o0L4O6p2j2K6J5%Jl6Ll9P9k6J7K3K5j9l5JM6r0R3k1j7Lj4pL1m9k7
$$ -37 40 13 -47 -13 53 -19 -31 -5 10 10 11 -25 -22 -61 18 -8 9 32 57 38 3 4 50 -40 53 32 15 18 4 -3 28 -21 -48
5991d8M5k8M3l3N9l2o1K6M9K1l0j7l3O0k4kk7L2Nm9Q3k8rJ0j1k6L1rO1m1ql7L8
$$ -48 -3 -31 12 -21 38 6 -55 -29 20 41 11 -6 -39 21 -3 -5 -32 0 5 -44 39 11 2 12 1 -25 6 -3 58 17 9 -28 10
6024A0N8r8J8m2R1n0Q3p7K6k5lj3J1M1nnj0j9J6jj6j0J9j6Qk9J7M5j6l6M1n8P3
$$ 10 68 -30 -12 -54 37 -13 70 -7 19 -6 -9 -22 -11 30 25 20 10 -9 7 6 -10 -20 -1 -17 -9 -38 -21 24 8 -28 13 -45 28
6057B8k2J9l7JJ0k0k3M7j8O8n7K2k0Qm7J1N2L2o2K2Km5L0L9l5j5k0L6Rl9oM9m2
$$ 28 6 25 -12 -11 -1 -21 -44 3 -15 53 -4 18 -2 6 -41 -30 22 54 -8 14 16 -29 1 40 5 -10 -30 6 15 -24 -30 19 -23
6090b3nJ02o7O3n2nl9K7J8K6n6N1k7J8mj0O8n9l5j1P1q7L5K6k1j1l8M4J7jl6L2
$$ -23 -28 74 7 70 18 13 -26 1 19 45 -11 40 13 31 27 17 85 26 -9 -20 51 -36 -1 25 4 -7 -45 -1 16 15 -21 11
6122A1j5plmN1n7N6m3oK4M8n1Mm1R1K5p0M0n4L4j5L2l9l2M4m1K4j3JMj6j9L7m1
$$ 11 -4 -11 -14 -18 33 -24 32 -11 -17 7 55 4 8 -33 58 83 13 53 -1 33 18 50 11 -21 23 -18 6 -7 -6 -2 -18 -37 0 -41
6156d1L1OrJ6K6l2qQkK5m7N9jORo1k2P8j5J4l5J0j4k1k6L1O0p9M5pPnM3l9K0m4
$$ -41 -10 -4 -13 3 29 -3 -11 -3 -5 20 -27 32 31 37 46 -15 -37 41 26 40 5 15 1 -20 -46 -15 45 -34 11 4 11 6 49 10 30 -14
6192a4MJ0L7k7k0l2L8Qo4M3J4J9%Jj3J5k6J2N0o3j4K8J1Jj1l8J7M2m1M7p3M0k1
$$ -14 -10 0 37 10 -10 -42 -4 4 -60 -17 -3 16 16 17 4 19 -7 5 55 -8 -22 6 17 18 7 -31 -14 28 -13 34 -39 1 -20
6225b0R9m5m4nK8N3p3jL8j3m8j8N6Mk1L9o3Q6q5J3J7k0O7o9M0j2j7lN7p8K2L0
$$ -20 79 34 -10 -15 13 66 -7 -8 30 17 -31 -49 7 11 -10 29 -34 52 -33 -20 -3 -23 44 -25 15 3 -14 -17 40 -38 -16 14
6257A4M2m2oL3j7J6k7K9j9jj2J6K8j3Rj6o7L5M8l2o0M0l7L0MK0M0r3Q8j9Km7p
$$ 14 56 14 8 41 24 40 13 42 23 22 10 26 54 41 50 34 -33 2 50 18 -42 -2 -39 -9 -5 15 55 -38 50 31 33 -14 -21
6290b1J2Nj0K6J6k7pJ3L0m4K7k5om5J8P8J2l7o2Q3K5l7o0R8o2K0jM0j3m7K3nk7
$$ -21 -9 -4 -14 12 28 1 -6 7 37 -7 20 -5 -11 -56 -38 40 52 15 -47 36 61 24 -36 62 0 20 19 59 46 -1 22 17 -10
6323a0j0%qP0o7J1rL1K9k8RK0m0N0j3k0K3k9j9j8M0l9K5ML8o7ol0N0O2n1L7l1
$$ -10 -20 -20 -28 42 -25 -14 -23 8 37 9 18 38 -2 48 35 15 38 9 -10 -28 12 -27 -2 2 40 -27 -33 -63 -13 49 -2 35 4
6356DJ9n9P4l8j6L5J7j5l9rP3o6PLM5m0Pk3O9k9l9QJ7J8j8K3l4qrkL3O4p3jRP
$$ 4 23 -36 38 0 -16 19 36 21 -18 -27 46 -20 -13 -10 35 -5 2 -21 48 19 -20 -12 5 23 5 28 -6 -14 -23 -25 8 72 -1 -2 7 14
6392A4Jk5L0olk6N1n7N8K2n8m3Q4oJ3m0l4N9j7k4rk3M4L0m6K9n9N1Jj3j7Qj3k
$$ 14 15 -10 20 14 11 -15 36 -21 37 59 1 -42 42 36 49 9 -25 34 17 -7 -16 -39 5 35 -11 18 -41 10 11 -2 -19 -11 -24 -26
6426b6M5K2k7m3L1MJ1l7P6p4kKm6O1J7jlJ5p0O5NLOo2O1lj4k7Nk2NK7km1M8J3
$$ -26 19 41 14 -29 2 6 17 -20 56 -18 -20 -18 -64 -3 14 13 10 25 -45 20 25 28 34 -28 33 30 16 -11 -6 -28 -23 4 2 -39 9 22
6462B2k4OJ5l2L8l8N1k4J5k0M4m1j3j2K0j5NJ6k9J11p9m6M8j6plK1lJ2nMj6k2
$$ 22 -2 4 19 -13 25 -13 38 14 29 9 53 12 -1 -13 7 -8 -3 13 -16 95 16 -30 18 2 -5 -8 13 10 22 17 21 5 -17
6495a7K4O3j7l9Pko3P2j3l8M3m0M7n0RJ4pK5l5j8O4K1k6j8k9O6o5N9j2l5K0j8
$$ -17 7 70 53 14 21 19 -44 28 15 -23 20 -20 27 -23 -14 0 -7 18 -17 -35 29 50 24 6 -23 43 -22 37 25 -10 10 -8
6527hq8Q2MJ3pM6j3m0M7j9J4l5J4L2j2k8j5j7J6M6m8N6j02M0N8n4N4k6K9m7M7
$$ -8 -96 -14 -10 3 -4 42 29 -11 36 17 31 -4 10 42 30 2 -13 -30 -14 32 -16 40 -62 -22 36 -18 36 10 39 -8 39
6558C9n7oL6NJ1K4j3l1pj7K0L2m4jk6j1M8mJ1k9Ql0L2j4PmK2k4J8%J6n9O6m5o
$$ 39 -18 -24 12 17 28 52 39 8 1 -16 4 36 -8 -9 -35 -46 2 -2 9 -20 -12 -42 -10 -24 -17 -21 1 -23 -5 -5 11 -48 18 -27 -33
6593c3K5k4J2N7jl3Q2r7R9j03P8o1L7Ko7L2j0n4P2l7K7M5n3K0Jj9L2k3qK7p7J5
$$ -33 -8 -32 -20 37 36 3 85 -12 87 -16 62 1 38 40 -27 5 -5 -59 13 -24 3 48 -5 15 16 -3 29 6 -2 25 -52 -37
6625c7P2k6KjK4J1k9k4l6K8N1o4K9nK2k6k5O6q6P4k1l4J8J2L5l7K1pK8q4N0j6
$$ -37 35 9 11 10 34 45 16 -8 -44 -16 35 -29 0 -5 17 -9 -34 32 -54 20 -1 -35 -17 -5 30 -7 14 7 35 -49 1 -15
6657a5M7j2%m4N4j1lk9M2l8K6jl3J5RM2n8Rj0L3j0M9l4l6J2K0nJ2n3K1k2Q4l6
$$ -15 32 20 20 -24 30 19 16 -13 29 -9 17 16 -17 -2 7 49 -9 0 -10 23 13 62 28 -8 4 24 19 31 -22 -1 -23 61 25
6690B5k5L5m7N0n9QJ9Qqm4P6m1K5m0Km1MJ03r7kN5j2K4p4Q9m5M1Ql7PJ0l9K9R
$$ 25 0 35 -12 38 -21 -13 6 14 6 -38 38 -3 22 -18 -16 -57 -53 50 -47 -49 6 -6 18 -56 33 -12 29 37 0 7 17 -22 7 16
6724A6l8Rm3P5k5k3J6jj6O6mpK1k5mLk3J3K0rjk%qJj6L2l1k0M3J7j1l4oN8k0m1
$$ 16 -22 -13 -56 19 -6 -29 -13 -14 -30 36 32 25 46 21 17 20 -3 10 30 21 20 18 18 10 11 -5 27 -4 -24 19 36 25 -9 -15 43 23 -18
6761a8L0j8jL3j8J0m0L6Kj5k6O0K3m5lk7M4l0PJ2lK2K1n1l9L4l5P7n8K7K8%q9
$$ -18 12 -6 -7 26 8 18 -22 14 16 1 -25 35 58 13 10 -17 27 -3 4 16 13 35 56 5 -34 0 -35 42 -16 11 39 39 -50
6794e0N5nrk1MO3l2k5J5OP3n3jm3P3m6l8M6mMk5L3J9k0K6Lkl0k8M5l8k0J3k2M3
$$ -50 5 0 -9 -30 -26 37 5 -20 -5 1 74 21 20 -23 50 4 -34 12 8 12 -13 20 39 19 45 48 46 16 -12 33 -5 -25 -12 -34 9
6829Im3K2Qj6L8j3pl0M2K0m7M8pj1K3Lpj04O6L9n1L8J0k3nN2p7K9m3K3Nj1L7J3
$$ 9 -34 -12 -4 -20 18 5 -2 -32 10 30 -17 31 24 13 36 39 32 -72 -6 33 -18 20 30 7 2 54 -23 6 -37 -14 -9 -20 17 30
6863C0J1m6K5K0KL4p1jk3jj8N6oJ3l6Q2n7l9PJ8K0j4m2L4qOP0k2l6M4j07L4M9
$$ 30 41 -5 20 40 42 76 5 4 -19 -20 -38 18 12 25 -11 71 14 -25 -18 0 20 6 -36 -2 -10 -4 66 44 8 52 -55 -21 28
6896B8lj8KO3m9k8J6ol8K2M4l9j7rK7L9l7m2L9L0m2pL6n0M9K4m6j0J9k9N2pJ3
$$ 28 25 7 9 72 23 -5 11 5 -33 -11 33 -6 -23 -32 -5 34 -3 -45 -6 24 -18 -25 11 -39 10 34 -12 -22 -3 -32 20 13 26
6929B6qm2L6m7J5oK5k1l2M4j0K8k8K3M5m2jK8j4oQ3p3L5j7l4mJ9pk3j9M1LjJ3
$$ 26 18 -24 12 -35 -20 -26 -1 -22 -54 -10 -20 8 -20 3 48 6 5 33 19 13 96 23 58 41 7 3 22 15 -8 -27 14 17 16 29
6963B9Knj8kKkl8P2m3j1N2lj6k1K9n2Q9k8k4lm4N7ol6K6j0LK5J2r5R9K2q1K3n
$$ 29 31 26 8 6 8 6 -32 40 -3 -14 38 35 19 -2 27 -25 64 36 12 9 -35 22 16 -20 6 -4 -1 24 36 -59 40 62 -19 4 -1
6998aMl6K7K8l0mk1N2j4N4o4k7M3M3n9L0n5J8JL9L6o9%L3ok1jK2p4J9O8l3K6l9
$$ -1 3 -33 -6 22 -8 -12 -33 19 5 59 -5 -32 11 54 -5 25 -30 -12 -11 28 64 -5 -5 28 22 1 0 22 -52 -33 35 2 28 -11
7032a1K0m4N1l8j8P6n5lO5j3q2N2L6m7K6n9K5qP6k7l2K1J0j5k9p3Q8pLk0M4l9
$$ -11 9 -35 16 -22 -40 36 -19 -22 43 30 -52 0 36 -11 15 -44 -19 -27 49 22 -10 11 21 6 -23 -96 -8 -15 -12 -32 12 -27
7064b7M7jk0oOK1l2K5L5j1m9J9o5QP0o6M8Rj3N9n9N4Ln1j3nQJ7J5l3J1k2K1j8
$$ -27 20 19 -1 -7 -1 20 -12 13 48 37 -12 7 -58 -50 20 -46 2 11 -2 57 -2 52 55 4 -9 -14 -6 11 26 -7 4 -18 3 -15
7098a5K8j0J5n9R7n0K8j1l6K5l0N1k4j8jK7jN1p7J5p%L5k0J6l4J5l9J4l4P2l9
$$ -15 13 3 18 -41 56 6 34 23 -13 12 -18 33 9 -9 -10 17 16 67 -10 5 -2 -2 33 13 29 -5 10 -29 -15 -49 23 -16
7130a6M9j0j5Pk2Mj4J2M2m7P1n8J8Rj4J0k5jl1O7n2L0K4J5l1K1o1P0m9K3l7J5
$$ -16 33 23 8 15 -7 -3 -17 -5 37 -10 61 3 21 30 16 26 1 0 -31 36 -16 14 38 53 22 43 -18 52 3 26 -11 4
7162DL2k8J3Po4L0RJk2K2m9K4M8o0K6K7j4j2K8j6JM5n1QK0k4Km6O7pk5L9L0l9
$$ 4 36 8 21 28 -36 -6 3 4 -18 4 -45 -21 27 -33 -7 20 6 -6 22 6 7 52 1 9 29 5 7 -39 28 21 -4 35 65 26
7196B6l7N2%m3%k2L0knL3k0rk1P1k5m5J9M4p1L8k6KN8o7M6k2lrJ0m4J08o5j8M0
$$ 26 -11 41 41 -2 -2 -24 6 4 -1 32 12 3 -18 53 28 -17 2 46 -25 13 -13 -11 47 -20 26 4 1 -8 2 -42 66 1 -17 23
7230B3p6O9%k1KPk4M9k2j3K8l2mJ2j4K6ol2K2J4J1j3k3Kk8J5J7K3On9K2J2RML
$$ 23 -53 16 16 -5 -3 4 -20 29 7 -6 22 -10 -14 -2 -16 10 4 -28 -6 8 19 6 -17 -15 -43 -28 -11 12 18 -41 -19 -7 2 6 9
7265IQn9J3N8q2N8l8N2oM8k4m8J8j3mM7p9K1K0K6m8j1jL2K1k6N0J1m5j2Kn4K8
$$ 9 17 -42 -29 29 -53 5 -33 19 13 61 37 -11 7 -6 -10 37 -42 -21 -1 25 -23 -34 -35 -3 18 -8 42 53 8 -4 -2 -56 -28
7298b8P0q0M4L1l6J4m9Q1m6J0j5k3K9j8j7jL5OmJ0m3Q5m2rppK4K6l9j3J4l2mK8
$$ -28 42 -38 6 37 1 15 -34 47 1 11 -4 -27 2 -16 -33 -34 1 7 3 13 -30 55 13 4 -3 -10 14 40 1 -12 2 -30 -34 -6
7332fJ9j0o2N6QJ9k0J4o1M6k0M7l6K1K8j27R0l6PPK9K6l7N2j9lm6Nl7J01k3j9
$$ -6 13 3 -59 -3 5 24 4 18 -43 3 -17 30 -6 15 43 -84 6 -30 -23 -16 13 39 2 54 35 32 -14 -9 -46 55 32 13
7364A3K7k6K7n3J5LJ1k0J4m2L3p8N3M8n5L4P3l9k3l0O5j5r8Q3l4%K1RL0n0j5L1
$$ 13 40 14 41 -12 3 6 17 -3 11 -31 2 -76 -23 25 -30 4 77 38 15 -15 50 35 -63 20 -14 -14 7 16 46 -4 -19 12
7396A2M0k4MJ8m3m5N5p0N2K2n6L6L3k3j9Ok6MQk5P2m2J8k8L9m5RoJ4LJ5J2n1O1
$$ 12 52 28 32 50 7 -38 17 -53 -1 21 -35 1 34 11 -8 -2 -28 -24 -16 -41 31 -11 7 -21 18 -27 -18 -24 -10 -7 8 20 -31 30
7430C0p9P4l0J8o2N4pJ3l8k4R7j8LK9k9JPj4j9pj1k5N5j7k2J12l3q9L9j7j9J2
$$ 30 -49 25 -5 13 -49 5 -2 11 -27 -51 46 28 31 60 31 32 39 25 6 -1 -12 -37 18 1 -21 91 58 -31 8 -9 -28 -16
7462a6J1j2K8J1m0K2pk8J0L8Lk4pL8k5Jl6K4j6j1J7M2k5K0kL7k8j8M9r3Q7k9m
$$ -16 -5 -17 11 22 -18 4 -3 -31 -21 17 20 -4 -11 27 2 3 -33 -9 -25 -36 -19 23 -2 18 16 53 25 7 56 -37 50 21 17
7495A7Kk8n7P4jM1o1j8M0k5j2M7o3M1Qn2R4l9l0RM0l7LPJ0oJ2jm1O7p3J01p5P
$$ 17 19 -9 -66 8 7 48 -13 -31 9 -16 -28 19 -44 -3 5 -47 47 8 -22 -13 27 -10 -7 0 10 4 16 15 -26 41 -32 69 -6 1
7529ArK0p1M3N4Mn2MK3n0N9J5j2m9k7L0J3K6l4l9M5lO2J5p6ln4M9N1k2k7k8P8
$$ 1 -8 12 -59 -16 38 42 -10 -6 17 -33 26 41 29 -20 -47 -17 -4 22 -12 -51 -6 -9 53 68 -8 -11 -65 -16 35 13 -14 -42 36
7562C6l6L7k4p1L9J0L8pK3J2m8Kj3lM1m5k0L4k3k1P3o9QJ4J7J9o5O2%j4l7K0n
$$ 36 0 37 13 -58 -19 -9 29 22 45 57 9 11 -2 -5 36 -9 -29 5 -18 -39 34 -35 -27 -13 4 23 -42 20 20 6 -31 -11 -16
$$ [...]
8191a6
##END NTUPLES=NMR FID
##END=
