##TITLE=1H_LR-758-R4-KA1C2-CR3
 CCl4
 8 sc, 
 28.9.2023
##JCAMPDX= 6.0         $$ Bruker NMR JCAMP-DX V2.0
##DATA TYPE= NMR FID
##DATA CLASS= NTUPLES
##ORIGIN= UXNMR, Bruker Analytische Messtechnik GmbH
##OWNER= root
$$ XWIN-NMR		Version 3.5
$$ Thu Sep 28 14:18:52 2023 Russian Standard Time (UT+4h)  she@DPX200
##.OBSERVE FREQUENCY= 200.13135
##.OBSERVE NUCLEUS= ^1H
##.DELAY= (6, 6)
##.ACQUISITION MODE= SIMULTANEOUS
##.ACQUISITION SCHEME= undefined
##.AVERAGES= 8
##.DIGITISER RES= 18
##SPECTROMETER/DATA SYSTEM= spect
##.PULSE SEQUENCE= zg30
##.SOLVENT NAME= CDCl3
##.SHIFT REFERENCE= (INTERNAL, CDCl3, 0, 15.7039)
##AUDIT TRAIL= $$ (NUMBER, WHEN, WHO, WHERE, WHAT)
$$ ##TITLE= Audit trail, XWIN-NMR		Version 3.5
$$ ##JCAMPDX= 5.01
$$ ##ORIGIN= Bruker BioSpin GmbH
$$ ##OWNER= she
$$ F:/spectra/data/she/nmr/H-F/1/audita.txt
$$ ##AUDIT TRAIL=  $$ (NUMBER, WHEN, WHO, WHERE, WHAT)
(   1,<2023-09-28 14:17:34.23 +0400>,<she>,<DPX200>,
      <created by zg, POWCHK disabled, PULCHK disabled
       configuration hash MD5:
       00 E9 B6 7A A2 85 ED C7 34 08 36 98 17 FE 4E 26
       data hash MD5: 16K
       F5 F5 F2 9B ED 13 AB 81 2A 91 5D 6F 71 F7 46 E7>)
$$ ##END=
$$ 
$$ hash MD5
$$ 89 2B C9 4F CE 8D AD 70 93 00 65 B7 02 B8 BB C3
##$RELAX= 
##$RELAX= 
##$RELAX= 
##$RELAX= 
##$RELAX= 
##$RELAX= 
$$ Bruker specific parameters
$$ --------------------------
##$DU= <F:/spectra>
##$EXPNO= 1
##$NAME= <H-F>
##$PROCNO= 1
##$TYPE= <nmr>
##$USER= <she>
##$AMP= (0..31)
100 100 100 100 100 100 100 100 100 100 100 100 100 100 100 100 100 100 
100 100 100 100 100 100 100 100 100 100 100 100 100 100 
##$AQSEQ= 0
##$AQ_mod= 1
##$AUNM= <au_zg>
##$AUTOPOS= <>
##$BF1= 200.13
##$BF2= 200.13
##$BF3= 200.13
##$BF4= 200.13
##$BF5= 200.13
##$BF6= 200.13
##$BF7= 200.13
##$BF8= 200.13
##$BYTORDA= 1
##$CFDGTYP= 0
##$CFRGTYP= 5
##$CHEMSTR= <none>
##$CNST= (0..31)
1 1 145 1 1 1 1 1 1 1 1 1 1 1 1 1 1 1 1 1 1 1 1 1 1 1 1 1 1 1 1 1 
##$CPDPRG= <>
##$CPDPRG1= <>
##$CPDPRG2= <>
##$CPDPRG3= <>
##$CPDPRG4= <mlev>
##$CPDPRG5= <mlev>
##$CPDPRG6= <mlev>
##$CPDPRG7= <mlev>
##$CPDPRG8= <mlev>
##$CPDPRGB= <>
##$CPDPRGT= <>
##$D= (0..31)
0 1.2 0 0 0 0 0 0 0 0.06 0 0.03 0 0 0 0 0.0002 0 0 0 0 0 0 0 0 0 0 0 0 
0 0 0 
##$DATE= 1695896253
##$DBL= (0..7)
120 120 120 120 120 120 120 120 
##$DBP= (0..7)
150 150 150 150 150 150 150 150 
##$DBP07= 0
##$DBPNAM0= <>
##$DBPNAM1= <>
##$DBPNAM2= <>
##$DBPNAM3= <>
##$DBPNAM4= <>
##$DBPNAM5= <>
##$DBPNAM6= <>
##$DBPNAM7= <>
##$DBPOAL= (0..7)
0.5 0.5 0.5 0.5 0.5 0.5 0.5 0.5 
##$DBPOFFS= (0..7)
0 0 0 0 0 0 0 0 
##$DE= 6
##$DECBNUC= <off>
##$DECIM= 32
##$DECNUC= <off>
##$DECSTAT= 4
##$DIGMOD= 1
##$DIGTYP= 9
##$DL= (0..7)
0 120 120 120 120 120 120 120 
##$DP= (0..7)
150 150 150 150 150 150 150 150 
##$DP07= 0
##$DPNAME0= <>
##$DPNAME1= <>
##$DPNAME2= <>
##$DPNAME3= <>
##$DPNAME4= <>
##$DPNAME5= <>
##$DPNAME6= <>
##$DPNAME7= <>
##$DPOAL= (0..7)
0.5 0.5 0.5 0.5 0.5 0.5 0.5 0.5 
##$DPOFFS= (0..7)
0 0 0 0 0 0 0 0 
##$DQDMODE= 0
##$DR= 18
##$DS= 0
$$ [...]
##$SUBNAM2= <"">
##$SUBNAM3= <"">
##$SUBNAM4= <"">
##$SUBNAM5= <"">
##$SUBNAM6= <"">
##$SUBNAM7= <"">
##$SUBNAM8= <"">
##$SUBNAM9= <"">
##$SW= 18.05172834244
##$SWIBOX= (0..15)
0 0 2 0 0 0 0 0 0 0 0 0 0 0 0 0 
##$SW_h= 3612.71676300578
##$TD= 16384
##$TD0= 1
##$TE= 0
##$TE2= 300
##$TE3= 300
##$TEG= 300
##$TL= (0..7)
0 120 120 120 120 120 120 120 
##$TP= (0..7)
150 150 150 150 150 150 150 150 
##$TP07= 0
##$TPNAME0= <>
##$TPNAME1= <>
##$TPNAME2= <>
##$TPNAME3= <>
##$TPNAME4= <>
##$TPNAME5= <>
##$TPNAME6= <>
##$TPNAME7= <>
##$TPOAL= (0..7)
0.5 0.5 0.5 0.5 0.5 0.5 0.5 0.5 
##$TPOFFS= (0..7)
0 0 0 0 0 0 0 0 
##$TUNHIN= 0
##$TUNHOUT= 0
##$TUNXOUT= 0
##$USERA1= <user>
##$USERA2= <user>
##$USERA3= <user>
##$USERA4= <user>
##$USERA5= <user>
##$V9= 5
##$VALIST= <valist>
##$VCLIST= <CCCCCCCCCCCCCCC>
##$VD= 0
##$VDLIST= <DDDDDDDDDDDDDDD>
##$VPLIST= <PPPPPPPPPPPPPPP>
##$VTLIST= <TTTTTTTTTTTTTTT>
##$WBST= 1024
##$WBSW= 4
##$XGAIN= (0..3)
0 0 0 0 
##$XL= 0
##$YL= 0
##$YMAX_a= 47559
##$YMIN_a= -39170
##$ZGOPTNS= <>
##$ZL1= 120
##$ZL2= 120
##$ZL3= 120
##$ZL4= 120
##$ABSF1= 10
##$ABSF2= 0
##$ABSG= 5
##$ABSL= 3
##$ALPHA= 0
##$AQORDER= 0
##$ASSFAC= 0
##$ASSFACI= 0
##$ASSFACX= 0
##$ASSWID= 0
##$AUNMP= <proc_1d>
##$AZFE= 0.1
##$AZFW= 0.1
##$BCFW= 1
##$BC_mod= 2
##$BYTORDP= 1
##$COROFFS= 0
##$CY= 11.3945322036743
##$DATMOD= 1
##$DC= 2
##$DFILT= <>
##$DTYPP= 0
##$F1P= 15.7292609196834
##$F2P= 12.9074282941183
##$FCOR= 0.5
##$FTSIZE= 0
##$FT_mod= 4
##$GAMMA= 1
##$GB= 0.15
##$INTBC= 1
##$INTSCL= 1
##$ISEN= 128
##$LB= 0.24
##$LEV0= 0
##$LPBIN= 0
##$MAXI= 10000
##$MC2= 0
##$MEAN= 0
##$ME_mod= 0
##$MI= 1.114404
##$NCOEF= 0
##$NC_proc= 0
##$NLEV= 6
##$NOISF1= 3.799351
##$NOISF2= 2.8
##$NSP= 1
##$NTH_PI= 0
##$NZP= 0
##$OFFSET= 15.70392
##$PC= 1
##$PHC0= -21706.72
##$PHC1= 9.452709
##$PH_mod= 1
##$PKNL= yes
##$PPARMOD= 0
##$PSCAL= 0
##$PSIGN= 0
##$REVERSE= no
##$SF= 200.130013532006
##$SI= 16384
##$SIGF1= 3
##$SIGF2= 2
##$SINO= 400
##$SIOLD= 16384
##$SREGLST= <1H.CDCl3>
##$SSB= 0
##$STSI= 0
##$STSR= 0
##$SW_p= 3612.71676300578
##$SYMM= 0
##$S_DEV= 0
##$TDeff= 0
##$TDoff= 0
##$TI= <>
##$TILT= no
##$TM1= 0
##$TM2= 0
##$TOPLEV= 0
##$USERP1= <user>
##$USERP2= <user>
##$USERP3= <user>
##$USERP4= <user>
##$USERP5= <user>
##$WDW= 1
##$XDIM= 8192
##$YMAX_p= 0
##$YMIN_p= 0
$$ End of Bruker specific parameters
$$ ---------------------------------
##NTUPLES= NMR FID
##VAR_NAME=  TIME,          FID/REAL,        FID/IMAG
##SYMBOL=    X,             R,               I
##VAR_TYPE=  INDEPENDENT,   DEPENDENT,       DEPENDENT
##VAR_FORM=  AFFN,          ASDF,            ASDF
##VAR_DIM=   8192,          8192,            8192
##UNITS=     SECONDS,       ARBITRARY UNITS, ARBITRARY UNITS
##FACTOR=    0.0002768,     1,               1
##FIRST=     0,             0,               0
##LAST=      2.2672688,     0,               0
##MIN=       0,             -39170,          0
##MAX=       2.2672688,     47559,           0
$$ Real data points
##PAGE= N=1
##DATA TABLE= (X++(R..R)), XYDATA
0@%%%%%%%%%%%%%%%%%%%%JrJ6j6J6j6J6j6J8k6L2l2L3l9M6m9N5o3O9p7Q4r2J04
43E5j13J22j35J50j65J80j98K17k38K63k92L23l58L99m48N08n78O64p73R17j111
64f11J381j787K449l666O536k2217k0627N0261l5481L1758k0036K4065K1812m5254
78a1417K7220k6492M174k947j1240K7199j1469K1887o464q926J2677j7418j408
91d624q020N183R876j2634J1886P053m312K599o925O339o453p811O014r860Q968
106b721j810L215J0527n577J2970j2973j943o19j4003O124r390J3417N930K65
120C412J1200n887K564j2854n363j727m880O193J37J2682K835R97J370p484l99
135B796q429l121J505J472M538J845L466L857k352l566k22l561j320l004J406
$$ plain form
0 0 0 0 0 0 0 0 0 0 0 0 0 0 0 0 0 0 0 0 0 0 1 -8 8 -8 8 -8 8 -8 10 -16 16 -16 17 -22 24 -25 30 -33 36 -41 43 -49 55
43 55 -58 64 -71 79 -86 94 -104 113 -125 138 -154 169 -189 210 -238 270 -308 356 -417 500 -611
64 -611 770 -1017 1432 -2234 4302 -17915 -38542 11719 -23762 7996 -12040 12025 33837 -11417
78 -11417 15803 -10689 -6515 -9462 -20702 6497 -4972 16915 10451 1525 14202 -3216 -4624
91 -4624 -12644 -7461 2415 -10219 1667 8720 4408 7007 82 6421 -32 -7843 -1829 -11689 -2721
106 -2721 -4531 -1316 9211 3634 16604 3631 1688 1069 -12934 -6810 -16200 -2783 3147 3412
120 3412 14612 8725 11289 -1565 -6928 -8655 -13535 -7342 -7205 5477 8312 9309 10679 3195 2796
135 2796 -5633 -8754 -7249 -5777 -1239 606 4072 7929 5577 2011 1789 -1772 -3092 -6096 -4690
150d690L410j938N552J32K313K79m084K657o988R51j982j359N308j479O183o41
166C624R38K24o157J052m516N57Q63J115N122j379L353k085k300K7l994J810q80
183b626J648L145r21J820j684j699N1k885K231j15R09K327j864K521k772r22R8
200g38k454L251k169K585J111q84K947m058K036k187j426J655k887L783j685J741
216F21J991k398L210l702L31q04k403K324k586K984R16M72L092k667J572k599
232C54j915M62l063L081r28J984K560p46K379l266n5q61l049J578k034K411J363
249B55j63L452k023J470j748k190O04k455J707p85R51K537j612K661j332J5n45
266G99k382J319k296R62R66o26K824j231J510l08r98Q95k968Q34n44l09J314o91
$$ plain form
150 -4690 -1280 -3218 2334 2466 4779 5058 974 3631 -3357 -2406 -4388 -5747 -439 -1918 4265 3624
166 3624 4562 4786 -1371 -319 -4835 -4278 -3415 -2300 2822 1443 4796 2711 411 438 -3556 -1746 -2626
183 -2626 -978 2167 1246 3066 1382 -317 -266 -3151 -920 -1035 -126 2201 337 2858 86 -836 -738
200 -738 -3192 59 -2110 475 1586 702 3649 -409 1627 -560 -1986 -331 -3218 565 -1120 621
216 621 2612 214 3424 -278 53 -751 -3154 -830 -3416 -432 484 956 4048 1381 2953 354
232 354 -1561 -1099 -4162 -1081 -2009 -25 2535 1789 4168 902 847 -14 -3063 -1485 -3519 -1108 255
249 255 92 3544 1521 2991 1243 -947 -343 -2798 -1091 -1876 -925 1612 0 2661 1329 1344 799
266 799 -1583 -264 -2560 -1598 -632 -1258 1566 335 1845 1537 539 1434 -1534 -700 -1244 -1553 -239 -930
284i30K225n27J99Q35k108J027j618J35k06m78J579r75R84R67q98J205j270M47
302E93n13j272J113j074P47n1J8J216m07Q47o19m07M50j705L15k86m5R33m66J629
322A016j63j01O11j575O44j369k4K07m91J510m04Q78Q16p58J07j330K54n82o59
341a413O47k15J412q8N67M17p08K28j202m35J21p10P69J91J012L33l61O87q99
360C53r7n10r64Q46p98J084M9J74R97q98L05o97k6J19p38O71j14J46M08l71R01
381H40p88K13J5o31O84p80O8P5j65N95k31P03m21j79K81m25K87l42J26K03l08
402a80M37l52N7J87l76M97k29L51Q3o46J11n25N1j40k0P30J18N63J12l21K19j025
424b98m06m22J51L32J76J026M85k31L4p87L8r89m3J62J64O77K18N86q6l04K98
$$ plain form
284 -930 1295 768 967 1802 -306 721 -897 -762 -968 -1446 133 -842 142 1109 211 1416 146 593
302 593 80 -1192 -79 -1153 -406 -457 -439 777 370 1217 598 191 641 -1064 -749 -1035 -1080 -147 -613 1016
322 1016 853 752 1363 -212 432 -937 -961 -754 -1245 265 -139 739 1555 797 904 -426 -172 -754 -1413
341 -1413 -766 -981 431 343 910 1327 619 847 -355 -790 -669 -1379 -610 -419 593 926 565 1252 353
360 353 256 -254 -1218 -372 -1170 -86 -37 137 1134 236 541 -156 -182 -63 -801 -130 -244 -98 310 -61 840
381 840 52 265 280 -351 333 -447 -379 -304 -469 126 -105 598 177 -2 279 -146 141 -201 -75 128 -180
402 -180 257 -95 -38 149 -227 270 41 392 475 -171 -60 -585 -534 -674 -694 36 154 717 829 508 727 -298
424 -298 -704 -1126 -975 -643 -467 559 1044 813 847 60 98 -891 -934 -772 -608 69 287 873 787 483 781
445G81r02r1n68k29M78k69R22K13J62N34l22k3n70p95J29q18M41L37R31O60o7
466I34M83q12k25p80r51K78l30J291M25M25R52j008O6q94m10Qn10Q08J78J62O94
487G84n15M38o30j79m1m58N31k10K26J17j6J16j16N37l23k95K47n31J65m32L28
508b57L57KL33l0O0l01m65N1n50N27J59JO15pj82k32n06O6j97L33K20J47L69k36
532B77J0p55K57l15l9O46K8L16J78m04No32M7j66o0O77J92o5M08M9m73m4k18k04
556b85k28J84m2L19L09o1J45K9nk44j14k25j81n4n0L75K05N54NN4k20k96o40j68
580f34j13K73J60L19Q13k69j19l34l05q9k27k9J70N66M86q8R0l26p2n33k68J59
602c70J74j25L28P5L45p0j71K94m27k52m61M73rm2K84j08N11k05n2R8l82k4k12
$$ plain form
445 781 -121 -212 -780 -1009 -531 -800 122 335 497 1031 709 686 116 -679 -550 -1368 -927 -590 341 1001 934
466 934 1417 605 380 -400 -1351 -1073 -1403 -112 313 738 1690 682 748 -146 -556 -548 -1058 -250 -72 90 784
487 784 269 707 77 -102 -143 -601 -70 -280 -54 63 47 163 47 584 261 -34 213 -318 -153 -585 -257
508 -257 100 102 435 405 465 164 -301 -250 -800 -273 -114 -113 502 495 313 81 -425 -359 -556 -223 -3 144 513 277
532 277 287 -468 -211 -526 -565 81 109 425 603 199 204 -428 -381 -547 -607 70 262 197 605 654 181 137 -81 -285
556 -285 -513 -329 -371 -52 257 196 341 370 365 121 7 -218 -399 -453 -503 -128 77 631 636 690 470 174 -466 -634
580 -634 -747 -474 -314 5 818 549 430 96 -209 -298 -525 -554 -384 182 668 580 670 344 272 -261 -529 -370
602 -370 -196 -321 7 82 427 357 186 480 53 -199 -660 -187 -196 -238 46 -62 449 244 192 290 -92 -116 -328
625c28M4m6K60R8M30j45M8m17J7m89K11KO8J45J52K76j41J39km16K09j21o9K56
649A81k14K58j18J58n5n18M42k95J98k17J17L74n35L08p6n6P1m68O25j1o5j99
671i5R9j8m3m2M8j58J42k36K94J35L8q5j28L63n54J96k5R3k54L0J72K13K26k07
695B04k12J53l55J3N8o6K30J2K90m10M68l28rl42K17J6J8k5K50j8p8J70l14K67
719B09l94l5m7K18p5j05K81K93l41K44j84J87j84k79K24R5l8j52K9J59K5r3J2
742D9L0n3l06j45K96J8L00k8j68j5K15k63J39j26J15Kq9o4Q4p2L6M19l11j29M7
767a9K22l15J27k26K31q0K25j90l7K17k7l07m6r7M1J09J66J67r4l0k24L20J1p3
791G1n8k24L49j54j91K0L35j71K6L8J3j64j35K63m3k51L60J2q9K70q4q8j15J92
$$ plain form
625 -328 -284 -330 -70 28 458 313 361 -56 -39 -528 -317 -315 -247 -102 50 326 185 324 322 -94 115 -6 -75 181
649 181 -33 225 107 265 210 -308 134 -161 37 -180 -63 311 -224 84 8 -48 23 -445 180 169 104 -95
671 -95 4 -14 -57 -99 -51 -209 -67 -303 -9 126 164 79 -49 314 -240 -44 -69 24 -230 -200 -28 185 411 204
695 204 -8 145 -210 -197 -139 -205 25 37 327 -83 385 57 48 -294 -77 -61 -43 -68 182 164 86 256 -58 209
719 209 -185 -220 -267 -49 -124 -229 52 345 4 248 64 251 67 -212 12 107 69 -83 -54 105 130 37 49
742 49 79 26 -280 -425 -129 -111 189 161 -7 -22 193 -70 69 -57 58 60 -29 -93 -9 -81 -45 374 63 -66 -19
767 -19 203 -112 15 -211 20 -60 165 -25 -62 155 128 -179 -225 -322 -281 -172 -6 161 67 37 -187 133 144 71
791 71 13 -211 138 -16 -207 -187 148 -23 3 41 54 -110 -245 18 -25 -276 84 96 7 277 193 105 -10 182
815A82m11k79M79M4J0j34pK63j44L48l04j27j01K81P6k69K2J98L5j29M3j70Rj02
839a87J14N7j68J98K72q0k35P0M6J07R9l03%j64M9L27j34k37L2J58M1j8K5K17
863B86k56q0J21L3kj34M7j55K64l49L22J5k7q5oK8j50P3K46m6Q6l33N18k49j21
888D6l14K60P1j79KK56j52j42L75k48j09j11L6R9N8N4J07k8j91Q5N1l8J32l40
912b20J04Q8l46N65l56P0n7L88j19j44j87K95j6o7n3J53L07k24Mj95l7R4j07L6
936b4j87l8O0K84j31J69j4j18o5j78L1P5K47j65J09qJ8lj09M7O8j04L1J41k58
961a22N16l27P8P1J41r2m10K47q2r6J0j02K6M33k96j17J09j31O1m5J40j46K94
984A60l0r0K04n07P9J59j51J71j69L83m9k49J05M5k2j36j13J93J99k48M3L19r2
$$ plain form
815 182 -229 -508 -29 15 25 -109 -116 147 3 351 47 -80 -181 100 176 -93 -71 127 162 33 76 -94 -85 -187
839 -187 -73 -16 -184 14 286 206 -29 41 87 194 293 -10 -10 -174 -125 202 68 -169 -137 21 62 44 69 286
863 286 30 -50 71 104 102 -32 15 -140 124 -225 97 112 85 0 -6 22 -128 -55 191 145 231 -102 416 167 46
888 46 -268 -8 63 -116 -114 142 -10 -152 223 -25 -134 -245 -209 -110 -52 2 109 81 -110 -25 26 -12 120 -220
912 -220 -116 -28 -374 191 -165 -95 -152 236 117 -27 -214 81 65 -2 -55 98 405 181 185 -10 -47 47 -60 -24
936 -24 -211 -249 -189 95 -36 133 119 1 -64 -242 -211 -136 111 -54 55 47 65 62 -47 0 68 -36 -5 136 -122
961 -122 394 67 145 216 357 265 -145 102 20 -76 -66 -168 -142 291 -5 -122 -13 -144 -83 -128 12 -134 160
984 160 130 40 244 -263 -184 -25 -176 -5 -174 209 160 -89 16 61 39 -97 -210 -17 182 -66 -23 296 204
1007B04j07j65Q5l32R3M23J0L2j9l21O3K53j95k60L37k37PP5J79r4k21J82J24
1030A16r6k1n8J19j49J86K2J40k05M5J75l29K01l01LJ1R9K59J04l18L5K9n1m08
1054c92M62P3l04L22k10R5J00r9K6j50j01L32p4j08k4J38J39j6j65o8K14j84o3
1077e7j69J77k20N4L28j78J24l3j20J22Nj72q7K71M1p2M2j0K28n4k05k13J10o0
1101a48K13l77K58l7j38J84J67m7l5J8J31j88Lj17J29qM3n5L1k30L80j31R8o6
1125G8p9Q3k67K64M3P9l34k7J90%Q5l20J63P3P1j91l3J89k95K92j53J69m8n5P6
1150E3M0o2l15L33l6J69Q6l19K11r8r3J87k7J67l88j62K0J83Q3r1J66J45%j67
1174H5K8j78r3L14q2j39Rn5L59m01j9J5O5L17j42k43L20l97K45j11J48k4j9J65
$$ plain form
1007 204 97 -68 17 -315 -222 201 211 243 224 -97 -34 219 24 -236 101 -136 -129 -54 125 31 -190 -8 116
1030 116 20 -1 -59 60 -89 97 119 259 54 99 274 -55 146 -155 -152 -141 -42 217 321 3 38 67 16 -392
1054 -392 70 143 -161 161 -49 46 146 47 73 -77 -178 154 80 -28 -52 86 225 209 44 -24 190 6 -57
1077 -57 -226 -49 -269 -215 113 -65 59 26 -94 28 33 -139 -226 45 86 14 56 46 274 220 15 -198 -88 -148
1101 -148 65 -312 -54 -91 -229 -45 122 75 40 58 189 1 4 -113 16 8 51 -4 27 -203 177 46 144 78
1125 78 -1 82 -185 79 122 201 -133 -160 30 30 115 -205 -42 31 102 -89 -122 67 -228 64 -89 80 32 -23 53
1150 53 93 31 -284 49 13 182 268 -51 160 62 -31 156 129 296 -92 -254 -234 -51 32 -59 107 252 252 85
1174 85 113 -65 -158 156 74 -65 -56 -111 248 -153 -172 -157 -92 225 83 -160 160 -237 8 -103 45 21 2 167
1198A67j00k20O4J9Q2Pj8L6n9J31j85j21K87o0k23J88l69L67J37k70N10l42j76
1221a48J17J62l26J44l43M45n3j14j26M24J73k39j82J47K9k6p0l18M10j51M9M33
1243D37l55j85K2J29J0M6l14J86j63J52K93jl81J00J79j04j19k55N38j86K26l71
1265a16Q1P9Oj42Q3j68M8K6kJ05q7M2J53l8j67%m5L70p8r2k50J68j05J20JL4j00
1292g4K74l94R6Q6J07k2J23r6l5k43K9j49M83k79L44j22j05l57L63K96l42J02
1314H5J8k35r9j0Q9J60j17J71l25M67m8j1o6k19K6K38k46K77k73J27l36L88j69
1337a08M2K01j37O7k18J69m9n1J42k05j14L13l0J02j4j61oJ05k54L17l06J51j00
1360a44M04n35L34l1j09N3o9K87r2k78K92mk61J52J16k36j8J47j14J02N4R7l25
$$ plain form
1198 167 67 -153 -89 -70 12 19 1 37 -22 109 -76 -197 90 30 -193 -5 -374 -7 130 -140 370 28 -148
1221 -148 -31 131 -195 -51 -394 51 -2 -116 -242 182 355 116 -66 81 110 84 14 -304 106 -45 4 437
1243 437 82 -103 -81 48 58 104 -210 -24 -187 -35 258 257 -124 -24 155 51 -68 -323 215 29 255 -116
1265 -116 -35 44 50 -92 -9 -177 -129 -103 -105 0 -87 -45 108 70 -97 -97 -142 228 150 58 -192 -24 -129 -9 -8 26 -74
1292 -74 200 -194 -98 -12 95 73 196 100 65 -178 -149 -298 185 -94 250 128 23 -334 29 325 -17 85
1314 85 103 -132 -231 -241 -152 8 -109 62 -263 204 156 145 79 -140 -114 124 -122 155 -118 9 -327 61 -108
1337 -108 -66 135 -2 65 -153 16 -33 -84 58 -147 -261 52 22 124 110 -51 -57 48 -206 111 -195 -44 -144
1360 -144 260 -275 59 28 -81 -28 -97 190 98 -180 112 108 -153 -1 115 -121 -139 8 -106 -4 50 147 -178
1383a78N4M84l49m2j88L57j86K18j21j34p5L81l45l6J73o2P6j55K41k67K09j73
1405a18r6K05j35j19L17P0j35P9k22j8o0K47q7J77j73J47q6j1p6K8M5L46n49K97
1429G3k48J38j9k4J64j26m0K75p7j00k47J98k32L03j18r3K11L2m4J55L3k54J4
1452b6o6K10j11J55l79L49l10L02j28p7M6j75M7J51J92m2r0N8r5j51K86k2j29
1475eL4M2j9k4m9j0K54j68Q0P4k38p1K45o5n9J22m5m5J32k54K7M3J36q6O3j02
1501A2J4n2q2o7J35Q0r4J35K21l00l15N51j08Ooj66J34k38K04j44K3q5K01j43
1525h4k00N80n44J5L71l67K10Rqk4Ll9j62J5M08P2k73k0J47n0j65K80j38k72M21
1550A85k24K87j18P6p1j09rj8j00j13K71j61K11j01K22n58M25k67J20J83j29J28
$$ plain form
1383 -178 -124 360 11 -31 -219 138 -48 170 49 -85 -160 221 -124 -160 13 -49 27 -128 113 -154 55 -118
1405 -118 -214 -9 -144 -263 54 124 -11 68 -154 -172 -232 15 -72 105 -68 79 -7 -18 -94 -66 -21 325 -224 73
1429 73 -175 -37 -56 -80 84 -42 -82 193 116 16 -231 -33 -265 38 -80 -173 38 70 26 181 214 -40 -26
1452 -26 -92 118 7 162 -217 132 -178 124 -4 -81 -35 -210 -163 -12 180 138 48 106 11 -140 146 124 -5
1475 -5 29 71 52 28 -21 -31 223 55 135 209 -29 -100 145 80 21 143 98 53 185 -69 -42 1 137 51 114 12
1501 12 26 -26 -108 -175 -40 40 -54 81 302 2 -313 238 130 136 130 -36 98 -140 64 -80 -57 -142 59 -84
1525 -84 -284 296 -248 -233 138 -229 -19 -10 -18 -42 -39 -78 -240 -225 183 255 -18 -38 109 59 -106 174 36 -236 185
1550 185 -39 248 130 206 135 26 17 -1 -101 -214 57 -104 107 6 228 -330 95 -172 -52 131 2 130
1572A30k06J16j77J48J68j58M2Qj71J84j35J37k41M0K1J88j73o2L5O0J75k6k1
1595H2k33J59N1j3k12J10K02k31n2K01K2J37m46K20l0k40K42L11oj91o6j90q9
1618b62K87L78n55L21m06M00M8j72o0k2l9J16j97L32k8o6R5k53J20q0j09o8P1
1641a49Q1J25K5j22K56k22L0q4n1J52j6R6k73Q1p6L04J12k19J55j45l29K08j27
1664a88K45L09l42m2n6M9k9j11J26j6m7Q4j14j27L24j69J77Q6j21KJ12k75J94
1687G1j01O2o6r8J05q9K88j83J25k8K27m39m8L31M2j06k9J31k61Q0K18j53j68
1710h9K33j44P9o6j77N6PJ11J06k42L51j07o4K5j96M9J66L8O7j87M0m7Q0J27l12
1735i6Q6j12p1M50l28N1Q3L3l3k90Q0L17j85k45J45K04j37J6j82J18J81k96R2
$$ plain form
1572 130 -76 40 -137 11 179 21 63 71 -100 84 -51 86 -155 -115 -94 94 -79 -141 -106 -46 129 103 82
1595 82 -151 8 59 46 -166 -56 146 -85 -137 64 86 223 -223 -3 -33 -273 -31 280 274 83 17 -173 -262
1618 -262 25 403 -152 169 -237 163 211 39 -21 -43 -82 34 -163 169 141 75 170 -83 37 -43 -152 -220 -149
1641 -149 -68 57 82 -40 216 -6 24 -60 -111 41 25 121 -152 -71 -147 157 269 50 205 60 -269 -61 -188
1664 -188 57 366 24 -18 -74 -25 -54 -165 -39 -55 -102 -18 -132 -259 65 -104 73 159 38 40 152 -123 71
1687 71 -30 32 -34 -132 -27 -116 172 -11 114 86 313 -126 -174 157 199 93 64 195 -66 14 232 79 -89
1710 -89 144 0 79 13 -164 -108 -101 10 116 -126 225 118 54 79 -117 -68 98 136 203 16 56 9 89 216 -96
1735 -96 -10 -122 -193 257 -71 -20 63 96 63 -227 -147 170 -15 -260 -115 89 -48 -32 -214 -96 85 -211 -119
1758a19L18n14M21J2m6l4j08J42l81L95J36j11m4L9l12J50j48R2K4K22j23j3r6
1781i8j80L7M36j58j55M4J10k93K95pL05n60L59J25j52J81n10J31m1P5L5O2l94
1804c53P8L59n2j23K36k9j88J86J00j20Q6l17L51j66j38J07J25r6j74L16l99M13
1826B02J5l43O5J11oO3J00j50k3k14J42J45j5J14j30L3j3j76rK17qO6j43j64P0
1851e1L3K59l28K18o1O9j58j99J44K91k78Q0M7j27J3Q1q4K48J49l29J2j44J18
1874Cj38K18o1j38K1r0J77R1j05J35j8j49K21k32L56l39O1k13J39M9K3o0P4K3
1898D8kj00J67k41J33n8L3j09k8K46k67K23j31K29J03q4p5Pq6K95k22P1k33R5
1922A4j09O8K24j71J69j26J19k16K68k66j22J56l02L55J33m24J27L2K8J09k22
$$ plain form
1758 -119 199 -315 106 118 72 38 -70 72 -309 86 222 111 67 106 -206 -56 -204 -112 -88 134 11 -2 -98
1781 -98 -278 -241 195 37 -118 -74 36 -257 38 31 336 -224 135 260 108 289 -221 -90 -131 -56 -21 41 -353
1804 -353 -275 84 32 -91 145 116 -72 114 214 94 180 -137 214 48 -90 17 142 46 -128 188 -211 202
1826 202 217 -126 -61 50 44 107 207 57 34 -180 -38 107 92 206 76 109 96 -80 -89 128 120 186 43 -121 -51
1851 -51 -18 241 -87 131 70 139 -19 -218 -74 217 -61 19 66 -61 -48 33 -51 197 346 17 29 -115 3
1874 3 -135 83 22 -116 -95 -185 -8 83 -22 113 95 -54 167 -65 291 -48 13 -200 -61 -12 11 -49 25 48
1898 48 46 -54 113 -128 5 -53 -20 -129 -157 89 -178 45 -86 143 246 162 87 94 8 303 81 152 -81 14
1922 14 -95 -27 197 26 195 69 188 -28 240 -26 -148 8 -294 61 194 -230 -103 -71 -43 66 -156
1943a56K26l8J26j76j03J02l9NK60p4J55l94j14Q0L08j20l76K65k0L35k76J87
1965A63k10K48k59J3J26O7k25J50M3mq2j66K28j02J17j47m0O8%k77M48r6J39m75
1989b73K39j0L6J66r7n9P5mm57L31J95j48K84j94j60P5r0k24J86J8J39RK3K1k27
2014a46K37j62j19K7L17j80L0K4l74K63K18k98M01j36q2L6j72P0K32k36J36k03
2036a17J47pN5j52L30o7m20K68j0Q4j04N6l33L50J00j15j99J76J02q8k84k8L72
2059A16K52l35R5k29J95l11J67r0K59j97j52J47m6K76q6j42M1K04l04K07k0m7
2081@JJ76k10L1R3j57K66j58k9R1J9k14L3L68k61j20K23o6l8m2j37L6m0J69N2
2106H6n5J43k16O1O7P4L8j91j84J30J3jp1K43oj96M1L9R9M5j04n0J3mO0j36K06
$$ plain form
1943 -156 70 32 158 -18 -121 -19 -58 -53 207 133 288 -106 -220 -140 168 48 -328 -63 -83 252 -24 163
1965 163 -47 201 -58 -45 81 148 -77 73 116 112 30 -136 92 -10 107 -40 -80 -12 -12 -289 159 63 202 -273
1989 -273 -34 -44 -8 158 61 2 77 73 -384 -53 142 -6 278 84 -76 -1 -91 -315 -129 -111 28 37 60 81 -146
2014 -146 91 -71 -190 -163 154 -26 4 28 -346 -83 135 -163 238 102 20 56 -116 -46 186 -50 86 -117
2036 -117 30 23 78 -74 256 189 -231 37 27 111 7 63 -270 80 180 65 -134 42 144 56 -228 -256 116
2059 116 368 33 128 -101 94 -217 -50 -140 119 -78 -230 -83 -129 147 61 -81 -40 164 -140 67 47 0
2081 0 1 177 -33 -2 91 -66 200 42 13 104 123 -91 -58 310 49 -71 152 86 48 6 -131 -95 -135 34 86
2106 86 31 174 -42 19 86 160 198 7 -177 -47 -34 -35 -106 137 131 -65 -24 15 114 159 55 5 18 14 74 -62 144
2133A44k80J7J95k41K92k55K98K31k55k23r0J05M1O2R6k36J28m0r9J03K19m36
2155b24K07K04or6j31j28J66J72j66K10l42p5L72j36Q9j5k82J48L17k77j93L97
2177B11j55j58N6j08K69k63J03O2k22K57J76l77lJ00om4J60R6m25RK42l8m5O7
2201c6J63l16K46j98K53L12m25l9k0j08Q0K80l23J93p1J51l0j04K15k62J83J0
2223A54m51L22L5o0j66M06l29K65j28j21n4J04L15l1n50J88J99k12J95J53j54
2244H0J0j00j05O0Q2K05q5j61qN2J3jl4L84l43o1Jp6K14j53j04J14O8P5j69o5
2270a07J44L47n65K70J5k09J70r6K89m08ll3J15K91l33K7J04J31l34QJ89N0K08
2293B70O4k83Q8k52N0M6R9N5q4J3k13L77m88J2Q2K90j22J10k83N3l7J90j61K18
$$ plain form
2133 144 -136 -119 76 -165 127 -128 170 401 146 -77 -167 -62 -21 41 137 -99 29 -11 -110 -7 212 -224
2155 -224 -17 187 181 85 -46 -174 -8 164 -2 208 -134 -209 163 27 116 101 -181 -33 284 7 -186 211
2177 211 56 -102 -46 -154 115 -148 -45 17 -205 52 228 -149 -152 -52 -58 -102 58 154 -271 -262 -20 -58 -103 -36
2201 -36 127 -189 57 -141 112 424 -1 -40 -60 -168 -88 192 -131 62 -9 142 112 8 223 -39 144 154
2223 154 -297 25 60 0 -166 240 -89 176 48 -73 -127 -23 292 261 -289 -101 98 -114 81 234 80
2244 80 90 -10 -115 -55 27 232 147 -14 -22 30 43 42 8 392 49 -12 -11 -87 127 -26 -130 -16 52 127 -42 -107
2270 -107 37 384 -181 89 104 -105 65 -31 258 -150 -153 -186 -71 220 -113 -86 18 149 -185 -177 12 62 270
2293 270 334 51 139 -113 -63 -17 82 137 53 66 -147 230 -258 -246 -164 126 4 114 -169 -116 -153 37 -124 94
2317I4J5J8j15M5L59m93K05k02J89k89K63j16K11l16K0k2O9J79J40m03P6r4K13
2340D6N8l88L15Rj10o3N5K72k53j14J51J02J1k24L74k04j69m9K58l4k4n4J9j1
2364b7p7K09j27l0M1M1j24n8R0PL7q0J84m8l8R4j82j51K70M7k84l5L98l13L18
2389A62k9J61j00nk87O2k9q3K27j35Q1J19j20j06J13j15Q8J92k27j34J75l7L0
2412CQ0Lj41m1K2K45Qk77l7K67M7l54R7J37j26J20p5j41N0N5K12p2k04J22%m5
2438d5J48N1k70K00p1KJ23j04k67K96L4Q1l57L8O8J57L0r3Q6j69J58lj59m2K24
2463A16j05J82j41l24J38K28l5j69M1k19K48O9j27k9J91o8j86L08k1j15r7L85
2485B70j71r1k20L13k8n3R1k46L31l89q2K99k01J28J15j95J43n0K55j65j94J06
$$ plain form
2317 94 109 127 12 57 416 -77 128 -74 115 -174 89 -27 184 -132 -112 -134 -65 114 254 -149 -73 -167 46
2340 46 104 -284 31 40 -70 -133 -78 194 -59 -173 -22 80 91 -133 241 37 -132 -181 77 43 19 -35 -16 -27
2364 -27 -104 105 -22 -52 -11 30 -94 -152 -62 -55 -18 -98 86 38 0 94 -88 -239 31 78 -206 -241 157 -156 162
2389 162 133 294 194 189 -98 -36 -65 -148 79 -56 25 144 24 -82 31 -84 4 196 -31 -165 10 -27 3
2412 3 83 86 -55 -96 -74 171 179 -98 -135 132 179 -175 -78 59 -67 53 -22 -163 -113 -58 154 82 -122 0 0 -45
2438 -45 103 154 -116 84 13 15 138 34 -233 63 97 178 -179 -141 -73 84 114 21 107 -62 96 93 -66 -108 116
2463 116 11 193 52 -272 -134 94 59 -110 -69 -288 -40 29 -98 -127 64 -4 -190 118 97 -18 -115 270
2485 270 99 8 -212 101 73 20 111 -135 196 -193 -275 24 -177 -49 66 -129 14 -36 219 54 -140 -34
2507c4J67j14M0j00p3J10J16R0j96j46K78P3k41o3j58K89j99R4O9j70K06R0j58
2530c0q2J00lQJ72l2j9k91q7L91k72K39K3j35M5J9o6j38J46n6O3k54K63K3j53
2555a26J30q9J54j74n4M13j22k95K12J65N9k40O4n1k25J13J52l08J58kJ46o5j59
2578a44K50k0m0J8j2L2k74L56l11N8n6J42o7o4J91j09j62J01K24j75k8J33P1R9
2602B13l60J03j9q0K21l3L3k71J43R3K72l86J40J09j47pP8j09NJ5J30j67k3j93
2626b40K62p5J51j59L0K09l34L44k96k6M5Q6J38m2k15L22m0k87L10q7l05k3Q5
2649a47R4K06l20K18j3J58l72L57J31k20j48P0j08M9O4j1j04K85k12k3K41k33
2671c8k26N2O1K56j90J97j04o3J90j51K5r0j7L3P7L8J42l81K91k24o3J68r3J92
$$ plain form
2507 -34 133 19 59 -41 -114 -4 112 202 6 -140 138 211 -30 -93 -251 38 -161 -67 2 -168 38 128 -30
2530 -30 -112 -12 -15 -7 165 133 114 -177 -264 127 -145 94 117 -18 27 46 -20 -158 -12 -68 -5 -259 4 27 -126
2555 -126 4 -85 69 -105 -159 254 132 -163 49 214 273 33 97 46 -179 -66 86 -222 -64 -66 80 15 -144
2578 -144 106 86 46 64 52 84 -190 166 -145 -87 -143 -1 -68 -132 59 -50 -212 -111 113 -62 -90 43 114 213
2602 213 -147 -44 -63 -143 78 45 78 -193 -50 43 315 -71 69 178 31 24 102 -7 -2 13 143 -24 -47 -240
2626 -240 22 -53 98 -61 -31 178 -156 188 -108 -134 -89 -3 135 93 -122 200 160 -127 183 96 -209 -232 -147
2649 -147 -53 153 -167 51 38 196 -176 181 312 92 -56 14 -94 -45 19 8 -96 189 -23 -46 195 -38
2671 -38 -264 -212 -151 105 -85 112 8 -55 135 -16 9 -81 -98 -65 12 50 192 -189 102 -122 -185 -17 -110 82
2695H2R2n5l0Q0j90P8P1n5j66K45j54l1k47J23K09j31j70L76k5j79J30J7o8m5
2719d3J27k52K02j21j21J89J74k49Q3K82j36j16q3o9L5N2K16j02l98J68j6J17
2741f1lJM78j55j55j30l8K25l82K55k86L40l40J65m7J1J61n0j62J54p5k2K96j57
2765B3L1m9P0J95j05J19l93J31K04p6L9m11K75J2J15m45R7M05l89N5J11M8j08
2788d6K13l07J83N6j09j4k61K75MJ11%K4j62j70L9M2J58NrP7l1j0k37K91j51Q4
2814E5J06o5k27N8K88p1l04K45K64k51J7l03L31o4j69Q0J18k8k66K13rk22N8O
2838a40L05j20j66J74J5k97Q8J81J58j43j70P4R4j64K44r1j84N81n83P6K47m81
2860c02J94K03k04K64k6p8j96L17r2K41m05J1K51l54K26l95O34l4k14n3m3m4M1
$$ plain form
2695 82 174 119 89 169 -21 57 128 73 -93 152 -2 -33 -280 -157 52 -79 -249 127 102 -77 53 70 2 -43
2719 -43 84 -168 34 -87 -208 -19 155 -94 -11 271 135 19 -64 -133 -98 -46 170 68 -330 -162 -178 -61
2741 -61 -64 -63 415 260 105 -25 -63 162 -220 35 -251 89 -251 -86 -133 -122 39 -11 -173 -19 -94 -116 180 23
2765 23 54 5 75 270 165 284 -109 22 226 150 189 -222 53 65 180 -265 -168 237 -152 -97 14 62 -46
2788 -46 167 -140 43 99 -10 -24 -285 -10 -6 105 105 129 -33 -203 -164 -122 36 41 32 109 78 68 -169 122 -29 55
2814 55 161 96 -131 -73 215 144 -160 85 349 98 115 -188 143 79 -90 -10 108 80 -186 27 18 -204 -146 -140
2838 -140 165 45 -121 53 68 -229 -141 40 198 55 -115 -41 53 -111 133 42 -142 439 -144 -68 179 -302
2860 -302 -108 95 -109 155 129 51 -145 172 80 321 -84 -73 178 -176 50 -345 289 255 41 -12 -55 -99 -58
2883e8nl2J51O0r7J20k51J4J86j19J58k35L31l85O1J69k55M00l36p4J20M3m7K08
2907A27J62m36J95N3K34k82k35K06k93K06k22K98J21o0k5l1k18k20M87j89J94
2928G2Q2l61K95J09j46l05L5J48j23L30k12j8NK64k50j83Q5K8J71j80J29K9p1
2951f7J1k7O3J10j36j21L17j43k14L14q7K8J17m56L92k00K08lj22nK12l49J98
2974D0r5OK0J1J37j48J07j78K91k71R9r8J23K58k14j1j53r5K72j88J10j84Q5p9
2998a55K60r7Rq9q1j9L68j40Q8J01l43R4j04Q1J84m4k5pj10J42J2m87L32M1j62
3023a51l1N5M9J02j63J06K78r2P1k41j69K61j29Q2Ok36L52l05J09K3M5k58K05
3046c1q4L79j16j16j51K75k25j49K9K54P9m9j66o8J62J54k64j99M62l03J53k18
$$ plain form
2883 -58 -63 -95 56 116 19 139 -112 -98 88 -31 127 -108 223 -162 -101 68 -187 213 -123 -197 -77 -34 -81 127
2907 127 289 -147 48 101 335 53 -182 24 -269 -63 -285 13 134 74 49 18 -200 -420 67 -122 72
2928 72 154 -207 88 197 51 -254 -219 -71 -194 136 -76 -94 -89 175 -75 -258 -173 -145 26 -154 -25 4 -67
2951 -67 -56 -83 -20 90 -46 -167 150 7 -207 107 20 48 165 -291 101 -99 109 106 -16 -21 191 -158 40
2974 40 -55 -49 -29 -18 119 -29 78 -100 191 -80 19 -79 44 302 88 77 -76 -171 101 -87 23 -161 -76 -155
2998 -155 105 8 17 -72 -153 -172 196 56 144 245 -98 -4 -108 -27 157 113 88 81 -29 113 125 -362 -30 11 -151
3023 -151 -182 -127 -78 24 -139 -33 245 153 224 -17 -186 75 -54 28 34 -202 150 -155 -46 -23 22 -236 -31
3046 -31 -115 264 148 32 -119 156 -69 -218 -189 65 144 95 -71 -139 23 177 -87 -286 176 -127 26 -192
3068a92N5J01k67L53l80K10J05k0j51M08K1j00M5k24J29q6J36J5J80j17o7k97
3090a43J01K4j11K17j22J93k84J04Q5N4k28J08m5O2rO2p7l9J19o1P2Qk13J20O6
3115F3l53L35o5j96L04K37k10k60P7k72N28m06J51N2O8j87K84q4k40K11r1J53
3137I9n6j06L51l57j08K98k92OK20m9J85l48m0L76p9lr9K54m62K13Q2l44K28J33
3161A02j04m0L04l62j76K47P3J1k10M6K3J3J48pJ34k20j71K57j26j80K73l03K06
3184f2P1J76j9k14K59j13K4N9m76J89P2o0l2L24j32k47L14k01l6J3j27L24j76
3207g0M8k1K12l69J19N5k88K65n4J61L4j46k9M8J23o2J64m34P6J71k30k9L00k95
3231b51J75K31Nm2j8j93J48o3n3J13J39k45K39j68q2J65j06N7o1k8R5p9j5p6J06
$$ plain form
3068 -192 -137 -36 -303 50 -330 -120 -15 -35 -186 222 243 143 188 -36 93 7 143 158 338 221 154 -143
3090 -143 -42 -18 -129 88 -34 159 -125 -21 64 118 -110 -2 -47 15 6 68 -9 -48 71 10 82 90 -123 -3 63
3115 63 -290 45 -20 -216 88 325 115 -145 -68 -340 188 -218 -67 -15 53 -134 150 66 -174 37 -54 99
3137 99 43 -63 288 -69 -177 121 -171 -165 55 6 191 -157 -197 179 100 97 -2 252 -210 3 85 -259 -31 102
3161 102 -2 -42 262 -100 -276 -29 44 55 -155 -109 -86 -73 75 68 202 -18 -189 68 -58 -238 35 -268 -62
3184 -62 9 185 166 -48 211 98 122 181 -295 -106 -34 -94 -126 198 66 -181 133 -68 -104 -91 -218 106 -70
3207 -70 -22 -43 169 -200 -81 -26 -314 -49 -103 58 92 -54 -83 -35 88 26 190 -244 -168 3 -227 -256 44 -251
3231 -251 -76 155 160 118 100 -93 55 -8 -61 52 191 -54 185 17 -65 100 -6 51 -10 -38 57 -22 -37 -113 -7
3256gk06OJ15j33J84k77J14jQ1K79k52n0K01k26j4J2m0N8M58l87K10l6Ol57N27
3281B65m85J22J79k37R9L9l9j38J30J14j37L27j80q0K58j62j46j8K24k70J86k24
3303a73J67J56Qk25j40QJ59J39l62J41j44M60j77j92J38N2p0l17N09l97L57k78
3325a81J77J9N9j69J97m7Q4k67J81j6K45k94m4J82j26l1kj62K16q1J91K9p1j03
3349a4j34J89j68jJ88q5mJ18j83Rr5J60j31J01M6K07j65j86J97P2J2m6K7m04J97
3374i3r7J69M6L8J03j76m2j7M17q7j81p5Q4k9j27j90R3J10J29L3j10M0P7j75m2
3399a02L51k13j30J80j30J22q2J22j38J24q2J24k13R4Q8k99J72Q6J4k1j72J38
3421C3J85j65n7j09R8oj68J9K86j44J5J59p1k03Q3L4P7k2j58J01j13L4k48K40
$$ plain form
3256 -7 -213 -207 -92 -225 -41 -318 -204 -205 -124 155 -97 -147 54 -172 -186 -174 -214 -156 302 -85 125 89 95 -262 265
3281 265 -220 -98 81 -156 -57 -18 -57 -195 -65 49 -88 239 59 -21 237 75 -71 -89 135 -135 51 -173
3303 -173 -6 150 158 -67 -207 -199 -40 99 -263 -122 -266 194 17 -175 -37 15 -55 -372 137 -260 97 -181
3325 -181 -4 15 74 -95 102 55 139 -128 53 37 282 -12 -56 126 0 -31 -33 -195 21 -60 131 160 89 -14
3349 -14 -148 41 -127 -128 60 -25 -29 89 -94 -85 -180 -20 -151 -50 -4 203 38 -148 49 121 133 87 114 -290 -93
3374 -93 -190 -21 25 63 166 -10 -52 -69 348 261 80 5 89 60 -67 -257 -164 -54 75 108 -2 38 115 -60 -102
3399 -102 249 36 -94 86 -44 78 -4 118 -20 104 22 146 -67 27 115 -184 -12 74 88 67 -105 33
3421 33 218 53 -4 -113 -15 -21 -189 -170 116 -28 -13 146 75 -128 -45 -11 66 44 -114 -13 -126 -92 -340 -100
3445a00J99N9M0l9j10K18k97J7j08K13j84nL01j31q1p0lN1L39m04R8L1O2q1k01
3470a86J24J51n5J13j13k2J2l8J01M3l7M0k04L65m72Q7N1K04j54q0k9J86n5j89
3494a57K83l5K6j30L41l75j31K8J70L8J62j39o3J11k72Q6j45R3K1J14N8j7J28
3517A95j35k50Q1J41r5q2J54j44M8N2q7K35k36J16r8J73l63L87K0j42N1O7J29
3540B17k08J20j90J77k97N6l0j28M41j47j77K32k34M39k27k0j97K48o5R5j73N4
3562a4m8J01j22K15j12M5o5K03m02L79j19k00L9J56J06m91M08j11K44j35l3r2
3584d8J54Q8j16o2r4MK28k40M8J26K6j2j95P0P5r2j37M27k79j6K79l74J36j19
3608a23J79j01p6O5L8K33n00N07k74l2K28j46J63l15M12l6k37K79k96l5J54n19
$$ plain form
3445 -100 99 158 198 159 49 267 -30 -13 -121 92 -92 -97 204 73 -8 -78 -81 -30 309 -95 3 34 96 15 -186
3470 -186 -62 89 34 147 34 12 24 -14 87 130 93 133 -71 294 -178 -91 -40 164 10 -70 -99 87 32 -157
3494 -157 126 91 117 -13 328 -47 -178 -150 20 58 220 81 18 129 -143 -57 -202 -109 -88 26 84 67 195
3517 195 60 -190 -109 32 -63 -145 9 -135 -87 -35 -122 113 -123 -7 -105 68 -295 92 112 -30 21 88 217
3540 217 9 129 -61 116 -181 -125 -155 -283 158 11 -166 66 -168 271 44 24 -173 75 10 105 -68 -14
3562 -14 -62 39 -83 132 20 65 0 203 -199 180 61 -139 -100 56 162 -329 79 -32 212 77 44 -48
3584 -48 106 194 78 16 -78 -74 154 -86 -38 88 114 102 -93 -23 52 -40 -177 250 -29 -45 234 -140 -4 -123
3608 -123 56 -45 -121 -56 -18 215 -285 222 -52 -84 144 -2 161 -154 258 222 -15 264 -32 -67 87 -432
3630d32L30K16J34j51k8j5mk13J92K7n8J08k01j03K28PJ66k29Q3j36kN5K34l00
3654i2n1P2Q7Q3j39QM5K07l98J67o4j52L5K29n5kj24L06j67Q9j93R6j09N9J16
3679E3pj49l0J44p4K44j14k15Q6Q5QQ1m5p4N1j96l8J65Nl4k68N25k79K31k52k58
3705c55L23N6R2m45L76k9J36j95k2K74l80j50M95k56L3pJ06l17L02L7P3l14J95
3728B8Jk25k6J32J98l08M26n2j50rl4r4O6J83l01J31k6q0r8K00J57K16k72l1j16
3753h4J68l75K02p5K93p0j82N53m17J24j41l5J43j78n7L16j96O0r2L7j4r8J80
3776F2m2J75j68j20K06K0l54M18l61L3J03o4k30L02p2q9J84j32L94k49n5n3q4
3799a76kJ33L53l74O7n2J11l22M08j8k53J12j6P1m8O5j14j03L41j05L7J4k63L6
$$ plain form
3630 -432 -102 114 248 97 69 54 50 -163 29 56 -2 106 -95 -198 30 37 203 -26 57 -79 -81 -26 208 -92
3654 -92 -143 -71 16 99 -40 -32 13 220 -178 -11 -75 -227 -192 37 -18 -20 -144 162 -5 84 -109 -13 -122 -63 53
3679 53 46 -103 -133 11 -63 181 67 -148 -62 23 31 112 67 -7 44 -152 -190 -25 -20 -54 -322 203 -76 155 -97 -355
3705 -355 -32 24 116 -329 47 18 154 -41 -63 211 -169 -319 176 -80 -47 -54 52 -265 37 74 147 -167 28
3728 28 29 -196 -222 -90 108 -200 226 174 24 15 -19 -113 -47 136 -165 -34 -60 -140 -238 -38 119 335 63 32 -84
3753 -84 84 -291 -89 -164 129 59 -123 430 13 137 -4 -39 104 -74 -131 185 -11 49 -43 -6 -20 -118 62
3776 62 20 195 27 -93 113 133 -221 197 -164 -131 -28 -92 -322 -20 -92 -181 3 -129 265 16 -39 -92 -176
3799 -176 -178 -45 308 -66 1 -51 60 -262 146 128 -125 -13 -29 42 -6 59 -55 -158 183 78 115 129 -134 -98
3823i8n3K24l2P3j1k29J77j80M0P1j39L33k15J32k26J98k11O9J21k28M29j98m1
3846Fk08O2J58p6J23J38k94K13k72L17j32k8j61O2J77M3j03J3r1J67m27K68J09
3869F4j67J70J3qo2j25J56p0L4J57j08Q1l73M28j80j07J15L2m0m7K63j64kJ49
3893B09p2j46J44k05j35R8J91m6J20L9k49m4J03LN6J7l51J70K58k16J81r5J57
3916A87k66J20l1q7J60j62K34q8l06J51L3K53J19l01N2o0M0j85J33j2j06j36J47
3939a11K17k81J63j76K48o0p2m3J45k05L8L01L6n7j01Ok41J57K07k49nK50j53
3962A4j49L24k25P0p2P9r4qK7l3q5P9n6l9K36J61j43l3R2k61J80q8L0k22K71J3
3988F8k02J12L12R9j67j26k12P5Q5N9k59P6K27l26J04N0J49k64N44m14N8J17o7
$$ plain form
3823 -98 -151 73 41 114 103 -126 51 -129 -89 -18 -157 176 -39 93 -133 65 -146 -77 44 -184 245 47 6
3846 6 -202 -140 18 -58 65 203 -91 122 -150 167 35 7 -154 -92 85 128 25 38 -53 114 -313 -45 64
3869 64 -103 67 80 72 10 -115 41 -29 5 162 54 135 -238 190 10 -97 18 50 10 -37 226 62 60 209
3893 209 137 -9 135 -70 -205 -107 84 38 158 197 -52 -96 7 10 66 83 -268 -98 160 -56 125 30 187
3916 187 -79 41 10 -77 83 -79 155 67 -239 -88 -55 198 317 16 68 8 48 -137 -4 -16 -122 -258 -111
3939 -111 106 -175 -12 -188 60 0 -72 -115 30 -175 -137 164 200 143 42 48 -193 -36 171 -78 -83 167 14
3962 14 -135 189 -36 34 -38 41 -53 -61 -34 -67 -152 -73 -129 -168 68 229 86 53 145 -116 64 -24 6 -216 55 68
3988 68 -134 -22 290 389 222 96 -116 -41 44 103 -156 -80 147 -179 -75 -25 124 -140 404 -10 48 165 98
4011I8j30p9J42j76J00p5J6P0R5o6p5L93m41n8J34L8k4J2k2J04J73j94p9J06K4
4036H6J94l69J98j34j45K31O9p2j68m7J15k4K79M5k25k22J08R1k32J41P2j65J58
4059a6J4J33o0j97M16l51J74J07k35J9K8R8J60l59J79r7R3jRj82j61K50P2k7N4
4084A20Jl6j81J65J28q0j14N2j3lM4j32j5l5J37j27J18p4mR0q9O1K19l23K0J63
4110I2j43K05J3l2K9r7j9L9o0j57L15j70K07%k75R3q9o4J63k02KN7K83p9M9o4
4136I6K2k9J62o35N84j73q7J65J48j52k31J13J4J29l30J28Q6O6j83R5kJ5j36K3
4160a12Q8R7r3J8o4J95q3k06J0pL85n83K03J80k17L24k04k1J50j45j47M92l75
4183a15J68k03K00L1k41J41j16J68j41O9O8M7j26M9j30K25l5K7j27M90m72L7K7
$$ plain form
4011 98 -32 -111 31 -145 -45 -120 -104 -34 61 -5 -80 313 -128 -186 -52 -14 -38 -26 -48 56 229 35 -44 62 86
4036 86 280 -89 109 -25 -170 61 130 58 -110 -157 -42 -66 213 258 33 -189 -81 10 -222 -81 -9 -174 -16
4059 -16 -2 131 71 -126 290 -61 113 220 -15 4 32 130 290 -69 110 13 106 105 114 -68 -229 21 93 66 120
4084 120 121 85 -96 69 197 117 3 55 42 39 83 -49 -64 -99 38 -89 29 -45 -49 41 -48 13 232 -91 -71 92
4110 92 -51 154 167 135 164 67 48 87 27 -130 185 15 222 222 -53 40 -49 -113 50 -152 -150 -93 190 111 160 96
4136 96 118 89 251 -384 200 27 -60 105 253 101 -130 -17 -3 126 -204 -76 10 76 -107 -12 -14 1 -135 -112
4160 -112 -24 73 -20 -2 -66 129 46 -160 -150 -157 228 -355 -152 28 -189 135 -69 -90 60 -85 -232 260 -115
4183 -115 53 -150 50 81 -160 -19 -135 33 -108 -39 29 76 -50 -1 -131 94 59 86 -41 449 -23 14 41
4206D1J3J96l8j90k93N06j77k41K56j22K55k96J84j75k4J80k52K00J07k18K23
4227A35O7j56m8o5R3K3K05R6l19j61K53m03J93J64k76L7K32M9j08j32K86j92j09
4250a36Q5J26J7k25J13K17l07j99O52m53J6P5j65m8J97J79k0q2O8k61M6k4K50
4273A21j12j20N3l25K90J29N2j78o3O4L10k74J30%r0O2j18nm6j3O6J97k2k0k09
4298a21K35l47J61q2J47p2NM27n95M58j22n7k43N8K25k08k6R0k7J52L0p8M3p3
4322b0K63k67L36k94P5j30K6J28QP1l63L17N9l55P8O2L7j30J53j98NN6o9J90J96
4347B34l96J10J1J78k78q8K85P7N6k21J03q8k23J14L44k45J7k5m2N0j54L68o1
4370A26j34J89j31j56J04J50j47j76J51Q6j33L98n28M66k89J8N7K1j58l8K08k23
$$ plain form
4206 41 54 250 212 22 -271 235 58 -183 73 -49 206 -90 94 -81 -105 75 -177 23 130 -88 135
4227 135 202 46 -2 -67 26 49 254 350 31 -130 123 -280 -87 77 -199 -162 70 119 11 -121 165 -27 -136
4250 -136 -51 75 92 -133 -20 197 -110 -309 343 -110 -94 -19 -184 -232 -35 144 124 42 110 -151 -105 -129 121
4273 121 9 -111 -58 -383 -93 36 88 -90 -153 -89 221 -53 77 77 -13 49 -69 -74 -120 -133 -67 130 108 88 -121
4298 -121 114 -233 -72 -154 -7 -79 -74 353 -242 216 94 37 -206 -148 77 -131 -157 -67 -94 58 88 10 53 -20
4322 -20 243 -24 312 18 93 -37 -11 117 125 196 -167 150 209 -146 -68 -6 31 -99 54 -144 -139 -83 -152 38 234
4347 234 -162 -52 -41 137 -141 -229 56 133 189 -32 71 -17 -240 -126 218 -27 -10 -35 -77 -27 -181 187 126
4370 126 -8 181 50 -106 -2 148 1 -175 -24 62 -71 327 -201 265 -24 -6 51 72 -86 -124 84 -139
4392a39K16o5J07J9j7j56L12m62J59O5p4n0l8M14k59M2N8KK2J11m14K62k79J38
4416b6J86j13J48m4q3p9P4l2m2Q7j3M5M6q6P2Rk66K30k29J74p1l6m6J24j55N1
4442g5J13q7K40k73J86l40J80j57L86q8k74L87M0k09p8J19J65l29L0J14K2r3r1
4465a12J91k62l8J21J53j03p3J78k1J2j01Q4l5j12J94p5n8k7L62l57J18J16l54
4488a99l6K31j06K72N0l12J39J09j32Qj74L39Jl00n1J93j93K79k56O0O0J78o6
4511I4k81K29J30j70J60k20J85K6k73L64o2P3p1j07q5l5P0J49Q2m54K75j9r1l4
4535f5oL57l27l03L70J15R1k42k56J83m1J58Q4J1o1O8k22kK20j87j20J31Q7P8
4559A21j28j3J41j52o9K96j44j56P4r6J4J08j43L09k33j02J85K94l81p0J66j35
$$ plain form
4392 -139 77 12 119 138 121 -35 277 -185 -26 39 -35 -85 -123 291 32 74 132 134 156 267 -147 115 -164 -26
4416 -26 160 47 195 151 68 -11 63 31 -11 76 63 108 154 68 140 149 -117 113 -116 58 -13 -49 -95 29 -126 -75
4442 -75 38 -49 191 -82 104 -236 -56 -213 173 85 -189 198 238 29 -49 70 235 -94 -64 50 72 -21 -112
4465 -112 79 -183 -221 -100 53 -50 -123 55 34 46 -55 29 -6 -118 76 1 -57 -84 278 -79 39 155 -199
4488 -199 -235 -4 -110 162 212 -100 39 148 16 24 -150 189 190 -110 -161 32 -161 118 -138 -78 -18 160 94
4511 94 -187 42 172 2 162 -58 127 153 -120 244 182 255 184 77 -8 -43 27 176 258 -196 79 60 -31 -65
4535 -65 -71 286 -41 -344 26 141 232 -10 -266 -83 -124 34 118 129 68 136 -86 -88 132 -55 -175 -44 43 121
4559 121 -7 -20 121 -31 -100 196 52 -104 -30 -126 -112 -4 -147 162 -71 -173 12 306 -75 -145 21 -114
4581a14R6K95l05j49L45j69j68J69j02J01j32L1l24L51k32K91j31K06J7Lk62J54
4603b9jJ0K16Ol25J40o2o7J09J59j4n07M77p4j61K98l1o6k60J31r2J52K4K72l81
4628g6O3p0N3k65L89L10n10K10k92M24k60O0k4p5O7J17k16L67j59k40J76k88L79
4651A40p5J64j17o0j75rQ2r5J63Q3p1j07l9K95l84M55l78l1J40N0q3R3q1K26m05
4676b19J23k8lM27k50J77l32O7o3L09k1k47L15k02j28j08K55j20j92K92k10M9
4698a09q9J76r0J20M0j37kJ24O2O5j63k5R5k5j38J14k64K8L91j83N9j06J99n7
4722H5J49l82J88j92j31n5L62pnp8Q3j43kK94j62l1J15m3pj9J6k1n5r0P7qP6r8
4750h4K50Q2l88K83j29p2q7J55Q8j62J40l0k41R6L0j2J23l01J51j8m7K70J05j96
$$ plain form
4581 -114 -18 277 -28 -177 168 -1 -169 0 -102 -1 -133 -102 -426 -75 -307 -16 -147 59 76 79 -183 -29
4603 -29 -30 -20 196 202 -123 17 -45 -112 -3 156 142 -365 112 38 -123 175 144 78 -182 -51 -143 9 33 305 -76
4628 -76 -13 -83 -30 -295 94 404 -106 104 -188 236 -24 36 12 -63 4 121 -95 272 113 -127 49 -239 140
4651 140 65 229 112 52 -123 -132 -50 -145 18 101 30 -77 -116 179 -205 250 -128 -159 -19 31 -52 41 -40 186 -219
4676 -219 -96 -124 -127 300 50 227 -105 -38 -101 208 187 -60 255 53 -75 -183 72 -48 -240 52 -158 -109
4698 -109 -198 -22 -112 8 48 -89 -91 33 95 160 -3 -28 67 42 -96 18 -246 -218 173 -10 49 -57 142 85
4722 85 234 -148 40 -152 -283 -338 24 17 12 -66 17 -126 -128 166 4 -27 88 45 38 19 35 14 -41 -131 -54 -62 14 -84
4750 -84 166 248 -140 143 14 -58 -145 10 98 -64 76 46 -195 -99 -69 -81 42 -259 -108 -126 -173 97 202 6
4774FJ32r3o2j04J22j59k1Q9J80j38L27j52q0J48j56q4J21j72R2R5n5j07J61j34
4798d4J3K31m88N52q5l7Rj54K4o9R2K08k67J62j23k69K57k02M38k82j04m2L13
4821A33m6k07Lm0K44q6M8j22J80j55J39Q9k69P0m7N7q0j3L9j26K94k54M3M32k99
4846B7j09J28k9j22N1L2J7O1j93J14K16nk80j36p4L34q4j9L8j65K36K6m6K17k66
4871c1J17L8j79J23j6k68jJ84R9j54K72k75jL00j17j88O4k10L86k73K72k63K23
4894A02j62p4NJ95q2K2k3j40J49O1O3Pm2k81L09l55O4J5K54RN9L0j66j30j15J16
4920a10J33j45L2L02k07j0J16n5k0k8J52r4J4k55L8p9qJ97m0J82k40O6j16L25
4944A50q5%M5k82L62k03R1L0k35J92p1k48K91k86K98q5k43K54j19L28k12J56N5
$$ plain form
4774 6 138 45 -17 -121 1 -158 -179 -90 90 -48 279 127 47 195 39 -45 76 -96 -4 91 36 -71 90 -44
4798 -44 -31 200 -288 264 179 142 151 -3 21 -48 44 252 -15 147 24 -245 12 -190 248 -34 -138 -180 133
4821 133 87 -120 -117 -157 87 1 49 -73 107 -48 91 180 -89 -19 -66 -9 -89 -102 -63 -189 105 -149 -106 326 27
4846 27 -82 46 17 -105 -54 -22 -5 56 -137 -23 193 188 -92 -228 -302 32 -52 -71 -33 -198 38 64 18 235 -31
4871 -31 86 124 -55 68 52 -216 -217 -33 66 -88 184 -91 -92 208 91 -97 -33 -243 143 -130 142 -121 102
4894 102 -60 -134 -129 66 -16 6 -17 -157 -8 53 116 123 81 -200 109 -246 -182 -167 87 96 155 185 19 -111 -226 -110
4920 -110 23 -122 -90 212 5 -5 111 56 36 8 160 66 80 -175 -137 -216 -224 -27 -67 115 -125 -59 -175 150
4944 150 65 65 110 -172 190 -13 78 108 -127 65 -6 -254 37 -249 49 -36 -279 -25 -144 184 -28 128 183
4967A83m63K20j56J50P2k70K97j0o8J76j67J55j11M4J26j55j55K40k7q4J12k09
4989a00J95j12k7K59o9q8Q7k96M31j98k54J3M27k82K3j29K00oq7J15m3k4j03j04
5013a72K94L7j06n2o8o6N0O0J02j3O9R3j16J57k26j76J54j95J41R0m5L5k02J01
5037e4J25J48l75P7OP6k85L10q9j95J46J32M1j18Q3j91K55r7o1k4R2n8k15K86
5061A5L0J23j73R3l13L34l91J92K40o5r5l5N2KM7k8J98j94j39K75q5j75j24O0
5085a56Q4K45k59K65o6q7k58K70J05m56M17N6r4o0K0n5m9J46k05L7K17j04K9j4
5109B8L3r8lo3P2k75L34p7j23L06M4m06K05J92J36k39j32K37j14k00Q6J29k79
5132b07K19p9j21J10Q9k4oL18k36K5q0l69K28J15nj47P6J44Q7k2m7p5R4k00L3
$$ plain form
4967 183 -280 -60 -216 -66 6 -264 33 23 -45 131 -36 119 8 52 178 23 -132 108 81 -3 109 -100
4989 -100 95 -17 -44 215 146 58 145 -151 280 82 -172 -159 268 -14 9 -120 80 74 -13 102 59 35 -68 -172
5013 -172 122 159 53 1 -67 -133 -83 -23 79 66 135 228 112 269 43 -133 21 -174 -33 57 12 47 -155 -54
5037 -54 71 219 -156 -79 -73 3 -282 28 -61 -256 -110 22 63 -55 28 -163 92 -5 -66 -90 2 -56 -271 15
5061 15 45 168 -5 88 -225 109 -282 -90 150 85 -10 -45 7 9 56 28 226 32 -107 168 83 -92 -216 -156
5085 -156 -72 173 -86 179 113 26 -232 38 143 -313 104 160 66 6 26 -29 -78 68 -137 -100 117 13 42 28
5109 28 61 -37 -40 -103 -31 -306 28 -49 -172 134 178 -228 -23 169 305 66 -66 171 57 -143 -57 72 -207
5132 -207 12 -67 -188 -78 11 -13 -19 299 63 88 8 -361 -133 -18 -23 -170 -94 50 137 115 68 -7 87 -113 -80
5157h0J26J32k51M0K87k84J58j63R1P0k80J17J08o0J12l01K43j03k08M32q7n63
5179d64L47J17k1j33n9K27Q8r4j07j96N47k81QJ71r8l61L36J20L3j80q1K22j92
5202e1M3L5K7K1p9o7q0l4J72k24K82j70l2J38O0K32l31L49k35j50j58O9K92k87
5226a78Q3OO1J4J18p8j13J20j53K91j14J27j81J6n9q0J91p9j37J05PL4j69J70
5250Br4m6M0O9K56p5M1l2k40J49K00k36j51RK55j13J47n8r6M6k21K86J55l16K19
5275A96j76J06k9j07L1n3R1J79j72Q0k13K0j08O8J73k05K34K49l61J44j60O5p
5298D5p9k4K1l6P7k08N10l48j00J76k18r5L94j71J02J74k94P2j05P7j73J33J40
5321G0m1J23j99R5Jk34K28k44o3K89j57J5n0J77N3j03J48r9K85j48j91J16j37
$$ plain form
5157 -80 46 178 -73 -33 254 -30 128 -35 56 126 -154 -37 71 11 123 -178 65 -38 -246 186 99 -464
5179 -464 -117 0 -21 -154 -213 14 102 8 -99 -295 252 -29 -21 150 52 -309 27 147 180 0 -81 141 -51
5202 -51 -8 27 54 75 -4 -71 -151 -185 -13 -237 45 -125 -157 -19 41 273 -58 291 56 -94 -252 -183 109 -178
5226 -178 -95 -89 -28 -14 104 26 -87 33 -120 171 57 184 3 19 -40 -120 71 -8 -145 -40 -33 1 -168 2
5250 2 -92 -138 -98 -29 227 152 193 161 -79 70 270 34 -117 -108 147 34 181 123 27 73 -148 138 293 -23 196
5275 196 20 126 97 -10 21 -32 59 238 66 146 -67 -47 -155 -87 86 -119 115 364 3 147 -13 52 45
5298 45 -34 -58 -37 -73 4 -204 306 -42 -142 34 -184 -279 115 -56 46 220 -74 -2 -107 -30 -203 -70 70
5321 70 29 152 -47 48 49 -185 43 -201 -264 25 -132 -117 -167 10 63 -40 108 9 294 146 -45 71 -66
5344f6j66O6kM26j89o2J88j13J02j06p0N6k58L79M6j47Q4k44L2J58j25J86k43
5367f8J17k59K84J11j10k8J42l08J7L91m14R7O9N7j54Q2j98J39R0k91L77j99K9
5390b7k8K79l32QN4K14l86J5J68j47R8J56j15M9j73O9N5J93k45J09j50J80k87
5413b43K79J39j26k32J17l9K35o5k37K76j86J84r5J94m16J76J47p0l13K16jJ75
5435A15KJ17k95K18k15N0M4j2J78o3Q7l54J2M35l18J1K39k97j13K17r7J70j2J31
5459B50L7k71J42l99R4J92k7j01n6J60K2j47J69j31J37pj35O8K21n1r8j04k8P4
5483A1J01j24J76k28mK20k48J67j18K77k41J9j05P4j20R9P4J4J09k16nJ63o8k43
5507b16L60k37J68J09k76R3K39l60P9p1K74k1q9O5k10J71q2j12K0Q1j60J11J05
$$ plain form
5344 -66 -232 -166 -168 258 69 7 195 82 184 78 8 64 -194 185 231 84 168 -76 -44 114 -11 175 -68
5367 -68 49 -210 74 185 75 47 189 -119 -102 289 -125 -28 41 98 -56 26 -172 -33 57 -234 143 -56 -27
5390 -27 -55 224 -108 -100 -46 168 -218 -203 -35 -182 -84 72 -43 6 -167 -98 -43 150 -95 14 -136 44 -243
5413 -243 36 175 49 -183 -66 -105 130 65 -172 104 -82 102 7 201 -215 -39 108 38 -275 -59 -60 115
5435 115 117 234 -61 157 -58 -8 36 24 202 139 226 -128 -116 319 1 12 251 -46 -159 58 -39 131 119 250
5459 250 287 16 158 -241 -147 45 18 -83 -139 21 43 -104 65 -66 71 64 -71 -3 218 167 69 -35 -63 11
5483 11 112 -12 164 -64 -68 152 -96 71 -47 230 -11 8 -97 -23 -143 -44 30 44 153 -63 -68 95 27 -216
5507 -216 144 -93 75 184 -92 1 240 -120 -41 -112 162 141 52 117 -93 78 -4 -116 -96 -15 -175 -64 41
5530D1j80O7j4k01K29J24j31K18k10m3JJ62R9j20K08j15j13M0J85l72J86k25J64
5553@k6k47L3O0P9K15j53J18N9Ql63K72j0j82N1J05P3k50L18k62Q1N4r2k8K81
5578A94l77R3J32Q4j57K19j87M9J2M5K5p1OOj3j05J60K34m29K6j35K57N0k3K3
5603A18j92j25L10k00K32j86j05j44J92J01j47J71r6J27l80L93J52r8m4nk8j8
5625B8K8J18j24k31K67k64J35J34j09j66K33O1m9l2j08J90p3j36J69j52P1j83
5647a93q1L82j44K55O9k43M9m4%j70m4J10J82j36l70K96K05k92J19M9j28J34P5
5670H0j06o4L91m30j02M97k37J39j68j15kRQ8O2M5j91k04M79p1o0O1l28J65j33
5694a95J02K26k02K24j51j79J34K5k8O6N1k3o4O4M8oj42j4K82l02J07j43J66o
$$ plain form
5530 41 -139 -72 -86 -287 -58 66 -65 153 -57 -100 -99 63 162 42 250 135 22 62 247 -125 61 -164 0
5553 0 -26 -273 -240 -180 -101 114 -39 79 138 146 -217 55 45 -137 -86 19 92 -158 160 -102 -21 33 -59 -87 194
5578 194 -183 -90 42 126 -31 188 1 50 62 107 132 61 67 73 60 -45 115 349 -80 -54 -189 68 118 95 118
5603 118 -74 -199 111 -89 143 -43 -148 -292 -100 1 -146 25 -71 56 -324 69 221 123 79 74 46 28
5625 28 56 174 50 -181 86 -178 -43 91 -18 -184 49 110 61 29 -79 111 38 -98 71 -81 -10 -193
5647 -193 -274 108 -36 219 288 45 94 50 50 -120 -164 -54 128 -8 -378 -82 123 -169 -50 -1 -129 5 80
5670 80 -26 -90 301 -129 -231 266 29 168 0 -115 -117 -108 -20 42 87 -104 -308 171 100 40 101 -227 -62 -195
5694 -195 -93 133 -69 155 4 -175 -41 -16 -44 22 73 50 -14 50 98 92 -50 -64 218 -84 23 -120 46 40
5718D0o7n2J49O1k31J38j07J43L2J13p7k69K80j49j27J72k51L68k12rK00m0j36
5741c1M6j26j62k7J08K61MJ83k05O4k10J31L2J11j07k31n5P5J22P4Q7j43j33P1
5765f1l4L9j7j02K47j32J50j46J70o6j26q2N8K92k36J89j42l9K3k00m5K77q8R7
5789B6K6p5r2J88j60K15m2l00J54K32k21JL0j44J52oO1l0j41K5L61j78M1j16j66
5814a59K73m8J68k99O5J55l0j27M5k43Q7K62p4K1k50K93n6j09k85K17L07l81J89
5837B1m0j87K24O5J5j79N3L5k3k37L34Q0k61J72J13l14K8J60J05k30N1m3J52M3
5861A37k57J15j6K2j93J53k45K11K39k10J98O4l64K69j38q1J55j66J21L4oJ04
5883A46k66J83k82O9J6M62k69k8J76j46o0j92K25r6K10m6n8p4J58J44l50J8J62
$$ plain form
5718 40 -27 -79 70 131 -100 38 -69 74 106 219 142 -127 153 4 -123 49 -202 166 -46 -55 145 105 -31
5741 -31 15 -111 -273 -300 -192 69 73 256 51 115 -95 36 68 179 72 -159 -214 -139 -17 57 144 1 -132 -61
5765 -61 -95 -56 -73 -175 72 -60 90 -56 114 48 -78 -160 -102 190 -46 143 1 -38 -15 -215 -260 17 -71 26
5789 26 52 -23 -115 73 -87 128 86 -214 -60 172 -49 -48 -18 -162 -10 -16 45 15 -126 -101 260 82 123 7 -159
5814 -159 114 66 234 -65 0 155 125 -2 43 -200 -113 149 75 96 -154 139 83 -26 -311 -94 213 -168 21
5837 21 -19 -206 18 83 98 -81 -28 7 -16 -253 81 161 -100 72 185 -129 -101 59 164 -66 -15 -58 94 137
5861 137 -120 -5 -21 1 -192 -39 -284 -73 166 -44 154 218 -146 123 -15 -96 59 -107 14 48 42 146
5883 146 -120 63 -219 -150 -134 328 59 31 207 61 1 -191 34 -62 148 102 44 -30 128 272 -78 -60 102
5906A02k09J44K08R2l51k1Q1o6L9l1J5J02o5j18O5k1pl2R8j57K46r9LJ39l48L21
5932A30j74J57J39n18L37p3P0K6o4P3j34m9K11j27pl13K9K16l5L4j22J87J17j81
5956g1N4m4J44l08K97k09j17M22n3k30M01m15K73j82m5j30L08q3K71k53J68j89
5978Ik95L68l37L36J76r3j02m5k14K26ll52J54M26k32M3P4j27q9j92K11J17Q8
6001A47K02n11K62k20K16Pn7K7j6j09P1J53l0o9k40J55K24o6j42J04j92k94L03
6024g5K99k01J96k08n9j0J56j9j41j07K65m2m3n6L11k02M3ql60J95o7J96p1J42
6048A34k70n8J94K4N1l27J47J93L7l0k27N2kJ5J14m6Ql11K72j20J89k06K63k07
6072a11Lj07J51k8K02j34j24K24k39L47L5l36K56j93Q7j77K07%K17k12p9J13k23
$$ plain form
5906 102 -107 37 245 337 -14 -35 46 -20 19 -12 3 105 40 -78 -13 -34 -41 -73 25 -132 114 15 18 157 -191 130
5932 130 -44 113 252 -266 71 -2 68 94 30 103 -31 -80 131 4 -3 -316 -287 -71 -106 -72 -194 -7 110 -71
5956 -71 -17 -61 83 -225 72 -137 -254 168 115 -115 286 -129 144 -38 -83 -213 95 12 283 30 198 9
5978 9 -286 82 -255 81 257 164 62 17 -197 29 26 -326 -172 254 22 65 139 12 -77 -269 -58 59 147
6001 147 349 -162 100 -120 96 103 46 73 57 -52 19 172 142 73 -167 -12 212 146 4 108 -84 -378 -75
6024 -75 224 23 219 11 -48 -58 98 79 -62 -169 96 54 11 -45 266 64 107 99 -261 -66 -133 63 -8 134
6048 134 -136 -194 0 24 75 -252 -105 88 125 95 -132 -80 -82 -67 47 1 9 -302 -30 -150 39 -167 96 -111
6072 -111 -108 -215 -64 -92 110 -24 -148 76 -163 184 219 -117 139 -54 33 -144 63 63 280 68 -11 102 -121
6095a21K08j74L16l87O6L42m38M4Q0L8j60L3J13j00L4K86l98N26l45m7o5L28k43
6118f4J6j12K4K01lJ68j0o0r4j95j26Q7L55j5l04K99j45m2PQ1o4r6j35M48j39
6143H2j09K20n6j61n5J65k61L49j33J4R3k05J10r2Q5J63N5l37j03K65j46J22j63
6166i8r8K09j60L80k41j24J49L4j20O3J2n7K80n6k09p1K60k23K8K34l4Rk20j67
6190b20J23J32J67l17L16j73R1k37MJ55k06K62R1j55r8N8l8J85l12K17k01M09
6212B53r8Kj09l6Rj2j54k2L37m33J70J90j29k1j0J81o1k00m5N05m47K65k58L16
6236A93k23r1j02L67k11P0qL3q5k45J59K51j47j46J05J55k60R1J56k38J17J95
6258A36j78J0K25k10j07nj9Qm6K98k00R2j53PJ08%n6O4J69k23l8p2J17J01k4r8
$$ plain form
6095 -121 87 -87 229 -158 -92 250 -188 -144 -64 -26 -186 -153 -40 -140 -106 180 -218 308 -37 -84 -149 179 -64
6118 -64 -48 -160 -136 65 62 230 220 160 66 -129 -255 -168 187 172 -132 167 22 -20 -13 68 4 -92 -227 221 82
6143 82 -27 193 137 -24 -79 86 -175 174 41 55 148 -57 53 -39 46 209 264 -73 -176 89 -57 65 -98
6166 -98 -196 13 -147 233 -8 -132 17 51 -69 -6 6 -51 229 173 -36 -107 153 -70 -42 192 158 167 -53 -220
6190 -220 -97 35 202 -115 201 28 119 -118 -114 41 -165 97 188 33 -65 -7 -45 140 -172 45 -156 253
6212 253 155 157 48 12 21 9 -145 -167 170 -263 -93 97 -32 -53 -63 118 57 -143 -188 317 -130 135 -123 193
6236 193 -30 -121 -223 144 -67 3 -5 28 -57 -302 -143 108 -39 -185 -80 75 -185 -94 62 -176 -59 136
6258 136 -42 -32 193 -17 -124 -129 -148 -140 -186 112 -88 4 -149 -142 -34 -34 -90 -26 143 -80 -118 -190 -73 28 4 -94
6284i4K1j04J22J69j41n0K83m25j21L47l2k18R8L31k12j85P1M17l21L4K50j32
6306A08Q4j04K31l92n4p9J01K16j38l20K74J07K78j42j80P3j38J93j63j01K27
6327H1k53L07q7k03L04l00P2j4P0j19Q1MK6J94j35o6R8q3L9L6r3J66k46J74N9
6352A12m07J89K5K58l40L19J23l43Q8L0k62p3R5J17J40m0j53J80j07j8K7j54J40
6375e4K7K16o1k24R2J95k46J06j17PJ91j95O4M1Q2j59l4J46K07m62j2J6M30k77
6399b1J00k04J48oP0K0k67J93j81p7N95l33j1PL1l1j98J14j35K97k30L13q0K74
6423C88k03k03J33n6K4l7j4k15L08n5r1j16K07o9l5J33Nj51K0R6k30K09r2m5J75
6448H6j40j4k2Q7O2r9M3P5M9Kj36k10L53j89Oj1J76j90l5K36j37oR8j42N2L5J04
$$ plain form
6284 -94 -73 -177 -55 114 -27 -77 206 -219 -340 7 -25 -243 -145 186 -26 -211 -140 277 -44 -10 240 108
6306 108 192 88 319 -73 -127 -206 -105 111 -27 -347 -73 34 312 170 -10 63 -75 118 -45 -146 81
6327 81 -172 135 48 -155 149 -151 -79 -93 -23 -142 -61 -57 -31 163 28 -38 60 -23 16 52 -41 125 -121 53 112
6352 112 -295 -106 -81 177 -163 156 279 -64 24 54 -208 -281 -186 -69 71 31 -122 58 -49 -67 -40 -194 -54
6375 -54 -27 189 128 -96 -4 191 -55 51 -66 -59 132 -63 1 42 124 -35 -69 77 284 -178 -190 -174 256 -21
6399 -21 79 -125 23 17 87 107 -160 33 -148 -225 370 37 26 33 64 33 -165 -51 -186 111 -119 194 114 388
6423 388 185 -18 115 59 83 46 32 -183 125 70 -21 -137 70 1 -34 99 104 -47 -27 69 -161 48 -44 -89 86
6448 86 -54 -68 -90 -3 59 -40 3 78 127 129 -7 -217 136 -53 -47 -58 118 -72 -107 129 -8 -14 84 -58 -6 29 133
6475A33oj25k64J93L5K02k74P1p0O3j04L31k77j79N02j41j64L37l98L41l16M8
6497f2L89k52J90l27Q8J54k89J27M9J30j64k40K24N0j31M4L47m29J34j72o2M96
6519B94l39j18J57J16k94K33l4PN1k01J53kL15n87J53J33kL2M9J58j58n9n5J06
6543A08j52l0K51k91R2J59l34K01K36k44m0p2M0L0Q5N6p9M9j3L33m40Q4m7p4M41
6568C49m51K67j83l05L09j16J9J82j5K1N4k02K33j91mJ38j65m1J32R3j97J46q8
6591a5J18q1r0L6p0J28Pr1Q5k3P2j91J92N5k51q7M25k67k18M76k55P1J01k30K46
6616A43j51k23K94pp5J16l3N9j00P9L3k47P0j08nJ24J23r0J05J3n38L97nl7J79
6641A16j90k1O1K20j30k8J07m8j67M61m07j18K28l9K7n4J13j29jO5j17j44J17
$$ plain form
6475 133 127 2 -262 -69 -34 168 -106 -35 -105 -42 -146 185 -92 -271 231 90 -74 263 -135 206 -110 -62
6497 -62 327 75 265 -62 26 180 -109 18 67 197 33 -207 17 67 -64 -20 327 -102 32 -140 -202 294
6519 294 -45 -163 -6 110 -184 49 15 22 73 -128 25 23 338 -249 -96 37 35 67 116 274 116 57 2 108
6543 108 -44 -74 177 -114 -22 137 -197 4 240 -4 -44 -116 -76 -46 39 95 16 65 52 385 -55 29 -18 -92 349
6568 349 -102 165 -18 -323 -14 -130 -111 71 56 77 131 -71 162 -29 -33 105 -60 -101 31 124 -73 73 -15
6591 -15 103 22 -68 -32 -102 26 33 -58 27 4 76 -115 77 132 -119 -206 219 -48 -266 210 -45 26 127 -103 143
6616 143 -8 -231 63 56 -19 97 64 123 23 102 135 -112 -42 -150 -155 -31 92 2 107 120 -418 -21 -26 -63 116
6641 116 -74 -95 -34 186 56 28 135 87 -80 381 -26 -144 84 45 72 18 131 2 1 66 -51 -195 -78
6664g8Q4M4K6J57l03m6n2m8J94N7k55K39p4m8j22L05j99j89K48J8J57j04j96m7
6688b32J96MK14j89K56l32N7J81%m01M36l20K23O2o6j31j51N00m46K32j53j00
6710a60K12L0n4r0j05L00L8j12k39J02K76m3k34M3N6R2k09J16l6L03m22J04L1
6733aj3K75l01M9L6R2m2q9l2nm1K37k40K36m7J57l18k14J25k1J19J50j21J18K4
6758A33m2j57k30K91J08n4J80k35l0j21K08R7j89K38k61rj38J90o9J64k9j23O
6781g2J3J01l8M7k00j2J37j44o9M20J75m66l1L57j71J59k47Kl5o8M3K77q6l25
6805b33J54J81l17j3M75k57K3j98J81J74k89K25o3N1R0j67Nj35K32j48J08J23
6827B02k52P7l4j80N9O6J9p3kK53k61K67j60N2o5J54k71P9R1jl1J45j19J83r8
$$ plain form
6664 -78 6 50 76 233 -70 -116 -168 -216 -22 35 -220 19 -55 -103 -225 80 -119 -308 -60 -42 115 11 -185 -232
6688 -232 -36 -32 182 -7 249 -83 -26 155 155 -246 190 -130 93 155 89 -42 -193 307 -139 93 -60 -160
6710 -160 52 82 28 -62 -167 133 171 59 -180 -78 198 155 -79 -36 20 112 -97 19 -17 286 -136 -32 -1
6733 -1 -14 261 -40 9 45 137 95 6 -26 -31 -72 165 -75 161 114 271 -47 -261 -136 -157 -38 112 -9 109 133
6758 133 91 -66 -296 -5 103 49 229 -6 -36 -157 51 148 -41 197 -64 -73 -211 -21 -90 74 45 -78 -72
6781 -72 -59 42 4 51 -149 -161 -24 -168 -237 183 358 -108 -139 218 47 206 -41 -39 -74 -142 -99 178 92 -233
6805 -233 -79 102 -215 -228 247 -10 13 -185 -4 170 -119 106 43 94 184 17 22 -113 119 -29 79 202
6827 202 -50 27 -7 -187 -128 -62 -43 -116 -118 135 -126 141 -19 33 -32 122 -149 -70 21 20 -11 134 15 198 100
6852A00k8j39J45L6p9j35K31j00j73K2J81j97J5K34km71K94P1P1k12O4K62k20
6875c0P0j14K3k4J50P1j40p4R3M5j44l0K01l40J16L41n03M45o5k18J08j18J60
6898B3Lk4j69j09M30j51j01K43j56J59j80j18L1q2Q7K01j18j56K14m2Qj70j72
6921c49K31K09k15o0L49n3l61J52J76k07J21o5J1J91p0k15J57J8O6k57L03k63
6943a31O1K50k80J57J5j53j04J90K38q5m2r5K19M5j3k82P9k76K9J35K47m23M70
6966B51q8j14j6N0Rj32K07l89P0J94j30J81p1N0l6k07J60m3M5J2k88K09P6O0j60
6991a00M9q7K27q4k54J22K29m7pk53J27J09k22J76M2k80M26j41J0k55L64o7k15
7014a31o9J36L2o1K0O2L6K45l05r2L23l13J92k71K27k89N99m36n8LK10j9O2r0
$$ plain form
6852 100 72 -67 78 114 35 -100 131 31 -142 -120 61 -136 -121 113 111 -360 -66 5 76 -136 -72 190 -30
6875 -30 40 -74 -51 -75 75 146 6 -68 25 70 -74 -104 97 -243 -127 214 -289 156 91 -127 -19 -137 23
6898 23 26 2 -167 -276 154 3 -98 145 -11 148 -32 -150 -119 -201 -114 87 -31 -187 27 -15 -7 -177 -349
6921 -349 -118 91 -124 -184 165 112 -249 -97 79 -128 -7 -72 -61 130 60 -155 2 20 86 -171 132 -131
6943 -131 -70 180 -100 57 72 -81 -185 5 243 158 116 21 240 285 272 -10 69 -207 -178 -43 204 -219 251
6966 251 163 49 33 83 92 -40 167 -222 -152 42 -88 93 22 72 36 -171 -11 -54 -9 3 -285 -76 0 60 -100
6991 -100 -51 -138 89 5 -249 -127 102 55 48 -205 -78 31 -191 -15 27 -253 173 32 42 -213 151 84 -131
7014 -131 -200 -64 -32 -93 -73 -11 25 270 -35 -127 196 -117 75 -196 31 -258 341 -95 -153 -150 60 41 103 13
7038A3j6K18r2k08J27O3j0k21J21K00m42J84j45J78J44j73L03k02K67P6l28l58
7060c01L59k84P8N6J5k3K65j8j12j18K1N6N9k5j9J19j16M4r2J80l05K76j64L3
7084a6J54j97kj73P54o83K43j20K32r0k55M06n09M78j56j13J45j52K4Qr4O6J82
7107A32j01L1j59Lk10M21l63K65j13K17l17O2L91k36k2o9o2R7%l2L56k47L4l86
7131c08J92J88N0k12K35j31pj13j9O1K24j79n9Q3j02J84K9j57L0n4n3K89k55J87
7155A03l38J93K9J83qL1l98j8M62l14K92m30N79l74K3n8Q9k47L44k73L37k24r8
7178a15J25j43J02J46l39J99r9J08q0nj00j21L30o9K17l15L78p1R9l51P7P6j41
7201i2J3K85K4m9J4k84J9J24L3j31K09q2p0P9j53j27L94j32m5K19k27l3j75J94
$$ plain form
7038 13 -3 215 123 -85 42 105 95 -126 -5 195 -247 -63 -208 -30 114 -59 244 42 309 385 57 -301
7060 -301 58 -226 -148 -92 -77 -100 165 147 35 -83 -62 -6 53 28 9 128 12 56 -36 144 -161 115 -49 -16
7084 -16 138 -59 -61 -234 520 -163 80 -40 192 102 -153 253 -256 222 66 -47 98 -54 -30 -22 -116 -50 132
7107 132 31 62 -97 -94 -304 117 -246 19 -94 123 -194 -132 259 23 1 -68 -130 -33 -33 -65 291 44 78 -308
7131 -308 -116 72 122 -90 145 14 7 -106 -125 -64 160 -19 -78 5 -97 87 116 -41 -11 -65 -118 171 -84 103
7155 103 -235 -42 -13 170 162 193 -205 -223 239 -75 217 -213 366 -8 15 -43 46 -201 143 -130 207 -17 -115
7178 -115 10 -133 -31 115 -224 -25 -124 -16 -96 -101 -201 -322 8 -61 156 -159 219 148 247 -104 -27 49 -92
7201 -92 -79 206 230 181 195 -89 -70 54 87 -44 165 83 13 92 -61 -188 206 74 29 248 21 -12 -187 7
7225Gl9M8R2j1m41M88j63p0L02l45K53j82l4Q9k67J12K96j10%j01j9J92j29n1
7249h3J53k46J57j71K81j27k9P6Q2p0o2j00P8K45k20P9q0o9J38m4K04k69K00l2
7273I1o1k42RQ2K43k10q3L30M2m03L43Jk72J37Q1l3r4j11J42O6k13K57k79J27
7297e0P1j02j89J84J91jn5M2M2k9j04j60J88k78R2L08L4m57K12M9J48p4j01o9
7321a08K03j0j15L6R7j57r5J57j4J48j06K9r7N8r9M0P2O2j9Q9k41j37K29N7k4
7346E5j14R5j36J76k12J19J45J27k37j47L6M22n64J68j00L57K4k26J9k3k8k4Q4
7369A6K1m0p4J11Q3o6K16j96L2J30K04k16l12P8o0P9n0j05M84m29Q7P8k75P2J82
7394E0o0Q3j31J78J68p4j45M6k47P4Q2r5J35r9r4K20P7j53J05r8j37J15K87k75
$$ plain form
7225 7 -32 16 108 97 -344 144 -19 -89 213 -132 121 -61 -95 -6 -273 -161 135 25 25 -76 -95 97 -32 -83
7249 -83 70 -176 -19 -190 91 -36 -65 11 93 23 -39 -139 -61 184 -36 43 -37 -106 32 -12 192 -77 123 91
7273 91 30 -212 -203 -121 122 -88 -171 159 201 -202 141 142 -130 7 88 55 -39 -150 -8 58 -155 102 -177 -50
7297 -50 21 -81 -270 -86 105 104 49 91 133 104 0 -160 28 -250 -158 150 184 -273 -61 -12 136 62 -39 -108
7321 -108 95 85 -30 6 103 -54 -149 8 -6 142 36 65 -32 26 -73 -33 39 101 82 171 -70 -207 22 79 55
7346 55 -59 36 -100 76 -136 -17 128 255 18 -129 -93 329 -235 -67 -167 190 214 -12 7 -16 -44 -68 16
7369 16 37 -3 -77 34 117 51 267 71 103 233 437 221 -91 -13 -73 6 -44 -149 335 -94 -7 71 -204 -132 50
7394 50 -10 73 -58 120 288 214 69 115 -132 -58 24 -71 64 -35 -129 91 168 15 120 22 -115 0 287 12
7418A2L0j50m7J70J33j42j38K69j83k2L53k41J3j98q7J32rJ2J7N7l5J09r4j68
7442b07K49j10pJ4J49K8j47k2j34J62N3q8K59l94P0J83j00N1M8j01M58l98Q6j58
7466e6j83L12j28MO9n6k05R0J46M8K00j60r4Q4O4m7j03m7l7J31J99m02K92l7l34
7491b50L31k3k13M31j55j11L4q7q2O8K43l40M6J31JK7j64J29K3k17k0N1L94k33
7515A4j23J55J9O7J3j1k63p5J59J40k71p1K94K3q6K83m87L66k47J99r0j00J47
7538E5r5M3r1O%J15O6L6l95M45j35q3N3J03l71K84J08o8j96m5Q1k7O6N7J88j60
7564D0J90n04L45j13M28k63l19K22l20K45m2J5K91m2n39K33P3j43L32j67J12j10
7586c6J62j50J07nk46J57O3p7J64j97J98k08K1l8J39r2R1Pj00K2J77l08L69l16
$$ plain form
7418 12 42 -108 -155 15 148 6 -132 137 -46 -68 285 44 57 -141 -228 -96 -105 -93 -76 -19 -54 55 -39 -207
7442 -207 42 -68 -75 -61 88 116 -31 -53 -187 -25 28 -60 199 -195 -125 58 -42 9 57 -44 414 16 102 -56
7466 -56 -239 73 -55 -51 18 -38 -243 -153 -7 41 241 81 -13 71 135 88 -15 -62 -99 32 231 -171 121 84 -250
7491 -250 81 58 -155 276 121 10 44 -43 -125 -57 186 -154 -108 23 24 51 -113 16 39 -178 -198 -147 247 14
7515 14 -109 46 65 132 145 134 -129 -204 -45 95 -176 -247 47 70 -16 267 -220 146 -101 98 8 -92 55
7538 55 -40 3 -88 -82 -82 33 99 135 -260 185 50 -33 20 123 -248 36 144 76 -120 -165 -84 -111 -45 12 200 40
7564 40 230 -274 71 -42 386 123 -196 26 -294 -49 -91 -76 215 173 -366 -133 -60 -203 129 -38 74 -36
7586 -36 126 -24 83 78 -168 -11 52 -25 139 -58 140 -68 -47 -85 54 -38 53 60 -40 -18 159 -149 220 -96
7610i6JK14j92J32r4O0k02L89j38o7j4k32J00o8L62p7j50L6K28j79k58K58l8R5
7634G0J2p5j4Q2Oj05q2M7RJ72J9O7k40K68l44J19Q4n5lP1k3k30K6L14j88J21j70
7661d2J66L36m65M7OM3j10j00j13L87j63j25J61J4k7r5J58o2O0L2k06J6J87R6
7685B01k90K85j65j60K19j28p7OK6J32l50L35K2M5n5k19J64n3J76j35m9K38l51
7708a83J47J41j39p7J50L3k61L97k21O8k19L34k01O3m5Q0J72j17m13K22J07Nj82
7731a39L44M1k53K53j50r5p2J30j18n0J73j88J47Lj34J01J59j64n2K90m84M31
7753A73j03pK3m55L32j08J07K27k48r5QQ3J75j92j0k20L31R2k2q9k1o3L89j73
7777A34j43O2O8O9l83J06P7M0j38Pj02j11M35lk11Q0q4L8j19J52L26l70L59j26
$$ plain form
7610 -96 -95 119 -73 59 -35 25 -177 212 74 7 -7 -239 -139 -207 155 78 -72 -36 192 13 -245 13 -25 70
7634 70 82 7 -7 75 81 -24 -106 -59 -50 122 141 208 -32 236 -108 11 95 40 37 108 85 -145 -119 195 7 128 -42
7661 -42 124 460 -5 42 48 91 -19 -119 -232 155 -8 -133 28 42 15 -80 78 16 76 108 -98 -82 105 201
7685 201 -89 196 31 -129 90 -38 -115 -109 -83 49 -301 34 56 101 46 -173 -9 -62 114 -21 -70 168 -183
7708 -183 -36 105 -34 -111 39 72 -189 208 -13 55 -164 170 -31 32 -13 67 239 122 -291 -69 38 43 -139
7731 -139 205 246 -7 246 96 1 -71 59 -59 -109 64 -124 23 26 -108 -7 152 -12 -64 226 -258 173
7753 173 70 63 86 -369 -37 -145 -38 189 -59 -154 -146 -63 112 -80 -90 -310 21 113 91 2 -19 -82 307 134
7777 134 -9 53 121 190 -193 -87 -10 30 -108 -101 -203 -314 121 118 -93 -13 -97 -59 -178 -26 300 -70 289 163
7801A63j19qj7k1l7J4l6N0P7k30R1J26R3l57O7j3LlJ12m9J44r3Q8k28M22r6m9
7828I4j18j45J57j7nk02J19J12o1Q7o1K66k75j1k1J12J99k01j02J52o9j98K78
7851I0k1M7j27m4m0J66j41J93j82JJ09O0m2q8K02K9j8mk29K45p2j55K01k07K14
7876A87l57L65k15j10k35K82J97n3j5Q1j53N9k19Q0K97l15k3K91k65K96m6k48
7898a19J64k14J9L74k72J84j9j73J37j61O0J05Q9k24M3K29j94J21k08N1j64K1
7920a51K22j46N2ok38L77j89j77N14l30j27K85K7p9J75k30j39L26j12o2j22K3
7942a07K7O6K6Rj08J81k43K69j61j8J78J22l06J86P4l47O0J48k42J08L09j08J1
7965A34p0L3j38M7K58n27L50n3j00J5P3j43M1J31k9j58o5K23j5j6j78K31j00J49
$$ plain form
7801 163 44 36 19 -2 -39 -25 -61 -11 66 -164 -73 53 146 -211 -144 -157 -154 -157 -45 -94 50 -43 45 -183 239 143 94
7828 94 -24 -169 -12 -29 -34 -236 -117 -5 -66 21 -40 226 -49 -60 -81 31 230 29 -73 79 10 -188 90
7851 90 69 116 -11 -55 -95 71 -70 123 -59 -58 51 111 69 -19 183 212 194 190 -39 206 134 -21 180 -27 187
7876 187 -170 195 -20 -130 -365 -83 114 61 46 127 -26 33 -186 -106 191 -124 -147 144 -121 175 129 -119
7898 -119 45 -169 -150 224 -48 136 117 -56 81 -80 -20 85 174 -50 -7 222 28 149 -59 -8 -172 -151
7920 -151 71 -75 -23 -29 -267 110 -79 -256 258 -72 -199 86 113 34 209 -21 -160 166 54 -8 -130 -107
7942 -107 -80 -14 12 21 -87 94 -149 120 -41 -59 119 241 -65 121 195 -152 -92 56 -186 -78 231 123 134
7965 134 64 97 -41 6 264 -263 87 34 -66 -51 22 -121 -80 51 22 -136 -201 22 7 -9 -187 44 -56 93
7989I3r1r8J53k32L3M5j40K52l7m7J83k09J52Q0o5l40K94J4j93P2R7J43j41J48
8013A66j60Q2j39J20j11J9j81J30n6N3J6K6o4P1K23j15l1m5K16l99K79k09O2k0
8037f7k19L45n9j66k1M6J59K6j4j30q6jK69j04J12P4j25J50k65l8J52Jj38J04
8061EJ41j59n9L9l9P4k6o1K37q9M0j9k50m7K19k35M60j13Qq2J73p8l4k84K15p5
8087c9k01J93J94K09l65j3j26J60K0j07p2K78l25J07J41Q9j17K01k25N3J7k2j05
8110e5J46o0R3j31j89J83J60m1n5M9j27K84k31l26K93K37k62p9K94k28J84m7J12
8133B04k93J84Kk08J02j76K79K86n22J04p0M2J49j6l1k22L93m36J99%J29k16j
8156a18M1J91l99L75k9L1P1k84K13J21m06K91j02M3r7J1N8J73j01n9J61m9J7J2
$$ plain form
7989 93 2 -96 57 -175 -142 -97 -237 15 -22 -69 114 -95 57 137 72 -268 26 40 -153 -81 16 159 18 166
8013 166 6 88 -51 69 -42 -23 -204 -74 -130 -77 -61 -35 -99 -28 195 80 49 4 220 -179 100 -109 -47 -67
8037 -67 -286 59 0 -166 -187 -141 18 44 30 -100 -186 -187 82 -22 90 164 39 189 -76 -114 38 39 -99 5
8061 5 146 -13 -72 -33 -72 2 -24 -85 152 63 103 84 -166 -213 6 -229 231 118 126 44 217 139 105 -179 36 -39
8087 -39 -240 -47 147 356 -9 -22 -148 12 32 -75 -147 131 -194 -87 54 143 26 227 2 55 72 50 -55
8110 -55 91 31 124 -7 -196 -13 147 106 51 100 -27 257 26 -300 -7 230 -32 -111 183 -45 139 92 204
8133 204 -89 95 97 -111 -9 -185 94 380 -142 -38 -108 -66 83 67 36 -186 207 -229 -30 -30 99 -117 -118
8156 -118 -77 114 -285 90 61 92 163 -121 92 213 -193 98 -4 39 -58 -47 11 184 83 24 185 136 153 165
8180A65j67k63K86J67j96J9K5K3K1j17l
$$ plain form
8180 165 -2 -265 21 188 -8 11 36 59 80 -37 -40
8191d0
$$ Imaginary data points
##PAGE= N=2
##DATA TABLE= (X++(I..I)), XYDATA
0@%%%%%%%%%%%%%%%qJ6j6J6j6J6k4L2l2M0m8N6o9P7q8J04j20J36j52J71j95K21
37A17k45K72l04L42l82M24m72N20n74O36p01P72q51R39j034J138j256J386j530
56h03J694j880K093k342K636k989L421l966M680n661P109r507J4532m8187L5518
71c652M452o447K9450k0795M4551n9462J0348j579k0663J9388j6552K6571J218
84F828M95J2105k3522J6417j2702q112K243k570J1173j0519K762J5042q497L903
98E046j593J239R01j3805O809n346m24P932n643J4549n784N019k721j2340R186
113C025j3946N403N30K330J2844j0353Q550n154k963l383o786Q752l262O386P09
128B682K751J975q515J842n868J182O74r39P144O45J270j490k829m58l072l293
$$ plain form
0 0 0 0 0 0 0 0 0 0 0 0 0 0 0 0 0 -8 8 -8 8 -8 8 -16 16 -16 24 -24 32 -37 40 -48 56 -64 72 -80 91 -104 117
37 117 -128 144 -160 182 -200 224 -248 272 -302 334 -367 405 -446 493 -541 597 -659 727 -803
56 -803 891 -989 1104 -1238 1398 -1591 1830 -2136 2544 -3117 3992 -5515 9017 -39170 -3652
71 -3652 800 -5647 23803 3008 47559 -11903 -1555 -3134 -23797 -4409 -20961 5610 6828
84 6828 7323 19428 -4094 12323 -379 -8491 -6248 -8818 2355 -8164 -5402 9640 1143 5046
98 5046 3453 4692 5593 -8212 -1403 -6749 -7173 759 -4884 9665 3881 8900 6179 -6161 3025
113 3025 -10921 -5518 -4988 -2658 10186 -167 8383 3229 266 -3117 -9903 -1151 -4413 1973 2682
128 2682 5433 7408 -1107 735 -5133 -3951 -3277 -4216 2928 3573 4843 3353 524 66 -3006 -6299
144f299K915J729J320K228K87L869m761n88Q1l688J915m423M448l69K14N130l632
161C76N249l184j177p50n592K372l875L063K838J385N332j390K256m417l297j776
177b587m966K426j6M516M447L81L805l032k996k707m780N01j372K525M252Q92
193A289M210j236k05j522m661O46l432J809P82L64M946j995L349j384j334N19
209B145m805K021k967R26J411q92M582j698K445n26k503J366m191J446j146n9
225b445L155j534L698j202l91P39k954J385k611P79J006j455L129j962J864m43
241G58j314K402l030J298m14n05J667k116K050j445J41J839k319K561j438M36
257E71L51j989J847k172O16Q00j597K378j344J763j71r06J338k407J086r71o26
$$ plain form
144 -6299 -3384 -1655 -335 1893 2180 6049 1288 700 781 -2907 -992 -5415 -967 -1336 -1122 4008 376
161 376 5625 2441 1264 514 -5078 -2706 -6581 -3518 -680 705 6037 4647 6903 2486 -811 -2587
177 -2587 -7553 -5127 -5143 -627 3820 4201 8006 4974 1978 -729 -5509 -5008 -6380 -3855 397 1289
193 1289 5499 4263 4058 2536 -2125 -1479 -4911 -3102 -2320 -1956 2990 995 4344 2960 1626 2145
209 2145 -2660 -639 -3606 -2680 -1269 -2161 2421 723 3168 2642 139 1505 -2686 -1240 -2386 -2445
225 -2445 710 -824 2874 1672 1281 2020 -934 451 -2160 -1381 -375 -1830 1299 -663 1201 758
241 758 -556 1846 -1184 114 -300 -805 862 -1254 796 -649 -508 1331 -988 1573 135 571
257 571 922 -1067 780 -1392 -776 24 -1573 805 -539 1224 1053 147 1485 -922 164 -807 -1433
274a433J382j193K362o95L52J437j960N71j968M70k73j130J897o10J353Q35p93
291F04J136j553K02j093j151J607j317J443Q4P78J072j349R52q85j105J62j448
308a861J096j11N39R13l61J426j022m52J96j233M45r70P89N73n99J470m78M99
326H59Oq89L36j216Q98n23k59R50o51O97m2K85K74o90Q86j320M4J71q48J044k96
347b84L20M72n87J238p28p2j08o63K71j276P20N10j41P50P3N60J9o45j98j124
367h93M52n94o6J023K6R24k83M87m5j280N03j271mJ60N9P77rJ236m16Q8K40j129
389a5k44r26QP00m94J261O2L94M56l33L2r28n82k23p92Q92K0J075M33K43J50r60
411B29j76n52p14J80j41P42N96O95M28n26j94n77p77q0j02P76l47O91M81k26J73
$$ plain form
274 -1433 -51 -1244 1118 423 775 2212 252 823 -1145 -675 -948 -2078 -181 -791 562 1397 604
291 604 1740 187 389 -704 -1855 -248 -1565 -122 -38 740 1812 463 1415 530 -575 -413 -1861
308 -1861 -765 -876 -337 576 215 1641 619 167 363 -870 -425 -1395 -606 -33 -632 838 360 859
326 859 865 -24 312 -904 -6 -529 -788 162 -489 208 166 451 725 35 921 -399 -355 -184 -1032 12 -284
347 -284 36 508 -79 1159 431 359 251 -412 -141 -1417 -697 -187 -328 422 495 1055 1074 429 231 -893
367 -893 -441 -1035 -1101 -78 -52 872 589 1076 1031 -249 254 -1017 -1021 -861 -802 -25 -34 1202 786 874 1114 -15
389 -15 -259 -1185 -1177 -477 -971 290 352 746 1202 869 901 -27 -609 -832 -1624 -732 -712 363 796 1039 1189 229
411 229 53 -499 -1213 -1033 -1174 -432 164 859 1287 761 567 -10 -787 -867 -969 -193 -540 151 632 406 579
432E79n02j94k75m35N58j61M31J3k14P40l67K97l46l03K56n90M39j19J45M7j86
453a87Q08m95j50K68n10K29k16j3L01q0L73n88M95l96k48K30j04O11J20P2J58
474F78o51L72p56o28L58k14J172J43K96J78m96p3j012K0p8Q0N95Q5O16Oj85j1
496D95q25L26l19k7Q1l18R25m79M25L68k65K71n86k10k3o83O79l69N95L1N74M27
518A093m38k3m53p13l85k44O11L83Q30M40j71q5q36l20j94n17M45R2Q25M64k20
539E84J94n67j63k75k29k8m0K96K96L02l9K87n05M5k7l16k07K62k99K85J02J30
561H8N26k0l31K09l77k53l96NM9N92K76j44J69n7k11k5o48K75j88M17M75k94K93
584D30k74pk04k14J75k39M50l5J04K36n22J36l12k6J06J45n3L37J3O3k44k21J28
$$ plain form
432 579 77 -117 -392 -827 -269 -430 1 14 -200 540 173 470 124 -179 77 -513 -74 -193 -48 -1 -187
453 -187 621 126 -24 244 -266 -37 -253 -266 35 -45 328 -260 235 -161 -409 -179 -283 328 448 520 678
474 678 27 399 -357 -985 -627 -841 331 474 770 948 452 379 -633 -613 -691 -611 -16 69 685 691 506 495
496 495 -330 -4 -323 -350 -269 -587 338 -141 284 652 387 658 72 -138 -161 -844 -165 -534 61 92 666 1093
518 1093 655 632 179 -534 -919 -1163 -552 -169 661 1101 930 845 9 -311 -505 -1022 -577 -485 340 804 584
539 584 778 211 48 -227 -456 -484 -524 -228 68 370 331 618 113 158 131 -185 -392 -130 -429 -144 -42 88
561 88 614 594 263 472 95 -158 -554 -549 -500 92 368 224 393 336 125 100 -548 -273 -461 -44 431 137 430
584 430 156 149 -55 -269 -94 -333 117 82 186 422 -100 36 -276 -302 -196 -51 -104 233 246 309 65 -156 -28
607b8l56M99l44J13L03KR9m02L61j90J7k72o0L07j1l48K99j46M56j37J38k59l24
630b83L79n79L13j15K7O44j34P9R2n10l4j66P8k21J85L29J76J6r4j10J11l90K69
653F2n20J24K06J12L46k38K24r5k51k22K8k2l91O05K00n9K69k92J74N9k25M0l15
676a81L4O2j6L17k58M32r4pk85k70j2o8K86P1n4J32J69K22k52j45j87p7J99j69
700a51K30Nj1J82k51J41k83m2L95l30K3N6j26J53J60l07K65k28K35j7K7j62J01
723F5j07j41K41J3l07L70j66q3K1K27j7k74J66K01k30r1J17R2j02j47M05p2j66
746A5K74m42J65j50P3L7j45M83l13K28j18k9K8o4k25j4L6J23L58Nn79K90J34m82
770c12K80r3j55J66O7K00O0k7J74m02P6o5p1j97J9L77K38m9j63k21R9J17n6o3
$$ plain form
607 -28 -384 115 -229 -116 187 189 288 -114 247 57 74 -198 -258 49 38 -310 -11 -157 299 162 300 41 -283
630 -283 96 -483 -170 -285 -258 386 252 331 423 -87 -121 -287 -209 -430 -245 84 260 276 182 72 183 -207 62
653 62 -458 -334 -128 -16 330 92 316 221 -30 -252 -224 -246 -637 -32 168 109 378 86 260 319 94 134 -181
676 -181 -147 -85 -101 216 -42 390 296 289 4 -266 -278 -346 -60 11 -43 89 258 480 228 83 -104 -181 18 -151
700 -151 79 84 73 255 4 145 -138 -180 215 -115 -92 -36 -162 -9 151 -156 109 -119 116 99 126 -36 65
723 65 -42 -183 58 71 -236 134 -32 -115 -94 133 116 -158 8 209 -21 -112 5 97 -5 -152 253 181 15
746 15 289 -153 12 -138 -65 -28 -173 310 -3 225 107 78 106 42 -183 -197 -161 -38 320 325 -254 36 170 -312
770 -312 -32 -125 -280 -114 -47 153 213 186 360 -42 34 -31 -102 -299 -280 97 335 286 123 -98 1 118 62 -1
794aq5J59o4k0k32K38J68k74K45j92L3J16l19K07k85K09K27k3p4N8j20M7J0l15
818b87M11j92J71J9k93M24k00k4q2m1K53j69l14K87j57J74L09k87K68j35j25M
840A4N3r5j03L96l70K14L2k17J04q2M16l96R4K2j62L8o2k22J54J87l0j36L14o6
864I7k32J70mJ24k81J5J67o5J6L68k43j70K6j54j59J39O7K50j49J96m1L5n9k2
888I1o6o8q3P9k2J01mJ64n8M7o0k7j09J73n31L47j52K00J14l6j84L35j51k20n3
913a73R8j5k31M60r7J8J34j80k84m0j34L28K29j96J96nl46M11j24j76J98q0J61
936A52r0N6j60K68j83J64k61r8N0J90j15M9N9PR8k47q8L5M5j28K98j57jK61q2
961A22j36q2j43K81j19M9K94l30J62J7k63J74j34j65K02l4J62j41M5K5k56M63
$$ plain form
794 -1 -86 73 9 -11 -243 -5 163 -111 134 -58 -25 91 -228 -21 -306 -97 130 107 33 91 -29 18 28 -287
818 -287 124 -68 103 122 -171 253 53 29 -53 -94 159 -10 -324 -37 -194 -20 289 2 270 135 10 14
840 14 67 -28 -131 265 -105 109 141 -76 28 -54 362 -34 60 82 -80 -42 -104 -326 -172 15 -15 -151 163 97
864 97 -135 35 31 155 -126 -111 56 -9 7 375 132 -38 -12 -166 -325 -186 -119 131 -18 178 137 172 113 91
888 91 25 -43 -126 -47 -69 32 28 192 134 181 121 94 -15 158 -373 -26 -178 22 136 100 -84 251 100 -120 -173
913 -173 -75 -90 -321 139 42 60 194 14 -270 -310 -444 -116 113 -83 113 108 -238 173 49 -127 71 -9 152
936 152 62 118 -42 226 43 207 -54 -152 -102 88 -27 22 81 88 186 -61 -149 -114 -69 -197 101 -56 -57 204 122
961 122 -14 -96 -239 42 -77 -28 266 -64 98 115 -148 26 -108 -273 -71 -105 57 -84 -39 -14 -270 193
983A93j53r6j40L57lq7j88K3K93M4j67J10k21l0P6J10k66Q1LK73j28j17j57K66
1007G6k06K72j99P1m38N97j96o3M8OK33l23P5K52j61N3j36j75L20j27J00J85k38
1030B6J2j62Q1l5J52j05J41j51j89O06p20L33J5J9R5rp9j93K78k24p2J89J3RO8
1055I8M1j09J8j03l4j79O01j53j46k00J11J03j74Q5p2QJ03l3MJ79l90K90p4J10
1079H4J73m30K07K0K0k16M13l57N4J78l47K69Q4l8j08Q6l41K36J7k3j03J69j43
1102i6K76k25K7M4o5P5j9N9j04J09J7r8lJ18l39J13L3J74j34j99L31J11j02l13
1126b10m4L01k11J04j71J90K01k99K39j07j0K4j32J90nk50k5J00J87j3j02R4k25
1149a74L49k84Q6K88m81NlL49j46L0o5J2j15J47J23j70J90p1k5j3rL10k83k02
$$ plain form
983 193 40 -56 -196 161 158 71 -117 -94 199 243 76 186 -35 -65 11 121 -145 -64 -61 212 84 -33 -190 76
1007 76 -130 142 -57 14 -424 173 -23 -86 -38 -32 201 -122 -47 205 44 97 -39 -214 106 -21 79 264 26
1030 26 38 -124 -43 -78 74 -31 110 -41 -230 376 -344 -11 4 23 118 109 30 -163 115 -109 -181 8 21 30 98
1055 98 139 30 48 -55 -89 -268 333 180 34 -166 -55 48 -126 -41 -113 -105 -2 -35 -31 148 -242 48 -26 84
1079 84 257 -173 34 54 74 -142 271 -86 -32 146 -201 68 152 114 6 92 -249 -13 4 -19 -122 47 -96
1102 -96 180 -45 -18 26 -39 36 17 76 -28 81 98 0 -3 115 -224 -111 -78 96 -38 -237 94 205 103 -210
1126 -210 -254 47 -164 -60 -231 -41 160 -139 100 -7 -17 7 -125 65 60 -190 -215 -115 72 59 -43 51 -174
1149 -174 175 -109 -23 265 -216 -211 -214 135 -11 19 -46 -34 -149 -2 121 -49 141 70 45 32 23 333 50 -152
1173a52L37K3j67q1K10k62q6K94M1k66K46J51k24j11M2j44J23j44K64N1l6J4J49
1196B72k18j40J45m5j24J74K3lK3P6n1j62j45L03q5j29k5j71J87J39jj71J00m9
1220g7J77l5K16k04m0k45K34j89J52l2P7j23k5O4k09Q8j1Q7K22lj72J4J46j25
1244a3KJ3k22N8L00o5j57J06j61K45k98K75j3q7Q7j73K9r9J35J02p0r2K8J26n9
1269cJ5K8M0k11J71k70J6K80J6j20j45K49J23j98m1j32JJ67j0j2K4q5J44K26k82
1294ik16K65o0R7k86KJ18N0J14j61L20j84rnJ25l55O8K30j51J19j70r1L10Qj30
1319aK1J13m0q3J24j56j5K84k04j71K58J54l29J12L2k08J07j34J31j59M6J8m5
1342a45l3K80j66M4p3l4p0K0J52K5K02k63J65j9J68r9R5k93j68M15k43K0Q3m8
$$ plain form
1173 -152 185 208 41 -40 170 -92 -178 116 157 -109 137 288 64 -47 -5 -149 -26 -170 94 145 109 123 272
1196 272 54 -86 59 14 -110 64 87 84 107 183 132 -30 -175 128 43 -86 -111 -282 -95 44 43 -128 -28 -77
1220 -77 100 65 281 77 37 -208 26 -163 -11 -43 34 -89 -114 -50 -259 -171 -182 -95 127 124 -48 -34 112 -13
1244 -13 -11 2 -220 -162 138 73 -84 22 -139 106 -192 83 70 -17 70 -103 -74 -173 -38 64 -6 -98 -70 56 -3
1269 -3 12 40 80 -131 40 -230 -214 66 82 -38 -183 66 189 -9 -50 -182 -181 -14 -24 -36 -12 -97 47 273 -9
1294 -9 -225 40 -20 77 -209 -207 -89 -39 75 -86 234 50 41 36 161 -194 -126 104 -47 72 -98 -189 121 129 -1
1319 -1 20 133 93 10 134 -22 -37 247 43 -128 130 284 -45 67 99 -109 -2 -136 -5 -164 -118 -100 -145
1342 -145 -178 102 -64 -20 -93 -127 -197 -177 -25 0 202 -61 104 85 253 154 249 -44 -212 203 -40 -20 63 15
1366A5J16j07m8K6P9j09N4J3j35Q2J76L3Lj71r1n4K52r5N9J22l47J06N0k64m8
1391b83L00M1N6j27Q2Q5MJ1n8r2j63K00k97LJ77J63k05jL08k08J17j15J52k04
1415e4J75K5k54R6o2Q9j77J34J28j7j27K49k69J47j67R7N6k07L45l11Q7M1j94
1438a70M41j29O8l00K35j21m8K04j05J05l8j08q0K50l24K20J65k21n8K01j63n7
1460c3N6j7m5K02l91PJ98K45l02K30q3j47j1j1J46k5k41J85R6l24K02r0K48K0
1484A15j79J61l36L82P4Qn5k12R1m8k85K18O3n4N9K75m06J45q0J60k40K36j89
1507i7p4N7o5K63q1K11m64K11R6J86k86j14J88j10J10p8R5j1k33L43j64m6L09
1530B46k59K9q3J56j8J36l39R7Q7k21P5R7N2k15O1R1J18J4j74K78l0l11K20p2
$$ plain form
1366 15 131 24 -24 2 81 -28 26 39 -96 -14 162 195 198 27 -64 -118 134 39 98 220 -127 -21 29 -235 -283
1391 -283 17 58 114 -13 69 154 158 169 111 19 -144 56 -241 -238 -61 102 -103 -104 204 -4 113 -2 150 -54
1415 -54 121 146 -108 -12 -74 15 -162 -28 100 83 -44 205 -64 83 -84 13 69 -138 207 -104 -17 24 -170
1438 -170 271 142 210 -90 145 24 -24 180 75 180 142 34 -46 204 -120 100 265 44 -14 187 24 -33
1460 -33 23 6 -39 163 -228 -221 -23 222 -80 150 67 -80 -91 -102 44 19 -222 -37 59 -265 -63 -153 95 115
1484 115 -64 97 -239 143 217 225 170 -42 49 1 -284 -66 -3 -57 2 277 -129 16 -64 96 -144 92 -97
1507 -97 -171 -114 -179 84 3 214 -250 -39 57 243 -43 -157 31 -79 31 -47 48 37 -196 147 -17 -63 246
1530 246 -13 16 -67 89 71 207 -132 -35 52 -169 -94 3 55 -160 -99 -8 110 124 -50 228 198 -113 107 35
1554C5J15m40M10j0K0j98l7M4q0k7L7P4J4O3j18Q1L30k31p6j90Q6J36K3o6N9M2
1580I6j85o7J36K17l92n3M81k90J31n9r9K29j32j14K36j13k46N52l94J54M1J42
1602B71k49n9P2J2J25j94J0N8k98L27k25L04n9l3L8l4j36MO0K8L1j50K51k14r
1627f9L40j18l21K26k55J14L57k57L83m04K23k72K56l63j09N9Oj30L87j82J29
1648@J20M9k01m0m3J15o1K46Nl85J92l5J57r1J11JL2j1p2n7J01l73M59l18L64
1673B65j79J57k19j48J16P0l9R1l6j26M1k68M4K57K36j34L2k54K79k06k9j15K31
1696F6l1M4j75j27K17J63o7n7R5jL5o6k28K2r7R0K65k18K17j72j59K84j21l2P3
1721B0k4J16p2k17L3L34j9J97n45J39q9M4L56k69k8l9N8J26j97P1J41l46J83K9
$$ plain form
1554 35 150 -290 120 110 130 -68 -105 -61 -141 -168 -131 -57 -43 20 -98 -17 313 82 6 -184 -98 38 61 -5 54 96
1580 96 -89 -156 -20 197 -195 -248 233 -57 74 15 -84 145 13 -101 135 22 -224 328 -66 88 129 271
1602 271 22 -37 35 47 172 -22 -12 46 -252 75 -150 154 95 62 100 66 -70 -66 -6 22 53 -97 154 -60 -69
1627 -69 271 153 -168 58 -197 -83 274 17 400 -4 219 -53 203 -160 -269 -210 -204 -334 53 -129 0
1648 0 120 169 -32 -72 -115 0 -61 185 190 -195 -3 -38 119 28 139 140 172 161 89 32 133 -240 219 -99 265
1673 265 86 243 24 -124 -8 62 23 114 78 -48 -7 -275 -231 26 262 128 160 -94 185 -21 -50 -165 66
1696 66 35 79 -96 -223 -6 157 90 33 128 127 162 96 -132 -110 -207 -117 148 -70 147 -25 -184 100 -21 -53 20
1721 20 -4 112 40 -177 -144 190 171 368 -177 -38 -127 -83 273 4 -24 -63 -5 121 -76 -5 136 -210 -27 2
1745Blj4Jn3J57k47L94n8k63L97l71NJ95n6J17j90J13l07rK06J50J00K77n15j3
1770A5j49j21o4L55l3jk30J44J84L2k13J53j86j61M83l50R5Q9K68n43K18o7Or
1794h5P2j64J28J40k84J0J82l83M56l2J45P5k21L4l2n3K37k66J19j17J04j2j43
1817i0QL33m26J09J43k38j61K14o1M4J4K49ll08K91n30K84n7K38Nj36k42N16l93
1841a97q4K33M5q8l18K38J06M3j07K8RL9J2J99p1p5J78j63K4Q2r0l1J91j53J7
1866F7J13R1l30n8J63J71k37LK69l4Q0m94K96k27k55M72oj84p0k0K30qN3L7j67
1891d5J82k62J86NP1k62J86K82l76q2J46j79K97k29L96j00M5l49K03l8m45N06
1913A38j42R4k77L17l68J83mJ19J00r7r0K4k2j26J41j14Nj89K10Mj5K17j74n2
$$ plain form
1745 2 -1 -15 -14 -67 90 -157 237 179 -84 313 -58 -53 142 86 203 13 126 -181 -190 16 166 266 543 28 15
1770 15 -134 -255 -319 36 3 2 -228 -84 100 132 -81 72 -114 -275 208 -142 -47 42 310 -233 -15 -82 -76 -85
1794 -85 -13 -177 -49 91 -193 -183 -1 -384 72 40 185 260 39 73 41 -12 225 -41 78 -39 65 53 -90
1817 -90 -82 251 -175 -66 77 -161 -322 -108 -169 -125 -111 138 135 -173 118 -412 -128 -185 53 58 -78 -320 196 -197
1841 -197 -281 -48 -3 -91 -409 -171 -65 -22 -129 -101 -92 -53 -41 158 87 12 190 27 51 133 43 12 203 50 67
1866 67 180 271 -59 -117 46 217 -20 -17 252 218 298 -196 100 -127 -382 90 84 -100 -170 -190 40 32 85 122 -45
1891 -45 137 -125 61 66 137 -125 61 343 -33 -115 31 -148 149 -80 316 216 261 -88 115 77 -368 138
1913 138 -4 90 -187 130 -238 -55 -59 60 160 63 -27 -3 -25 -151 -10 -124 -119 -308 -98 -94 -109 108 -66 -118
1937a18L5k2n2J45J6k52L18o4l3J63j45J54k3l11K20o7M5k12J15kn3N2L2k8K88
1962B01k92l2K74j67j70J55J59j81K48p6p0r2K92k99N3j8Po2J41j42K77j32K2
1985I6n5k10J00J99J02j82k18L68j99J01K15j65k3P2m68L24r1M5j25L33k55P2
2007C6k30R7L10k49J38kM4L3jo2j96L40j39j35k8K75l43nJ06K3L0l29L91l07K01
2032bJ59J9PJ24k5k04p6K20k31K05j25l3l9L4k35M66j75j19k4K3M7J30k02J58
2056A02j60J01N3j67K22k93L2o9j63L45J18j74J21R3m5l39L09j74n1J20J64k61
2078a16K10r1j45K73M9j90j13J85j21J02j81K86j33N2M6j09O9Lk73K42j22r2K61
2101I2l10K82j84K96k49j85K2K20Q5q5m2n8K13m0P8j46r4j08L6L18Kj12j08J69
$$ plain form
1937 -118 -83 -105 -157 -12 4 -248 70 6 -27 136 -9 145 122 -189 31 -36 9 -203 -88 -90 -143 -91 -59 -87 201
1962 201 -91 -123 151 -16 -186 -31 128 -53 195 119 49 -43 249 -50 3 -15 -8 -70 71 -71 206 74 96
1985 96 41 -169 -69 130 232 50 -168 200 1 102 317 152 129 201 -267 57 -34 11 -114 219 -36 36
2007 36 -194 -97 213 -36 102 100 144 177 176 114 -82 258 119 -16 -44 231 -112 -117 -11 12 42 -287 104 -203 -2
2032 -2 157 176 183 307 282 78 2 222 -9 196 71 38 -1 33 -202 264 89 -30 -54 -31 16 146 -56 102
2056 102 -58 43 96 -71 151 -142 -110 -179 -342 3 121 -53 68 161 116 -223 86 -88 -139 -19 145 -116
2078 -116 94 3 -142 131 180 -10 -123 62 -59 43 -138 148 15 67 113 4 73 76 -197 45 -77 -169 92
2101 92 -218 64 -120 176 -73 -258 -236 -16 69 -16 -58 -116 97 57 135 -11 -105 -213 -177 141 143 31 -77 92
2125I2K13l48R8J0k37l7K90N8ok44J9J18m2R0j71o2J73m4j08J98j92J79j97Q1
2149f9j08L3K63L5j79r1O9m2M2J24J42l75K02o8J17l0j10M2M8o5O5j60K05k66
2173a76K30j89jk6J95p7K0l9J68j13M1Q1j09K78k78L6K17k90J6k11K56j94K27
2196F2P5j43p6q4L27k11N0J9m5P5j26J08J72j11N7j93M6j29J00k32K23o5j16J39
2220g8J05O1P2k41K18j20l6j40J69pn1K4Q2N1j39m09L79L0J94q4l36L24j98R3
2244c7j92M45o7J04k95L5L7Q4j58L6J39k31j37N37l52J25o1J9N0l08k1M84j83
2267E3L0j06rJ19j46j77J38j25J64j65K29J47K3m62J11M26l49J51k6n5L09k51
2289B9j95K73j80R1P5p8j20L1J54j95l9K66k58L23p5k57r3N99k66p2J13j97J38
$$ plain form
2125 92 305 -43 55 65 -172 -209 81 139 133 -111 -92 26 -16 74 -97 -159 14 -30 -138 60 -132 47 -150 -69
2149 -69 -177 -144 119 154 -25 -116 -47 -89 -47 77 219 -156 46 -22 95 65 -45 -3 45 -20 45 -115 90 -176
2173 -176 54 -135 -136 -162 33 -44 -24 -63 105 -8 33 114 5 283 5 41 258 -32 -16 -227 29 -165 62
2196 62 137 -6 -82 -166 161 -50 0 19 -26 49 -77 31 203 92 149 -44 2 -127 -27 -259 -36 -101 -217 -78
2220 -78 27 88 160 -81 137 17 -19 -159 10 3 -48 -24 58 109 -30 -439 -60 -30 164 80 -256 68 -130 -37
2244 -37 -229 216 149 253 -42 -7 30 114 -44 -8 131 -100 -237 300 -52 73 12 31 81 -227 -248 236 53
2267 53 83 -23 -32 87 -59 -236 -98 -223 -59 -224 5 152 175 -287 -176 250 -99 52 26 -29 280 29
2289 29 -166 107 -73 18 93 15 -105 -74 80 -115 -154 112 -146 177 102 -155 -248 351 85 13 126 -71 67
2312F7n9q6m0n6L14j19RR5k80K42j65j08Q6J87r3L14j72m6k21J80j41P2L8K18
2336B36k68k5N9k02J14M42j96l14J95j7J54o0O7%k90J16L32j42j94L23m86K40
2358H4O2J7k5L8p2j5j42RJ20R2j95J79J9l15J88p3j13M19l04j3O1K25k14m67N70
2383A35k33K20j27j55L02j58K11n3k77J70l7J67q3n4j86r0K31J87l3j52j37J31
2405b1p4k06K88j94N26l68K64l99J89J14k02q2K95K7l83L44k48K64j43J11O7M
2427A73P2r8m28K20K17k7j68J00m9N8N5J3k84O6N8k0J19j04L3o5J14j43O9J58
2451A39k91L77m31L36j9R3k02j18R9K3R4k03J47N9l72K76j69J65J04k79L88m31
2473b15J88K14Q4k38R3r3M5j48K19j77j90J47k2N7R6j0l00L14J46j45J43k28P3
$$ plain form
2312 67 8 -78 -118 -174 140 21 30 125 -155 87 -78 -186 -100 87 -6 308 136 90 -131 49 -92 -20 18 236
2336 236 -32 -57 2 -200 -86 356 160 -154 41 24 178 118 185 185 -105 11 343 201 7 330 -156 84
2358 84 146 163 138 176 104 89 -53 -44 76 168 -27 152 171 -144 44 -29 -142 277 -27 -40 21 246 32 -435 135
2383 135 -98 122 -5 -160 142 -16 195 142 -135 35 -2 165 82 28 -158 -248 -17 170 137 -15 -152 -21
2405 -21 -95 -301 -13 -207 319 -49 215 -184 5 119 -83 -165 130 157 -226 118 -130 134 -9 102 169 173
2427 173 245 147 -281 -61 156 129 -39 61 12 70 125 138 -146 -80 -22 -42 77 -27 6 -59 55 -88 -19 139
2451 139 -152 225 -206 130 111 204 2 -116 -17 6 100 -103 44 103 -269 7 -162 3 107 -172 216 -215
2473 -215 -27 187 271 33 126 33 78 -70 149 -28 -218 -71 -93 -36 60 50 -250 64 210 65 208 -20 53
2496E3r9M3L5j50R2K76k79N1j1K29j73l9j47K41j41Q3j92J01M1j51O5N4k78N00
2520B04j92M1J54j39L8Mn9J49l18o5K50j24Q5p1K78m61L00l9q4k0P8j55R9O9O8
2545I0k0j21K96k82N5o7P9j12L59k63j48J69j55o8J62j38P8l2L18l19J33q0L32
2568B66l52m2L9o0J86j2L8j71J42j51K05M5k46K31j57J97j1m06L57j39J29l9N1
2591A00j92J54j23M8N9j00p2K34k43K16o7M9J68l28K09j73q8R9J17m4p3j2n6L12
2615A94k63R2K01l27J65k31o1L31l00R9J21k20J45l6p1j84O03k84lj36j42M75
2637A68j89P4p8J11n8J7J17j04l30L13P4j6J20l16J00R4j54K9j12J14R2p2j05
2660a11K84j18J35j38j27K45j97J77j00K31k56M4j1J63m13K07J82n00M77j99o
$$ plain form
2496 53 -46 -3 32 -118 -26 250 -29 22 11 240 67 28 -119 122 -19 64 -128 -27 14 -137 -72 -18 -296 204
2520 204 12 53 207 68 106 110 51 200 -118 -183 67 -57 28 -43 235 -226 74 35 -49 -69 9 -146 -47 22 90
2545 90 70 -51 245 -37 18 -49 30 -82 277 14 -134 35 -120 -188 -26 -164 -86 -118 200 -119 14 -66 266
2568 266 -86 -128 -89 -149 37 25 63 -108 34 -117 88 133 -113 118 -39 158 147 -259 98 -41 88 49 100
2591 100 -92 62 -61 -13 46 -54 -126 108 -135 81 14 63 231 -97 112 -61 -149 -50 67 23 -50 -62 -118 194
2615 194 -69 23 224 -103 62 -169 -230 101 -199 -100 21 -199 -54 -90 -161 -345 258 -26 -29 -165 -307 168
2637 168 -21 53 -25 86 28 45 162 58 -272 41 115 99 219 -97 3 97 -57 -28 -140 -26 66 -6 -111
2660 -111 173 55 190 52 -75 170 -27 150 50 281 25 69 58 221 -192 15 197 -303 174 -25 -31
2681c1J5m4r9mJ93j33J9J89l11N1JJ48R1q2M8k18J91o4j41L6m1K73k2J64k62q3
2707a16N3K25j39r4p9J7K42j17J7Lm9R6Q8k26J07Mk14J84P5p0l26M41j30P3j81
2732a16L3Q2J83k38l12L81J73k77K92l58N6O5O5J3n6M9L6j22O9N9l68M22j07j
2756B3J77p0k83L3o1K59k39L22k14K02j81O3l11P1J79l00M96l2k65L23j45L6n6
2779B7o4mk55N36p6k52O5J23J64j14l17L9K6j45M05l9j27k73L25p7K46l09k1K66
2803A49K8k12p3N4P4r2ko5J60j55L43j97M0q3n6J48J46k47q8J02j33L32k71k00
2827b98L42R9l1j21N5j6j79K55l5J6k44J06j9j59J44J29M4j14M8k6J22j51j6j03
2851a52J40O5m2m2M9j58J21o4J99K3k69L00j62K36rk01k39K54m4j02L90m08M4
$$ plain form
2681 -31 -16 -60 -159 -163 30 -103 -84 105 -206 -155 -154 -6 85 3 51 -167 24 -40 -181 -145 -186 87 65 229 -33 -116
2707 -116 -63 162 23 -71 -150 -133 109 -8 9 12 -37 59 147 -79 28 32 -182 2 77 7 -319 122 -8 65 -116
2732 -116 -83 -1 182 -56 -368 13 186 -91 201 -157 -101 -36 29 42 -14 35 71 -51 18 77 -291 131 24 23
2756 23 200 130 -153 -120 -181 78 -161 161 -53 149 -32 31 -280 -209 -30 -330 166 134 -131 192 47 83 27
2779 27 -37 -41 -296 240 164 -88 -23 100 264 150 -167 -128 -102 -247 158 119 -8 -281 44 -33 213 -96 -117 149
2803 149 177 -35 -108 -54 20 -72 -74 -139 21 -134 209 12 52 -31 -87 61 207 -40 -128 -26 -159 173 -98 -298
2827 -298 44 143 112 -9 46 30 -149 106 71 87 -157 -51 -70 -229 -85 44 88 -26 22 -4 118 -33 -49 -152
2851 -152 -12 53 11 -31 18 -140 -19 -83 116 139 -130 170 8 244 235 34 -205 49 5 -97 293 -115 -71
2874g1O6q9L89j77K51k69J83k23k36J37J3K57j07pj41n8L3J32j91n7L13j64m4
2897f0kQ6L9k53N2R7pK61k6k73K13k96jKJ67P1n2n8J21j76Q4j84M21k74l24K55
2923a17R0J95k20N9J18J56m07J57j50K86k38M5J78L8j33k71K27j19J31K92k67
2944E0q0j54J75J17j95K08n5k27J5K03j03J39R0k19%N8n7K58k07J00J5j10J5j17
2968h1K67R1k53j17j07K72k14M1N4M1j38k8L45j77J45j61j74K55J91k36l3j70
2990a87P8l9J85l5j76M34k80o5l2O3k7p2J09J8J66jp7j72n4K61k14J53J60k25
3014b9J48q8r5J24k85N14l72J68k73L38k33j87J89J78j63%K29l0q3J63j73L5m6
3037B9q5o5K56rq8K9j88K12k1j92J13N1K5K70k77Qj93R8J23Qj84o7L30r8jk0P6
$$ plain form
2874 -71 -5 -94 295 118 369 100 283 60 -176 -39 -26 231 124 117 -24 -82 -49 83 -108 -165 148 -16 -60
2897 -60 -62 24 63 -190 -138 -41 -48 213 187 -86 127 -169 -170 -168 -1 70 18 -40 81 -95 -11 -195 226 -48 -372 -117
2923 -117 -27 168 -52 7 125 281 -126 31 -119 167 -71 -26 152 190 57 -214 13 -106 25 317 50
2944 50 -30 -184 -9 108 -87 121 66 -161 -146 57 -46 93 183 -36 -36 22 -35 223 16 116 131 21 36 -81
2968 -81 186 277 24 -93 -200 72 -142 -101 -47 -6 -144 -172 173 -4 141 -20 -194 61 252 16 -17 -187
2990 -187 -109 -148 37 2 -174 260 -20 -85 -117 -54 -81 -153 -44 -26 140 139 62 -110 -164 97 -117 36 196 -29
3014 -29 119 31 -64 60 -225 289 -83 85 -188 150 -83 -270 -81 97 -66 -66 163 133 50 213 40 75 29
3037 29 -56 -121 135 126 38 67 -121 91 70 -122 -9 42 67 337 60 68 -125 -27 96 104 -80 -147 183 85 84 64 140
3064A40k14J54J0o6j98J66P3j94Q4j37K71n7RJ20j44O7j67J99j04N6J8l62O6J71
3088c9K45k64R5l0j43J67N3q8R7j20Q4k52M88j69j29M48l22L4l07K93Kr3k53M5
3112a58J07j3Q8o9K89l67R7K3j34M27m34K11O3O4l24L68l03M9k6p7K33j4j89J16
3136B7l7k42K50P5k16J50K28l64L73n30L71k0k14K18j19l84K39K49l6j10J07o0
3158d5M1K3p9J2j2J73l62J30J23j60K21j34l1Q0j6j12K3J23K34j90n4J54J28k23
3182D7k35L79l0q0k58J06l1K75j51m4j37Q2O6N3j05k1Q2J09j16J24k30o1K99j16
3206Gj71L30k54J21k38M15l01Q1N2k0J47j92k97J90K37j72R7j02lj63Q1J80J28
3229A53k1k19j46K11p8K85l48J91L7j23No8K5M43M3k65Q0j10j92J15m1O1n5jl2
$$ plain form
3064 140 -74 80 90 24 -174 -8 65 -129 -45 -182 89 32 41 161 17 84 -83 116 12 68 86 -276 -210 -39
3088 -39 206 -58 37 7 -136 31 84 -4 93 -27 57 -195 293 124 -5 443 121 155 -152 141 143 50 -203 -158
3112 -158 -51 -64 24 -45 244 -123 -26 -3 -137 290 -144 67 130 194 -130 238 -65 -16 -42 -119 114 100 -89 27
3136 27 -10 -252 -2 73 -143 7 235 -129 244 -286 85 65 -149 69 -50 -434 -195 54 18 -92 15 -45
3158 -45 -4 19 -60 -48 -60 113 -249 -119 4 -156 65 -69 -100 -20 -36 -148 -125 -2 232 42 -12 142 270 47
3182 47 -188 191 161 81 -177 -71 -102 173 22 -22 -159 -77 -11 42 -63 -84 -2 107 -9 115 -115 -176 123 7
3206 7 -164 166 -88 33 -205 210 -91 -10 42 22 169 -23 -320 -130 107 -65 32 -70 -73 -236 -155 25 153
3229 153 132 -87 -233 -22 -100 185 -163 28 65 -58 -53 -121 -96 347 390 125 205 95 -97 18 -23 38 -17 -18 -50
3254e0K1j2K2K57k92J81J03k18m48M19r2J30J94k48J17Q0q5k95J48L45k00l12
3276b35J57j74J46J01J62k12J0j3R0N2N9l29K17L6J82k44K8j1j65jP4Q5j75K41
3300H1k09Q7j20K14J29l18J91k08K95k52r5J71M7o5R9j27J72k8k2R5j74j41K56
3323G8M5j82K1J02Q5Q6j52j24j27J52J3k8J85k30J98n8p9J68k19QK06o8k76J13
3347h3K15l49J65MK7J09j84J45j37K00j28K2kQ7m80M37M2j11j29o7K03j34L3j68
3371b83J13K71l13Q1L1O3N0nM9J73j40j21j3l9J69m1l24L54p7K00m25J21M4j20
3395a82K50k92L44n9K8j76K32k30J07J62l6j16q1O9m11K98J32L42o42K25r1J95
3417F8M3j31J00k66J80M7n1R5j93J06n7J2o8K0M0o1L9K55k40K15k17L6J20k16
$$ plain form
3254 -50 -29 -41 -19 238 -54 127 230 12 -436 -17 -109 21 215 -33 84 164 79 -216 -68 277 77 -235
3276 -235 -78 -252 -106 -5 157 -55 -45 -58 32 84 143 -186 31 67 249 5 33 22 -143 -144 -70 15 -160 81
3300 81 -128 -41 -161 53 182 -136 55 -153 142 -110 -205 -34 13 -52 47 -80 92 64 42 137 -37 -178 78
3323 78 123 -59 -38 64 149 235 83 -41 -168 -16 -3 -31 154 -76 122 64 -15 153 -66 -58 148 80 -196 -83
3347 -83 132 -217 -52 -48 -21 88 -96 49 -88 112 -16 6 4 91 -389 48 90 -21 -150 -217 -14 -148 -115 -283
3371 -283 -170 101 -212 -131 -100 -37 13 8 57 230 90 -31 -44 -83 86 45 -279 75 -2 198 -227 -106 -62 -182
3395 -182 68 -224 120 61 89 -87 145 -85 22 184 148 32 -49 20 -391 -93 39 381 -261 -36 -127 68
3417 68 111 -20 80 -186 -6 41 -10 85 -108 -2 -59 -47 -115 -95 -55 -116 -77 178 -62 153 -64 -28 92 -124
3441a24L09l71L06j31J29j67J42k06K43k23Q2q2J10r5M03k42j70J69j19j59M17
3462B21k95J10j04p3K15j17O1l09K70J25k35L90l13k61L79j46L8k5j56J96K41
3483B12k74L2O2J26J23k89J47j04M6K42k48j28J71k26K31m5l45J37K11m58J84
3504a93M25l07j11K55j29j23L67j65rj9O3K50j05k66J82j55PJ64j32j05J49j79
3526a36J98k59J26jJ15j92j00J88l5K16k5k6R3Q0l49J58p8j02N4J98M1j69J57
3549A52q2R9J06k55q6K84j97j35J04QM6J13q7O3kK2r6M4o3o0N2J28j05J37j24
3574F6J7K94m64mK62l57K98k71L42j28l3K06j11j78J14J40j35J34l47J51k12J84
3596c2o7L4Q6K1j10J32j08j08q2J42J15p3J53r7J7m9k29K08J56k86L36j55J42
$$ plain form
3441 -124 185 -186 120 -11 118 -49 93 -113 130 -93 -11 -93 17 -78 325 83 -87 82 -37 -196 221
3462 221 -74 36 -68 -141 74 -43 18 -291 -21 104 -131 259 -54 -315 64 -82 -44 -69 -225 -29 212
3483 212 -62 -30 32 158 281 -8 139 35 81 323 75 -53 118 -108 123 78 -267 -130 81 -377 -193
3504 -193 232 -75 -186 69 -60 -183 184 19 10 -9 54 304 199 -67 115 -40 -33 131 -1 -106 43 -136
3526 -136 62 -197 -71 -72 43 -149 -249 -61 -96 120 95 69 162 242 -107 51 -27 -129 -75 123 164 -5 152
3549 152 70 169 275 20 -66 218 21 -114 -10 -2 44 157 70 133 131 153 57 101 38 -22 30 158 53 190 66
3574 66 83 377 -87 -91 171 -186 112 -159 183 55 22 228 117 -61 53 193 58 192 -155 -4 -216 -32
3596 -32 -99 -65 21 42 -68 64 -44 -152 -234 -92 23 -50 103 6 23 -26 -255 -47 109 -177 159 4 146
3619A46j9np5j64J30j3N9n4M1r8J38j08J20j96N8k2J01r5k8K9K09l75L68l07L82
3644B22j12lj17oJ30pq9j77MK32j2k84L58k20j5J58O0k1L0j06j11K38k9l31o0
3669b68k2M17j10K3K24j78L7n8j0K4j94L02l03P7j06o4J98LK32k69J75j66j5n7
3693a08K28l16Q8K21n6k78J80J28k5nj8O7k47J27j68K96L4p1n2k2m6k7J17J4j03
3718d2K01j54n7j18M4K59k89N5p3J66K53k47j87L35o1k59O04l76k54M23j42n3
3740B8q4O7N5j9J40j38r6qJ59j45k44N61k46p9r6J1L94k14q4Oj24L50k35q9K14
3765H4qj03J27J5j60L03l82O6J16j13R1j56J66j62K74l38J81J45Q2j33k07m2L2
3788a22J23%l5O6O2J22l13j28Q5L57k16r3N1n3R9J88k09J6J29K9l37K31M0n9P0
$$ plain form
3619 146 127 122 47 -117 13 0 59 5 46 -52 86 -22 98 -98 -40 -62 39 -56 -84 -55 154 -221 147 -160 222
3644 222 110 107 -10 -16 114 107 18 -159 -155 77 65 -219 139 -81 -96 62 122 101 131 25 -86 152 123 -208 -268
3669 -268 -290 127 17 40 264 86 123 65 55 79 -115 187 -116 -39 -145 -209 -11 -8 224 -45 130 -36 -51 -108
3693 -108 120 -196 -108 113 57 -221 -41 87 62 57 39 106 -141 -14 -182 114 148 77 25 3 -43 -70 47 61 -42
3718 -42 159 5 -52 -170 -126 133 -156 -101 -174 -8 245 -2 -189 146 85 -174 430 54 -200 223 81 28
3740 28 -56 11 66 47 187 49 -47 -55 104 -41 -285 276 30 -49 -145 -134 260 46 -38 -32 -156 194 -41 -130 84
3765 84 76 -27 100 115 -45 258 -124 -58 58 -55 36 -120 46 -116 158 -180 1 146 228 95 -112 -154 -122
3788 -122 1 1 -34 32 94 216 -97 -225 -140 217 1 -92 -41 -94 5 193 -16 0 129 158 -179 52 92 33 103
3813A03j90K05Lk62J85L0p0k61K97N9j83J24N0L4j98J02L6j10R8m5L02j98j09
3836Bn9j60K49J91j71k66J61q7L03j66J9J03q8n4Q2j20K3J83k02J42J24k27J73
3859A55l86K48o3m7J22K0on7pL66k99k25J29N7L2o0M7r3m8J87k49K10m8j15N9
3884g1o7L3L7L9o6n6K44j36l5J07P9K5j48N8R4j61m2N9J73k32J28l4L4p7K61l21
3910g5k08N7M65l14R9O1j15q5K7J35k65Q4J17K36m72K78k54J01O6P8L5k09J16
3933d2k24K50k79J01J64j04K17k13K75j81J75q9r2J34k34O5J36n2O0J22j46k21
3955a78K36n2J20J23k54K10k79K2P4j40K32j43q8K24j83J45q8j05k0K48P2m03
3977b27K86J80j81p0j31k55N32K33j22k77K13l78J63J90Lp5j19J29j85O5J21k
$$ plain form
3813 103 -87 118 121 -141 44 74 4 -257 40 99 -84 40 90 124 -74 28 64 -46 52 7 309 111 2
3836 2 -57 -217 32 223 52 -214 -53 -140 163 -3 16 119 31 -23 59 -61 -38 145 -57 85 209 -18 155
3859 155 -231 17 -46 -93 29 49 43 -14 -21 345 46 -179 -50 7 39 -21 26 -67 -115 72 -177 33 -15 -130 -71
3884 -71 -138 -105 -68 -29 -95 -151 93 -43 -78 29 108 133 -15 43 137 -24 -66 -7 166 -66 62 28 62 -15 246 -75
3910 -75 -283 -226 239 -75 24 85 -30 -115 -88 47 -218 -134 -17 219 -253 25 -229 -128 -62 16 51 -158 -42
3933 -42 -266 -16 -295 -194 -30 -134 83 -130 145 -36 139 50 -42 92 -142 -77 59 7 67 189 43 -178
3955 -178 58 6 126 249 -5 205 -74 -52 22 -118 114 -29 -117 107 -76 69 -19 -124 -144 104 176 -227
3977 -227 59 239 58 -12 -143 -398 134 367 245 -32 181 -197 -34 156 159 84 -35 94 -91 -26 95 93
3999I3j17j48J20p9O5P8P4j59j47L30j21K32l36Q7O0j0o5j17K25Pj23J52k19J64
4023D6J8q3N0J70j37l07J88K07k06j0p4J05j25J15J21J35m54J80K75l76L98l68
4045a32M80n56K17m8J21j8p0p8J80j30k47L40K70m40l02L62L6j1m6L11l34k7J91
4068F9J70k10N5j95N5j42M6J08R4k42K25j65J20n1J6R5r1P3k09P3oK81p3k80j14
4093b98K28M9O6k6P1j12j84L00j05O5%j31N0J81j42J7Lk0p7J41l05L58o9P5q0
4118E5p1Q6J49j50j03j7Q8m4L11j75j53j47K52K39j32m7l57L97n4j50m21N04J3
4141G3l0Q8j8Q9k2k38Q2J8O7j32K22m2k52O0Q5o1K4R8j57K05j88JJ8K90l21K7
4167a4j54M02m84L56p7J31j72l3J77k17R0k52L81j87K32p7m1J23k10j4KJ81n8
$$ plain form
3999 93 -24 -172 -52 -131 -66 12 86 -73 -220 110 -11 221 -115 -28 32 22 -43 -160 65 72 -51 101 -118 46
4023 46 64 -19 31 201 64 -243 -55 152 -54 -64 -138 -33 -158 -43 78 213 -241 -61 214 -162 236 -132
4045 -132 348 -208 9 -39 82 64 -6 -84 96 -34 -281 59 329 -111 -413 -51 -15 -26 -72 239 -95 -122 69
4068 69 239 29 84 -111 -56 -198 -152 -44 50 -192 33 -132 -12 -63 -47 48 -43 30 -179 -106 -112 169 96 -184 -298
4093 -298 -70 -21 45 19 90 -22 -206 94 -11 54 54 -77 -27 154 12 29 32 12 -65 76 -229 129 60 135 55
4118 55 -16 70 219 69 -34 -51 37 -7 304 129 -24 -171 81 320 188 141 -216 181 127 -23 -444 60 73
4141 73 43 131 113 202 180 -58 24 42 109 -23 199 157 -95 -35 50 -11 13 111 -46 159 -29 -28 -10 280 -41 -14
4167 -14 -168 234 -250 106 29 160 -12 -45 132 -85 5 -247 134 -53 179 102 61 184 -26 -40 -38 143 85
4190H5l63K87L3J67k45Q7jL5O3l04J74K12r8j28Q0j35m7J42o7J34j43J78k99L76
4214B23l95J98o3J44j35J21j9k01Q6o1K59R4k04j09J82j76o5J09k08J50K54r3
4236I1r3m4J57j38q0K40k64K92l18K58P0k6o7r7M3J02j12J02j60mj04M3J29N4
4260G4j70p5m7J50K62j29j90J99j3K27m78J59o8J75Q0n08K97J07j18k47N24j43
4282F8j70J13M4j09OP6J58k40p0J56n6N9j10Q8K6K8Lj60q6J52M1r7L2J69j30J25
4308A16l03K76j07J01m4j22L7j76K47J76m24K13J27l62K18j01J31pJ4O4k36K78
4330A16r8J11Nj23K49l17m6J40n2J4o4J7O2l3k6M4p2J6K21p4J90l79L81o1l13
4355i2L08r0O0l38r3J75J96N5m53L00j6n3R2j31J7p6L9N0j12J92ok00J39J87j00
$$ plain form
4190 85 -278 9 42 209 -36 51 50 85 148 -156 18 230 132 4 84 -51 -98 44 -23 111 -32 146 -153 223
4214 223 -172 26 -37 107 -28 93 74 -127 -41 -102 157 251 47 -62 120 -56 -121 -12 -220 -70 184 91
4236 91 -2 -46 111 -27 -107 133 -131 161 -157 101 171 145 78 -19 24 126 14 116 -44 -48 -152 -109 20 74
4260 74 -96 -171 -218 -68 194 65 -125 74 61 288 -190 -31 -99 76 156 -352 -55 52 -66 -313 211 68
4282 68 -102 11 55 -54 -48 28 186 -54 -124 32 -24 35 -75 13 39 67 70 -90 -176 -24 17 -80 -48 121 -9 116
4308 116 -187 89 -18 83 39 -83 -46 -222 25 201 -223 -10 117 -245 -27 -128 3 -4 10 74 -162 116
4330 116 18 129 134 11 260 -57 -103 37 -15 -1 -65 -48 14 -19 -45 -1 -73 -57 164 90 280 -99 282 221 -92
4355 -92 216 126 186 -152 -245 -70 126 181 -272 28 12 -41 51 -80 -63 -139 -100 -50 -162 30 24 -176 -37 150 50
4380E0j30j0K71j41L0j7n4j49O4N4J32k16M50n90L14n2l27L86k80L74l40J44K95
4403B58k22n5L4pK09j17nr0Pn4k23R1J72J80j78J61p4n1l3j07L49m14oJ74j52
4428a53K14j7K7o1k22L16j55J53j66K89k7l84K90j43j55N7R7J9L9Qk41R8L03j56
4452C0J99j32k66j2J40l5R0l2j24L38o8j45k1o7O4J54O1J22m16J6L46l75J94j52
4476i1j2K97k08J48l14K77k48K88k02l1n8K62k71K24n7J00j68n2J69j49n7K12
4498E9J0j97J70j46K36k05K45j44O6j16J3L0k18J00J11J23q6o3k8k9J49j88q4
4521a92L14m0K8l11L47k69l5K65k1j29J21r7p6J12J33m72J97K35k31P1r3K9j86
4544c00M22j33m8o5J61J74l40L34q8r7k40K55L7j52q7j0L53j14J80m41K34k88
$$ plain form
4380 50 -80 -90 181 40 70 53 -1 -150 -86 -32 100 -116 334 -256 58 6 -321 65 -215 159 -181 -37 258
4403 258 36 -19 15 8 217 100 95 5 12 -42 -265 -174 -2 178 0 161 87 36 3 -104 245 -169 -175 -1 -153
4428 -153 61 44 71 10 -212 104 -51 102 -64 225 198 -186 104 -39 -194 -137 -40 -21 18 26 -215 -117 186 30
4452 30 229 97 -169 -181 -41 -76 14 -18 -142 196 128 -17 -38 -105 -41 113 174 296 -120 -104 242 -133 61 -91
4476 -91 -103 194 -14 134 -180 97 -151 137 -65 -96 -154 108 -163 61 4 104 -64 -116 53 -96 -153 59
4498 59 69 -128 42 -104 132 -73 172 28 94 -22 -9 21 -197 -97 14 137 51 -12 -40 -69 80 -108 -192
4521 -192 122 82 110 -201 146 -123 -158 107 86 -43 78 -19 -95 17 150 -322 -125 110 -121 -50 -143 -114 -300
4544 -300 122 -11 -59 -124 37 211 -129 205 117 20 -220 35 72 -80 -167 -177 176 62 242 -199 35 -253
4566b53Q3K70n8j97J52R7p1j59P5m2m7K2Q7P8k8l24K79p0P3j9L8r7J39j32m3K21
4592G4m0p3J21j97K12J78mj35J0m9l7j77K37o4Q3j07M7rj09K84k43J48k11J12
4616E1J03k21l6J79P1J10l51N8J42l55L12J8k19O9k82M41r5l1O8L0R7k90L16l03
4640a18J00p7K3M5M7k50K26J04Jj36p4K16j12n3J78l98J14R5J1J98r2q5j78J09
4664a06m8Q4K45j40j03J52j24J08j02K12k25O5k03J82j84O7P9k50N33k07j39J98
$$ plain form
4566 -253 -170 100 42 -155 -3 94 23 -136 -61 -103 -150 -128 -41 37 9 -315 -36 -106 -33 -52 -14 -111 28 -104 -147 74
4592 74 34 -39 82 -115 97 275 271 136 146 97 60 -117 120 56 139 32 79 70 -39 245 2 150 -61 51
4616 51 154 -67 -103 76 147 257 -94 -36 106 -249 63 81 -138 -69 -351 90 -5 -36 32 62 159 -131 185 -118
4640 -118 -18 -95 -72 -27 20 -230 -4 100 101 -35 -109 107 -5 -58 120 -278 -164 -69 -58 140 48 -37 -215 -106
4664 -106 -154 -70 175 35 -68 84 -40 68 -34 178 -47 18 -185 -3 -187 -120 -41 -291 242 35 -104 94
$$ [...]
8191b12
##END NTUPLES=NMR FID
##END=
