##TITLE=1H_LR-758-R4-KA1C2-CR2
 CCl4
 8 sc, 
 28.9.2023
##JCAMPDX= 6.0         $$ Bruker NMR JCAMP-DX V2.0
##DATA TYPE= NMR FID
##DATA CLASS= NTUPLES
##ORIGIN= UXNMR, Bruker Analytische Messtechnik GmbH
##OWNER= root
$$ XWIN-NMR		Version 3.5
$$ Thu Sep 28 13:45:43 2023 Russian Standard Time (UT+4h)  she@DPX200
##.OBSERVE FREQUENCY= 200.13135
##.OBSERVE NUCLEUS= ^1H
##.DELAY= (6, 6)
##.ACQUISITION MODE= SIMULTANEOUS
##.ACQUISITION SCHEME= undefined
##.AVERAGES= 8
##.DIGITISER RES= 18
##SPECTROMETER/DATA SYSTEM= spect
##.PULSE SEQUENCE= zg30
##.SOLVENT NAME= CDCl3
##.SHIFT REFERENCE= (INTERNAL, CDCl3, 0, 15.7039)
##AUDIT TRAIL= $$ (NUMBER, WHEN, WHO, WHERE, WHAT)
$$ ##TITLE= Audit trail, XWIN-NMR		Version 3.5
$$ ##JCAMPDX= 5.01
$$ ##ORIGIN= Bruker BioSpin GmbH
$$ ##OWNER= she
$$ F:/spectra/data/she/nmr/H-F/1/audita.txt
$$ ##AUDIT TRAIL=  $$ (NUMBER, WHEN, WHO, WHERE, WHAT)
(   1,<2023-09-28 13:44:06.92 +0400>,<she>,<DPX200>,
      <created by zg, POWCHK disabled, PULCHK disabled
       configuration hash MD5:
       00 E9 B6 7A A2 85 ED C7 34 08 36 98 17 FE 4E 26
       data hash MD5: 16K
       03 74 7C 30 97 8C 09 08 12 19 6E A8 54 D5 A4 EB>)
$$ ##END=
$$ 
$$ hash MD5
$$ 74 29 0E 7D 60 B7 2B 54 1A 47 FC 58 54 55 8E 57
##$RELAX= 
##$RELAX= 
##$RELAX= 
##$RELAX= 
##$RELAX= 
##$RELAX= 
$$ Bruker specific parameters
$$ --------------------------
##$DU= <F:/spectra>
##$EXPNO= 1
##$NAME= <H-F>
##$PROCNO= 1
##$TYPE= <nmr>
##$USER= <she>
##$AMP= (0..31)
100 100 100 100 100 100 100 100 100 100 100 100 100 100 100 100 100 100 
100 100 100 100 100 100 100 100 100 100 100 100 100 100 
##$AQSEQ= 0
##$AQ_mod= 1
##$AUNM= <au_zg>
##$AUTOPOS= <>
##$BF1= 200.13
##$BF2= 200.13
##$BF3= 200.13
##$BF4= 200.13
##$BF5= 200.13
##$BF6= 200.13
##$BF7= 200.13
##$BF8= 200.13
##$BYTORDA= 1
##$CFDGTYP= 0
##$CFRGTYP= 5
##$CHEMSTR= <none>
##$CNST= (0..31)
1 1 145 1 1 1 1 1 1 1 1 1 1 1 1 1 1 1 1 1 1 1 1 1 1 1 1 1 1 1 1 1 
##$CPDPRG= <>
##$CPDPRG1= <>
##$CPDPRG2= <>
##$CPDPRG3= <>
##$CPDPRG4= <mlev>
##$CPDPRG5= <mlev>
##$CPDPRG6= <mlev>
##$CPDPRG7= <mlev>
##$CPDPRG8= <mlev>
##$CPDPRGB= <>
##$CPDPRGT= <>
##$D= (0..31)
0 1.2 0 0 0 0 0 0 0 0.06 0 0.03 0 0 0 0 0.0002 0 0 0 0 0 0 0 0 0 0 0 0 
0 0 0 
##$DATE= 1695894246
##$DBL= (0..7)
120 120 120 120 120 120 120 120 
##$DBP= (0..7)
150 150 150 150 150 150 150 150 
##$DBP07= 0
##$DBPNAM0= <>
##$DBPNAM1= <>
##$DBPNAM2= <>
##$DBPNAM3= <>
##$DBPNAM4= <>
##$DBPNAM5= <>
##$DBPNAM6= <>
##$DBPNAM7= <>
##$DBPOAL= (0..7)
0.5 0.5 0.5 0.5 0.5 0.5 0.5 0.5 
##$DBPOFFS= (0..7)
0 0 0 0 0 0 0 0 
##$DE= 6
##$DECBNUC= <off>
##$DECIM= 32
##$DECNUC= <off>
##$DECSTAT= 4
##$DIGMOD= 1
##$DIGTYP= 9
##$DL= (0..7)
0 120 120 120 120 120 120 120 
##$DP= (0..7)
150 150 150 150 150 150 150 150 
##$DP07= 0
##$DPNAME0= <>
##$DPNAME1= <>
##$DPNAME2= <>
##$DPNAME3= <>
##$DPNAME4= <>
##$DPNAME5= <>
##$DPNAME6= <>
##$DPNAME7= <>
##$DPOAL= (0..7)
0.5 0.5 0.5 0.5 0.5 0.5 0.5 0.5 
##$DPOFFS= (0..7)
0 0 0 0 0 0 0 0 
##$DQDMODE= 0
##$DR= 18
##$DS= 0
$$ [...]
##$SUBNAM2= <"">
##$SUBNAM3= <"">
##$SUBNAM4= <"">
##$SUBNAM5= <"">
##$SUBNAM6= <"">
##$SUBNAM7= <"">
##$SUBNAM8= <"">
##$SUBNAM9= <"">
##$SW= 18.05172834244
##$SWIBOX= (0..15)
0 0 2 0 0 0 0 0 0 0 0 0 0 0 0 0 
##$SW_h= 3612.71676300578
##$TD= 16384
##$TD0= 1
##$TE= 0
##$TE2= 300
##$TE3= 300
##$TEG= 300
##$TL= (0..7)
0 120 120 120 120 120 120 120 
##$TP= (0..7)
150 150 150 150 150 150 150 150 
##$TP07= 0
##$TPNAME0= <>
##$TPNAME1= <>
##$TPNAME2= <>
##$TPNAME3= <>
##$TPNAME4= <>
##$TPNAME5= <>
##$TPNAME6= <>
##$TPNAME7= <>
##$TPOAL= (0..7)
0.5 0.5 0.5 0.5 0.5 0.5 0.5 0.5 
##$TPOFFS= (0..7)
0 0 0 0 0 0 0 0 
##$TUNHIN= 0
##$TUNHOUT= 0
##$TUNXOUT= 0
##$USERA1= <user>
##$USERA2= <user>
##$USERA3= <user>
##$USERA4= <user>
##$USERA5= <user>
##$V9= 5
##$VALIST= <valist>
##$VCLIST= <CCCCCCCCCCCCCCC>
##$VD= 0
##$VDLIST= <DDDDDDDDDDDDDDD>
##$VPLIST= <PPPPPPPPPPPPPPP>
##$VTLIST= <TTTTTTTTTTTTTTT>
##$WBST= 1024
##$WBSW= 4
##$XGAIN= (0..3)
0 0 0 0 
##$XL= 0
##$YL= 0
##$YMAX_a= 72042
##$YMIN_a= -68105
##$ZGOPTNS= <>
##$ZL1= 120
##$ZL2= 120
##$ZL3= 120
##$ZL4= 120
##$ABSF1= 10
##$ABSF2= 0
##$ABSG= 5
##$ABSL= 3
##$ALPHA= 0
##$AQORDER= 0
##$ASSFAC= 0
##$ASSFACI= 0
##$ASSFACX= 0
##$ASSWID= 0
##$AUNMP= <proc_1d>
##$AZFE= 0.1
##$AZFW= 0.1
##$BCFW= 1
##$BC_mod= 2
##$BYTORDP= 1
##$COROFFS= 0
##$CY= 11.3945322036743
##$DATMOD= 1
##$DC= 2
##$DFILT= <>
##$DTYPP= 0
##$F1P= 15.7292609196834
##$F2P= 12.9074282941183
##$FCOR= 0.5
##$FTSIZE= 0
##$FT_mod= 4
##$GAMMA= 1
##$GB= 0.15
##$INTBC= 1
##$INTSCL= 1
##$ISEN= 128
##$LB= 0.24
##$LEV0= 0
##$LPBIN= 0
##$MAXI= 10000
##$MC2= 0
##$MEAN= 0
##$ME_mod= 0
##$MI= 1.114404
##$NCOEF= 0
##$NC_proc= 0
##$NLEV= 6
##$NOISF1= 3.799351
##$NOISF2= 2.8
##$NSP= 1
##$NTH_PI= 0
##$NZP= 0
##$OFFSET= 15.70392
##$PC= 1
##$PHC0= -21710.77
##$PHC1= 12.85271
##$PH_mod= 1
##$PKNL= yes
##$PPARMOD= 0
##$PSCAL= 0
##$PSIGN= 0
##$REVERSE= no
##$SF= 200.130013532006
##$SI= 16384
##$SIGF1= 3
##$SIGF2= 2
##$SINO= 400
##$SIOLD= 16384
##$SREGLST= <1H.CDCl3>
##$SSB= 0
##$STSI= 0
##$STSR= 0
##$SW_p= 3612.71676300578
##$SYMM= 0
##$S_DEV= 0
##$TDeff= 0
##$TDoff= 0
##$TI= <>
##$TILT= no
##$TM1= 0
##$TM2= 0
##$TOPLEV= 0
##$USERP1= <user>
##$USERP2= <user>
##$USERP3= <user>
##$USERP4= <user>
##$USERP5= <user>
##$WDW= 1
##$XDIM= 8192
##$YMAX_p= 0
##$YMIN_p= 0
$$ End of Bruker specific parameters
$$ ---------------------------------
##NTUPLES= NMR FID
##VAR_NAME=  TIME,          FID/REAL,        FID/IMAG
##SYMBOL=    X,             R,               I
##VAR_TYPE=  INDEPENDENT,   DEPENDENT,       DEPENDENT
##VAR_FORM=  AFFN,          ASDF,            ASDF
##VAR_DIM=   8192,          8192,            8192
##UNITS=     SECONDS,       ARBITRARY UNITS, ARBITRARY UNITS
##FACTOR=    0.0002768,     1,               1
##FIRST=     0,             0,               0
##LAST=      2.2672688,     0,               0
##MIN=       0,             -68105,          0
##MAX=       2.2672688,     72042,           0
$$ Real data points
##PAGE= N=1
##DATA TABLE= (X++(R..R)), XYDATA
0 0 0 0 0 0 0 0 0 0 0 0 0 0 0 0 0 0 0 0 0 0 2 -7 8 -8 8 -8 8 -8 13 -15 16 -16 21 -23 24 -29 31 -35 39 -43 49 -52 59
43 59 -65 70 -77 85 -94 102 -113 125 -138 152 -168 187 -208 231 -261 294 -336 387 -453 541 -658
64 -658 832 -1097 1552 -2467 4946 -23077 -68105 2077 -26438 -20717 -35550 -42244 34081 10478
78 10478 10171 39280 23806 37264 7910 -12063 -17098 -39486 -18031 -15722 -22701 1605 14958
91 14958 21816 9702 -6005 6433 9445 -7360 -3280 7104 7764 6640 -6725 -10369 -11600 -17894
105 -17894 -8144 -4173 5339 18507 21309 26212 11243 300 288 -13121 -16018 -18615 -16720 -2722
119 -2722 590 -1984 4398 14498 14514 16546 12752 7055 14320 -5005 -18699 -16434 -28179 -15921
133 -15921 -12596 -8711 14717 15228 22900 18561 4439 7517 -5930 -8175 -12175 -13548 2840 -5612
147 -5612 -5134 -1385 -6395 2143 -5686 4 11997 6852 15011 7908 3275 2111 -13062 -8452 -12406
162 -12406 -12282 1367 -1641 7292 9290 4722 11087 2412 2192 4928 -2186 203 -4122 -6935 -7250
177 -7250 -11040 -5414 -1084 4225 11751 13826 16309 10942 963 -3924 -12721 -16565 -14363 -12753 -2876
192 -2876 3922 5995 10560 7855 6004 4499 -990 146 -744 -1228 -1620 -6087 -4706 -7528 -8037 -4189
208 -4189 -3263 4888 7106 8007 10057 4427 3005 -2878 -6353 -3098 -6032 -824 -491 -73 3440 -2464
224 -2464 484 -217 -600 5870 2163 5837 5153 -266 376 -7661 -6336 -3602 -4744 2616 3541 7317
240 7317 8613 1162 1397 -3128 -5933 -4131 -6288 -611 1499 -123 2872 -445 -871 546 -1546 2186
256 2186 2431 2935 4800 -852 -2959 -4265 -7244 -5244 -5039 -967 4266 3416 6191 4251 683 520
272 520 -2026 -854 -509 -527 3353 1043 -1358 -1821 -3465 -2197 -2748 -147 4069 4119 5254 3741 529
289 529 -1154 -3084 -2572 -2364 -629 2985 3982 2238 22 -937 -1960 -4123 -3626 -1251 1286 2042 1785
306 1785 1959 -304 -1403 -1086 -1716 -390 1384 2960 2241 -1187 -1718 -2767 -4706 -4287 -2970 1502 3384
323 3384 3329 4379 1541 473 -1014 -2832 -1997 -1367 1077 2776 602 737 49 -1209 -2206 -2354 624
340 624 2244 1830 2855 1135 -283 -1360 -2359 -2011 -1106 1792 4224 3433 2150 1628 -663 -3154 -5068
357 -5068 -3777 -1235 -753 628 1463 909 838 129 -308 188 777 2986 2024 180 -649 -2282 -3941 -5577
375 -5577 -4497 -1038 716 2609 3840 3842 2871 799 -547 -1783 -1520 -293 801 254 -464 -121 -1561
392 -1561 -2853 -2875 -238 2069 2799 4372 4384 2883 792 -1919 -3221 -4031 -3173 -283 268 2073 3067
409 3067 2854 2283 -150 21 247 -1413 -530 -1478 -1860 -1848 -3180 -1710 -1140 790 4244 4405 5049 3194
427 3194 1392 -1015 -5512 -6303 -5392 -4376 -1470 495 3018 4250 2654 2359 1232 325 956 230 840
444 840 313 -657 -911 -4036 -3895 -3021 -2295 743 2068 4238 5771 3560 3072 1129 -979 -1325 -3098
461 -3098 -1690 -1651 -1708 118 -1228 313 1061 1039 3395 2728 3104 2517 -1276 -2020 -4646 -5819 -4010 -3395
479 -3395 1199 3444 4638 5989 3337 2082 -1346 -4227 -3489 -4865 -2723 -1015 -1206 1816 617 546
495 546 1255 -56 1817 1568 1888 3046 773 478 -1729 -2902 -2949 -4029 -2075 -1090 -108 2075 1467 2966
513 2966 3487 2360 3439 2194 1905 728 -2627 -4017 -5485 -5600 -3977 -2510 2361 5103 6614 7218
529 7218 4844 2633 -818 -5281 -5862 -6175 -4263 -929 -38 3289 3929 3319 2593 -36 655 -906 -2009
546 -2009 -1287 -2213 -746 -1674 -2831 282 -1026 1151 2756 1593 3996 1836 981 282 -2282 -1100
562 -1100 -2318 -2086 -1076 -1922 277 -1033 -680 1877 1047 3513 4525 3823 4589 507 -708 -3011 -6319
579 -6319 -5754 -5559 -2256 669 1999 5829 5287 4396 3069 -1054 -874 -2811 -3482 -2131 -3055 -886 66
596 66 -915 50 369 2070 2091 566 2094 967 -264 -1182 -3235 -1559 -1645 -1826 1160 292 2184 2292
614 2292 49 973 -154 244 556 -1122 1263 30 -915 -1112 -3460 -1204 -1679 -634 3152 2640 4837
631 4837 4450 2232 1950 -2742 -2996 -3594 -5120 -2278 -2249 357 2318 1573 3977 2008 2326 2693 -350
648 -350 378 -1366 -2128 -1966 -4400 -2398 -1407 -688 1379 1338 3857 3079 513 705 -1263 -1639 -1579 -2467 -534
667 -534 -193 130 1129 -797 280 -42 -245 910 356 2143 1534 -390 27 -1629 -2000 -1984 -2134 974
685 974 1300 2339 3482 1708 1760 149 -1172 -803 -2614 -876 -975 -1293 341 -599 327 699 351 2251
703 2251 952 1605 1837 -748 -301 -2041 -2767 -1818 -2908 -158 298 629 2265 270 1326 367 -641
720 -641 613 -642 519 726 -630 465 -1693 -1035 -840 -1776 472 549 1695 2168 756 1136 -338
737 -338 -1150 -410 -1696 -9 345 479 1584 416 651 57 -1007 9 -531 96 769 -419 617 -718
755 -718 -1143 -301 -894 887 941 940 1867 321 351 -748 -2023 -1090 -2122 -1130 -7 -1 1436 516 83 669
775 669 -773 415 -125 301 1161 -156 322 -426 -1350 -671 -1301 -133 801 484 1494 354 200 88
793 88 -1204 -315 -462 350 1455 426 1439 626 -346 -237 -1341 -864 -481 -502 571 75 275 386 -352
812 -352 421 6 415 1180 527 1050 469 -820 -873 -1927 -1120 -673 -711 829 836 1196 755 -55 490 -722
832 -722 -526 21 -156 564 203 -34 -126 -827 -361 -530 -62 901 429 1184 428 -377 -362 -1264 -791 -184 -107
853 -107 963 896 1082 957 292 253 -273 -514 -157 -289 -40 -440 -523 -223 -909 -394 300 830 1879 1492 1766
874 1766 1020 -142 -692 -1853 -2053 -1903 -1651 -345 222 599 1315 869 703 295 365 707 -141 -134 -313 -1027
894 -1027 -1114 -1441 -1016 -774 -101 1162 1146 1393 1231 658 42 -1031 -854 -713 -695 -168 120 586 545 217 277
915 277 539 312 1090 794 182 202 -842 -1261 -1759 -1949 -615 -236 1046 1532 2024 2220 1160 506 -546
934 -546 -1480 -1603 -1965 -1866 -1179 -915 157 432 784 1428 1774 1238 1253 454 72 -999 -1467 -1831 -1831 -1053 -361
955 -361 365 908 1356 1301 1014 199 -23 42 222 85 295 -153 7 -650 -697 -1202 -804 -5 656 1409 1763
976 1763 1622 1372 -133 -926 -1315 -2156 -1535 -1058 -226 597 1235 1446 1412 1089 803 67 -329 -1076 -1704 -1537
996 -1537 -1825 -1271 -710 128 1139 1556 2055 1995 920 300 -621 -1537 -1780 -1872 -1133 -650 -51 803 496 452
1016 452 364 178 792 994 1103 940 571 213 -715 -1187 -1679 -1787 -1013 -408 234 1467 1739 1872 1585 808
1036 808 -104 -668 -1214 -1235 -1077 -729 -206 -18 549 504 1429 1168 1013 881 -288 -787 -1341 -2055 -1575 -1370
1056 -1370 -108 658 735 1729 1423 1087 688 -648 -471 -917 -959 -501 -816 149 -11 -178 117 -167 553 611
1076 611 609 998 914 701 225 -585 -897 -1308 -1129 -875 -662 -79 99 523 890 421 980 736 433 468 -231
1097 -231 -605 -886 -1553 -959 -882 -175 965 801 1432 1118 586 184 -692 -846 -1047 -1170 -262 -122 315 1111
1117 1111 340 617 301 214 4 -571 184 -533 -606 -11 -953 -470 -455 -352 356 262 974 989 764 1035 -83
1138 -83 -128 -363 -1029 -365 -446 -430 65 -159 403 489 419 875 408 1109 966 170 181 -1171 -971 -1340 -1115 -140
1160 -140 -214 496 921 494 620 -62 97 -124 -608 353 -153 -223 322 -245 -39 -153 -607 248 101 193 575
1181 575 -48 234 -392 -339 -256 -518 77 203 522 972 102 489 179 -285 0 -374 -316 -7 -256 104 -511
1202 -511 -206 69 -667 463 296 653 865 264 592 -109 -585 -395 -829 -183 -397 -266 194 -68 199 -50
1222 -50 -218 680 -325 497 160 -286 237 -452 -463 -469 -854 95 -268 234 801 -120 367 207 -514 195 -457
1243 -457 13 348 158 648 140 251 36 -419 199 -483 -311 355 -193 276 -112 -242 -4 -341 23 490
1263 490 500 839 160 329 -54 -814 -71 -522 -308 32 -97 419 -65 -103 215 -247 246 -24 -110 531 -158
1284 -158 89 402 -317 29 -323 -52 -9 -291 506 -83 -139 87 -524 -97 -452 -164 416 160 645 326 108
1305 108 331 -307 -10 -6 -303 181 -304 -316 39 -360 146 -126 -33 629 288 625 276 -237 129 -472 -257
1326 -257 -236 -606 312 -149 205 257 -174 408 -153 271 426 -97 306 -51 -81 -73 -416 -290 -214 -72 215 -59
1348 -59 498 656 -471 68 -493 -438 -467 -541 140 -85 44 339 58 37 58 -79 363 -60 320 42 -663 -45
1370 -45 -602 -336 -191 -165 530 214 712 1013 155 570 -138 -416 -321 -755 -393 -466 -750 -168 -203 229 233 343
1392 343 590 258 384 507 -374 -350 -622 -588 -526 -566 -46 226 442 642 247 431 185 -121 -54 -430 58 247
1414 247 -149 -60 -3 176 150 -152 394 160 419 374 19 -31 -244 -315 -340 -630 109 1 -159 622 371 447 424
1437 424 156 428 -79 -227 -486 -559 -459 -655 -454 -192 -73 637 1173 787 815 194 121 -418 -839 -812 -848 -553
1459 -553 93 167 481 275 181 309 278 150 113 33 -19 -280 -44 -380 -224 -223 -363 -137 144 384 483 244 329
1482 329 334 90 -3 124 -232 -215 -79 -172 114 -74 68 226 706 725 265 332 -130 -259 -772 -1020 -455 -802
1504 -802 -324 688 737 708 1046 341 366 -150 -194 -260 -444 -504 -351 -164 -42 65 105 132 75 282 462 276 229
1527 229 -118 -219 -316 -615 -431 -425 -109 114 191 151 123 20 296 289 376 47 59 156 -36 -477 -221 -219 -159 87 134
1552 134 756 352 406 287 24 -408 -550 -486 -670 -619 105 157 522 595 400 592 461 -56 -151 -375 -283 -545
1574 -545 -550 -357 -253 -144 377 395 516 763 306 364 -43 -74 -40 -270 -274 -224 -254 -138 -223 179 -20 -21 275 333 603
1599 603 389 80 88 -82 -311 -584 -491 -272 -43 157 434 502 221 64 -8 152 32 18 -180 -230 -213 -51 -173
1622 -173 165 41 214 35 364 155 -197 -66 -383 -190 -272 -578 -191 -83 266 -106 138 398 69 -52
1642 -52 118 -86 -67 63 -147 -154 -180 -256 -73 -65 317 190 96 473 310 315 231 -111 -288 -258 -199 141 -97 21 20
1667 20 26 -96 -104 284 -224 216 332 143 61 -166 -107 -57 -73 -50 -455 -151 -13 205 195 64 -157 -50 -216 145
1691 145 -307 -156 93 -5 167 310 62 76 71 115 135 -195 252 -301 -327 -22 -462 -2 21 102 452 196 -43
1714 -43 100 -219 44 -358 77 -14 -36 181 -219 -199 -9 -14 -192 -158 231 403 -130 105 -109 -238 154 -207
1736 -207 -203 -130 -395 396 -247 -37 3 -231 -188 -284 -186 -95 -33 120 211 66 185 -31 307 -79 -89 379 -321 -3
1760 -3 -169 -333 27 25 -119 95 295 186 312 300 3 -12 183 -320 -244 82 -165 236 5 41 265 -74 -156
1783 -156 167 -245 491 104 309 161 -224 107 -201 -146 372 159 213 -104 -121 187 -382 -71 -222 -93 54
1804 54 -101 160 126 -209 151 1 131 82 -244 168 -126 -174 174 -255 -178 -338 -220 92 -54 155 109 133
1826 133 444 60 43 -46 -329 277 -214 -28 202 -174 88 119 -132 267 9 291 48 -252 136 -435 -158
1847 -158 -66 -444 372 -102 437 166 -77 136 -30 -278 103 -574 -6 -65 -154 62 25 198 185 176 234 122 343
1870 343 173 -114 -150 -228 -313 -329 -461 48 207 -8 162 222 202 44 171 176 -110 -337 26 -389 -14 -371 -406
1893 -406 0 -297 -44 208 97 473 -44 326 -121 -119 25 -297 -48 -73 -306 -50 -194 153 121 -336 199
1914 199 -16 -158 -192 -165 154 -257 -76 -82 -138 -22 -6 241 200 -13 212 -182 -81 -465 -229 -45 66 -305
1936 -305 283 34 -75 -87 -16 272 154 444 218 39 -205 101 -47 21 -456 -182 -31 110 258 200 190 2
1958 2 171 155 -156 -30 -79 -176 -89 -219 -30 -9 183 224 99 73 271 20 -185 -195 -300 -59 -292 -347 161 -174
1982 -174 342 194 -171 285 15 -310 -99 -205 117 176 -11 -153 3 48 -172 -15 201 -98 97 95 25 135
2004 135 -27 18 -194 -302 -273 -25 27 105 113 353 131 -77 396 -55 114 -66 -98 -35 -418 -34 -56 -15 125
2027 125 -98 444 40 -88 138 -87 -262 24 -55 -80 -75 178 278 -19 46 -107 -66 -198 -61 50 -7 282
2049 282 195 37 -154 -194 73 40 100 -144 74 83 86 256 91 27 12 -74 -133 -386 171 -99 119 112 10 -221 178
2074 178 46 111 17 -204 -453 -91 -315 -173 -192 -93 59 -28 160 416 -19 -36 143 -175 73 86 -112 -50 -197
2097 -197 -38 -51 60 26 -37 157 75 -35 -75 -172 -34 22 -39 -180 83 -177 -98 -136 86 98 -208 162 -232 -4
2121 -4 -27 -160 -198 -71 111 35 -110 255 64 -46 82 -159 44 10 -99 -102 -102 -127 -181 72 -12 -80 -38 -163 1
2146 1 29 185 156 -174 84 32 -133 -259 -198 39 18 -259 383 156 203 45 142 324 47 10 159 44 -135
2169 -135 -55 193 11 103 156 187 115 -75 81 -12 -155 204 180 165 4 27 -49 -10 -188 120 -149 -267 -56 -15
2193 -15 105 -254 -79 -34 67 67 82 -187 -55 -94 33 263 -70 183 -11 -28 -203 -73 16 -96 40 43 235
2216 235 328 134 251 300 -51 208 57 -128 198 6 -104 50 -7 218 136 -84 112 -143 61 -50 -158
2237 -158 99 59 -78 -58 -193 132 190 -101 22 -243 -197 -15 -132 83 -66 38 -28 -38 40 112 -128 -65 162
2260 162 192 -168 -48 96 201 145 37 -97 -88 74 -151 -180 -123 96 47 189 -167 33 167 -54 -17 -4 -123
2283 -123 -289 83 7 33 243 138 -57 181 201 -112 -68 -119 -77 118 58 100 66 50 9 -293 -70 11 -53 283
2307 283 127 -30 146 -41 39 297 -11 193 154 -173 -104 -44 170 -132 -116 -159 33 -233 -144 178 89 -219 21
2330 21 85 120 207 86 192 38 77 2 -245 74 -150 -208 -5 75 18 165 90 223 -58 -177 135 -137 12
2353 12 45 -410 208 133 101 -39 -227 144 -86 48 -64 168 164 -172 -323 -283 -143 39 165 163 357 65 191
2376 191 -98 -171 -40 -241 48 -119 -204 51 -330 343 -58 -189 440 208 233 193 166 94 39 -414 28 -240
2398 -240 -63 -66 -95 50 121 44 92 -62 39 -41 33 204 31 -38 -84 67 -232 -283 114 -19 -45 265 -88 -132
2422 -132 -69 -348 69 61 -31 60 -231 -146 -10 24 160 -124 153 -230 -377 109 -214 -101 217 -113 -79 1 305
2445 305 140 -109 132 17 148 -44 -135 -40 -196 -7 46 -141 -43 92 -225 -197 125 -299 62 181 355 107
2467 107 279 80 -143 -129 -284 -271 -165 -152 425 -126 139 83 -195 114 -14 71 -101 -203 -37 140 6 -91
2489 -91 -163 -156 281 126 -139 -277 -209 -100 -138 -236 -160 85 -128 3 276 99 -107 106 197 56 41 -26 69 -184
2513 -184 61 1 -71 -34 -87 -85 158 178 369 93 -32 -34 -93 -103 -149 -38 204 175 315 31 -260 352 -64 187
2537 187 35 -98 -36 -53 -33 -35 20 -302 122 -24 -79 -98 39 141 184 20 -201 -26 274 -33 298 -27 -38
2560 -38 -76 151 77 -160 -135 -226 -285 -145 -115 -129 22 -54 -100 -116 -89 250 -130 182 224 -102 33 73 -81 -94 113
2585 113 -57 -44 70 6 244 -68 55 -77 -3 -6 -140 22 126 -20 84 25 30 -183 -41 -48 113 -365 117
2608 117 157 -183 62 -77 -211 194 -125 -175 2 -172 -40 -58 299 -157 45 -18 130 9 -324 -153 152
2629 152 25 -25 201 85 125 187 -18 -58 0 -108 142 -180 -108 -73 9 109 -103 -124 44 170 -136 107 -95
2652 -95 -36 68 -329 105 -123 339 -119 -31 -67 -116 140 -131 -228 -69 -142 37 89 -32 3 116 229 -1 435
2675 435 -157 24 -141 140 86 32 119 -148 123 -114 -176 76 23 144 -92 239 200 -15 83 53 13 -39 -39 -42 -9
2700 -9 -80 282 -194 141 -171 61 154 -219 107 -351 28 -279 -74 42 93 -111 -51 98 -8 108 -42 53
2722 53 -61 214 90 -60 -39 74 25 -3 30 -156 -12 101 -61 40 -11 -121 59 29 77 -11 5 109 -89
2745 -89 72 32 64 -158 12 -63 -159 56 119 -174 -129 41 -180 -46 -167 101 -139 -133 -186 -25 141 110 9 113
2769 113 -8 -309 -34 207 101 57 -119 226 -90 -186 -279 19 -138 -169 -209 118 197 -100 258 228 -145 -178 142
2792 142 17 -15 99 100 -26 -145 -123 350 -85 53 40 -176 40 146 199 29 -95 75 -32 -152 -46 -310
2814 -310 -109 -79 -24 -57 -182 2 36 64 131 -145 -119 -190 -79 -104 -190 -58 101 -11 4 -127 155 -136 -191 -39
2838 -39 -41 4 -132 2 -143 -7 55 -57 -114 31 -348 182 -29 -155 210 -17 -73 10 110 -368 70 29 111
2861 111 78 -80 144 -90 -18 221 158 -10 -37 -98 31 -5 -24 -72 77 202 38 174 -4 36 81 -67 -104 -126
2885 -126 49 100 164 -23 -345 -16 90 130 146 171 83 124 64 160 -26 43 65 -55 -45 130 -75 60 244 -114
2909 -114 8 107 -302 -83 133 -57 -51 37 -52 261 168 26 -129 -113 -29 -111 22 14 48 -156 -167 130 -110 1
2933 1 -1 11 133 232 -151 -17 68 251 58 149 -32 -49 36 -177 117 -177 74 -197 51 -68 -122 -257 30 -91
2957 -91 -182 -170 -208 -207 33 -44 93 -41 121 64 -20 164 40 28 39 49 -36 -232 199 63 -101 -70 -18 -79 125
2982 125 -71 268 4 52 -38 84 123 111 30 -113 19 237 -73 22 136 -40 -121 15 -90 63 130 -110 243
3005 243 8 127 28 178 -274 15 -38 75 -3 127 192 74 287 62 -50 81 -103 53 -128 45 -169
3026 -169 -36 -59 -115 6 -147 199 138 -63 -198 -68 -178 45 -43 -96 67 -122 131 111 -109 126 -41 165
3048 165 -53 -115 -115 -22 -50 -107 56 -9 44 -300 -38 -38 -166 -51 166 216 206 62 -52 -147 40 46 1 -79 3 110
3074 110 -28 162 -46 38 185 -123 -132 142 -65 137 -17 106 334 128 -16 82 -199 38 -55 -270 164 -173
3096 -173 128 89 -60 55 48 19 -277 -220 221 83 195 -97 207 214 27 -58 114 -222 -23 202 -250 85 -75
3119 -75 192 68 -93 -32 128 172 -134 30 -68 85 -61 -93 -22 -67 -71 93 -57 -148 -65 14 -90 172 3 210
3143 210 74 -200 221 -65 -139 -148 -43 124 -26 77 -56 25 17 185 30 -186 -87 -98 36 -72 40 41 194
3166 194 -183 -116 -72 -350 -113 4 -106 281 32 -38 -108 -230 47 -86 231 -129 -22 302 -62 206 -131
3187 -131 61 -186 71 -193 171 174 23 18 97 -7 -65 183 5 -20 131 82 58 -11 7 16 5 0 421 -31 298
3212 298 -134 -161 148 74 -7 -176 -50 -142 92 147 239 47 124 111 52 366 -38 -362 27 68 136 -76 -279 1
3236 1 -295 -39 140 -55 -141 218 179 -111 174 107 -79 -112 -78 -82 -291 -310 -56 181 -7 25 38 -17 -277 -89
3260 -89 7 -296 -35 40 40 -53 -220 -88 -27 117 -104 160 43 78 -56 105 351 3 85 -29 115 -320 -43
3283 -43 109 -190 69 248 50 219 -231 -94 46 -55 172 80 97 -45 32 90 201 -34 -166 -309 -177 -288
3305 -288 -58 49 15 -23 -33 -51 50 -119 87 -36 122 -7 224 5 68 -61 211 -141 286 -7 257 -144
3327 -144 -98 86 -118 24 109 -144 -189 70 -144 288 -115 18 -134 -67 -271 112 -185 77 -4 36 -113 -93
3349 -93 -283 61 1 14 169 33 -132 134 -175 -2 117 107 -10 66 119 123 10 98 93 167 -77 -43 168 62
3373 62 -304 -209 -173 147 212 -202 -8 -33 49 -49 85 77 26 -46 207 6 -192 218 35 35 -142 -125 193 -131 -5
3398 -5 -70 58 99 171 11 64 29 145 -81 53 43 216 296 -217 93 147 -53 -57 55 -117 222 -432 30 140
3422 140 -21 36 -151 -24 -282 -245 -19 265 46 185 97 13 -361 -10 -69 -25 174 114 93 125 -13 108 150
3445 150 91 169 274 -100 -310 -129 239 -61 78 -206 139 15 -6 -117 -22 -9 82 -200 -226 94 133 -126 44
3468 44 1 6 24 25 -16 75 181 -282 67 210 -28 51 80 61 26 -132 -189 -225 -48 41 279 -53 -38 297 7 83
3494 83 -66 -63 55 29 10 -133 -69 -52 -19 217 100 -10 -73 36 -259 75 -64 -202 206 105 -101 -52 1 -279
3518 -279 238 -24 -40 -192 -101 -54 -72 -208 -135 -70 193 146 196 170 68 15 22 24 149 36 -130 -119 -91 170 7
3543 7 -38 63 51 -108 54 -33 -138 -116 -259 -4 -7 -38 35 -148 -78 -134 146 -275 -94 -128 148 146 147 -4 209 24
3569 24 -74 -106 81 171 -183 242 -228 162 196 35 111 -11 -81 225 216 -54 -218 31 33 -77 -124 97 70 159 65
3594 65 317 -25 176 39 -145 -80 -89 60 -124 -139 -45 -31 26 -74 72 -104 -193 34 -62 -185 -131 19 115 33
3618 33 -93 118 205 -159 213 -84 43 -9 -21 220 54 -125 -13 -113 57 -87 -212 -21 -53 -89 -16 35 127
3641 127 166 4 254 -83 28 148 -61 -52 -209 256 -203 74 -240 14 73 56 -80 -27 -111 -129 206 78 252
3664 252 201 -71 -193 58 -56 -97 -107 -25 -106 48 105 -180 -162 -31 239 -131 -183 105 90 -38 250 -151 -3
3687 -3 20 -36 112 -6 99 100 34 -261 -229 -139 -6 -256 -43 -231 -77 31 -174 27 -32 -202 -52 -80 -308 88
3711 88 36 -127 32 163 -13 472 4 112 7 -225 77 -102 94 157 165 -6 -39 -50 87 258 -146 50
3733 50 -117 147 153 -123 -42 56 -4 22 -75 -50 -37 187 -24 -49 -157 -76 -12 28 181 -71 -214 -60 -214 -171 -95
3758 -95 53 132 -140 -24 -74 -42 -65 -5 58 -85 128 -172 -36 14 85 16 66 -114 -22 114 -256 -15 82 47 142
3783 142 141 94 42 52 236 8 33 -22 20 42 19 -238 211 -219 -25 50 32 -34 -146 58 -36 -303 102 -30 27
3808 27 75 -9 -22 11 138 -117 -188 -64 336 -161 -38 -40 134 108 -22 -52 -119 107 101 136 81 68 -23 106 146 -160
3834 -160 -208 -43 -189 46 -330 68 85 -32 -108 -209 -36 -184 -212 -90 16 30 -6 213 11 20 73 -29 157
3857 157 -8 237 113 -12 -202 -379 198 115 29 20 49 -28 208 -154 78 -171 158 267 -5 73 -241 -140
3879 -140 -264 -133 -113 -69 92 2 -209 -4 -61 -31 -127 -155 -7 -318 -20 -126 13 -236 89 6 -104 -143 -139 -132
3903 -132 -87 264 -29 -256 -33 -64 35 264 72 -97 -279 -159 5 131 257 -173 248 235 69 33 -39 -211
3925 -211 -32 -66 54 -207 -42 -177 123 14 151 -233 186 168 -6 34 -148 104 -10 -29 153 -8 175
3946 175 312 212 -31 87 176 206 288 125 206 -182 78 264 -5 -56 -54 289 -12 108 -139 65 -30 -135 57
3969 57 -206 -54 -34 20 -260 -149 97 -114 74 40 -71 -98 -28 39 -281 82 -14 -106 -84 -73 166 -228 -169 -51
3993 -51 28 11 -74 140 -18 65 -318 -66 93 122 253 178 -300 -50 269 -95 3 30 -41 -20 48 62 -30 -72 -20
4018 -20 -8 18 -151 20 32 -11 298 -145 115 147 -114 -22 -236 34 -53 70 155 -12 -165 -109 221 -127 -295
4041 -295 304 29 13 -11 90 -140 -168 -120 95 76 -214 13 -70 119 -88 138 -212 7 -24 -133 171 189 8
4064 8 -154 -156 118 -260 336 67 -206 -23 -40 147 217 -141 68 191 12 -245 -163 165 43 -11 -98 -97 -113 22
4088 22 -60 219 -153 -72 124 -72 277 79 -206 -254 35 -2 16 -6 7 160 -327 -229 -113 -132 115 119 77 -257
4112 -257 -62 28 -196 118 48 -188 -43 -164 -162 33 47 -21 -158 -98 47 -98 -78 45 2 33 -99 -67 234 -75
4136 -75 -179 11 -22 73 62 -149 -83 -98 -164 80 163 -426 40 103 70 -37 107 61 196 44 -242 -149 90 34
4160 34 -204 -113 63 -150 32 -66 -6 -84 -137 -63 -27 60 -63 310 8 68 -116 86 -25 65 -67 209 -47 -79
4184 -79 -266 -39 -137 -163 -141 139 -147 -88 -107 18 51 -1 -142 -141 110 148 -2 -102 -158 -76 -113 262 -96 180 -172
4209 -172 109 122 -255 258 -113 -54 -40 186 -89 -1 -96 137 150 88 -188 -157 40 127 123 47 -102 99 -7 -272
4233 -272 -209 -98 35 98 47 -91 -178 56 -147 75 44 -83 -110 -7 -122 -166 -96 -57 5 -120 6 -243 61
4256 61 83 14 16 87 8 79 -118 93 193 -280 -159 179 90 15 103 102 -90 97 -85 1 -303 179 -50 -176 -28
4281 -28 59 -155 102 468 104 -28 -140 -64 291 10 57 3 23 300 109 0 269 74 300 -80 -202 192
4303 192 34 63 27 204 107 -43 -149 -7 -211 -136 182 -192 5 -359 168 7 -118 11 -41 -274 -109 -62
4325 -62 116 155 23 -100 -188 32 246 144 60 176 184 -320 59 -54 -142 -26 107 -126 17 59 -67 160 68
4348 68 80 106 21 70 -52 34 -39 -181 -167 -76 -100 17 -118 -215 -6 -9 -42 97 -84 25 70 46 -104 -22 -132 -103
4374 -103 -25 -242 242 6 214 -297 -109 8 130 50 -2 -171 -25 -75 -38 6 16 29 100 -184 134 13 -7
4397 -7 -33 34 101 14 -38 -9 48 35 -229 -24 -7 27 -6 18 -324 115 -128 -121 143 58 160 -93 -89 189 50 -41 -56
4424 -56 40 93 -119 213 -121 -12 90 -22 -62 -29 -297 298 229 92 -250 -80 -22 -216 -47 -29 -29 -36 124 -15
4448 -15 90 43 -81 36 139 -85 47 52 -22 131 88 195 -92 40 169 -58 87 39 -156 -256 39 -151
4470 -151 117 -17 226 77 47 -20 20 -9 -139 -144 76 37 -154 161 95 -83 -179 20 -47 218 83 13 15 411
4494 411 5 194 3 -212 -127 1 -128 173 109 -59 28 58 31 92 22 83 166 -55 110 -161 -96 -70 -179 188
4518 188 112 50 124 78 141 27 110 -18 168 -125 92 -11 229 251 -236 -60 28 -138 -73 212 -116 -118 -116 37
4542 37 -13 -105 -132 -79 -147 -189 221 0 109 43 191 -61 90 -115 56 41 172 -88 -16 -48 -3 178 162 60
4566 60 -276 -156 49 60 170 -1 -11 211 89 63 100 139 -92 -100 153 86 -163 -57 -7 -62 -31 162 67 -186
4590 -186 47 -233 161 53 26 31 64 -47 0 74 29 42 -190 -75 -131 -159 -168 127 -148 -69 -17 173 314 81 -145
4615 -145 158 -299 60 99 -7 64 -4 155 -185 -30 1 0 165 -76 -40 -57 -120 -205 119 -18 -6 150 35 -76
4639 -76 -71 250 -25 88 -237 258 142 -38 2 83 -104 47 304 -225 -39 26 -10 -156 61 -244 17 -20 67
4662 67 -126 90 36 128 -10 -267 -42 -88 -42 -25 13 -182 -214 -20 253 -214 -109 176 96 18 113 -74 -8 109
4686 109 -135 -190 37 125 -26 -53 268 -102 118 13 -38 38 118 -56 -120 48 330 -25 52 7 15 93 63 111 -22
4711 -22 106 -115 -269 54 111 -239 30 -94 -146 -213 45 60 -72 -2 -204 -38 -34 244 116 -118 107 -83 265
4734 265 -187 22 -64 12 135 92 -59 -183 237 161 -29 -268 -9 38 -35 -64 158 -81 146 276 -287 43
4756 43 154 -33 245 -4 -117 -57 77 -248 2 60 38 67 -4 -7 41 280 30 -80 -174 418 16 -151 93
4779 93 -37 45 -95 -115 45 324 63 -136 194 122 -381 150 87 -216 -3 114 82 150 -175 185 130 -136 62
4802 62 -103 55 115 99 191 -41 147 113 193 5 9 170 154 104 0 -96 -100 -243 -119 -53 -37 -3 89 46 47 29 102
4829 102 -110 65 -97 -204 69 114 17 15 -179 -116 122 6 -293 -91 -91 -45 -31 133 266 197 -148 -110 215 -197
4853 -197 -67 27 -311 70 -75 -68 69 66 60 24 -7 34 -11 -83 59 -100 74 -144 72 71 86 101 -38 101 -179
4878 -179 170 81 -93 -8 -122 175 -100 161 -50 -63 -9 42 -36 -202 129 -14 74 -19 -86 -43 264 14 -65 208
4902 208 26 -120 250 53 -75 -11 -178 231 21 30 104 -130 -12 85 -81 -45 -15 35 250 -264 256 76 -32
4925 -32 31 90 28 -80 121 153 31 130 -60 -163 241 -216 -77 -69 162 -16 58 -2 72 -8 -73 165 13 -29 36
4950 36 -187 -101 -17 -160 -201 114 2 84 -227 -7 -67 26 -148 75 159 177 -99 -5 -49 -88 146 -100 52 -162
4974 -162 -169 154 -22 -59 31 165 -124 -2 -9 33 -1 -37 -31 131 -73 -65 -64 -218 -61 17 27 128 -56 -281 -10 -8
5000 -8 142 6 65 -143 -137 191 232 -74 -43 -67 -116 -50 -129 16 -162 187 -94 168 -35 94 141 44 -63 -86 -107
5025 -107 141 -106 223 125 38 -145 -15 -169 47 -14 234 4 56 191 26 -177 -128 -120 -74 145 251 332 17
5048 17 35 84 156 49 319 174 -427 185 274 -198 -143 11 -184 165 113 50 -92 23 -12 -76 87 67 226 -153
5072 -153 -38 150 -124 -5 1 -256 32 108 71 -3 239 193 27 100 121 -15 50 -102 78 79 6 158 81 5 87
5097 87 372 163 -188 -64 -2 22 138 -90 147 -75 92 43 112 4 158 -8 85 -19 7 40 -164 -119 83
5120 83 -90 -185 75 145 -16 57 -176 37 93 55 45 70 85 -55 37 24 -110 -203 -53 95 10 123 -61 298
5144 298 148 188 -156 72 37 -119 -139 213 -34 -137 -193 109 116 71 154 83 20 172 -47 -149 -261 264 183 -195
5168 -195 -36 17 41 30 39 -15 106 -9 -58 -88 24 -128 -26 -146 216 -112 -84 -193 98 303 118 38 -163
5191 -163 0 -54 2 -12 -20 161 -178 -148 48 -89 -240 -112 106 192 -131 40 -140 151 -153 83 -132 41
5213 41 -162 35 148 7 52 -70 102 -17 -158 26 -99 29 101 196 -198 123 -277 51 72 156 37 -189
5235 -189 -6 -215 127 -31 53 92 54 -74 -92 153 -138 -40 -294 86 -180 105 -240 -145 -59 -139 -26 -94 56
5258 56 -108 -297 -37 141 -26 -71 106 -158 -104 1 238 -117 -45 223 -49 -74 96 -106 140 -147 160 -66
5280 -66 103 225 211 -304 -99 188 -256 -141 10 -114 5 120 -105 -36 5 -311 -30 -155 -324 -180 164
5301 164 -40 -205 227 -39 -33 216 243 -8 85 6 53 8 102 197 55 167 84 -244 -128 355 162 113 88 22
5325 22 29 177 97 -16 -78 48 -28 -85 75 184 -71 53 1 97 102 171 -193 147 181 -91 -156 -135 -190 -158 309 207
5351 207 94 -206 -82 -145 14 -404 -6 -25 8 146 15 53 108 -9 247 -10 -239 91 -175 22 -55 -183
5373 -183 41 -159 92 -140 -79 -113 137 59 -38 15 -50 153 -34 55 -22 46 175 -161 -4 -57 8 -286 -218 -101
5397 -101 -171 208 -232 139 42 -38 187 -218 95 -52 -138 -87 -187 -237 -75 -55 -91 66 -182 -137 -165 129 -30
5420 -30 40 90 -138 -41 20 23 -129 38 127 13 -91 177 155 -130 50 30 75 199 -186 12 126 -77 61 -160
5444 -160 -58 80 57 287 -147 -190 -152 103 -39 -222 186 -107 -81 -297 -37 -36 -58 -189 12 194 306 98
5466 98 168 -126 -155 13 3 -136 -7 -45 40 -200 69 -18 148 -130 117 176 -104 -115 -77 14 -53 -64 60 65 -76
5491 -76 -79 -40 -26 -27 -29 52 -66 92 -48 172 -41 165 -204 170 -41 79 -148 -252 32 -28 -184 19 147 -356
5515 -356 -9 72 -111 -72 -82 352 205 228 86 167 12 82 60 -189 82 -220 135 -93 -123 93 -107 -84 207
5538 207 -282 -180 -75 -118 303 -213 -166 -83 171 86 54 -2 17 46 -56 -62 165 131 -98 60 -167 21 -208 -62
5562 -62 -61 -201 -56 -13 24 -169 -131 132 -119 -49 -129 57 56 74 -113 -213 78 21 123 -24 -54 155 49 -45 -111
5587 -111 220 121 -51 -25 -91 -55 198 -5 -204 233 -68 120 -29 73 102 -47 184 -101 -75 12 -32 -203 96
5610 96 -121 72 -93 -9 -40 -67 202 193 -147 6 -71 -22 -154 275 72 308 -6 45 -284 -107 -74 -106 -55 66
5634 66 91 -107 -51 -16 129 -243 22 -75 73 102 -144 -40 -199 205 -85 178 215 -100 31 -208 253 -243
5656 -243 3 216 -154 -206 70 -20 17 -146 -29 -104 -313 -205 347 45 2 -206 -213 -222 -113 -149 62 90 -176 184
5680 184 -313 27 172 99 64 207 124 357 -69 82 11 -51 -155 -89 104 -134 -180 -79 347 -47 -102 -88 -104
5703 -104 -71 -48 -183 267 18 -136 347 -26 -6 -174 81 157 156 321 -195 43 250 98 59 -126 -7 18 57
5726 57 -198 27 -51 205 182 64 124 -20 -60 190 25 171 178 -50 89 -91 318 204 -191 -279 -235 -107 -272
5749 -272 -87 -2 79 -269 204 26 -82 -312 -231 126 174 50 -93 -104 -151 -22 15 116 220 1 -37 -49 -133
5772 -133 64 180 44 -79 87 66 -121 60 61 96 -92 -64 -24 -81 152 -215 7 -70 24 23 59 44 -7 118 208
5797 208 -186 207 -225 103 91 -318 -147 -184 5 148 -172 71 154 -189 -132 134 149 116 -41 -17 -30 0 -87
5820 -87 43 -69 -136 75 61 -78 -80 25 -211 211 70 -60 -76 53 -168 128 160 -354 -96 92 -33 -145
5842 -145 197 -13 49 83 -173 -113 -39 225 -195 -50 -148 9 -114 -64 -35 110 11 98 218 -43 49 50 -24 -11 247
5867 247 -50 -61 -182 76 -103 62 139 2 63 -165 54 -152 217 65 -189 -288 -176 -300 -57 95 -255
5888 -255 -61 -73 -91 -35 24 85 43 -325 130 -103 -102 29 -4 -65 283 -138 123 148 143 187 87 -47 206 165 48
5913 48 86 61 104 45 -180 -62 141 54 -43 -36 -172 166 141 -221 50 13 -6 -134 -102 -54 -98 -119 3 -48 99 -176
5939 -176 12 -177 225 253 -102 146 383 309 144 -52 -114 -99 -121 33 -129 -41 -16 95 88 -113 -84 163 58
5962 58 -141 -120 8 117 -69 5 -118 -94 -203 -147 127 -96 214 9 41 110 -43 2 -237 -201 -144 24 -98
5985 -98 -270 -15 106 2 28 26 58 105 -84 64 -21 102 -105 -26 33 -95 218 68 2 54 51 182 16 209
6009 209 -124 112 143 -140 -236 109 -137 -302 72 218 -76 3 -94 -173 40 182 25 -158 37 140 82 -10
6031 -10 -108 -168 185 -83 -85 -110 98 -220 1 187 -161 -105 57 -72 55 20 -80 -76 73 -103 -56 18 100 30 34
6056 34 -177 163 -135 -220 -84 104 261 -273 94 -4 -77 -77 -62 -138 -59 63 238 184 46 121 -64 -20 -29 98 -206
6081 -206 -81 50 77 395 108 -40 -55 9 62 -125 326 -172 47 -59 -59 -153 15 55 -55 -61 -208 -205 6 129
6105 129 198 -40 -55 22 47 -127 321 231 72 -164 -4 166 93 95 -228 -52 -31 -210 -28 -76 45 87 59 223
6129 223 103 -190 231 -41 -193 -133 137 -27 24 13 -239 108 82 116 101 169 -279 21 -12 127 76 -225 -119
6152 -119 252 121 81 -159 -93 65 101 -63 -2 51 80 -205 -73 121 -50 273 -23 -136 -50 -124 96 117 278
6175 278 -245 -68 13 -50 14 -309 50 97 14 -95 20 126 -66 38 327 -322 -131 6 44 84 -61 5 138
6198 138 284 83 -274 -166 48 -13 -69 11 118 128 80 236 194 -30 158 247 -48 -91 -195 53 25 166 -67
6221 -67 49 65 109 -145 -63 -1 53 -36 -211 -67 310 104 -45 -51 78 207 7 -28 16 -159 75 249 -173 -13
6245 -13 58 56 66 -89 -114 35 -44 161 -226 -55 -45 -44 -116 55 -45 306 -8 -317 52 -112 36 -62 -57 -139 -77
6270 -77 -74 142 -52 -66 88 -101 139 -117 -54 89 135 -249 102 -77 -166 -41 62 71 17 53 -92 -26 2 38 361
6295 361 45 122 18 80 81 10 -251 -92 130 -109 -121 19 -145 -169 94 -228 -211 -145 -121 88 155 66 37 -50 -300
6320 -300 3 -215 -139 -126 122 238 -61 -18 -68 -227 -26 174 -21 47 -153 173 -90 109 96 90 190 33 20
6343 20 -251 25 62 -75 -96 -112 -32 55 -182 -46 81 8 -5 -154 175 -65 -130 -98 -71 60 -42 -65 -55 16 -14
6368 -14 136 82 -149 -301 -55 -37 65 205 128 -90 -300 3 153 12 -149 -12 160 -59 -248 -223 48 104
6390 104 -60 -46 2 -45 77 84 -42 134 -75 -114 -69 120 -54 -80 5 33 -59 -64 103 -191 -7 -83 282 -24 -69
6415 -69 37 -115 -24 70 -83 -11 -30 -109 90 -52 -5 -192 -40 -134 -89 -153 -103 -173 -33 -98 246 -189 -11 -163
6439 -163 80 -96 166 0 158 86 246 111 -214 -128 153 198 20 184 7 -97 -31 -81 67 84 58 -112
6461 -112 34 -191 38 8 -22 -333 -133 -44 -205 -102 -155 -293 13 178 -66 -7 -168 -77 -42 68 -190 -184 11
6484 11 -234 -195 34 59 64 -90 -54 -150 118 40 141 -147 -133 -69 -46 25 14 146 -36 161 -64 8 90 -31 0
6509 0 -36 -39 -216 12 -51 -107 91 190 -120 20 76 -50 127 -105 20 69 254 190 141 39 -151 106 115 -60 28
6534 28 97 76 -284 -227 -146 7 -176 48 -161 -2 -148 8 -11 -125 97 -92 -242 -124 -28 142 -29 -83 236
6557 236 -161 126 -44 -70 214 40 -54 -247 -11 123 -242 58 37 -44 189 12 22 -93 54 19 125 -88
6579 -88 -117 -165 -114 -139 42 108 103 -154 56 -58 -179 25 1 157 -156 139 129 -208 82 -75 -34 159 -47 155
6603 155 -75 -151 41 107 -120 14 -35 -129 -76 -70 -206 21 92 -31 244 3 -65 -36 121 53 111 328 -16 112
6627 112 -17 96 -109 -183 100 232 -123 -17 -160 -45 257 -38 -307 114 30 2 201 -2 -92 185 82
6648 82 118 -5 103 -55 -65 -196 -151 -82 27 -210 -165 86 -213 111 -66 228 -30 -76 98 -19 105 -318
6670 -318 10 57 -247 -86 -136 123 -108 -25 -246 279 39 -131 0 98 43 104 -4 -72 -191 -209 -151 -120 -68 -15
6694 -15 -56 -48 56 -15 20 113 -19 -163 136 320 -27 -18 186 190 -111 -84 -15 -1 152 21 62 24 -42 3 99 91 132
6721 132 15 63 -213 45 21 185 -62 -64 343 -71 -34 -149 -55 23 18 9 134 -63 -227 -45 -33 -30 56 53 19 -230
6747 -230 -99 73 -17 46 -56 -128 -108 138 60 74 -5 66 -195 57 -31 -28 115 128 199 121 -20 87 -51 -185 -43
6772 -43 22 55 133 52 -12 -7 -11 191 17 158 110 163 -72 114 201 -59 30 287 105 311 -22 -83 -137 116 223
6797 223 -200 -77 -32 -32 40 -62 3 -2 54 -62 -117 0 -32 122 -152 -180 -73 -152 86 67 220 29 159 -94
6821 -94 25 165 179 84 -210 -46 184 119 -189 247 146 -94 72 88 85 62 -54 -224 -59 -98 -68 -185 107
6844 107 72 15 -18 117 195 49 17 -114 -47 -281 126 233 -17 234 47 141 -78 -172 92 -131 104 344 -29
6867 -29 339 165 -7 -22 49 -103 54 17 96 106 -94 159 78 170 -5 -34 -73 -506 40 -144 208 -253 8
6890 8 -1 17 148 203 -11 8 105 143 -45 -225 224 104 -27 142 10 161 -21 -47 -127 -41 167 -105 276 -63
6914 -63 -77 87 -163 155 81 78 52 65 -51 -208 78 -90 155 140 174 -96 182 134 17 194 -25 126 -82
6937 -82 -260 190 -57 43 9 217 125 -92 -48 -54 157 261 -6 0 -12 88 -219 -84 -237 31 22 -217 135 85
6961 85 120 82 -78 -52 -101 -108 140 377 -138 213 -11 -133 262 -43 -238 -81 -33 -200 258 -88 -190 134 -4
6984 -4 -89 -265 -96 50 -84 18 -194 -104 133 -109 -56 14 120 89 -286 -96 151 -204 -141 -74 -165 45 86 58
7008 58 175 88 63 25 67 -336 -57 67 91 -24 -78 -201 139 31 -54 69 39 -18 3 55 -316 23 -114 -90
7032 -90 33 27 -289 -135 -24 20 110 85 -97 41 -154 -138 -103 -149 114 -167 224 288 -195 104 379 87 -1 -26
7056 -26 78 104 -20 -162 -36 -17 185 65 181 -182 131 27 -108 1 122 -14 -149 128 -59 11 18 48
7078 48 106 -176 -178 -126 -344 84 47 131 -70 66 -73 11 -161 35 -121 24 16 -72 -44 -199 -215 -403 95 -79
7102 -79 -164 -33 -10 176 31 78 123 -93 -25 45 199 -42 -126 -138 -46 13 -142 -42 0 120 -93 202 214 161 -61
7127 -61 -115 61 70 -188 162 -177 124 222 20 207 -98 55 -95 62 137 -10 248 -95 -153 -77 4 -344 -291
7150 -291 -116 -138 -46 -98 51 -56 29 -5 -78 -60 -44 -8 -39 54 -149 203 -19 37 -18 28 -141 155 217 85 59
7175 59 -34 246 198 108 -290 -26 -22 -200 -5 201 9 -77 165 -137 96 -124 -158 2 95 21 37 -27 57 -8 20
7200 20 66 82 74 167 -177 -48 -79 -55 -173 397 44 -57 58 231 -149 141 105 -84 49 -393 157 -70 23
7223 23 332 65 -96 -45 21 -132 -53 26 -49 -181 -88 -37 12 -291 -95 92 59 -151 59 94 -137 109 86 342
7247 342 -174 -2 -86 -183 46 195 -32 -48 -15 61 7 -236 46 183 209 -68 12 54 -66 88 -144 -58 -103 -100
7271 -100 150 -130 129 164 126 -225 222 12 -306 44 -285 -81 -14 -73 201 218 -320 3 319 238 55 77
7293 77 -28 235 6 16 58 -6 -142 32 -20 -115 -100 -184 112 159 43 -27 -197 -125 120 19 101 -27 290 119
7317 119 -13 27 -180 -6 -66 -213 -84 28 -123 48 -58 32 183 -41 -199 188 -45 23 27 -74 390 44
7339 44 -142 98 83 137 217 107 157 -7 52 -145 204 -177 199 192 -76 173 -84 19 30 -130 -58 231 -75
7362 -75 72 -145 -229 51 -21 95 96 12 -56 205 63 78 28 216 -168 -84 179 -3 162 -31 118 -19 -12 156
7386 156 236 86 4 -19 16 67 -55 -23 -83 20 -251 -56 68 -185 -91 239 -11 -60 341 173 73 -133 -255
7409 -255 -87 24 58 13 -89 -141 -156 -104 -124 -64 -329 12 -36 28 -32 138 50 59 179 -90 -53 -205 33 -61 -94
7434 -94 11 -106 -40 -47 -193 -133 -82 29 -242 -144 -75 -114 -18 28 71 191 139 -54 252 -196 57 -146 -58 261 -269
7459 -269 -86 29 -343 203 -28 -102 -12 100 156 -132 -11 -160 221 -193 45 -13 -162 -26 -28 100 120 47 -411
7482 -411 -371 76 -217 -204 -60 166 -125 -334 29 -27 183 223 55 13 -105 -36 30 -85 -147 191 -60 -202 -91
7505 -91 -179 31 61 184 -120 54 80 -16 247 -44 -70 -61 330 -43 -145 -2 -18 170 -27 33 48 80 -86 -153
7529 -153 -81 -77 8 -62 -18 198 274 -63 -146 -99 -155 55 76 127 2 104 73 260 74 -27 -140 91 -95 175
7553 175 63 -14 192 190 38 96 56 -41 -39 -142 110 231 -273 -124 121 -120 60 -83 56 -236 147 16 -137
7576 -137 -15 270 130 -91 -165 -128 -62 73 86 130 -143 -103 -59 -103 -170 -71 -40 -2 155 -168 -43 94 142 47 22
7601 22 113 -51 -24 30 205 48 267 89 -100 -237 -122 9 -167 103 -41 -116 282 -72 54 143 -228 76
7623 76 285 -129 -276 38 12 -149 -6 -40 109 151 262 -71 -259 173 -16 -32 15 86 33 190 5 95 140
7646 140 24 -80 276 7 -13 -59 186 -72 -182 -130 -171 -31 19 175 8 12 -85 16 -20 123 -114 6 201
7669 201 -98 -1 -75 -162 66 431 111 37 -10 56 8 15 39 122 -125 -204 96 -50 -141 -105 73 -168 -284 173 228
7694 228 -156 -268 -148 36 -60 1 152 53 -148 -92 -228 15 -138 18 207 15 -68 -11 288 -17 -211 279
7716 279 41 104 82 133 -37 -131 68 -84 -104 83 -125 220 130 112 -259 -143 21 -102 3 104 115 -133 -152
7739 -152 18 9 -98 -119 68 -426 -171 50 69 51 16 -36 121 12 -17 136 193 -3 -155 -102 137 2 21 164
7763 164 174 84 -53 65 -72 20 -207 168 -56 190 -205 -93 56 182 24 127 -2 61 -41 -156 267
7784 267 34 -224 136 10 -167 -24 19 -51 141 88 -220 113 -5 -26 -24 6 136 115 -303 -16 -35 -46 -2 41
7808 41 66 -60 85 -60 236 117 61 56 51 298 128 -12 -43 -96 380 -20 88 73 -348 9 -112 -31 92 -18
7832 -18 -70 72 17 -61 205 24 362 -205 28 390 -82 62 -64 -25 129 -238 33 -133 76 -83 89 -66
7854 -66 -40 107 182 -14 113 -136 48 9 110 -233 -272 32 -135 -46 106 34 -61 -289 -155 -89 -164 -111 -121 123
7878 123 5 -194 87 31 104 66 -206 -80 -106 156 187 -118 -116 32 -80 -20 -243 -9 48 45 -95 114 50 -250
7902 -250 88 -95 -27 -159 137 18 228 96 391 -275 -101 85 176 32 -43 -51 -108 -91 83 164 415 100 -114
7925 -114 94 59 10 -33 105 43 270 45 -24 23 154 18 4 -165 -15 90 -59 240 -341 55 -24 111 20
7948 20 -105 18 -55 -158 31 -154 25 -44 230 3 -8 -89 -96 -168 -56 -73 328 87 268 11 -191 -3 -21
7971 -21 53 -209 -89 -139 3 -48 254 -49 -43 94 -260 -249 27 -247 46 -36 -210 -51 32 51 -91 -67 -29 215
7995 215 -35 43 -213 -84 -17 -135 -153 3 -94 216 -40 -50 32 -152 -177 31 110 -83 55 -45 550 -6 15
8018 15 -106 -118 82 -95 115 -27 122 46 118 3 72 -50 197 135 -186 -64 -56 -19 100 166 231 143 -129 2
8042 2 -37 -113 -42 296 -67 -163 -123 7 26 5 -87 -40 -227 59 142 68 -157 -9 -76 -71 217 -172 -36 -12 295 249
8068 249 130 16 -300 -29 -44 -37 31 -287 -56 48 -16 -183 10 123 -127 27 167 212 -78 -146 71 85 -62
8091 -62 3 211 -68 139 -222 -127 -108 118 43 -76 107 95 -89 -52 196 156 -71 32 -63 65 165 69 133 -216
8115 -216 149 33 -30 92 -55 28 -208 -398 4 -246 85 -118 -117 -24 88 155 -81 -58 -26 245 -51 -89 -88 -103
8139 -103 -1 -77 256 -143 -103 95 45 -30 30 151 -194 82 19 70 96 -28 120 247 -38 74 204 -118 67
8162 67 123 -77 -259 39 105 83 -18 39 97 110 -150 97 8 39 9 -18 220 -250 177 -130 247 -44 111 48
8186 48 -75 11 214 3 -119
8191a19
$$ Imaginary data points
##PAGE= N=2
##DATA TABLE= (X++(I..I)), XYDATA
0 0 0 0 0 0 0 0 0 0 0 0 0 0 0 0 8 -8 8 -8 8 -16 16 -16 24 -24 32 -32 40 -48 56 -63 72 -80 90 -104 117 -132
36 -132 149 -165 185 -205 229 -255 285 -313 348 -382 423 -468 516 -566 624 -688 759 -835 924
55 924 -1022 1132 -1261 1409 -1585 1794 -2047 2365 -2777 3332 -4129 5377 -7614 12978 -57257
70 -57257 -32954 8452 -19711 27664 8305 72042 47399 -7075 13074 -9813 -16535 -15181 -33877
83 -33877 -7252 -14519 -138 7800 -12132 2497 17490 15475 13544 3467 14656 15920 -9561
96 -9561 -19135 -8666 -10629 -7679 -5968 -66 11285 6831 6998 6615 746 7549 5639 8036 3075
111 3075 -7560 -2361 -13509 -22099 -19189 -15395 2841 14496 16788 24079 28536 17026 20 -12416
125 -12416 -25367 -19406 -20343 -25002 -1717 2298 8359 16160 3728 14511 10876 4492 8453 -4286
139 -4286 1541 -2986 -13706 -12422 -19184 -4963 -2914 -3793 13746 12203 16690 10694 -144 6746
153 6746 -5133 -5790 -2277 -6372 3162 -4419 -3502 -721 -9689 1277 394 3251 14698 9077 13841
168 13841 6704 -5200 -5167 -15680 -16010 -10668 -6955 3829 7811 12715 13839 7466 4292 -1873 -5229
183 -5229 -6501 -10377 -6898 -5777 -6860 -3196 -2843 864 6771 6823 11108 11559 6520 4448 -5333 -10079
199 -10079 -11143 -13339 -7781 -4598 2912 8141 6911 8623 4429 2827 1903 -1963 2217 1295 1530 1589
215 1589 -4023 -2512 -6631 -6925 -2659 -2099 6645 6687 7398 9312 768 934 -5236 -8101 -3210 -5488 736
232 736 1474 1031 5067 -742 -482 -900 -2002 2682 -1013 863 2144 -3297 -2486 -6071 -5203 -506 -1147
249 -1147 4551 6555 5236 6307 1191 -2664 -4361 -6687 -3111 -3033 -1448 3218 2041 1940 691 -1194
265 -1194 1518 43 2365 5195 3313 3773 814 -2912 -4288 -7077 -3695 -1510 -728 4123 4911 4733
281 4733 2353 -894 -455 -2413 -2037 312 833 2175 1530 -38 -2089 -3940 -2513 -1407 -675 854
297 854 3143 3187 142 -2011 -2614 -2728 -1983 -785 2181 3743 3629 3190 -157 -2483 -3662 -3790 -2423
314 -2423 -2112 1285 3864 2346 1358 106 63 24 -1393 1439 2624 2215 2848 -163 -1749 -2880 -3199
331 -3199 -1467 -1450 1289 4475 3952 2197 -182 -1250 -1628 -3450 -1739 306 1604 3007 2075 1058
347 1058 -725 -1681 -1395 -2037 -1767 938 1503 255 -1501 -2072 -2054 -2646 -1880 1049 3143 4534 4325 2317
365 2317 45 -2666 -3487 -4320 -4538 -1597 1130 1703 1760 1168 1758 779 -71 962 1832 2685 2289 1280
383 1280 -694 -2421 -3032 -3313 -3324 -1343 1759 3506 3098 2965 1922 1249 -953 -1883 -460 -706 376
400 376 78 -659 -1355 -2605 -1225 -982 -118 3015 3671 3543 1449 -1204 -2147 -5301 -5596 -4038 -2271 1596
418 1596 3403 4938 4990 2972 2072 -1134 -3067 -3010 -3025 -1672 -2369 -1740 26 -885 376 1385 2635 4696
436 4696 3973 3964 2456 -264 -1679 -4405 -4861 -3841 -2666 533 1230 1815 3243 1617 1266 558 504 2488
454 2488 1201 1119 1064 -1784 -2756 -4605 -4854 -2870 -1730 2124 3747 4442 5740 2169 911 -1949 -4653
471 -4653 -3638 -4985 -2760 -288 196 2871 2047 2258 2633 429 1755 134 -971 -691 -3556 -2740 -3412
488 -3412 -3312 199 372 3923 4794 3762 4707 1248 -454 -1572 -3419 -1502 -1665 -586 641 -474
504 -474 501 -1479 -1625 -91 118 3063 3928 4713 5377 2111 -223 -3273 -6186 -5940 -6437 -3795 -62
521 -62 1943 4811 4540 4867 4096 918 -146 -1844 -3201 -3043 -4662 -3672 -2287 -1533 1619 2261 3956
538 3956 5595 3482 2298 -862 -2721 -3556 -5814 -3399 -1992 409 3374 2360 4441 3004 428
553 428 931 -1740 -459 399 -552 1135 -866 -677 -1568 -3726 -1967 -1622 940 3086 3106 6075 3745
570 3745 2000 1176 -3114 -3494 -4914 -4862 -2110 -2825 -322 1240 1641 3530 2146 3660 3068 865 965
587 965 -2676 -3446 -3358 -5090 -2970 -2129 390 3993 3162 3794 3246 1325 -263 -3486 -2531 -1131 -1544 298
605 298 248 1347 1708 -962 402 -374 -159 2396 596 2327 1615 -225 -87 -3316 -2592 -1313 -2369
622 -2369 719 574 2646 3240 1086 2960 996 -255 282 -2297 -970 -2980 -3708 -1389 -3408 -813
638 -813 610 1609 4739 3562 4239 2909 -493 -878 -4642 -4738 -3414 -3297 7 352 1774 4154 1670
655 1670 1783 538 373 725 -1379 -48 -456 -871 -713 -2275 -1451 -326 -456 1526 1391 2369 2738 339
673 339 16 -1479 -1537 -559 -2089 -391 660 713 1094 9 871 825 32 1363 180 517 266 -1653 -1647
692 -1647 -3033 -2438 -856 -1144 1533 2454 2739 3102 675 352 -1052 -2869 -1399 -2496 -1194 -357 -641
709 -641 1299 -728 229 1064 -131 1796 1226 1388 1850 -278 43 -1573 -2243 -979 -2062 -52 1062
726 1062 644 2235 406 361 343 -886 359 -400 542 1062 -327 312 -465 -1019 -159 -929 570 583 805
745 805 1573 -377 -542 -950 -2115 -856 -1288 53 1375 558 1971 525 -182 378 -1302 -390 -627 -650
763 -650 208 -539 82 -394 -1082 69 -487 777 1522 995 1984 526 -255 -158 -1599 -584 -937 -344 1057
782 1057 97 1266 543 -504 318 -827 1 134 115 1427 278 483 188 -861 -85 -785 -277 432
800 432 -170 663 -239 -902 -544 -1396 -242 -215 364 1785 1102 1450 569 -906 -654 -1521 -1223 -621 -566 197
820 197 71 196 98 -614 285 349 125 1031 860 855 83 -753 -358 -1378 -935 -117 -170 1272 1126 713 700 -409
842 -409 51 -264 -791 55 7 639 622 5 158 -284 -275 46 73 888 751 591 204 -1169 -891 -1452 -1393 -724
864 -724 -81 1307 1593 1173 1168 264 319 -748 -912 -868 -1118 -1085 -782 -1137 -663 -509 320 731 1048 2179 1647
885 1647 1335 101 -748 -1060 -1914 -1963 -1005 -810 615 855 1216 1164 596 723 207 -189 316 382 37 -186
905 -186 -821 -459 -777 -790 23 474 1084 1396 1181 951 60 -872 -981 -1684 -1255 -919 -156 318 242 1091 1013
926 1013 612 951 834 741 -54 -592 -1016 -2222 -1779 -1711 -1167 121 1053 2205 2521 1889 1840 221 -652 -1291
946 -1291 -1744 -1806 -1259 -606 17 427 937 715 779 735 648 872 659 505 -69 7 -469 -1235 -1109 -792 -472 189
968 189 330 918 842 1025 587 275 161 -182 -303 -663 -1080 -948 -912 -960 -414 511 1411 1778 1972 1505 360
989 360 -863 -2100 -2706 -2347 -1982 -889 410 1540 2376 2103 1733 889 34 -428 -953 -1080 -1256 -928 -639
1008 -639 -599 -155 87 330 939 984 1426 1464 725 554 -271 -811 -917 -1240 -1174 -664 -347 174 57 355 1035
1029 1035 564 1244 1239 530 363 -418 -783 -1373 -2343 -1432 -1058 -143 916 1546 2172 1548 747 65 -1005 -1444
1049 -1444 -1991 -1672 -779 -158 682 1086 1005 1509 810 841 421 -203 32 -941 -1023 -886 -1313 -235 -563 68
1069 68 1014 900 1241 724 703 487 -496 -414 -401 -412 -102 -811 -503 -371 -757 -188 -247 432 1123 1242 1633 910
1091 910 381 -130 -1300 -1541 -1574 -1440 -536 -407 889 973 679 1274 651 159 -49 -841 -323 -773 -733 -288
1111 -288 -575 -68 152 576 1242 569 895 697 -396 0 -924 -1011 -847 -528 512 463 415 849 461 622
1131 622 62 141 688 133 238 -367 -398 -267 -962 -535 -643 -488 718 718 1038 1423 695 749 -322 -431 -536
1152 -536 -1344 -454 -582 -388 132 -270 180 118 206 904 -17 397 488 -550 33 -773 -637 -242 -569 205 266
1173 266 363 897 47 171 -312 -615 -207 -422 23 258 -84 822 -113 245 298 -33 665 119 169 431 -248
1194 -248 113 -693 -812 -200 -542 270 187 366 959 136 461 317 -392 261 -584 -26 82 -532 222 -639
1214 -639 -553 52 -641 487 333 498 693 100 422 -198 -545 -82 -457 -102 132 29 489 64 44 147
1234 147 -382 442 -436 217 452 -124 411 -400 -172 385 -85 287 322 -4 557 -236 -362 -125 -1006 123
1254 123 -438 74 424 241 730 314 103 308 -554 -602 -188 -294 266 -359 -132 -228 -531 -156 -649 -9 457
1275 457 -198 577 13 42 193 -824 48 -3 -120 513 -270 251 237 -366 262 -589 -196 340 -185 489 134
1296 134 43 136 -296 300 -92 136 346 -252 448 64 -438 -202 -815 -79 142 -155 371 472 402 677 -34
1317 -34 334 -277 -206 5 -369 213 -211 -400 51 -481 -14 34 20 497 162 394 97 -390 138 -477 -363
1338 -363 28 -329 90 12 203 330 80 270 -178 -62 174 -309 163 12 -64 198 -305 -52 8 31 672
1359 672 242 195 409 -344 -235 -508 -495 -23 -582 97 192 337 649 38 455 175 86 478 -149 70 -48
1380 -48 -677 -392 -612 -629 -280 -83 549 522 678 820 211 332 -223 -856 -488 -811 -289 -337 -110 229 41
1401 41 217 328 24 614 292 235 320 -169 -319 -522 -385 95 134 380 454 253 356 -140 265 -286 -636 -133
1423 -133 -186 -58 263 -180 187 -351 81 -58 143 515 562 288 608 -119 -146 -655 -925 -490 -519 -176 226
1444 226 353 824 630 549 422 255 163 -146 -594 -594 -870 -226 -322 -11 286 137 808 745 246 327 254 -376 -518
1467 -518 -441 -466 -440 -341 128 -44 380 325 83 320 171 101 257 276 106 -36 -203 -284 -641 -248 -197 83 334
1490 334 433 713 585 103 108 -296 -522 -601 -632 -146 -194 -41 372 242 622 730 687 403 69 -163 -514 -836
1512 -836 -566 -742 -97 -218 539 444 782 639 343 545 103 -179 -137 -318 -617 -255 46 110 -47 -86 -10 67
1534 67 322 293 454 293 224 93 -197 -438 -424 -565 -221 -58 125 85 113 99 493 82 -183 -290 -199 -363 -189
1557 -189 -521 -324 114 73 -23 359 704 427 256 231 -272 -675 -602 -670 -730 -314 -20 159 593 148 112 255
1579 255 189 47 -196 -209 -160 -203 -180 -229 -191 -158 -82 107 299 377 201 329 532 80 -228 -298 -340 -260 -372 -281 -56
1604 -56 -249 -23 116 8 296 160 303 153 -24 -223 -268 -433 -489 -170 131 35 155 352 350 359 -115 -249 -385
1627 -385 -302 -100 -440 16 265 69 312 142 49 371 -15 284 82 -94 -167 -471 -249 -11 -460 -43 64
1648 64 388 205 177 435 194 88 250 -217 -109 -120 -242 -134 -99 26 -294 -156 48 -30 187 45 123 135
1670 135 -204 15 -313 -120 101 -16 -162 210 12 149 53 -209 209 -42 110 104 -214 188 -171 266 75
1691 75 -249 295 69 288 103 213 304 -166 -165 -418 -307 -28 -55 111 303 153 89 444 -107 183 15 -113
1713 -113 261 34 -60 -136 -188 -205 -323 -75 -30 234 252 40 7 -8 -187 155 -299 106 -33 -167 53 58 -231
1736 -231 -257 -401 28 -132 16 211 -138 169 52 54 226 -285 228 -158 195 285 56 -123 -19 -505 -319
1757 -319 -385 -165 132 88 290 -12 43 360 -173 -53 -176 -133 139 3 -132 113 -206 -78 -134 94 170 66
1779 66 264 43 -73 262 -199 -164 -33 -236 424 -37 33 -20 40 23 -490 -7 18 -69 283 -198 279 248 -178
1802 -178 140 -175 -132 126 77 250 7 4 120 -250 -291 -80 -263 378 -124 153 420 132 25 -204 -220 49
1824 49 10 -287 -6 -172 -136 -288 -194 -235 -137 375 -36 57 321 205 155 38 -4 -35 -4 -145 -133 -152 217 -138
1848 -138 62 -19 -305 -21 -134 0 16 -391 75 -162 29 48 -197 200 251 258 385 229 52 65 -215 126
1870 126 -419 -91 -31 -162 244 -25 287 342 70 360 211 380 383 -31 -43 -350 -418 -109 -131 138 -6 -197
1892 -197 246 110 370 203 -109 295 -7 50 -158 -218 80 -369 -443 117 -88 101 186 151 263 145 212 35
1914 35 -203 108 34 -45 307 32 173 166 187 173 -245 -35 -177 -205 -108 -186 125 130 -210 143 41 152 137 89 309
1939 309 -146 123 -190 -222 152 -289 -208 -150 -179 401 173 59 263 329 246 85 -65 84 31 -202 -483 -631
1961 -631 -172 -351 -214 78 -85 359 128 253 65 -307 -83 -182 7 -46 135 190 224 195 246 69 -22 251
1983 251 65 260 6 226 -151 -237 117 193 174 105 145 224 -39 49 319 77 -65 -85 -151 154 -261 -78 -167
2006 -167 -366 -1 -200 169 129 377 297 60 -145 7 -210 -400 -192 -218 -78 -29 186 245 49 306 159 150
2028 150 15 3 -99 -248 -58 -23 -155 -73 -24 118 287 236 194 80 -62 21 28 -22 -244 -1 250 56 161
2051 161 236 -55 189 29 84 41 -14 -72 -84 -130 -50 -169 -200 -96 -382 28 191 332 160 368 215 47 -225
2074 -225 -166 -133 323 -17 59 -291 194 204 -102 16 7 41 17 -29 -185 -176 -124 -143 -293 -248 -188 269 -42 49 175
2099 175 113 -51 -101 -8 201 -93 -110 174 38 66 86 -28 15 203 -33 -102 -10 -333 8 124 -85 -98 175
2122 175 139 87 115 187 -89 -7 -83 -269 14 219 218 -276 -84 -197 77 29 13 110 -279 -25 -140 247 224 -41
2146 -41 94 -295 -24 8 -214 224 -23 93 175 198 -13 150 119 111 -46 95 -70 -58 -19 -266 32 -74 -3
2169 -3 -36 -51 122 218 -192 -124 55 2 236 149 118 -63 -66 145 -359 -166 105 -110 -46 201 -15 70 47 -183 124
2194 124 111 145 108 92 66 6 32 30 75 4 271 -4 146 -92 219 -40 -159 196 80 50 -105 308 137 297
2218 297 55 260 -35 -29 -386 16 -108 -161 -84 -146 -49 -314 -111 -30 28 -62 128 -138 100 -30 -13 172 -145
2241 -145 -125 2 -202 -288 -190 -16 -5 -302 172 -17 -50 -24 55 109 -45 290 48 -117 73 134 -133 94 127
2264 127 -262 66 -156 190 -15 -140 -4 -115 206 56 -1 220 -169 -276 -172 43 19 -56 63 -155 -85
2285 -85 207 -112 108 100 109 293 -295 17 213 107 -50 -68 -289 -68 -149 -130 -131 -94 339 -184 76 -202 243 111
2309 111 63 109 149 -3 -336 33 -32 -49 -32 -18 -148 -134 -6 -129 109 -12 -15 101 50 92 90 82 225 -306 78
2334 78 35 -158 93 -138 65 194 -78 -158 -66 -141 114 16 -90 227 28 103 -194 -66 77 -290 89 13 102
2357 102 192 -129 90 -81 -212 25 -212 -289 -66 194 180 -76 215 174 -85 382 147 -139 13 -409 -30
2378 -30 -180 -267 1 52 208 183 134 264 -52 213 152 -139 35 -261 -22 -6 -21 72 -264 -198 42 -20 8 296
2402 296 140 259 33 162 161 -484 -112 -237 -34 -35 -124 291 41 187 -97 -44 244 -119 -221 173 0 27
2424 27 -26 -171 147 -60 212 10 -119 -47 -7 173 254 -117 -360 -116 -89 43 163 340 66 190 47 82
2446 82 107 -22 97 274 -38 -122 -90 -221 -6 -152 30 94 -150 -16 -54 23 -51 42 -43 -196 60 204 -261
2469 -261 -39 -56 -90 234 123 -241 196 -45 129 -57 110 -6 -305 -20 -6 -34 140 -13 150 97 33 34 -207
2492 -207 -134 -137 -62 52 -101 17 -31 -85 -52 -30 85 -73 -3 -63 39 -81 -248 -195 -304 -66 26 145 -64 298
2516 298 -22 -88 149 -17 125 228 -163 84 41 -14 -52 158 -185 -118 40 -52 80 549 401 132 70 -39
2538 -39 52 -145 -111 71 -18 90 -46 -10 185 -80 36 12 -49 -98 -184 -191 239 239 -37 290 -84 -9 -43 -181 -72
2563 -72 59 -239 33 19 -6 127 -87 -25 -146 200 44 -112 190 -38 6 117 -60 -93 -286 -355 -113 -142 101
2586 101 -29 15 236 154 -96 -77 131 128 -147 236 -248 -110 11 230 -22 -182 -46 43 -20 -67 104 156 354
2609 354 71 170 -126 -6 -189 -113 -47 49 -49 111 21 -89 -106 -225 100 96 -203 -230 -90 150 11 -23 69 -192
2633 -192 -31 73 -92 17 329 85 79 -259 76 15 49 8 -62 74 11 47 -183 14 163 -59 111 17 -170
2656 -170 -88 58 -139 85 -45 214 -29 120 96 3 -80 -239 -6 -77 26 112 -11 -98 48 -99 99 -95
2678 -95 -76 132 58 -95 -126 77 230 74 -73 -68 -154 -182 -14 -224 72 -31 -111 -68 -108 -104 -311 9 5 164 70
2703 70 -119 31 53 -71 98 182 -154 52 -12 -93 -36 -60 24 187 148 296 -143 195 -8 -39 143 65 113 164
2727 164 -79 15 -127 -426 -135 -168 21 4 -13 -63 124 269 -198 -40 -82 -120 38 -121 -127 44 20 -49 8 -130
2751 -130 -268 -139 28 1 137 163 -57 87 -109 -72 -210 166 -367 22 7 -13 4 -44 -185 -64 -29 -44 149
2774 149 -16 -65 -60 47 234 -43 46 -130 23 46 -62 144 -264 -80 78 -94 25 50 244 -187 -63 32
2796 32 -33 29 188 203 59 28 123 193 -78 -167 111 -4 -79 232 -69 116 -131 -164 201 -23 196 188 -34 -200
2820 -200 -265 270 -13 -46 49 0 -203 90 -96 62 26 -56 353 274 78 372 94 165 -170 -105 224 -291 -56
2843 -56 -78 -132 105 167 -108 48 17 -64 115 -226 115 -111 -122 -111 102 60 17 233 50 34 -101 -105 -74 95 -162
2868 -162 -140 62 -96 131 26 140 -112 -59 69 79 226 158 22 34 37 -36 128 87 271 4 42 -22 66 226
2892 226 -164 48 -71 -108 66 0 17 46 114 -124 -185 111 -15 -154 82 -59 -159 49 -139 137 192 99 376
2915 376 79 91 30 135 -66 0 58 -74 296 271 57 219 -230 -256 -42 288 -80 -138 31 35 -72 54 -92
2938 -92 -161 -50 7 -153 68 -60 -202 -79 124 41 -66 -26 -60 -9 261 19 -225 -154 151 104 40 -119 -3
2961 -3 115 212 -31 -18 139 65 36 -54 217 85 -151 -130 -21 -51 2 -88 -30 85 -7 12 -107 233 214 -192 256
2986 256 152 -191 119 -151 -82 82 191 324 36 37 -36 -281 33 -6 13 26 -82 33 136 44 108 89 -66
3009 -66 161 -5 55 -68 -21 -28 -140 255 97 169 187 -144 -131 -9 53 138 -25 -44 185 -89 242 -165 -5 117
3033 117 -63 58 -88 40 -14 40 -115 -158 111 141 211 75 28 96 -184 131 -13 0 361 28 -49 -140 -59 83
3057 83 1 -299 -37 70 -164 -15 -11 185 89 263 -90 109 97 -181 -217 -58 50 108 94 -83 -86 -4 -20 214
3081 214 -162 16 151 -249 -27 88 54 -41 -209 -13 -157 -195 84 129 249 -97 28 73 200 134 276 94
3103 94 22 -32 321 217 22 -31 38 103 187 -104 210 -94 -137 -306 -73 12 12 33 306 -140 -194 -141 -93 11 -53
3128 -53 -196 -63 -91 -121 156 -39 20 -116 342 -70 -72 -72 26 -85 -245 -152 75 118 -245 -8 -32 -9 -37 -97 92
3153 92 181 -225 246 -133 151 -137 179 186 85 -51 48 -91 40 -92 -34 161 -153 -2 -133 17 -135 254
3175 254 80 23 -150 -15 -81 -150 -122 108 -79 80 42 -68 -12 6 98 211 72 -144 135 70 -203 -77 254
3198 254 66 -143 -3 13 -113 -147 -62 -218 79 -189 156 93 -127 154 -80 -204 -19 -50 208 12 66 -72
3220 -72 -112 111 -39 -71 -45 -272 -248 -338 -1 -7 -32 74 42 123 -217 94 -208 190 32 67 -122 -114 -111 -178 53 95
3246 95 -491 5 105 66 -21 -78 -6 121 69 105 145 20 -35 -28 -141 235 150 -16 4 -44 -90 146 395 -220 -69
3271 -69 -288 -118 -86 -130 75 140 131 107 17 -21 -60 47 126 -96 142 139 170 45 133 59 -40 -144 -154 245 -31 -183
3297 -183 -258 -49 92 -27 -36 -64 100 -4 310 2 -189 27 88 -92 -37 -22 21 -45 -64 -44 -39 -113 13 159 -166
3322 -166 -78 -49 -163 75 -258 -75 4 -8 28 -103 9 -85 -35 -17 118 72 148 -130 -143 -194 232 -60 25 203
3346 203 -80 33 125 167 54 -1 29 121 26 130 95 176 77 174 15 -192 91 7 22 -77 72 -31 -8 43 -111
3371 -111 149 -37 -137 -148 27 154 -43 17 178 181 -59 228 40 -54 -169 -121 -101 63 -124 151 90 -275 187
3394 187 82 23 55 -141 -21 43 -23 -55 -229 -289 -85 177 63 53 -115 -98 -126 252 193 -66 44 -49 -84 11
3418 11 3 -23 13 -75 -60 -214 -19 -39 42 -141 10 -40 223 -75 -126 125 205 -133 -1 11 -188 -122 -151 -80 70
3443 70 -130 69 40 -88 -52 23 187 138 -70 83 82 1 -80 -156 136 25 -36 133 -93 162 -122 -161 -73 111
3467 111 179 -120 157 23 145 175 7 187 -164 -37 -164 -55 8 30 230 -195 -113 -8 -194 70 -180 -95
3489 -95 -166 -303 146 102 269 -107 12 -43 175 -66 -93 -131 218 -77 -93 -123 -77 -169 132 99 -60 -3 150 -98
3513 -98 37 -63 118 -20 127 -160 42 166 -131 70 21 2 12 52 157 68 330 155 64 213 -143 63
3535 63 -8 -44 -143 -222 -153 98 -67 65 -30 -104 185 -40 -374 -89 84 -276 213 23 -51 -219 81 -26 14
3558 14 -20 52 101 -210 -276 88 92 -235 203 210 20 110 65 121 -153 46 237 187 239 -69 101 -99 -119 -305 75
3583 75 62 135 153 37 -93 283 -3 -55 118 165 -12 -43 -85 41 132 -40 67 170 -25 -60 114 29 54 211
3607 211 -161 105 -14 -24 239 -98 -161 122 -74 -4 -94 -12 -43 40 186 29 -281 -114 11 -201 -51 65
3629 65 -84 -228 -66 73 175 -39 244 -41 204 -270 109 -21 161 174 -39 30 123 -135 -49 116 53 41
3651 41 207 213 -114 -353 -271 127 -37 -169 28 150 -181 -131 157 -127 -93 103 -168 -295 -26 222 71 -65
3673 -65 26 83 8 2 43 155 25 31 -12 -7 341 -155 -48 219 -496 80 116 -81 -164 -3 4 -78 12 58 50 -32 267
3700 267 -21 156 145 -53 -9 52 -103 14 -9 -107 -59 -133 -42 -170 20 -104 -70 -123 -162 118 -76 86 -170 -273
3724 -273 228 76 -41 178 -269 -128 60 -165 216 296 336 -26 25 64 -161 -192 132 109 -7 88 7 -89 40
3747 40 177 8 -59 -87 -81 108 -11 -21 -144 8 192 44 -54 -117 -10 8 35 44 102 161 218 120 130 194 75 303
3773 303 105 92 -27 -50 189 -107 207 -24 -25 276 140 -88 -29 318 160 32 -41 152 245 -93 21 124
3795 124 -70 -57 -17 -94 -9 73 -174 2 160 -33 -236 -192 86 46 -86 86 252 94 -96 -61 -115 190 104
3818 104 -110 52 -49 8 -2 59 8 -51 83 43 112 -262 50 -76 -131 -128 23 -5 -36 -69 -207 58 -54 -239
3842 -239 112 13 -220 12 39 109 -124 -14 -128 21 222 -23 -150 -77 25 -122 -75 -50 -9 -91 68 164 204
3865 204 129 172 -87 -243 124 -31 48 -89 -19 -17 -87 -261 -201 -273 -17 15 21 3 -51 -104 106 -106 -25 197 -6
3890 -6 -163 61 -24 -201 22 -106 110 -51 174 118 171 196 106 120 197 -118 -11 76 -8 28 56 7 136 -260 -151
3915 -151 -132 -16 -32 -29 128 -114 -62 148 17 -267 203 -82 -46 -176 -17 -217 -9 -47 -122 -66 -136 -82 24 238
3939 238 -187 84 252 -5 53 -23 48 108 -232 -86 41 -96 80 38 164 97 51 205 199 41 -121 -67 -128 -168
3963 -168 81 161 248 6 42 -128 223 46 -123 -11 -118 -221 -10 145 -6 -254 6 98 166 4 5 132
3985 132 61 121 -68 -231 -52 -208 81 -131 -190 -139 -7 -149 -32 -313 141 167 15 -148 -118 300 66 -99
4007 -99 367 -165 -165 -40 57 75 -178 132 -58 71 84 -107 34 100 39 177 120 245 20 79 -70 -170 132
4030 132 -80 108 -101 351 -43 -91 153 -289 90 -108 180 44 -128 52 -12 -234 109 -10 46 -281 -77
4051 -77 -202 -177 -226 -5 -24 -18 51 125 -33 22 -10 -83 -2 -14 164 152 -15 203 59 -48 25 151 56 368 -69
4076 -69 81 -7 -83 -181 133 -112 94 121 -144 147 350 42 -87 187 205 98 60 13 131 -83 211 -46 40
4099 40 -101 -95 47 42 -94 -34 -40 -254 90 73 10 -3 296 -132 -61 -70 84 -76 -60 -96 -130 -15 191 -58 343 6
4125 6 180 -89 -39 -35 -68 106 -56 199 263 -311 110 -170 53 96 -295 -142 -184 105 145 -40 -7 -191 -110 96
4149 96 49 305 -136 -173 39 -100 -48 -98 90 -48 -56 -24 -74 86 237 -108 89 126 -29 -119 5 -190 -84 15
4173 15 -209 -41 26 -92 -85 -67 -81 -101 68 163 111 -148 130 73 -16 -122 -164 -216 -68 -182 -262 98 -133 -112 81
4198 81 -24 -20 143 -12 77 68 -73 -165 168 -79 -52 -17 161 126 -237 174 -66 171 117 -152 43 -147 -11 -142
4222 -142 217 -95 -152 131 59 -146 -48 13 -23 -160 20 191 39 -3 -85 195 129 14 124 -196 -38 34 -37
4245 -37 49 -22 218 8 15 -153 29 -31 109 19 -85 -97 -224 1 7 -33 -20 -260 49 9 122 -42 -67 101 196
4270 196 -201 47 -58 40 136 -55 30 -153 40 61 244 87 -182 -27 71 -313 97 7 86 -77 -145 6 -16
4293 -16 -143 -112 41 -47 -72 -114 -45 -117 92 -63 -170 226 4 -39 -37 -70 132 122 166 -5 -317 -71 -161 -40 8
4318 8 237 196 223 112 -28 4 5 -174 -240 88 256 6 83 -48 -116 10 -169 -99 -136 292 24 -84 14 -7 76
4343 76 -135 126 290 -180 119 -46 -161 91 -19 154 50 -120 79 102 -219 -170 58 178 -196 -326 -188
4364 -188 162 200 -171 43 8 -88 46 67 -136 142 49 -35 20 51 -165 -205 78 208 -88 -49 28 -23 -102 214
4388 214 -308 -123 107 -159 -116 61 144 63 -35 28 -13 187 159 42 192 45 103 -7 -5 322 -28 197 -78
4411 -78 223 -42 170 85 81 -170 113 -125 102 284 -145 65 140 76 -29 -181 80 -194 104 55 -36 50 -67
4434 -67 -175 12 -76 147 108 127 -224 -45 -40 54 31 -282 49 -9 -299 -50 204 -63 62 232 -16 -58 -127 -40
4458 -40 -52 190 134 92 -5 -119 266 220 -59 69 20 -104 98 14 179 13 39 -130 33 -66 63 -18 -340 -9
4482 -9 -171 157 -167 -162 -88 56 230 8 247 50 138 156 59 27 83 -46 39 36 117 47 170 142 -107 -245 -69
4507 -69 -94 -55 -82 -68 -125 182 18 32 18 151 -282 -171 -167 23 53 164 55 34 23 -166 -248 -59 222 -260 -44
4532 -44 174 -2 49 135 -263 -248 221 -206 -81 48 -183 7 113 -35 16 -108 54 -140 28 -25 -157 -26
4554 -26 230 -62 -299 8 280 -152 -78 59 -58 -140 159 106 4 -312 135 -84 -70 117 151 94 38 55 -32
4577 -32 -103 174 56 -162 -8 -93 64 224 -57 -82 -135 21 -42 -75 52 379 95 -182 -73 27 163 20
4599 20 -23 -206 -5 -48 75 -53 -230 -134 -74 -53 85 -61 -143 -63 53 -61 99 53 -98 -100 -191 -9 145 -169
4623 -169 -14 -87 294 -31 100 -58 15 98 -81 -46 184 -162 -53 43 -92 -209 -123 -157 -86 60 -96 50 -118
4646 -118 120 -308 -47 -165 126 131 8 42 -297 -160 126 -57 -62 50 -124 101 78 -141 1 71 -61 -13 46
4669 46 -69 67 35 162 246 20 -150 100 -114 342 87 160 228 -2 -22 -287 -64 94 -161 226 -50 -106
4691 -106 191 101 -216 -138 -83 145 -77 119 -243 -4 -74 207 -41 85 226 -71 -117 -100 -160 -17 65 -22 -257
4714 -257 -384 178 -48 160 -111 -135 -18 242 -16 160 -267 9 -70 -109 -328 -53 -12 225 20 -142 155
4735 155 181 61 -61 -3 -40 -83 -90 -46 90 208 111 181 -18 -235 128 81 30 -36 158 196 56 70 75 -79 91
4760 91 74 -169 -66 -186 75 -49 15 293 -69 59 -193 261 214 -132 159 52 249 212 -42 53 303 -50
4782 -50 -62 150 -159 -88 -40 288 170 26 -253 -7 -22 176 182 -46 244 -76 -137 218 -112 -35 -5 79 9 125
4806 125 -61 257 -91 -196 -131 -149 -136 45 -32 24 -23 153 58 -152 53 182 -13 50 27 75 27 -131 -11 -116
4830 -116 156 55 -102 72 14 -134 -108 66 0 -28 -204 291 -138 108 80 -9 60 -244 -79 -34 -256 69 -98
4853 -98 -32 100 -69 169 -271 103 98 21 -12 -41 87 237 -71 127 123 0 210 -234 18 46 112 97 159 75 327
4878 327 116 213 65 220 -93 -75 -81 45 22 76 156 -7 13 207 111 59 90 8 25 184 -51 -8 -107 -97 -147 197
4904 197 86 -54 154 -67 12 0 -52 -63 -98 -68 41 9 -235 65 65 -99 148 -13 57 110 134 128 136 242 -193
4929 -193 -28 -24 -163 136 -143 54 39 100 -52 -70 -93 107 -279 50 -25 20 -51 -21 66 51 108 -293 27 -54 216
4954 216 39 40 152 292 60 -43 -35 -55 -220 -57 36 -90 187 -92 -44 124 71 -210 136 44 -61 -156 -88 126
4978 126 -262 -99 -98 12 42 -111 30 124 -236 147 -66 76 -25 72 170 -64 83 9 -87 0 116 95 -104
5001 -104 129 301 -270 -32 -108 -211 56 118 -2 14 58 87 -28 228 161 -17 -74 -183 -135 190 39 106 -150
5024 -150 25 -152 -140 32 115 102 -5 -47 6 -174 -19 -1 -238 14 26 227 -98 94 -32 93 143 -69 28
5047 28 97 92 -50 -49 -129 43 139 -38 315 243 -61 198 93 191 -6 -93 23 26 79 10 -154 104 63 145 70 149
5073 149 -20 1 -34 -89 -25 243 89 11 106 78 53 -144 155 191 50 -126 134 17 61 -111 -11 -133 -240
5096 -240 11 -92 103 -95 30 79 -163 52 -269 -78 21 -11 92 268 -16 -163 25 -4 199 231 -82 -76
5118 -76 126 242 -267 -134 -110 -192 -26 95 71 99 112 -7 87 -278 61 186 128 115 13 -30 491 -96 120
5141 120 34 123 92 -125 304 33 -209 -13 37 -25 160 -120 -23 -179 72 159 188 -305 77 181 -113 95 142
5164 142 -43 359 -132 53 -278 -21 145 195 232 16 27 -42 -194 226 -187 -206 59 -48 92 -116 61 347
5186 347 53 135 3 -172 -5 -153 43 2 -44 -206 67 146 210 41 -113 -83 -69 -214 -139 166 -148 121 169
5209 169 123 175 -186 -348 106 -104 135 -136 26 -202 4 -112 -43 -113 46 -55 83 154 234 271 192 -89 147
5232 147 -99 79 180 52 -155 98 26 -237 203 53 42 -67 -93 127 30 359 -121 -48 -234 -182 51 -203
5254 -203 -69 -54 160 -182 -38 -50 -19 -103 64 -98 -81 199 -59 190 63 -49 -70 75 79 -172 -74 -73 -41 -66
5278 -66 71 156 -3 -34 -145 -12 196 9 29 136 108 70 149 350 -209 160 -18 -155 38 -61 -72 -88 -44 198
5302 198 5 -142 -83 -55 -64 -152 79 -146 -50 103 -129 -134 121 137 259 -64 -106 -185 67 191 -79 187 -117 87
5326 87 11 -137 190 108 159 185 -108 219 150 -170 26 -276 -149 -64 195 82 -101 17 -161 -168 322 -118 91
5349 91 -115 -141 71 -61 -28 44 -25 108 25 70 -278 1 -104 -46 28 101 -141 171 307 -106 119 -37 103
5372 103 7 -195 56 307 -119 81 -17 43 -5 136 41 -93 102 40 -334 169 -99 -35 115 -119 -146 274 172
5395 172 -49 132 10 -203 47 -52 17 -225 -29 130 245 -7 -204 -30 -8 87 301 37 -114 259 -63
5416 -63 24 -95 2 9 -207 -30 45 184 -218 -106 75 -36 -30 -11 21 31 -47 91 -32 -240 75 28 -77 117
5440 117 -75 -204 -49 -89 140 -69 79 22 -127 -220 123 32 -56 151 243 -4 -47 150 73 27 140 166 -108
5463 -108 364 -123 -229 -9 -51 -52 -66 -36 21 85 107 -117 -12 40 -114 64 254 38 130 -170 208 -35 -59 5
5487 5 -142 168 -219 -168 37 76 42 27 302 222 -70 -82 -87 41 71 -74 -25 40 162 90 0 230 39 -207 -164
5512 -164 124 10 79 -348 -154 108 73 78 0 -30 -86 57 51 -144 -331 295 -122 -2 -64 59 -200 -156 24 30
5536 30 282 -78 -60 220 37 42 189 56 -32 -150 138 13 59 -176 -78 159 6 151 -85 5 37 99 -100
5559 -100 -79 134 -89 30 -109 -96 -30 68 -229 131 -23 380 59 -10 -13 90 -95 131 16 243 -87 63
5581 63 -34 -163 -47 9 -37 35 132 -152 151 286 -87 -186 38 -8 172 -236 109 -109 55 249 -223 140 -100
5604 -100 -26 252 153 -172 108 44 -15 -42 189 -27 -88 83 155 -10 -229 33 26 23 105 -172 -100 238 -111 -197 -82
5629 -82 153 146 -21 59 -116 -60 256 125 150 261 -6 75 -32 65 173 -46 -42 41 94 74 -261 -84 61 8 70
5654 70 274 -23 50 -152 350 -17 -58 184 -28 20 -137 -202 -177 -45 -105 -77 38 19 -19 20 -255 -123 -94 35
5678 35 -31 -220 -82 36 182 318 -229 103 179 144 -90 -178 -6 291 131 64 62 64 -127 -67 57 -141 -159 175
5702 175 -5 85 181 40 -69 -22 276 38 97 26 -48 -234 13 93 -492 0 127 -44 130 3 -58 -113 -37
5725 -37 140 -52 -42 -111 -69 82 128 -113 -4 65 -270 119 -10 -122 38 -205 -82 102 -127 -107 -6 111
5747 111 235 94 54 22 12 34 127 42 302 87 207 118 86 175 344 -99 -291 -20 230 93 -66 -146 -52 -29
5771 -29 -57 144 128 -6 161 15 176 -29 -74 -45 -45 4 8 25 -44 -155 -197 34 34 158 8 -153 12 34 -158
5796 -158 -281 208 -174 -17 41 144 -78 81 -43 103 -23 -120 -83 149 107 2 72 -274 42 -56 19 -70 -127
5819 -127 32 -116 -26 -89 -147 12 -23 41 30 -144 -147 46 -26 -233 -132 -51 157 -68 -31 -201 94 118 101 309
5843 309 135 -32 38 -6 42 127 -208 70 -58 -98 -111 42 37 -64 122 60 -16 301 79 273 5 218 76
5866 76 -244 213 42 32 -157 44 -52 75 178 -249 127 -42 -30 28 -109 49 52 113 61 -187 31 93 101 245
5890 245 72 -218 -80 154 -60 227 23 292 23 -41 -111 -342 -63 -94 -46 -69 80 3 135 -3 95 8 155
5913 155 65 -15 117 -62 -94 44 -152 -261 132 86 180 64 89 278 -34 -89 200 -35 -21 71 186 -53 -53 217
5937 217 -81 225 80 73 -41 65 159 37 -78 -62 140 -22 108 -33 -82 -45 342 -199 -86 -42 -126 241 6
5960 6 -96 -44 64 52 -19 -72 -34 -84 100 322 -116 58 12 192 -171 -189 118 121 192 101 -189 -47 -26 -46 -13 241
5986 241 -196 81 223 48 35 -29 142 55 -100 -125 -139 116 247 -216 -11 41 101 237 106 359 -8 329
6008 329 76 -177 -164 -288 204 30 173 77 2 -39 -5 -29 -9 125 -54 207 -200 -163 -60 -21 128 -51 -9
6031 -9 53 20 106 33 -72 95 -86 -20 -81 -42 -63 -116 -164 96 -36 -7 46 -177 61 -91 -110 -73 84 -104 -106 177
6057 177 186 -24 49 252 67 -188 -120 133 -173 -134 -110 6 216 -180 -32 47 -141 30 45 -82 -143 50 132
6080 132 97 -215 -168 -37 -134 137 145 -131 56 93 -28 49 -219 -104 171 -50 -74 -156 127 -119 50 -44 17 111
6104 111 -1 170 -110 128 93 8 138 91 -49 9 -2 75 185 -101 -99 58 104 57 -81 -10 -20 -134 -488 -140
6128 -140 63 -154 -81 157 101 -241 12 -29 230 -105 56 115 -36 32 -225 7 -152 -6 -185 -40 -115 49
6150 49 261 -70 -93 303 104 192 130 -122 -14 30 -5 153 -13 91 78 112 87 7 1 47 -73 -25 -97 -17 -13 3
6176 3 66 146 -37 199 -84 185 217 -186 158 -217 -11 163 29 111 38 151 295 152 209 130 222 -11 102
6199 102 -69 -103 -147 52 119 -54 -221 167 150 61 -149 286 -191 109 -143 -132 198 63 159 81 276 -50 460
6222 460 -89 129 31 -132 -7 91 -39 240 187 -70 -119 -207 -105 16 125 152 48 40 -25 -71 94 56 -182 353
6246 353 155 38 121 49 50 -117 -356 -80 20 34 144 -22 -21 -56 -249 39 -47 173 -178 -136 -179 17 -93 -435
6270 -435 -238 -104 11 -30 56 -135 111 300 28 194 -34 -380 6 -63 37 188 -37 -58 144 199 155 256
6292 256 -35 -46 -131 -226 132 146 205 21 96 -8 -16 78 202 -188 -33 -147 -14 -198 266 66 63 -95 40 165
6316 165 -12 19 -79 46 57 -169 369 -3 205 53 -107 20 41 -6 250 258 116 19 -77 -215 -179 173 -101
6339 -101 39 89 36 19 92 62 -100 122 105 -204 -169 17 -201 -44 225 77 -86 -64 84 -58 -27 51 -141
6362 -141 -44 -113 -368 2 38 66 -130 99 105 25 -190 -169 116 -12 -41 132 73 17 -174 23 170 -135 -52 144
6386 144 182 11 97 215 -11 -135 -37 253 16 -176 -29 196 -20 354 264 168 69 158 171 -72 68 135 -1
6409 -1 -163 -152 27 29 18 -181 -59 128 -41 46 -115 -53 -19 85 -23 141 -140 -296 -89 163 94 -180 -158 87
6433 87 -179 236 303 246 189 -48 -38 86 27 -35 -54 261 125 92 -142 -217 -278 -130 171 60 21 -259 -137 -213
6457 -213 36 55 40 235 89 90 146 -222 -67 -229 -40 -208 176 310 -32 108 264 152 -138 -149 -113 24
6479 24 -16 18 -20 -38 125 -78 47 -40 -6 -62 70 120 -5 -185 -94 -131 -47 379 -67 -323 -72 200 175 65
6503 65 93 57 7 198 -27 89 20 -92 70 -105 35 -242 253 67 -29 120 -71 -28 111 23 -127 19 274
6526 274 -110 -221 152 -8 -56 -132 -85 -34 -137 139 -239 279 -250 59 112 33 52 120 -179 -165 -142 154 -66
6549 -66 48 194 61 8 171 328 98 57 97 -112 81 210 -229 -72 -132 -32 192 55 263 -137 173 75
6571 75 243 212 131 30 7 -27 104 172 -264 -25 -60 145 -73 5 -161 -244 172 58 -55 33 40 -221 80 -91
6595 -91 188 -167 -113 -47 -356 20 180 225 78 -311 -68 290 -138 190 411 -36 -349 111 -109 100 -32
6616 -32 -152 23 -79 219 -90 -35 275 256 157 26 -74 221 -47 -162 -108 -157 151 -258 -289 116 -7 51 252
6639 252 31 89 91 -111 -148 172 -83 -14 146 92 -109 141 -74 97 31 8 -172 120 41 -95 64 41 68 -41
6663 -41 147 37 -71 151 -132 -141 104 203 54 -158 197 -115 -93 -26 98 135 -90 80 -143 -169 1 34 30 -117
6687 -117 61 4 -84 -51 208 13 95 -22 -90 87 -63 -100 160 255 -177 118 105 125 100 2 -107 74 144 -25
6711 -25 16 47 -1 129 115 33 -159 -31 -108 99 30 -31 55 -198 97 -59 -51 76 -42 -186 151 134 -156 92
6735 92 181 -63 65 -161 199 -68 31 78 -218 189 50 44 -69 87 -164 -276 -162 184 97 -5 -223 185
6757 185 124 123 -229 -212 10 256 203 7 -11 -123 96 56 92 157 -209 243 -67 -134 -103 -52 -134 -28 -37 82 -93
6782 -93 -199 -178 -248 -16 53 251 6 51 -72 227 45 -43 -214 -12 -135 1 -145 -164 185 -94 -101 -254 -20
6805 -20 198 8 189 -34 -115 -58 -64 -46 -148 -118 -190 -7 -209 322 -90 70 -13 247 64 69 -42 -6 -113 -5
6829 -5 -140 1 -113 -66 39 56 -152 -153 240 174 82 -127 174 365 -206 -154 71 -102 -9 -184 22 -122 39
6852 39 347 -200 158 -9 -121 113 57 -31 -15 65 -210 -171 -166 133 12 158 255 75 -155 -40 -94 -83 24 -91
6876 -91 139 -8 -1 247 270 -310 -6 23 257 82 68 -3 105 -92 -26 -103 -41 -39 -111 231 38 -181 133 66 -100
6901 -100 172 -63 -91 -67 -292 167 -158 149 -52 -116 179 21 69 286 21 30 -80 79 31 -64 -375 -83 56
6924 56 53 192 -78 -131 188 -210 -65 64 0 86 -355 97 -12 -21 119 14 20 -81 3 -36 -155 80 -121 203
6948 203 68 -43 -63 -82 -111 -274 -275 26 30 227 97 -108 -150 -84 183 -285 122 148 212 31 295 16 321 55
6972 55 -80 216 57 -6 -80 -92 16 -54 -105 -86 -293 18 28 35 -72 76 -38 -57 -80 -113 -10 -39 198 161 -119
6997 -119 276 -153 86 -87 -84 67 107 53 101 7 45 47 -20 -83 -68 127 63 -62 -181 216 149 -105 -161 48 -209
7022 -209 -149 -98 -377 -225 77 148 -255 -163 -269 -152 -120 194 0 38 50 70 130 -40 238 -97 175 166 -144 -214
7046 -214 101 195 -55 22 -163 62 294 -31 92 194 -19 14 -90 41 -109 -49 -202 45 -58 185 -150
7067 -150 82 25 99 65 -9 221 73 318 -65 31 -181 103 179 156 -36 103 110 182 57 63 50 -233 42 -20 -37
7092 -37 -97 121 -75 -16 -96 -90 52 -187 -142 -91 -7 -232 -5 32 0 104 -33 21 -220 132 32 10 50 -14 -34
7117 -34 -64 -162 111 -67 304 8 -39 -198 16 -32 8 -20 106 -174 -102 2 -83 127 -97 -165 -57 108 45 -276
7141 -276 87 -106 46 -282 211 -10 -275 55 65 -137 136 -97 19 36 -20 63 177 -149 -122 312 -74 30
7163 30 36 23 -31 13 123 299 19 -210 54 -12 28 37 -108 -84 -15 182 74 -16 0 120 28 -66 145 -16 -62 -44
7189 -44 -167 144 0 190 -32 -24 -51 120 25 27 95 -44 84 -259 31 -197 -194 69 31 118 96 246 -154 -80 -115
7214 -115 5 -32 1 -35 -35 -56 20 -114 -165 -88 -168 89 -112 200 -229 -73 -131 -356 -97 220 -101 12 103 71
7238 71 42 331 12 -56 301 -68 -23 -165 97 -3 -158 176 -12 -43 -51 241 316 183 15 -244 -17 -37 59
7261 59 196 69 1 -148 270 325 -323 9 20 -61 -113 9 209 -285 94 33 -148 -125 212 14 46 178 -6
7284 -6 -109 198 36 46 111 -73 9 62 36 -115 -138 51 78 89 62 112 139 -26 119 -101 -105 -10 323 -110 -82 125
7310 125 -19 -150 -37 -5 417 208 161 -188 9 13 -171 23 -86 -92 36 -20 -86 80 58 -97 66 -25 122
7333 122 22 -43 -127 -35 196 3 5 -44 -125 -47 119 71 212 238 -312 13 121 172 -39 246 -67 128 241 70
7357 70 90 -46 -24 -100 158 -26 9 125 -55 -28 -73 169 143 218 33 -216 -134 52 -40 12 209 79 -225 -7
7381 -7 215 168 65 42 -1 -36 -21 0 -11 -66 89 -117 -263 1 -141 -31 -134 -53 56 190 380 34 -37 221
7405 221 -259 128 -111 -320 -17 97 -45 -31 -56 -58 -64 -142 10 -161 5 -25 4 -103 167 54 20 58 10 191
7429 191 143 -45 160 -22 69 234 -19 19 13 -3 -110 -185 111 -253 -39 98 -187 -30 79 288 -14 45 214
7452 214 113 31 -41 56 -18 63 -21 107 -164 31 -76 38 269 -20 24 -20 -10 234 -99 -116 -6 235 -92
7475 -92 24 14 -76 125 41 52 16 10 198 -100 123 107 -7 3 43 -203 -129 -151 121 74 47 -28 231 18 215
7500 215 149 25 0 12 -94 -6 55 -162 336 -53 78 -63 210 -48 18 52 -215 21 -8 -90 268 94 146
7523 146 17 -158 36 254 -43 22 105 -32 163 -3 7 88 137 37 -29 -17 101 -150 218 -156 -218 8 42
7546 42 -106 69 73 -121 -60 -54 0 35 42 14 18 -30 199 -9 177 79 93 -32 -32 -194 29 -239 43 154 54 -134
7572 -134 -240 22 -18 -17 88 -105 46 -89 193 357 52 15 -185 -120 -121 -232 51 -102 158 108 -9 42 -51
7595 -51 29 -50 67 -23 -187 94 -106 -250 -57 -33 -75 192 56 -112 74 -158 0 -60 6 -128 -3 -150 36
7618 36 195 -159 102 77 26 -153 60 -5 -148 -133 -160 -231 -13 -63 112 51 -4 -28 -6 -95 -2 -24 100 -46 -365
7643 -365 -224 -155 274 -55 -182 176 77 -71 24 -30 -98 -32 -14 11 47 65 96 224 -26 -9 -140 116 96 198
7667 198 -111 37 198 49 169 -146 29 76 -200 -11 -30 -29 147 56 81 -130 -17 -52 -123 55 -200 227 -100
7690 -100 -75 -214 65 -159 99 -177 -57 87 -240 -76 8 168 47 -11 101 -210 79 -61 31 -15 -345 203
7712 203 -16 19 -152 -26 11 177 31 110 -134 -233 -110 74 43 228 -206 -50 -122 128 -63 66 85 -93
7734 -93 228 68 0 -113 11 -64 -164 162 -45 -45 -69 -39 84 -160 -9 99 -37 -58 48 -220 -55 103 -261
7757 -261 132 129 -101 105 -108 93 87 42 53 -262 122 185 150 34 -34 294 72 149 30 41 -3 70 34 -59 -19
7782 -19 -23 -251 54 -82 -7 40 -103 -16 -83 138 -253 -31 151 189 259 -113 65 13 -55 127 -37 -58 22 146
7806 146 -152 -132 137 -39 -176 -164 68 65 63 62 -166 62 175 -177 378 -151 -137 172 196 -168 -166 119 54 -262
7830 -262 -50 315 109 -69 149 -21 111 48 -1 -16 -115 -116 -167 42 -172 -30 -129 63 -146 -1 46 223 6
7853 6 -45 -143 -130 152 -247 299 147 124 69 -190 9 67 129 -160 152 -81 -30 -4 -304 96 -10 142 -73 -137
7877 -137 -151 -42 -163 227 -86 -144 118 277 -106 -225 -234 112 316 187 80 -49 -104 153 -83 77 146 -286
7899 -286 -78 -98 109 -195 21 185 239 -28 136 -134 -107 -89 -120 -20 97 -56 122 53 67 29 21 117 -172 41
7923 41 31 16 77 -170 2 -181 58 90 3 -67 166 89 97 151 -74 -48 -28 23 54 -4 -19 -15 126 -7 -1 -14 61 94
7951 94 74 -100 211 116 -8 229 76 68 -100 100 7 58 20 138 -141 -81 -127 -185 -20 -119 -109 149 -109 -139 -6
7976 -6 -43 172 -193 15 247 -190 -250 -56 -55 188 -69 -31 -110 106 -60 71 24 -109 -194 -239 -163 207 -190 -70
8000 -70 -144 -54 -235 134 93 -139 95 2 7 -104 76 18 26 116 -124 -9 -74 259 360 -180 56 97 329 -76
8024 -76 67 170 78 291 336 -9 164 273 -62 136 13 -153 -96 -12 95 13 88 288 -141 121 -63 104
8046 104 182 6 21 -46 -54 -294 -25 305 -19 -47 83 8 -1 51 64 37 -229 29 136 -67 -3 111 -22 -199
8070 -199 44 -72 -327 50 -47 -102 -117 -172 36 113 56 283 -236 -143 93 19 -9 128 205 -111 12 122 285
8093 285 38 -58 -34 -13 -213 65 -76 22 -136 -72 -142 -66 46 144 210 158 96 -184 175 39 74 31 -148 -120 23
8118 23 34 78 -168 70 159 181 -42 -374 -196 -136 -3 72 34 83 -42 166 60 212 264 13 109 -74 -33 25
8142 25 -25 -209 109 253 28 241 -147 19 42 121 71 109 -163 5 -139 -123 83 -4 -211 131 -143 1 -83
8165 -83 -91 -192 -46 -125 -212 -242 157 -66 6 20 126 -118 67 1 -39 354 14 -248 -164 -45 292 -35 -28 -84 -81
8190 -81 131
8191A31
##END NTUPLES=NMR FID
##END=
