##TITLE=1H_LR-758-R4-KA1C2-CR1
 CDCl3
 8 sc, 
 27.9.2023
##JCAMPDX= 6.0         $$ Bruker NMR JCAMP-DX V2.0
##DATA TYPE= NMR FID
##DATA CLASS= NTUPLES
##ORIGIN= UXNMR, Bruker Analytische Messtechnik GmbH
##OWNER= root
$$ XWIN-NMR		Version 3.5
$$ Wed Sep 27 15:17:25 2023 Russian Standard Time (UT+4h)  she@DPX200
##.OBSERVE FREQUENCY= 200.13135
##.OBSERVE NUCLEUS= ^1H
##.DELAY= (6, 6)
##.ACQUISITION MODE= SIMULTANEOUS
##.ACQUISITION SCHEME= undefined
##.AVERAGES= 8
##.DIGITISER RES= 18
##SPECTROMETER/DATA SYSTEM= spect
##.PULSE SEQUENCE= zg30
##.SOLVENT NAME= CDCl3
##.SHIFT REFERENCE= (INTERNAL, CDCl3, 0, 15.7039)
##AUDIT TRAIL= $$ (NUMBER, WHEN, WHO, WHERE, WHAT)
$$ ##TITLE= Audit trail, XWIN-NMR		Version 3.5
$$ ##JCAMPDX= 5.01
$$ ##ORIGIN= Bruker BioSpin GmbH
$$ ##OWNER= she
$$ F:/spectra/data/she/nmr/H-F/1/audita.txt
$$ ##AUDIT TRAIL=  $$ (NUMBER, WHEN, WHO, WHERE, WHAT)
(   1,<2023-09-27 15:15:55.81 +0400>,<she>,<DPX200>,
      <created by zg, POWCHK disabled, PULCHK disabled
       configuration hash MD5:
       00 E9 B6 7A A2 85 ED C7 34 08 36 98 17 FE 4E 26
       data hash MD5: 16K
       9A 8E 7D 38 21 69 6F 6C 15 4B 4F 68 2F 53 8F 52>)
$$ ##END=
$$ 
$$ hash MD5
$$ C7 DE C6 9E A7 55 A7 51 ED A9 54 21 FA 60 08 0B
##$RELAX= 
##$RELAX= 
##$RELAX= 
##$RELAX= 
##$RELAX= 
##$RELAX= 
$$ Bruker specific parameters
$$ --------------------------
##$DU= <F:/spectra>
##$EXPNO= 1
##$NAME= <H-F>
##$PROCNO= 1
##$TYPE= <nmr>
##$USER= <she>
##$AMP= (0..31)
100 100 100 100 100 100 100 100 100 100 100 100 100 100 100 100 100 100 
100 100 100 100 100 100 100 100 100 100 100 100 100 100 
##$AQSEQ= 0
##$AQ_mod= 1
##$AUNM= <au_zg>
##$AUTOPOS= <>
##$BF1= 200.13
##$BF2= 200.13
##$BF3= 200.13
##$BF4= 200.13
##$BF5= 200.13
##$BF6= 200.13
##$BF7= 200.13
##$BF8= 200.13
##$BYTORDA= 1
##$CFDGTYP= 0
##$CFRGTYP= 5
##$CHEMSTR= <none>
##$CNST= (0..31)
1 1 145 1 1 1 1 1 1 1 1 1 1 1 1 1 1 1 1 1 1 1 1 1 1 1 1 1 1 1 1 1 
##$CPDPRG= <>
##$CPDPRG1= <>
##$CPDPRG2= <>
##$CPDPRG3= <>
##$CPDPRG4= <mlev>
##$CPDPRG5= <mlev>
##$CPDPRG6= <mlev>
##$CPDPRG7= <mlev>
##$CPDPRG8= <mlev>
##$CPDPRGB= <>
##$CPDPRGT= <>
##$D= (0..31)
0 1.2 0 0 0 0 0 0 0 0.06 0 0.03 0 0 0 0 0.0002 0 0 0 0 0 0 0 0 0 0 0 0 
0 0 0 
##$DATE= 1695813355
##$DBL= (0..7)
120 120 120 120 120 120 120 120 
##$DBP= (0..7)
150 150 150 150 150 150 150 150 
##$DBP07= 0
##$DBPNAM0= <>
##$DBPNAM1= <>
##$DBPNAM2= <>
##$DBPNAM3= <>
##$DBPNAM4= <>
##$DBPNAM5= <>
##$DBPNAM6= <>
##$DBPNAM7= <>
##$DBPOAL= (0..7)
0.5 0.5 0.5 0.5 0.5 0.5 0.5 0.5 
##$DBPOFFS= (0..7)
0 0 0 0 0 0 0 0 
##$DE= 6
##$DECBNUC= <off>
##$DECIM= 32
##$DECNUC= <off>
##$DECSTAT= 4
##$DIGMOD= 1
##$DIGTYP= 9
##$DL= (0..7)
0 120 120 120 120 120 120 120 
##$DP= (0..7)
150 150 150 150 150 150 150 150 
##$DP07= 0
##$DPNAME0= <>
##$DPNAME1= <>
##$DPNAME2= <>
##$DPNAME3= <>
##$DPNAME4= <>
##$DPNAME5= <>
##$DPNAME6= <>
##$DPNAME7= <>
##$DPOAL= (0..7)
0.5 0.5 0.5 0.5 0.5 0.5 0.5 0.5 
##$DPOFFS= (0..7)
0 0 0 0 0 0 0 0 
##$DQDMODE= 0
##$DR= 18
##$DS= 0
$$ [...]
##$SUBNAM2= <"">
##$SUBNAM3= <"">
##$SUBNAM4= <"">
##$SUBNAM5= <"">
##$SUBNAM6= <"">
##$SUBNAM7= <"">
##$SUBNAM8= <"">
##$SUBNAM9= <"">
##$SW= 18.05172834244
##$SWIBOX= (0..15)
0 0 2 0 0 0 0 0 0 0 0 0 0 0 0 0 
##$SW_h= 3612.71676300578
##$TD= 16384
##$TD0= 1
##$TE= 0
##$TE2= 300
##$TE3= 300
##$TEG= 300
##$TL= (0..7)
0 120 120 120 120 120 120 120 
##$TP= (0..7)
150 150 150 150 150 150 150 150 
##$TP07= 0
##$TPNAME0= <>
##$TPNAME1= <>
##$TPNAME2= <>
##$TPNAME3= <>
##$TPNAME4= <>
##$TPNAME5= <>
##$TPNAME6= <>
##$TPNAME7= <>
##$TPOAL= (0..7)
0.5 0.5 0.5 0.5 0.5 0.5 0.5 0.5 
##$TPOFFS= (0..7)
0 0 0 0 0 0 0 0 
##$TUNHIN= 0
##$TUNHOUT= 0
##$TUNXOUT= 0
##$USERA1= <user>
##$USERA2= <user>
##$USERA3= <user>
##$USERA4= <user>
##$USERA5= <user>
##$V9= 5
##$VALIST= <valist>
##$VCLIST= <CCCCCCCCCCCCCCC>
##$VD= 0
##$VDLIST= <DDDDDDDDDDDDDDD>
##$VPLIST= <PPPPPPPPPPPPPPP>
##$VTLIST= <TTTTTTTTTTTTTTT>
##$WBST= 1024
##$WBSW= 4
##$XGAIN= (0..3)
0 0 0 0 
##$XL= 0
##$YL= 0
##$YMAX_a= 47332
##$YMIN_a= -58572
##$ZGOPTNS= <>
##$ZL1= 120
##$ZL2= 120
##$ZL3= 120
##$ZL4= 120
##$ABSF1= 10
##$ABSF2= 0
##$ABSG= 5
##$ABSL= 3
##$ALPHA= 0
##$AQORDER= 0
##$ASSFAC= 0
##$ASSFACI= 0
##$ASSFACX= 0
##$ASSWID= 0
##$AUNMP= <proc_1d>
##$AZFE= 0.1
##$AZFW= 0.1
##$BCFW= 1
##$BC_mod= 2
##$BYTORDP= 1
##$COROFFS= 0
##$CY= 11.3945322036743
##$DATMOD= 1
##$DC= 2
##$DFILT= <>
##$DTYPP= 0
##$F1P= 15.7292609196834
##$F2P= 12.9074282941183
##$FCOR= 0.5
##$FTSIZE= 0
##$FT_mod= 4
##$GAMMA= 1
##$GB= 0.15
##$INTBC= 1
##$INTSCL= 1
##$ISEN= 128
##$LB= 0.24
##$LEV0= 0
##$LPBIN= 0
##$MAXI= 10000
##$MC2= 0
##$MEAN= 0
##$ME_mod= 0
##$MI= 1.114404
##$NCOEF= 0
##$NC_proc= 0
##$NLEV= 6
##$NOISF1= 3.799351
##$NOISF2= 2.8
##$NSP= 1
##$NTH_PI= 0
##$NZP= 0
##$OFFSET= 15.70392
##$PC= 1
##$PHC0= -21714.74
##$PHC1= 16.85271
##$PH_mod= 1
##$PKNL= yes
##$PPARMOD= 0
##$PSCAL= 0
##$PSIGN= 0
##$REVERSE= no
##$SF= 200.130013532006
##$SI= 16384
##$SIGF1= 3
##$SIGF2= 2
##$SINO= 400
##$SIOLD= 16384
##$SREGLST= <1H.CDCl3>
##$SSB= 0
##$STSI= 0
##$STSR= 0
##$SW_p= 3612.71676300578
##$SYMM= 0
##$S_DEV= 0
##$TDeff= 0
##$TDoff= 0
##$TI= <>
##$TILT= no
##$TM1= 0
##$TM2= 0
##$TOPLEV= 0
##$USERP1= <user>
##$USERP2= <user>
##$USERP3= <user>
##$USERP4= <user>
##$USERP5= <user>
##$WDW= 1
##$XDIM= 8192
##$YMAX_p= 0
##$YMIN_p= 0
$$ End of Bruker specific parameters
$$ ---------------------------------
##NTUPLES= NMR FID
##VAR_NAME=  TIME,          FID/REAL,        FID/IMAG
##SYMBOL=    X,             R,               I
##VAR_TYPE=  INDEPENDENT,   DEPENDENT,       DEPENDENT
##VAR_FORM=  AFFN,          ASDF,            ASDF
##VAR_DIM=   8192,          8192,            8192
##UNITS=     SECONDS,       ARBITRARY UNITS, ARBITRARY UNITS
##FACTOR=    0.0002768,     1,               1
##FIRST=     0,             0,               0
##LAST=      2.2672688,     0,               0
##MIN=       0,             -58572,          0
##MAX=       2.2672688,     47332,           0
$$ Real data points
##PAGE= N=1
##DATA TABLE= (X++(R..R)), XYDATA
$$ [...]
$$ plain form
1782 -159 35 177 -134 -75 -39 138 519 138 -153 -148 308 516 302 -172 -114 -20 265 67 -184 -42 -99 -118 -121
1805 -121 -328 -216 -130 -234 -102 -174 -511 -36 384 68 99 322 131 178 551 417 199 475 630 383 389 442
1827 442 243 716 725 174 12 -29 76 -9 114 -575 -175 15 -143 -148 -311 -292 -415 64 -379 -214 -162 166 -104
1850 -104 -137 -51 21 -208 144 249 -157 46 24 596 266 465 -50 163 -85 424 61 -416 -72 -143 109 74
1872 74 -191 83 292 518 420 -45 117 225 359 87 240 57 225 201 540 190 199 144 341 436 -149 -37
1894 -37 -125 -23 -147 -41 -331 -605 -499 -108 -574 -552 -432 -745 -413 -376 -359 -257 -210 -93 165 -132 -271 -303
1916 -303 150 238 400 290 145 580 593 225 280 186 76 341 250 44 29 276 167 -47 -114 -169 -247 -78 -84 -433
1940 -433 -366 -203 62 -89 -278 -474 -370 20 -489 -524 -108 -533 -59 -62 -223 -344 -184 14 35 -378 -322 -551
$$ packed form
1782a59J94J42l11N9L6J77L81l81k91NM56K08k14m74N8R4K85j98k51J42n7j9l
1805a21k07J12Q6j04J32p2l37M75M20l16L1K23j91M7L73j34k18K76J55k47ON3
1827D42j99M73Rn51j62m1J05q5J23o89M00J90j58nj63J9j23M79m43J65N2L28k70
1850a04l3Q6P2k29L52J05m06K03k2N72l30J99n15K13k48N09l63m77L44p1K52l5
1872G4k65K74K09K26r8m65J62J08J34k72J53j83J68k4L39l50Rn5J97R5n85J12
1894c7q8J02j24J06k90k74J06L91m66K2J20l13L32L7J7J02M7J17K58k97j39l2
1916c03M53Q8J62j10j45M35J3l68N5r4j10K65r1k06j5K47j09k14o7n5p8J69ol49
1940d33O7J63K65j51j89j96J04L90n09l5M16m25M74lj61j21J60J98K1m13N6k29
$$ plain form
1962 -551 -164 196 -113 -321 -190 68 42 -38 -186 -342 -68 285 43 87 -136 229 666 233 68 355 310
1983 310 156 429 330 157 269 688 426 277 -21 -193 83 16 -96 67 -479 -421 -327 -371 -602 -617 -151 -516
2005 -516 -384 -413 -375 -263 -116 -215 -82 -301 -74 108 33 187 -79 63 229 256 219 36 14 244 344 178
2027 178 -34 -376 -7 31 12 -357 85 157 -53 13 -35 -102 -123 28 108 -111 -254 -153 64 -34 387 112 -149
2050 -149 289 -49 -167 -3 -251 187 156 -243 -182 -251 -212 -218 31 -434 -445 -119 -258 -285 -100 -356 -295 -195 -130
2073 -130 -22 9 -38 219 276 304 349 292 390 659 481 383 84 -16 336 317 160 401 86 202 34 42 -137 -70
2097 -70 77 -99 -329 -477 -295 -67 -12 -27 -283 -68 14 16 -88 -239 48 281 -5 119 -56 -3 -84 345 241
2120 241 -208 163 13 376 42 59 -401 138 352 5 -208 -386 -168 -44 143 -132 110 -14 121 126 159
$$ packed form
1962e51L87L60l09k08J31K58k6q0j48j56K74L53k42M4k23L65M37m33j65K87m5
1983C10j54K73r9j73J12M19k62j49k98j72K76o7j12J63n46N8R4m4k31j5M66l65
2005e16J32k9L8J12J47r9J33k19K27J82p5J54k66J42J66K7l7j83k2K30J00j66
2027A78k12l42L69L8j9l69M42P2k10O6m8o7k1J51Q0k19j43J01K17r8M21k75k61
2050a49M38l38j18J64k48M38l1l99O1o9L9oK49m65j1L26j39k7J85k56O1J00O5
2073a30J08L1m7K57N7K8M5n7R8K69j78r8k99j00L52j9j57K41l15J16j68Qj79O7
2097g0J47j76k30j48J82K28N5j5k56K15Q2Kj04j51K87K33k86J24j75N3q1M29j04
2120B41m49L71j50L63l34J7m60N39K14l47k13j78K18J24J87k75K42j24J35NL3
$$ plain form
2141 159 -201 64 250 71 -34 45 57 310 379 388 15 29 170 53 -240 -174 -242 -154 -160 172 -136 -149 -61 -100 -212
2166 -212 -192 -337 -151 22 81 -118 -69 104 331 305 28 177 266 537 289 364 -110 18 196 259 426 -233
2188 -233 -4 83 -110 109 -73 -39 201 98 -230 -143 -128 44 -141 -105 10 -87 -79 42 60 -121 -93 142 275
2211 275 507 41 153 8 376 340 154 22 109 129 305 -318 -202 -196 -52 -47 -169 -229 -64 -5 -22 59 162 -186
2235 -186 -157 169 138 133 -206 357 263 475 121 260 50 159 117 292 356 -40 143 196 -57 20 207 101 233
2258 233 -131 -273 -133 -54 -110 -102 -343 -130 295 299 397 -186 -223 172 193 61 229 -111 -24 294 211 334 97 -45
2282 -45 48 57 23 -59 -49 12 -41 -54 101 -369 -33 -81 -253 -207 -135 -292 336 -74 -162 -124 138 -44 264 58 -228
2307 -228 227 467 597 168 -119 58 509 291 316 -123 -231 -101 79 13 116 -57 21 -88 -235 -332 -248 -310
$$ packed form
2141A59l60K65J86j79j05P9J2K53O9Rl73J4J41j17k93O6o8Q8oL32l08j3Q8l9j12
2166b12K0j45J86J73N9j99M9J73K27k6k77J49Q9K71k48P5m74J28J78O3J67o59
2188b33K29Q7j93K19j82L4K40j03l28Q7J5J72j85L6J15r7QJ21J8j81K8K35J33
2211B75K32m66J12j45L68l6j86j32Q7K0J76o23J16OJ44Nj22o0J65N9j7Q1J03l48
2235a86K9L26l1nl39N63r4K12l54J39k10J09m2J75O4l96J83N3k53P7J87j06J32
2258B33l64j42J40P9n6Qk41K13M25MR8n83l7L95K1j32J68l40Q7L18q3J23k37j42
2282d5R3Rl4q2J0O1n3j3J55m70L36m8j72M6P2j57O28m10q8L8K62j82L08k06k86
2307b28M55K40J30m29k87J77M51k18K5m39j08J30J80o6J03j73P8j09j47r7Q4o2
$$ plain form
2329 -310 -302 -205 -248 11 -126 -115 -110 -240 125 103 341 -52 -74 -47 17 111 9 155 78 96 159 275 359 -242 -79
2354 -79 -42 -69 -119 -90 -92 108 111 108 -89 2 112 79 106 -29 1 81 261 250 196 261 59 249 179 108 27 -9 162 216
2382 216 -166 -121 -210 -110 -307 -217 -461 -326 -205 -102 -5 -69 -368 -54 -23 -240 -123 -102 -3 204 131 252 173
2405 173 260 384 135 47 289 81 204 35 209 81 114 163 27 96 -238 -78 -97 19 -106 -344 -175 -34
2427 -34 -201 110 -59 -76 -36 210 -144 147 -12 126 151 22 -83 135 191 173 -19 -78 -17 -65 -112 264 -130
2450 -130 -31 -288 -166 -31 104 -389 -202 111 149 -41 91 -104 139 338 109 223 265 251 -73 128 339
2471 339 210 215 344 197 267 16 44 85 0 -174 -77 -206 60 -49 166 -162 -252 -283 -304 -122 -160 -173 18 111
2495 111 -44 -78 -234 250 -138 -6 204 -11 47 -211 180 488 145 45 103 -39 -59 0 -19 42 5 214 -12
$$ packed form
2329c10QR7m3K59j37J1Nj30L65k2K38l93k2K7O4R4j02J46p7J8O3J16Q4o01J63
2354g9L7k7n0K9kK00Llj97R1J10l3K7j35L0Q0J80j1n4O5k02J90p0p1q1l6J71N4
2382B16l82M5q9J00j97R0k44J35J21J03R7o4k99L14L1k17J17K1R9K07p3J21p9
2405A73Q7J24k49q8K42k08J23j69J74j28L3M9j36O9l34J60j9J16j25k38J69J41
2427c4j67L11j69j7M0K46l54K91j59J38K5j29j05K18N6j8j92n9O1m8m7L76l94
2450a30R9k57J22J35J35m93J87L13L8j90J32j95K43J99k29J14M2j4l24K01K11
2471C39j29NJ29j47P0k51K8M1q5j74R7j29K66j09K15l28r0l1k1J82l8j3J91R3
2495A11j55l4j56M84l88J32K10k15N8k58L91L08l43j00N8j42k0N9j9O1l7K09k26
$$ plain form
2518 -12 13 133 16 9 -291 -192 -268 81 31 -20 -25 -121 317 408 -157 210 -163 164 177 35 -44 -124 164 4 -220
2543 -220 -192 -95 52 -20 -340 63 -264 -188 -2 -205 -268 -382 -78 69 -19 -67 -107 148 180 0 73 152 154 129 299
2568 299 149 172 218 220 32 184 320 -62 147 250 219 -93 -75 52 -222 30 -380 -283 -199 -103 -190 -274 -146 -119
2592 -119 -138 -43 -375 4 -33 13 158 -76 -14 -141 2 33 -24 21 116 -29 149 173 106 32 -65 33 199 -276 -133
2617 -133 -97 50 -122 45 1 221 5 90 -56 62 175 73 -22 -32 -143 305 -75 366 124 83 48 174
2639 174 131 83 -168 -67 -140 -24 -106 -241 -6 -40 -162 33 -78 -80 -12 28 -17 -100 53 -25 -27 77 -176 -92 -16
2664 -16 193 -150 -129 235 278 135 185 211 -173 -83 159 216 -81 -144 -30 -188 126 32 -67 130 -205 -122 -182 36
2688 36 150 45 171 -20 122 168 130 222 122 -166 190 108 196 219 -55 228 153 310 176 120 -64 -128 210
$$ packed form
2518a2K5J20j17pl00R9p6L49n0n1nr6M38R1n65L67l73L27J3j42p9q0K88j60k24
2543b20K8R7J47p2l20M03l27P6J86k03o3j14L04J47q8m8m0K55L2j80P3P9Kk5J70
2568B99j50K3M6Kj88J52J36l82K09J03l1l12J8J27k74K52m10R7Q4R6q7q4J28K7
2592a19j9R5l32L79l7M6J45k34O2j27J43L1n7M5R5j45J78K4o7p4r7R8J66m75J43
2617a33L6J47j72J67m4K20k16Q5j46J18J13j02r5j0j11M48l80M41k42m1l5J26
2639A74m3m8k51J01p3J16q2j35K35l4j22J95j11kO8M0m5q3J53p8kJ04k53Q4P6
2664a6K09l43K1L64M3j43N0K6l84R0K42N7k97o3J14j58L14r4r9J97l35Q3o0K18
2688C6J14j05J26j91J42M6l8R2j00k88L56q2Q8K3k74K83p5J57j34n6j84o4L38
$$ plain form
2711 210 8 -224 226 -311 -12 138 104 39 135 187 -24 264 8 196 249 107 468 256 -212 268 225 404
2733 404 271 250 262 267 147 -184 -30 207 96 -157 143 180 -175 -181 49 183 -254 -115 77 120 229 -195 -100
2756 -100 -3 214 237 -7 212 62 20 -146 278 301 8 -188 -183 87 -27 -6 181 -110 111 211 60 40 -66
2779 -66 -46 -137 98 -90 -33 208 -110 79 195 271 157 82 112 -92 46 54 207 -77 -33 98 205 239 -112 -58
2803 -58 240 159 -77 128 -50 146 -61 -214 -21 -200 -40 24 -42 -150 124 -146 77 155 55 55 121 148 -15
2826 -15 252 -31 110 22 306 77 100 282 163 -209 31 193 104 25 -284 -63 11 -398 -360 119 -57 -167
2848 -167 149 -73 79 61 -87 72 36 -4 325 81 -7 267 321 212 142 123 11 29 285 42 118 -265 -142
2871 -142 -111 -241 -280 64 -161 -158 -102 -105 -73 -107 145 -79 -58 178 126 172 -121 12 -58 73 -151 -63 244 175 373
$$ packed form
2711B10k02k32M50n37K99J50l4o5R6N2k11K88k56J88N3j42L61k12m68M80m3J79
2733D04j33k1J2Nj20l31J54K37j11k53L00L7l55oK30J34m37J39J92M3J09m24R5
2756a00R7K17K3k44K19j50m2j66M24K3k93j96NK70j14K1J87k91K21J00j51k0j06
2779f6K0r1K35j88N7K41l18J89J16P6j14p5L0k04J38QJ53k84M4J31J07L4l51N4
2803e8K98q1k36K05j78J96k07j53J93j79J60O4o6j08K74k70K23P8j00%O6K7j63
2826a5K67k83J41q8K84k29K3J82j19l72K40J62q9p9l09K21P4m09L8M79j76j10
2848a67L16k22J52j8j48J59l6m0L29k44q8K74N4j09p0j9j12J8K56k43P6l83J23
2871a42L1j30l9L44k25LN6lL2l4K52k24K1K36n2M6k93J33p0J31k24Q8L07o9J98
$$ plain form
2896 373 297 203 -66 -40 54 333 59 182 -88 -33 179 -139 -73 -345 40 89 84 62 -181 -51 -142 -24 -18 -81 -21
2921 -21 34 97 -127 57 49 79 48 54 -22 12 205 135 215 -338 -23 -90 149 -218 -52 -118 -68 -82 -113 -334 -67 27
2947 27 191 383 151 151 -47 15 23 184 25 207 219 215 62 -147 30 -57 16 -78 -118 84 82 298 -197 68 -146
2972 -146 -171 -79 -90 -124 87 172 34 72 24 -106 -203 262 -71 120 169 13 -25 223 141 -70 128 -43 300 225
2996 225 196 -90 216 -88 -118 -92 -101 -53 92 -20 -156 -298 -134 -88 -213 13 45 -174 0 121 243 127 125
3019 125 8 196 -56 65 23 -89 167 170 36 117 97 145 114 -48 -94 49 201 -271 -74 14 -158 65 -62
3042 -62 -30 -296 -169 -78 51 44 98 43 5 174 47 -25 129 152 138 70 -135 140 -94 77 79 -12 -4 -115 1 71
3068 71 22 -69 -286 -208 -45 137 -164 -140 96 -94 132 -68 -118 55 260 29 -113 -210 57 230 -21 217
$$ packed form
2896C73p6r4k69K6R4K79k74J23k70N5K12l18O6k72L85M9nk2k43J30r1J18Oo3O0
2921b1N5O3k24J84qL0l1Op6L4J93p0Q0n53L15o7K39l67J66o6N0j4l1k21K67R4
2947B7J64J92k32%j98O2QJ61j59J82J2mj53k09J77q7P3r4m0K02kK16m95K65k14
2972a46k5R2j1l4K11Q5j38L8m8j30r7M65l33J91M9j56l8K48q2k11J98j71L43p5
2996B25k9k86L06l04l0K6rM8J45j12j36j42J64M6j25K26L2k19J74J21J22j16k
3019A25j17J88k52J21m2j12K56Lj34Q1k0M8l1j62m6J43J52m72J97Q8j72K23j27
3042f2L2k66J27R1J29pN4n5l8J69j27p2J54K3j4o8k05K75k34J71Kr1Qj11J16P0
3068G1m9r1k17P8J63J82l01K4K36j90K26k00n0J73K05k31j42r7K67J73k51K38
$$ plain form
3090 217 -122 82 136 -113 -58 -135 -83 -76 106 -69 -41 -142 22 8 -255 -117 -187 23 252 -193 -139 -34 -91 -24
3114 -24 -183 91 -204 -95 161 224 85 43 -114 -57 -101 -228 -223 -254 34 -130 -264 99 -180 -218 -35 -31 -125 -158
3138 -158 -250 115 -39 -381 66 21 -35 386 2 -65 118 -75 165 218 -162 142 -40 100 40 62 102 222 27
3161 27 -121 -230 94 -136 -306 118 -66 -165 -26 6 -224 22 -23 -144 153 -344 -39 -58 94 -205 10 199
3183 199 -145 123 166 169 12 143 73 66 -248 6 20 160 144 -245 -66 -171 -178 -192 71 -133 -128 -164 7 -67 68
3208 68 -123 208 310 79 26 -70 -105 -137 264 27 -189 -39 -172 217 -25 -81 5 -18 227 -113 169 69 -40
3231 -40 27 -241 -301 213 207 -35 -117 134 -110 -242 -179 229 123 37 222 31 426 234 292 -43 145 74 199
3254 199 -135 220 -153 275 207 139 112 223 137 -98 -64 -136 -157 102 72 88 -158 -180 -37 37 -161 81 -74 -64
$$ packed form
3090B17l39K04N4k49N5p7N2PJ82j75K8j01J64j4k63J38p0K10K29m45N4J05n7O7
3114b4j59K74k95J09K56O3j39m2j57N7m4j27Nl1K88j64j34L63k79l8J83Mr4l3
3138a58r2L65j54l42M47m5n6M21l84o7J83j93K40N3l80L04j82J40o0K2M0J20j95
3161B7j48j09L24k30j70M24j84r9J39L2k30K46m5j21K97m97L05j9J52k99K15J89
3183A99l44K68M3Lj57J31p0pl14K54J4J40j6l89J79j05pj4K63k04Nl6J71p4J35
3208F8j91L31J02k31n3r6l5l2M01k37k16J50j33L89k42n6Q6k3K45l40K82j00j09
3231d0O7k68o0N14ok42q2K51k44j32O3M08j06q6J85j91L95j92N8l35J88p1J25
3254A99l34L55l73M28o8o8k7J11q6k35L4p2k1K59l0J6k46k2J43P4j98K42j55J0
$$ plain form
3278 -64 126 -85 77 -224 31 153 206 176 -154 -84 -36 158 -133 -256 -31 -219 29 -113 -109 180 143 -62 -123
3301 -123 -200 -106 -191 -3 -71 44 -38 227 -121 27 -222 -149 -28 -158 187 -146 139 -170 13 71 -305 -98
3323 -98 -304 -257 -29 166 -239 -158 -145 -182 -25 -33 265 168 -43 149 108 -160 33 136 -78 274 -228 4 -96
3346 -96 220 -51 204 -14 -39 -28 6 -92 127 -84 -53 -1 -111 -133 -145 -27 6 -115 -149 -135 -161 113 -62 -64 -89
3371 -89 -6 256 -85 86 167 -47 277 202 359 182 -94 367 -145 -232 -105 16 -24 -138 43 109 33 -132 -113
3394 -113 -158 -73 -83 -161 -255 13 191 90 164 45 -114 18 180 -207 168 40 273 66 -76 150 -158 21
3416 21 152 -184 208 108 -3 -187 46 134 -191 -87 398 -35 -124 26 -349 -3 113 0 -57 -10 183 219
3438 219 188 131 -104 5 194 -79 -160 217 134 223 -306 104 284 -2 49 70 263 -17 -192 194 129 187 -9
$$ packed form
3278f4J90k11J62l01K55J22N3l0l30P0M8J94k91j23K25j88K48j42MK89l7k05o1
3301a23p7R4q5J88o8J15q2K65l48J48k49P3J21j30L45l33K85l09J83N8l76K07
3323i8k06M7K28J95m05Q1J3l7J57qK98r7k11J92m1k68J93J03k14L52n02K32j00
3346i6L16k71K55k18k5J1L4r8K19k11L1N2j10k2j2J18L3j21l4J4k6K74j75kk5
3371h9Q3K62l41J71Q1k14L24p5J57j77k76M61n12q7J27J21m0j14J81O6p6j65J9
3394a13m5Q5j0p8r4K68J78j01P4j19j59J32J62l87L75j28K33k07j42K26l08J79
3416B1J31l36L92j00j11j84K33Q8l25J04M85m33q9J50l75L46J16j13n7M7J93L6
3438B19l1n7k35J09J89k73q1L77q3Q9n29M10J80k86N1K1J93k80j75L86o5N8j96
$$ plain form
3461 -9 -165 -134 -33 -103 53 27 -139 127 166 -9 -52 233 41 66 219 139 -17 -337 198 29 120 88 -109 79
3485 79 51 -33 -99 -160 -207 75 105 36 -10 -95 80 13 -221 -114 46 68 -182 -45 -50 139 6 -32 225 18 -47
3510 -47 186 -55 -53 -85 37 89 -229 -55 -114 -425 -229 -200 -35 4 114 -24 135 -151 -130 -44 -30 98 99 5 100
3535 100 85 96 48 23 130 19 -145 -65 10 119 106 117 -84 -11 -189 27 -57 -40 68 -212 -175 311 -50 -89
3559 -89 71 -6 100 -86 299 -66 115 203 304 44 -142 -177 120 -29 260 402 68 216 130 63 -38 20
3581 20 -46 294 125 -61 -309 -50 43 71 1 -22 239 120 -46 -181 211 -179 46 -4 199 51 135 25 -22
3604 -22 -27 -26 57 230 38 -61 76 192 -171 154 -27 130 -25 -145 -17 -37 -91 -208 -37 -212 54 -58 139
3627 139 -147 116 17 -326 132 51 -185 95 -76 182 -259 164 -79 206 204 32 76 -47 353 -228 -114 253
$$ packed form
3461ij56L1J01p0J56k6j66K66L9j75m3K85j92K5J53q0j56l20N35j69R1l2j97J88
3485G9k8q4o6o1m7K82L0o9m6q5J75o7k34J07J60K2k50J37nJ89j33l8K57k07o5
3510d7K33k41Kl2J22N2l18J74n9l11J96K9J65L9J10j38J59k86K1Q6J4J28Jr4R5
3535A00j5J1m8k5J07j11j64Q0P5J09j3J1k01P3j78K16q4J7J08k80L7M86l61l9
3559h9J60p7J06j86L85l65J81Q8J01k60j86l5K97j49K89J42l34J48q6o7j01N8
3581B0o6L40j69j86k48K59R3K8p0k3K61j19j66j35L92l90K25n0K03j48Q4j10m7
3604b2nJQ3J73j92r9J37J16l63L25j81J57j55j20J28k0n4j17J71j75K66j12J97
3627A39k86K63r9l43M58q1k36K80j71K58m41M23k43K85kj72M4j23M00n81J14L67
$$ plain form
3649 253 84 -230 -74 -148 -229 1 122 161 -190 -30 318 61 -115 114 -118 159 15 -94 195 112 57 118
3671 118 -3 -39 9 -100 -75 112 212 -70 -144 120 -43 96 -55 -133 212 143 -91 -98 -134 64 8 125 -178
3694 -178 -202 69 74 35 19 316 -64 -301 -112 86 17 192 7 178 80 30 20 90 -127 -129 -129 50 -42 -44 146 53
3720 53 -83 7 -121 115 47 56 -53 -44 148 111 62 -182 188 3 -14 73 -117 -96 133 -50 118 -99 -61 -17 -23
3745 -23 -5 -117 -97 -178 -15 13 -42 47 -127 1 219 -123 160 39 -49 35 -196 77 -100 -5 35 271 14 15
3769 15 147 17 -40 2 -126 -65 -91 -97 -136 13 -138 43 -45 -157 -73 -69 -10 57 22 49 61 25 59 -25 215 -86 57
3796 57 -136 120 -187 91 14 25 282 -43 122 -19 -91 22 158 -292 118 -35 -42 243 149 -72 0 15 -67
3819 -67 42 96 -7 183 -246 3 43 150 29 -33 -54 192 141 -14 50 71 -60 83 66 -294 -284 61 -205
$$ packed form
3649B53j69l14J56p4q1K30J21L9l51J60L48k57j76K29k32K77j44j09K89q3n5O1
3671A18j21l6M8j09K5J87J00k82p4K64j63J39j51p8L45o9k34pl6J98n6J17l03
3694a78k4K71Nl9j6K97l80k37J89J98o9J75j85J71r8n0j0P0k17k%J79r2kJ90r3
3720E3j36R0j28K36o8Rj09RJ92l7m9k44L70j85j7Q7j90K1K29j83J68k17L8M4o
3745b3J8j12K0q1J63K8n5Q9j74J28K18l42K83j21q8Q4k31K73j77R5M0K36k57J
3769A5J32j30n7M2j28O1k6ol9J49j51J81q8j12Q4MN9O7l5K7J2l6L4q4K40l01J43
3796E7j93K56l07K78p7J1K57l25J65j41p2J13J36m50M10j53pK85r4k21P2J5q2
3819f7J09N4j03J90m29K49M0J07j21o2k1K46n1j55O4K1j31J43j7l60J0L45k66
$$ plain form
3842 -205 -44 -66 -92 66 -286 -169 22 -199 41 -161 -258 -163 -143 0 110 235 142 -225 -16 55 -223 52
3864 52 -179 178 70 -220 30 -208 75 66 -199 127 -185 34 77 -171 -65 42 -42 142 -190 91 43 187
3886 187 55 140 -50 22 116 129 206 -106 -17 48 47 -62 200 -122 54 -23 -1 -193 63 153 -232 108 11 -20 -62
3911 -62 -16 -98 208 38 -192 204 -105 247 81 -90 -144 198 -217 120 31 172 -14 36 -86 23 156 186
3933 186 -73 -132 -46 -132 -40 173 -121 -257 -52 -74 -87 32 -164 46 44 -10 104 63 29 -93 -70 8 -88 -99 -127
3958 -127 -114 -210 101 80 38 145 86 -56 105 270 -132 125 78 -28 -62 113 -78 30 -127 -10 -230 211
3980 211 -4 -38 -21 -47 178 215 251 20 271 86 61 16 -3 49 104 -29 358 218 146 -29 14 137 -129 -164
4004 -164 -52 -66 72 -2 -44 366 109 277 -16 7 -134 63 62 -18 -90 -210 -16 -304 57 32 -42 -49 -45 12 142
$$ packed form
3842b05J61k2k6J58l52J17J91k21K40k02r7R5K0J43J10J25r3l67K09P1k78K75
3864E2k31L57j08k90K50k38K83rk65L26l12K19M3k48J06J07q4J84l32K81m8J44
3886A87j32Q5j90P2R4J3P7l12Q9O5jj09K62l22J76p7K2j92K56R0l85L40r7l1m2
3911f2M6q2L06j70k30L96l09L52j66j71n4L42m15L37q9J41j86N0j22J09J33L0
3933A86k59n9Q6q6R2K13k94j36K05k2j3J19j96K10kn4J14m1l4j22K3P8r6j1k8
3958a27J3r6L11k1m2J07n9j42J61J65m02K57m7j06l4J75j91J08j57J17k20M41
3980B11k15l4J7k6K25L7L6k31K51j85k5m5j9N2N5j33L87j40p2j75M3J23k66l5
4004a64J12j4J38p4m2M10k57J68k93K3j41J97jq0p2j20J94k88L61k5p4pMN7J30
$$ plain form
4029 142 38 -123 -86 -15 53 46 -45 40 56 -155 27 171 -151 -79 -84 103 -120 133 -31 28 -95 80 66 12 301
4054 301 124 8 111 24 -71 7 30 160 -76 -291 8 20 -94 9 -22 -136 -80 -107 -339 -17 -13 -20 35 133 126
4079 126 -30 -174 -63 66 223 183 148 -15 -104 -28 99 38 119 17 -255 -116 110 159 -102 -108 -46 27 -109 -189
4103 -189 -2 41 62 -159 -27 -98 -160 -180 79 -30 19 193 -156 59 268 162 91 -11 89 -22 261 311 -30
4126 -30 94 30 58 276 -40 175 7 12 110 -35 13 84 -160 272 249 -18 -119 -18 -288 125 -197 -228 164
4149 164 270 -170 41 91 14 206 -3 0 -99 -48 -64 -236 -264 19 0 110 -165 23 42 -63 -100 -21 30 -53 -2
4174 -2 126 170 -43 -80 20 13 -30 62 28 160 21 -38 83 59 106 157 22 102 162 -41 115 246 -5 58 63 73
4200 73 -10 -316 38 56 115 91 -10 -22 158 135 -40 -148 -80 -57 -89 -15 -73 180 34 160 28 -213 127 -51
$$ packed form
4029A42j04j61L7P1O8pr1Q5J6k11J82J44l22P2nJ87k23K53j64N9j23J75j4n4K89
4054C01j77j16J03q7r5P8K3J30k36k15K99J2j14J03l1j14N6k7k32L22MpN5R8p
4079A26j56j44J11J29J57m0l5j63q9P6J27o1Q1j02k72J39K26M9k61oO2P3j36q0
4103a89J87M3K1k21J32p1o2k0K59j09M9J74l49K15K09j06p1j02J00j11K83N0l41
4126c0J24o4K8K18l16K15j68NR8j45M8P1k44M32k3k67j01J01k70M13l22l1L92
4149A64J06m40K11N0p7J92k09Lr9N1j6j72k8K83j9J10k75J88J9j05l7P9N1q3N1
4174bJ28M4k13l7J00pm3R2l4J32j39n9J21k4M7N1j35Q0O0k03J56J31k51O3NJ0
4200G3q3l06L54J8N9k4j01j2J80k3j75j08O8K3l2P4n8K53j46J26j32k41L40j78
$$ plain form
4224 -51 73 -181 -146 -29 38 59 -189 168 192 17 -140 -229 -7 64 -49 -214 -115 116 -22 281 56 163 88
4247 88 127 170 -78 351 8 -18 209 -5 14 -63 -120 41 201 49 -55 -29 117 216 -291 28 102 56 -73 182
4271 182 81 74 154 -83 -214 -25 -84 252 -11 -85 165 50 -5 -88 84 -185 207 -90 325 54 -85 23
4293 23 -113 86 79 -278 -113 -8 58 230 -9 -100 202 56 -53 358 70 -19 70 243 188 -27 194 -8 -192
4316 -192 119 -47 -121 -86 52 -99 13 -14 33 71 32 9 73 -129 105 40 27 -72 -134 73 -39 225 -31 73
4340 73 94 -324 245 56 23 61 61 -30 -33 -38 283 94 170 157 56 13 86 228 128 75 -293 -72 41 72 103 27
4366 27 -137 72 -85 -104 -43 -79 -203 186 -215 -140 -106 192 -52 116 52 60 -74 98 64 35 169 192 38 99
4390 99 -15 -130 226 51 -136 51 99 -1 80 180 106 -31 8 -11 119 -187 164 186 71 -166 0 4 127
$$ packed form
4224e1J24k54L5J17O7K1k48L57K4j75j57q9K22P1j13j65R9K31j38L03k25J07p5
4247H8L9M3k48M29l43k6K27k14J9p7n7J61J60j52j04K6J46R9n07L19P4m6j29K55
4271A82j01pQ0k37j31J89n9L36k63p4K50j15n5q3J72k69L92k97M15k71j39J08
4293B3j36J99pl57J65J05O6J72k39r1L02j46j09M11k88q9Q9J73n5k15K21k02j84
4316a92L11j66p4L5J38j51J12k7M7L8l9k3O4k02K34o5j3r9o2K07j12K64k56J04
4340G3K1m18N69j89l3L8%r1lnL21j89P6j3j01m3P3J42j00n3l68K21J13L1L1p6
4366B7j64K09j57j9O1l6j24L89m01P5L4K98k44J68o4Qj34J72l4k9J34K3j54O1
4390I9j14j15L56j75j87J87M8j00Q1J00p4j37L9j9J30l06L51K2j15k37J66MJ23
$$ plain form
4413 127 162 70 104 -64 21 210 106 -104 162 -228 -38 56 -210 241 63 108 -19 100 51 175 -191 -31
4435 -31 -50 69 -146 259 -2 -82 79 309 -34 -21 -40 -81 -93 -260 -197 -56 175 -165 -12 121 26 -287 -246
4458 -246 -432 -203 -1 19 -95 -144 -48 -34 128 -36 -194 102 87 -9 -61 95 89 236 -42 291 -94 139 26
4481 26 144 181 78 -72 108 -15 -208 8 171 -149 -18 132 109 -340 -101 -12 -7 3 38 -52 -190 18 -76
4504 -76 -194 153 -187 -125 -52 -69 -110 8 -62 -114 -74 -99 198 -2 199 -214 43 -67 -57 56 28 178 -39 -73
4528 -73 -40 290 150 -102 157 -19 -134 141 -121 7 139 -225 60 79 29 171 -85 -51 129 40 200 -16
4550 -16 189 -79 -131 228 -179 -197 -40 75 -103 -24 78 64 13 -278 -61 91 -39 93 -131 159 -238 88
4572 88 -67 95 -59 25 40 -78 31 26 -118 -31 43 -10 -5 -85 -21 -171 -30 59 140 -282 168 -203 87 185 142
$$ packed form
4413A27L5r2L4j68Q5J89j04k10K66l90J90R4k66M51j78M5j27J19m9J24l66J60
4435c1j9J19k15M05k61q0J61K30l43J3j9m1j2j67O3J41K31l40J53J33r5l13M1
4458b46j86K29K02K0j14m9R6J4J62j64j58K96j5r6n2J56oJ47k78L33l85K33j13
4481B6J18L7j03j50J80j23j93K16J63l20J31J50k3m49K39Q9NJ0L5r0j38K08r4
4504g6j18L47l40O2P3j7m1J18p0n2M0k5K97k00K01m13K57j10J0J13k8J50k17l4
4528g3L3L30j40k52K59j76j15K75k62J28J32l64K85J9n0J42k56L4J80q9J60k16
4550a6K05k68n2L59m07j8J57J15j78P9J02j4n1k91K17J52j30J32k24K90l97L26
4572H8j55J62j54Q4J5j18J09nj44Q7P4n3Nq0O4j50J41Q9Q1m22M50l71K90R8m3
$$ plain form
4597 142 -28 -206 -132 109 -216 -21 -6 53 176 -215 36 284 238 -221 -84 24 126 -185 92 148 -40 -26
4619 -26 72 -201 -22 -16 198 -44 -100 -177 121 -42 -320 -225 -135 -218 -116 179 213 32 192 105 -16 75 -95 3
4643 3 20 171 205 128 -284 284 368 66 8 -264 -58 393 -179 21 29 92 -140 179 -63 -207 45 105 -164 -70
4667 -70 -18 121 131 -41 268 52 -107 -31 -44 -134 -7 -377 -12 64 -193 133 276 74 -243 -129 -4 102
4689 102 -282 63 89 -28 239 23 -116 -14 24 85 347 77 100 15 -60 -123 73 -56 -40 -69 -87 77 -32
4712 -32 -7 -102 -128 45 -152 -209 -74 -18 -35 4 -81 10 69 -253 232 94 117 -126 198 154 -190 48 -99 19
4736 19 -156 37 31 69 5 -26 -53 12 -7 -253 120 -71 -21 32 -164 185 23 3 11 -26 80 102 51 -107 -2 309
4762 309 -117 -61 68 176 97 197 -82 -135 106 -219 10 -60 -189 -52 -114 15 -51 115 -167 27 206 -255
$$ packed form
4597A42j70j78P4K41l25J95J5N9J23l91K51K48m6m59J37J08J02l11K77N6j88J4
4619b6R8k73J79OK14k42n6p7K98j63k78R5R0q3J02K95L4j81J60q7j21R1j70R8
4643CJ7J51L4p7m12N68Q4l02n8k72K06M51n72K00QO3k32L19k42j44K52O0k69R4
4667g0N2J39J0j72L09k16j59P6j3r0J27l70L65P6k57L26J43k02l17J14J25J06
4689A02l84L45K6j17K67k16j39J02L8O1K62k70K3q5p5o3J96j29J6k9j8J64j09
4712c2K5r5k6J73j97n7J35N6j7L9q5R1N9l22M85j38K3k43L24m4l44K38j47J18
4736A9j75J93oL8o4l1k7O5j9k46L73j91N0N3j96L49j62k0Ql7J06K2n1j58J05L11
4762C09m26N6J29J08p9J00k79n3K41l25K29p0j29J37o2J29o6J66k82J94J79m61
$$ plain form
4784 -255 -37 -126 91 -151 -127 -56 7 136 -133 -62 -156 -72 -123 234 -100 8 180 70 222 46 101 -129 70
4807 70 258 294 69 149 99 223 434 48 -177 33 -49 -26 -68 -178 186 50 121 1 34 -65 49 -195 -69
4830 -69 -45 98 -231 152 13 106 134 -220 -133 19 -39 9 -161 -80 311 -182 -171 -205 -70 17 224 -143 -126 103
4854 103 66 -162 70 232 -209 -93 14 110 -23 -34 34 -39 26 150 142 -61 144 37 86 21 250 -154 -24
4877 -24 -23 -217 -71 191 9 -151 240 -79 125 60 -109 -306 -127 -35 68 -156 190 65 65 -128 10 -37 -108
4900 -108 -108 154 95 137 -8 232 38 -201 -121 -26 171 151 -35 -102 -87 -233 -51 -311 -138 -92 -67 93 -183 8
4924 8 71 -26 -80 -68 101 -75 -62 -29 11 -3 152 26 156 -39 -201 -23 66 169 -311 66 -6 -99 101 -74
4948 -74 -1 13 -133 -74 160 -107 -88 219 105 112 -54 16 84 1 85 -52 85 127 -187 137 103 78 -42 80 97
$$ packed form
4784b55K18q9K17k42K4P1O3J29k69P1r4Q4n1L57l34J08J72j10J52j76N5k30J99
4807G0J88L6k25Q0n0J24K11l86k25K10q2K3m2j10L64j36P1j20L3r9J14k44J26
4830f9K4J43l29L83j39R3K8l54Q7J52n8M8j70Q1L91m93J1l4J35Q7K07l67J7K29
4854A03l7k28K32J62m41J16J07R6j33j1O8p3O5J24qk03K05j07M9o5K29m04J30
4877b4Jj94J46K62j82j60L91l19K04o5j69j97J79R2J03k24L46j25%j93J38m7p1
4900a08%K62n9M2j45K40j94k39Q0R5J97k0j86o7J5j46J82k60J73M6K5J60k76J91
4924HO3r7n4J2J69j76J3L3M0j4J55j26J30j95j62J78Q9J03m80L77p2r3K00j75
4948g4P3J4j46N9K34k67J9L07j14Pj66P0O8q3Q4j37J37M2l14L24l4k5j20J22J7
$$ plain form
4973 97 -45 -83 1 33 15 -42 186 50 152 296 -204 -171 123 110 49 32 19 -91 174 38 36 -252 93 154 94
4998 94 202 179 -11 -114 138 -268 74 -66 15 20 -287 -113 -9 -161 -9 -213 -147 -110 89 232 -94 188
5020 188 110 -21 136 30 -2 151 148 119 -6 313 -23 160 420 -52 -23 -129 -133 -149 -65 -169 138 81 65 -188
5044 -188 -166 34 68 -58 -76 -53 -114 -61 -102 -21 -48 -153 -182 -44 116 -175 -174 87 -19 49 -122 -228 -79 11 -85
5069 -85 -159 113 61 32 27 -72 -87 107 -47 -69 146 84 217 99 -71 -58 166 -25 53 108 -161 75 -109 135
5093 135 -24 -21 -123 -164 18 118 80 -96 180 43 106 -6 -180 -113 184 59 -74 -131 95 45 36 -249 -219 111
5117 111 92 -163 -266 -45 72 -140 -168 75 -172 213 418 387 207 187 -84 -58 51 20 -35 -135 -89 -207 -110
5140 -110 94 -76 1 -37 37 -213 312 51 -53 -92 13 -24 57 85 -112 166 -62 20 -42 6 -129 99 64 165
$$ packed form
4973I7j42l8Q4L2j8n7K28j36J02J44n00L3K94j3o1j7j3j10K65j36kk88L45O1o0
4998I4J08k3j90j03K52m06L42j40Q1Nl07J74J04j52J52k04O6L7J99J43l26K82
5020A88p8j31J57j06l2J53lk9j25L19l36J83K60m72K9j06mj6Q4j04L07n7j6k53
5044a88K2K00L4j26j8K3o1N3m1Q1k7j05k9J38J60k91JK61j06O8j71j06J49R0r6
5069h5p4K72n2k9nr9j5J94j54k2K15o2J33j18j70J3K24j91P8N5k69K36j84K44
5093A35j59Lj02m1J82J00l8j76K76j37O3j12j74O7K97j25j33n7K26n0rk85L0L30
5117A11j9k55j03K21J17k12k8K43k47L85K05l1j80k0k71K6J09l1n5j00M6j18R7
5140a10K04j70P7l8P4k50N25k61j04l9J05l7Q1K8j97K78k28Q2o2M8j35K28l5J01
$$ plain form
5164 165 -108 -200 -210 -21 89 -27 -74 -95 -19 -41 -32 -1 -264 -245 112 136 -85 -39 -126 97 194 33 46 -249 -211
5189 -211 -80 -63 -178 -180 0 4 -145 162 293 223 -241 2 -123 -11 -107 -197 -248 -202 104 107 45 -267 184 129 84
5214 84 -114 234 183 -1 261 -131 8 3 -230 -70 -162 -50 -73 143 188 93 -9 -25 213 -196 -89 -7 -19 13
5238 13 73 177 -1 208 -150 139 -54 -18 -130 44 -198 41 1 -135 40 -93 -60 -41 -102 82 -55 -97 -72
5261 -72 -73 89 -82 -86 -43 -27 13 -138 116 -86 -67 -241 211 21 153 -94 166 143 -193 -87 164 176 26 199
5285 199 -47 11 111 57 -137 186 -86 -130 60 -108 -122 -131 140 195 11 123 20 -165 20 -17 -120 -5 31
5308 31 170 21 171 276 -27 131 165 60 283 163 -46 -80 215 74 -44 3 66 -8 49 56 -244 108 -44
5331 -44 97 -48 -104 -248 260 97 -55 125 224 -57 117 91 -213 -182 121 -40 310 -93 57 102 -171 -319
$$ packed form
5164A65k73r2j0J89J10j16m7k1P6k2RL1k63J9L57K4k21M6q7K23R7j61J3k95L8
5189b11J31J7j15kJ80Mj49L07J31p0m64K43j25J12r6r0n1M6L06Lo2l12M51n5m5
5214H4j98L48n1j84K62l92J39nk33J60r2J12k3K16M5r5j02j6K38m09J07Q2j2L2
5238A3O0J04j78K09l58K89j93L6j12J74k42K39m0j36J75j33L3J9o1J84j37m2K5
5261g2jJ62j71mM3J6M0j51K54k02J9j74M52j90J32k47K60k3l36J06K51J2j50J73
5285A99k46N8J00n4j94L23k72m4J90j68j4rK71N5j84J12j03j85J85l7j03J15L6
5308C1J39j49J50J05l03J58L4j05K23j20k09l4K95j41j18M7O3p4N7Pl00L52j52
5331d4J41j45n6j44N08j63j52J80R9k81J74k6l04L1L03j61L50m03J50M5k73j48
$$ plain form
5353 -319 71 -5 160 35 -65 -8 -4 330 -135 52 155 -90 -211 131 -143 -162 114 70 -51 102 -349 -152
5375 -152 -52 23 20 -127 -69 -70 382 52 -99 196 -38 -43 193 301 -254 -89 12 106 -74 -23 -100 -15 265 -119
5399 -119 -13 -157 87 -132 155 -91 -38 -278 34 123 64 10 165 -36 18 118 84 -205 -123 136 72 -49 126
5422 126 148 101 196 -198 -3 -40 43 72 -15 179 176 30 143 -101 -14 199 -41 -18 -68 106 51 83 122 166 87 -157
5448 -157 217 68 -101 29 38 130 -156 77 140 112 -142 -181 -86 -72 -47 -209 -63 -220 146 206 49 -82 27
5471 27 -54 64 56 228 -24 -38 51 83 52 -181 -36 119 76 10 130 205 -66 -177 -325 188 -240 -229 97 -163
5495 -163 -208 -145 34 -55 175 -133 -28 9 50 -96 -66 158 -95 -139 -93 -151 -110 23 -53 -104 45 -88 146 -26
5519 -26 233 27 103 106 -11 52 -126 -7 -96 -49 35 173 -89 287 22 57 -71 -1 -143 -160 -240 3 -95 98
$$ packed form
5353c19L90p6J65j25j00N7ML34m65J87J03k45j21L42k74j9K76m4j21J53m51J97
5375a52J00P5lj47N8jM52l30j51K95k34nK36J08n55J65J01R4j80N1p7Q5K80l84
5399a19J06j44K44k19K87k46N3k40L12Q9n9n4J55k01N4J00l4k89Q2K59o4j21J75
5422A26K2m7R5l94J95l7Q3K9q7J94lj46J13k44Q7K13k40K3n0J74n5L2L9M4p9k44
5448a57L74j49j69J30RR2k86K33O3k8k54l9R5J4K5j62J46j57L66O0j57j31J09
5471B7q1J18qJ72k52j4Q9L2l1k33J45J55m3o6J20P5k71j11j48N13m28J1L26k60
5495a63m5O3J79q9K30l08J05L7M1j46L0K24k53m4M6n8M1J33p6n1J49j33K34j72
5519b6K59k06P6Lj17O3j78J19q9M7Q4J38k62L76k65L5j28P0j42j7q0K43r8J93
$$ plain form
5543 98 -99 -166 94 -119 309 56 48 197 -60 141 -69 21 -67 -104 -277 -170 113 -53 73 -115 312 162
5565 162 -194 149 -82 -126 -143 -36 44 -17 61 -165 -138 -17 -61 -53 -236 -196 68 113 -58 -113 -147 -90 129 28 -28
5590 -28 165 153 83 -172 -96 -108 171 147 -62 97 -27 137 -120 -69 -263 -22 23 64 103 98 -114 -197 52 -84
5614 -84 -132 -7 29 -78 194 27 -171 241 -91 -123 -84 -236 -103 114 -179 164 -286 172 239 249 98 51 -173
5637 -173 -80 -251 -113 7 183 -116 -25 -235 91 18 -79 -214 -40 -51 18 48 -124 -107 69 336 -57 9 -164
5660 -164 -39 -113 247 82 45 -62 -96 350 -40 389 -135 220 -124 -81 -78 -11 -76 -325 -66 -97 -116 -12 -24 218
5684 218 -242 -61 -60 340 153 129 90 -9 -77 66 -193 -130 -56 -27 -13 -13 13 -64 156 -145 -16 100 -81 48 -15
5709 -15 96 195 19 114 -83 236 -89 -155 -106 41 -79 -11 93 -39 209 -237 -322 -4 -55 -110 232 -166 -51
$$ packed form
5543I8j97o7K60k13M28k53qJ49k57K01k10R0q8l7j73J07K83j66J26j88M27j50
5565A62l56L43k31m4j7J07Q0o1P8k26K7J21m4Qj83M0K64M5j71n5l4N7K19j01n6
5590b8J93j2p0k55P6j2K79k4k09J59j24J64k57N1j94K41M5M1L9nk12q3K49j36
5614h4m8J25L6j07K72j67j98M12l32l2L9j52J33K17k93L43m50M58O7J0j51m7k24
5637a73R3j71J38J20J76k99R1k10L26p3r7j35J74j1O9L0j72J7J76K67l93O6j73
5660a64J25p4L60j65l7j07l4M46l90M29n24L55l44M3LO7o5k49K59l1j9J04j2K42
5684B18m60J81JM00j87k4l9r9o8J43k59O3P4K9J4%K6p7K20l01J29J16j81J29o3
5709a5J11R9j76R5j97L19l25o6M9J47j20O8J04j32K48m46q5L18n1n5L42l98J15
$$ plain form
5732 -51 199 -141 349 123 166 -110 -10 -146 59 37 40 19 163 -127 120 -99 -154 132 -10 137 108 47 -44
5755 -44 -83 -87 -21 88 -14 -94 -75 -114 -323 -29 69 102 156 -6 -110 -126 -269 -4 209 -184 187 -260 123 48
5779 48 122 16 45 192 -58 93 -23 6 -134 -53 -219 -228 188 -59 131 18 7 63 -74 55 -118 -64 169
5802 169 59 15 14 -16 114 -20 -65 -40 -35 86 77 -62 -107 -146 27 -114 -135 -8 -45 67 -100 48 115 18 -130
5827 -130 49 -106 -71 -302 -210 48 -36 250 161 -36 26 -49 -1 -7 43 124 -166 144 -5 89 -90 -200 161 -18
5851 -18 158 -28 132 167 -37 -66 -135 112 -108 -28 -105 11 -70 -130 148 69 189 24 -57 -27 -133 -134 -169 -225 169
5876 169 34 -61 -88 82 -243 -46 -139 -303 -219 -6 -52 -60 -31 -247 30 -117 176 -33 -119 285 160 -50 -266
5899 -266 -69 -72 11 81 110 -60 53 -47 93 29 83 159 49 110 39 139 -41 134 216 -202 -241 -39 -294 67
$$ packed form
5732e1K50l40M90k26M3k76J00j36K05k2Lk1J44k90K47k19n5K86j42J47k9o1r1
5755d4l9mO6J09j02q0J9l9k09K94R8L3N4j62j04j6j43K65K13l93L71m47L83p5
5779D8P4j06K9J47k50J51j16K9j40Q1j66rM16k47J90j13j1N6j37J29j73N4K33
5802A69j10m4jl0J30j34m5K5NJ21rj39m5l9J73j41k1J27l7J12j67J48O7r7j48
5827a30J79j55L5k31R2K58q4K86q9j97O2p5M8oN0Q1k90L10j49R4j79j10L61j79
5851a8J76j86J60L5k04k9o9K47k20Q0p7J16q1o0K78p9J20j65q1L0j06jl5n6L94
5876A69j35r5k7J70l25J97r3j64Q4K13m6qK9k16K77j47K93k09q6M04j25k10k16
5899b66J97lQ3P0K9j70J13j00J40o4N4P6j10O1p1J00j80J75Q2m18l9K02k55L61
$$ plain form
5923 67 17 -67 171 87 91 35 -14 -159 68 -102 125 79 5 219 65 90 -117 62 -59 -206 78 76 -135 2
5947 2 69 48 114 -127 -287 -203 128 21 125 -131 -99 172 116 16 -121 -127 -213 -13 0 -89 -181 254 159 80 47 42
5973 42 92 -3 451 81 120 67 -84 -128 101 -45 62 144 71 -210 127 -100 -53 108 -203 -58 201 58 142
5996 142 109 23 21 106 55 -38 15 74 -13 -77 -8 90 123 8 -66 109 -174 102 -115 22 168 -162 61 186 -223
6021 -223 -77 -105 -188 -72 -126 -94 42 185 -236 -96 -53 -87 41 23 12 -10 -5 -219 -98 -1 77 -53 74 -21 -134
6046 -134 -180 138 -45 6 -20 21 99 -116 106 -81 160 68 -283 21 141 147 -177 -22 -29 -223 69 73 -138 99
6070 99 -63 -84 -98 140 36 -5 93 -83 49 46 96 76 116 60 -57 -33 -50 275 -84 148 -91 76 28 -87 -99
6095 -99 -416 -192 -96 58 -148 185 -381 79 -6 -57 165 -79 -131 -4 -85 -43 86 -114 43 -112 277 109
$$ packed form
5923F7n0q4K38q4Mn6m9j45K27j70K27m6p4K14j54K5k07J79j21j47K84kk11J37
5947BO7k1O6k41j60Q4L31j07J04k56L2K71n6j00j37oq6K00J3q9r2M35r5p9l3n
5973D2N0r5M54l70L9n3j51m4K29j46J07Q2p3k81L37k27M7J61l11J45K59j43Q4
5996A42l3q6kQ5n1r3N3N9q7o4O9R8L3j15p4J75k83K76k17J37J46l30K23J25m09
6021b23J46k8q3J16n4L2J36J43m21J40M3l4J28j8j1k2Nk14J21R7P8j30J27r5j13
6046a34m6L18j83N1k6M1P8k15K22j87K41r2l51L04J20Ol24J55pj94K92Mk11K37
6070I9j62k1j4K38j04m1R8j76J32lN0k0M0n6j17K4j7L25l59K32k39J67m8j15j2
6095i9l17K24R6J54k06L33n66M60q5n1K22k44n2J27q1M2J29k00J57j55L89j68
$$ plain form
6117 109 237 265 -3 76 177 -54 146 -71 122 -85 65 -246 -302 184 141 -59 -75 111 -51 -55 -218 20
6139 20 -173 -206 -179 -152 21 -52 35 154 -84 -21 52 -42 23 -9 -101 45 71 -131 -24 32 -273 15 183 88 -17
6164 -17 69 -52 -89 120 -21 -8 -200 27 -76 -33 101 -104 108 140 90 98 -144 146 14 -67 -32 -94 -127 16
6188 16 -96 -54 -69 -149 44 -207 -98 -30 -51 -71 -50 -5 167 38 213 233 117 -103 72 72 210 27 -148 100
6212 100 223 -215 -48 -128 5 -23 -3 43 -8 -174 145 71 -47 158 103 -49 154 -1 -5 186 -47 45 96 87
6236 87 -124 -36 60 66 -86 9 148 -153 80 -71 -12 -38 145 5 -46 -163 156 138 -123 231 158 73 -84 48
6260 48 164 14 15 -134 204 113 -159 -114 188 178 253 -160 -325 13 -153 -163 -329 -243 120 -64 97 -227 -144
6283 -144 20 52 -48 38 -48 134 36 46 -11 -140 -89 4 62 -73 191 75 55 28 117 -56 58 -26 6 -67 51
$$ packed form
6117A09J28K8k68P9J01k31K00k17J93k07J50l11n6M86m3k00j6J86j62mj63K38
6139B0j93l3K7K7J73p3Q7J19k38O3P3r4O5l2r2J46K6k02J07N6l05K88J68r5j05
6164a7Q6j21l7K09j41J3j92K27j03M3J34k05K12L2n0Qk42K90j32q1L5o2l3J43
6188A6j12M2j5q0J93k51J09O8k1k0K1M5J72j29J75K0j16k20J75%J38j83j75K48
6212A00J23m38J67q0J33k8K0M6n1j66L19p4j18K05n5j52K03j55mJ91k33R2N1r
6236H7k11Q8R6Oj52R5J39l01K33j51N9k6J83j40n1j17L19j8k61L54p3q5j57J32
6260D8J16j50Jj49L38r1k72M5L02j0P5m13j65L38j66j0j66Q6L63j84J61l24Q3
6283a44J64L2j00Q6q6J82r8J0n7j29N1R3N8j35K64j16k0k7Q9j73J14q4L2p3J18
$$ plain form
6308 51 -12 -48 -149 -10 73 -2 -84 -180 57 40 -130 228 195 -234 168 184 122 178 95 -310 67 123 -22 92 -65
6333 -65 -195 -211 29 -140 72 -10 248 100 61 214 -15 23 85 125 -82 -125 -66 84 88 -65 271 165 -279 142
6357 142 -14 72 -94 257 19 -13 -90 -202 142 128 181 95 66 119 115 -89 -181 -27 107 34 -118 71 -158 -10
6381 -10 -19 -137 169 -3 -238 -118 -66 -5 119 -89 -86 80 255 115 74 245 -6 -1 23 -242 143 -45 -76 -28
6405 -28 -205 26 60 -163 -154 80 -66 69 -50 126 -38 109 174 -68 45 -116 65 63 -240 51 -138 53
6427 53 -43 110 54 2 187 -139 289 -57 -126 1 -243 52 335 -6 284 55 23 142 -26 65 -4 30 -12
6450 -12 52 -107 -13 -8 50 47 9 -87 -93 53 -3 78 48 107 151 -63 -156 16 -67 -300 218 203 121 -306 84 -7 -90 84
6478 84 -52 121 -156 -140 -57 65 -197 30 63 175 342 41 -85 61 4 -153 129 -155 -87 4 -15 52 -48
$$ packed form
6308E1o3l6j01J39Q3p5q2r6K37j7j70L58l3m29M02J6o2N6q3m05L77N6j45J14j57
6333f5j30j6K40j69K12q2K58j48l9J53k29L8O2M0k07m3N9J50Mj53L36j06m44M21
6357A42j56Q6j66L51k38l2p7j12L44j4N3q6k9N3mk04r2J54J34p3j52J89k29J48
6381a0rj18L06j72k35J20N2O1J24k08LJ66J75j40m1J71k51NK4k65L85j88l1M8
6405b8j77K31L4k23RK34j46J35j19J76j64J47O5k42J13j61J81kl03K91j89J91
6427E3r6J53n6n2J85l26M28l46o9J27k44K95K83l41K90k29l2J19j68R1o9L4m2
6450a2O4j59R4NN8ll8r6oJ46n6Q1l0N9M4k14r3J72q3k33N18j5q2m27L90r1q3J74
6478H4j36J73k77J6Q3J22k62K27L3J12J67l01j26J46n7j57K82k84O8R1j9O7j00
$$ plain form
6501 -48 6 -140 -124 77 295 94 -121 15 -217 -60 -185 -121 -139 196 -159 -221 -139 -272 -70 12 -253 116 -45
6524 -45 67 115 65 -148 -224 290 26 76 144 201 177 154 200 32 10 41 -93 47 -33 -44 78 -167 -139 69 32
6549 32 233 -49 237 293 -50 -87 -56 73 314 21 -48 186 -255 -36 -115 170 170 -237 -20 81 14 254 27
6572 27 84 -7 21 -52 258 161 354 -85 156 90 -68 -65 190 -6 -230 -212 118 3 -110 77 101 274 7 147
6596 147 93 -74 -245 -37 140 66 -117 155 80 -28 113 181 62 141 53 -173 211 77 154 -17 -38 176 244
6619 244 -60 -188 -75 -211 101 42 -133 -98 -269 -182 61 -48 -150 4 235 -26 -35 55 -34 40 151 91 -95
6642 -95 47 1 -195 -38 -37 -56 32 -20 -159 256 -124 -19 116 139 259 67 161 -72 -213 7 -49 62 229
6665 229 1 -182 -117 -158 -7 -50 63 -21 -323 -1 10 94 23 271 156 122 -24 319 -148 -218 19 108 171 -77
$$ packed form
6501d8N4j46J6K01K18k01k15J36k32J57j25O4j8L35l55o2Q2j33K02Q2k65L69j61
6524d5J12M8n0k13p6N14k64N0O8N7k4k3M6j68k2L1j34J40q0j1J22k45K8K08l7
6549C2K01k82K86N6l43l7L1J29K41k93o9K34m41K19p9K85%m07K17J01o7K40k27
6572B7N7r1K8p3L10r7J93m39K41o6j58LK55j96k24J8L30j15j13J87K4J73k67J40
6596A47n4j67j71K08J77p4j83K72p5j08J41O8j19P9q8k26L84j34P7j71k1K14O8
6619B44l04j28J13j36L12n9j75L5j71Q7K43j09j02J54K31k61rR0q9P4J11o0j86
6642i5J42m6j96J57Jj9Q8n2j39M15l80J05J35K3J20j92R4k33j41K20n6J11J67
6665B29k28j83O5m1J51m3J13q4l02L22J1Q4p1K48j15l4j46L43m67p0K37Q9O3k48
$$ plain form
6689 -77 -120 -41 -135 -62 -79 -36 -176 -131 32 -104 -114 121 -16 -166 -257 -67 75 325 10 -230 278 110 -132
6712 -132 119 27 20 -152 -67 175 28 -26 23 25 -86 -179 22 11 -114 -16 -87 71 248 -166 210 47 51 -70 -5
6737 -5 86 46 -183 -174 1 -37 187 -37 72 106 248 -41 335 -107 -114 -26 221 -71 -78 134 98 77 -58 131 -115
6762 -115 60 37 -92 127 -99 -5 109 124 -174 -6 -86 -104 32 -74 -271 71 -39 -163 30 77 -45 116
6784 116 117 -33 56 -238 63 -148 5 115 119 169 191 -1 180 -10 -207 46 220 105 72 19 115 131 140 -158
6808 -158 -212 254 51 42 -135 3 119 81 54 19 -102 -3 140 -128 -103 30 -13 362 117 -3 85 -45 -68 -22
6832 -22 -1 241 218 -30 209 10 248 7 115 25 4 148 -12 297 24 174 -149 -6 -156 126 -304 190
6854 190 75 -79 -165 -268 -157 -225 -13 -97 -119 68 172 61 -20 -275 -118 43 -205 9 12 147 0 18 18
$$ packed form
6689g7m3P9r4P3j7M3j40M5J63j36j0K35j37j50r1J90J42K50l15k40N08j68k42
6712a32K51r2pj72Q5K42j47n4M9Kj11r3K01j1j25R8p1J58J77m14L76j63Mj21O5
6737eR1m0k29RJ75l8K24k24J09L4J42k89L76m42pQ8K47k92pK12l6k1j35J89k46
6762a15J75k3j29K19k26R4J14J5k98J68q0j8J36j06j97L42j10j24J93M7j22J61
6784A16Jj50Q9k94L01k11J53J10MN0K2j92J81j90j97K53J74j15l3n3R6J6Rk98
6808a58n4M66k03rj77J38J16l8k7l5j21R9J43k68K5J33m3L75k45j20Q8j30k3M6
6832b2K1K42k3k48K39j99K38k41J08r0k1J44j60L09k73J50l23J43j50K82m30M94
6854A90j15j54q6j03J11o8K12q4k2J87J04j11q1k55J57J61k48K14LJ35j47J8%
$$ plain form
6877 18 108 -191 190 91 -444 7 -104 77 5 317 -208 84 304 -164 -121 -36 -14 -78 57 -56 -7 -99 164
6900 164 -12 -37 -56 26 139 -21 -133 11 3 12 -39 19 145 100 303 47 -262 -16 -41 33 41 -167 -102 76 75 78
6926 78 82 71 147 -275 22 124 -301 158 -15 -96 -95 -195 -127 -134 -117 113 68 -72 20 -206 85 -64 6 84 151 115
6952 115 -284 89 -28 -201 38 98 -187 -167 40 54 172 -62 166 11 -9 187 -183 -143 -66 -168 -35 113
6974 113 -45 143 -58 -205 45 70 -197 236 252 -80 30 -103 -133 -62 53 -158 -206 -177 313 -74 -201 -60
6996 -60 -10 127 10 -122 -53 -48 -24 -298 -59 191 102 -111 146 216 174 -43 -140 56 -102 271 109 -39 114
7019 114 126 108 49 109 136 -123 78 37 -109 23 162 303 0 42 -312 66 19 -132 105 -40 112 32 -269
7042 -269 92 -5 69 -24 40 189 348 -73 -299 -235 -101 283 -122 -29 104 56 84 110 -24 -152 -347 -56 138
$$ packed form
6877A8R0k99L81r9n35M51j11J81p2L12n25K92K20m68M3Q5K2o4J35j13M9r2K63
6900A64j76k5j9Q2J13j60j12J44qRn1N8J26m5K03k56l09K46k5P4Qk08O5J78jL
6926G8Mj1P6m22K97J02m25M59j73q1Jj00O8pJ7K30m5j40R2k26K91j49P0P8O7l6
6952A15l99L73j17j73K39O0k85K0K07J4J18k34K28j55k0J96l70M0P7j02J33J48
6974A13j58J88k01j47K50K5k67M33J6l32J10j33l0P1J15k11m8K9M90l87j27J41
6996f0N0J37j17j32O9NK4k74K39K50q9k13K57P0m2k17r7J96j58L73j62j48J53
7019A14J2j8n9O0K7k59K01m1j46J32J39J41l03M2l54L78m7j51K37j45J52q0l01
7042b69L61r7P4r3O4J49J59m21k26O4J34L84m05R3J33m8K8K6j34j28j95K91J94
$$ plain form
7065 138 -88 52 -96 93 -112 38 -60 -91 -74 197 -229 69 -107 -117 101 67 80 -316 -15 -168 229 -193
7087 -193 48 -154 110 60 -92 8 69 -154 13 -75 77 34 -27 110 15 -82 46 -106 51 61 62 -105 -200 -5
7111 -5 95 105 243 -60 187 -43 -113 1 153 -302 166 145 83 112 -234 4 -313 -68 69 -26 -13 108 4
7134 4 291 115 -248 33 -87 -112 -89 -82 151 112 -68 79 292 -122 -162 233 65 41 -26 -2 190 172 271 -219
7158 -219 242 -29 -79 -7 -189 -41 -17 149 -125 73 268 -123 140 -27 -28 70 357 -114 -89 -105 -147 216 -28
7181 -28 -245 -59 175 147 -48 -76 70 -15 323 -87 183 -9 130 263 192 -42 -97 17 284 -59 -34 56 20
7204 20 -96 -123 -323 202 34 288 103 71 163 -14 -70 88 -190 -175 -166 -21 19 -52 76 -142 306 -80 19 -127
7228 -127 220 -205 130 -46 -83 -94 -255 -159 55 147 8 262 242 -170 -291 -83 254 8 -21 0 -63 -82 -121
$$ packed form
7065A38k26J40j48J89k05J50r8l1J7K71m26K98j76j0K18l4J3l96L01j53L97m22
7087a93K41k02K64n0j52J00O1k23J67q8J52m3o1J37r5r7J28j52J57J0Jj67r5J95
7111eJ00J0J38l03K47k30p0J14J52m55M68k1o2K9l46K38l17K45J37r5J3J21j04
7134DK87j76l63K81j20k5K3PK33l9j80J47K13m14m0L95j68k4o7K4J92j8R9m90
7158b19M61k71n0P2j82J48K4J66k74J98J95l91K63j67jR8K87m71K5j6m2L63k44
7181b8k17J86K34k8j95k8J46q5L38m10K70j92J39J33p1k34n5J14K67l43K5R0l6
7204B0j16k7k00N25j68K54j85l2R2j77n6J58k78J5RJ45M0p1J28k18M48l86R9j46
7228a27L47m25L35j76l7j1j61R6K14R2j39K54k0m12j21K08L37k46k9K1o3j9l9
$$ plain form
7251 -121 -39 172 147 44 132 -147 97 -1 -61 152 163 124 219 185 -90 -24 196 78 -111 -34 69 -40 25 34 76
7276 76 -140 104 -90 -53 94 233 235 -15 83 4 10 242 72 -104 -56 79 -51 48 6 176 131 -72 -217 -37
7300 -37 -1 -148 13 -72 -43 -219 9 118 -333 106 7 170 -249 -201 118 59 -169 228 11 134 -95 145
7322 145 -263 96 213 -40 112 153 -8 -51 16 -18 85 63 89 146 148 340 32 -87 8 86 284 -48 -153 -69
7346 -69 165 105 -130 -129 -141 64 -53 -115 -96 -66 -3 -83 -248 -60 21 -29 138 -129 -16 -123 -186 -5 -27 -12 110
7371 110 89 170 -186 20 -135 -52 -1 12 -172 175 151 36 -56 149 324 218 -234 -66 191 -30 31 78 -46
7394 -46 -1 -115 -190 -76 89 -32 20 124 136 55 -35 -185 -218 336 -173 32 116 -63 -131 -237 194 21 51 192
7418 192 -89 26 -68 87 52 -72 4 -52 69 158 85 -33 -80 -233 -72 -83 154 114 101 78 145 43 237 -91
$$ packed form
7251a21Q2K11k5j03Q8k79K44r8o0K13J1l9R5l4k75O6K20j18j89P7J03j09O5RM2
7276G6k16K44j94L7J47J39Kk50R8p9OK32j70j76M8J35j30R9m2J70m5k03j45J80
7300c7L6j47J61q5K9j76K28J09m51M39r9J63m19M8L19n9k28L97k17J23k29K40
7322A45m08L59J17k53J52M1j61m3O7l4J03k2K6N7KJ92l08j19R5P8J98l32j05Q4
7346f9K34o0k35Jj2K05j17o2J9L0O3q0j65J88Q1n0J67k67J13j07o3J81k2J5J22
7371A10k1Q1l56K06j55Q3N1J3j84L47k4j15r2K05J75j06m52J68K57k21O1M7j24
7394d6M5j14p5J14J65j21N2J04J2q1r0j50l3N54n09K05Q4j79o8j06M31j73L0J41
7418A92k81J15r4J55l5j24P6n6J21Q9p3j18m7j53J61j1K37m0j3k3O7j02J94l28
$$ plain form
7442 -91 11 -60 -160 330 -188 40 -28 373 31 90 -73 191 82 72 -1 48 159 1 -29 -87 17 156 18
7465 18 -48 26 -1 50 49 -209 -1 26 27 -118 -54 -26 -128 -115 -87 -31 -192 191 168 46 -96 57 78 102 252 -155
7491 -155 134 135 -20 44 -231 60 62 -46 99 -6 -29 283 -120 -45 -122 -39 -67 169 -87 -199 167 -189 177
7514 177 114 -108 136 -14 -64 58 -406 -225 12 -142 -67 -206 106 -97 -35 360 -16 -336 120 72 35 -123
7536 -123 -15 15 30 10 -109 11 100 -211 -188 -24 89 26 38 -70 112 101 105 143 29 -137 -20 75 -51 136
7560 136 -46 278 -320 130 -27 -360 73 -172 -152 216 -4 54 282 -222 139 78 -144 137 52 -65 53
7581 53 -173 28 -165 15 -4 119 -280 160 136 -245 7 -299 -73 -311 -162 -46 151 255 31 39 43 4 46
7604 46 -62 89 -67 60 -234 -20 -109 -15 139 156 88 151 -266 -1 43 -173 -90 36 -14 -134 40 133 145 -213
$$ packed form
7442i1J02p1j00M90n18K28o8M01l42N9j63K64j09j0p3M9J11j58l0n8J04J39j38
7465A8o6P4k7N1jk58K08K7Jj45O4K8j02J3K8N6j61L83k3j22j42J53K1K4J50m07
7491a55K89Jj55O4k75K91Kj08J45j05k3L12m03P5p7Q3k8K36k56j12L66l56L66
7514A77o3k22K44j50n0J22m64J81K37j54P5j39L12k03O2L95l76l20M56m8l7j58
7536a23J08L0J5k0j19J20Q9l11K3J64J13o3J2j08J82j1ML8j14j66J17R5j26J87
7560A36j82L24n98M50j57l33M33k45K0L68k20N8K28n04L61o1k22K81q5j17J18
7581E3k26K01j93J80j9J23l99M40k4l81K52l06K26k38J49J16J97J04k24QMl9M2
7604D6j08J51j56J27k94K14q9R4J54J7o8O3m17K65M4k16Q3J26n0j20J74R3J2l58
$$ plain form
7628 -213 168 291 -40 31 109 -231 -9 -67 -178 60 -72 -82 59 204 51 6 62 207 -355 6 13 -39 147
7651 147 -199 190 -58 183 -76 -40 -293 -233 -74 -39 159 154 -230 182 -7 40 -114 -93 55 100 -37 -53 74
7674 74 -101 192 -209 252 64 61 -97 280 255 305 135 -79 -59 -202 -131 -156 12 119 50 188 -221 -291 281
7697 281 -14 195 191 -92 -23 -116 -211 -12 -161 85 -50 -212 184 71 145 -153 189 95 -86 22 168 175 -129
7720 -129 224 59 121 -221 -157 -93 -55 150 85 -26 48 -26 108 -9 -271 -33 88 -186 -22 163 128 36 24
7743 24 -186 227 19 156 -119 230 190 144 3 -77 -31 -18 -19 21 141 102 246 83 -270 106 45 -124 51 -115
7767 -115 28 -73 94 -28 -179 -339 -269 -138 99 196 -153 -132 -3 -70 124 26 -246 -106 83 -39 88 -24
7789 -24 -319 67 -208 -6 55 124 -11 111 -71 57 150 -120 -157 -144 -150 -116 99 33 -162 -271 48 138 182 -145
$$ packed form
7628b13L81J23l31P1P8l40K22n8j11K38j32j0J41J45j53m5N6J45n62L61Pn2J86
7651A47l46L89k48K41k59L6k53O0J59L5J98nl84M12j89M7j54K1J48M5j37j6J27
7674G4j75K93m01M61j88lj58L77k5N0j70k14K0j43P1k5J68J07o9J38m09p0N72
7697B81k95K09mk83O9r3r5J99j49K46j35j62L96j13P4k98L42r4j81J08J46Pl04
7720a29L53j65O2l42O4O4L8K05o5j11P4p4J34j17k62K38J21k74J64J85l5r2j2
7743B4k10M13k08J37k75L49m0m6j41q0M6J3jM0J20l9J44j63l53L76o1j69J75j66
7767a15J43j01J67j22j51j60P0J31K37R7l49K1J29o7J94r8k72J40J89j22J27j12
7789b4k95L86k75K02O1O9j35J22j82J28R3k70l7J3oL4K15o6j95j09L19R0M4l27
$$ plain form
7813 -145 103 -143 230 -8 46 53 34 -69 316 281 -252 -128 -105 -190 -42 -98 -105 29 -31 53 -161 -120 -73 68 250
7838 250 142 222 -53 86 -73 23 -230 198 -114 63 169 155 -158 70 -233 158 -129 -34 -196 33 -103
7859 -103 -88 -149 74 -22 3 27 -127 102 9 -88 107 -227 98 176 102 69 -19 106 2 -218 -248 99 -70 -92
7883 -92 33 106 -14 223 108 275 247 74 -159 27 -38 206 14 284 28 58 -100 -67 267 23 38 26 -35
7906 -35 -94 87 9 10 -92 52 -82 308 216 -7 146 -31 19 -45 75 -107 -99 52 0 -102 95 172 -113 120
7930 120 -3 -86 24 1 9 -76 -104 -38 100 59 -27 -114 -29 -94 -130 10 -64 31 275 -83 228 -97 -30 176 -275
7955 -275 182 -65 -124 -79 57 -85 -219 135 131 -189 -71 11 -15 -87 -201 -58 -97 -50 -29 -73 -16 176 110 -46
7979 -46 -58 32 60 -5 -56 150 116 -172 -129 -50 32 -349 -83 160 153 -162 117 -117 -77 -80 -162 115 -76 -40 123 11
$$ packed form
7813a45K48k46L73k38N4Pj9j03L85l5n33J24K3q5J48n6pJ34o0Q4k14M1M7J41J82
7838B50j08Q0k75J39j59R6k53M28l12J77J06j4l13K28l03L91k87R5j62K29j36
7859a03J5o1K23r6K5K4j54K29r3r7J95l34L25P8p4l3q8J25j04k20l0L47j69k2
7883i2J25P3j20K37j15J67k8j73k33J86o5K44j92K70k56L0j58L3L34k44J5j2o1
7906c5n9J81p8Jj02J44j34L90r2k23J53j77N0o4J20j82QJ51n2j02J97P7k85K33
7930A20j23q3J10k3Qq5k8O6J38m1q6q7Q5o5l6J40p4R5K44l58L11l25O7K06m51
7955b75M57k47n9M5J36j42j34L54ml20J18Q2k6p2j14J43l9M7K1m4N7J92o6j56
7979d6j2R0K8o5n1K06l4k88M3P9Q2l81K66K43pl15K79k34M0lq2K77j91L6J63j12
$$ plain form
8005 11 27 -90 54 -60 -330 -39 -71 -115 -14 -121 -96 -90 178 213 87 -202 -168 36 -53 -72 -71 -56 164 -67 -115
8030 -115 -6 83 -1 -56 -360 0 28 -1 -69 46 -131 -156 157 -178 206 -244 174 -19 -85 20 -99 65 -8
8053 -8 -197 306 245 -3 101 7 -20 -77 6 34 293 42 67 -59 -85 -171 67 208 -143 258 158 49 -143 0
8077 0 30 146 -85 -168 -79 -162 152 -4 111 -6 72 47 17 42 8 -26 248 -138 28 145 87 -6 -14 205 -106
8102 -106 -102 -251 103 -38 -108 30 43 -50 198 23 -146 65 -135 10 -203 -102 -136 -71 113 -153 19 53 40
8125 40 24 50 110 -165 69 73 173 35 -196 -173 -248 15 160 23 -133 76 -1 -140 30 92 -87 20 -18 -54
8149 -54 -4 320 -145 93 132 -25 260 -334 294 178 8 99 -22 66 -50 92 303 -2 -239 24 -72 -62
8171 -62 15 -56 -109 24 -34 -62 3 62 -19 94 129 -56 -108 -62 5 169 -135 30 99 -148
$$ packed form
8005A1J6j17J44j14k70K91l2m4J01j07K5OK68L5j26k89L4K04q9j9JJ5K20k31m8
8030a15J09Q9q4n5l04L60K8k9o8J15j77k5L13l35L84m50M18j93o6J05j19J64p3
8053hj89N03o1k48J04r4k7n7Q3K8K59k51K5j26k6q6K38J41l51M01j00j09j92J43
8077@L0J16k31q3Q9q3L14j56J15j17P8k5l0K5l4l4K74l86J66J17n8r3qK19l11
8102a06Mj49L54j41p0J38J3r3K48j75j69K11k00J45k13J01l4O5J84k66J72L4j3
8125D0j6K6O0k75K34MJ00j38k31K3p5K63J45j37j56K09p7j39J70O2j79J07l8l6
8149e4N0L24m65K38L9j57K85n94O28j16j70R1j21Q8j16J42K11l05k37K63r6J0
8171f2P7p1n3J33n8k8O5N9q1J13L5j85n2M6O7J64l04J65O9k47
8191a48
$$ Imaginary data points
##PAGE= N=2
##DATA TABLE= (X++(I..I)), XYDATA
$$ plain form
0 0 0 0 0 0 0 0 0 0 0 0 0 0 0 0 0 -8 8 -8 8 -8 8 -16 16 -16 24 -24 32 -33 40 -48 56 -64 72 -80 89 -100 113
37 113 -127 141 -158 177 -195 217 -239 265 -292 324 -356 394 -433 476 -525 579 -640 704 -782
56 -782 866 -965 1079 -1214 1376 -1575 1824 -2149 2589 -3231 4251 -6123 10735 -50922 -33820
71 -33820 25695 -39131 -22902 3149 -39098 -56115 6107 3717 -32426 -17205 6406 -15439
83 -15439 -16687 -1115 -4907 -10787 11549 19931 -1569 -14461 3042 6702 -2485 8634 16750 -5204
97 -5204 -5095 16653 7608 -9662 3748 8346 -3659 306 2379 -6924 -2703 36 -6865 1126 4745
112 4745 -9825 -5532 2098 -17590 -19185 4882 77 -13563 -3260 -5436 -19892 -9471 601
125 601 -10174 -10486 -3980 -11956 -15983 -7446 -5714 -6293 -471 882 -7411 -12709 -4682 4077 -942 -3748
$$ packed form
0@%%%%%%%%%%%%%%%qJ6j6J6j6J6k4L2l2M0m8N6o5P3q8J04j20J36j52J69j89K13
37A13k40K68k99L35l72M12m56N04n57O16o80P50q27R09j001J104j219J344j486
56g82J648j831K044k293K590k951L399l973M738n820P482j0374J6858o1657J7102
71c3820N9515o4826J6229K6051m2247j7017O2222k390l6143J5221K3611k1845
83a5439j248J5572l792n880K2336Q382k1500j2892J7503L660r187J1119Q116k1954
97e204J09K1748r045j7270J3410M598j2005L965K073r303M221K739o901P991L619
112D745j4570M293P630j9688j595K4067m805j3640J0303k176j4456J0421J0072
125F01j0775l12O506p976m027Q537J732n79N822J353q293n298Q027Q759n019k806
$$ plain form
141 -3748 5362 2835 -5218 6643 12948 -1747 31 14716 5609 -5434 5491 6440 -1519 6710
155 6710 8973 -4484 -3706 5833 1073 -5040 -5384 -8019 -8557 -3373 -1048 -6061 -12042 -10854 -3300 -4180
171 -4180 -11459 -7393 -3913 -10921 -8551 485 -6149 -9918 3998 6608 -5832 -5572 439 -196 927
186 927 5883 3224 -2422 279 7166 8293 2317 1558 6034 3896 -78 4886 5447 -732 4959 12024
202 12024 1934 -2847 7616 7712 -113 3657 5789 -2951 -800 9800 5835 -2957 1265 5979 434
217 434 -3007 885 71 -4915 -2000 2937 -4349 -9156 614 3321 -6296 -6249 -1364 -7098 -7181 1978 -1514
234 -1514 -10004 -2993 4677 -738 -2877 1242 -764 -2592 3325 4766 -1065 -1294 4897 6780 2376
249 2376 1465 4535 3265 1859 4622 2669 -3874 -1707 6228 3881 -1520 278 1093 -2588 -1000 1757
$$ packed form
141c748R110k527q053J1861O305j4695J778J4685r107j1043J0925R49p959Q229
155F710K263j3457P78R539m760o113l44k635n38N184K325n013n981J188P554q80
171d180p279M066L480p008K370R036o634l769J3916K610j2440K60O011o35J123
186I27M956k659n646K701O887J127n976p59M476k138l974M964N61o179N691P065
202A2024j0090m781J0463R6p825L770K132q740K151J0600l965q792M222M714n545
217D34l441L892q14m986K915M937p286m807R770K707r617M7M885n734q3R159l492
234a514q490P011P670n415k139M119k006j828N917J441n831k29O191J883m404
249B376r11L070j270j406K763j953o543K167P935k347n401J798Q15l681J588K757
$$ plain form
265 1757 -2470 -4882 -469 1912 -2249 -3634 837 2021 -763 1146 2135 -2655 -3933 2866 3015 -2709
281 -2709 986 5668 -74 -2834 3234 1230 -4177 1060 3542 -3856 -4352 2856 1178 -4242 -3
296 -3 2963 -1701 -2117 2250 -2473 -6478 836 6213 1069 -1823 2302 1435 -647 4010 4568 -2362 -1418
313 -1418 5344 3586 -1912 111 2897 1587 3196 4136 -2082 -5894 -771 2575 -146 -2310 -1343 -316
329 -316 -459 124 -179 -3643 -3691 1768 3574 -2768 -4817 -815 826 927 3235 1875 -3893 -2225 2971
346 2971 49 -4923 -1125 2090 -255 -685 968 -3437 -5720 855 3494 -3765 -5552 -1306 -2161 -4048
362 -4048 902 1731 -3014 -724 4355 -218 -4236 831 3311 432 2583 5356 1188 364 5035 5150
378 5150 849 2022 5191 2509 -459 1385 2041 558 1930 4386 972 -3015 -839 431 -2686
$$ packed form
265A757m227k412M413K381m161j385M471J184k784J909R89m790j278O799J49n724
281b709L695M682n742k760O068k004n407N237K482p398m96P208j678n420M239
296cK966m664m16M367m723m005P314N377n144k892M125q67k082M657N58o930R44
313a418O762j758n498K023K786j310J609R40o218l812N123L346k721k164R67J027
329c16j43N83l03l464m8N459J806o342k049M002J641J01K308j360n768J668N196
346B971k922m972L798L215k345m30J653m405k283O575K639p259j787M246q55j887
362d048M950Q29m745K290N079m573m018N067K480k879K151K773m168q24M671J15
378E150m301J173L169k682k968J844O56j483J372K456l414l987K176J270l117
$$ plain form
393 -2686 -3365 301 -510 -2525 -857 -286 -3543 -2318 2346 983 -3100 -2364 143 -406 -689 1919 1552
410 1552 -382 2119 4429 -246 -3240 1471 3368 631 1815 2809 -903 -416 5261 3852 -1219 736
426 736 3821 1688 464 1940 781 276 4547 6662 1697 -1617 1292 3029 1635 1245 1674 -560
442 -560 -701 2746 1618 -2750 -1783 1289 -334 -3067 -2673 -3787 -4762 -1735 541 -3134 -5169 -2123
458 -2123 -504 -2416 -2618 -1239 -1745 -2033 1494 2706 -240 503 5613 4813 1519 3610 5412 3348
474 3348 4522 7110 4226 2324 6723 8748 4643 3510 4877 3643 2909 4580 3712 204 1164 4319
490 4319 2765 -697 574 2465 -468 -1211 430 -1901 -3673 815 3068 -2773 -3980 -19 157 -1763
506 -1763 100 -1096 -4140 -3322 280 -124 -2378 -1650 687 -455 -1972 -1207 -654 -1226 308 2375 -912
$$ packed form
393b686o79L666q11k015J668N71l257J225M664j363m083P36K507n49k83K608l67
410A552j934K501K310m675k994M711J897k737J184R94l712M87N677j409n071J955
426G36L085k133j224J476j159n05M271K115m965l314K909J737j394l90M29k234
442e60j41L447j128m368R67L072j623k733L94j114r75L027K276l675k035L046
458b123J619j912k02J379n06k88L527J212k946P43N110q00l294K091J802k064
474C348J174K588k884j902M399K025m105j133J367j234p34J671q68l508R60L155
490D319j554l462J271J891k933p43J641k331j772M488K253n841j207L961J76j920
506a763J863j196l044Q18L602m04k254P28K337j142j517P65N53n72J534K067l287
$$ plain form
523 -912 -2337 1725 4087 1955 2771 3400 491 469 4907 3970 1196 3167 5651 3178 1612 3533 4089
540 4089 1778 1778 2791 -269 -2158 1171 2799 -1534 -2690 -485 -1328 -2994 -1156 -2457 -5350 -3978
556 -3978 -1404 -2849 -3489 -1052 -1333 -1929 -1006 -1256 -2261 -484 2440 2357 -1017 -1126 2208 3761 3103
573 3103 4022 3418 466 714 4500 3749 757 2620 5192 2093 851 2006 850 1105 3262 2285 -1574
590 -1574 -2471 159 1315 975 82 -930 -2364 -1272 659 -1549 -4823 -2568 -138 -2181 -2925 -1565
606 -1565 -3362 -4330 -1275 -1153 -5455 -5273 -2077 -2631 -4010 -3647 -3295 -3037 -922 239 -1190 -3684 -3646
623 -3646 -272 821 -39 882 1841 252 1275 3312 2202 1674 4074 4111 346 904 2699 1944 2723
640 2723 4549 2749 -572 18 1949 -476 -1452 430 -68 -2482 -2234 -950 -1854 -2389 -94 -1128 -4486
$$ packed form
523i12j425M062K362k132Q16O29k909k2M438r37k774J971K484k473j566J921N56
540D089k311%J013l060j889L329J628m333j156K205q43j666J838j301k893J372
556c978K574j445o40K437k81n96R23k50j005J777K924q3l374j09L334J553o58
573C103R19o04k952K48L786p51k992J863K572l099j242J155j156K55K157r77l859
590a574q97K630J156l40q93j012j434J092J931k208l274K255K430k043p44J360
606a565j797r68L055J22m302J82L196n54j379L63L52K58K115J161j429k494L8
623c646L374J093q60R21R59j589J023K037j110n28K400L7l765N58J795p55P79
640B723J826j800l321N90J931k425r76J882m98k414K48J284r04n35K295j034l358
$$ plain form
657 -4486 -3811 -659 -1781 -2780 -1119 -1617 -2325 344 983 -1581 -2141 -374 -50 -341 -222 -42 70 358
675 358 1092 514 -778 -632 1803 1889 -963 -2092 -361 226 1224 2971 755 -2517 -368 1755 93
692 93 -891 776 484 -516 1032 1041 -1656 -705 2410 1470 -1856 -2158 -1044 -1567 -998 300 -1546 -3748
710 -3748 -1056 700 -2075 -3058 -1637 -2529 -2723 -715 -922 -2822 -1561 860 113 -1101 -265 519 227
727 227 881 886 443 363 1979 3230 2081 625 1149 2403 1134 884 1506 405 -426 1388 1219 -955
745 -955 -402 1622 475 -1228 -612 -1012 -1446 -107 1047 -501 -1799 37 1479 -184 -549 274 -554
762 -554 -562 767 798 -1364 -410 2145 589 -1055 -42 -190 -976 -174 191 -1575 -2366 -177 810 -1008
780 -1008 -1122 -653 -977 -1026 32 -699 -1799 -947 875 1148 -684 24 1050 546 538 1287 192 -614 1194
$$ packed form
657d486O75L152j122r99J661m98p08K669O39k564n60J767L24k91J19J80J12K88
675C58P34n78j292J46K435Q6k852j129J731N87R98J747k216l272K149K123j662
692I3r84J667k92j000J548Rk697R51L115r40l326l02J114n23N69J298j846k202
710c748K692J756k775r83J421q92j94K008k07j900J261K421p47j214Q36P84k92
727B27O54Nm43q0J616J251j149j456N24J254j269k50O22j101q31J814j69k174
745i55N53K024j147j703O16m00m34J339J154j548j298J836J442j663l65Q23q28
762e54qJ329L1k162R54K555j556j644J013j48p86Q02L65j766p91K189R87j818
780a008j14M69l24m9J058p31j100Q52J822K73j832P08J026n04qP49j095q06J808
$$ plain form
799 1194 2032 125 -224 1178 1162 270 473 86 -1268 -627 861 98 -1216 -552 749 -74 -720 18
817 18 -375 -1044 213 685 -1236 -1559 766 1183 377 631 601 -422 86 772 -240 -992 -400 980 326
836 326 -606 -729 -726 -452 162 207 -1618 -2471 -492 386 -1123 -1150 276 137 153 1186 455 -1684 57 2265
856 2265 1644 502 904 1461 1232 2294 2049 579 213 1549 1843 250 -670 442 535 529 879 -240 -2224
875 -2224 -1764 56 -730 -2125 -1377 -1029 -1342 -1342 -867 -1961 -1755 -535 58 -1652 -2272 -1129 -953 -711 -131
894 -131 204 -624 -522 452 -291 -1525 -494 662 -83 -626 190 -413 -377 805 1041 -393 -493 661 339
913 339 -303 288 892 959 1186 1778 708 94 564 2056 996 -133 727 1140 279 616 643 -944 -417
932 -417 667 168 -2119 -2079 -1645 -1858 -1050 -794 -1838 -2580 -1312 -860 -2025 -2698 -1716 -676 -673 -597 -707 -1497
$$ packed form
799A194Q38j907l49J402j6q92K03l87j354O41J488p63j314O64J301q23o46P38
817A8l93o69J257M72j921l23K325M17q06K54l0j023N08O86j012p52N92J380o54
836C26r32j23LK74O14M5j825q53J979Q78j509k7J426j39J6J033p31k139J741K208
856B265o21j142M02N57k29J062k45j470l66J336K94j593r20J112R3oL50j119j984
875b224M60J820p86j395P48L48l13%M75j094K06J220N93j710o20J143J76K42N80
894a31L35q28J02R74p43j234J031J156p45n43Q16o03L6J182K36j434j00J154l22
913C39o42N91O04O7K27N92j070o14M70J492j060j129Q60M13q61L37K7j587N27
932d17J084m99k287M0M34k13Q08K56j044p42J268M52j165o73R82J040LP6j10p90
$$ plain form
952 -1497 -338 1300 1706 -30 -195 771 922 954 1346 823 447 1474 2237 1073 -478 186 786 626
970 626 -165 -380 -892 -1041 61 420 -840 -1510 -332 -166 -1440 -1427 -1183 -1853 -1075 49 -739 -1894 -787
989 -787 -308 -1390 -1227 -976 -1505 -1352 -89 -700 -1494 -925 595 423 -793 -951 -641 -506 -11 642 114
1008 114 -294 880 1731 879 654 1698 1535 1366 1905 1524 1058 1948 2849 2495 1714 1335 1619 1970 1538
1027 1538 911 523 -119 733 1199 -98 -735 -304 -48 -1326 -1062 -1241 -2134 -1640 -430 -1381 -2429 -1843
1045 -1843 -484 -672 -974 -709 -1194 -960 -51 743 249 -251 635 1401 870 687 1086 1094 951 1523 1132 117
1065 117 943 2208 1165 556 876 694 119 1185 1090 -282 -343 592 960 649 584 774 959 610 191 286
1085 286 -411 168 1166 660 -661 -369 371 315 439 75 -997 -1238 -210 34 -910 -898 -246 254 356 -202
$$ packed form
952a497J159J638M06j736j65R66J51L2L92n23l76J027P63j164j551O64O00j60
970F26p91k15n12j49J102L59j260o70J178J66j274J3K44o70P78J124p88j155J107
989g87M79j082J63K51n29J53J263o11p94N69J520j72j216j58L10J35M95O53n28
1008A14m08J174Q51q52k25J044j63j69N39l81m66Q90R01l54p81l79K84L51m32
1027A538o27l88o42Q52M66j297o37M31K56j278K64j79q93M94J210r51j048N86
1045a843J359j88l02K65m85K34R09P94m94n00Q86P66n31j83L99Qj43N72l91j015
1065A17Q26J265j043o09L20j82n75J066r5j372o1R35L68l11o5J90J85l49m19R5
1085B86o97N79R98n06j321K92P40n6J24l64j072k41J028K44r44J2O52N00J02n58
$$ plain form
1105 -202 -145 -391 350 892 671 -494 235 1814 1873 1589 1770 1297 1029 1970 2934 1096 908 1684 2035 1724
1125 1724 1969 1408 769 831 1209 200 -393 -149 246 135 -504 -726 -1024 -987 -184 228 -1254 -1988 -1248 -779
1145 -779 -818 -134 -24 -747 -414 169 -484 -594 25 575 71 23 -40 54 324 776 498 -87 -320 142 612
1166 612 -92 -428 241 443 262 529 809 -320 431 1419 373 -301 718 1015 844 709 661 147 797
1185 797 1494 1056 123 -503 67 -43 -161 243 -203 -612 -325 -63 -830 -1529 -640 -265 -688 -1105 -1311 -1365
1205 -1365 -623 302 106 -639 -863 -137 493 -11 -331 18 526 752 859 726 -92 69 1040 646 -459
1224 -459 -72 67 -138 487 155 -824 -539 302 142 -650 -679 -1014 -761 -159 10 -412 -660 -82 167 -16
1244 -16 -431 -8 38 -36 -43 -6 -393 -197 710 555 -608 -515 -219 -341 -362 -213 -678 -915 -541 -212 -641 -946
$$ packed form
1105b02N7k46P41N42k21j165P29J579N9k84J81m73k68R41R64j838j88P76L51l11
1125A724K45n61o39O2L78j009n93K44L95j11o39k22k98L7Q03M12j482p34P40M69
1145g79l9O84J10p23L33N83o53j10O19N50n04m8o3R4K70M52k78n85k33M62M70
1166F12p04l36O69K02j81K67K80j129P51R88j046o74J019K97j71j35m8n14O50
1185G97O97m38r33o26N70j10j18M04m46m09K87K62p67o99Q89L75m23m17k06n4
1205a365P42R25j96p45k24P26O30n04l20L49N08K26J07j33q18J61R71l94j105
1224d59L87J39k05O25l32r79K85Q41j60p92k9l35K53O02J69m22k48N78K49j83
1244a6m15M23M6p4pL7l87J96R07j55j163R3K96j22k1J49m65k37L74L29m29l05
$$ plain form
1266 -946 -719 -236 -605 -816 -789 -452 -480 349 625 -726 -109 727 637 162 551 193 -363 963 861 144
1286 144 -73 731 753 385 212 -215 -40 29 189 -213 -558 -566 395 168 -214 -430 -670 -383 194 -38 -396
1307 -396 -166 140 888 493 78 224 384 209 560 -141 -444 -383 470 319 -409 -525 -81 -366 -301 -627 -812
1328 -812 -1377 -608 124 -636 -921 -285 156 -141 -13 -91 -538 -113 932 171 69 401 1021 1051 1038 819 460
1349 460 297 782 613 80 112 263 781 366 199 172 -496 -359 -47 -357 -979 -578 -199 -101 -595 -642 -527
1370 -527 -458 71 40 -566 -602 -258 371 605 -184 73 206 332 535 196 -587 -286 634 533 -250 -178 -191 153
1392 153 714 641 -245 -205 408 219 101 264 198 287 606 1050 547 134 337 492 667 393 345 469 359 211
1414 211 498 244 -334 -262 -50 -909 -953 -548 -866 -659 -806 -711 -1258 -1186 -590 -915 -1185 -1092 -300 -576 -893 -532
$$ packed form
1266i46K27M83l69k11K7L37k8Q29K76j351O17Q36r0m75L89l58n56J326j02p17
1286A44k17Q04K2l68j73m27J75O9J60m02l45qR61k27l82k16k40K87N77k32l58
1307c96K30L06P48l95m15J46J60j75L51p01l03O1Q53j51p28j16M44k85O5l26j85
1328h12n65P69P32p60k85O36M41k97J28p8m47M25J045p61j02L32O20L0j3k19l59
1349D60j63M85j69n33L2J51N18m15j67k7o68J37L12l10o22M01L79R8m94m7J15
1370e27O9N29l1o06l6L44O29K34p89K57J33J26K03l39p83L01R20j01p83P2j3L44
1392A53N61p3q86M0O13j89j18J63o6Q9L19M44n03m13K03J55J75k74m8J24j10j48
1414B11K87k54n78P2K12q59m4M05l18K07j47R5n47P2N96l25k70R3P92k76l17L61
$$ plain form
1436 -532 -417 -204 263 408 -67 -477 320 829 478 433 452 770 907 779 338 133 830 461 366 -53 -181
1457 -181 -105 -10 -35 369 -250 -679 27 227 -649 -862 -412 -369 92 104 -466 -882 -491 51 -114 -478 -727 -673
1479 -673 -479 -135 -320 -771 -573 -264 -234 -694 -996 -753 -680 -539 -384 -600 -800 -221 212 -208 -295 -159 248
1500 248 244 561 -13 24 380 715 869 441 239 347 454 111 -19 -30 3 51 169 -586 -797 -655 -416 -626
1522 -626 -932 -1044 -1145 -1428 -1011 -782 -1311 -1039 -653 -769 -906 -683 -802 -454 -396 -241 -190 -424 128 401 215
1543 215 -128 74 204 358 261 284 -126 -104 695 609 52 -266 413 -10 68 64 -422 -12 149 361 140 -346
1565 -346 -70 432 242 232 219 -371 61 517 343 -366 -531 -28 -147 -111 -224 -722 -791 -239 -690 -1103 -921
1586 -921 -709 -403 -567 -428 -746 -427 -519 -76 56 -617 -543 164 447 263 226 163 94 227 736 576 286 443
$$ packed form
1436e32J15K13M67J45m75m10P97N09l51m5J9L18J37j28m41k05O97l69r5m19j28
1457a81P6R5k5M04o19m29P06K00q76k13M50M3M61J2n70m16L91N42j65l64k49N4
1479f73J94L44j85m51J98L09L0m60l02K43P3J41J55k16k00N79M33m20q7J36M07
1500B48mL17n74L7L56L35J54m28k02J08J07l43j30j1L3M8J18p55k11J42K39k10
1522f26l06j12j01k83M17K29n29K72L86j16j37K23j19L48N8J55N1k34N52K73j86
1543B15l43K02J30J54r7K3m10K2P99q6n57l18O79m23P8mm86M10J61K12k21m86
1565c46K76N02j90j0j3n90M32M56j74p09j65N03j19L6j13m98o9N52m51m13J82
1586i21K12L06j64J39l18L19r2M43J32o73P4P07K83j84l7o3o9J33N09j60k90J57
$$ plain form
1608 443 602 480 508 492 349 586 449 -214 -614 -124 215 116 -158 -517 -341 -434 -325 -7 -535 -486 23 -206
1630 -206 -361 -449 -308 279 166 66 -294 -118 20 410 191 63 -364 -131 566 416 59 91 -153 -178 257
1651 257 -87 -256 -82 253 27 9 198 -141 219 637 400 -307 127 556 428 391 423 459 145 554 524 225
1673 225 132 29 212 -12 -176 -164 -282 -355 -7 -64 -1040 -723 -275 -372 -574 -646 -535 -332 -155 35 -277 -185
1695 -185 62 -221 -191 49 -62 380 410 368 -16 25 316 462 75 -199 -181 -105 -17 176 218 -220 -225 97 202
1718 202 -479 -372 -404 -178 -9 -69 -456 -425 69 243 84 -132 -44 221 265 311 91 -9 212 467 586 69
1740 69 -221 -37 -37 -380 -234 -465 -142 161 -165 -331 -684 -619 -181 -153 -534 -520 -399 -419 -107 226 -326 -97
1762 -97 179 117 66 202 -128 74 361 382 -54 -106 236 302 -76 359 -304 -215 -345 -95 -62 -431 -108 -227 309
$$ packed form
1608D43J59j22K8j6j43K37j37o63m00M90L39r9k74l59J76r3J09L18n28M9N09k29
1630b06j55q8J41N87j13j00l60J76J38L90k19j28m27K33O97j50l57L2k44k5M35
1651B57l44j69J74L35k26j8J89l39L60M18k37p07M34M29j28l7L2L6l14M09l0k99
1673B25r3j03J83k24j64J2j18p3L48n7r76L17M48r7k02p2J11K03J77J90l12R2
1695a85K47k83L0K40j11M42L0m2l84M1K91J46l87k74J8P6Q8J93M2m38nL22J05
1718B02o81J07l2K26J69o0l87L1M94J74j59k16Q8K65M4M6k20j00K21K55J19n17
1740F9k90J84%l43J46k31L23L03l26j66l53O5M38K8l81J4J21k0L12L33n52K29
1762i7K76o2n1J36l30K02K87K1m36n2L42O6l78M35o63Q9j30K50L3l69L23j19N36
$$ plain form
1785 309 -507 -441 -153 -145 -76 29 -288 -353 -9 422 -101 -234 -117 202 248 24 -103 -423 -84 6 184 -3
1807 -3 -145 21 -100 -258 -143 -565 -662 -19 -121 -509 -564 -272 1 -30 52 8 -278 51 663 275 176 129 396
1830 396 469 537 467 -69 340 373 404 422 6 164 319 366 55 -57 -255 -112 257 -303 -456 -370 -363 -114 -98 -195
1854 -195 -330 -236 105 14 -301 -410 288 210 25 -273 21 298 100 289 41 -241 158 268 181 -381 -376 19
1876 19 177 55 -43 -156 -19 198 5 -11 -330 165 282 660 585 124 414 400 170 403 -3 328 568 593
1898 593 400 250 326 91 338 397 101 -151 -217 31 -275 -83 -149 -447 -211 -159 -268 -221 -416 0 -75 35
1920 35 -177 -57 43 393 314 -153 96 545 524 241 379 296 186 641 579 548 381 479 429 316 215 26 335
1943 335 284 136 372 14 -171 97 109 -169 -337 27 308 180 163 73 -145 -1 395 124 -31 -123 2 -117
$$ packed form
1785C09q16O6K88QO9J05l17o5L44M31n23j33J17L19M6k24j27l20L39R0J78j87
1807cj42J66j21j58J15m22r7O43j02l88n5K92K73l1Q2m4k86L29O12l88r9m7K67
1830C96P3O8p0n36M09L3L1J8m16J58J55M7l11j12j98J43L69n60j53Q6PK49J6r7
1854a95j35R4L41r1l15j09O98p8j85k98K94K77j98J89k48k82L99J10q7n62NL95
1876A9J58j22r8j13J37K17j93j6l19M95J17L78p5m61K90j4k30K33m06L31K40K5
1898E93j93j50P6k35K47N9k96k52o6K48l06J92o6k98K36N2j09M7j95M16p5J10
1920C5k12J20J00L50p9m67K49M49k1k83J38q3j10M55o2l1j67R8n0j13j01j89L09
1943C35n1j48K36l58j85K68J2k78j68L64K81j28j7r0k18J44L96k71j55r2J25j19
$$ plain form
1965 -117 -1 -113 -69 -195 -94 8 -398 -771 -79 -70 -297 -121 -247 -388 45 241 -5 -121 -66 40 271
1986 271 284 234 157 505 481 657 577 192 570 386 403 117 160 254 441 341 158 99 42 53 161 -180 -142 -328
2010 -328 -175 -13 -233 -404 -402 -153 -142 -229 -173 -122 -113 -221 98 -353 -197 167 252 140 310 90 287 221 119
2033 119 416 -246 182 279 -48 -70 52 -200 -66 63 -33 -90 228 -268 120 264 -185 -110 195 268 174 78 10
2056 10 153 297 131 206 -16 299 -51 -113 -272 -393 9 -26 -225 -343 -480 -199 -64 -160 -167 -519 -369 -427 -110
2079 -110 -84 -243 -149 178 45 125 -170 279 193 221 201 -26 -88 399 369 168 91 186 178 469 376 310 -250 52 8
2104 8 -204 -244 -25 13 4 -188 -262 -563 -274 165 19 -130 -328 51 55 197 172 265 -295 -22 183 -140 94 -100
2128 -100 -43 62 20 -109 -171 -205 21 -78 15 -443 -180 -51 -72 122 -52 -287 -347 115 -301 -64 164 68 157
$$ packed form
1965a17J16j12M4j26J01J02m06l73O92Rk27J76j26j41M33J96k46j16N5J06K31
1986B71J3n0p7L48k4J76q0l85L78j84J7k86M3R4J87j00j83n9n7J1J08l41L8j86
2010c28J53J62k20j71KK49J1q7N6N1Rj08L19m51J56L64Q5j12J70k20J97o6j02
2033A19K97o62M28R7l27k2J22k52J34J29r6n7L18m96L88J44m49P5L05P3r4r6o8
2056A0J43J44j66P5k22L15l50o2j59j21M02l5j99j18j37K81J35r6pl52J50n8L17
2079a10K6j59R4L27j33Q0k95M49q6K8k0k27o2M87l0k01p7R5qK91r3o6n60L02m4
2104Hk12m0K19L8rj92p4l01K89M39j46j49j98L79MJ42k5R3n60K73K05l23K34j94
2128a00N7J05m2j29o2l4K26r9R3m58K63J29k1J94j74k35o0M62m16K37K28r6Q9
$$ plain form
2151 157 422 119 258 334 357 403 27 -52 182 206 -137 -155 -4 15 -239 -11 -274 -349 -278 16 -137 -159 -174 -296
2175 -296 -22 -136 -197 -79 -310 -152 179 -192 178 -53 166 365 317 182 193 349 451 154 -135 -88 -54 20
2197 20 108 188 107 134 11 -134 -194 -549 -109 19 -42 -227 -263 -99 165 383 4 82 -31 232 97 34 142
2220 142 194 110 203 4 58 -106 229 96 -55 -208 -82 122 -180 -8 43 -172 -75 -68 -4 -292 -230 -179 -151 31
2244 31 -68 291 -20 44 330 176 -9 247 232 395 394 215 -32 100 28 279 199 -241 130 -47 178 -122 32
2267 32 38 -73 290 -119 -79 -3 -71 226 -108 12 -110 58 155 114 -30 -7 -9 344 169 220 168 23 268 150
2291 150 -164 -96 19 -65 -263 -361 -514 -309 -278 -40 -62 -515 -406 -129 -389 -53 -77 -157 -82 112 159 1 10 385
2315 385 463 98 67 128 261 -88 62 -136 -232 88 603 32 -165 54 -55 -49 -125 -111 -2 -404 22 17 -64 -9
$$ packed form
2151A57K65l03J39P6K3M6l76p9K34K4l43j8J51J9k54K28k63p5P1K94j53k2j5j22
2175b96K74j14o1J18k31J58L31l71L70k31K19J99m8j35J1J56J02k97k89M7L4P4
2197B0Q8Q0q1K7j23j45o0l55M40J28o1j85l6J64K64K18l79P8j13K63j35o3J08
2220A42N2q4R3j99N4j64L35j33j51j53J26K04l02J72N1k15R7PO4k88O2N1K8J82
2244C1r9L59l11O4K86j54j85K56j5J63jj79k47J32p2K51q0m40L71j77K25l00J54
2267C2Oj11L63m09M0P6o8K97l34J20j22J68R7m1j44K3kL53j75N1n2j45K45j18
2291A50l14O8J15q4j98r8j53K05L1K38k2m53J09K77k60L36k4q0P5J94M7j58RL75
2315C85P8l65l1O1J33l49J50j98r6L20N15n71j97K19j09Op6J4J09m02M26nq1N5
$$ plain form
2339 -9 -74 -131 78 -121 -139 -96 -54 200 54 177 -55 173 349 190 -4 -174 -31 86 -56 -135 -366 -183 -62
2362 -62 129 -2 -146 -35 41 -36 -237 262 0 371 -9 -35 4 215 220 121 278 -79 258 345 222 258 15
2385 15 75 -73 249 49 134 -158 -102 -89 -121 -414 -201 -404 -82 97 -389 -267 -203 -372 -321 -27 -292 -205 -89
2408 -89 47 48 87 -117 86 206 211 268 234 205 222 300 135 -49 28 157 110 -48 -240 64 42 -188 56 44 -204
2433 -204 -59 169 -116 -394 -192 148 -33 -114 96 265 44 196 29 -206 48 194 149 -17 -30 84 -213
2454 -213 280 52 -308 -153 -283 -176 -99 -114 -334 -140 19 66 -279 -332 11 -49 84 52 49 46 234 383 277
2477 277 198 243 371 112 170 221 -76 212 101 -33 72 -66 125 163 -45 -86 31 52 -84 -157 63 -261 -174
2500 -174 135 -63 -57 -118 -84 80 69 14 31 109 133 213 277 -24 -62 149 71 200 63 -50 114 79 99 -127 34
$$ packed form
2339io5n7K09j99j8M3M2K54j46J23k32K28J76j59j94j70J43J17j42p9k31J83J21
2362f2J91j31j44J11P6p7k01M99k62L71l80k6L9K11Nr9J57l57L37Q7j23L6k43
2385A5O0j48L22k00Q5k92N6J3l2k93K13k03L22J79m86J22O4j69N1K94k65Q7J16
2408h9J36JL9k04K03J20NN7l4k9J7P8j65j84P7J29m7j58j92L04k2k30K44j2k48
2433b04J45K28k85k78K02L40j81q1K10J69k21J52j67k35K54J46m5j66j3J14k97
2454b13M93k28l60J55j30J07P7j5k20J94J59M7l45n3L43o0J33l2llJ88J49j06
2477B77p9M5J28k59N8N1k97K88j11j34J05j38J91L8k08m1J17K1j36p3K20l24Q7
2500a74L09j98Oo1L4J64j1n5J7P8K4Q0O4l01l8K11p8J29j37j13J64l5K0k26J61
$$ plain form
2525 34 8 -70 61 -228 -70 96 193 31 95 -258 4 184 74 -165 -1 -58 100 261 119 69 239 182 258
2548 258 262 -97 -147 -11 -31 -28 -54 -10 43 -267 -227 -345 -250 -429 254 14 -237 -15 -37 -280 148 51 -169 130
2572 130 43 60 -20 -157 238 191 340 -72 -133 111 20 -43 34 -225 -77 122 -169 178 -258 -321 -74 -111 -4
2595 -4 -183 80 -140 -4 -35 -195 -194 55 256 198 29 -85 7 164 -4 141 164 -61 101 -82 80 -45 -248
2618 -248 -81 -226 -81 -129 -287 -428 113 -21 -76 -188 -108 -41 -82 -309 -21 92 139 -149 218 250 184 -15 26
2641 26 148 -24 82 28 219 194 -5 -33 -172 145 -163 -95 -348 -100 -65 -225 -424 -258 -67 138 -125 -95
2663 -95 -117 87 106 -99 -236 61 -268 -210 25 13 191 137 -115 80 -108 -42 -51 141 6 -65 -54 -98 -136 -149 -181
2688 -181 -78 -64 -174 13 -125 -162 -7 -79 -123 -39 -152 -101 -21 220 23 202 -70 -35 65 94 49 110 -29 -40
$$ packed form
2525C4k6p8J31k89J58J66R7j62O4l53K62J80j10k39J64n7J58J61j42n0J70n7P6
2548B58Ml59n0J36k0Lk6M4N3l10M0j18R5j79O83k40k51K22k2k43M28r7k20K99
2572A30q7J7q0j37L95m7J49m12o1K44r1o3P7k59J48J99k91L47m36o3K47l7J07
2595dj79K63k20J36l1j60JK49K01n8j69j14R2J57j68J45K3k25J62j83J62j25k03
2618b48J67j45J45m8j58j41N41j34n5j12Q0O7m1k27K88J13M7k88L67L2o6j99M1
2641B6J22j72J06n4J91k5j99k8j39L17l08O8k53K48L5j60j99J66J91K05k63L0
2663i5k2K04J9k05j37K97l29N8K35j2J78n4k52J95j88O6rJ92j35p1J1m4l8j3l2
2688a81J03J4j10J87j38l7J55p2m4Q4j13N1Q0K41j97J79k72L5J00K9m5O1j39j1
$$ plain form
2712 -40 115 -122 -109 -99 -52 134 -246 69 -277 25 51 -164 -40 -215 -50 -9 -94 19 -137 -264 170 144 -371
2735 -371 -5 5 30 141 12 -58 144 105 66 276 -244 -99 115 -89 -89 -19 -92 -156 -205 -25 -23 -189 28 31 -234
2760 -234 -28 -191 104 200 288 41 93 90 70 -55 -187 44 38 213 92 100 -96 -105 -269 -160 -218 -3 -131 -37 -130
2785 -130 -82 -90 -365 -87 95 71 -49 -100 -57 78 48 33 -69 151 70 111 23 5 3 33 268 138 153 127 -83 -99
2811 -99 200 -136 -156 -161 -155 149 -69 -177 69 -13 -22 -140 -103 -236 -132 103 -295 -88 52 160 309 90 -2 190
2835 190 -167 42 -6 244 137 67 135 -69 -203 39 84 115 43 -71 86 156 -43 -245 67 -49 -47 -67 -37 57
2859 57 -237 260 183 30 269 83 92 277 218 108 82 245 -91 -213 151 15 -357 -264 -118 112 6 -168
2881 -168 -44 -41 -187 -337 -308 -72 7 -12 -47 99 25 -10 364 243 -76 11 55 221 186 265 45 156 -11 287
$$ packed form
2712d0J55k37J3J0M7J86l80L15l46L02K6k15J24j75J65M1q5J13j56j27M34k6n15
2735c71L66J0K5J11j29p0K02l9l9K10n20J45K14k04%P0p3o4m9J80Kj66K17Lk65
2760b34K06j63K95R6Q8k47N2lk0j25j32K31oJ75j21Qj96rj64J09n8K15j28R4r3
2785a30M8qk75K78J82k4j20n1M3J35l0j5j02K20q1M1q8j8kL0K35j30J5k6k10j6
2811i9K99l36k0nOL04k18j08K46q2rj18L7j33J04K35l98K07J40J08J49k19r2J92
2835A90l57K09m8K50j07p0O8k04j34K42M5L1p2j14J57P0j99k02L12j16Kk0L0R4
2859E7k94M97p7j53K39j86RJ85n9j10k6J63l36j22L64j36l72R3J46K30j06j74
2881a68J24Lj46j50K9K36P9j9l5J46p4l5L74j21l19Q7M4J66l5P9k20J11j67K98
$$ plain form
2905 287 80 33 151 169 -35 39 -10 32 130 149 -211 -300 70 -146 -157 51 -47 -99 119 -15 -90 -14 -131 -47 148
2930 148 141 -81 67 -12 115 13 157 96 -89 19 -188 78 -266 -232 10 -350 -317 -218 -20 29 117 94 -51
2953 -51 -148 5 182 -67 -19 117 -25 76 66 52 101 356 148 325 210 -17 47 201 -1 -6 -115 88 79 -9
2977 -9 -316 70 -112 31 -54 -9 -223 -336 131 -43 -162 -87 84 -128 -86 -169 -1 -223 67 40 149 190 -14
3000 -14 -13 110 -54 -65 77 -130 144 130 -85 9 72 99 -124 228 -274 -172 46 128 3 -69 109 52 -57 -85
3024 -85 53 460 114 267 138 138 318 129 132 145 175 -89 -118 243 41 -63 -113 -34 -106 103 60 -79 18 -222
3048 -222 -89 -115 61 -95 -3 -234 -30 -4 -94 240 -176 -165 261 218 296 -39 42 99 0 23 272 -55 -44 56
3072 56 -54 -87 108 -365 -146 -79 -56 -156 -157 141 -84 2 -43 -81 -172 69 13 115 56 207 120 274 159 -186
$$ packed form
2905B87k07m7J18J8k04P4m9M2R8J9l60q9L70k16j1K08r8n2K18j34p5P6j17Q4J95
2930A48pk22J48p9J27j02J44o1j85J08k07K66l44L4K42l60L3R9J98M9Q8k3j45
2953e1r7J53J77k49M8J36j42J01j0j4M9K55k08J77j15k27O4J54k02nj09K03rq8
2977il07L86j82J43q5M5k14j13M67j74j19P5J71k12M2q3J68k22K90k7J09M1k04
3000a4JJ23j64j1J42k07K74j4k15R4O3K7k23L52n02J02K18Q2j25p2J78n7j09k8
3024h5J38M07l46J53j29%J80j89LJ3L0k64k9L61k02j04n0P9p2K09m3j39R7k40
3048b22J33k6J76j56R2k31K04K6r0L34m16J1M26m3P8l35Q1N7r9K3K49l27J1J00
3072E6j10l3J95m73K19O7K3j00jK98k25Q6m5l8r1K41n6J02n9J51q7J54j15l45
$$ plain form
3096 -186 -136 70 101 1 52 -173 -64 -157 -20 -156 -15 -24 30 -87 64 -30 -115 -301 -87 84 -152 -178 -154 -29
3120 -29 92 230 -79 76 185 374 183 56 -149 353 343 180 -184 -4 -102 -90 23 -199 -138 -258 34 -77
3142 -77 -28 84 -193 -169 -26 -106 -427 199 -63 231 28 -68 28 97 -23 238 147 -263 -19 42 -10 155 79 187
3166 187 -63 77 76 -60 26 -16 -61 -81 -165 -69 -49 -2 -71 -71 -8 146 27 145 -127 106 268 -118 -170 271 177
3191 177 -107 242 180 66 -160 -123 -93 -123 202 -88 35 36 -76 45 -56 -200 183 -201 31 -377 77 -49
3213 -49 -153 21 -52 44 41 189 -135 265 -7 100 -109 74 243 183 -131 214 -240 -30 -154 211 -115 116
3235 116 19 -60 95 8 -161 -174 -104 -9 -52 -229 122 132 -79 -166 30 -28 3 -89 -32 50 -121 166 171 10 197
3260 197 -18 -17 45 35 205 110 49 -273 -75 -13 -47 -48 -136 29 -66 -77 53 27 39 -48 3 106 -76 122 230 184
$$ packed form
3096a86N0K06L1j00N1k25J09r3J37j36J41rN4j17J51r4q5j86K14J71k36k6K4J25
3120b9J21J38l09J55J09J89j91j27k05N02j0j63l64J80r8J2J13k22O1j20K92j11
3142g7M9J12k77K4J43q0l21O26k62K94k03r6R6O9j20K61r1m10K44O1n2J65p6J08
3166A87k50J40jj36Q6m2m5k0q4R6K0M7o9%O3J54j19J18k72K33J62l86n2M41r4
3191A77k84L49o2j14k26L7L0l0L25k90J23Jj12J21j01j44L83l84K32m08M54j26
3213d9j04J74p3R6lJ48l24M00k72J07k09J83J69o0l14L45m54K10j24L65l26K31
3235A16r7p9J55q7j69j3P0R5m3j77L51J0k11q7J96n8L1r2N7Q2j71K87Nj61J87
3260A97k15JO2j0J70r5o1l22J98O2l4jq8J65r5j1J30k6J2q7N1J03j82J98J08m6
$$ plain form
3286 184 -7 55 72 196 -152 -148 -153 91 126 -42 -55 -101 128 6 226 -46 -103 -49 -130 50 -147 -302 -167 6
3310 6 -3 -15 -266 -60 86 159 149 100 329 56 104 28 64 -181 20 21 -37 -42 -53 -206 -233 -98 -218 -188 -188 -245 -258 -247
3338 -247 -59 -71 60 -282 -55 -117 -146 192 103 -122 55 115 48 -103 192 93 -48 54 121 -27 7 395 38
3361 38 -73 149 62 -2 266 -134 -36 112 -101 -301 -37 146 194 -169 -72 258 165 -134 208 -133 55 104 -135
3384 -135 40 124 206 48 178 -32 -97 117 -125 -197 194 22 -81 -329 -189 -92 -92 -45 27 120 -145 32 -195
3407 -195 -313 48 -34 147 -101 126 206 61 -20 60 88 -199 89 79 141 43 -50 113 28 -174 220 -350 -229
3430 -229 -221 -292 -205 -216 -10 49 -27 230 -151 210 93 -74 -3 55 27 9 81 54 255 -75 -100 -200 44 79 318
3455 318 76 114 -100 28 -144 130 72 182 -29 -154 66 -174 -118 -221 -156 -126 96 -6 55 -87 49 -59
$$ packed form
3286A84j91O2J7J24l48MnK44L5j68j3m6K29j22K20k72n7N4q1J80j97j55J35J73
3310Frj2k51K06J46P3j0m9K29k73M8p6L6k45K01Jn8nj1j53k7J35j20L0%n7j3J1
3338b47J88j2J31l42K27o2k9L38q9k25J77O0o7j51K95r9j41J02O7j48L4L88l57
3361C8j11K22q7o4K68m00R8J48k13k00K64J83M8l63R7L30r3k99L42l41J88M9k39
3384a35J75Q4Q2j58J30k10o5K14k42p2L91j72j03k48J40R7%M7P2R3k65J77k27
3407a95j18L61q2J81k48K27Q0j45q1Q0K8k87K88j0O2r8r3J63q5k02L94n70J21
3430b29Qp1Q7j1K06N9p6K57l81L61j17j67P1N8k8j8P2k7K01l30k5j00K44L5K39
3455C18k42L8k14J28j72K74n8J10k11j25K20k40N6j03O5L0K22j02O1j42J36j08
$$ plain form
3477 -59 -6 9 236 244 21 4 -38 143 204 124 178 -345 61 54 -105 399 43 -314 -144 147 -28 -134 -70 48
3501 48 -17 -281 -9 -37 -23 -101 79 -106 175 67 72 -34 284 -70 6 139 -16 88 139 35 -110 39 241
3524 241 -236 -109 95 -25 -38 -174 -36 -170 73 203 -181 103 -249 -101 -68 69 48 -1 -47 34 230 -127
3546 -127 261 -56 100 -246 -123 89 -67 -75 -15 89 4 266 -174 4 75 -160 -32 58 -207 -81 12 133
3568 133 45 8 166 96 93 236 -28 88 -143 -173 -87 246 37 -19 253 157 0 -56 -113 -175 -262 -147 289 -37
3592 -37 -59 126 88 -72 -171 -44 95 -24 -172 186 39 12 74 -89 51 -59 109 144 59 -66 263 71 -149
3615 -149 57 -193 219 92 -84 -245 -33 -17 -104 26 52 156 154 -124 -60 40 -27 51 -65 49 17 120 -190
3638 -190 -194 -124 -172 -118 17 -47 86 116 124 19 99 -58 152 196 -99 -238 -66 24 -240 71 235 22 51 -142
$$ packed form
3477e9N3J5K27Qk23j7m2J81O1q0N4n23M06pj59N04l56l57J70K91j75j06O4J18
3501D8o5k64K72k8J4p8J80j85K81j08Nj06L18l54P6J33j55J04N1j04j45J49K02
3524B41m77J27K04j20j3j36J38j34K43J30l84K84l52J48L3J37k1m9m6Q1J96l57
3546a27L88l17J56l46J23K12j56qO0J04q5K62m40J78P1k35J28R0k65J26R3J21
3568A33q8l7J58p0lJ43k64J16k31l0Q6L33k09n6K72r6j57n6n7o2q7J15M36l26
3592c7k2J85l8j60r9J27J39j19j48L58j47k7O2j63J40j10J68L5q5j25L29j92k20
3615a49K06k50M12j27j76j61K12J6q7J30K6J04kk78O4J00o7P8j16J14l2J03l10
3638a90mP0m8N4J35o4J33L0Qj05Q0j57K10M4k95j39J72R0k64L11J64k13K9j93
$$ plain form
3662 -142 -85 -167 -31 -197 22 -64 -76 -24 238 -252 -43 194 231 -13 67 82 145 107 369 34 -109 144 -21
3685 -21 23 81 -100 -52 -77 -168 -163 -13 72 248 -263 162 168 38 -131 207 163 149 116 -44 -94 98 112 230 189 -18
3711 -18 -108 57 90 -70 57 -110 -24 -76 101 -16 -82 -51 84 -283 -45 -298 -10 49 -396 71 -141 189 -57
3734 -57 -96 57 -110 28 3 188 -88 -191 61 -87 -10 71 -33 93 -67 78 166 247 -55 -24 -72 -18 -104 -213
3758 -213 33 -102 -25 1 46 -46 -124 -172 72 -32 154 23 104 -43 -88 134 80 324 38 -228 128 133 -93 171
3782 171 145 -31 -108 -93 38 -176 -77 -89 146 45 -207 -82 -32 -138 287 -101 -74 71 -29 -124 270 40 343
3805 343 -188 -31 89 -9 147 -221 -47 -263 -41 37 13 -136 -60 -90 -32 -104 -53 -187 -143 -141 56 290 89 245
3829 245 -45 -41 119 -133 169 38 61 -14 -34 -206 4 230 -222 -52 -51 -220 -143 -105 -56 77 -36 -73 -48 -70
$$ packed form
3662a42N7q2J36j66K19q6j2N2K62m90K09K37L7k44Q0J5O3l8K62l35j43K53j65
3685b1M4N8j81M8k5r1NJ50Q5J76n11M25Oj30j69L38m4j4l3j60n0J92J4J18m1k07
3711a8r0J65L3j60J27j67Q6n2J77j17o6L1J35l67K38k53K88N9m45M67k12L30k46
3734e7l9J53j67J38k5J85k76j03K52j48P7Q1j04J26j60J45Q8Q1l02L1m8N4q6j09
3758b13K46j35P7K6M5r2p8m8K44j04J86j31Q1j47m5K22n4K44k86k66L56Nk26K64
3782A71k6j76p7J5J31k14R9j2K35j01k52J25N0j06M25l88K7J45j00r5L94k30L03
3805C43n31J57J20r8J56l68J74k16K22P8k4j49P6l0N8p2N1j34M4KJ97K34k01J56
3829B45k90MJ60k52L02j31K3p5k0j72K10K26m52J70Jj69P7L8M9J33j13l7K5k2
$$ plain form
3853 -70 60 -222 -237 126 -42 132 -115 -238 70 -84 -46 -22 -4 31 86 -172 -69 -39 27 142 137 137 -214 -152 -108
3878 -108 -102 120 83 -71 -291 -148 90 63 -169 5 206 -72 -115 8 9 -166 -83 -40 77 -225 52 62 -23 120
3902 120 20 63 138 -120 2 133 -155 71 20 -126 99 76 -155 225 -26 50 88 -78 -9 -66 5 -61 -194
3925 -194 -150 -110 59 125 -80 78 -43 66 24 215 110 10 161 -52 -17 86 161 -59 113 -86 -76 33
3947 33 -167 -86 -249 -71 -65 74 -58 63 154 23 193 -230 -32 -20 207 122 -28 76 354 -241 -39 45 11
3970 11 206 -44 197 -165 -160 -81 -17 187 -155 -274 -17 151 -49 245 -14 -78 107 -21 -25 74 20 228 -36
3993 -36 93 152 -39 -118 -127 68 -125 -205 -300 166 -73 4 124 72 198 37 -43 24 -182 -182 164 95 -32 -73 58
4018 58 -265 -124 59 -49 -204 122 -33 27 77 -155 -212 43 -126 -105 -43 160 64 45 -125 118 88 103 8 268
$$ packed form
3853g0J30k82j5L63j68J74k47j23L08j54L8K4J8L5N5k58J03L0O6J15n%l51O2M4
3878a08OK22l7j54k20J43K38k7k32J74K01k78m3J23Jj75Q3M3J17l02K77J0q5J43
3902A20j00M3P5k58J22J31k88K26n1j46K25k3k31L80k51P6L8j66O9n7P1o6j33
3925a94M4M0J69O6k05J58j21J09m2J91j05j00J51k13L5J03P5k20J72j99J0J09
3947C3k00Q1j63J78OJ39j32J21R1j31J70m23J98J2K27q5j50J04K78n95K02Q4l4
3970A1J95k50K41l62NP9O4K04l42j19K57J68k00K94k59o4J85j28mR9n4K08k64
3993c6J29N9j91p9rJ95j93q0r5M66k39P7J20n2J26j61q0O7k06%L46o9j27m1J31
4018E8l23J41J83j08j55L26j55O0N0k32n7K55j69K1O2K03r6j9j70K43l0J5r5K60
$$ plain form
4042 268 -96 -196 -144 -145 -16 79 225 -272 -123 1 12 19 -136 93 -58 -14 91 -73 196 195 -3 60 68 -67
4066 -67 173 -133 99 59 -212 -123 -184 -41 -79 12 8 -224 90 -39 -89 -300 -65 -75 109 -319 -106 77 79 37
4090 37 -26 93 -39 -192 36 -112 -84 71 -97 19 134 18 11 204 130 91 117 -15 -90 3 53 23 -105 1
4114 1 -237 -165 128 -111 -190 -108 -256 -99 50 55 128 15 -103 0 81 71 -342 221 -2 133 -7 141 91 3
4138 3 64 -235 -153 114 -41 23 135 -23 49 44 -40 111 141 195 277 -50 3 50 50 -96 189 154 97 52 282 -142
4164 -142 20 33 62 -65 -16 -13 -177 89 -2 -45 -47 -92 11 -77 14 143 129 -92 280 -265 40 26 -212 227 27
4189 27 24 -55 259 -169 -102 26 63 77 61 204 -26 -28 133 -174 -34 57 -178 50 194 151 -35 -179 -16 53
4213 53 -97 -58 -34 115 95 7 18 100 25 140 106 -9 164 82 141 180 121 -24 9 -274 -172 -32 -105 59 7
$$ packed form
4042B68l64j00N2jJ29R5J46m97J49J24J1Pj55K29j51M4J05j64K69jj98O3Qj35
4066f7K40l06K32m0k71Q9o1J43l8R1mk32L14j29n0k11K35j0J84m28K13J83Km2
4090C7o3J19j32j53K28j48K8J55j68J16J15j16pJ93p4l9K6j32p5R3N0l0j28J06
4114Ak38P2K93k39p9Q2j48J57J49NP3j13j18J03Q1j0m13N63k23J35j40J48n0q8
4138CO1k99Q2K67j55O4J12j58P2nq4J51L0N4Q2l27N3M7%j46K85l5n7m5K30m24
4164a42J62J3K9j27M9Lj64K66r1m3km5J03q8R1J29j4k21L72n45L05j4k38M39k00
4189B7lp9L14m28O7J28L7J4j6J43k30kJ61l07J40R1k35K28J44m3j86j44J63O9
4213E3j50L9K4J49k0q8J1Q2p5J15l4j15J73q2N9L9n9j45L3k83J02J40p3J64n2
$$ plain form
4238 7 -111 -197 -37 -33 134 -169 -269 -92 148 -211 -248 -15 52 -26 101 -137 -150 326 -199 149 -58 136 -78
4261 -78 95 -29 144 -174 -192 -69 -41 53 74 -32 -73 1 105 -206 -89 -302 -94 88 174 25 80 -32 53
4284 53 -186 -12 42 -4 -48 -11 -168 -194 34 127 306 -217 272 38 -117 9 173 -114 -236 6 22 -97 34
4307 34 119 163 -62 38 -66 -84 96 -208 -154 33 245 252 -150 185 133 63 63 65 62 76 -119 59 8 -108 43 77
4333 77 -110 284 34 157 -1 -408 -98 189 150 -341 -128 89 141 190 28 181 47 -5 -319 -50 244 170
4355 170 131 -170 388 -128 -13 96 187 139 -8 57 307 111 -177 101 -3 190 -237 -139 -44 -84 111 -284
4377 -284 2 -114 248 -34 -257 13 100 140 262 -247 247 105 -170 -44 120 29 -83 -190 44 -94 128
4398 128 -141 -168 -103 -126 -27 49 216 48 47 -226 -174 -183 45 109 -101 94 72 -38 -38 11 217 116 46 101 -50 -1
$$ packed form
4238Gj18q6J60MJ67l03j00J77K40l59l7K33O7p8J27k38j3M76n25L48k07J94k14
4261g8J73j24J73l18j8J23K8R4K1j06m1P4J04l11J17k13K08J82Q6j49N5j12Q5
4284E3k39J74N4m6m4L7j57k6K28R3J79n23M89k34j55J26J64k87j22K42J6j19J31
4307C4Q5M4k25J00j04j8J80l04N4J87K12Pm02L35n2p0%KlJ4j95J78n1j16J51L4
4333G7j87L94k50J23j58m07L10K87l9m91K13K17N2M9j62J53j34n2l14K69K94p4
4355A70l9l01N58n16J15J09R1m8j47O5K50j96k88K78j04J93m27R8R5m0J95l95
4377b84K86j16L62k82k23K70Q7M0J22n09M94j42k75J26J64r1j12j07K34j38K22
4398A28k69k7O5k3R9P6J67j68jk73N2rK28O4k10J95k2j10%M9K06j01p0N5j51M9
$$ plain form
4424 -1 68 -174 73 18 116 246 -126 36 -71 -54 52 -87 206 -265 10 -21 115 14 -88 175 66 -46
4446 -46 -21 -408 33 136 79 42 -341 -79 229 -84 -196 19 -91 65 219 106 53 -32 205 35 77 -88
4468 -88 81 -141 25 -223 -91 63 -41 94 26 19 -28 -6 67 176 -4 144 221 45 -67 181 -13 89 -55
4491 -55 103 -50 -43 74 -27 -134 10 114 -214 120 228 179 -122 21 -310 -136 154 49 224 -4 85 257
4513 257 -15 16 25 -148 0 -7 -101 287 115 52 -10 36 -23 184 -179 97 -72 194 -11 -55 -293 158 -138 -32
4537 -32 14 163 23 -62 66 318 49 72 168 25 51 81 89 70 211 2 -108 -203 -12 -10 156 53 -88 158
4561 158 -71 97 122 -156 -13 -14 216 95 100 -215 34 120 96 -55 -206 14 63 154 -164 -57 42 111 -19 -127
4585 -127 -155 112 32 -187 -234 -61 115 31 320 78 -34 -139 116 19 -144 126 61 -149 134 -43 -311 -75
$$ packed form
4424aO9k42K47n5R8J30l72J62j07J7J06j39K93m71K75l1J36j01j02K63j09j12
4446d6K5l87M41J03n7l7l83K62L08l13j12K15j10J56J54j13n3q5K37j70M2j65
4468h8J69k22J66k48J32J54j04J35o8pm7K2P3J09j80J48P7j76j12K48j94J02j44
4491e5J58j53PJ17j01j07J44J04l28L34J08m9l01J43l31J74K90j05J75k28Q9J72
4513B57k72L1Rj73J48pr4L88j72o3o2M6n9K07l63K76j69K66k05m4k38M51k96J06
4537c2M6J49j40q5J28K52k69K3R6j43K6L0Qj9J41k09j10r5J91KJ66j03j41K46
4561A58k29J68K5k78J43jK30j21Nl15K49Q6k4j51j51K20M9R1l18J07R9O9j30j08
4585a27k8K67q0k19m7J73J76q4K89k42j12j05K55r7j63K70o5k10K83j77k68K36
$$ plain form
4607 -75 11 -142 -222 79 4 93 204 -15 -133 14 -49 -156 -53 -43 44 -66 -81 24 -209 211 190 -217 159
4630 159 -227 28 -249 -173 -124 114 -47 -13 -139 147 52 -210 -118 -181 230 -124 -344 196 -33 -301 108 341
4652 341 -68 -238 52 62 -49 0 -33 200 143 -95 6 -220 33 -70 140 2 -125 -145 -17 3 82 -188
4674 -188 -69 -233 5 40 108 140 120 84 -135 -12 18 4 85 -52 -159 -146 84 51 -3 -228 -25 150 -192 115
4698 115 323 -154 -213 109 -125 202 -220 41 -28 -12 142 -282 -32 208 15 103 -175 -23 81 -125 86
4719 86 83 -64 226 -64 -53 -51 168 -96 123 59 51 125 98 -136 -91 -144 -171 -12 -91 -18 246 3 -277 -61 -88 96
4745 96 -6 -99 -33 61 -1 49 128 165 -32 -237 -133 -78 150 -149 75 259 -13 -105 -104 104 -99 65 -290 -44
4769 -44 83 130 -162 -52 96 -111 -136 175 -50 240 -78 -120 -31 -78 140 -37 248 152 24 -351 -319 137 -178
$$ packed form
4607g5Q6j53q0L01p5Q9J11k19j18J47o3j07J03J0Q7j10j5J05k33M20k1m07L76
4630A59l86K55k77P6M9K38j61L4j26K86r5k62R2o3M11l54k20N40k29k68M09K33
4652C41m09j70K90J0j11M9l3K33n7k38J01k26K53j03K10j38j27k0J28K0P9k70
4674a88J19j64K38L5O8L2k0l6k19J23L0j4Q1j37j07J3K30l3n4k25K03J75l42L07
4698A15K08m77n9L22k34L27m22K61o9J6J54m24K50K40j93Q8k78J52J04k06K11
4719H6lj47K90k90J1KK19k64K19o4qP4k7k34M5n3k7J59p9P3K64k43k80K16k7J84
4745I6j02r3O6R4o2N0P9L7j97k05J04N5K28k99K24J84k72r2JK08k03J64l55K46
4769d4J27M7k92J10J48k07k5L11k25K90l18m2Q9m7K18j77K85r6j28l75L2M56l15
$$ plain form
4792 -178 -21 -68 96 -3 57 48 -240 -209 -122 -106 16 53 -15 -119 46 -31 163 290 -90 64 201 137 -191 2
4816 2 -46 -154 -82 91 -112 -33 206 87 -323 -138 28 -135 -150 -129 38 122 -118 303 144 102 -42 -80 197
4839 197 86 -374 -101 -84 27 -45 -30 -36 -67 272 104 95 -104 -152 -280 48 81 -86 -89 -20 88 -37 55 318 58
4864 58 58 -75 -1 -8 -176 -37 199 -65 31 16 61 -11 -307 32 -52 147 61 310 -16 -149 -57 -43 -7 142 63
4889 63 -181 -303 129 -30 95 129 -167 -83 68 38 170 7 229 75 32 -49 217 -31 -48 -162 -218 -28 -130
4912 -130 45 -109 -173 115 204 -139 60 -45 17 -34 -33 246 146 19 126 97 -151 37 94 -134 71 -45 -40
4935 -40 -44 34 140 22 -147 -250 3 208 -130 9 -43 -334 -69 -160 8 97 62 -52 -18 -28 232 25 -182
4958 -182 22 72 46 -123 -25 0 91 184 183 63 181 18 130 154 61 131 -191 265 -96 -29 -33 -96 -231 -248 -220 -115
$$ packed form
4792a78J57m7J64r9O0rk88L1Q7J6J22L7o8j04J65p7J94J27l80J54J37o4l28J93
4816Bm8j08P2J73k03P9K39j19m10J85J66j63j5K1J67Q4k40M21j59m2j44l8K77
4839A97j11m60K73J7J11p2J5ol1L39j68rj99m8j28L28L3j67lO9J08j25R2K63k60
4864E8%j33P4pj68J39K36k64R6j5M5p2k96L39q4J99q6K49l26j33R2J4L6J49p9
4889F3k44j22M32j59J25L4k96Q4J51l0J32j63K22j54m3q1K66k48j7j14n6J90j02
4912a30J75j54o4K88Q9l43J99j05O2n1JK79j00j27J07k9k48J88N7k28K05j16N
4935d0mP8J06j18j69j03K53K05l38J39n2k91K65r1J68Q9l5j14L4j0K60k07k07
4958a82K04N0k6j69R8K5R1R3jj20J18j63J12K4r3P0l22M56l61O7mo3j35j7K8J05
$$ plain form
4984 -115 149 320 102 102 -99 -26 132 30 -1 180 51 -195 -95 -20 73 5 56 -162 22 -101 -165 94 102 -52
5008 -52 8 -164 -83 63 -54 204 157 52 -55 81 151 -150 -87 -32 189 303 39 280 -51 -29 64 -275 73
5031 73 176 -189 -143 -102 -120 89 149 55 -42 -213 -55 66 101 -225 196 160 -184 -172 -37 40 -7 -18 -128 72
5055 72 -265 49 23 -43 -79 3 102 3 126 76 -89 34 69 166 -117 -268 257 31 121 -171 32 152 -105 -66
5079 -66 -129 -240 -113 83 -19 -21 -50 -18 -4 -103 67 43 139 130 -19 146 63 -42 20 12 36 110 -42 262 81 -13
5105 -13 -28 212 -115 28 100 -110 -204 -188 -98 88 271 -90 88 -44 157 40 153 129 3 36 83 132 -94
5128 -94 24 0 12 -61 157 104 -193 -139 85 -165 -145 -78 -126 118 271 -255 -99 60 -184 4 137 119 -33
5151 -33 227 -95 21 86 110 -48 202 122 -33 93 -178 -111 50 -120 10 260 141 142 -172 -17 30 -6 64
$$ packed form
4984a15K64J71k18%k01P3J58j02l1J81j29k46J00P5R3o8N1k18J84j23o4K59Qj54
5008e2O0j72Q1J46j17K58m7j05j07J36P0l01O3N5K21J14k64K41l31K2R3l39L48
5031G3J03l65M6M1j8K09O0r4r7j71J58J21L5l26M21l6l44J2J35P7m7j1j10K00
5055G2l37L14k6o6l6Q2R9r9J23n0j65J23L5R7k83j51N25k26R0k92K03J20k57L9
5079f6o3j11J27J96j02kk9L2J4r9J70k4R6rj49J65q3j05O2qK4P4j52L04j81r4
5105a3j5K40l27J43P2k10r4J6R0J86J83l61J78j32K01j17J13k4j26L3M7M9k26
5128i4J18k4J2p3K18n3k97N4K24k50K0O7m8K44J53n26J56J59k44J88J33j8j52
5151c3K60l22J16O5K4j58K50q0j55J26k71O7J61j70J30K50j19Jl14J55M7l6P0
$$ plain form
5174 64 -27 86 -80 -167 46 41 -50 28 134 -114 122 52 -46 -68 -126 -182 -154 -20 2 104 121 225 241 7 -229
5199 -229 97 -57 135 -125 -105 -187 197 63 -324 10 -213 -180 -60 -123 -110 -76 -246 -101 -11 83 -93 93 -190
5222 -190 55 103 120 228 130 -90 170 47 56 153 -166 -185 8 -22 -53 -116 302 35 -244 204 89 -227 185
5245 185 128 59 -87 -90 -192 -20 206 307 -188 -245 167 97 69 -10 -121 -69 -132 54 -6 -29 175 60 94 -144
5269 -144 -157 127 171 -128 129 -375 220 68 40 -144 70 -30 -6 -73 -133 -251 68 74 43 58 -134 176 150 97
5293 97 -237 -111 62 110 -292 -100 183 -143 -87 87 112 43 74 -183 -195 -107 -117 52 89 -13 -35 -14 -182 -95
5317 -95 267 -3 337 5 10 90 73 -326 47 142 -29 70 -99 189 155 -203 -38 -8 38 124 -174 421 -14 -187
5341 -187 -49 -167 -24 -6 -46 33 -215 -179 -70 -150 106 -111 299 -133 76 75 149 54 65 -63 188 11 -26 -61
$$ packed form
5174F4r1J13j66q7K13nr1P8J06k48K36p0r8k2n8n6K8J34K2J02J7J04J6k34k36
5199b29L26j54J92k60K0q2L84j34l87L34k23L3J20o3J3L4j70J45R0R4j76J86k83
5222a90K45M8J7J08r8k20K60j23RR7l19j9J93l0l1o3M18k67k79M48j15l16M12
5245A85n7o9j46lj02J72K26J01m95n7M12p0k8p9j11N2o3J86o0k3K04j15L4k38
5269a44j3K84M4k99K57n04N95j52k8j84K14j00K4o7o0j18L19Ol1J5j92L10k6n3
5293I7l34J26J73M8m02J92K83l26N6J74K5o9L1k57j2Q8j0J69L7j02k2K1j68Q7
5317i5L62k70L40l32NQ0j7l99L73R5j71R9j69K88l4l58J65L0M6Q6k98N95m35j73
5341a87J38j18J43J8m0P9k48L6J09q0K56k17M10m32K09jP4r5J1j28K51j77l7l5
$$ plain form
5365 -61 -22 102 68 91 -298 211 202 62 -34 -125 -71 104 120 113 83 38 -130 21 -72 -17 -161 -183 152 -198 -119 161
5391 161 88 -107 15 -68 31 -290 46 305 -58 155 87 -112 -131 -113 -89 114 74 -35 -19 107 -113 -38 -95 120
5415 120 -116 -136 -165 -93 165 -47 -142 187 -99 303 -14 -13 -27 159 -136 -31 -7 183 175 -288 94 182 141 -38
5439 -38 -210 59 -32 107 199 15 66 -65 216 101 19 155 -190 -5 21 226 209 14 -17 -7 -49 107 0
5462 0 84 154 -224 -131 -209 197 -26 167 -122 -161 -85 -22 20 -121 29 -107 -91 -25 277 7 120 -85 -148 103
5486 103 -40 259 187 11 38 -99 -136 141 -31 -79 98 41 234 -59 70 -45 -149 46 -357 -86 -157 179
5508 179 -217 -151 -51 -90 -260 16 -83 36 -11 43 -45 -164 -106 68 293 28 145 30 -104 36 -147 -197 243
5531 243 -51 -92 42 -17 94 -369 80 116 -119 284 20 -160 -152 29 17 -179 -309 26 90 -267 -42 -50 10
$$ packed form
5365f1L9J24l4K3l89N09rj40r6r1N4J75J6pl0m5j68J51r3N5j44k2L35l50P9K80
5391A61p3j95J22q3R9l21L36K59l63K13o8j99j9J8K4K03m0j09J6J26k20P5n7K15
5415A20k36k0k9P2K58k12r5L29k86M02l17Jj4J86k95J05K4J90qm63L82Q8m1j79
5439c8j72K69r1J39R2j84N1j31K81j15q2J36l45J85K6K05j7j95l1J0m2J56j07
5462@Q4P0l78R3p8M06k23J93k89l9P6O3M2j41J50j36J6O6L02k70J13k05o3K51
5486A03j43K99p2j76K7j37l7K77j72m8J77n7J93k93J29j15j04J95m03K71p1L36
5508A79l96O6J00l9j70K76r9J19m7N4q8j19N8J74K25k65J17j15j34J40j83n0M40
5531B43k94m1J34n9J11m63M49L6k35M03k64j80QJ81j2j96j30L35O4l57K25qO0
$$ plain form
5554 10 27 -130 -6 307 42 -160 -150 -117 77 -241 -116 -196 -71 -99 77 -240 50 8 26 212 -95 -88 -33 260
5578 260 16 45 -165 21 -19 -3 -262 -54 220 -157 146 189 -7 -142 250 84 22 -146 -103 -80 -48 38 156
5601 156 -80 -145 30 195 -34 2 -26 6 95 -52 -145 -159 53 35 130 113 82 117 -112 -122 84 -269 -185 -9 -36
5626 -36 -24 118 -17 -58 -234 -47 -49 -27 188 -107 -359 270 -115 62 3 -113 124 -208 38 -35 -74 -182 -80
5649 -80 -93 -48 86 66 178 -17 -106 192 -6 10 60 -8 139 -305 -107 -61 34 -281 185 4 -34 -161 162 18
5673 18 9 82 -194 -69 -106 -121 67 -114 137 -3 -170 54 -235 188 -82 -171 -113 -90 -206 -148 64 255 -111
5696 -111 -96 -374 8 94 193 81 97 139 -153 58 -5 71 -323 -23 -21 -222 117 -14 133 -175 64 -53 -56 -57
5720 -57 -264 -4 -17 144 4 34 -13 -97 -101 -281 -95 96 -151 -148 -66 -144 -65 -28 -31 -19 53 161 102 15 -20 20 20 -83
$$ packed form
5554A0J7j57J24L13k65k02J0L3J94l18J25q0J25k8J76l17K90m2J8J86l07PN5K93
5578B60k44K9k10J86m0J6k59K08K74l77L03M3j96j35L92j66o2j68M3K3L2Q6J18
5601A56k36o5J75J65k29L6k8L2Q9j47r3j4K12j8R5j7l1L5k29j0K06l53Q4J76k7
5626c6J2J42j35m1j76J87kK2K15k95k52O29l85J77n9j16K37l32K46p3l9j08J02
5649h0j3M5J34k0J12j95q9K98j98J6N0o8J47m44J98M6R5l15M66j81l8j27L23j44
5673A8rP3k76J25l7j5J88j81K51j40j67K24k89M23k70q9N8K3j16N8K12J91l66
5696a11J5k78L82Q6R9j12J6M2k92K11o3P6l94L00Kk01L39j31J47l08K39j17lj
5720e7k07K60j3J61j40L0m7q4mj80J86J91k47LQ2p8P9L7lJ2P2J08n9q7l5M0%j03
$$ plain form
5748 -83 167 42 42 -62 -210 -74 47 150 -151 11 72 -44 -212 66 -244 45 -57 107 100 -216 -42 -52
5770 -52 -122 129 -145 77 101 -31 -122 98 111 -43 -23 47 27 -66 -240 55 113 8 78 -6 -4 76 -138 -82 65
5795 65 -92 177 -9 -36 103 -62 -70 -55 -3 27 189 168 -20 7 190 -67 14 -142 37 -259 -100 -14 56 -83
5819 -83 129 -34 55 72 34 120 238 141 -15 205 41 -130 -166 -42 324 -88 107 -176 -72 28 -350 12
5841 12 286 -83 41 133 101 58 64 151 -29 98 95 -101 -68 -57 -7 22 -156 -130 -33 166 8 16 -78 194 -165 -31
5867 -31 -8 274 -20 -138 -244 97 8 27 103 172 -38 119 -51 223 105 -61 150 -61 161 -9 91 -156
5889 -156 52 -148 109 24 12 -88 141 153 29 230 -82 292 -113 103 -103 72 89 -36 -158 -6 172
5910 172 262 130 30 59 112 63 90 -30 34 -256 65 77 161 -64 169 -25 -48 133 -50 21 -102 -229 -100
$$ packed form
5748h3K50j25%j04j48J36J21J03l01J62O1j16j68K78l10K89j02J64pl16J74j0
5770e2p0K51k74K22K4j32r1K20J3j54K0P0k0r3j74K95N8j05P0q4KQ0k14N6J47
5795F5j57K69j86k7J39j65qJ5N2L0J62k1j88K7J83k57Q1j56J79k96J59Q6P0j39
5819h3K12j63Q9J7l8Q6J18r7j56K20j64j71l6J24L66m12J95k83J04J00l78L62
5841A2K74l69J24R2l2m3OQ7j80J27lj96L3J1N0K9j78K6R7J99j58Qr4K72l59J34
5867c1K3K82k94j18j06L41q9J9P6O9k10J57j70K74j18j66K11k11K22j70J00k47
5889a56K08k00K57q5j2j00K29J2j24K01l12L74m05K16k06J75J7j25j22J52J78
5910A72R0j32j00K9N3m9K7j20O4k90L21J2Q4k25K33j94k3J81j83P1j23j27J29
$$ plain form
5933 -100 113 -250 -38 149 -117 -136 71 -72 -112 -98 54 -66 -83 -180 -257 -222 -1 -47 -219 219 -78 -174 61
5956 61 60 56 -148 -242 109 13 269 -54 37 153 -3 17 150 -101 233 -193 -55 -108 -191 102 -86 140 -135 254
5980 254 94 39 172 -336 -102 -98 197 -60 94 -70 -25 -9 148 -80 12 135 -66 380 -156 -30 56 -45
6002 -45 18 -157 -53 -12 91 -27 18 -63 40 245 72 -13 87 154 45 209 155 137 -66 -34 74 89 14 -53
6026 -53 34 60 -80 159 205 39 -207 -93 -26 219 -162 73 -33 135 144 -235 -306 72 181 -93 29 -39 -213
6049 -213 -27 143 87 40 53 89 -108 -87 -174 64 243 281 -61 -270 -4 -176 -84 179 26 80 -146 160 -122
6072 -122 22 204 20 -87 0 266 56 183 -20 247 -25 -36 51 186 84 261 -16 -271 139 152 -4
6093 -4 9 27 -12 156 92 331 126 371 -165 289 97 48 -66 108 -183 71 -25 -174 -38 15 226 -166 -141
$$ packed form
5933a00K13l63K12J87k66j9K07j43m0J4J52j20j7r7p7L5K21m6j72M38k97r6K35
5956F1jmk04r4L51r6K56l23R1J16j56K0J33k51L34m26J38n3q3K93j88K26k75L89
5980B54j60n5J33n08K34MK95k57J54j64M5J6J57k28R2J23k01M46n36J26Q6j01
6002d5O3j75J04M1J03j18M5q1J03K05j73q5J00O7j09J64n4j8k03L2J08J5p5o7
6026e3Q7K6j40K39M6j66k46J14O7K45l81K35j06J68Rl79p1L78J09k74J22o8j74
6049b13J86J70n6m7J3L6j97K1q7K38J79L8l42k09K66j72R2K63j53N4k26L06k82
6072a22J44J82j84j07Q7K66k10J27k03K67k72j1Q7J35j02J77k77k55M10J3j56
6093dJ3J8l9J68o4K39k05K45n36M54j92m9j14J74k91K54r6j49J36N3K11l92K5
$$ plain form
6116 -141 -52 352 -177 -46 0 32 -141 151 -49 -113 56 -33 20 -169 74 -39 -47 -110 -238 152 229 -80 162
6139 162 -12 -2 -128 20 2 -61 -47 111 -100 69 -60 72 -42 152 32 99 140 126 -21 140 11 8 -150
6162 -150 -169 34 20 -120 -13 2 238 76 101 21 232 -69 81 55 61 2 -122 -83 -138 334 218 282 -33 -217
6186 -217 91 79 77 -56 264 -144 -7 -45 -180 52 -64 75 -105 363 10 213 -219 -73 -90 68 -168 -204
$$ packed form
6116a41Q9M04n29J31M6L2j73K92k00o4J69q9N3j89K43j13qo3j28L90P7l09K42
6139A62j74J0j26J48j8o3J4J58k11J69j29J32j14J94j20O7M1j4j47J61j29lj58
6162a50j9K03j4j40J07J5K36j62K5q0K11l01J50k6On9j24L9n5M72j16O4l15j84
6186b17L08j2kj33L20m08J37l8j35K32j16J39j80M68l53K03m32J46j7J58k36l6
$$ [...]
8191B7
##END NTUPLES=NMR FID
##END=
