##TITLE=1H_LR-758-R4-KA1-CR3
 CCl4
 8 sc, 
 26.9.2023
##JCAMPDX= 6.0         $$ Bruker NMR JCAMP-DX V2.0
##DATA TYPE= NMR FID
##DATA CLASS= NTUPLES
##ORIGIN= UXNMR, Bruker Analytische Messtechnik GmbH
##OWNER= root
$$ XWIN-NMR		Version 3.5
$$ Tue Sep 26 14:31:15 2023 Russian Standard Time (UT+4h)  she@DPX200
##.OBSERVE FREQUENCY= 200.134
##.OBSERVE NUCLEUS= ^1H
##.DELAY= (6, 6)
##.ACQUISITION MODE= SIMULTANEOUS
##.ACQUISITION SCHEME= undefined
##.AVERAGES= 8
##.DIGITISER RES= 18
##SPECTROMETER/DATA SYSTEM= spect
##.PULSE SEQUENCE= zg30
##.SOLVENT NAME= CDCl3
##.SHIFT REFERENCE= (INTERNAL, CDCl3, 0, 15.7039)
##AUDIT TRAIL= $$ (NUMBER, WHEN, WHO, WHERE, WHAT)
$$ ##TITLE= Audit trail, XWIN-NMR		Version 3.5
$$ ##JCAMPDX= 5.01
$$ ##ORIGIN= Bruker BioSpin GmbH
$$ ##OWNER= she
$$ F:/spectra/data/she/nmr/H-F/1/audita.txt
$$ ##AUDIT TRAIL=  $$ (NUMBER, WHEN, WHO, WHERE, WHAT)
(   1,<2023-09-26 14:30:04.29 +0400>,<she>,<DPX200>,
      <created by zg, POWCHK disabled, PULCHK disabled
       configuration hash MD5:
       00 E9 B6 7A A2 85 ED C7 34 08 36 98 17 FE 4E 26
       data hash MD5: 16K
       E7 ED 10 FB 9D DC 76 A3 E7 C5 D6 C0 E5 A5 18 A2>)
$$ ##END=
$$ 
$$ hash MD5
$$ D7 98 30 6A BD 5E C0 98 D1 66 1A E4 00 0A BC 81
##$RELAX= 
##$RELAX= 
##$RELAX= 
##$RELAX= 
##$RELAX= 
##$RELAX= 
$$ Bruker specific parameters
$$ --------------------------
##$DU= <F:/spectra>
##$EXPNO= 1
##$NAME= <H-F>
##$PROCNO= 1
##$TYPE= <nmr>
##$USER= <she>
##$AMP= (0..31)
100 100 100 100 100 100 100 100 100 100 100 100 100 100 100 100 100 100 
100 100 100 100 100 100 100 100 100 100 100 100 100 100 
##$AQSEQ= 0
##$AQ_mod= 1
##$AUNM= <au_zg>
##$AUTOPOS= <>
##$BF1= 200.13
##$BF2= 200.13
##$BF3= 200.13
##$BF4= 200.13
##$BF5= 200.13
##$BF6= 200.13
##$BF7= 200.13
##$BF8= 200.13
##$BYTORDA= 1
##$CFDGTYP= 0
##$CFRGTYP= 5
##$CHEMSTR= <none>
##$CNST= (0..31)
1 1 145 1 1 1 1 1 1 1 1 1 1 1 1 1 1 1 1 1 1 1 1 1 1 1 1 1 1 1 1 1 
##$CPDPRG= <>
##$CPDPRG1= <>
##$CPDPRG2= <>
##$CPDPRG3= <>
##$CPDPRG4= <mlev>
##$CPDPRG5= <mlev>
##$CPDPRG6= <mlev>
##$CPDPRG7= <mlev>
##$CPDPRG8= <mlev>
##$CPDPRGB= <>
##$CPDPRGT= <>
##$D= (0..31)
0 1.2 0 0 0 0 0 0 0 0.06 0 0.03 0 0 0 0 0.0002 0 0 0 0 0 0 0 0 0 0 0 0 
0 0 0 
##$DATE= 1695724203
##$DBL= (0..7)
120 120 120 120 120 120 120 120 
##$DBP= (0..7)
150 150 150 150 150 150 150 150 
##$DBP07= 0
##$DBPNAM0= <>
##$DBPNAM1= <>
##$DBPNAM2= <>
##$DBPNAM3= <>
##$DBPNAM4= <>
##$DBPNAM5= <>
##$DBPNAM6= <>
##$DBPNAM7= <>
##$DBPOAL= (0..7)
0.5 0.5 0.5 0.5 0.5 0.5 0.5 0.5 
##$DBPOFFS= (0..7)
0 0 0 0 0 0 0 0 
##$DE= 6
##$DECBNUC= <off>
##$DECIM= 32
##$DECNUC= <off>
##$DECSTAT= 4
##$DIGMOD= 1
##$DIGTYP= 9
##$DL= (0..7)
0 120 120 120 120 120 120 120 
##$DP= (0..7)
150 150 150 150 150 150 150 150 
##$DP07= 0
##$DPNAME0= <>
##$DPNAME1= <>
##$DPNAME2= <>
##$DPNAME3= <>
##$DPNAME4= <>
##$DPNAME5= <>
##$DPNAME6= <>
##$DPNAME7= <>
##$DPOAL= (0..7)
0.5 0.5 0.5 0.5 0.5 0.5 0.5 0.5 
##$DPOFFS= (0..7)
0 0 0 0 0 0 0 0 
##$DQDMODE= 0
##$DR= 18
##$DS= 0
##$DSLIST= <SSSSSSSSSSSSSSS>
$$ [...]
##$SUBNAM2= <"">
##$SUBNAM3= <"">
##$SUBNAM4= <"">
##$SUBNAM5= <"">
##$SUBNAM6= <"">
##$SUBNAM7= <"">
##$SUBNAM8= <"">
##$SUBNAM9= <"">
##$SW= 18.0514893171864
##$SWIBOX= (0..15)
0 0 2 0 0 0 0 0 0 0 0 0 0 0 0 0 
##$SW_h= 3612.71676300578
##$TD= 16384
##$TD0= 1
##$TE= 0
##$TE2= 300
##$TE3= 300
##$TEG= 300
##$TL= (0..7)
0 120 120 120 120 120 120 120 
##$TP= (0..7)
150 150 150 150 150 150 150 150 
##$TP07= 0
##$TPNAME0= <>
##$TPNAME1= <>
##$TPNAME2= <>
##$TPNAME3= <>
##$TPNAME4= <>
##$TPNAME5= <>
##$TPNAME6= <>
##$TPNAME7= <>
##$TPOAL= (0..7)
0.5 0.5 0.5 0.5 0.5 0.5 0.5 0.5 
##$TPOFFS= (0..7)
0 0 0 0 0 0 0 0 
##$TUNHIN= 0
##$TUNHOUT= 0
##$TUNXOUT= 0
##$USERA1= <user>
##$USERA2= <user>
##$USERA3= <user>
##$USERA4= <user>
##$USERA5= <user>
##$V9= 5
##$VALIST= <valist>
##$VCLIST= <CCCCCCCCCCCCCCC>
##$VD= 0
##$VDLIST= <DDDDDDDDDDDDDDD>
##$VPLIST= <PPPPPPPPPPPPPPP>
##$VTLIST= <TTTTTTTTTTTTTTT>
##$WBST= 1024
##$WBSW= 4
##$XGAIN= (0..3)
0 0 0 0 
##$XL= 0
##$YL= 0
##$YMAX_a= 33230
##$YMIN_a= -91281
##$ZGOPTNS= <>
##$ZL1= 120
##$ZL2= 120
##$ZL3= 120
##$ZL4= 120
##$ABSF1= 10
##$ABSF2= 0
##$ABSG= 5
##$ABSL= 3
##$ALPHA= 0
##$AQORDER= 0
##$ASSFAC= 0
##$ASSFACI= 0
##$ASSFACX= 0
##$ASSWID= 0
##$AUNMP= <proc_1d>
##$AZFE= 0.1
##$AZFW= 0.1
##$BCFW= 1
##$BC_mod= 2
##$BYTORDP= 1
##$COROFFS= 0
##$CY= 11.3945322036743
##$DATMOD= 1
##$DC= 2
##$DFILT= <>
##$DTYPP= 0
##$F1P= 15.7292609196834
##$F2P= 12.9074282941183
##$FCOR= 0.5
##$FTSIZE= 0
##$FT_mod= 4
##$GAMMA= 1
##$GB= 0.15
##$INTBC= 1
##$INTSCL= 1
##$ISEN= 128
##$LB= 0.24
##$LEV0= 0
##$LPBIN= 0
##$MAXI= 10000
##$MC2= 0
##$MEAN= 0
##$ME_mod= 0
##$MI= 1.114404
##$NCOEF= 0
##$NC_proc= 0
##$NLEV= 6
##$NOISF1= 3.799351
##$NOISF2= 2.8
##$NSP= 1
##$NTH_PI= 0
##$NZP= 0
##$OFFSET= 15.70392
##$PC= 1
##$PHC0= -21711.39
##$PHC1= 11.05271
##$PH_mod= 1
##$PKNL= yes
##$PPARMOD= 0
##$PSCAL= 0
##$PSIGN= 0
##$REVERSE= no
##$SF= 200.130013532006
##$SI= 16384
##$SIGF1= 3
##$SIGF2= 2
##$SINO= 400
##$SIOLD= 16384
##$SREGLST= <1H.CDCl3>
##$SSB= 0
##$STSI= 0
##$STSR= 0
##$SW_p= 3612.71676300578
##$SYMM= 0
##$S_DEV= 0
##$TDeff= 0
##$TDoff= 0
##$TI= <>
##$TILT= no
##$TM1= 0
##$TM2= 0
##$TOPLEV= 0
##$USERP1= <user>
##$USERP2= <user>
##$USERP3= <user>
##$USERP4= <user>
##$USERP5= <user>
##$WDW= 1
##$XDIM= 8192
##$YMAX_p= 0
##$YMIN_p= 0
$$ End of Bruker specific parameters
$$ ---------------------------------
##NTUPLES= NMR FID
##VAR_NAME=  TIME,          FID/REAL,        FID/IMAG
##SYMBOL=    X,             R,               I
##VAR_TYPE=  INDEPENDENT,   DEPENDENT,       DEPENDENT
##VAR_FORM=  AFFN,          ASDF,            ASDF
##VAR_DIM=   8192,          8192,            8192
##UNITS=     SECONDS,       ARBITRARY UNITS, ARBITRARY UNITS
##FACTOR=    0.0002768,     1,               1
##FIRST=     0,             0,               0
##LAST=      2.2672688,     0,               0
##MIN=       0,             -91281,          0
##MAX=       2.2672688,     33230,           0
$$ Real data points
##PAGE= N=1
##DATA TABLE= (X++(R..R)), XYDATA
$$ plain form
0 0 0 0 0 0 0 0 0 0 0 0 0 0 0 0 0 0 0 0 0 0 4 -8 8 -8 8 -8 8 -11 15 -16 16 -19 23 -24 28 -31 35 -39 44 -48 53 -60
42 -60 66 -72 80 -88 97 -107 119 -129 142 -156 172 -192 213 -237 265 -298 336 -381 438 -511 606
63 606 -738 927 -1220 1731 -2773 5698 -28831 -91281 16794 1314 -46435 8643 -36436 -82125
77 -82125 -3294 -3793 -48434 -19580 -22232 -42063 -15768 -11651 -18056 -2307 -10620 -30837 -11317
90 -11317 14846 3594 -7926 -1803 -16240 -6607 30370 3604 -21621 12896 3692 -11845 21116
103 21116 6653 -9678 20527 1366 -9708 26410 9795 478 24835 -3310 -4095 32669 6088
116 6088 -2767 28453 4514 -11298 16291 11626 2116 14054 3102 -14033 -2438 16835 11183
129 11183 -6663 -5613 -3936 -7888 7563 9306 -9525 -7816 -7041 -11273 2645 3068 -7928 -9940
$$ packed form
0@%%%%%%%%%%%%%%%%%%%%Mj2J6j6J6j6J6j9K6l1L2l5M2m7N2n9O6p4Q3r2J01j13
42f0J26j38J52j68J85k04K26k48K71k98L28l64M05m50N02n63O34p17Q19r49J117
63F06j344J665k147K951m504Q471l4529o2450J08075j5480m7749N5078m5079m5689
77h2125P8831m99m4641K8854k652j9831K6295M117o405J5749q313k0217J9520
90a1317K6163j1252j1520O123j4437R633L6977k6766k5225L4517r204j5537L2961
103B1116j4463j6331L0205j9161j1074L6118j6615r317K4357k8145p85L6764k6581
116F088q855L1220k3939j5812K7589m665r510J1938j0952j7135J1595J9273n652
129A1183j7846J050J677l952J5451J743j8831J709P75m232J3918M23j0996k012
$$ plain form
143 -9940 -20339 -13420 7529 -4027 -14012 -10002 -19298 -9003 5898 -9399 -10798 -4495 -13345 -3680
157 -3680 2755 -7912 771 812 -12497 -782 5564 -3087 3240 3081 -5496 793 4588 1319 3312
172 3312 5376 5287 1626 411 8629 9393 6871 8837 2265 1200 12237 11409 7929 7447 -110 2209
188 2209 7463 2723 5510 2485 -8981 -2998 616 -6689 -1582 -4244 -15806 -8568 -4733 -10469 -5187
203 -5187 -7036 -13294 -7350 -5915 -7934 -2920 -3762 -5860 -2312 -2769 -3073 99 1435 589 -875 -662
219 -662 312 192 3822 3969 -2490 -1411 439 -1124 3263 3392 -3548 -2094 -1457 -3186 3247 3624 -3269
236 -3269 -1950 -2312 -2376 5723 4096 -3233 -863 -654 -755 4915 2819 -1429 390 -509 -1217 2119 3146
253 3146 149 -1800 -3097 -2681 443 1622 -1494 -5104 -3306 -2493 -2690 -802 -1993 -3631 -2141 -3825
$$ packed form
143i940j0399O919K0949j1556r985M010r296J0295J4901j5297j399O303q850R665
157c680O435j0667Q683M1j3309J1715O346q651O327j59q577O289L795l269J993
172C312K064q9l661j215Q218P64k522J966o572j065J1037q28l480m82p557K319
188B209N254m740K787l025j1466N983L614p305N107k662j1562P238L835n736N282
203e187j849o258N944J435k019N014q42k098L548m57l04L172J336q46j464K13
219f62R74j20L630J47o459J079J850j563M387J29o940J454O37j729O433L77o893
236c269J319l62o4Q099j627p329K370K09j01N670k096m248J819q99p08L336J027
253C146k997j949j297M16L124J179l116l610J798Q13j97J888j191j638J490j684
$$ plain form
269 -3825 -4716 497 790 -3079 -2548 -3745 -2799 3272 1163 -3712 -1260 -1707 -2001 1327 -318 -1969 332
286 332 -2123 -3669 540 1263 -356 -1609 -3419 -1934 2101 1448 -1629 -1593 -753 447 551 18 -285
303 -285 538 613 -1565 -1793 1110 260 -1589 -1455 -2228 -1210 336 -2328 -3613 -902 -1360 -2696 -2328 -3259
321 -3259 -1780 746 -1728 -3179 -824 -263 -460 202 -625 222 1280 -574 -780 1372 1771 421 -1038
338 -1038 -1918 -346 1640 384 -1798 -2027 -1375 -1075 -1158 -1319 -1443 -1547 -2525 -3201 -1330 903 -164 -2177
356 -2177 -2982 -1996 539 1443 -691 -1906 -1058 -1080 -31 629 -391 -221 -1508 -2893 -1364 995 699
373 699 -1499 -3880 -3439 -926 282 -485 -1767 -2614 -2053 -1011 -398 -27 219 -1432 -2165 -1538 946 1940
391 1940 206 -2245 -2221 -767 923 1229 -312 -1248 -913 -974 -71 672 500 71 -1469 -1672 206 1885
$$ packed form
269c825q91N213K93l869N31j197R46O071k109m875K452m47k94L328j645j651K301
286C32k455j546M209P23j619j253j810J485M035o53l077L6Q40J200J04n33l03
303b85Q23P5k178k28K903q50j849J34p73J018J546k664j285K711m58j336L68r31
321c259J479K526k474j451K355N61j97O62q27Q47J058j854k06K152L99j350j459
338a038q80J572J986j256k182k29O52L00q3j61j24j04r78o76J871K233j067k013
356b177q05R86K535R04k134j215Q48k2J049O60j020J70j287j385J529K359k96
373F99k198k381M41K513J208p67j282q47N61J042O13L71K46j651p33O27K484R94
391A940j734k451K4J454J690L06j541r36L35o1R03P43j72m29j540k03J878J679
$$ plain form
409 1885 1250 -116 -1872 -1207 733 938 413 -271 -1140 -1275 -1038 -534 291 -223 -2402 -2474 -2156 -848 -224
428 -224 -1450 -3032 -2943 -1761 -1196 -644 -1307 -1840 -1655 -1829 -929 -239 -967 -385 -1023 -1578 -267 902 403
447 403 -363 223 -571 871 561 -33 136 -584 206 -398 -834 159 -111 -1022 -1232 -1176 -1105 -406 -394 -835 -999
468 -999 -1584 -1125 -315 -35 -87 -398 -1196 -553 439 317 662 9 -608 -115 318 419 564 -556 -764 -350
488 -350 -481 -604 -108 -904 -1335 -605 -1123 -743 -278 -184 -593 -979 -915 -589 -306 -563 -496 -1461 -1225 -627 -640 -455
510 -455 -316 -1530 -1948 -1228 -725 -366 -723 -1664 -1637 -850 -57 692 -364 -758 138 143 1033 1666 917 666 681
531 681 543 1726 1555 781 701 -341 -293 235 249 -933 -890 -1057 -1277 -882 -1196 -1108 -1000 -1094 -707 -782 -971 21
553 21 -204 -610 -193 -3 -104 219 357 -182 -217 -104 -281 -412 -312 40 -858 -1498 -735 -294 -546 -610 -889
$$ packed form
409A885o35j366j756O65J940K05n25o84q69j35K37N04Q25n14k179p2L18J308O24
428b24j226j582Q9J182N65N52o63n33J85j74R00O90p28N82o38n55J311J169m99
447D03p66N86p94J442l10n94J69p20P90o04m36R93k70r11k10N6P1O99J2m41j64
468i99n85M59Q10K80n2l11p98O43R92j22L45o53o17M93M33J01J45j120k08M14
488c50j31j23M96p96m31P30n18L80M65R4m09l86O4L26K83k57O7r65K36N98j3J85
510d55J39j214m18P20N03L59l57r41K7P87P93P49j056l94Q96NQ90O33p49k51J5
531F81j38J183j71p74q0j042M8N28J4j182M3j67k20L95l14Q8J08r4L87p5j89R92
553B1k25m06M17J90j01L23J38n39l5J13j77j31J00L52q98o40P63M41k52o4k79
$$ plain form
574 -889 -1066 -453 -254 -540 -306 -875 -394 177 -769 -97 374 4 -81 133 -33 142 179 -115 171 -71 15
595 15 -66 -389 187 534 -328 -787 -157 235 216 716 -17 -565 22 540 688 416 120 -115 -46 232 904 224
617 224 -298 -350 -675 -223 543 -200 -754 -1161 -906 -544 -319 -756 -806 -906 -1540 -665 -489 -596 -133 -863 -849
638 -849 -341 -357 239 -187 -229 30 327 18 570 445 449 171 -74 105 512 850 259 -148 -410 152 366 95
660 95 111 -402 -730 -23 154 168 -38 -318 -462 -39 227 142 52 -383 -474 329 143 622 86 -161 4 166
682 166 -158 165 -33 -160 -218 -408 -247 -14 -348 -216 -437 -415 -404 -48 -184 -302 -280 -234 -91 -180 3 14 -103
705 -103 -501 -155 -103 164 -106 182 -173 150 68 -247 169 -74 -58 30 -75 -25 89 -26 -261 -75 78 127
727 127 122 -3 160 16 -32 173 159 71 -24 49 -177 -87 -62 20 56 -301 -242 -156 140 -28 -120 50 -225 -112 -44
$$ packed form
574h89j77O13J99k86K34n69M81N71r46O72M71l70q5K14j66J75L7k94K86k42Q6
595A5q1l23N76L47q62m59O30L92j9N00p33n48N87N18J48k72k96k35O9K78O72o80
617B24n22n2l25M52P66p43n54m07K55L62K25m37n0j00o34Q75J76j07M63p30J4
638h49N08j6N96m26m2K59K97l09N52j25Mk78k45J79M07L38n91m07k62N62K14k71
660I5J6n13l28P07J77J4k06k80j44M23K66q5r0m35r1Q03j86M79n36k47J65J62
682A66l24L23j98j27n8j90J61K33l34J32k21K2J1L56j36j18K2M6J43q9J83J1j17
705a03l98L46N2K67k70K88l55L23q2l15M16k43J6Q8j05N0J14j15k35J86J53M9
727A27nj25J63j44m8K05j4q8r5P3k26R0K5Q2L6l57N9Q6K96j68r2J70k75J13O8
$$ plain form
752 -44 219 -181 -222 56 -315 -126 -74 133 -133 -128 27 106 49 -25 357 334 -90 -93 13 208 227 -167 63 16 32
777 32 -37 0 86 -165 143 -97 61 306 -182 16 -130 -184 205 110 0 85 -257 -158 -48 -74 -22 -163 -122 -121 -40
802 -40 125 86 -40 3 -18 74 -60 12 39 111 -136 -171 242 46 59 207 28 -248 23 -74 -83 30 155 54 -3
827 -3 142 -44 43 -156 -122 21 96 -39 230 -32 52 -13 -201 -75 93 -112 -39 13 -95 -57 -44 3 -83 -36 -159
852 -159 -32 -225 129 -54 57 124 -17 -277 -46 50 -38 177 -21 -63 118 96 41 -80 -111 6 -108 -21 -117
875 -117 -131 -110 77 -127 78 77 104 -266 -84 -247 22 -8 168 139 17 -123 -17 42 5 198 20 -160 -41
898 -41 -62 -37 38 125 117 -32 37 -156 119 -68 -118 54 42 -196 28 -189 -149 -88 -177 -96 22 -238 -230 -155 201 -298
924 -298 -74 -261 96 -198 -402 -144 -89 -204 -102 -125 -97 -48 -143 -226 18 -32 -288 -228 -250 43 -168 -36 -30 -112
$$ packed form
752d4K63m00m1K78l71J89N2K07k66NJ55P9n7p4L82k3m24lJ06J95J9l94K30m7J6
777C2o9L7Q6k51L08k40J58K45m88J98j46n4L89r5j10Q5l42R9J10k6N2j41M1JQ1
802d0J65l9j26M3k1R2j34P2K7P2k47l5M13j96J3J48j79k76K71r7rJ13J25j01n7
827cJ45j86Q7j99L4J43P5j35K69k62Q4o5j88J26J68k05P3N2j08L8J3M7q6M7j23
852a59J27j93L54j83J11O7j41k60K31R6q8K15j98m2J81k2n5j21l1J17j14Q7r6
875a17j4K1J87k04K05jK7l70J82j63K69l0J76k9j22j40J06N9l7J93j78j80J19
898d1k1K5P5Q7qj49O9j93K75j87n0J72j2k38K24k17M0O1q9Q1J18k60QP5L56m99
924b98K24j87L57k94k04K58N5j15J02k3K8M9r5q3K44n0k56O0k2K93k11J32Oq2
$$ plain form
948 -112 -192 -52 23 -31 -86 88 -65 73 78 18 52 -202 -164 -25 -138 148 190 -76 -148 -284 126 303 244 -34
972 -34 -182 -60 118 142 99 379 212 -152 109 122 64 131 -68 21 -206 -98 128 -39 -285 -601 -357 -383 -624
995 -624 -169 -490 -555 -199 -366 -154 -186 -314 -218 -129 -192 -120 -258 -55 -58 28 -142 2 156 19 136 71 14 186
1019 186 143 41 -105 57 -153 -170 -33 151 -70 -145 122 18 172 205 -25 -74 -78 52 122 30 20 -116 75
1042 75 -44 -167 119 -191 -216 -332 -190 -300 -66 -289 -387 -319 -428 -7 -102 -343 -492 -397 -136 -195 -367 254
1064 254 -108 -108 -194 -225 64 -276 -185 -351 -461 -32 -367 -118 -94 -212 -264 -127 -135 214 115 187 -93 -245 265 187
1088 187 210 552 108 -102 49 127 291 402 48 -107 84 65 -121 42 -184 -123 -99 42 52 -22 -316 -148
1110 -148 -529 -392 -107 -291 -314 -397 -472 -392 -182 -73 -137 35 -247 76 135 40 -153 36 -176 -91 -107 -125 98
$$ packed form
948a12q0J40P5n4n5J74j53J38No0L4k54L8J39j13K86M2k66p2j36M10J77n9k78
972c4j48J22J78K4m3K80j67l64K61J3n8O7j99Q9k27J08K26j67k46l16K44k6k41
995f24M55l21o5L56j67K12l2j28R6Q9o3P2j38K03lQ6j70J44J54j37J17o5n7J72
1019A86m3j02j46J62k10j7J37J84k21p5K67j04J54L3k30m9mJ30P0r2j0j36J91
1042G5j19j23K86l10k5j16J42j10K34k23r8O8j09M21r5k41j49R5K61n9j72O21
1064B54l62%q6l1K89l40R1j66j10M29l35K49K4j18n2J37qL49r9P2k80j52N10p8
1088A87K3L42m44k10J51P8J64J11l54j55J91j9j86J63k26O1K4J41J0p4k94J68
1110a48l81J37K85j84k3q3p5Q0K10J09o4J72k82L23N9r5j93J89k12Q5j6j8K23
$$ plain form
1133 98 -218 -259 223 34 94 109 61 144 -227 -234 85 135 -251 -37 -173 62 60 66 35 -50 224 348 323 163 222 137
1159 137 -64 -139 -104 7 235 -144 -454 -141 -77 -102 -158 -199 -228 -188 -311 31 -90 -163 -115 -264 -90 103 -217
1182 -217 -70 100 -89 24 -62 -117 -332 -341 -313 -270 -176 56 -236 -2 -159 -226 -269 -355 99 -234 -141 59 -99 -92
1206 -92 433 50 68 172 311 138 55 155 157 114 -186 -3 -61 -10 -60 -1 -317 -306 -214 -382 -52 -296 -154 -90
1230 -90 -95 3 -23 -174 -209 -82 -270 -22 236 32 126 -102 -54 33 47 -21 -8 -212 -203 -59 72 189 -33 -231 -146
1255 -146 -78 -326 19 -188 106 99 -23 235 125 -71 -6 -47 -196 56 -20 -19 33 15 -258 -76 -127 -33 -74 146
1279 146 38 179 -44 70 -228 -95 -223 49 32 247 -86 111 -23 175 136 59 268 -174 140 -239 -21
1300 -21 -71 -250 -155 -102 -251 63 -368 42 -76 -117 -280 -76 109 25 100 68 -158 123 103 140 166 -25 -141 57
$$ packed form
1133I8l16m1M82j89O0J5m8Q3l71pL19N0l86K14j36K35kOl1q5K74J24k5j60N9q5
1159A37k01p5L5J11K28l79l10L13O4k5n6m1k9M0j23L42j21p3M8j49J74J93l20
1182b17J47J70j89J13q6n5k15rK8M3R4K32k92K34j57o7m3q6M54l33R3K00j58P
1206i2N25l83J8J04J39j73q3J00Km3l00J83n8N1n0N9l16J1R2j68L30k44J42O4
1230i0nR8k6j51l5J27j88K48K58k04R4k28M8Q7J4o8J3k04RJ44J31J17k22j98Q5
1255a46O8k48L45k07K94pj22K58j10j96O5m1j49K52p6JN2j8k73J82n1R4m1K20
1279A46j08J41k23J14k98J33j28K72j7K15l33J97j34J98l9p7K09m42L14l79K18
1300b1n0j79R5N3j49L14m31M10j18m1j63K04J85q4P5l2k26K81k0L7K6j91j16J98
$$ plain form
1324 57 68 172 226 60 42 -151 -270 116 -68 -36 -57 14 -24 -12 -14 -12 -33 -160 -28 -91 -67 -41 -49 25 8 -6 85 4
1352 4 87 -149 -163 111 112 -7 -114 -287 -381 -42 44 -34 -170 -185 -450 -130 -65 163 128 -249 -391 -12 -5 176 3
1377 3 69 -166 48 148 52 122 303 -121 211 -152 159 73 61 9 314 120 5 38 -208 -74 -58 185 -82
1400 -82 35 -230 -311 -131 -412 30 148 61 182 -49 -10 252 156 -212 186 -126 -173 236 -203 -85 -40 -122 -20
1423 -20 -167 -103 218 -13 -57 112 -21 108 47 116 -86 -170 -5 93 -182 -68 -102 6 204 115 152 -138 216
1446 216 120 212 84 52 147 115 201 425 -98 172 191 120 91 -7 45 -305 -64 21 82 -153 -238 -41 -139 -36 -95
1471 -95 24 44 107 16 -55 112 -48 160 -123 -128 111 -173 -261 -70 105 210 22 -133 -83 8 -99 -37 -151 97
1495 97 14 15 100 54 -240 11 66 -85 -45 44 326 297 37 96 -170 38 76 100 71 -155 40 12 -190 -68 186
$$ packed form
1324E7J1J04N4j66j8j93j19L86j84L2k1P1l8J2kKk1j27J32o3K4K6qP4j7j4R1q1
1352DQ3k36j4K74Jj19j07j73r4L39Q6p8j36j5k65L20O5K28l5l77j42L79PJ81j73
1377CO6k35K14J00r6P0J81m24L32l63L11q6j2n2L05j94j15L3k46J34J6K43k67
1400h2J17k65q1J80k81M42J18q7J21k31L9K62r6l68L98l12m7M09m39J18M5q2J02
1423b0j47O4L21k31m4J69j33J29o1O9k02q4J65R8k75J14l4J08J98q9L7k90L54
1446B16r6R2j28l2R5l2Q6K24n23K70J9p1k9r8N2l50K41Q5O1k35q5J97r8J03n9
1471i5J19K0O3r1p1J67j60K08k83nK39k84q8J91J75J05j88j55N0R1j07O2j14K48
1495I7q3JQ5m6k94K51N5j51M0Q9K82k9k60N9k66K08L8K4k9k26J95k8k02J22K54
$$ plain form
1520 186 -1 132 -60 90 236 219 192 157 -9 -48 -194 70 250 5 -60 -6 182 138 -15 99 150 131 -56
1543 -56 -42 -122 -145 57 -258 -250 -144 -8 78 -72 -198 -18 89 -62 -83 134 17 121 -58 43 81 271 183
1566 183 111 17 36 -154 -265 78 -69 11 85 -86 216 -125 -34 -113 128 81 -121 171 79 89 -88 3 -85 -21
1590 -21 109 -219 -289 104 38 79 131 -75 -311 -99 168 -179 -112 -51 -36 -32 -67 -33 -13 -58 -260 -135 181 34 -19
1615 -19 340 125 46 -78 18 -64 -40 111 -5 -253 45 -134 180 74 -162 102 92 -131 -140 54 -167 -108 93
1638 93 119 -247 -267 163 193 250 22 -18 126 -36 -43 -45 -183 -359 -46 210 46 7 -84 -262 -89 -53 295 -125
1662 -125 -137 99 24 -116 -29 1 18 -110 215 137 149 143 -155 216 6 -10 -135 283 -38 -165 -90 -55 2 71 99
1687 99 -166 282 121 57 -175 -164 219 88 310 23 -32 -4 86 23 44 217 128 -79 -27 142 -3 86 -332 -233
$$ packed form
1520A86j87J33j92J50J46j7k7l5j66l9j46K64J80k45o5N4J88m4j53J14N1j9j87
1543e6J4q0k3K02l15QJ06J36Q6j50j26J80J07j51k1K17j17J04j79J01L8J90q8
1566A83p2r4J9j90j11L43j47Q0P4j71L02l41R1p9K41m7k02K92r2J0j77R1q8O4
1590b1J30l28p0L93o6M1N2k06k36K12K67l47O7O1J5Ml5L4K0m5k02J25L16j47n3
1615a9L59k15p9j24R6q2K4J51j16k48K98j79L14j06k36K64j0k23rJ94k21N9K01
1638I3K6l66k0M30L0N7k28m0J44j62pkj38j76L13K56j64l9r1j78J73L6L48m20
1662a25j2K36p5j40Q7L0J7j28L25p8J2ok98L71k10j6j25M18l21j27P5L5N7O9K8
1687I9k65M48j61o4k32J1L83j31K22k87n5K8R0o3K1J73q9k07N2J69j45Q9m18R9
$$ plain form
1711 -233 87 130 116 -18 -66 109 192 319 -50 -101 74 -14 -156 19 271 6 150 -178 -179 275 -243 24 176
1734 176 -65 184 32 51 -81 273 80 -158 214 -44 -127 24 136 3 -340 -5 -253 137 37 -17 37
1755 37 -22 191 53 -148 -273 126 12 168 -167 -205 -44 23 30 6 -50 -23 -177 -55 26 -121 20 110 -86 -141
1779 -141 11 0 127 42 97 159 4 -3 -244 187 0 241 17 2 299 149 -128 -59 112 -8 98 -45 93
1802 93 -298 -53 -55 -27 -374 -356 12 -139 -3 -198 9 -140 -34 107 -44 5 -131 69 -327 -69 -84 -200
1824 -200 122 -153 -215 43 229 -57 140 -149 -142 2 177 -80 -180 -176 -91 -369 -124 -1 -68 -60 -91 -45 162 -94
1848 -94 -3 -78 -472 -181 110 -254 -288 271 111 -122 67 625 -171 285 -309 557 -155 -625 -430 100 -7
1869 -7 16 -188 -73 -274 -152 -386 -112 66 -14 25 -63 124 -94 -149 1 -209 76 -107 -144 -68 305 98 -301
$$ packed form
1711b33L20M3j4j34m8J75Q3J27l69n1J75q8j42J75K52k65J44l28jM54n18K67J52
1734A76k41K49j52J9j32L54j93k38L72k58q3J51J12j33l43L35k48L90j00n4N4
1755C7n9K13j38k01j25L99j14J56l35l8J61O7Pk4n6K7j54J22Q1j47J41R0j96n5
1779a41J52j1J27q5N5O2j55pk41M31j87K41k24j5K97j50k77O9J71j20J06j43J38
1802I3l91K45kK8l47J8L68j51J36j95K07j49J06J41j51M9j36K00l96K58j5j16
1824b00L22k75o2K58J86k86J97k89PJ44J75k57j00MQ5k78K45J23o7Ql1M6K07k56
1848i4R1p5l94K91K91l64l4N59j60k33J89N58p96M56n94Q66p12m70J95N30j07
1869gK3k04J15k01J22k34K74J78q0L9q8J87k18n5J50k10K85j83l7P6L73k07l99
$$ plain form
1892 -301 84 156 82 7 53 123 112 -142 -105 -37 140 25 247 175 -206 -108 -152 -186 188 -17 1 -381 -151 -7
1916 -7 -124 -78 -162 15 -249 -138 118 -317 25 -36 -188 30 -23 45 -335 -120 5 20 -178 -109 -91 13 -129
1939 -129 -192 241 -89 -131 37 13 -114 -222 34 -107 -126 33 15 115 51 -99 243 -131 -79 -167 -23 81 -144
1962 -144 -47 -41 13 96 -63 0 -122 -36 -294 -89 -97 -131 -168 -185 -120 -34 -43 -29 -95 -253 -80 -154 92 145 -56 -93 17
1989 17 17 -132 237 25 65 -174 10 -93 -174 -77 -38 157 -242 -120 97 121 -117 46 22 -201 -242 229 -12
2012 -12 2 -139 -194 87 -259 -37 54 -162 20 -216 -120 -77 -108 -58 -45 120 -58 -41 32 48 -286 -260 -33 45 81
2037 81 64 69 -183 -157 -95 -76 -136 -77 37 -35 207 -154 107 24 137 12 84 -111 277 172 19 -62 -61 40 -276
2062 -276 113 184 129 -37 -56 -97 73 43 -24 -254 287 72 -132 80 0 -15 -38 67 61 -2 35 -201 49 99 -12
$$ packed form
1892c01L85P2p4p5M6P0j1k54L7O8J77j15K22p2l81R8m4l4L74k05J8l82K30J44
1916gj17M6q4J77k64J11K56m35L42o1j52K18n3O8l80K15J25J5j98O9J8J04j42
1939a29o3M33l30m2J68k4j27j08K56j41j9J59j8J00o4j50L42l74N2q8J44J04k25
1962a44R7ON4Q3j59O3j22Q6k58K05ql4l7j7O5Q6rJ4o6j58J73p4K46N3k01l7J10
1989A7%j49L69k12M0k39J84j03q1R7L9J95l99J22K17K4k38J63k4k23m1M71k41
2012a2J4j41n5K81l46K22R1k16J82k36R6M3l1N0J3J65j78J7P3J6l34K6K27P8L6
2037H1j7Nk52K6O2J9o0N9J14p2K42l61K61q3J13j25P2j95L88j05j53q1JJ01l16
2062b76L89P1n5j66j9m1J70l0o7k30N41k15k04K12q0j5k3J05oo3L7k36K50N0j11
$$ plain form
2087 -12 -158 25 -111 -124 159 -153 -145 39 -141 138 -185 -215 -136 -110 -114 -97 76 47 -6 -163 -224 -65 10 30 93
2112 93 29 156 -97 -130 142 12 100 124 202 -174 -103 -111 -146 -182 -218 -71 43 -130 -56 -33 126 70 216 -101 -29
2137 -29 -101 98 69 15 50 295 21 99 -77 -100 118 42 212 93 21 62 -10 127 199 -69 105 -59 128 198
2161 198 70 -93 -309 -163 173 -81 199 174 73 151 -74 -90 458 95 -64 68 -73 86 -165 -132 164
2182 164 -126 -226 -261 -14 -155 -173 155 -54 -27 218 61 42 17 3 -104 -179 -24 -148 106 154 74 296 300 4
2206 4 -84 169 -68 -38 -33 44 -257 4 -52 -92 -43 162 21 -93 154 -122 102 92 -28 -14 -190 34 -20 -80 63
2231 63 24 -62 224 80 119 228 -230 22 -194 92 123 74 -155 -1 144 -21 62 120 20 -107 72 -215 -189
2254 -189 30 91 133 55 -42 -173 48 29 150 -100 136 -12 -32 33 209 128 -76 -175 -190 256 41 18 46 26
$$ packed form
2087a2j46J83j36j3K83l12QJ84j80K79l23l0P9K6mJ7J73k9n3j57o1J59P5K0O3
2112I3o4J27k53l3K72j30Q8K4P8l76P1ql5l6l6J47J14j73P4K3J59n6J46l17P2
2137b9p2J99k9n4L5K45k74P8j76k3K18p6J70j19p2M1p2J37P2k68J74j64J87P0
2161A98j28j63k16J46L36k54K80k5j01P8k25j6N48l63j59J32j41J59k51L3K96
2182A64k90j00l5K47j41j8L28k09K7K45j57j9k5j4j07p5J55j24K54M8q0K22Mk96
2206Dq8K53k37L0NP7l01K61n6m0M9K05j41j14K47k76K24j0j20J4j76K24n4o0J43
2231F3l9q6K86j44L9J09m58K52k16K86L1m9k29J54J45j65Q3N8j00j27J79k87K6
2254a89K19O1M2p8r7j31K21j9J21k50K36j48k0O5J76q1k04r9j5M46k15k3K8k0
$$ plain form
2278 26 -92 108 38 -31 215 17 190 -190 66 -100 -22 55 103 -97 -224 241 -44 6 131 48 25 89 1 -14
2302 -14 108 252 -10 137 39 -87 -55 -62 140 108 111 -98 -51 -110 123 71 227 -131 35 10 -19 92 170 152 -116
2327 -116 -114 116 70 -105 198 128 -85 87 188 -22 170 -118 -14 -66 6 -44 -55 60 -180 -200 204 28 -13
2350 -13 -56 31 99 -108 -9 119 -6 249 99 -2 80 34 162 29 242 -28 5 7 189 -141 53 47 134 201 3
2375 3 -34 217 146 144 -105 147 26 -22 -159 73 273 -188 157 -212 157 -141 129 22 -2 50 -6 -130 99
2398 99 -27 103 -85 128 -399 -169 90 -109 170 79 -27 320 -7 183 -245 -134 8 62 36 -89 178
2419 178 29 0 -141 -258 178 133 -47 91 192 165 38 -157 -73 286 191 123 304 168 -19 -115 130 -25
2441 -25 449 -136 19 -130 -23 -104 177 286 -1 65 171 115 169 103 -19 4 -128 -38 98 8 -35 -100 -257 -120
$$ packed form
2278B6j18K00p0o9K46j98J73l80K56j66P8P7M8k00j27M65k85N0J25q3k3O4q8j5
2302a4J22J44k62J47r8j26L2pK02l2Lk09M7n9K33n2J56l58J66k5k9J11P8j8k68
2327a16KK30m6j75L03p0k13J72J01k10J92k88J04n2P2n0j1J15k40k0M04j76m1
2350a3m3Q7O8k07R9J28j25K55j50j01Q2m6J28j33K13k70L3KJ82l30J94oQ7O7j98
2375Cl7K51p1kk49K52j21m8j37K32K00m61L45l69L69k98K70j07k4N2n6j24K29
2398I9j26J30j88K13n27K30K59j99K79r1j06L47l27J90m28J11J42N4k6j25K67
2419A78j49k9j41j17M36m5j80J38J01k7j27j95Q4L59r5o8J81j36j87r6K45j55
2441b5M74n85J55j49J07q1K81J09k87O6J06n6N4o6j22K3j32R0J36r0m3o5j57J37
$$ plain form
2465 -120 -108 -6 -43 -70 388 274 0 -8 -6 130 25 -133 85 221 145 -66 195 -109 37 116 215 -100 290
2488 290 217 103 107 129 119 -43 192 78 69 -2 -73 -261 -12 -50 -112 -227 82 305 254 -218 224 -130 212 -74
2512 -74 28 35 271 -117 68 110 -239 44 -69 43 84 93 -68 -24 -90 3 57 -144 78 -126 59 67 -18 -160 -166
2537 -166 -51 -18 150 156 -22 149 -17 86 -52 -56 -71 52 375 58 12 131 252 -127 146 -111 -145 181 40
2560 40 210 145 -53 168 65 107 118 267 268 32 -153 -68 239 89 -296 -255 -29 -42 89 -274 71 -25 46 58
2584 58 -28 -106 -152 -7 167 -108 -114 -48 -23 428 -38 29 62 58 74 12 -192 295 59 -249 -67 -54 28 -192 -289 93
2610 93 -36 -94 -105 -225 31 118 63 -262 33 324 82 335 -128 111 20 12 -140 80 6 213 248 48 117 14
2634 14 71 80 -70 262 167 -97 246 -71 103 -24 -285 -89 -18 71 123 120 -20 -34 290 99 59 93 -217 115
$$ packed form
2465a20J2J02l7k7M58j14k74qKJ36j05j58K18J36p6k11K61l04J46P9R9l15L90
2488B90p3j14MK2j0j62K35j14rp1p1j88K49l8o2j15L09K23n1m72M42l54L42k86
2512g4J02PK36l88J85M2l49K83j13J12M1Rj61M4o6R3N4k01K22k04J85Qq5j42o
2537a66J15L3J68Oj78J71j66J03j38mj5J23L23l17m6J19J21l79K73k57l4L26j41
2560D0J70o5j98K21j03M2J1J49Jk36j85Q5L07j50l85M1K26j3J31l63L45r6P1J2
2584E8q6p8m6J45J74k75oO6K5M51m66O7L3mJ6o2k04M87k36l08J82J3Q2k20r7L82
2610I3j29n8j1j20K56Q7n5l25K95K91k42K53m63K39r1qj52K20p4K07L5k00O9j03
2634A4N7Rj50L32r5k64L43l17J74j27k61J96P1Q9N2lj40j4L24j91m0L4l10L32
$$ plain form
2658 115 -173 -4 -226 74 150 31 64 -180 -127 234 83 -27 259 26 180 -25 -14 181 102 -6 87 -93
2680 -93 140 81 7 -174 98 -187 -132 152 147 12 5 119 59 41 -153 247 156 6 121 -102 -96 254 121 -220
2704 -220 -49 136 12 90 125 12 -211 -50 -5 -42 -274 -112 142 174 0 -55 40 45 156 104 -8 222 31
2727 31 117 -77 68 20 220 -87 -123 -2 -30 -39 -161 135 107 -262 -64 127 86 -151 44 -3 290 -30 68 -215
2751 -215 8 28 -279 139 -48 121 -170 20 136 103 14 -12 -116 -230 34 -57 -143 146 43 -243 153 -25
2773 -25 -70 26 38 -168 -229 -142 -226 130 -184 47 -20 28 -45 -158 86 -180 112 -86 55 -57 118 -233 -18
2796 -18 -64 41 -130 50 85 -294 206 145 -6 15 130 -137 52 131 136 -61 -142 -44 -172 -49 293 -6 70 114
2820 114 -40 230 1 -6 -2 125 -46 -93 4 171 210 -90 -250 137 -163 -29 283 3 109 131 -70 -354 -179
$$ packed form
2658A15k88J69k22L00P6j19L3k44N3L61j51j10K86k33J54k05J1J95p9j08R3j80
2680i3K33n9p4j81K72k85N5K84nj35pJ14o0j8j94M00r1j50J15k23OL50j33l41
2704b20J71J85j24P8L5j13k23J61M5l7k32J62K54L2j74n5R5NJ11n2j12K30j91
2727C1Q6j94J45m8K00l07l6J21k8rj22K96k8l69J98J91m1k37J95m7K93l20R8k83
2751b15K23K0l07M18j87J69k91J90J16l3q9k6j04j14K64r1q6K89j03k86L96j78
2773b5m5R6J2k06o1Q7q4L56l14K31o7M8p3j13K44k66K92j98J41j12J75l51K15
2796a8m6J05j71J80L5l79N00o1j51K1J15k67J89P9Nj97q1R8j28J23L42k99P6M4
2820A14j54K70k29pMJ27j71m7R7J67L9l00j60L87l00J34L12k80J06K2k01k84J75
$$ plain form
2843 -179 10 -143 48 83 10 175 97 -124 -17 125 -35 264 46 32 -162 -137 60 130 -21 -4 11 43 5
2866 5 -87 -44 108 64 -39 96 17 175 -204 11 272 296 115 -122 -75 -300 28 -93 -20 135 -118 43 -10
2889 -10 -95 187 -2 -39 -5 -26 -39 119 -103 -47 -82 156 312 176 146 215 140 -214 -143 -52 -56 -134 -97 -40 -133 -204 -193
2916 -193 50 128 -208 260 98 4 7 38 -141 99 237 70 -25 -26 13 36 113 -22 -145 -187 177 50 19 25 -43
2941 -43 170 153 -203 7 -80 93 -151 184 269 66 -18 -165 -299 -164 -73 65 179 61 -12 -172 -151 -136 -243
2964 -243 -21 10 -40 -193 228 32 85 340 -50 -3 119 97 27 -59 -82 -89 16 79 202 -67 -125 141 -131 116
2988 116 -51 -266 9 289 150 -1 8 -295 -45 183 15 186 -89 -109 42 18 -109 114 210 212 63 45 66
3011 66 -134 -76 -195 41 -123 115 174 -40 169 175 -146 223 144 -9 -11 57 167 -86 186 43 144 49 39 -27
$$ packed form
2843a79J89j53J91L5p3J65p8k21J07J42j60K99k18j4j94K5J97P0j51J7J5L2l8
2866Er2M3J52m4j03J35p9J58l79K15K61K4j81k37M7k25L28j21P3J55k53J61n3
2889a0q5K82j89l7L4k1j3J58k22N6l5K38J56j36l0O9p5l54P1R1mp8L7N7r3p1J1
2916a93K43P8l36M68j62r4LL1j79K40J38j67r5jL9K3P7j35j23m2L64j27l1Oo8
2941d3K13j7l56K10q7J73k44L35Q5k03q4j47j34J35R1J38J14j18p3j60K1J5j07
2964b43K22L1n0j53M21j96N3K55l90M7J22k2p0q6k3pJ05O3J23k69n8K66k72K47
2988A16j67k15K75K80j39j51Rl03K50K28j68J71k75k0J51k4j27K23R6Kj49j8K1
3011F6k00N8j19K36j64K38N9k14K09Ol21L69p9j53kO8J10k53K72j43J01r5j0o6
$$ plain form
3035 -27 -70 -50 174 158 157 -307 53 31 140 -44 52 -58 83 -69 -90 -178 159 156 70 -142 33 44 29 -172 208
3060 208 -108 119 -46 159 23 26 -73 10 22 33 156 57 245 -119 -215 -18 56 149 43 3 90 234 -169 -42
3084 -42 101 -72 47 15 94 117 46 -50 -14 -115 -45 -152 -130 34 -111 -41 -156 190 291 250 -3 5 -35 32 -149
3109 -149 2 66 -225 6 -84 -10 -205 -147 115 -36 13 -44 -221 222 9 -3 -64 -241 148 -156 -41 -111 48
3132 48 -70 21 -49 30 -133 78 -112 -80 80 -154 14 -81 -36 -257 -126 -169 -46 24 183 -15 -90 126 17
3155 17 3 -12 116 -91 54 68 -203 121 261 -83 -136 26 52 -108 216 151 50 -204 -26 -137 119 68 116
3178 116 115 102 -342 283 69 -167 173 -208 11 12 -106 118 17 -50 310 72 -276 -14 122 -167 -15 -119
3200 -119 -36 77 69 122 58 4 -251 102 -111 181 45 64 -67 65 338 -190 169 -32 112 54 -34 -34 -59 -78
$$ packed form
3035b7m3K0K24j6jm64L60k2J09j84R6j10J41j52k1q8L37lq6k12J75J1j5k01L80
3060B08l16K27j65K05j36Lr9Q3J2J1J23r9J88l64r6J97P4R3j06m0Q7J44m03J27
3084d2J43j73J19l2P9K3p1r6L6j01P0j07K2J64j45P0j15L46J01m1k53Qm0O7j81
3109a49J51O4k91K31r0P4j95N8K62j51M9n7j77M43k13j2o1j77L89l04J15p0J59
3132D8j18R1p0P9j63K11j90L2J60k34J68r5M5k21J31m3J23P0J59j98p5K16j09
3155A7j4j5J28k07J45J4k71L24J40l44n3J62K6j60L24o5j01k54J78j11K56n1M8
3178A16jj3m44O25k14k36L40l81K19Jj18K24j01o7L60k38l48K62J36k89J52j04
3200a19Q3J13qN3o4n4k55L53k13K92j36J9j31J32K73n28L59k01J44n8q8%k5j9
$$ plain form
3224 -78 -154 -176 126 4 385 -15 -174 -106 -55 -118 175 358 -89 -162 172 -12 -51 186 -114 189 252 -107 63
3247 63 3 57 73 188 -84 -1 -79 101 245 217 57 -220 19 72 -31 207 -64 -149 127 -44 99 18 -91
3270 -91 293 -172 -61 -78 -65 131 -118 143 18 85 -41 156 -149 12 177 43 97 -190 31 35 -120 214
3292 214 113 322 480 151 148 152 -96 -56 12 82 -37 -36 52 -332 95 -2 12 -45 171 56 -18 38 -303 -186 113
3317 113 -244 123 158 204 -47 -105 -3 64 39 123 -13 -38 49 -141 101 -126 54 1 75 308 137 106 -63 44
3341 44 5 -47 -192 -18 4 169 -79 -32 90 -21 -304 84 0 -39 -21 9 151 -80 11 -32 -127 269 -167 7
3365 7 -93 -199 77 -35 223 -55 -146 -157 -13 -11 146 17 -116 -126 143 44 -59 25 195 82 136 189 -49 141
3389 141 -24 -174 -39 -11 123 56 -121 -95 -186 13 50 61 165 63 -1 -72 -127 -262 -142 -161 119 23 -3 -106
$$ packed form
3224g8p6k2L02j22L81m00j59O8N1o3K93J83m47p3L34j84l9K37l00L03O3l59J70
3247F3o0N4J6J15k72Q3p8J80J44k8j60k77K39N3j03K38k71q5K76j71J43q1j09
3270i1L84m65J11j7J3J96k49K61j25O7j26J97l05J61J65j34N4k87K21Mj55L34
3292B14j01K09J58l29lMk48M0O8P0j19JQ8l84M27r7J4n7K16j15p4N6l41J17K99
3317A13l57L67L5M6k51n8J02O7k5Q4j36k5Q7j90K42k27J80n3P4K33j71l1j69J07
3341D4l9n2j45J74K2J65k48M7J22j11k83L88q4l9J8L0J42k31R1m3r5L96m36J74
3365Gj00j06K76j12K58k78r1j1J44KJ57j29j33j0K69r9j03Q4J70j13N4N3k38J90
3389A41j65j50J35K8J34o7j77K6r1J99L7J1J04j02o4p1n5j35J20j9K80r6k6j03
$$ plain form
3413 -106 -13 200 -97 32 40 2 125 135 73 267 58 -61 -278 82 92 31 -30 -30 -12 59 -169 -139 196 -62 -36
3438 -36 309 318 -50 -73 290 160 -254 176 -18 139 -69 2 35 -168 -134 -56 188 -136 -139 -19 -180 -178 -39 -84
3462 -84 -170 -89 44 89 -57 -275 105 -32 212 -142 85 -189 -84 2 8 311 89 -181 -32 93 19 -97 -111
3485 -111 66 -83 121 236 -258 -143 47 -205 137 59 113 -33 -54 103 162 -66 77 -215 -69 -308 -125
3506 -125 -82 -97 -18 168 -11 153 35 -125 170 -223 191 22 -113 -36 207 103 73 17 56 57 33 -3 335 -8
3530 -8 160 -195 -41 -61 -133 82 -40 -162 7 277 -70 -67 -12 109 257 32 -277 41 -199 90 -68 -147 -53
3553 -53 -126 38 -59 -227 212 -201 -221 -113 -14 77 -77 6 79 113 41 -138 1 6 -121 -221 179 -158 163 269
3577 269 -26 49 -151 10 72 -48 -17 -145 24 12 49 108 84 88 61 89 -17 -126 -132 155 351 -131 -71 -245 -98
$$ packed form
3413a06R3K13k97J29Ql8J23J0o2J94k09j19k17L60J0o1o1%J8P1k28L0L35k58K6
3438c6L45Rl68k3L63j30m14M30j94J57k08P1L3k03L4P8K44l24lJ20j61KJ39m5
3462h4q6Q1J33M5j46k18L80j37K44l54K27k74J05Q6OL03k22k70J49J25p4j16j4
3485a11J77j49K04J15m94J15J90k52L42p8N4j46k1J57N9k28J43k92J46k39J83
3506a25M3j5P9J86j79J64j18j60K95l93M14j69j35P7K43j04l0n6L9Jk4l6L38l43
3530hJ68l55J54k0p2K15j22j22J69K70l47LN5J21J48k25l09L18k40K89j58p9R4
3553e3p3J64r7j68M39m13k0J08R9R1j54Q3P3L4p2j79J39Nj27j00M00l37L21J06
3577B69k95P5k00J61O2j20L1j28J69j2L7N9k4Mk7K8j06j09oK87J96m82O0j74J47
$$ plain form
3602 -98 15 -120 60 -22 -27 -104 135 23 -50 298 139 -145 -155 -114 -73 240 111 93 147 124 123 140 -304 28 -24
3627 -24 -211 -9 -504 167 184 -29 -92 -100 -176 -61 101 -153 -118 140 -77 336 -70 -169 -75 56 108 -24 -27 46
3651 46 43 -173 -136 187 -308 -111 114 -90 -117 -57 189 -148 57 -127 155 83 -127 318 -42 194 43 34 2
3674 2 -75 1 78 97 69 106 -95 -296 178 -33 -52 -58 85 18 106 -22 -202 -165 114 -178 639 264 -420 22 -1192
3699 -1192 -130 478 -361 -101 521 396 94 -17 553 -222 131 3 831 -71 -579 -452 695 -810 505
3718 505 279 -584 -698 64 230 188 132 -228 -988 461 -304 627 -563 121 196 -645 528 -217 -95 -177
3738 -177 808 -489 42 78 -82 400 519 -245 179 176 941 179 -57 486 447 -46 668 37 12 38 184 556
3760 556 220 -129 295 -187 -329 -475 55 168 -199 -16 281 110 137 171 -156 99 90 -443 -486 184 722 657
$$ packed form
3602i8J13j35J80q2np7K39j12p3L48j59k84j0M1M1L13j29j8N4k3jJ7m44L32n2
3627b4j87K02m95O71J7k13o3qp6J15J62k54L5K58k17M13m06r9R4J31N2j32lP3
3651D6lk16L7L23m95J97K25k04k7O0K46l37K05j84K82p2k10M45l60K36j51rl2
3674Bp7P6P7J9k8L7k01k01M74k11j9oJ43o7Q8j28j80L7K79k92Q17l75o84M42j214
3699a192J062O08q39K60O22j25l02j11N70p75L53j28Q28r02n08J27J147j505J315
3718E05k26q63j14P62J66m2n6l60p60J449p65R31j190O84P5q41J173p45J22q2
3738a77R85j297N31L6j60M82J19p64M24lP65p62k36N43l9m93P14o31k5K6J46L72
3760E56l36l49M24m82j42j46N30J13l67J83K97j71K7L4l27K55rn33m3O70N38o5
$$ plain form
3782 657 128 91 343 265 129 -413 52 -2 -388 -52 137 605 -151 -413 395 -340 -129 -144 162 -187 520
3803 520 37 -189 220 216 -47 -65 238 -209 72 32 -104 -194 -158 24 237 -77 -12 -120 104 75 599 154 -46
3826 -46 32 -169 -155 -185 -6 -46 0 -234 -121 6 -143 576 231 -22 -2 -22 9 90 71 -143 -124 -37 -280 -170
3850 -170 -36 44 48 -276 134 202 37 -75 105 170 -131 61 58 148 -73 311 76 -52 -183 -121 -3 -137 131
3873 131 -141 -109 -124 -76 186 -172 142 -79 150 -75 -135 77 130 86 -87 276 25 -53 -136 -79 -73 -69 -96 -163 19
3898 19 -132 -142 -106 -17 -226 -61 180 228 46 99 135 -26 12 68 -115 170 170 -310 -96 253 9 101 -10 -9 58
3923 58 -68 -101 -53 -70 5 -215 -196 -4 165 -5 230 10 -137 -10 0 -29 51 13 -95 80 -140 174 -131
3946 -131 67 -59 -103 -311 -149 73 76 -248 -77 54 18 78 -238 -153 16 21 -56 166 -268 51 -148 53 -152
$$ packed form
3782F57n29l7K52p8j36n42M65n4l86L36J89M68p56k62Q08p35K11j5L06l49P07
3803E20m83k26M09mk63j8L03m47K81m0j36r0L6J82K13l14O5j08K24k9N24m45k00
3826d6P8k01J4l0J79m0M6k34J13J27j49P19l45k53K0k0L1Q1j9k14J9Q7k43J10
3850a70J34Q0Ml24M10O8j65j12J80O5l01J92lR0k21L84k35j28j31O2J18j34K68
3873A31k72L2j5M8K62l58L14k21K29k25o0K12N3m4j73L63k51p8q3N7OMk7o7J82
3898A9j51j0L6Q9k09J65K41M8j82N3L6j61L8N6j83K85%m80K14L49k44R2j11JO7
3923E8j26l3M8j7P5k20J9J92J69j70K35k20j47J27J0k9Q0l8j08J75k20L14l05
3946a31J98j26m4k08J62K22Ll24J71J31l6O0l16Q5J69Np7K22m34L19j99K01k05
$$ plain form
3969 -152 -104 -218 -83 42 63 112 -41 66 77 -60 1 -15 -54 -223 -69 -92 263 -15 50 234 -183 91 29
3992 29 242 16 146 -25 -68 -338 78 137 -43 -22 -44 -73 -126 62 178 119 -43 -210 -241 -177 156 -43 -178
4015 -178 61 -25 -160 155 95 45 -98 22 -129 54 -155 46 9 -150 2 -2 -83 -78 -50 46 65 38 -121 62
4039 62 -45 -48 25 96 185 141 83 -372 -162 -177 20 -74 -232 -50 -53 -90 -174 15 -14 -69 -27 -88 20 78 -93 33
4065 33 193 52 21 -313 390 -44 127 34 61 -80 -134 204 108 98 103 -107 -152 306 5 -194 167 14 -119
4088 -119 150 53 -22 -86 -221 19 17 -261 135 61 119 128 87 250 -178 -258 159 -151 243 7 -2 -48 -131 155 55
4113 55 274 -58 -45 -174 134 1 99 -44 -62 46 290 219 -15 167 32 36 -143 206 138 339 -15 -29 137
4136 137 -38 16 -259 12 -29 -258 -191 46 21 -224 -10 -61 -185 92 70 111 48 -202 -71 -5 -57 -22 -112 118
$$ packed form
3969a52M8j14J35J25K1M9j53J07J1j37O1j6l9j69J54k3L55k78O5J84m17K74o2
3992B9K13k26J30j71m3k70M16N9j80K1k2k9n3J88J16n9j62j67l1O4L33j99j35
4015a78K39q6j35L15o0n0j43J20j51J83k09K01l7j59J52mq1NK8R6J9k7j59J83
4039F2j07lP3P1Q9m4n8m55K10j5J97r4j58J82ll7q4J89k9n5M2o1J08N8j71J26
4065C3J60j41l1l34P03m34J71r3K7j41n4L38r6j0Nk10m5M58l01j99L61j53j33
4088a19K69r7p5o4j35K40kk78L96p4N8Rm1J63m28q0M17l10L94k36rm6q3K86j00
4113E5K19l32J3j29L08j33R8j43j8J08K44p1k34J82j35Mj79L49o8K01l54j4J66
4136A37j75N4k75K71m1k29O7K37k5k45K14n1j24K77k2M1o3k50J31O6n2L5r0K30
$$ plain form
4160 118 -9 127 158 -12 180 -145 -134 24 134 107 76 -119 77 -48 -162 107 119 -28 36 44 5 225 -174
4183 -174 -94 -180 167 -313 207 -18 13 101 -23 -78 -142 166 102 -24 -176 114 -23 -191 -50 -180 -44 -49 -187
4206 -187 -23 -132 66 -41 44 134 146 25 -68 86 -323 56 54 97 240 30 -24 35 27 35 107 77 -25 -87 127
4231 127 -38 -42 152 68 221 44 101 -222 16 -112 -28 42 -240 9 -13 78 165 -55 -11 38 108 -93 48 58
4255 58 23 191 -3 104 -37 72 -106 -109 186 -151 -141 -107 -94 11 86 -56 198 -102 86 141 4 -225 90
4278 90 -245 56 217 -142 322 -59 21 0 73 -56 141 79 94 27 -65 -89 -128 -152 -158 -138 236 -24 19 -10 5 9
4304 9 253 -40 72 26 27 9 75 90 -20 76 -55 37 -94 42 -249 -125 80 -2 230 259 -128 -167 14 -146
4328 -146 -53 32 4 -113 219 46 -113 -192 -89 27 -91 142 -75 119 144 244 -40 17 114 -132 -162 125 -119
$$ packed form
4160A18j27J36L1j70J92l25J1J58J10k7l1j95J96j25j14K69J2j47O4Ql9K20l99
4183a74Q0q6L47m80N20k25L1Q8j24n5o4L08o4j26j52K90j37j68J41j30J36nj38
4206a87J64j09J98j07Q5R0J2j21r3J54m09L79kM3J43k10n4N9qQP2l0j02o2K14
4231A27j65mJ94q4J53j77N7l23K38j28Q4P0k82K49k2R1Q7k20M4M9P0k01J41J0
4255E8l5J68j94J07j41J09j78lK95l37J0L4J3J05P5j42K54l00J88N5j37k29L15
4278I0l35L01J61l59M64l81Q0k1P3j29J97o2J5o7r2k4l9k4oK0L74k60M3k9J5M
4304IK44k93J12m6Jj8O6J5j10R6j31R2j31J36k91J24K05q2K32K9l87l9J81j60
4328a46R3Q5k8j17L32j73j59p9J03J16j18K33k17J94K5J00k84N7R7k46l0K87k44
$$ plain form
4351 -119 42 -9 116 -37 30 100 -193 -63 -15 317 57 153 -95 -229 -66 -66 56 125 -139 -156 -100 -111 -184 -48
4375 -48 -169 -177 -111 -138 108 -75 -74 -104 129 -146 -15 100 -132 104 -126 113 6 -109 1 86 -58 10 -34 -85
4399 -85 -92 -30 -32 35 -98 -32 -16 134 -179 -32 154 -311 1 -47 -42 40 -66 53 181 -210 -118 80 -15 140 -51
4424 -51 283 420 173 55 -34 235 51 -20 205 127 -33 110 39 -35 -76 140 20 -22 -53 -42 22 -105 126 57
4448 57 34 -144 61 -49 54 288 140 153 -40 120 -194 140 228 10 -12 25 -160 -140 -83 -29 6 -38 174 -250
4472 -250 -39 -228 -100 101 63 -158 -2 -108 -39 -42 -120 -145 -57 -131 -141 -277 140 -13 185 -94 -446 -124 250
4495 250 94 -11 -42 48 -163 61 25 78 130 -81 -53 -73 144 -48 -191 62 -167 -70 -23 266 56 -214 -330
4518 -330 229 3 -158 -3 58 159 144 -136 -105 -156 -126 54 26 68 124 -140 49 216 85 23 -211 -79 -125
$$ packed form
4351a19J61n1J25j53O7P0k93J30M8L32k60R6k48j34J63%J22O9k64j7N6j1p3J36
4375d8j21qO6k7K46j83Jl0K33k75J31J15k32K36k30K39j07j15J10Q5j44O8m4n1
4399h5pO2kO7j33O6J6J50l13J47J86m65L12m8NQ2j06J19J28l91R2J98r5J55j91
4424e1L34J37k47j18q9K69j84p1K25p8j60J43p1p4m1K16j20m2l1J1O4j27K31o9
4448E7k3j78K05j10J03K34j48J3j93J60l14L34Q8k18k2L7j85K0N7N4L5m4K12m24
4472b50K11j89J28K01l8k21J56j06O9lp8k5Q8p4j0j36M17j53J98k79l52L22L74
4495B50j56j05l1R0k11K24l6N3N2k11K8k0K17j92j43K53k29R7M7K89k10k70j16
4518c30N59k26j61J55O1J01j5k80L1n1L0J80k8M2N6k64J89J67j31o2k34J32m6
$$ plain form
4541 -125 -8 12 -55 -11 251 161 123 95 -181 -181 6 87 72 44 12 18 -71 93 38 25 -30 232 -55 9 -95 79
4567 79 -101 162 176 -157 -132 -33 41 29 81 32 -27 5 -231 45 53 -40 -19 127 47 -103 -64 -9 249 62 186 -169
4593 -169 -133 -74 264 110 -60 -129 -217 -75 171 -329 -55 -168 -201 -105 164 78 128 -32 64 -65 155 -170 -254
4616 -254 48 190 -115 -12 1 -115 -42 20 -23 246 -205 73 119 19 47 -257 95 38 180 21 46 -133 18
4639 18 -59 23 -76 9 33 185 -18 189 -60 99 103 114 142 -113 -48 -66 -142 -162 -61 250 -173 108 231 139 115
4664 115 -153 -27 -95 130 -81 33 51 -63 -98 -172 -82 -72 26 -4 11 -56 -33 -19 -355 -156 33 -125 -125 41 -8
4689 -8 -50 57 -49 -389 -109 -9 -119 -13 96 -188 314 -64 176 -210 -96 215 -83 238 -205 -15 -44
4710 -44 71 -136 9 27 36 -104 4 -207 -192 17 62 169 -26 86 -88 -133 -234 -97 -9 -11 -113 147 -43
$$ packed form
4541a25J17K0o7M4K62r0l8k8k76%J87Q1j5k8l2Oq9J64n5j3n5K62k87O4j04J74
4567G9j80K63J4l33K5R9P4j2N2m9n9L2k36K76Qr3K1J46q0j50L9N5K58j87J24l55
4593a69L6N9L38j54j70o9q8J42K46n00K74j13l3R6K69q6N0j60R6j29K20l25q4
4616b54L02J42l05J03J3j16P3O2m3K69m51K78M6j00K8l04L52n7J42j59K5j79J51
4639A8p7Q2r9Q5K4J52k03K07k49J59MJ1K8k55O5j8p6k0J01L11m23K81J23r2k4
4664A15k68J26o8K25k11J14J8j14l5p4R0J0R8l0J5o7K3J4l36J99J89j58%J66m9
4689hm2J07j06l40K80J00j10J06J09k84N02l78K40l86J14L11k98L21m43J90k9
4710d4J15k07J45J8Rj40J08k11J5K09M5J07j95J12j74m5j01J37Q8kj02K60j90
$$ plain form
4733 -43 66 -30 145 -104 118 -86 121 -125 -42 307 -244 61 -58 -54 -222 56 38 64 74 -95 138 -148 -126
4756 -126 87 25 34 60 -116 -61 -109 56 87 73 -214 -161 -85 -171 -159 -60 -76 -145 -104 -135 106 15 -48 142 44 -18 -53
4783 -53 -19 28 128 -96 -134 -116 157 125 -123 -240 -104 59 4 7 -59 53 -23 -103 -150 33 112 -6 3 81 -175 -162
4809 -162 -47 140 76 -62 -74 -49 -28 59 87 -192 -6 35 -127 -191 -93 55 -246 93 -57 43 -271 -94 112
4832 112 -107 -30 -17 2 -201 -21 11 5 16 -27 157 -37 28 -267 57 -121 152 -93 -29 126 -49 248 167 -20
4856 -20 -324 -244 -57 -77 68 -29 189 -90 -254 5 -54 -80 -52 309 248 -49 -97 -125 -85 -6 63 -150 -152 -266 60
4881 60 218 -275 71 23 235 -119 -94 224 -118 102 95 206 -78 161 -263 -185 -209 84 198 -4 -126 74
4903 74 34 22 -55 -181 82 -163 -52 -47 -9 40 -4 184 13 -199 48 -55 -7 305 358 -42 170 35 -73 135
$$ packed form
4733d3J09r6J75k49K22k04K07k46Q3L49n51L05j19Mj68K78j8K6J0j69K33k86K2
4756a26K13o2RK6j76N5m8J65L1j4k87N3P6q6J2R9j6o9M1l1K41r1o3J90r8o2l5
4783e3L4M7J00k24l8J8K73l2k48j17J36J63n5Lo6J12p6q0m7J83P9j18RP8k56J3
4809a62J15J87o4j38j2K5K1Q7K8k79J86M1j62o4R8J48l01L39j50J00l14J77K06
4832A12k19P7J3J9k03J80L2oJ1m3J84j94O5k95L24j78K73k45O4J55j75K97q1j87
4856b0l04Q0J87k0J45r7K18k79j64K59n9k6K8L61o1k97m8k8M0P9O9k13kj14L26
4881F0J58m93L46m8K12l54K5L18l42K20pJ11k84K39m24P8k4K93J14k02j22K00
4903G4m0j2p7j26K63k45J11NL8M9m4J88j71k12K47j03M8L12N3m00K12j35j08K08
$$ plain form
4927 135 -78 -197 -68 -16 38 -153 -73 -37 37 88 174 35 -115 -2 133 -14 -96 184 144 -89 -9 26 164 65
4951 65 130 82 -278 72 -177 -7 39 184 154 43 -68 -80 158 -13 -44 -44 -39 228 175 -10 -85 -193 -141 -182 -151
4976 -151 -297 -89 -13 145 217 -177 332 -134 -96 116 -35 -6 25 214 195 -245 179 169 3 25 67 33 132 44
5000 44 -27 -124 103 -201 -45 58 149 -24 -136 -18 231 11 -218 -25 14 13 100 -250 -37 -156 -86 -66 -12 3
5024 3 -133 104 -24 -104 32 -28 -70 26 112 -132 -198 73 24 -222 73 -110 66 -52 -20 86 -109 119 -55
5047 -55 -6 38 -85 -60 192 71 79 31 -128 -207 65 39 -117 56 388 -186 211 150 -13 -230 -28 -134 -67 2
5071 2 -104 -99 -117 25 -44 61 -149 -48 -63 24 90 144 -200 -52 -98 -31 76 -11 101 74 -33 -180 10 28 118
5096 118 -108 160 -221 137 213 -110 141 59 74 -370 40 -169 -142 58 180 -44 -17 -36 -86 -97 10 173 -152
$$ packed form
4927A35k13j19J29N2N4j91Q0L6P4N1Q6j39j50J13J35j47q2K80m0k33Q0L5J38r9
4951F5O5m8l60L50k49J70M6J45l0j11j11j2K38j71l1%NK67n3j85p5j08N2m1L1
4976a51j46K08P6J58P2l94N09m66L8K12j51K9L1J89j9m40M24j0j66K2M2l4R9q8
5000D4p1r7K27l04J56J03R1j73j12J18K49k20k29J93L9jQ7l50K13j19P0K0N4J5
5024Cj36K37j28q0J36o0m2R6Q6k44o6K71m9k46K95j83J76j18L2J06j95K28j74
5047e5M9M4j23K5K52j21Qm8j59p9K72k6j56J73L32n74L97o1j63k17K02j06O7O9
5071Bj06Nj8J42o9J05k10J01j5Q7O6N4l44J48m6O7J07q7J12k7j07j47J90J8R0
5096A18k26K68l81L58P6l23K51q2J5m44M10k09K7K00J22k24K7j9n0j1J07J63l25
$$ plain form
5119 -152 -68 165 -211 -16 19 -19 53 142 -80 -56 46 131 138 -46 -133 -119 21 64 -257 -51 139 -100 -10 -126
5143 -126 -194 -181 42 131 -8 115 253 -216 -174 -74 83 57 20 252 62 -42 -169 -254 -59 151 -24 51 90
5166 90 276 95 57 -9 121 42 71 -44 -156 -22 -101 -14 -48 -64 65 -9 93 76 87 225 181 -86 -119 254 -36
5191 -36 86 -2 86 -19 34 -255 60 -13 171 -40 4 29 -7 102 -103 -56 -10 78 221 -195 23 -6 46 -40 131
5216 131 188 -94 129 -16 119 -125 125 -46 220 136 -72 5 -151 258 40 -145 208 161 -165 -135 -120 30
5238 30 211 -65 -90 95 106 -11 20 -181 91 112 -421 131 236 110 230 -4 -32 -38 77 -18 -165 -92 -87 82
5262 82 47 144 166 80 -215 -53 83 183 -136 243 145 146 -46 110 -58 -99 144 -61 67 18 87 9 60 118 34
5287 34 -174 -160 -11 147 47 -35 -82 32 -20 -87 -110 26 -166 -225 242 -35 -144 116 -76 -149 70 119 -109
$$ packed form
5119a52Q4K33l76J95L5l8P2Q9k22K4J02Q5Pj84q7J4J40M3l21K06J90k39R0j16
5143a26o8J3K23Q9j39J23J38m69M2J00J57k6l7K32j90j04j27q5J95K10j75P5L9
5166I0J86j81l8o6J30p9K9j15j12J34p9Q7l4j6J29p4J02j7J1J38m4k67l3L73k90
5191c6J22q8Q8j05N3k89L15p3J84k11M4K5l6J09k05M7M6Q8J43m16K18k9N2q6J71
5216A31N7k82K23j45J35k44K50j71K66q4k08P7j56M09k18j85L53m7l26L0J5J50
5238C0J81k76k5J85J1j17L1k01K72K1n33N52J05j26J20k34k8oJ15r5j47P3NJ69
5262H2l5R7K2q6k95J62J36J00l19L79r8Jj92J56j68m1K43k05J28m9O9p8N1N8q4
5287C4k08J4J49J58j00q2m7J14n2o7k3J36j92n9M67k77j09K60j92p3K19M9k28
$$ plain form
5310 -109 -268 -195 55 -39 84 3 146 168 -109 136 -197 187 -235 -55 -5 227 -6 -174 -12 -94 -213 -10
5332 -10 -151 -27 -3 275 -5 193 -51 130 -60 38 -49 64 113 46 -138 33 232 -233 209 -218 268 28
5354 28 -130 -66 -230 69 60 -169 33 -79 -60 46 -65 73 -47 -160 -218 230 -92 -170 -56 -100 -122 -49 -5 -91
5378 -91 -81 -44 -39 -116 -49 5 -90 45 -208 120 101 -55 -134 23 -94 96 240 -33 128 148 191 -79 19 -493 167
5403 167 109 170 -109 123 5 259 118 109 -102 35 181 -82 86 -90 -49 39 -19 28 -200 -74 -176 -128 -105
5426 -105 -62 -213 -107 43 5 170 49 354 76 21 173 -340 -150 65 14 -83 -14 31 156 -53 48 -86
5448 -86 -177 -204 63 28 18 70 -9 24 130 44 -146 39 100 -2 77 -111 -155 -142 46 -136 -16 -184 132 -39
5472 -39 -233 -45 -33 174 8 1 -75 -85 -67 -120 -109 -6 137 99 -232 -89 -13 4 -88 -240 -118 96 16 45 -26
$$ packed form
5310a09j59P3K50r4J23q1J43K2k77K45l33L84m22J80N0K32k33j68J62q2j19K03
5332a0j41J24K4K78k80J98k44J81j90R8q7J13M9o7j84J71J99m65M42m27M86k40
5354B8j58O4j64K99rk29K02j12J9J06j11J38j20j13n8M48l22p8J14m4k2P3M4q6
5378i1J0L7Np7O7N4r5J35k53L28j9j56p9J57j17J90J44k73J61K0M3k70R8n12O60
5403A67n8O1k79K32j18K54j41rk11J37J46k63J68j76M1Q8n8M7k28J26j02M8K3
5426a05M3j51J06J50l8J65j21L05k78n5J52n13J90K15n1r7O9M5J25k09J01j34
5448h6r1k7K67l5j0N2p9L3J06q6j90J85O1j02P9j88m4J3J88j82J20j68L16j71
5472c9j94J88J2K07j66pp6j0J8n3J1J03J43l8l31J43P6J7r2j52J22K14q0K9p1
$$ plain form
5497 -26 -324 173 -178 231 2 -7 90 46 -32 176 -42 37 200 -4 113 -132 131 79 161 101 -41 -172 -166 -85
5521 -85 134 -290 -122 -200 22 -81 4 10 4 -127 -48 23 -185 -171 -48 -65 -68 -167 69 82 -16 -118 -90 120 31 61
5547 61 -1 77 386 100 132 363 -150 -134 70 126 1 -53 -33 65 -23 114 -2 -163 -16 -91 42 140 22 -76
5571 -76 -74 20 -75 -166 25 -111 254 27 -45 143 -15 58 169 -119 223 -113 -92 -10 -79 100 -117 -279 -288 -97
5595 -97 29 101 -100 81 87 145 -135 307 108 228 302 -82 -166 -121 -114 -24 -34 -179 18 -214 16 -22 -93 181 156
5620 156 312 -34 -229 -163 170 228 18 -98 -64 47 -299 -51 186 -80 -104 -89 -84 -291 -116 -210 -101 -10 120
5643 120 -49 105 25 -29 -42 -182 84 117 -36 31 -37 182 168 74 33 -8 172 -146 93 111 -85 224 -39 35
5667 35 -3 -41 120 -171 59 8 7 238 54 -28 24 -131 3 87 -103 155 180 -105 122 -51 -157 111 85 -131
$$ packed form
5497b6k98M97l51M09k29rR7m4p8K08k18P9J63k04J17k45K63n2Q2o0j42j31OQ1
5521h5K19m24J68p8K22j03Q5Ooj31P9P1k08J4J23j7lr9K36J3r8j02K8K10q9L0
5547F1o2P8L09k86L2K31n13J6K04N6j25n4K0R8q8J37j16j61J47p5J33R8j18r8
5571g6KR4r5r1J91j36L65k27p2J88j58P3J11k88L42l36K1Q2o9J79k17j62rJ91
5595i7J26P2k01J81ON8k80M42j99J20P4l84q4M5PR0j0j45J97k32K30l8p1K74k5
5620A56J56l46j95O6L33N8k10j16L4J11l46K48K37k66k4J5Nk07J75r4J09R1J30
5643A20j69J54q0n4j3j40K66L3j53O7o8K19j4r4m1m1J80l18K39J8j96L09k63P4
5667C5l8l8J61k91K30n1jK31j84q2N2j55J34Q4j90K58K5k85K27j73j06K68k6k16
$$ plain form
5691 -131 32 -169 109 -137 39 -62 5 -30 -118 78 -58 214 36 -175 42 128 81 62 -13 -130 -78 179 25
5714 25 -208 39 -184 -89 -132 5 -129 132 -211 7 -204 -126 62 -153 202 287 21 57 -121 -138 116 120 303
5737 303 42 -42 31 94 233 300 -86 -15 39 283 34 -32 -184 76 56 -35 118 154 161 189 -99 -232 -95 230
5761 230 32 -186 -80 -173 -278 139 229 126 59 46 216 334 34 53 43 -29 -110 84 60 131 -106 169 100 -269
5785 -269 167 11 -148 274 66 -106 90 149 169 123 -42 -227 -193 245 -19 -313 -7 13 -80 65 -19 178
5807 178 284 19 110 -44 -239 -285 236 -38 219 -187 -175 -166 26 -30 -69 -72 -29 -37 -15 -134 255 104 42 -38 -119
5832 -119 89 77 183 208 -117 -31 -16 161 5 19 59 -133 36 -317 99 -57 -76 -109 135 42 -128 20 279
5855 279 96 193 176 159 -42 231 -96 -108 -57 64 -159 10 103 -45 210 -3 65 27 -126 -200 234 -57 148
$$ packed form
5691a31J63k01K78k46J76j01O7l5q8J96j36K72j78k11K17Q6m7j9p5j17N2K57j54
5714B5k33K47k23R5m3J37j34K61l43K18k11P8J88k15L55Q5k66L6j78j7K54MJ83
5737C03k61q4P3O3J39O7l86P1N4K44k49o6j52K60k0r1J53L6PK8k88j33J37L25
5761B30j98k18J06r3j05M17R0j03o7j3J70J18l00J9j0p2q1J94k4P1k37K75o9l69
5785b69M36j56j59M22k08j72J96N9K0m6j65j85L4M38k64k94L06K0r3J45q4J97
5807A78J06k65R1j54j95m6N21k74K57m06J2RJ92n6l9lM3qK2j19L89j51o2q0q1
5832a19K08j2J06K5l25Q6J5J77j56J4M0j92J69l53M16j56j9l3K44r3j70J48K59
5855B79j83R7j7j7k01K73l27j2N1J21k23J69R3j48K55k13O8l8j53p4M34k91K05
$$ plain form
5878 148 123 -20 52 246 -112 284 -32 -65 -41 -76 63 47 -28 -360 -73 68 -66 77 319 17 -190 51
5900 51 134 -37 57 -19 -113 40 -15 -193 -95 -85 -65 116 -161 22 -96 165 53 251 -187 79 159 57 -50
5923 -50 -204 109 -81 -62 111 104 -8 -71 176 253 55 44 210 -45 -230 -17 117 -175 -146 191 5 158 -215
5946 -215 27 -144 61 -43 227 -86 -156 -14 -19 -12 126 84 -87 -31 -83 175 -5 49 79 -45 106 68 -59 117
5970 117 116 -14 33 -85 53 -31 -77 -2 -262 25 241 254 41 43 -196 122 -44 -55 215 365 34 -118 -45 -11
5994 -11 -314 155 0 256 -298 -132 -108 60 -23 -211 -121 32 28 193 12 -114 101 -118 183 -288 -21 -160
6016 -160 -18 -149 231 15 -43 -19 56 -285 91 -19 49 207 149 -97 -51 -69 97 -24 -15 1 18 -103 -131 -93
6040 -93 -225 -3 -8 -40 -176 76 -147 47 12 -164 109 137 -167 -221 -48 -17 143 -140 208 122 8 128 87
$$ packed form
5878A48k5j43P2J94l58L96l16l3K4l5J39j6p5l32K87J41j34J43K42l02k07K41
5900E1Q3j71R4p6r4J53n5j78R8J0K0J81k77J83j18K61j12J98m38K66Q0j02j07
5923e0j54L13j90J9J73pj12o3K47P7j98j1J66k55j85K13J34k92K9L37j86J53l73
5946b15K42j71K05j04K70l13p0J42nPJ38m2j71N6n2K58j80N4L0j24J51l8j27J76
5970A17jj30M7j18J38q4m6P5k60K87K16J3k13Kk39L18j66j1K70J50l31j52P3L4
5994a1l03M69j55K56n54J66K4J68q3j88R0J53mJ65j81j26K15k19L01m71K67j39
6016a60J42j31L80k16n8K4P5l41L76j10O8J58n8k46M6j8J66j21RJ6J7j21k8L8
6040i3j32K22nl2j36K52k23J94l5j76K73K8l04n4J73L1J60k83L48q6j14J20m1
$$ plain form
6063 87 -134 -12 -128 -12 -15 79 103 47 277 -183 -34 -6 -69 125 -55 -15 -36 -86 -306 231 244 -23 -119 137
6087 137 152 181 78 -84 137 -47 154 53 -250 -179 -129 -71 108 -55 56 128 120 -57 35 1 147 169 256 11
6111 11 2 -29 -23 148 -79 139 -194 -154 -377 -7 68 -56 52 -80 175 -140 -31 -278 -114 -35 31 -119 -126 20
6135 20 -124 -117 31 60 22 2 361 -119 -45 -147 25 172 -279 -81 17 -176 -118 241 221 -186 -92 7 -247 79
6159 79 12 -174 147 86 15 -75 -4 -21 -160 95 164 -271 116 -40 89 183 79 -206 146 150 -41 238 -4 254
6183 254 53 72 149 202 59 40 -125 -219 -28 -98 98 -37 -142 5 -61 85 -160 16 -146 -267 -64 76
6205 76 66 135 -78 89 -134 20 245 20 -128 16 -62 -104 -325 112 -150 28 93 -70 -64 -40 108 24 -233
6228 -233 109 -165 81 39 -50 -57 111 3 156 -59 -91 -194 95 -290 -128 -5 -69 -24 -142 63 14 -93 -126
$$ packed form
6063H7k21J22j16J16lR4K4n6K30m60J49K8o3J94j80M0k1n0k20N37J3k67r6K56
6087A37J5K9j03j62K21j84K01j01l03P1N0N8J79j63J11P2qj77R2l4J46K2Q7k45
6111A1rl1OJ71k27K18l33M0k23L70P5j24J08j32K55l15J09k47J64P9O6j50pJ46
6135B0j44PJ48K9l8k0L59m80P4j02J72J47m51J98R8j93N8L59k0m07R4R9k54L26
6159G9o7j86L21o1p1r0P1j7j39K55O9m35L87j56J29R4j04k85L52Mj91K79k42K58
6183B54k01J9P7N3j43j9j65r4J91p0J96j35j05J47o6J46k45J76j62j21K03J40
6205G6j0O9k13J67k23J54K25k25j48J44p8m2k21M37k62J78O5j63OK4J48q4k57
6228b33L42k74K46m2q9pJ68j08J53k15l2j03K89l85J62J23o4M5j18K05m9j07l3
$$ plain form
6251 -126 210 207 179 -94 161 53 -103 -71 -16 -94 -50 233 -85 206 68 135 -47 -46 115 1 -109 -169 78 49
6275 49 42 -15 89 19 -18 -143 -165 -82 -56 -123 -65 -291 -43 15 -27 -30 -233 55 80 -173 96 29 228 -193 -198 -149 -51
6302 -51 -134 80 -70 -365 121 -102 123 -38 -84 130 -45 -266 -159 -58 -261 62 37 93 283 2 -2 -44 -178
6325 -178 116 -170 33 326 -9 13 -75 176 199 173 -60 -126 42 2 -43 -41 30 28 -8 158 -90 -180 -1 -61 77
6350 77 60 -154 -76 16 -104 27 39 -76 24 -44 4 -341 -7 47 74 51 205 118 26 85 34 88 31 23 33 -22 -33
6377 -33 -45 62 -73 115 -219 10 323 -84 -164 235 160 15 224 21 5 8 179 48 -88 -44 35 -76 90
6400 90 -92 25 83 -70 -118 174 123 -137 38 40 74 -130 28 100 -32 151 98 34 117 40 33 29 231 -135 16
6425 16 46 43 246 -140 10 -124 -300 -20 -96 69 133 25 161 64 88 -92 60 91 -69 -45 -244 -113 -26 -74
$$ packed form
6251a26L36lk8k73K55j08j56L2N5p8M4K83l18K91j38O7j82JJ61j14j10o0K47k9
6275D9pn7J04p0l7j25k2Q3K6o7N8k26K48N8m2lk03K88K5k53K69o7J99m21nM9R8
6302e1q3K14j50k95M86k23K25j61m6K14j75k21J07J01k03L23k5N6J90k81mm2j34
6325a78K94k86K03K93l35K2q8K51K3k6k33o6J68m0m5KP1kl6J66k48r0J79o0J38
6350G7j7k14P8R2j20J31J2j15J00o8M8l45L34N4K7k3J54q7r2N9n1N4n7qJ0n5j1
6377c3j2J07j35J88l34K29L13m07q0L99p5j45K09k03j6LJ71j31j36M4P9j11J66
6400I0j82J17N8j53m8K92n1k60J75KL4k04J58P2j32J83n3o4Q3p7pmK02l66J51
6425A6L0lK03l86J50j34j76K80p6J65O4j08J36r7K4j80J52L1j60K4j99J31Q7m8
$$ plain form
6449 -74 16 -30 -85 -30 289 40 119 -27 -132 -20 2 138 189 -116 -119 57 202 155 98 -62 147 124 3 -50 20
6474 20 -54 -17 -70 -196 105 218 106 24 -41 -110 59 182 191 -22 -82 -91 -1 297 -221 210 -68 -70 119 117 -117 39
6500 39 56 50 -15 -150 -108 -64 -250 49 104 48 -237 149 -91 -43 -96 -218 -181 -141 -142 194 3 -62 -6 193 -204 167
6526 167 95 -18 86 -205 -20 -200 198 206 176 258 161 -207 -63 -117 -361 66 71 -12 196 -159 57 142 -38 125
6550 125 85 78 67 173 -23 112 158 42 109 -250 -8 193 -9 -51 -193 88 -19 -57 -55 -211 -143 327 167 -63
6574 -63 196 167 124 -58 -275 71 117 131 -46 -225 -51 -85 -90 229 -143 -46 223 -299 -183 119 -28 -99 -3 2
6598 2 11 34 -226 -54 89 -30 72 -60 180 -72 63 2 -132 -88 -35 320 138 66 27 46 46 -81 -30 -26 -68 -4
6624 -4 -48 135 -137 -33 -55 0 -26 -118 39 -85 -185 130 -294 32 15 -23 -71 -11 -65 51 -42 11 68 -243 -46
$$ packed form
6449g4R0m6n5N5L19k49P9j46j05J12K2J36N1l05lJ76J45m7n7j60K09k3j21n3P0
6474B0p4L7n3j26L01J13j12q2o5o9J69J23Rk13o0rR0K98n18M31k78kJ89kk34J56
6500C9J7oo5j35M2M4j86K99N5n6k85L86k40M8n3j22L7M0jL36j91o5N6J99l97L71
6526A67p2j13J04k91J85j80L98Ql0Q2r7l68J44n4k44M27Nq3K08l55K16Q5j80J63
6550A25m0pj1J06j96J35M6j16O7l59K42K01k02m2j42K81j07l8Kj56O8M70j60k30
6574f3K59k9m3j82k17L46M6J4j77j79J74l4nL19l72R7K69n22J16L02j47p1R6N
6598BRK3k60J72J43j19J02j32K40k52J35o1j34M4N3L55j82p2l9J9%j27N1Mm2O4
6624dm4J83k72J04k2N5k6r2J57j24j00L15m24L26j7l8m8O0n4J16r3N3N7l11J97
$$ plain form
6649 -46 -48 -103 48 -104 4 42 27 7 12 -35 40 55 105 27 93 93 -144 -53 106 -244 -100 11 -97 -145 -177 207 -29
6676 -29 -84 -88 -208 -25 -154 -165 -11 70 -106 -18 -137 -51 -68 180 129 -47 -3 -191 -56 61 21 201 229 -293
6700 -293 30 139 23 42 -125 -118 -27 -153 -205 21 -84 26 73 -156 126 172 -86 -132 34 -103 91 88 -3 -183
6724 -183 81 -206 -16 363 68 150 -29 101 124 -351 -23 -24 141 35 -22 35 -116 78 202 57 -179 -8
6746 -8 21 -181 61 26 29 282 -89 116 -69 -115 41 -150 -24 55 33 64 4 -150 164 -63 -94 125 181 12
6770 12 -144 86 24 213 -110 -35 -202 147 -48 92 85 -119 70 -147 80 -23 0 -189 48 122 90 -18 3
6793 3 -4 -96 291 107 14 114 -115 -66 -26 -188 95 -126 93 59 -40 -98 -171 150 -1 -88 -224 208 147 20 -114
6818 -114 104 247 -169 -157 17 -75 92 34 -108 74 -66 61 -109 80 176 55 -20 112 -134 -139 -134 -242 17
$$ packed form
6649d6kn5J51j52J08L8j5k0Nm7P5J5N0p8O6%k37R1J59l50J44J11j08m8l2L84k36
6676b9n5mj20J83j29j1J54Q1j76Q8j19Q6j7K48n1j76M4j88J35J17m0J80K8n22
6700b93L23J09j16J9j67PR1j26n2K26j05J10M7k29K82M6k58m6J66j37J94lr1j80
6724a83K64k87J90L79k95Q2j79J30K3m75L28jJ65j06n7N7j51J94J24j45k36J71
6746hK9k02K42l5LK53l71K05j85m6J56j91J26P9k2L1o0j54L14k27l1K19N6j69
6770A2j56K30o2J89l23P5j67L49j95J40pk04J89k17K27j03K3j89K37P4l2j08K1
6793Cpr2L87j84r3J00k29M9M0j62K83k21K19l4r9n8p3L21j51q7j36M32o1j27j34
6818a14K18J43m16J2J74r2J67n8j42J82j40J27j70J89R6j21p5J32k46nNj08K59
$$ plain form
6841 17 100 101 -187 12 120 -113 55 -87 -100 271 183 -26 -127 -149 -3 -159 -117 92 -93 -170 -23 -12 -128
6864 -128 108 -187 239 -6 -92 147 -73 150 -3 -189 -97 175 -26 125 -116 -84 -202 46 126 -291 153
6885 153 -2 30 -70 46 170 -182 65 105 176 135 75 -74 -20 5 -267 53 9 217 156 86 2 102 -313 25
6909 25 35 -65 -23 -8 -53 -19 -140 160 96 8 171 -68 -27 -11 -163 -138 52 211 152 23 3 -23 -52 -53 118 -211
6935 -211 -120 -160 -45 132 -17 -75 -176 -42 98 129 -101 218 -56 -102 136 -66 -243 18 -161 72 8 91
6957 91 -147 42 159 79 66 -84 -101 9 7 46 13 -142 -63 103 0 110 90 182 -271 144 -60 102 102 -5
6981 -5 23 -261 -25 66 26 -319 -241 -134 45 -231 -148 -353 60 -64 166 149 -189 -33 52 -128 102 80 140 48
7005 48 -124 -196 -16 -30 32 22 -162 -77 75 -184 105 -12 166 -133 99 -259 27 57 38 42 -26 210 -41 249
$$ packed form
6841A7Q3Jk88J99J08k33J68j42j3L71q8k09j01k2J46j56M2K09j85p7J47J1j16
6864a28K36k95M26k45q6K39k20K23j53j86R2K72k01J51k41L2j18K48Q0m17M44
6885A53j55L2j00J16J24l52K47M0P1m1o0j49N4K5k72L20m4K08o1p0q4J00m15L38
6909B5J0j00M2J5m5L4j21L00o4q8J63k39M1J6j52K5J90J59n9j29k0k6k9jJ71l29
6935b11R1m0J15J77j49n8j01J34J40L1k30L19k74m6K38k02j77K61j79K33o4Q3
6957I1k38J89J17q0j3j50j7J10kL9l3j55P9J66j03J10k0R2m53M15k04J62%j07
6981eK8k84K36R1m0l45P8J07J79k76Q3k05M13j24K30j7l38J56Q5j80K30k2O0r2
7005D8j72p2J80j4O2j0j84Q5J52k59K89j17J78k99K32l58K86L0j9Mo8K36k51K90
$$ plain form
7029 249 -20 123 -171 91 -170 12 -28 -178 -51 73 -160 -247 135 -1 -163 -53 54 8 60 167 54
7050 54 140 -38 -179 -16 -93 65 353 -24 -122 122 -14 80 67 73 -18 -26 -87 160 -47 -164 -75 -211 -23 -43 33
7075 33 238 -145 36 -121 267 148 -67 -97 -55 25 -244 -141 92 28 206 -138 -57 -238 79 -223 -178 57
7097 57 -105 -164 170 90 -95 17 -163 104 -51 84 -141 105 51 -78 98 221 -141 66 169 111 4 -129
7119 -129 -174 -106 10 -64 -203 135 44 77 -51 161 279 -120 -1 -83 48 172 -44 42 58 33 92 197 40
7142 40 -74 -182 15 111 26 -11 41 -171 109 -4 45 105 62 166 2 -20 -7 126 132 -42 57 22 -212 -92 -12
7167 -12 207 238 155 -57 -49 109 197 305 -35 55 -63 -181 -200 191 -105 83 253 -114 28 24 -288 -169 29
7190 29 130 79 -127 -142 165 -8 -103 -193 110 -74 30 -47 -77 -22 -93 -43 9 233 -120 87 25 -41 -161 6
$$ packed form
7029B49k69J43k94K62k61J82m0j50J27J24k33q7L82j36j62J10J07m6N2J07j13
7050E4Q6j78j41J63p7J58K88l77r8K44j36R4j3Or1qo1K47k07j17Q9j36J88k0P6
7075C3K05l83J81j57L88j19k15l0M2Q0k69J03K33o4J78l44Q1j81L17l02M5K35
7097E7j62n9L34q0j85J12j80K67j55J35k25K46n4j29J76J23l62K07J03n8j07j33
7119a29m5O8J16p4j39L38r1L3j28K12J18l99J19q2J31J24k16Q6J6k5N9J05j57
7142D0j14j08J97R6q5l7N2k12K80j13M9O0m3J04j64k2J3J33Oj74R9l5k34J20Q0
7167a2K19L1q3k12QJ58Q8J08l40R0j18j18j9L91k96J88J70l67J42ml12J19J98
7190B9J01n1k06j5L07j73r5r0L03j84J04p7l0N5p1N0N2K24l53K07o2o6j20J67
$$ plain form
7214 6 -235 -1 125 116 23 -135 -283 -75 118 8 60 52 -50 -321 -208 -97 -42 35 333 -2 42 -55 45 -342
7238 -342 16 8 -23 -2 80 110 -101 -102 214 50 -15 136 -39 -163 77 -66 -32 -62 34 57 57 -15 -10 158 -33 164
7264 164 138 74 64 111 -135 -103 -193 -129 148 -46 -2 -141 247 13 -48 -120 203 -12 -61 144 48 -27 -259 198
7288 198 -86 123 -39 -97 129 16 104 205 84 -27 98 209 -68 92 -163 4 -43 61 22 165 234 -128
7310 -128 -56 7 6 -17 108 -80 76 173 61 -183 -79 131 -19 -215 13 120 24 -207 -104 -113 160 50 109
7333 109 47 259 -57 234 -178 162 91 -234 -120 -68 -71 -34 -14 124 -27 32 -298 -53 -6 -228 56 53 112 55
7357 55 35 -36 -18 43 -232 -139 -34 -128 -114 104 58 79 63 -118 43 9 148 -148 -114 -259 69 91 -24 85 -292
7382 -292 235 39 27 -38 160 -160 21 -56 62 257 106 -70 -61 -67 -27 -368 -93 -237 54 -126 5 137 48
$$ packed form
7214Fk41K34J26rr3j58j48K08J93j10N2qj02k71J13J11N5P7K98l35M4r7J00l87
7238c42L58ql1K1Q2L0k11jL16j64o5J51j75j24K40j43L4l0R6K3%p2NJ68j91J97
7264A64k6o4j0M7k46L2r0O4K77j94M4j39L88k34o1p2L23k15m9K05r6p5k32M57
7288A98k84K09j62n8K26j13Q8J01j21j11J25J11k77J60k55J67m7J04l9J43O9l62
7310a28P2O3jk3J25j88J56R7j12k44J04K10j50j96K28J07r6k31J03rK73j10N9
7333A09o2K12l16K91m12L40p1l25J14N2lL7K0J38j51N9l30K45M7k22K84lN9n7
7357E5k0p1J8O1k75R3J05r4J4K18m6K1j6j81J61l4J39k96L4j45L28K2j15J09l77
7382b92N27j96j2o5J98l20J81p7J18J95j51j76RoM0l41K75j44K91j80J31J32q9
$$ plain form
7405 48 115 -65 293 234 123 -47 -136 25 2 -244 -162 113 -83 -252 -38 -144 287 66 263 27 81 -4 -233
7428 -233 84 29 -155 74 -61 163 97 -29 -86 -43 -117 -231 -34 395 111 212 140 -103 -40 -122 43 -69 -31
7451 -31 -298 11 216 31 150 -172 83 -139 60 77 100 -79 -130 134 -84 69 -4 85 64 -47 73 -76
7473 -76 -152 67 -64 -25 12 67 -64 -153 310 -13 50 -44 -244 28 -10 -64 194 -303 -93 93 -15 70 20 52
7497 52 -86 -48 -35 279 167 114 255 -70 -163 119 -78 56 22 195 -152 -3 32 7 -206 79 -261 44 0
7520 0 63 89 -74 -61 235 -176 -144 -14 151 48 -159 -30 26 -73 -8 407 10 15 37 -176 10 -13 -124 192
7544 192 -25 33 166 -51 -107 -17 -87 29 -183 88 -147 -65 61 -73 -21 -311 -147 -147 -242 -259 80 175 62 5
7568 5 73 252 -45 -27 -7 21 189 168 -27 -14 103 74 74 -50 81 21 -74 250 -48 -62 -79 -149 -16 61 -190 135
$$ packed form
7405D8O7j80L58n9j11j70q9J61k3k46Q2K75j96j69K14j06M31k21J97k36N4q5k29
7428b33L17n5j84K29j35K24o6j26n7M3p4j14J97M29k84J01p2k43O3q2J65j12L8
7451c1k67L09K05j85J19l22K55k22J99J7K3j79n1K64k18J53p3Q9k1j11J20j49
7473g6p6K19j31L9L7N5j31q9M63l23O3r4k00K72l8n4K58m97K10J86j08Q5n0L2
7497E2j38L8J3L14j12n3J41l25r3K82j97J34l4J73l47J49L5k5k13K85l40L05m4
7520@O3K6j63J3K96m11L2J30J65j03k07J29N6r9O5M15l97NK2k13J86k3j11L16
7544A92k17N8J33k17n6R0p0J16k12K71k35Q2J26j34N2k90J64%r5j7L39R5j13n7
7568EO8J79k97J8K0K8J68k1j95J3J17k9%j24J31o0r5L24k98j4j7p0J33P7k51L25
$$ plain form
7594 135 -110 151 -129 31 6 26 118 -91 61 139 -8 37 201 -108 64 20 -106 45 -113 -123 194 118 102
7617 102 173 154 113 -19 13 38 -103 -62 3 -45 44 -116 125 -77 -44 13 -259 -38 93 -262 -207 -65 182 104
7641 104 -26 8 178 56 101 -95 -153 -87 197 0 79 118 131 158 26 23 134 31 39 -105 3 40 172 -97
7665 -97 197 57 -141 59 5 84 -145 0 -138 16 76 10 -126 55 70 30 -170 -111 17 132 17 218 120
7688 120 -16 -132 -75 41 114 -35 116 165 87 -237 81 101 293 187 -137 -109 241 -189 23 322 -237 -29
7710 -29 62 -213 -20 -113 5 -72 -186 50 86 -157 -95 -41 125 44 14 -21 -129 -41 92 185 283 169 37 -401
7734 -401 -86 101 28 -81 112 309 51 -70 88 -12 1 103 -319 19 155 -97 81 -87 152 177 11
7755 11 27 134 96 -195 -10 -122 87 151 -72 -25 -7 -93 -43 -117 142 -24 88 -61 163 135 -56 -207 39
$$ packed form
7594A35k45K61k80J60k5K0R2k09J52P8j47M5J64l09J72m4j26J51j58j0L17p6j6
7617A02P1j9m1j32L2K5j41M1O5m8Q9j60K41k02L3N7k72K21J31l55N5J42K47p8
7641A04j30L4J70j22M5j96n8O6K84j97P9L9J3K7j32lJ11j03Qj44J08L7J32k69
7665i7K94j40j98K00n4P9k29J45j38J54O0o6j36J81J5m0k00N9J28J15j15K01r8
7688A20j36j16N7J16P3j49J51M9p8l24L18K0J92j06l24K8L50m30K12K99n59K08
7710b9R1k75J93r3J18p7j14K36L6k43O2N4J66q1l0l5j08Q8J33R3R8j14j32m38
7734d01L15J87p3j09J93J97k58j21J58j00J3J02m22L38J36k52J78j68K39K5j66
7755A1J6J07l8k91J85j12K09O4k23M7J8q6N0p4K59j66J12j49K24k8j91j51K46
$$ plain form
7778 39 -145 -112 -71 257 17 -225 -23 -171 -112 129 -133 102 -30 -282 -82 -46 -101 -135 -36 -138 -75 58 80
7801 80 -1 92 26 141 88 -48 174 -44 -61 29 11 -125 19 59 -185 -10 -38 -90 219 159 -117 -124 -25 -62 124
7826 124 -124 11 -86 -24 180 -53 188 167 -87 -64 136 -231 -64 117 82 -60 -233 -96 141 -315 -231 -166
7848 -166 -115 -193 2 -30 -109 138 -149 34 -180 20 -245 -154 55 -81 -37 -111 -36 103 -37 78 -259 33 23
7871 23 83 283 96 -137 159 239 -20 32 -241 -63 24 -136 49 238 161 -62 88 -131 -118 132 -157 -224 56
7894 56 79 200 -27 122 195 213 -101 118 -47 -79 152 0 92 81 49 -148 25 155 86 -310 -44 107 179
7917 179 108 97 131 46 71 -68 63 190 -55 130 -154 133 -82 83 -55 -213 166 154 142 -9 15 -103 87
7940 87 -20 -129 60 168 -194 31 56 56 45 75 -352 51 -126 -64 19 65 112 7 -109 -36 103 115 -4 89
$$ packed form
7778C9j84L3M1L28k40k42K02j48N9K41k62K35j32k52K00L6n5l4R9j02O3J33K2
7801H0q1R3o6J15n3j36K22k18j7R0j8j36J44M0k44J75k8n2L09o0k76pR9l7J86
7826A24k48J35r7O2K04k33K41k1k54K3K00l67J67J81l5j42j73J37K37m56Q4O5
7848a66N1p8J95l2p9K47k87J83k14K00k65R1K09j36M4p4P5J39j40J15l37K92j0
7871B3O0K00j87k33K96Q0k59N2k73J78Q7j60J85J89p7k23J50k19J3K50k89o7K80
7894E6K3J21k27J49P3J8l14K19j65l2K31j52R2j1l2j97J73J30o9l96K66J51P2
7917A79p1j1L4q5K5j39J31J27k45J85k84K87k15J65j38j58L79j2j2j51K4j18J90
7940H7j07j09J89J08l62K25K5%j1L0m27M03j77O2Q3M6M7j05j16P3J39J2j19R3
$$ plain form
7964 89 0 -102 -50 44 6 -108 61 -99 21 36 36 -288 1 17 -86 31 -68 79 -28 88 177 -100 -168 37
7988 37 22 -1 -56 232 -84 3 195 178 63 -87 366 -97 33 -85 -95 144 -338 81 -102 9 35 -243 -51
8011 -51 199 -34 -30 38 -108 118 -60 -70 -40 -220 -25 -135 -72 65 60 207 -21 91 -139 306 145 -152 124
8034 124 144 45 42 38 -81 2 -11 -243 -85 -131 -37 -92 -100 27 -129 72 136 -16 -10 198 -6 84 -293 49 -25 19
8060 19 -169 148 64 -76 238 111 221 71 154 -106 -82 125 -16 -152 136 -140 -112 198 -14 -119 -162 113
8082 113 85 -38 -229 -293 -191 20 105 -95 -123 -282 -163 -109 131 56 101 -123 -389 -137 -22 12 105 -27 -384
8105 -384 64 153 80 284 144 -55 -216 40 -78 -178 -100 131 -71 -185 246 301 -218 76 184 85 -39 286
8127 286 20 -141 46 328 94 -14 -70 -58 64 160 -278 157 63 -225 158 -49 0 -231 -186 165 79 38 54
$$ packed form
7964H9q9j02N2R4l8j14J69j60J20J5%l24K89J6j03J17r9J47j07J16Q9k77o8K05
7988C7j5k3n5K88l16Q7J92j7j15j50M53m63J30j18j0K39m82M19j83J11K6k78J92
8011e1K50k33MO8j46K26j78j0L0j80J95j10O3J37nJ47k28J12k30M45j61k97K76
8034A24K0r9lmj19Q3j3k32J58m6R4n5qJ27j56K01O4j52OK08k04R0l77L42p4M4
8060A9j88L17q4j40L14j27J10j50Q3k60K4K07j41j36K88k76K8L10k12j05m3K75
8082A13k8j23j91o4J02K11Q5k00k8j59J19N4K40p5M5k24k66K52J15L4R3j32l57
8105c84M48Q9p3K04j40j99j61K56j18j00P8K31k02j14M31N5n19K94J08r9j24L25
8127B86k66j61J87K82k34j08n6J2J22R6m38M35r4k88L83k07M9k31M5L51q6m1J6
$$ plain form
8150 54 7 -101 58 118 -84 82 29 -76 -85 -193 -168 -122 -156 -150 -31 24 -59 -182 40 111 180 -112 2 -2 -17 -236
8176 -236 178 -178 107 58 172 353 -97 -187 78 17 100 208 -46 238 96
$$ packed form
8150E4m7j08J59O0k02J66n3j05rj08K5M6l4OJ19N5q3j23K22P1O9k92J14mj5k19
8176b36M14l56K85m9J14J81m50r0K65o1Q3J08k54K84j42
8191I6
$$ Imaginary data points
##PAGE= N=2
##DATA TABLE= (X++(I..I)), XYDATA
$$ plain form
0 0 0 0 0 0 0 0 0 0 0 0 0 0 0 -8 8 -8 8 -8 11 -16 16 -24 24 -32 32 -40 48 -56 64 -72 80 -95 104 -120 136
35 136 -152 171 -191 215 -239 266 -295 328 -362 402 -442 490 -538 594 -654 722 -795 875 -966
54 -966 1067 -1182 1312 -1459 1633 -1836 2081 -2378 2753 -3241 3904 -4861 6372 -9128 15831
69 15831 -72657 -43166 24710 -66014 -9579 -24710 -78677 -8638 33230 -25807 2127 14179
81 14179 -14926 3896 27946 16932 29335 18777 -7404 2461 32517 23788 6412 8747 -1661
94 -1661 -8506 22482 10957 -19006 10996 13037 -21345 5392 13513 -8575 17873 10518 -20180
107 -20180 12149 15145 -4031 21925 5340 -18529 15567 4075 -15657 18536 3565 -30739
119 -30739 -6650 -972 -14569 -2214 -8261 -30156 -22489 -3303 -5749 -19876 -17178 -11028 -18490
$$ packed form
0@%%%%%%%%%%%%%qJ6j6J6j6J9k7L2m0M8n6O4p2Q8j04J20j36J52j75J99k24K56
35A36k88L23l62M06m54N05n61O23o90P64q44R32j028J132j248J376j517J670j841
54i66K033k249K494k771L092l469L917m459N131n994P145q765J1233j5500K4959
69A5831q8488K9491O7876r0724N6435j5131n3967P0039M1868n9037K7934J2052
81A4179k9105J8822K4050j1014J2403j0558k6181R865L0056q729j7376K335j0408
94a661o845L0988j1525k9963L0002K041l4382K6737Q121k2088K6448p355l0698
107b0180L2329K996j9176K5956j6585k3869L4096j1492j9732L4193j4971l4304
119c0739K4089N678j3597J2355o047k1895P667J9186k446j4127K698O150p462
$$ plain form
132 -18490 -10493 -837 -13821 -11312 -3581 -12647 -5429 1859 -6628 -3659 -5509 -8002 7123 -629
146 -629 -12479 1130 -264 -2972 7105 -6625 -10656 6475 1497 -670 4711 -7343 -1059 10783
160 10783 -105 3743 9901 -3220 1565 12095 5910 8560 9844 1541 2503 9229 10534 6303
174 6303 -175 1919 2711 -807 2588 -1052 -8423 -3912 -5857 -11186 -6592 -8564 -10718 -8046 -14810
189 -14810 -13856 -7313 -12930 -9094 -3945 -13583 -10210 -2014 -8471 -2797 2607 -7661 -4901 1412 -1270
204 -1270 4109 4554 -3881 -2246 1443 1310 4863 3190 -3097 -2359 598 2458 3104 1168 -803 -2792
220 -2792 85 4327 1608 1458 2631 -2142 33 4574 951 1466 2368 -3342 -940 2761 -2352 -1050
236 -1050 270 -4712 -1691 -914 -6227 -1806 415 -4298 -3241 -3255 -5157 -140 1134 -3197 -3033 -1647
$$ packed form
132a8490P997R656j2984K509P731r066P218P288q487K969j850k493J5125p752
146f29j1850J3609j394k708J0077j3730m031J7131m978k167N381j2054O284J1842
160A0783j0888L848O158j3121M785J0530o185K650J284q303R62O726J305m231
174F303o478K094P92l518L395l640p371M511j945n329M594j972k154K672o764
189a4810R54O543n617L836N149r638L373Q196o457N674N404j0268K760O313k682
204a270N379M45q435J635L689j33L553j673o287P38K957J860O46j936j971j989
220b792K877M242k719j50J173m773K175M541l623N15R02n710K402L701n113J302
236a050J320m982L021P77n313M421K221m713J057j4j902N017J274m331J64J386
$$ plain form
252 -1647 -2161 -681 399 -1017 -1570 -1759 -2954 -2522 1106 1210 -3298 -4247 -3483 -3014 160 -718 -5099
269 -5099 -3186 -1406 -3551 -874 324 -1842 130 -958 -3903 1676 4807 1109 506 -640 -1400 3445
285 3445 3990 140 1093 318 -1781 -126 1233 642 766 -2605 -5461 -2709 1413 1076 -1725 -4519 -4807
302 -4807 -2067 959 -262 -1838 -1734 -2148 -2614 421 2065 1292 13 -3049 -3101 2378 4200 1022 -1031
319 -1031 -2674 -1368 2192 1906 -528 -140 -1457 -2986 -463 857 894 473 -3185 -4249 -251 2669
335 2669 1318 -610 -2693 -2136 687 1278 284 198 -294 -1800 -1558 155 1324 592 -1556 -3683 -2591
352 -2591 1106 993 -1198 -2393 -2560 -1168 289 -311 -967 -221 -909 -1748 16 1115 1702 763 -1443
369 -1443 -1132 1352 1741 991 -134 -718 97 625 -122 -145 139 -338 -778 -1365 -498 839 -16 -1116 -1836
$$ packed form
252a647n14J480J080j416n53j89j195M32L628J04m508r49P64M69L174q78m381
269e099J913J780k145K677J198k166J972j088k945N579L131l698o03j146p60M845
285C445N45l850R53p75k099J655J359n91J24l371k856K752M122l37k801k794k88
302d807K740L026j221j576J04m14m66L035J644p73j279l062n2N479J822l178k053
319a031j643J306L560k86k434L88j317j529K523J320L7m21l658j064L998K920
335B669j351j928k083N57K823N91r94q6m92j506K42J713J169p32k148k127J092
352b591L697j13k191j195j67J392J457o00o56P46o88q39J764J099N87r39k206
369a443L11K484L89p50j125n84Q15N28p47k3K84m77m40n87Q67J337q55j100p20
$$ plain form
388 -1836 -339 677 712 -218 -6 760 739 390 212 937 2219 1233 132 317 675 1401 551 -524 -748
407 -748 -270 -725 -1255 -1019 -973 -1070 -2050 -2832 -1725 -945 -930 -1486 -1930 -1708 -603 -476 -290 -77 81 416 -245
428 -245 247 1420 1831 613 -49 -285 765 1550 1132 540 48 -306 588 483 722 481 854 -1217 -473
447 -473 1454 744 666 -614 -1347 22 1353 1216 739 -983 -562 549 505 460 381 -713 -846 -726 -45
466 -45 546 55 -727 -823 -933 73 635 291 39 172 -428 126 649 576 743 407 -508 -122 729 751 1213
487 1213 -160 -1229 -424 -246 -133 632 -318 -1279 -712 -448 -58 185 -568 -1145 -1114 -495 437 132 -426 -150
507 -150 -546 -464 1086 822 425 754 576 1310 1698 1274 1423 1490 1145 1640 1145 867 1715 939 274 130 -100
528 -100 -209 374 -80 -340 -700 -1379 -573 61 -639 -607 -861 -1661 -918 419 22 -85 -548 -711 380 1091
$$ packed form
388a836J497J016L5r30K12P66k1l49j78P25J282r86j101J85L58P26q50j075k24
407g48M78m55n30K36M6r7r80p82J107P80J5n56m44K22J105J27J86K13J58L35o61
428b45M92J173M11j218o62k36J050P85m18n92m92l54Q94j05K39k41L73k071P44
447d73J927p10p8j280p33J369J331j37m77j722M21J111m4m5p9j094j33J20O81
466d5N91m91p82r6j10J006N62l44k52J33o00N54N23p3J67l36r15L86Q51K2M62
487A213j373j069Q05J78J13P65r50r61N67K64L90K43p53n77L1O19R32l05n58K76
507a50l96Q2J550k64l97L29j78P34L88m24J49O7l45M95m95k78Q48p76o65j44k30
528a00j09N83m54k60l60o79Q06O34p00L2k54q00P43J337l97j07m63j63J091P11
$$ plain form
548 1091 1261 428 -548 201 612 358 743 422 -960 -699 -384 -61 364 -14 -768 -559 -495 283 429 -306
568 -306 -49 216 -182 108 936 875 1179 481 -3 199 624 1103 936 -98 -411 475 407 494 388 -127 -403
589 -403 3 41 335 730 125 -392 -86 566 1531 916 -225 -30 365 683 902 487 -4 126 -287 221
609 221 31 -23 -298 -493 -647 -80 -181 -564 -517 -898 -476 -290 -417 -299 -142 -62 -72 -135 -357 -90 586 256
631 256 152 416 256 641 719 527 449 368 348 758 631 503 592 171 177 477 643 314 105 107 87 381 278 -114
655 -114 -51 318 144 -39 11 227 -5 1 104 -303 27 -23 -79 3 -72 -254 -46 212 52 583 13 -236 -285
678 -285 -141 18 409 51 -456 -346 39 -29 319 -227 -133 -201 -84 235 329 -254 -62 -115 -201 258 344 165 -170
701 -170 -90 360 298 144 205 107 414 15 224 315 241 48 81 123 375 197 450 90 -59 -47 48 25 42 73 2
$$ packed form
548A091J70q33r76P49M11k54L85l21j382K61L15L23M25l78p54K09O4P78J46p35
568c06K57K65l98K90Q28o1L04o98m84K02M25M79j67j034l13Q86o8Q7j06n15k76
589d03M06L8K94L95o05n17L06O52R65o15j141J95L95L18K19m15m91J30m13N08
609B21j90n4k75j95j54N67j01l83M7l81M22J86j27J18J57Q0j0o3k22K67O76l30
631B56j04K64j60L85P8j92p8q1k0M10j27j28Q9m21OL00J66l29k09Kk0K94j03l92
655a14O3L69j74j83N0K16k32OJ03m07L30n0n6Q2p5j82K08K58j60N31n70k49m9
678b85J44J59L91l58n07J10L85o8L48n46R4o8J17L19R4n83J92n3q6M59Q6j79l35
701a70Q0M50o2j54O1r8L07l99K09R1p4j93L3M2K52j78K53l60j49J2R5k3J7L1p1
$$ plain form
726 2 -157 16 -89 -15 -72 -194 -188 -293 76 -101 -21 111 -355 48 216 40 113 -24 8 91 -88 -18 170 21
750 21 -249 -26 -165 48 113 185 55 -139 -75 102 202 -102 103 35 50 -131 167 165 159 235 -49 63 336 167
774 167 49 72 3 156 31 206 97 267 -128 283 -85 -120 -138 105 158 181 -43 -218 -1 57 -68 -103 293
797 293 -160 124 97 50 200 149 119 71 7 46 -167 -21 -126 139 9 135 108 217 -201 -63 80 -37 175
820 175 -148 -56 159 76 10 20 -171 -167 38 -129 -127 -100 16 62 -139 21 -218 -58 42 -47 -107 56 -81 -308
844 -308 232 109 -6 -103 -58 154 33 -19 -120 -168 44 13 32 17 10 -125 0 30 -440 -143 -119 103 -97 -260
868 -260 178 -57 78 314 -194 13 -20 210 64 245 123 147 -17 29 -21 -190 107 161 70 133 141 -33 -9 -38
892 -38 -134 -108 59 82 -73 72 -144 102 29 -142 -104 -147 -142 65 -134 -32 117 17 15 -111 -102 29 116 -75 -141
$$ packed form
726Bj59J73j05P4n7j22Oj05L69j77Q0J32m66M03J68j76P3j37L2Q3j79P0J88j49
750B1k70K23j39K13O5P2j30j94O4J77J00l04K05o8J5j81K98koP6k84J12K73j69
774A67j18K3o9J53j25J75j09J70l95M11l68l5j8K43N3K3k24j75K17N8j25l5L96
797B93m53K84k7m7J50n1l0m8o4L9k13J46j05K65j30J26k7J09m18J38J43j17K12
820A75l23R2K15q3o6J0j91MK05j67KK7J16M6k01J60k39J60J00q9o0J63j37k27
844c08N40j23j15r7M5K12j21n2j01m8K12l1J9j5pj35J25L0m70K97K4K22k00j63
868b60M38k35J35K36n08K07l3K30j46J81j22K4j64M6n0j69K97N4r1O3Qj74K4k9
892c8r6K6J67K3j55J45k16K46p3j71L8m3NK07j99J02J49j00kj26RJ31Q7j91o6
$$ plain form
917 -141 -109 -122 -12 83 -92 -344 -232 -208 -196 70 -13 -190 -75 59 239 -104 -234 244 -149 -88 -204 181 -22
940 -22 78 106 -103 -164 162 141 -3 -18 131 16 33 195 300 194 124 142 -86 299 168 -55 -37 129 143 -54
964 -54 199 112 33 71 31 15 -108 42 32 -151 -184 -332 64 -64 -15 -254 35 -231 -344 -160 -188 -62 -321 -85
988 -85 -191 -389 74 -117 -120 -80 105 -63 50 113 106 -16 28 268 89 40 218 290 310 99 198 28 104 53 39
1013 39 80 93 -34 194 78 90 -12 244 16 -18 -139 -220 30 238 74 -133 -138 -218 -28 151 -88 -33 -26 -255
1037 -255 -113 -286 -15 -23 -139 -355 -296 -295 19 93 -21 -80 100 24 32 -18 -141 -343 77 -89 173 277 -2 -118
1061 -118 -156 -199 181 311 204 -202 -133 -27 393 31 140 -155 -77 212 306 387 174 330 268 378 -29 387
1083 387 370 194 271 -43 -69 252 -207 -12 80 37 -92 -123 -204 -169 25 -129 -7 10 -180 164 121 -123 -277
$$ packed form
917a41L2j3J10R5j75k52J12K4J2K66q3j77J15J34J80l43j30M78l93O1j16L85k03
940b2J00K8k09o1L26k1j44j5J49j15J7J62J05j06p0J8k28L85j31k23J8J66J4j97
964e4K53q7p9L8m0j6j23J50j0j83l3j48L96j28M9k39K89k66j13J84k8J26k59K36
988h5j06j98M63j91lM0J85j68J13O3pj22M4K40j79m9J78P2K0k11R9j70P6n1j4
1013C9M1J3j27K28j16J2j02K56k28l4j21q1K50K08j64k07nq0J90J79k39N5Pk29
1037b55J42j73K71qj16k16N9JL14P4j14n9J80p6Qn0j23k02M20j66K62J04k79j16
1061a18l8m3L80J30j07m06O9J06M20l62J09k95P8K89R4Q1k13J56o2J10m07M16
1083C87j7j76P7l14k6L21m59J95R2m3j29l1q1L5J94j54J22J7j90L44m3k44j54
$$ plain form
1106 -277 29 45 -140 -82 -61 -153 -205 -58 -26 -31 -71 59 -102 266 237 95 153 45 20 306 298 140 324 288 205
1131 205 441 -32 119 113 -35 -143 34 51 85 104 -70 -234 -50 130 314 215 24 -66 11 -87 190 -85 99
1154 99 -114 -34 -12 239 214 156 185 58 -281 97 247 -127 -73 -209 -50 117 7 128 -152 -23 -31 -162 88
1177 88 20 95 -13 -201 -14 -133 115 28 187 82 -20 287 43 147 168 -139 73 154 80 216 100 -78
1199 -78 65 62 295 419 119 7 13 -24 321 285 234 75 312 151 206 61 -257 -94 72 -49 56 178 95
1222 95 -249 -351 -2 291 1 -70 -4 -182 -78 38 -228 112 315 -266 -300 -55 102 97 355 116 322 6
1244 6 314 208 350 187 -82 -171 -65 69 114 209 -371 -19 -157 104 144 17 123 -28 -18 -106 95 135 159
1267 159 126 78 -52 143 19 387 24 186 162 310 318 191 60 77 -40 37 151 -35 52 248 -227 -41 -21
$$ packed form
1106b77L06J6j85N8K1r2n2J47L2nm0J30j61L68k9j42N8j08k5K86qj58J84l6q3
1131B05K36m73J51oj48j08J77J7L4J9j74j64J84J80J84r9j91r0P7r8K77k75J84
1154I9k13Q0K2K51k5n8K9j27l39L78J50l74N4j36J59J67j10J21k80J29qj31K50
1177H8o8P5j08j88J87j19K48q7J59j05j02L07k44J04K1l07K12Q1p4J36j16j78
1199g8J43lK33J24l00j12Ol7L45l6n1j59K37j61N5j45l18J63J66j21J05J22q3
1222I5l44j02L49K93k90p1O6j78J04J16k66L40K03n81l4K45J57nK58k39K06l16
1244FL08j06J42j63k69q9J06J34M5R5n80L52j38K61M0j27J06j51J0q8K01M0K4
1267A59l3m8j30J95j24L68l63J62k4J48Qj27j31J7j17P7J14j86Q7J96m75J86K0
$$ plain form
1290 -21 98 16 -353 -122 -261 153 265 34 35 -59 350 189 427 338 -15 -105 268 161 337 127 182 50 240
1313 240 236 282 -16 176 -24 -18 -15 147 68 36 163 -2 17 187 273 249 126 204 46 207 199 178 135 85 -322 -22
1339 -22 181 -85 58 -157 0 -47 309 320 -84 67 32 15 109 65 323 121 59 144 175 111 104 80 -67 109 162
1364 162 37 75 -42 -161 -137 230 12 420 145 64 66 96 -25 26 108 133 -6 -208 -146 -71 90 -104 -142 -237
1388 -237 71 -42 428 125 -54 113 -12 137 262 -184 -52 -51 90 78 83 184 -49 -192 -15 266 -130 74
1410 74 128 66 -116 -86 36 141 189 195 -128 -41 85 64 92 59 101 70 86 85 367 81 2 100 285 -75 113 186
1436 186 325 129 56 200 137 202 71 8 140 -24 189 131 72 33 215 154 -121 155 22 26 -161 -230 252 -42
1460 -42 -254 -122 -117 62 98 -164 -96 22 48 15 261 164 17 -57 43 180 25 189 107 188 -271 213 93 14
$$ packed form
1290b1J19q2l69K31j39M14J12k31Jr4M09j61K38q9l53r0L73j07J76k10N5j32J90
1313B40mM6k98J92k00OLJ62p9l2J27j65J9J70Q6k4j23P8j58J61qk1m3n0m07L00
1339b2K03k66J43k15J57m7L56J1m04J51l5j7R4m4K58k02o2Q5L1o4pk4j47J76N3
1364A62j25L8j17j19K4L67k18M08k75q1KL0j21N1Q2K5j39k02O2P5J61j94l8r5
1388b37L08j13M70l03j79J67j25J49J25m46J32JJ41j2NJ01k33j43J77K81l96K04
1410G4N4o2j82L0J22J05M8Ol23Q7J26k1K8l3M2l1J6jK82k86p9R8J85l60J88P3
1436A86J39j96p3J44o3O5j31o3J32j64K13n8n9l9J82o1k75K76j33Mj87o9M82k94
1460d2k12J32NJ79L6k62O8J18K6l3K46r7j47p4J00J37j55J64q2Q1m59M84j20p9
$$ plain form
1484 14 -100 -212 123 82 11 -42 76 114 -100 -55 50 157 1 5 189 259 209 276 244 208 139 224 -44 165 58
1509 58 99 37 255 -37 -52 -108 -120 -93 12 35 246 -133 -113 -254 -334 -86 147 71 92 -15 80 315 175 57
1533 57 -141 -177 -185 -139 -56 -81 20 -16 -88 152 -27 -49 44 119 167 -59 110 -42 122 138 20 324 -67 50 -272
1558 -272 -74 198 -98 -162 34 207 243 -129 -149 81 -391 61 63 79 70 -41 38 -62 46 48 51 94 37 -189 -194 -72
1584 -72 95 -12 25 35 -91 251 -92 244 -126 26 -138 -111 28 -176 93 24 76 59 -62 44 90 -59 -206
1607 -206 -45 22 122 -161 -24 204 23 105 118 69 -32 -14 102 62 -26 5 -45 -89 -65 5 -160 -135 -112 -83 28
1632 28 52 82 129 364 189 -308 -161 -243 64 30 -93 13 246 176 -246 -270 -7 -95 83 -94 21 -6 -273
1655 -273 -45 132 -151 105 211 15 -102 2 43 228 4 271 -39 -106 321 -61 24 18 226 262 125 -93
$$ packed form
1484A4j14j12L35m1p1n3J18L8k14M5J05J07j56MJ84P0n0O7l2l6o9Q5k68K09j07
1509E8M1o2K18k92j5n6j2K7J05K3K11l79K0j41q0K48K33p6K1j07R5K35j40j18
1533E7j98l6qM6Q3k5J01l6p2K40j79k2R3P5M8k26J69j52J64J6j18L04l91J17l22
1558b72J98K72k96o4J96J73L6l72k0K30m72M52KJ6rj11P9j00J08KLM3n7k26nJ22
1584g2J67j07L7J0j26L42l43L36l70J52j64K7J39k04K69o9N2j7j21J06M6j49j47
1607b06J61O7J00k83J37K28j81Q2J3m9j01J8J16m0q8L1n0m4K4P0j65K5K3K9J11
1632B8K4L0M7K35j75m97J47q2L07l4j23J06K33p0m22k4K63q8J78j77J15k7k67
1655b73K28J77k83K56J06j96j17J04M1J85k24K67l10o7M27l82Q5oK08L6j37k18
$$ plain form
1677 -93 120 164 54 -81 -68 -33 64 57 -45 -407 -43 -81 -139 -149 7 -74 49 48 86 -133 -130 -66 -56 -100 63 77 -199
1704 -199 -22 33 154 115 -35 167 49 -63 -7 148 116 -108 44 204 22 -206 68 -98 -290 -28 -21 13
1726 13 -88 4 163 11 89 -35 133 91 54 99 -10 -94 158 -110 -207 -72 -44 75 -65 -116 96 121 -60 -132
1750 -132 -26 -183 -170 31 -30 -191 -107 -130 -220 -368 -7 -5 12 30 -207 68 16 -168 -231 -99 -49 142 -60 143
1774 143 237 -202 236 -64 100 -146 -56 -95 137 -28 -45 -191 7 -228 -193 -172 60 -33 37 170 -4 185 94
1797 94 -83 11 52 -56 64 -40 159 80 -87 -197 -62 231 -213 -107 115 272 -79 -94 5 -338 58 185
1819 185 -196 74 -19 -132 106 43 -199 51 -4 -121 -174 96 99 2 24 3 -70 131 94 383 -184 5 -403 -161
1843 -161 -268 66 -15 -174 -300 282 -15 -368 50 -371 346 -26 -449 854 867 113 -101 405 350 -116 617
$$ packed form
1677i3K13M4j10j35J3L5R7pj02l62L64l8n8j0J56q1J23jL8k19LO4J0m4J63J4k76
1704a99J77N5J21l9j50K02j18j12N6J55l2k24J52J60j82k28K74j66j92K62PL4
1726A3j01R2J59j52P8j24J68m2l7M5j09q4K52k68r7J35K8J19j40n1K12K5j81p2
1750a32J06j57J3K01o1j61Q4k3r0j48L61KJ7J8k37K75n2j84o3J32N0J91k02K03
1774A43R4m39M38l00J64k46R0l9K32j65j7j46J98k35L5K1K32r3P0J33j74J89r1
1797I4j77R4M1j08J20j04J99p9j67j10J35K93m44J06K22J57l51j5R9l43L96J27
1819A85l81K70r3j13K38o3k42K50n5j17n3K70Lr7K2k1p3K01l7K89n67J89m08K42
1843a61j07L34q1j59j26N82k97l53M18m21P17l72m23J303J3p54k14N06n5m66P33
$$ plain form
1864 617 -152 -634 97 552 371 346 -350 472 -293 -398 338 194 -200 243 159 206 -132 194 -352 -302 -131
1885 -131 217 -56 134 67 47 -42 -33 12 121 -32 -2 -145 116 171 -144 -4 66 -164 -25 -44 -48 39 -80 161
1909 161 90 169 -150 -173 -43 43 -213 -357 -23 -100 13 40 5 -90 -95 93 205 -86 -62 -99 112 -87 -124 71
1933 71 -53 177 220 36 41 125 -30 -220 80 58 271 -12 25 -106 48 56 10 40 -109 -46 37 134 44 186 -152
1958 -152 -30 80 20 206 -185 -95 62 -205 -159 0 -39 -189 -7 156 16 -35 264 -82 18 13 42 357 26
1981 26 -106 -83 -12 -63 160 -21 -183 40 50 33 243 -152 123 11 120 -27 81 121 82 -1 75 128 -140 245
2005 245 -32 -236 254 -63 107 -37 235 5 -58 -182 -20 -146 -210 113 245 -57 132 290 360 99 207
2026 207 41 -193 -220 214 -33 -125 -149 -257 14 204 29 -59 412 238 307 148 92 -142 198 77 70 187 -36
$$ packed form
1864F17p69m82P31M55j81k5o96Q22p65j05P36j44l94M43q4M7l38L26n46N0J71
1885a31L48k73J90o7k0q9RM5J09j53L0j43K61N5l15J40P0k30J39j9mQ7j19K41
1909A61p1P9l19k3J30Q6k56j44L34p7J13K7l5r5nJ88J12k91K4l7K11j99l7J95
1933G1j24K30M3j84NQ4j55j90L00k2K13k83L7j31J54Qm6L0j49O3Q3R7r0J42l38
1958a52J22J10o0J86l91R0J57k67M6J59l9j50J82J63j40n1K99l46J00nK9L15l31
1981B6j32K3P1n1K23j81j62K23J0j7K10l95K75j12J09j47J08M0l9q3P6N3k68L85
2005B45k77k04M90l17J70j44K72k30o3j24J62j26o4L23J32l02J89J58P0k61J08
2026B07j66k34k7M34k47r2k4j08K71J90j75q8M71j74O9j59n6k34L40j21pJ17k23
$$ plain form
2049 -36 68 -100 111 -186 97 -36 481 89 86 159 -27 10 89 319 103 322 140 -4 -111 196 -3 -40
2071 -40 42 -47 45 118 39 249 -173 33 -13 134 -51 64 -180 149 28 -21 36 14 243 -289 12 -123 280
2094 280 -119 104 -85 -35 244 -5 172 -79 -27 79 16 -62 81 -251 -225 -84 1 -27 -118 59 -100 142 -67
2117 -67 68 251 30 -25 2 -55 175 13 34 -99 173 -172 235 72 100 -72 131 158 -111 -90 33 318 2
2140 2 178 178 22 -121 105 353 163 -85 88 84 23 36 109 59 191 109 -14 -115 12 -58 279 238 -81 112
2164 112 46 0 14 -44 32 -94 -91 215 2 -52 -15 323 21 -66 132 156 -7 154 -54 -40 -68 -152 -24 179 -67
2189 -67 -149 83 -147 157 44 63 94 -11 84 -24 -40 -32 78 -29 -92 102 318 152 -82 73 -139 -184 2
2212 2 142 -13 162 -143 40 136 6 212 45 123 -32 58 263 116 369 -191 -39 -20 97 55 -12 -58 -400
$$ packed form
2049c6J04j68K11k97K83j33N17l92lP3j86L7P9K30k16K19j82j44j07L07j99l7
2071d0Q2q9R2P3p9K10m22K06m6J47j85J15k44L29j21m9N7k2K29n32L01j35M03
2094B80l99K23j89N0K79k49J77k51N2J06o3p8J43l32K6J41Q5k8r1J77j59K42k09
2117f7J35J83k21n5K7n7K30j62K1j33K72l45M07j63K8j72K03K7k69K1J23K85l16
2140BJ76%j56j43K26K48j90k48J73mo1J3P3n0J32q2j23j01J27p0L37m1l19J93
2164A12o6m6J4n8P6j26LL06k13n4L7L38l02q7J98K4j63J61k08J4k8q4J28K03k46
2189f7q2K32k30L04j13J9L1j05R5j08j6QJ10j07o3J94K16j66k34J55k12m5J86
2212BJ40j55J75l05J83R6j30K06j67P8j55R0K05j47K53n60J52J9J17m2o7m6l42
$$ plain form
2235 -400 249 -227 10 -128 5 -180 -48 -107 75 -99 -20 119 73 -76 -41 19 178 139 224 92 -31 37 268
2258 268 -14 24 75 159 203 32 297 -23 221 96 136 187 -28 94 -150 180 78 -156 -10 -91 -66 51 76
2281 76 15 177 -14 -9 16 -1 -41 40 159 191 119 30 -4 150 -81 56 -67 19 31 -240 35 -50 24 165 223 33
2307 33 -248 -175 -69 14 47 109 7 117 -18 -30 57 -86 -38 187 98 94 27 -59 -33 -141 65 37 -315 -118 -199
2332 -199 182 5 -90 60 -228 -139 -37 67 304 -71 108 -35 135 -1 161 -232 370 161 3 127 253
2353 253 428 9 96 3 -58 -87 98 159 281 143 -55 142 -107 -42 -58 19 12 -65 -1 -230 450 -25 227 -236
2377 -236 -44 -337 114 139 400 244 226 129 118 149 155 103 -190 78 -143 357 10 77 24 147 51 128 25 128
2401 128 -87 127 53 93 -90 -59 -7 -90 11 180 270 -31 -57 -58 12 -51 -125 -101 384 85 -66 74 236 282 73
$$ packed form
2235d00O49m76K37j38J33j85J32n9J82j74P9J39m6j49L5O0J59l9Q5j32j23O8K31
2258B68k82L8N1Q4M4j71K65l20K44j25M0N1k15J22k44L30j02k34J46q1K5J17K5
2281G6o1J62j91NK5j7m0Q1J19L2p2q9l4J54k31J37j23Q6J2k71K75q5P4J41N8j90
2307C3k81P3J06Q3L3O2j02J10j35j2Q7j43M8K25q9mo7q6K6j08K06k8l52J97q1
2332a99L81j77r5J50k88Q9J02J04K37l75J79j43J70j36J62l93O02k09j58J24J26
2353B53J75m19Q7r3o1k9J85O1J22j38j98J97k49O5j6P7pp7O4k29O80m75K52m63
2377b36J92k93M51K5K61j56j8r7j1L1On2k93K68k21N00l47O7n3J23r6P7j03J03
2401A28k15K14p4M0j83L1N2q3J01J69R0l01k6jP0o3p4K4M85k99j51J40J62M6k09
$$ plain form
2426 73 78 -83 -23 288 91 -89 124 103 -387 16 79 161 322 -168 94 10 136 91 -103 -120 -7 159 -124
2449 -124 -109 -27 20 99 -57 -187 96 82 -89 -114 77 -85 -119 -50 -47 144 88 8 71 -131 27 -101 209 -221
2473 -221 155 232 246 67 68 210 -52 116 34 75 -65 40 215 301 92 69 72 -36 -57 245 62 39 46 -260 -34
2498 -34 -46 227 -50 225 -227 -66 -100 204 46 60 47 -93 13 78 -47 -67 -5 45 27 -29 231 -70 159 169
2522 169 -53 -307 -114 158 -34 109 -218 8 -286 17 228 143 60 15 179 76 256 -35 -20 72 -34 165
2544 165 -70 189 -128 -124 -216 -146 99 -191 -83 -30 64 -85 163 -106 -81 75 -48 -43 -97 -16 25 -153 -71 -108 35
2569 35 -7 159 -164 -80 15 38 -54 241 99 15 264 40 34 70 -26 71 -157 -210 -120 45 -37 -217 203 217 -164
2594 -164 7 -63 -161 -199 -88 -71 -62 8 189 117 -9 57 71 -57 58 81 -47 86 25 -342 -248 85 -214 93
$$ packed form
2426G3Nj61O0L11j97j80K13k1m90M03O3Q2J61m90K62q4J26m5j94j7J13J66k83
2449a24J5Q2M7P9j56j30K83j4j71k5J91j62l4O9LJ91n6q0O3k02J58j28L10m30
2473b21L76P7J4j79JJ42k62J68q2M1j40J05J75Q6k09k3Lj08k1L02j83k3Pl06K26
2498c4j2K73k77K75m52J61l4L04j58J4j3j40J06O5j25k0O2N0j8n6K60l01K29J0
2522A69k22k54J93K72j92J43l27K26k94L03K11q5q3m5J64j03J80k91J5R2j06J99
2544A65k35K59l17Mr2P0K45k90J08N3R4j49K48k69K5J56j23Nn4Q1M1j78Q2l7J43
2569C5m2J66l23Q4R5K3r2K95j42q4K49k24oL6r6R7k28n3R0J65q2j80M20J4l81
2594a64J71p0r8l8J11J7RP0J81p2j26O6J4j28J15K3j28J33o1l67R4L33k99L07
$$ plain form
2618 93 155 0 14 234 85 -211 36 -286 13 95 -187 -41 113 -37 270 387 -235 30 39 -187 124 124 114
2641 114 284 -151 -121 118 144 74 -167 7 -12 41 -44 -108 162 92 197 192 60 7 -16 101 0 -20 217 69
2665 69 -36 30 16 97 -171 -193 -58 -293 70 -27 10 -107 84 -105 159 -4 -78 41 -145 14 18 -182 15
2688 15 29 133 -125 63 -13 186 68 -130 42 25 -48 49 92 -155 22 -29 213 189 97 -22 -118 245 305 62
2712 62 -212 33 -67 -5 10 70 -59 -141 69 -168 -161 -334 42 212 66 75 -208 104 -4 -182 60 -34 -59 135
2736 135 -111 2 -41 28 80 -221 4 -158 -310 -292 -117 180 -34 190 351 82 14 121 77 212 222 -105
2758 -105 51 -174 7 -12 -118 0 -348 6 -137 119 47 -160 182 127 -38 -59 126 152 226 70 51 -81
2780 -81 -42 56 -163 -22 -228 -161 56 -317 58 226 -6 39 -130 -298 11 -153 -49 132 -47 203 267 -185
$$ packed form
2618I3O2j55J4K20j49k96K47l22K99Q2k82J46J54j50L07J17o22K65Rk26L11%j0
2641A14J70m35L0K39K6p0k41J74j9N3q5o4K70p0J05nj32n3k3J17j01k0K37j48
2665F9j05O6j4Q1k68k2J35k35L63r7L7j17J91j89K64j63p4J19j86J59Mk00J97
2688A5J4J04k58J88p6J99j18j98J72j7p3R7M3k47J77n1K42k4r2j19r6L63O0k43
2712F2k74K45j00O2J5O0j29q2K10k37Pj73L76J70j46Rk83L12j08j78K42r4k5J94
2736A35k46J13m3O9N2l01K25j62j52J8J75K97k14K24J61k69o8J07m4J35J0l27
2758a05J56k25J81j9j06J18l48L54j43K56p2k07L42n5j65k1J85K6P4j56j9j32
2780h1L9R8k19J41k06O7K17l73L75J68k32M5j69j68L09j64J04J81j79K50O4m52
$$ plain form
2802 -185 -154 -137 119 -251 -17 98 110 -42 21 -133 118 -118 25 187 -136 17 125 0 -52 33 259 -76
2824 -76 44 -15 -51 -68 -2 -202 -57 39 -126 149 -171 -364 139 214 68 -120 121 -46 -28 -39 63 39 50 68
2848 68 32 -135 -291 12 45 -290 217 -168 -211 213 46 -15 203 47 -98 214 -61 -67 175 100 45 -160 18
2871 18 213 230 20 -159 -90 30 18 -54 -65 -100 -81 -146 -14 -165 181 -61 -258 -126 -53 -35 80 130 -40 126
2895 126 256 -204 -40 -31 132 -99 -27 96 91 -261 176 -107 -5 -26 183 -15 -62 -80 -210 113 137 196 -228
2918 -228 401 -18 171 250 -131 248 -40 -70 226 -50 -40 -167 -69 -42 14 -127 142 134 -13 -30 208 94 -123
2941 -123 -25 50 -140 -17 13 -64 198 154 -101 145 -218 119 54 -35 23 95 -108 -90 -168 272 68 44 -454 76
2965 76 -34 -116 33 -69 59 121 199 21 -42 -90 43 166 214 86 -99 48 210 -270 -90 57 140 54 207
$$ packed form
2802a85L1J7K56l70K34J15J2j52O3j54K51k36J43J62l23J53J08j25n2Q5K26l35
2824g6J20n9l6j7O6k00J45R6j65K75l20j93N03P5j46j88K41j67J8j1J02k4J1J8
2848F8l6j67j56L03L3l35N07l85m3M24j67o1K18j56j45L12k75oK42p5n5k05J78
2871A8J95J7k10j79O9J20j2p2j1l5J9o5J32j51L46k42j97J32P3J8J15N0j70J66
2895A26J30m60J64RJ63k31P2J23nl52M37k83J02k1K09j98m7j8j30L23K4N9m24
2918b28O29m19J89P9l81L79k88l0K96k76J0j27R8K7N6j41K69qj47j7K38j14k17
2941a23R8P5j90J23L0p7K62m4k55K46l63L37o5q9N8P2k03J8p8M40k04k4m98N30
2965G6j10q2J49j02J28O2P8j78o3m8J33J23M8j28j85J47J62m80J80J47Q3q6J53
$$ plain form
2988 207 75 -87 206 -154 -91 97 -47 40 145 124 158 17 24 -89 71 140 101 130 -360 81 60 41 -333 41
3012 41 -149 -299 30 -40 249 35 207 268 93 62 1 163 161 159 30 -299 -79 90 -196 133 -72 14 206
3035 206 129 -151 107 6 -44 39 -43 -23 -181 -113 -46 302 47 -101 47 108 209 -152 5 -163 -113 -254 69
3058 69 -149 225 39 -66 -123 133 133 149 105 197 -72 223 143 -250 7 36 91 38 -384 221 -196 32 118 41
3082 41 55 -128 -386 -198 168 10 -4 -214 50 17 -146 26 -74 -182 14 -56 -74 159 -75 -13 97 -142
3104 -142 56 -190 323 187 136 93 107 17 -102 164 -12 112 -81 -14 -137 41 128 -27 -222 -23 -168 -220
3126 -220 48 178 -188 -173 45 -49 95 -228 2 240 69 29 -175 155 -156 -69 139 -65 22 158 73 115
3148 115 -246 308 223 202 27 -193 -123 -101 175 229 13 38 -46 96 78 -213 -82 12 -9 93 108 -146 -29 -201
$$ packed form
2988B07j32j62K93l60O3J88j44Q7J05k1L4j41Pj13J60O9l9K9m90M41k1j9l74L74
3012D1j90j50L29p0K89k14J72O1j75l1o1J62kkj29l29K20J69k86L29k05Q6J92
3035B06p7k80K58j01n0Q3q2K0j58O8O7L48k55j48J48O1J01l61J57j68N0j41L23
3058F9k18L74j86j05n7K56%J6m4R2k69K95q0l93K57K9N5n3m22O05m17K28Q6p7
3082D1J4j83k58J88L66j58j4k10K64l3j63J72j00j08J96p0j8K33k34O2J10k39
3104a42J98k46N13j36n1m3J4r0j19K66j76J24j93O7j23J78Q7j55j95J99j45n2
3126b20K68J30l66J5K18r4J44l23K30K38j71m0k04L30l11Q7K08k04Q7J36q5M2
3148A15l61N54q5k1j75k20P0K2K76N4k16K5q4J42j8k91J31R4k1J02J5k54J17j72
$$ plain form
3172 -201 -8 -42 -247 -176 -144 13 166 -4 -35 238 -179 50 -89 -209 -1 -133 -66 -218 258 -118 -113 -103 -219
3195 -219 -130 96 115 -149 133 235 98 55 40 -76 7 227 77 7 67 100 -203 -76 -334 30 -275 -28 -59
3218 -59 -143 -22 87 103 28 102 -93 -203 -139 -26 211 38 -228 -211 208 -67 -239 81 211 122 151 40 204
3241 204 -189 16 37 -79 29 -262 -26 13 -133 -58 55 54 -164 -102 -121 -159 125 6 -246 129 58 21 -49 -70
3265 -70 -51 100 98 196 5 251 -43 49 164 221 8 18 62 31 170 141 104 15 109 113 -208 32 -91 193 50
3290 50 -99 1 -107 -26 -351 -125 -71 -209 10 -272 11 -271 55 -63 152 264 -66 -35 -105 11 -58 13
3312 13 196 93 -377 28 201 32 -108 77 -56 -135 -195 51 67 -165 -43 -80 173 -169 106 5 -396 22
3334 22 123 73 -74 -99 95 33 61 -223 -151 30 102 -18 -144 4 -100 1 -74 -90 35 -44 -146 -97 -20 -35
$$ packed form
3172b01J93l4k05P1L2J57J53j70l1K73m17K29j39j20K08j32O7j52M76l76NJ0j16
3195b19Q9K26J9k64K82J02j37m3j5j16Q3K20j50p0O0L3l03J27k58L64l05K47l1
3218e9q4J21J09J6p5P4j95j10O4J13K37j73k66J7M19k75j72L20J30q9K9j11J64
3241B04l93K05K1j16J08k91K36L9j46P5J13jk18O2j9l8K84j19k52L75p1l7p0k1
3265g0J9J51kR8j91K46k94R2J15N7k13J0M4l1J39k9l7q9R4Ml21K40j23K84j43
3290E0j49J00j08Q1l25K26N4j38K19k82K83k82L26j18K15J12l30L1p0J16o9P1
3312A3J83j03m70M05J73j69j40J85j33p9o0K46J6k32J22l7K53l42K75j01m01M18
3334B2J01n0j47k5J94o2K8k84P2J81P2j20j26J48j04J01p5j6J25p9j02M9P7j5
$$ plain form
3358 -35 -45 -54 -85 -20 -92 -146 150 -26 -123 -90 158 -65 -148 86 -47 84 -12 281 -167 152 -103 -169 -19 -135
3382 -135 -37 -214 -7 -74 -104 107 -40 -135 269 51 -276 -23 0 -36 153 -59 -188 190 75 -47 45 -24 9
3405 9 128 -22 229 69 -87 -74 128 -104 53 -213 -229 -169 25 -112 -150 326 -156 182 88 201 -175 38
3427 38 143 -63 -136 6 86 169 151 -41 59 -138 17 -102 174 58 -164 172 32 17 -26 -133 53 -22 -251
3450 -251 197 163 1 -38 190 -91 -63 151 -216 -108 -48 236 -133 -29 30 -6 186 -47 -67 -52 146 -118 -99
3473 -99 -78 -181 -68 -37 157 186 128 243 -107 106 -97 171 14 29 -122 -82 -10 -44 -119 18 141 -121 240
3496 240 264 68 211 0 -2 48 144 -167 -251 -220 -167 -34 -190 -30 176 -26 -5 33 122 117 -187 -66 42 345
3520 345 17 -123 185 -263 249 80 0 266 -31 19 514 -367 -250 37 23 -119 76 -73 -21 -20 21 -133
$$ packed form
3358c5j0rl1O5p2n4K96j76r7L3K48k23q3K34j33J31r6K93m48L19k55o6J50j16
3382a35R8j77K07o7l0K11j47r5M04k18l27K53K3l6J89k12j29L78j15j22R2o9L3
3405IJ19j50K51j60j56J3K02k32J57k66j6O0J94j37l8M76m82L38r4J13l76K13
3427C8J05k06p3J42Q0Q3j8j92J00j97J55j19K76j16k22L36j40j5m3j07J86p5k29
3450b51M48l4j62l9K28k81K8K14l67J08O0K84l69J04N9l6J92k33k0J5J98k64J9
3473i9K1j03J13L1J94K9n8J15l50K13k03K68j57J5j51M0P2l4p5J37J23k62L61
3496B40K4j96J43k11kN0R6l11q4L1N3J33j56J60K06k02K1L8Q9nl04J21J08L03
3520C45l28j40L08m48N12j69q0K66k97N0M95q81J17K87j4j42J95j49N2JM1j54
$$ plain form
3542 -133 161 133 27 24 49 20 244 204 -93 42 -15 11 -88 47 210 -20 -296 -46 90 -164 34 96 23 115
3566 115 19 -150 -139 72 -2 -291 -9 -56 -109 -42 -395 -32 80 -172 -25 -67 265 1 35 293 85 -54 -79
3589 -79 -10 -165 58 81 -240 98 -82 -108 -175 113 162 51 -74 8 -37 -36 -113 -231 38 114 22 367 42 174
3613 174 136 182 -61 -57 -102 161 120 -197 147 109 -11 -67 89 -92 -74 -172 -55 218 69 129 80 -102 -42 85
3637 85 169 -16 67 96 101 195 215 -207 9 292 85 24 178 -140 -141 75 -383 109 -193 -276 291 -137 85 -89
3661 -89 -131 -41 -232 -60 -17 -18 -116 -12 1 -156 -98 128 -170 -11 21 78 -203 -182 -92 -49 2 -194 -9 188 -119
3686 -119 86 -52 53 -112 146 241 -55 73 -104 89 340 -844 -250 437 -220 -306 27 90 -369 243 -255
3707 -255 390 -306 56 -485 37 349 -45 277 750 215 130 882 -132 -64 339 713 140 -313 228 -245
$$ packed form
3542a33K94k8j06lK5k9K24m0k97J35n7K6r9J35J63k30k76K50J36k54J98O2p3R2
3566A15r6j69J1K11p4k89K82m7n3O7l53L63J12k52J47m2L32k64L4K58k08j39k5
3589g9O9j55K23K3l21L38j80k6o7K88M9j11j25Q2m5Jp7j18K69P6r2L45l25J32
3613A74l8M6k43Mm5K63m1l17L44l8j20n6J56j81J8r8J17K73j49O0m9j82O0J27
3637H5Q4j85Q3K9NR4K0m22K16K83k07o1J54l18jK16m58M92l02q3N67m28K22j74
3661h9m2R0j91J72M3jr8J04J3j57N8K26k98J59L2N7k81K1R0M3N1j96J85J97l07
3686a19K05j38J05j65K58R5k96J28j77J93K51j184N94O87o57q6L33O3m59O12m98
3707b55O45o96L62n41N22L12l94L22M73n35q5P52j014O8M03L74n73m53N41m73
$$ plain form
3727 -245 -216 -150 -113 -227 -368 -63 -396 271 -17 -129 125 275 209 419 325 76 518 716 137 -28 -178 106
3749 106 661 183 594 445 -94 268 705 -61 875 700 44 124 552 -21 212 17 -358 -546 451 931
3769 931 -463 -36 -278 -273 528 62 176 -401 -63 -187 -434 -255 -233 49 223 256 384 -110 121 299 -220
3790 -220 -176 -224 39 -321 -10 344 -142 201 85 -154 310 164 258 -156 -259 -496 -212 -251 83 42 -159 -450
3812 -450 31 -626 420 -116 -637 -50 358 -63 -154 -8 63 157 -134 22 342 -36 127 9 332 -470 211
3833 211 7 407 -50 -207 79 -290 6 -331 57 -135 82 216 135 118 78 -132 49 13 -25 55 63 -229 -162
3856 -162 133 -57 -229 59 125 61 -95 141 -125 -50 -38 184 181 161 -92 -171 -13 276 62 -44 -53 99 -211
3879 -211 -12 -408 -82 -2 -234 266 -323 -93 102 -115 113 55 258 49 274 -4 189 245 -169 154 -157
$$ packed form
3727b45K9O6L7j14j41L05l33O67k88j12K54J50o6K10r4k49M42J98n79j65j50K84
3749A06N55m78M11j49n39L62M37p66R36j75o56Q0M28n73K33j95l75j88R97M80
3769I31j394M27k42NQ01m66J14n77L38j24k47J79K2K82J74L3J28m94K31J78n19
3790b20M4m8K63l60L11L54m86L43j16k39M64j46R4m14j03k37K84l9L34m1k01k91
3812d50M81o57J046n36n21N87M08m21r1J46P1R4k91J56L20l78J63j18L23q02O81
3833B11k04M00m57j57K86l69K96l37L88j92K17J34q1j7m0k10J81l6l8Q0Qk92O7
3856a62K95j90j72K88O6o4j56K36k66P5J2K22lk0k53p9J58K89k14j06rJ52l10
3879b11J99l96L26Q0k32N00n89K30J95k17K28n8K03k09K25k78J93N6m14L23l11
$$ plain form
3900 -157 0 -154 -122 174 -60 43 87 -116 95 -30 68 192 189 -145 -251 200 30 88 -58 101 -148 133
3922 133 -207 -4 126 49 253 -78 114 80 1 153 -177 -55 -140 140 -117 -116 12 -186 141 2 139 133 -149
3945 -149 265 -108 -185 24 -28 228 95 -100 84 219 91 -119 66 -153 19 -21 -56 135 11 46 96 -43
3967 -43 175 -373 -260 -44 118 2 -220 -261 20 -8 -137 93 -40 -77 -129 56 35 -166 -107 -115 -139 -94 17 -16
3991 -16 27 -35 -137 95 84 -129 103 23 -106 68 -88 -91 108 -55 -41 67 -147 -132 -155 256 49 11 7 -60 -59
4016 -59 -31 60 68 -127 -100 144 -72 95 -96 14 -113 57 81 -149 -57 55 165 163 34 25 -148 -210 196 52
4040 52 -64 80 221 89 73 -81 2 213 -2 -6 134 167 14 -101 113 26 -116 245 -203 177 48 71 118
4063 118 -95 -145 -263 218 317 -2 -2 32 -89 45 65 46 95 -284 -66 -37 67 191 -266 -119 -11 -78 -185
$$ packed form
3900a57J57j54L2K96k34J03M4k03K11j25R8J24ll34j06M51j70N8j46J59k49K81
3922A33l40K03J30p7K04l31J92l4p9J52l30J22q5K80k57JJ28j98L27j39J37ok82
3945a49M14l73p7K09n2K56j33j95J84J35j28k10J85k19J72m0l5J91j24L5N0j39
3967d3K18n48J13K16J62j16k22m1K81k8j29K30j33l7n2J85k1k01N9qk4M5J11l3
3991a6M3o2j02K32j1k13K32q0j29J74j56lJ99j63J4J08k14J5k3M11k07l8mo7J
4016e9K8R1Qj95K7K44k16J67j91J10j27J70K4k30R2J12J10kj29rj73o2M06j44
4040E2j16J44J41j32j6j54Q3K11k15mJ40L3j53j15K14q7j42L61m48L80j29K3M7
4063A18k13n0j18M81R9l19%L4j21J34K0j9M9l79K18K9J04J24m57J47J08o7j07
$$ plain form
4086 -185 46 -13 -155 55 -88 29 105 -92 -150 -39 -126 148 10 205 -2 -61 27 -124 167 40 -100 63
4108 63 133 7 -69 -139 44 -196 -125 -152 201 -187 -111 59 -68 -17 -83 -48 -103 185 66 -237 102 157 -18 -108
4132 -108 -83 95 9 5 202 9 45 -115 -157 103 -91 -326 -93 -85 11 50 7 80 -51 0 40 -129 171 38 -120
4157 -120 167 -130 -265 -134 27 60 -103 311 292 37 -49 107 54 -163 72 262 95 83 -39 -149 25 -108
4179 -108 -72 -98 152 -99 -139 75 335 198 80 -198 -127 160 -172 -82 30 -189 60 11 98 -175 149 63 -226
4202 -226 14 5 30 -21 -93 20 124 -59 -2 -144 75 1 21 15 -35 73 -72 84 -18 80 -134 -165 -110 -162 0
4227 0 217 -127 -61 -94 175 -114 -116 230 -336 -19 -75 -110 -152 -40 -192 149 -82 153 -64 -7 -59 59 5 18
4251 18 87 -37 -110 409 -12 -148 -13 -103 -38 -155 44 73 -133 209 16 -61 156 5 246 60 -21 198 -70
$$ packed form
4086a85K31n9j42K10j43J17P6j97n8J11q7K74j38J95k07n9Q8j51K91j27j40J63
4108F3P0j26p6p0J83k40P1k7L53l88P6J70j27N1o6L5n5K88j19l03L39N5j75r0
4132a08K5J78q6mJ97j93L6j60m2K60j94k35K33QR6L9m3P3j31N1M0j69L00j33j58
4157a20K87k97j35J31J61L3j63M14j9k55q6J56n3k17K35J90j67j2j22j10J74j33
4179a08L6k6K50k51m0K14K60j37j18k78P1K87l32R0J12k19K49m9Q7k73L24q6k89
4202b26K40rK5n1p2J13J04j83N7j42K19p4K0on0J08j45J56j02R8k14l1N5n2J62
4227@K17l44O6l3K69k89kL46n66L17n6l5m2J12j52L41k31K35k17N7n2J18n4J3
4251A8O9j24p3N19m21j36J35r0O5j17J99K9k06L42j93p7K17j51K41j86q1K19k68
$$ plain form
4274 -70 262 -2 193 4 210 -12 -6 -67 -182 92 73 -62 130 -11 65 -45 -187 -187 -59 -195 75 18 -47
4297 -47 19 51 18 52 118 146 194 -231 -141 -196 14 44 -130 -116 -6 245 -60 318 65 130 154 -202 30 133 362
4322 362 -93 -46 139 -4 35 -257 33 56 -1 -114 -108 -21 -161 -319 -9 63 38 -112 109 11 123 239 -137
4345 -137 -188 165 -63 336 209 120 56 -162 66 -89 91 -88 -146 141 55 78 -8 195 70 -66 -126 -89 24
4368 24 197 100 116 185 272 72 215 296 155 249 -144 -7 -45 57 -102 106 10 169 -82 194 43 -189 -85
4391 -85 81 8 231 -1 -49 -6 -60 -133 141 -20 228 161 -117 128 -184 -93 -1 -83 -32 64 201 -140 -5 -77
4415 -77 -23 232 -171 -37 -88 44 -75 -236 -84 0 43 38 186 92 82 15 -146 -36 -15 -34 116 215 265 32 78
4440 78 106 2 164 191 104 15 209 29 -74 -124 114 -27 21 -275 -4 -152 204 -109 141 229 -60 139 -170
$$ packed form
4274g0L32k64J95j89K06k22Oo1j15K74j9j35J92j41P6j10j42%J28j36K70n7o5
4297d7O6L2l3L4O6K8M8m25R0n5K10L0j74J4J10K51l05L78k53O5K4l56K32J03K29
4322C62m55M7J85j43L9k92K90K3n7j13OQ7j40j58L10P2k5j50K21r8J12J16l76
4345a37n1L53k28L99j27q9o4k18K28j55J80j79n8K87q6K3q6K03j25j36o0L7J13
4368B4J73r7J6O9Q7k00J43Q1j41R4l93J37l8J02j59K08r6J59k51K76j51k32J04
4391h5J66p3K23k32m8M3n4p3K74j61K48o7k78K45l12R1R2q2N1R6J37l41J35p2
4415g7N4K55m03J34n1J32j19j61J52Q4M3nJ48r4j0o7j61J10K1j9J50R9N0k33M6
4440G8K8j04J62K7q7q9J94j80j03n0K38j41M8k96K71j48L56l13K50Q8k89J99l09
$$ plain form
4463 -170 151 -90 -176 222 -27 -89 -29 -16 -14 60 -172 232 -170 -159 168 81 94 -101 17 99 -65 -271 -195 69
4487 69 -129 27 181 172 -31 -134 108 142 75 109 -119 36 -49 34 154 141 26 -41 150 -21 195 -238 11
4510 11 -77 -181 171 14 102 -22 -11 136 -52 178 -212 23 1 140 -65 231 -27 -4 149 -94 -166 -38
$$ packed form
4463a70L21k41q6L98k49o2O0J3KP4k32M04m02J1L27q7J3j95J18Q2j64k06P6K64
4487F9j98J56J54rk03j03K42L4o7L4k28J55q5Q3J20j3j15o7J91j71K16m33K49
4510A1q8j04L52j57Q8j24J1J47j88K30l90K35k2J39k05K96k58K3J53k43p2J28
$$ [...]
8191d3
##END NTUPLES=NMR FID
##END=
