##TITLE=1H_LR-758-R4-KA1-CR2
 CCl4
 8 sc, 
 26.9.2023
##JCAMPDX= 6.0         $$ Bruker NMR JCAMP-DX V2.0
##DATA TYPE= NMR FID
##DATA CLASS= NTUPLES
##ORIGIN= UXNMR, Bruker Analytische Messtechnik GmbH
##OWNER= root
$$ XWIN-NMR		Version 3.5
$$ Tue Sep 26 14:37:15 2023 Russian Standard Time (UT+4h)  she@DPX200
##.OBSERVE FREQUENCY= 200.134
##.OBSERVE NUCLEUS= ^1H
##.DELAY= (6, 6)
##.ACQUISITION MODE= SIMULTANEOUS
##.ACQUISITION SCHEME= undefined
##.AVERAGES= 8
##.DIGITISER RES= 18
##SPECTROMETER/DATA SYSTEM= spect
##.PULSE SEQUENCE= zg30
##.SOLVENT NAME= CDCl3
##.SHIFT REFERENCE= (INTERNAL, CDCl3, 0, 15.7039)
##AUDIT TRAIL= $$ (NUMBER, WHEN, WHO, WHERE, WHAT)
$$ ##TITLE= Audit trail, XWIN-NMR		Version 3.5
$$ ##JCAMPDX= 5.01
$$ ##ORIGIN= Bruker BioSpin GmbH
$$ ##OWNER= she
$$ F:/spectra/data/she/nmr/H-F/1/audita.txt
$$ ##AUDIT TRAIL=  $$ (NUMBER, WHEN, WHO, WHERE, WHAT)
(   1,<2023-09-26 14:36:04.87 +0400>,<she>,<DPX200>,
      <created by zg, POWCHK disabled, PULCHK disabled
       configuration hash MD5:
       00 E9 B6 7A A2 85 ED C7 34 08 36 98 17 FE 4E 26
       data hash MD5: 16K
       14 02 A7 E6 C5 51 9A 44 6C E3 47 EA 8F 8C E0 38>)
$$ ##END=
$$ 
$$ hash MD5
$$ 01 21 DA 86 BC 9F 90 35 C6 F0 25 AB C8 97 D0 3A
##$RELAX= 
##$RELAX= 
##$RELAX= 
##$RELAX= 
##$RELAX= 
##$RELAX= 
$$ Bruker specific parameters
$$ --------------------------
##$DU= <F:/spectra>
##$EXPNO= 1
##$NAME= <H-F>
##$PROCNO= 1
##$TYPE= <nmr>
##$USER= <she>
##$AMP= (0..31)
100 100 100 100 100 100 100 100 100 100 100 100 100 100 100 100 100 100 
100 100 100 100 100 100 100 100 100 100 100 100 100 100 
##$AQSEQ= 0
##$AQ_mod= 1
##$AUNM= <au_zg>
##$AUTOPOS= <>
##$BF1= 200.13
##$BF2= 200.13
##$BF3= 200.13
##$BF4= 200.13
##$BF5= 200.13
##$BF6= 200.13
##$BF7= 200.13
##$BF8= 200.13
##$BYTORDA= 1
##$CFDGTYP= 0
##$CFRGTYP= 5
##$CHEMSTR= <none>
##$CNST= (0..31)
1 1 145 1 1 1 1 1 1 1 1 1 1 1 1 1 1 1 1 1 1 1 1 1 1 1 1 1 1 1 1 1 
##$CPDPRG= <>
##$CPDPRG1= <>
##$CPDPRG2= <>
##$CPDPRG3= <>
##$CPDPRG4= <mlev>
##$CPDPRG5= <mlev>
##$CPDPRG6= <mlev>
##$CPDPRG7= <mlev>
##$CPDPRG8= <mlev>
##$CPDPRGB= <>
##$CPDPRGT= <>
##$D= (0..31)
0 1.2 0 0 0 0 0 0 0 0.06 0 0.03 0 0 0 0 0.0002 0 0 0 0 0 0 0 0 0 0 0 0 
0 0 0 
##$DATE= 1695724564
##$DBL= (0..7)
120 120 120 120 120 120 120 120 
##$DBP= (0..7)
150 150 150 150 150 150 150 150 
##$DBP07= 0
##$DBPNAM0= <>
##$DBPNAM1= <>
##$DBPNAM2= <>
##$DBPNAM3= <>
##$DBPNAM4= <>
##$DBPNAM5= <>
##$DBPNAM6= <>
##$DBPNAM7= <>
##$DBPOAL= (0..7)
0.5 0.5 0.5 0.5 0.5 0.5 0.5 0.5 
##$DBPOFFS= (0..7)
0 0 0 0 0 0 0 0 
##$DE= 6
##$DECBNUC= <off>
##$DECIM= 32
##$DECNUC= <off>
##$DECSTAT= 4
##$DIGMOD= 1
##$DIGTYP= 9
##$DL= (0..7)
0 120 120 120 120 120 120 120 
##$DP= (0..7)
150 150 150 150 150 150 150 150 
##$DP07= 0
##$DPNAME0= <>
##$DPNAME1= <>
##$DPNAME2= <>
##$DPNAME3= <>
##$DPNAME4= <>
##$DPNAME5= <>
##$DPNAME6= <>
##$DPNAME7= <>
##$DPOAL= (0..7)
0.5 0.5 0.5 0.5 0.5 0.5 0.5 0.5 
##$DPOFFS= (0..7)
0 0 0 0 0 0 0 0 
##$DQDMODE= 0
##$DR= 18
##$DS= 0
##$DSLIST= <SSSSSSSSSSSSSSS>
$$ [...]
##$SUBNAM2= <"">
##$SUBNAM3= <"">
##$SUBNAM4= <"">
##$SUBNAM5= <"">
##$SUBNAM6= <"">
##$SUBNAM7= <"">
##$SUBNAM8= <"">
##$SUBNAM9= <"">
##$SW= 18.0514893171864
##$SWIBOX= (0..15)
0 0 2 0 0 0 0 0 0 0 0 0 0 0 0 0 
##$SW_h= 3612.71676300578
##$TD= 16384
##$TD0= 1
##$TE= 0
##$TE2= 300
##$TE3= 300
##$TEG= 300
##$TL= (0..7)
0 120 120 120 120 120 120 120 
##$TP= (0..7)
150 150 150 150 150 150 150 150 
##$TP07= 0
##$TPNAME0= <>
##$TPNAME1= <>
##$TPNAME2= <>
##$TPNAME3= <>
##$TPNAME4= <>
##$TPNAME5= <>
##$TPNAME6= <>
##$TPNAME7= <>
##$TPOAL= (0..7)
0.5 0.5 0.5 0.5 0.5 0.5 0.5 0.5 
##$TPOFFS= (0..7)
0 0 0 0 0 0 0 0 
##$TUNHIN= 0
##$TUNHOUT= 0
##$TUNXOUT= 0
##$USERA1= <user>
##$USERA2= <user>
##$USERA3= <user>
##$USERA4= <user>
##$USERA5= <user>
##$V9= 5
##$VALIST= <valist>
##$VCLIST= <CCCCCCCCCCCCCCC>
##$VD= 0
##$VDLIST= <DDDDDDDDDDDDDDD>
##$VPLIST= <PPPPPPPPPPPPPPP>
##$VTLIST= <TTTTTTTTTTTTTTT>
##$WBST= 1024
##$WBSW= 4
##$XGAIN= (0..3)
0 0 0 0 
##$XL= 0
##$YL= 0
##$YMAX_a= 96811
##$YMIN_a= -207662
##$ZGOPTNS= <>
##$ZL1= 120
##$ZL2= 120
##$ZL3= 120
##$ZL4= 120
##$ABSF1= 10
##$ABSF2= 0
##$ABSG= 5
##$ABSL= 3
##$ALPHA= 0
##$AQORDER= 0
##$ASSFAC= 0
##$ASSFACI= 0
##$ASSFACX= 0
##$ASSWID= 0
##$AUNMP= <proc_1d>
##$AZFE= 0.1
##$AZFW= 0.1
##$BCFW= 1
##$BC_mod= 2
##$BYTORDP= 1
##$COROFFS= 0
##$CY= 11.3945322036743
##$DATMOD= 1
##$DC= 2
##$DFILT= <>
##$DTYPP= 0
##$F1P= 15.7292609196834
##$F2P= 12.9074282941183
##$FCOR= 0.5
##$FTSIZE= 0
##$FT_mod= 4
##$GAMMA= 1
##$GB= 0.15
##$INTBC= 1
##$INTSCL= 1
##$ISEN= 128
##$LB= 0.24
##$LEV0= 0
##$LPBIN= 0
##$MAXI= 10000
##$MC2= 0
##$MEAN= 0
##$ME_mod= 0
##$MI= 1.114404
##$NCOEF= 0
##$NC_proc= 0
##$NLEV= 6
##$NOISF1= 3.799351
##$NOISF2= 2.8
##$NSP= 1
##$NTH_PI= 0
##$NZP= 0
##$OFFSET= 15.70392
##$PC= 1
##$PHC0= -21711.46
##$PHC1= 12.65271
##$PH_mod= 1
##$PKNL= yes
##$PPARMOD= 0
##$PSCAL= 0
##$PSIGN= 0
##$REVERSE= no
##$SF= 200.130013532006
##$SI= 16384
##$SIGF1= 3
##$SIGF2= 2
##$SINO= 400
##$SIOLD= 16384
##$SREGLST= <1H.CDCl3>
##$SSB= 0
##$STSI= 0
##$STSR= 0
##$SW_p= 3612.71676300578
##$SYMM= 0
##$S_DEV= 0
##$TDeff= 0
##$TDoff= 0
##$TI= <>
##$TILT= no
##$TM1= 0
##$TM2= 0
##$TOPLEV= 0
##$USERP1= <user>
##$USERP2= <user>
##$USERP3= <user>
##$USERP4= <user>
##$USERP5= <user>
##$WDW= 1
##$XDIM= 8192
##$YMAX_p= 0
##$YMIN_p= 0
$$ End of Bruker specific parameters
$$ ---------------------------------
##NTUPLES= NMR FID
##VAR_NAME=  TIME,          FID/REAL,        FID/IMAG
##SYMBOL=    X,             R,               I
##VAR_TYPE=  INDEPENDENT,   DEPENDENT,       DEPENDENT
##VAR_FORM=  AFFN,          ASDF,            ASDF
##VAR_DIM=   8192,          8192,            8192
##UNITS=     SECONDS,       ARBITRARY UNITS, ARBITRARY UNITS
##FACTOR=    0.0002768,     1,               1
##FIRST=     0,             0,               0
##LAST=      2.2672688,     0,               0
##MIN=       0,             -207662,         0
##MAX=       2.2672688,     96811,           0
$$ Real data points
##PAGE= N=1
##DATA TABLE= (X++(R..R)), XYDATA
0 0 0 0 0 0 0 0 0 0 0 0 0 0 0 0 0 0 8 -8 8 -8 8 -8 12 -16 16 -16 24 -24 28 -32 36 -40 47 -52 60 -68 76 -84 92
39 92 -100 113 -123 137 -152 167 -183 202 -222 245 -269 297 -328 361 -400 445 -493 551 -618 701
59 701 -800 919 -1074 1280 -1564 1973 -2617 3744 -6063 12607 -66412 -207662 52805 9198
73 9198 -109773 43425 -56272 -182145 1365 5466 -98833 -21437 -25357 -88647 -31415 -11051
85 -11051 -24518 9902 -10110 -64039 -19838 47254 12608 -17515 10027 -26730 -15098 73921
97 73921 4463 -55736 48532 21078 -39452 45481 14855 -26094 60793 6898 -36754 58418
109 58418 17785 -9959 62864 -8115 -22700 71268 -1440 -27146 71073 12784 -44107 23405
121 23405 13960 -7151 35465 11271 -43511 -17937 39295 28885 -14574 -5057 -1275 -18423 22892
134 22892 32523 -14275 -4460 -1820 -21475 13389 16815 -10449 -9664 -39270 -30055 25264 -6897
147 -6897 -37014 -18259 -42445 -23925 16931 -27170 -34654 -6620 -28780 -9694 9634 -22773
159 -22773 -1478 10582 -24526 4133 24483 -6115 8859 18426 -3415 11584 22095 6891
171 6891 7568 17983 21756 9055 2146 20647 20219 12828 22509 5091 -1350 25654 19812 9490
185 9490 13427 -4811 1652 15943 -2755 5007 5899 -26532 -8382 5438 -21553 -6510 -5597 -38254
199 -38254 -15535 -99 -22977 -10603 -8911 -26292 -5692 973 -12541 -1252 -54 -6367 6721
212 6721 7396 -820 3944 8128 7634 5685 4817 3226 -1308 6742 9970 -5866 -4599 1056 -9547
227 -9547 783 7327 -10842 -6137 -1213 -12319 4964 11637 -8403 -1279 1154 -4298 17481 16528
241 16528 -5314 4711 8995 3438 17496 13486 -1441 7074 7194 -1176 7008 8740 19 -3631
255 -3631 -5950 -6176 393 2552 -7139 -14430 -8272 -4021 -6942 -3756 -5609 -9849 -2532 -4326 -10297
270 -10297 3711 6717 -5319 -2960 -1966 -2064 13073 8241 -8992 -471 4247 36 6877 2465 -5123
285 -5123 2510 -127 -6499 3693 6713 -1738 -4814 -5797 -1092 9548 7124 -4986 -6127 2341 6261
300 6261 4472 2006 -707 354 4329 648 -1376 5589 3161 -6256 -4488 -1040 1020 5225 -4868
315 -4868 -12861 -1344 3298 -2048 -1898 -5043 -4434 4567 1217 -3896 4308 4623 -1100 734 1759 5348
331 5348 9707 1208 -5508 1575 7135 5037 -442 -4789 -2845 2185 1466 -3510 -3464 -734 -2347 -5647
347 -5647 -2491 1493 2101 -592 -6131 -4258 6945 7571 -221 -2481 -1492 3237 8307 2687 -2332 2128
363 2128 -95 -3000 -284 469 289 -2105 -9981 -9680 219 1773 -4520 -9441 -10500 -3392 2541 -277
379 -277 -3495 -2314 -322 951 2342 5328 7420 5045 1252 1509 7460 13046 9008 292 -765 3321
395 3321 7368 7414 1178 -1989 531 -345 -1298 915 929 -503 -3472 -7023 -2047 4201 2291 -2779 -6056
412 -6056 -4821 1416 2797 -1533 -2685 -3579 -3959 -2774 -2549 -827 -415 -5621 -7968 -4860 -366 2563
428 2563 -850 -7149 -4702 659 3279 4025 1155 -267 2205 2626 4018 6894 4203 2588 1371 -489
444 -489 3974 5957 119 -2742 -2716 -2549 925 -388 -4315 -3238 -2785 -2465 -522 -1889 -564 2418 -77
461 -77 650 3776 3031 5181 5885 3650 4331 4989 3784 5220 4413 3134 2986 -1176 -1802 1433 -692 -2896
479 -2896 -3847 -7557 -5832 -3179 -4979 -5299 -7248 -9139 -4537 -3715 -5459 -2633 -4269 -5971 -657 -54
495 -54 -1558 673 1053 693 2466 2847 3918 3855 2889 5460 3884 1390 5605 5031 2180 5855 3478
512 3478 -530 1542 2482 2707 3309 -1325 -2667 -605 772 3286 747 -5338 -2716 328 582 2345
528 2345 -325 -3227 -1978 -1558 916 2920 -2018 -3517 -2370 -3527 1309 2843 -4918 -6302 -2759
543 -2759 -1536 299 -1142 -3615 -1953 -1156 762 2487 -1098 437 4631 459 1152 6164 3103 1553
559 1553 3214 1556 1665 2393 -56 -765 -1739 -915 -1121 -6444 -5615 -513 -3005 -4971 -3985 -4741 -548
576 -548 2428 -869 -685 1238 2413 7383 5621 3438 7459 6276 3466 8072 7094 3564 3319 -262
592 -262 393 3445 -136 -4216 -6532 -7197 -1900 -2278 -9756 -9081 -5838 -5788 -2613 -3190 -6115 -3697 -961
609 -961 461 1931 1925 2967 1689 65 5634 7684 2838 1788 573 1115 6057 4206 -1537 -1499 -656
626 -656 561 2348 -2032 -2341 1182 -1828 -1408 1506 -218 1108 1621 -1706 323 3190 1435 1261
642 1261 -52 -504 1612 -827 -1786 840 33 -1483 -2618 -4643 -1895 1676 -805 -3356 -4550 -2707
658 -2707 2144 1893 -802 -495 -1581 -312 3734 3021 2161 1972 -1718 84 4351 3910 2514 -913 -3765
675 -3765 649 3957 761 -775 -3176 -3915 207 274 -1663 -1149 -2436 -2977 -787 -536 418 994 -1587
692 -1587 -1044 1080 1782 3187 1462 184 2297 2276 1016 2401 1527 1787 2351 -528 -876 1413 797
709 797 281 -1092 -3678 -1634 -132 -1516 -984 -2028 -3889 -1470 -1287 -1481 509 -1070 -2884 -671
725 -671 642 1493 2092 -409 -824 1263 1983 2568 1581 -301 876 1371 881 1148 467 -232 436 -141 -100
744 -100 492 -728 -490 26 -1028 -128 87 -1050 412 836 -450 96 -38 -493 1231 808 -243 -187
762 -187 -974 -291 1219 96 -750 -531 -1595 -266 1089 170 -848 -661 -883 259 790 632 226 -328
780 -328 -264 825 726 740 617 -809 -213 418 256 625 85 -1088 -284 -581 -1005 -91 -341 -977 -359 -1125
800 -1125 -1035 949 661 -382 70 -609 266 1068 784 294 492 21 724 1362 572 1096 298 -624 -146 400
820 400 494 -123 -1494 -1431 -416 -145 3 -884 -1448 -390 -407 -726 579 623 -162 824 137 780 2095 993
840 993 470 1251 1237 1432 1625 -140 179 1378 316 -396 -374 -911 -154 -320 -1448 -1277 -862 -1137 -1061 -1500
860 -1500 -1025 -91 -724 -1218 -1067 -193 592 -382 -1162 -288 56 562 798 -68 -49 986 -8 -186 848 675
880 675 730 407 -660 359 1729 742 -92 -84 259 1300 1499 191 552 576 -76 249 727 1266 967 -355
900 -355 -1214 -62 1083 901 -294 -1465 -881 -81 267 -255 -345 -837 -634 -1017 -610 470 157 -942 -1373
919 -1373 -1288 767 1287 -279 -1068 -999 -337 859 492 -469 -247 -495 -1047 -150 125 204 -282 -1744 -1890 -248
939 -248 261 -121 -1260 -1774 -578 175 457 374 375 341 375 760 1457 2478 1778 1358 1142 1855 2807 3144 1545
960 1545 1175 1133 1161 1771 965 -75 -2 -1059 -1559 -681 -692 -1275 -2007 -2979 -2496 -1104 -1364 -1839 -1827 -2216 -1300
981 -1300 -409 -708 -382 -224 -376 -240 -23 213 917 252 -212 51 -64 73 329 -770 -367 -183 -242 51
1001 51 141 24 860 351 -153 902 1265 968 1445 487 624 2029 1140 1212 1137 318 676 828 15 599 376
1022 376 -553 -398 -218 -524 14 -304 -529 128 -62 30 6 -9 506 467 -163 148 96 171 549 65 -919 -896
1044 -896 -1044 -849 -743 -1490 -1847 -1581 -2092 -1611 -1036 -1526 -1643 -1157 -1746 -152 460 -98 33 148 355 1279
1064 1279 1490 1193 1344 1013 1202 2013 1573 1270 1576 930 1151 1561 1131 793 847 567 516 364 321 568 -121
1085 -121 -344 73 -347 -314 106 -601 -402 -116 -1419 -672 -487 -840 -371 -1065 -1596 -697 -421 -1054 -391 -1038
1105 -1038 -1214 24 -252 -351 -55 -480 -458 -25 -173 452 401 -613 -82 155 69 177 -29 -280 418 586
1125 586 242 349 -357 451 859 158 356 290 261 1101 974 173 704 422 430 1253 891 403 538 172 268 1387
1147 1387 568 -75 -197 -149 443 966 183 -254 -284 -712 -29 6 -889 -350 -799 -1344 -779 -628 -675 -739 -1471
1168 -1471 -1300 -775 -658 -294 -646 -690 -77 -251 -505 228 490 110 404 26 284 1547 842 625 426 -411
1188 -411 524 1105 767 565 60 -484 62 393 592 484 -159 -748 -294 344 604 191 -671 -561 361 651
1208 651 289 365 -317 -168 182 192 502 64 -770 -158 -509 -285 379 -160 -747 -650 -686 -269 214 -407 -136
1229 -136 24 -462 -150 31 -133 537 12 -437 74 29 414 408 157 -447 -168 -76 217 407 -153 -359 -323 -371
1251 -371 321 277 -325 -39 -73 351 724 311 -191 113 283 494 566 331 247 518 116 234 355 -102 -17 -47
1273 -47 -581 -120 2 -693 -338 -436 -610 -286 -547 -622 -71 -160 40 174 -152 132 523 351 375 23 344 650
1295 650 366 799 730 232 207 548 325 250 473 -262 -694 -233 -227 137 -575 -693 -540 -343 -109 71 -164 -302
1317 -302 -213 -7 -112 188 200 283 227 -23 133 -11 -81 273 97 -176 140 -201 85 -84 -327 -355 -155 -188
1339 -188 201 118 -372 -156 163 211 818 657 104 266 61 87 765 606 126 140 8 315 395 201 162 269
1361 269 -312 -75 120 -80 -222 -76 -303 -224 166 -102 152 -81 39 39 -39 20 192 42 36 -154 -236 153 -117
1384 -117 -304 -285 -476 -572 -500 -336 -465 -188 -720 -595 -228 -371 -261 -51 -375 14 87 235 476 795 408
1405 408 693 744 456 867 840 506 675 125 448 675 501 327 17 -37 -94 72 -142 -16 -352 -379 -391 -287
1427 -287 -271 41 16 -417 -7 127 50 137 -204 -104 -176 22 143 389 -277 -323 -375 -538 -209 -269 -423 -537 -562
1450 -562 -547 132 -188 -400 -566 -345 -166 44 237 128 24 -68 16 279 592 529 307 114 405 458 439 532
1472 532 50 276 89 151 346 240 4 -77 96 -99 393 489 36 173 296 -82 443 151 2 270 26
1493 26 -182 -14 -283 113 -301 -655 -370 -424 -688 -290 -494 -938 -575 -308 -453 -411 -435 -388 -125 -389 -234 5
1515 5 1 56 306 -19 642 272 265 132 405 219 273 113 390 450 113 157 98 122 380 404 -82 219 -171 -134 237
1540 237 44 -61 23 100 -111 -71 64 -59 -137 92 48 -20 203 191 110 102 13 -136 -365 303 -161 -459 -293 -467
1564 -467 -341 -215 -514 -539 -438 -565 -154 -139 -470 -211 -420 -156 115 286 166 329 68 -79 340 488 417
1585 417 302 -69 169 223 234 191 236 214 -207 143 143 184 -186 205 28 13 243 276 -60 153 331 46 281
1608 281 272 -113 -124 54 -61 -182 -65 -181 -1 -427 -464 -264 -315 -132 -137 -135 -472 -231 -220 136 -167 -21 -41 68
1632 68 31 441 246 204 -196 50 243 324 308 -134 36 -361 36 -104 -9 -153 -406 -125 0 -440 -341 144
1654 144 -141 55 250 152 260 218 206 209 295 155 -12 463 91 16 -21 -56 113 275 192 -19 -455 -200 -279 -76
1678 -76 -329 -141 -309 -186 -155 35 -479 -213 -303 136 -292 -218 100 0 23 1 -260 178 301 91 -264 99
1700 99 -158 -274 56 -278 162 -93 -208 -176 -144 -19 18 -210 -262 143 221 358 -84 53 128 323 257 277 316
1723 316 -8 -182 142 -263 180 -85 -308 -228 -344 -37 159 -326 -341 -210 -113 -53 139 -95 192 35 -69
1744 -69 262 270 165 30 38 320 284 70 -91 285 -93 -111 133 42 72 -39 -23 -391 32 -429 -51 -370 -139
1767 -139 28 -29 -40 -175 290 -166 328 180 201 65 29 389 253 94 57 200 151 253 255 -478 348 -137 -220
1790 -220 27 -158 -173 -260 -105 -189 -184 -127 20 19 -23 203 178 -99 298 88 20 4 121 107 66 134 -48 115 -178
1815 -178 -48 79 -100 18 -77 -130 109 32 7 79 25 38 208 18 -8 -125 114 59 -7 -17 -113 247 48 -126
1839 -126 170 86 -178 -22 -35 183 -186 -24 237 29 -30 -311 -187 -6 -109 -179 -34 226 -88 347 325 202
1861 202 83 -2 150 450 205 -15 -25 205 33 122 232 -120 -194 -159 -97 63 57 -282 -26 -252 -222 65 -146
1884 -146 167 -37 268 -117 310 194 270 304 112 -4 217 51 -3 174 52 -165 11 126 -96 -118 -442
1905 -442 -437 -324 131 -50 -114 346 29 -80 108 110 61 57 -209 -182 -306 -132 -33 116 -180 160 -156 187 198 13
1929 13 -154 -302 -190 -59 193 -133 71 -106 -55 -40 213 248 23 -275 -234 138 15 -199 -98 -99 -358 -248
1951 -248 -2 -112 266 -79 -145 48 50 276 9 71 -212 -44 130 431 45 -145 14 -9 -88 -129 253 -84
1973 -84 -55 -72 30 167 169 130 110 113 131 269 96 385 165 6 18 33 67 185 111 -236 -294 -282 -114 67 -379
1998 -379 179 -98 -290 16 -28 160 124 161 64 142 388 163 7 -25 156 12 -230 81 -182 -106 -29 -109 -37
2021 -37 38 -175 -101 -62 -182 64 13 104 26 96 -220 125 19 259 55 -91 -117 -21 -195 -16 20 -102 23 -54
2045 -54 -222 218 322 -61 117 -177 -233 -76 -389 -313 -15 -136 -298 8 -46 201 -62 -23 -272 27 237 -52
2067 -52 -490 -149 122 -103 -121 -90 222 -156 -195 -315 -13 -19 -108 -26 336 -31 127 14 -126 336 88 -173 -6
2090 -6 107 -24 -182 126 -242 -70 -4 117 85 -176 67 24 124 -76 -111 127 -35 -19 -49 20 21 -146 100 0
2114 0 -158 208 72 -138 136 45 46 188 67 -114 238 -218 32 35 -154 -294 -42 -50 174 152 100 -3 -28 -96
2138 -96 -50 120 -97 132 172 54 -177 19 280 406 -61 115 63 75 -11 154 71 91 11 71 -139 127 146 -140
2162 -140 -132 122 120 56 -36 93 26 -23 -94 30 118 -134 -97 63 -263 -16 362 -148 83 123 -6 -52 81 136 -114
2187 -114 100 -130 -42 -74 -58 33 -48 39 26 -133 -54 116 -120 34 22 148 227 120 -61 -65 281 -2 -25 -123 -325
2212 -325 -173 -210 -45 -13 -361 -254 190 75 -121 -196 -173 -130 -235 -12 -26 -6 185 -257 6 -10 294 42 330
2235 330 107 -26 76 339 -187 155 84 -101 -39 64 111 -26 -59 -278 -148 -73 93 -21 115 45 38 -106 27
2258 27 297 -198 181 91 51 66 -30 -136 31 43 127 -56 58 107 188 36 -157 10 135 -32 -86 -132 81 47
2282 47 285 -84 95 -84 -127 -11 -84 148 -69 -92 131 -15 119 97 -136 38 -25 -344 22 175 -119 67
2304 67 -251 -96 23 64 -33 23 -228 169 147 -32 178 5 154 58 62 -146 76 -331 -14 48 -274 -41 -57
2327 -57 17 72 -203 -281 -28 -179 26 211 -47 -41 -111 -39 -35 -98 -213 -127 4 202 144 -41 -78 -1 11 171 -138
2352 -138 -1 88 42 174 -141 -7 44 -82 -47 4 152 84 -100 186 218 -180 152 102 159 55 92 122 16 -102
2376 -102 48 -97 55 162 -168 12 -95 99 19 -139 11 -291 -218 27 -155 -72 -215 -82 -117 85 -62
2397 -62 -123 3 -109 -106 325 -151 -73 -100 64 80 -26 -313 4 223 -314 115 -35 78 45 96 126 -23 -54 16
2421 16 247 -163 -101 -49 -202 -61 162 18 245 -52 -11 58 64 212 206 -110 -68 -65 -22 -61 63 35 -128 85 -195
2446 -195 29 -62 -135 81 139 -51 183 30 -54 -100 -205 -11 129 12 -106 -206 111 -66 75 179 120 -76
2468 -76 207 -41 -291 45 -32 -137 -42 -14 -113 -42 -37 -4 -341 87 -35 12 103 -53 170 -89 -34 159 135 -73
2492 -73 -69 18 -164 -355 53 -14 -74 -297 186 170 -53 -100 14 99 -238 -89 96 -64 37 147 -151 118 105
2515 105 -121 -56 64 -92 282 263 62 131 -2 -58 -151 -253 -37 97 56 -200 -178 -57 -3 2 -219 74 29 -137
2539 -137 72 290 -136 -205 257 45 149 -130 191 146 -173 134 0 -30 116 -13 -169 15 -56 -27 45 69
2561 69 -14 62 37 -106 181 -199 69 112 18 52 40 -120 1 -76 128 225 -26 -15 -104 204 -27 36 -174 -94 -222
2586 -222 234 41 23 42 -257 64 72 68 -245 -94 179 -65 -37 8 -46 -90 -87 169 -55 102 -386 -59 165 -38
2610 -38 -141 -44 -54 -71 -16 110 -287 -60 -11 -88 184 -27 132 -192 191 -174 91 -88 -83 144 -24 -144 7
2633 7 -51 -213 -187 59 177 181 2 109 -47 -282 160 161 -176 -164 -131 -49 -28 -120 124 20 0 24 266 -257 34
2658 34 7 31 0 -255 -134 111 -153 83 10 188 285 170 21 -50 219 197 -278 47 -69 45 77 -227 -22
2681 -22 45 19 -100 -23 -41 -101 -287 -177 87 1 10 -178 49 4 50 79 -3 35 -1 -184 56 -181 -46 26 175
2706 175 22 253 237 35 -135 122 168 -47 -3 41 -26 -10 -34 -153 -93 69 196 -75 243 -204 93 258 286
2729 286 19 2 42 -30 -40 69 343 -117 -92 -149 -181 -20 -16 -63 -177 125 59 -428 -101 -246 30 168 -101 -195
2753 -195 59 119 80 101 48 168 26 146 71 -169 230 -202 -91 -43 167 -23 -216 -54 83 96 -148 -225 105
2776 105 -313 -61 13 -13 -30 -204 143 -197 112 -252 47 -348 203 -141 -22 264 -14 35 111 156 89 -218
2798 -218 -114 128 -87 197 -78 83 6 -265 -24 -139 -140 63 293 139 -220 -62 12 -241 -90 -55 77 -12
2820 -12 62 232 -212 75 78 -107 -34 25 -368 -162 8 17 210 136 46 109 162 -44 56 24 -268 71 -165 -75 28
2845 28 12 131 113 9 109 -26 155 -27 207 -248 -36 -78 55 195 162 -125 -50 -2 -208 132 -170 61
2867 61 -179 -185 -97 -151 483 -111 58 -23 -487 -178 176 -82 -28 58 -201 173 20 -34 6 -9 -49 -28 -105 -31 225
2892 225 -27 -73 228 21 -152 -52 -2 113 276 -34 -199 118 -30 -122 170 181 121 126 109 -50 224 -55 30
2915 30 229 -38 -71 -31 -23 59 192 85 -177 -17 -319 31 43 19 288 158 -185 -26 42 59 -31 2 -155 -117
2939 -117 34 152 -211 78 -97 52 213 105 -45 29 -132 27 280 -156 -88 87 -32 10 -44 -80 -29 17
2961 17 106 -127 39 -172 51 -134 36 -208 -145 -3 28 -173 22 169 268 -13 29 -21 -95 -106 61 -39 0
2984 0 -66 33 25 -140 199 -86 -155 67 -152 76 -62 -198 -254 -33 -11 251 140 112 -8 -201 20 -7 154 11
3008 11 8 -43 117 -84 -111 28 57 1 59 -105 54 187 -119 -82 -73 228 204 -40 81 114 -234 33 -64 -34 127
3033 127 109 151 -233 164 -165 -7 -97 154 189 -34 54 34 251 -229 -67 -30 120 201 -72 45 7 -52 -129 40
3057 40 -2 140 -341 -78 -214 13 -16 -113 137 -136 -294 -79 -142 73 -254 85 -54 -57 -61 9 -130 -151 22 284
3081 284 41 -308 91 -168 -212 -13 -47 -17 36 -16 272 -137 129 159 250 -139 -76 -101 167 62 71 213 -153 -187
3105 -187 244 -208 -67 248 104 -61 121 -4 -410 67 -84 465 -85 -18 190 167 -137 -36 -8 -156 -173
3126 -173 143 -45 29 113 109 247 -240 134 139 -66 -124 168 -75 -70 -20 -176 -177 -117 7 67 45 262 93 24 -227
3151 -227 79 -10 67 -52 244 -191 61 -7 68 11 23 -109 -244 -45 -145 -41 -334 4 70 -174 175 58
3173 58 71 -74 -214 -70 -214 -16 -68 -211 -101 52 156 -64 -111 165 -105 -5 -236 146 -169 232 23
3194 23 -130 -85 -88 69 228 98 -44 -115 12 105 -88 87 -61 -240 -221 18 -137 243 59 -21 -66 232 -38
3217 -38 -35 97 79 67 38 -161 71 320 128 -22 -155 36 194 -34 -38 -228 222 147 143 -54 -180 163 -74 -51
3241 -51 286 -58 40 130 -407 49 -210 -71 -34 43 -101 97 1 -234 194 -38 225 131 -70 65 -54 -4 142
3264 142 40 -70 -140 -19 -256 -68 -100 52 69 -219 74 -73 -8 85 -5 348 -207 -93 -166 -74 105 -46 50
3287 50 311 69 3 -97 -29 -106 -182 216 -213 26 -125 -37 -18 -175 -116 131 25 -26 232 -4 -1 -112 104 -5
3311 -5 -13 -78 22 -141 286 70 -22 156 123 121 166 78 -28 -56 66 -172 119 -159 2 92 -5 -12 -55 221 23 -101
3337 -101 38 -29 -26 288 -132 -1 47 -303 -157 -167 -45 7 -118 -8 87 90 -54 135 -172 -43 -94 2 296 -131
3361 -131 -145 -35 -155 -157 -41 -130 -35 1 -39 118 52 -65 -88 -47 -58 179 -173 -5 29 196 114 41 60 -146 -68
3386 -68 125 -167 -103 2 150 228 101 130 93 -95 -5 30 -31 198 163 -108 67 42 -101 171 73 -233 -85 94
3410 94 257 -43 10 -56 214 -62 77 100 229 -43 8 -37 -32 32 225 69 -62 -206 -156 73 20 34 42 -147 72
3435 72 42 -14 146 21 -8 -41 -66 290 -32 -15 118 -143 53 -6 131 13 108 2 245 -54 -91 200 -59
3458 -59 -12 104 37 -69 -106 58 -438 -13 -24 9 25 -179 -8 -40 90 -33 -122 70 -12 -129 -26 -139 2
3481 2 -35 -53 -179 -190 -26 7 141 412 -113 -206 -184 58 -132 69 33 65 -10 -285 -111 105 -76 33 -188 130
3505 130 70 -50 -219 -147 109 -181 70 -99 117 -165 86 100 -65 -68 124 7 161 118 237 32 101 -84
3527 -84 88 -6 112 -156 40 -50 -103 -160 97 65 45 -62 -45 146 -134 -32 -145 130 -162 133 140 -33 85
3550 85 17 -108 174 -83 -194 88 -60 -207 28 -79 19 -149 -15 263 24 -42 50 -87 79 -50 218 -221
3572 -221 -91 -303 -82 -207 -231 245 18 116 -129 -125 161 -82 -96 -268 -86 -242 27 46 -28 -79 -88 92 -100
3595 -100 48 -163 -260 -34 8 19 -32 30 107 -92 52 132 68 -336 -244 -132 -143 58 -171 -89 -199 -252 -214 -44
3619 -44 -61 6 -68 -61 31 -15 -87 -25 -169 -46 -175 84 242 -2 -127 47 -190 286 324 -206 -75 481 -165 -78
3643 -78 20 138 -217 -120 -173 -117 263 -217 185 -95 -149 -42 236 -56 -75 -162 49 -7 90 94 -96 -9 -229 59
3667 59 63 182 99 15 -37 104 -163 96 -77 -49 25 -46 -74 184 -161 240 141 232 -39 -108 -130 229 -2 113 -3
3692 -3 235 0 6 37 -120 49 -52 142 -175 -118 -264 -80 57 123 12 95 244 31 -108 24 187 -337 -72
3715 -72 -131 73 91 38 48 134 50 72 -225 3 -16 27 -121 79 80 158 62 147 254 89 78 76 -42 20 26 136 -307
3742 -307 128 9 -150 219 -20 -289 45 -145 -175 57 29 -44 -99 149 187 265 135 -9 -203 -56 29 4 112
3765 112 -62 -89 -44 -88 110 79 -41 -146 -8 -99 -27 14 -40 23 -194 -52 -21 235 -112 -137 -213 -133 76 23 129
3790 129 -16 17 241 85 -92 140 139 309 105 55 266 -102 78 42 38 83 137 -28 32 36 -152 -167 -33 -24 217
3815 217 71 -31 -95 -33 49 -161 -5 -108 137 22 -39 -265 -112 75 -42 -89 69 -26 -56 -129 193 -59 35
3838 35 -95 -185 -293 9 -253 -28 -287 -31 278 105 148 -47 -69 115 78 -178 -113 250 130 -100 3 21
3860 21 41 70 -106 143 52 51 146 74 -131 -120 223 -92 37 151 28 10 -101 -28 74 -269 -340 127 -78 41
3884 41 -96 -70 246 138 -138 -16 -76 67 -58 83 -46 25 105 -176 -60 -296 66 -156 68 -29 69 100 -96
3907 -96 6 -289 20 105 173 225 -87 -5 19 128 -70 24 -20 117 -18 -278 -18 160 -213 125 -97 -136 7
3930 7 -188 -14 -129 1 101 -54 60 -85 -10 253 21 27 23 78 -79 68 -141 -43 -52 42 246 -57 -99 -96 105
3955 105 39 12 -128 79 61 -19 95 186 187 128 49 -135 70 -24 234 -214 -61 -57 -116 168 20 238 81 -128
3979 -128 -207 40 104 -31 10 -163 -62 141 -1 -60 -80 285 -33 147 33 32 14 13 91 68 -43 -57 -70 -20 4
4004 4 38 -57 -11 21 216 -150 -210 129 122 -102 185 -173 -111 -79 -91 -243 -54 89 -80 144 -15 -167 105 165
4028 165 -1 -28 84 97 38 -115 95 -159 91 -76 98 -171 -30 70 158 14 -236 -31 24 -148 -45 -60
4050 -60 -83 12 -47 9 20 264 64 -209 -276 68 203 88 -76 -79 111 -128 -95 137 -44 33 163 -144 -228 45
4074 45 -23 -281 -99 103 83 -179 190 97 -100 181 237 -132 53 -286 -12 27 123 -73 103 129 -4 163 -152
4097 -152 7 11 104 141 92 -76 306 -96 157 54 224 -279 -48 -101 383 -102 -115 20 -81 63 -219 -55
4119 -55 -66 33 75 -185 99 123 -1 123 183 -53 62 34 154 30 161 -253 61 58 -74 -132 -52 -40 -49 -36 -59
4144 -59 198 -90 -146 72 -101 119 35 -43 116 2 -124 33 5 86 -237 81 194 60 -49 4 -33 -29 -260
4167 -260 14 60 -140 63 -14 -42 -9 91 -54 118 -37 87 60 173 -66 61 279 -70 257 81 -59 175
4189 175 -164 93 264 23 13 -64 113 -129 287 -22 -49 -17 -252 -106 42 -178 92 48 -8 -171 -14 71
4211 71 145 -79 94 106 -136 257 -76 -34 38 -270 165 204 0 -281 14 114 -80 -136 -123 -19 -57 26 -167
4234 -167 -54 -116 -28 -199 -13 126 122 -90 -16 173 184 91 186 -72 226 30 219 -74 -39 -101 -48 -97 -332 298
4258 298 53 62 -157 101 2 -75 39 -181 -62 -93 41 51 -125 -106 106 43 -82 -16 228 11 -147 -236 137
4281 137 207 332 84 170 -64 84 148 -241 35 -91 205 102 -74 50 77 95 -97 34 -70 -189 190 40
4303 40 144 -58 -210 103 -180 -97 100 -46 96 -187 207 -178 73 -81 19 -27 -16 17 96 95 -158 3 -126
4326 -126 72 -153 42 272 36 -42 -136 -24 -53 -361 -60 -74 -43 194 -172 -149 56 92 35 -98 -57 111 -115
4349 -115 28 -6 -36 34 -66 13 36 68 -202 123 -132 -99 -123 49 305 42 169 85 -49 76 205 201 -13 144
4373 144 144 129 213 59 -228 -74 90 -104 37 62 195 230 -131 142 34 1 141 94 -30 34 -169 -91 187
4396 187 -118 74 219 55 -10 28 75 -190 -6 -86 -42 112 114 82 -124 247 -156 -50 -69 236 47 49 -59 -85
4420 -85 -136 163 -40 210 3 -46 109 -1 -89 147 -77 170 92 19 64 -92 -187 -48 10 119 259 -168 -259
4443 -259 61 33 -43 57 -49 -66 130 -128 116 82 -143 -139 -127 98 -12 -63 -27 -63 -9 258 29 160 -110 136
4467 136 95 -4 41 -247 81 28 -121 89 -66 140 -127 -5 -138 29 -219 98 47 217 -217 142 69 -167
4489 -167 24 -197 91 -249 2 -63 -74 71 288 42 55 -147 -34 55 -57 -57 -72 42 -13 119 -63 165 311
4512 311 108 -55 -5 237 16 112 109 17 106 110 -94 0 -196 -190 26 24 -103 -123 131 -51 -38 171 53 182 -35
4537 -35 135 -100 -166 51 62 265 2 -154 -116 -53 122 -281 192 110 63 -143 32 -22 -47 140 73 -162 -147 -29
4561 -29 -273 185 -154 43 -39 -163 -208 -93 100 -35 -53 -97 -102 -148 99 -97 1 32 35 279 104 -14 145 143 48
4586 48 122 20 60 31 126 -126 -48 -81 154 250 106 -60 31 -2 85 -90 -5 171 121 -42 15 -340 130 -169 182
4611 182 -42 -219 101 60 48 174 -87 -103 159 46 229 -154 1 -21 281 -114 8 236 -271 70 12 10
4633 10 136 -99 -19 82 -42 4 78 -90 43 -115 -92 123 27 -37 54 200 105 -8 -101 65 3 24 -95 -161
4657 -161 -62 -96 324 370 -1 -58 121 -73 -18 -172 -11 75 240 110 -32 33 -183 15 142 33 60 83 207
4680 207 236 -164 47 -178 -130 44 165 -80 172 -18 -72 209 -38 -86 171 57 152 -214 101 -13 14 103
4702 103 34 192 -24 75 8 -218 22 41 -201 125 -138 2 -27 -148 -10 -44 -84 1 -12 36 -25 139 -37 -62
4726 -62 93 -38 -116 13 -118 -136 -81 -3 276 266 13 159 -288 205 -198 -123 -83 -116 39 -2 -112 -267 -50
4749 -50 -358 221 -66 -20 -50 58 197 82 8 191 -101 69 208 194 -170 102 -127 -133 -93 -169 -77 36 1 22
4773 22 123 124 -342 -188 79 117 -31 220 290 -180 -195 65 -46 79 -114 193 71 59 14 35 -227 167 123
4796 123 -9 -130 -115 26 74 111 -124 -55 94 236 97 68 -129 31 181 -14 -14 281 -208 -38 9 158 -68
4819 -68 171 -190 -329 -76 129 -84 -223 -46 21 165 -18 -3 10 139 76 42 68 69 -141 -82 49 -126 -285
4842 -285 -47 -25 -182 -40 58 263 -192 60 -144 33 -114 -143 179 -257 -46 -163 212 -32 -41 -88 8 476
4864 476 135 -72 -96 -156 -96 135 116 -4 -134 -59 19 94 -203 -255 19 -64 143 -116 -168 11 214 -47 37 -11
4888 -11 180 9 -19 -182 241 15 109 -12 -112 245 -77 75 -114 -69 204 -238 -80 163 -201 -92 77
4909 77 143 -39 157 174 -281 -178 248 -102 -280 -4 -186 -103 102 -98 -214 -233 68 -76 -61 161 45 140
4931 140 -271 103 -103 -92 96 -11 -120 -85 -156 -170 57 10 43 -53 147 368 -229 -182 -358 35 -92 33 -87
4954 -87 -9 -25 -114 209 24 1 199 28 24 63 44 3 -31 76 -31 -153 142 -69 177 76 -252 138 133 -30
4978 -30 -153 310 -102 -24 -23 42 -50 53 -42 226 104 56 9 190 56 172 4 -117 -180 47 -103 407 120
5001 120 97 29 97 -256 -70 -117 30 -38 -59 11 -82 5 131 135 -130 -84 -43 -106 -113 -120 107 -226 99 344 10 -24
5027 -24 189 23 393 -94 12 114 -71 -68 335 180 159 234 113 -79 -25 51 -49 83 -69 104 -127 62
5049 62 -151 167 25 120 -43 -124 208 -2 -12 -21 -58 96 -177 -91 56 -315 45 -263 86 -207 36 158 77
5072 77 -90 -63 -41 179 -114 -22 276 -45 74 88 -69 114 -19 182 -1 142 50 19 70 -253 -179 -106 38
5095 38 120 -90 96 41 -56 -376 -27 113 -72 312 69 194 158 -105 -107 -108 166 -4 -254 -129 -181 -68 -98 -153
5119 -153 -51 -60 -53 -195 77 -89 15 181 -133 -29 379 109 86 -71 -112 84 -379 78 344 85 -92 -15
5141 -15 210 -356 -148 231 -91 214 32 73 129 -191 104 -5 -92 -87 -175 35 43 -11 -117 -146 9 31 -40 -3 -202
5166 -202 -18 51 -5 -93 207 16 -90 63 -275 121 85 92 -107 155 40 -255 191 8 91 47 -99 149 185
5189 185 233 -82 -161 27 -186 255 141 -128 87 -47 64 96 -80 79 -186 -35 62 245 -83 -139 -187 192
5211 192 191 -9 3 -26 34 17 -20 136 -27 -43 -126 -87 159 95 20 55 121 -79 6 -204 -63 -17 202 -3 36 -211
5237 -211 -59 -42 103 183 -60 7 170 209 19 267 157 -54 -151 -101 -55 -249 173 77 -198 -179 -159 -70 -131 -107
5261 -107 -36 155 41 -7 -47 -38 -260 64 -121 36 64 -140 108 165 -240 -67 -162 133 253 65 240 -93 -117
5284 -117 -173 116 -70 -57 81 71 154 -134 266 61 102 44 131 -6 -50 108 -215 -37 -101 49 -178 63 185
5307 185 -17 55 -77 188 -147 5 149 -327 240 39 96 -91 -46 78 103 -114 -216 91 -8 -144 -68 -59 8
5330 8 236 -76 -15 -48 60 -17 71 37 26 49 22 -13 -140 106 -194 -52 139 136 22 -95 91 -36 -62 138 37
5355 37 82 159 -195 52 129 37 -82 100 168 -84 21 -20 147 -52 -208 -97 192 -192 -187 -7 -4 45 -42 14 29
5380 29 175 416 -33 -25 -9 182 -51 32 -218 -301 124 132 139 94 -98 16 -99 61 -38 85 -14 -126 58 -175
5404 -175 -25 -171 -41 -176 -23 16 -135 -206 5 199 -83 -204 192 13 -178 219 97 -64 -18 -49 31 145
5426 145 67 46 122 -179 3 124 283 -39 25 -95 61 82 -55 -52 -185 -1 -142 -147 8 259 -211 273 -106
5449 -106 -27 103 23 65 -54 -97 44 74 164 16 -42 19 -282 9 -403 69 94 258 -197 -127 50 -215 210
5472 210 211 -178 -171 123 48 -233 -260 -160 124 -9 200 -287 81 -149 -48 -19 392 30 269 7 3 -132 -4
5495 -4 241 101 47 -90 -77 -15 -111 8 -25 -233 -270 -286 22 126 85 -8 157 -364 -107 135 55 6 166 141 -65
5520 -65 -127 88 25 -20 -78 123 -63 -163 299 -115 -112 -7 -143 -65 -29 -243 0 12 -108 -73 -164 153 93 -118
5544 -118 107 -11 61 -37 124 150 33 -164 44 224 163 4 32 -120 150 79 -147 230 276 222 210 -80 62
5567 62 124 -73 89 204 -190 30 -171 82 -291 -58 22 -28 72 -166 11 87 56 -48 -117 174 -76 -67 25
5590 25 0 -85 -27 -49 -152 -131 86 -17 148 -112 -86 -61 -260 80 185 -61 41 -18 107 254 48 -128 -115
5613 -115 28 -8 -177 154 196 -56 -218 -209 -70 -265 177 350 15 14 -47 -149 -107 -23 68 -376 90 134 -63 78
5637 78 118 17 96 -147 -54 131 -279 56 -7 70 39 -116 306 -51 88 -132 -85 7 82 -157 -5 -58 -89 102
5661 102 -96 13 -263 -53 -11 -8 205 -22 -192 -118 192 118 -44 -15 -43 64 -26 -130 96 -168 54 -25 -16 -69
5685 -69 164 119 -300 23 -98 -13 224 347 254 77 224 -172 90 31 63 152 -115 -115 152 144 -103 -102 -57 -250 52
5710 52 -10 -90 111 84 -43 -51 -48 201 -87 114 294 231 9 -12 63 -93 -90 200 105 116 -3 5 -8 28 70 71 -102
5737 -102 -86 248 -151 -14 52 -27 42 -237 -10 320 -187 161 -93 -6 14 -59 -153 -116 -76 -126 -98 -171 62 -96
5761 -96 -414 348 -79 -109 7 -91 -28 -110 226 -177 261 -193 66 10 123 73 280 -57 30 -54 -7 21 -181 171
5785 171 99 -107 65 39 -118 -22 -108 36 35 -106 120 179 -20 -39 55 38 16 120 -192 10 320 23 -4 85
5809 85 92 -220 -92 264 170 -75 35 -54 -68 -27 35 -22 -40 279 -31 -21 269 208 8 107 248 -80 94 -166
5833 -166 -125 57 158 -3 26 -23 -70 150 -224 -115 132 2 -118 109 -150 15 -151 -50 60 24 -267 93
5855 93 -104 -66 155 66 -63 -88 68 -137 71 6 -48 180 -72 -44 -76 132 -271 -62 -110 -42 126 -164 -224 77
5879 77 -49 -171 167 -60 93 22 165 38 200 -37 113 209 52 -29 -53 69 89 39 -28 176 33 74 -85
5902 -85 -4 86 180 44 34 78 189 -413 -57 -29 -124 -2 2 96 -81 218 149 20 -72 314 -174 151 63 -52 48
5927 48 -7 -179 -223 82 168 -111 -207 192 136 -210 -143 -26 111 -10 94 190 -85 3 169 -27 78 61 45 -66
5951 -66 -35 79 113 -41 7 -229 -58 215 104 97 -108 -87 -2 -29 -81 -27 -175 -33 -9 -91 218 50 54 -75 -284
5976 -284 35 84 88 -262 -21 -14 -215 -66 117 90 348 -70 -130 40 67 19 -248 -103 -41 166 8 283 -26
5999 -26 -117 -139 -107 103 -169 250 81 -5 -145 44 24 -190 -289 -15 93 221 231 -13 -67 -32 140 202 47 -40
6023 -40 -13 -252 150 -248 -61 -107 -114 26 19 -248 7 -32 -16 167 99 0 -12 205 9 -130 -247 123 33 -69
6047 -69 -149 -144 178 39 -106 2 320 14 -112 259 -198 -118 97 189 -59 -114 138 -59 -274 -26 156 -141
6069 -141 -47 -236 -135 -14 247 -5 -155 -53 205 230 32 190 -31 27 -89 -167 16 117 210 101 -2 -45
6091 -45 -90 9 34 -342 171 -52 -46 -168 -60 -166 -110 231 -162 90 53 -166 54 92 140 42 55 -134 50 -35
6115 -35 154 157 -87 44 -49 -101 -282 173 74 52 -39 326 49 -163 249 -153 5 217 53 -180 28 82 -49
6138 -49 -150 -23 -84 92 -120 94 21 57 -84 -24 128 56 76 -236 204 106 101 76 -72 129 -19 -75 52 -66
6162 -66 2 -39 -12 -31 22 -130 -18 203 34 33 -25 150 -187 -3 85 149 -241 -56 29 114 -25 -29 -243 168 158
6187 158 -113 18 66 -100 30 -46 -136 82 -157 -7 75 78 187 67 -26 -15 60 130 -96 0 190 90 -64 -142
6211 -142 -101 66 186 -44 -149 -196 120 -41 -105 48 -17 10 138 134 4 -171 -70 56 -69 -87 -80 -94 32 205
6235 205 26 193 33 -81 -159 -80 -36 -143 186 10 22 -109 69 55 -13 44 -50 -131 41 33 52 -7 39 -9 -296
6260 -296 187 59 -237 84 -134 334 10 -224 10 -165 30 -10 4 83 5 34 -250 5 -27 193 -48 116
6282 116 25 161 -11 11 -12 -148 -147 29 52 -83 162 282 -82 125 127 -270 100 39 -111 -160 66 -133 -35 -174
6306 -174 -71 -134 2 202 85 -22 -128 119 30 -124 164 -78 45 80 20 -22 32 -34 -20 240 -102 51 -92
6329 -92 -120 76 112 74 239 50 88 -12 -279 35 81 133 105 -68 319 38 10 -65 55 -69 -306 101 -118
6352 -118 -10 213 -3 77 83 56 -24 -112 -29 -73 31 -57 -138 -268 -137 -111 93 169 117 45 44 -46 18 223 134 145 -166
6379 -166 -47 -7 -63 29 -42 -101 88 -152 -219 -103 18 65 -248 -50 -252 32 -86 -1 100 -27 22 113 -238
6402 -238 113 -66 125 111 -8 -45 128 280 214 41 -10 -263 -4 -108 53 -66 44 310 82 144 -112 -171
6424 -171 -266 -31 38 11 55 20 153 182 -145 143 122 74 -124 70 1 41 165 165 -7 47 158 118 13 -22 295
6449 295 10 125 44 -89 18 -307 331 -1 100 -13 -89 21 77 -194 -197 -239 -27 112 -39 13 -47 103 45
6472 45 -64 128 -90 -13 70 60 -176 38 -83 -90 -32 -105 93 202 -130 232 -90 15 -60 -86 -70 -60 188 58
6496 58 -121 44 -171 225 141 -116 230 -32 70 -83 -84 -168 77 -184 105 320 -39 10 19 -85 269 153 -6
6519 -6 -12 203 194 -8 -338 70 118 26 -58 -268 218 -31 13 52 -102 -96 -41 -84 -409 -72 83 76 183 42 110 47
6545 47 -121 194 174 10 281 160 30 112 98 178 -42 7 -65 72 -62 162 -83 -111 153 219 -248 -117 89
6568 89 -105 -39 -196 94 -72 -174 92 171 -79 -64 -2 -58 -24 -24 -152 6 49 39 60 -35 -25 49 -140 88 -170
6593 -170 95 100 27 -18 -116 -221 112 -90 2 14 -31 34 -116 141 7 -28 30 -266 -177 31 222 85 -77 316
6617 316 -197 191 19 285 -150 -50 -161 -99 129 -124 29 -146 93 142 -138 161 -67 -200 -10 314 124
6638 124 36 92 220 -139 -143 167 -24 -218 -119 186 38 5 35 -54 -249 -133 -58 -82 29 -289 -238 -22 115 -183
6662 -183 16 72 -69 -177 -146 17 133 95 -86 -112 -42 -154 -22 13 52 -152 -33 -111 92 12 -42 -137 -96 -72
6686 -72 250 66 -46 99 124 -22 165 181 -30 180 89 -2 37 30 19 138 -73 -61 -250 38 -9 -190 -10 -99
6710 -99 248 99 -114 142 37 -160 190 -131 -108 -43 -45 -71 -173 -12 -109 41 -13 -96 -25 57 27 12 -48 -68 22
6735 22 -69 65 146 -95 38 133 147 -113 76 57 95 137 65 -134 -124 -79 -167 -101 21 -76 205 92 -68 -38 -23
6760 -23 40 -209 -103 73 24 161 -227 217 52 190 -49 -112 -25 212 -80 -17 -96 75 -153 -62 -11 31 -76
6783 -76 81 1 -72 -56 -108 163 -133 26 -85 -101 32 -28 7 244 -75 -317 -187 -87 -154 202 -150 33 -75
6806 -75 12 -1 71 63 23 170 -59 99 36 189 -250 -63 54 87 166 114 40 77 63 62 285 4 246 23 -225
6831 -225 -31 12 12 -65 -156 -77 -73 27 338 -63 139 107 -145 -137 -98 183 -163 -42 -42 -271 -99 176 45 193 -298
6856 -298 71 -131 -104 -109 -7 -146 62 -110 61 181 146 -189 -239 29 59 -79 -178 250 70 -57 -195 -139 213
6879 213 -159 -26 269 -32 -6 -137 -112 -201 -32 -179 -25 -64 84 -165 -92 15 -119 -147 -20 -147 -94 -141 29
6902 29 -162 -16 103 69 33 42 -105 125 -125 21 -204 28 -199 -161 47 15 53 -162 241 -2 -148 -45 150
6925 150 109 78 -69 0 -84 178 -9 -72 60 15 -81 104 -72 13 80 119 158 -152 134 169 -77 130 14 -13
6949 -13 -143 39 41 -4 -203 35 -49 -104 71 -5 188 289 -121 -154 -68 392 -30 -188 -47 77 149 -16 -30 137
6973 137 215 -237 -52 109 -128 -155 -222 -126 114 145 98 3 100 -72 237 -1 33 -93 127 103 -9 121 -95
6996 -95 172 82 12 -244 113 -280 23 -49 -96 39 194 -66 -23 69 -123 -195 110 -3 180 134 89 -136 26
7019 26 -175 10 -213 80 243 -55 -289 -114 -75 -14 -26 -42 181 -43 52 -141 4 181 -87 31 -236 217
7041 217 74 -54 -66 -48 6 -82 24 127 -100 35 125 226 171 47 -117 20 121 97 -6 -211 261 -91
7063 -91 138 64 145 -48 -23 191 100 -96 -173 -17 44 -67 259 -125 96 134 -109 82 -67 184 137 119 -179
7086 -179 -276 -8 82 -53 -159 -96 44 -108 -66 31 -174 116 47 -93 -185 50 58 136 5 64 -270 177 -232 22
7110 22 121 135 -22 38 -119 142 90 116 -148 -202 33 126 -155 -42 -174 -173 -56 -226 108 -51 -201 145 -88
7133 -88 -38 -114 55 -202 64 -217 21 77 74 95 185 15 -11 -18 139 36 -92 169 -376 61 -126 -276 -18 -107
7157 -107 141 -192 -142 3 105 -62 189 152 125 87 75 132 -20 -152 91 150 -41 148 2 217 -31 65 124
7180 124 94 -29 -58 153 -86 -48 -72 -269 53 31 -109 142 153 45 -213 -159 -230 -21 11 114 79 217 -86
7203 -86 -88 -14 -150 -23 107 -98 -215 82 36 -104 93 -241 86 -260 -189 -165 -91 -116 -31 76 -290 -145 54
7226 54 21 -3 -90 90 -173 -171 22 -42 84 10 104 103 -84 -55 125 -316 -138 172 -159 -98 -12 -239 -117 58 27
7251 27 12 183 -221 160 102 -284 -184 192 90 -162 -187 -64 34 75 181 24 -46 5 -144 -72 -5 -129 -20
7274 -20 91 229 6 -1 72 -57 87 -55 140 -184 -138 196 -38 59 152 199 -122 -81 -279 -109 88 -152 149
7297 149 -44 7 -122 112 -113 -13 128 -3 82 170 169 -139 89 76 -226 -174 56 -187 150 16 33 10 -236
7320 -236 -65 -168 165 239 156 274 -71 -141 70 -23 -55 222 -38 34 57 47 -24 -46 106 148 139 -56 -17 -153 55
7345 55 -90 1 155 -144 -76 -61 34 -58 177 4 56 101 -123 -21 79 -159 -87 -136 -17 68 -58 -117 130 146
7369 146 -29 -264 20 22 34 153 9 -95 72 -327 5 -384 171 -130 -12 76 194 -164 -199 174 67 145
7391 145 -42 -27 -113 117 16 163 65 20 -246 110 129 -113 69 -119 85 -231 -7 -62 94 123 -52 -102 -107
7414 -107 -170 53 28 -24 219 253 -101 42 -103 -120 115 116 43 -2 122 1 -24 -269 -55 -88 -191 -53 -91 12
7438 12 53 -38 -137 -88 -141 -82 -147 -57 -14 51 421 66 72 206 13 179 -248 236 -25 118 -186 -275 -14 -115 -82
7463 -82 -66 98 305 29 185 61 -42 295 193 126 61 -112 50 -129 121 34 -328 10 -87 -158 -92 61 45
7486 45 102 -52 -136 -202 25 -252 146 99 150 105 -36 20 65 -252 -126 92 -174 -9 21 156 -54 154 -139
7509 -139 -84 -56 256 237 -25 32 -44 -167 14 145 91 -44 -79 187 -236 -32 56 73 -231 -80 -152 64 55 -193
7533 -193 142 110 -72 108 -73 -220 98 -139 6 61 -88 213 248 33 49 -87 -91 -8 -112 -13 112 258 329
7556 329 128 240 20 -56 105 115 -61 30 73 166 -156 -145 90 -89 -44 133 -123 -46 -76 -61 -58 42 -249 -245 82
7581 82 155 20 -108 -207 -32 -97 -109 162 -39 0 -110 4 -99 -238 37 57 -165 110 -21 168 -101 43
7603 43 25 -30 -91 -257 -93 48 -179 18 21 -26 274 59 180 39 -89 -286 -155 24 -100 -35 -345 -172 2
7626 2 -80 -152 -66 237 45 152 203 12 -26 168 124 -206 103 -29 -132 98 2 60 136 136 -229 75 -108 -298
7650 -298 48 -29 -127 24 111 -7 -40 -168 123 159 -143 -286 175 18 94 245 -69 97 -37 -148 170 11
7672 11 31 -250 -16 -128 -103 63 -211 6 -37 -107 7 -54 101 -287 -25 -77 -65 138 -53 111 68 8 -281
7695 -281 228 13 61 -134 -5 -126 62 40 214 -63 16 83 13 -246 -65 187 221 -129 55 -64 48 -189
7717 -189 -152 -147 -239 51 -226 5 36 -40 217 -6 165 -57 -23 87 -16 -14 10 15 -244 55 45 -36 220 156 -15
7742 -15 -4 -150 26 -257 -82 -64 -118 -35 -140 62 -84 144 -119 14 201 143 -198 -75 -4 246 -6 -76 -23
7765 -23 -153 55 -27 -32 15 214 101 55 205 298 -188 10 42 -143 -220 -78 100 327 -124 289 -249 151 26
7788 26 -89 -39 9 7 8 231 114 180 67 39 190 3 339 94 -133 117 -39 255 -70 -75 97 198 -277 -39
7812 -39 181 81 -124 29 -76 6 118 14 -287 13 -150 -149 -107 173 -132 -63 16 59 43 46 -154 -56 -161 -125
7836 -125 -19 -97 43 110 38 -194 295 15 233 166 -171 -115 200 124 -210 -7 73 132 211 -179 4 126 160
7859 160 -115 -17 222 -49 -27 92 -174 335 -42 138 133 -125 -325 97 -46 -91 -87 117 60 -2 -278 -132 -70
7882 -70 -51 -166 375 -67 -328 -165 -149 -1 31 -112 45 36 37 143 -304 -31 -24 -72 137 -82 127 87 -53 -123
7906 -123 -45 137 138 99 -56 -40 25 -105 249 -79 22 56 127 187 -236 -145 -124 63 -293 156 4 69 178 72
7930 72 -272 45 31 74 -40 -142 65 25 -48 -64 -37 201 -40 -111 5 116 -8 -35 -147 -51 137 -39 201
7953 201 -60 6 -193 -47 -50 -23 205 -65 96 -72 -106 45 48 111 214 78 -99 -37 -21 -160 60 -100 -13 33
7977 33 32 -107 83 48 57 -19 18 260 112 -27 192 53 -67 23 224 58 -268 -188 35 63 -104 -319 -102 52
8001 52 59 -127 -24 -261 -39 -46 -71 113 20 -120 -55 277 -284 11 -153 -99 68 95 54 210 -45 -156 -100 -244
8025 -244 124 -149 -137 -9 27 -87 197 48 32 60 18 -83 13 -97 129 -43 -70 151 -365 44 -45 81 241
8048 241 -34 -8 -6 -61 -139 -15 -109 -372 -39 77 84 -34 90 3 -236 -1 -21 -160 2 27 188 -26 142 -141
8072 -141 -62 -121 185 -6 -31 -49 -212 -42 -56 -30 239 -170 -50 94 18 207 -273 -29 -58 -136 17 64 -98
8095 -98 47 -73 -132 92 -14 -89 -53 86 158 -123 -104 101 -35 -77 102 -260 144 19 -59 37 186 -42 196
8118 196 -112 296 39 -280 -57 -109 -92 -57 104 -74 -193 -85 140 -249 91 -47 -23 151 42 195 -167
8139 -167 -65 146 -51 -16 26 101 -53 8 -179 318 -109 -153 -28 -81 -80 15 -221 116 -133 3 -246 113 129
8162 129 -45 3 35 -6 97 -2 247 291 -137 48 -61 -215 -11 136 446 78 -49 -91 203 -78 292 85
8184 85 44 -266 -35 82 -14 143 -138
8191a38
$$ Imaginary data points
##PAGE= N=2
##DATA TABLE= (X++(I..I)), XYDATA
0 0 0 0 0 0 0 0 0 0 0 0 0 -8 8 -8 8 -16 16 -23 24 -32 36 -40 48 -62 72 -81 96 -112 128 -146 168 -192 217
33 217 -247 279 -314 353 -397 441 -494 550 -611 677 -751 830 -917 1013 -1117 1230 -1357
50 -1357 1493 -1645 1813 -2000 2210 -2445 2715 -3021 3379 -3800 4304 -4919 5692 -6698 8060
65 8060 -10022 13107 -18688 32048 -136219 -56720 75553 -154154 -5802 -20640 -161513
76 -161513 660 96811 -52979 12766 53381 -20547 21035 80453 45803 62490 45931 -8246
88 -8246 17904 86798 48820 -3269 18694 6368 -17095 53611 17899 -62349 27911 40389
100 40389 -58161 11307 35605 -30471 40297 29687 -52022 36666 44720 -19480 50359 19015
112 19015 -42683 48597 18178 -45365 50393 21857 -72580 -6630 15243 -28551 4139 -5726
124 -5726 -64238 -39950 17631 7338 -38954 -30150 -7598 -25501 -3144 20065 -23313 -20458 5299
137 5299 -17759 1617 19540 -12932 -9119 -12712 -18292 27105 6317 -37413 -3167 -3431 -10780
150 -10780 24798 -9505 -31322 15965 6375 -869 23161 -6149 1260 35476 5649 13130 40766
163 40766 6331 9322 38096 19179 20808 32111 10320 6916 22363 23231 8930 -5426 4055
176 4055 6499 -7493 -849 -9457 -26912 -8098 -9784 -28460 -17320 -22195 -25273 -8975 -24795
189 -24795 -25008 -5840 -24685 -15332 9709 -16595 -12064 11176 -11647 1122 24684 -4205 -3197
202 -3197 15135 1244 12183 21079 -4006 -2183 8467 1053 8889 8556 -8284 -6499 1699 3170
216 3170 2714 71 -3375 -5775 1578 11577 2191 149 8958 -365 2936 17165 3611 2123 11850
231 11850 -2203 3360 16300 -2786 -3060 5922 -6380 2330 7220 -14517 -6515 6094 -7466
244 -7466 -3003 -325 -12654 -2194 5307 -7017 -4050 2192 -4176 -3302 -80 -1618 -635 -101 -6178
259 -6178 -8077 281 3900 -5237 -7538 -4515 -6135 501 1279 -9328 -1747 5059 -5254 -1420 5645
274 5645 1418 8251 7141 -6411 4684 16780 6587 5534 4881 -1745 7255 10460 -445 2795
288 2795 5173 -4677 -5160 -1058 105 2329 -4094 -15003 -10719 2224 4676 -3426 -9107 -8518 -3097
303 -3097 4756 3844 -1591 1781 2400 -3827 2253 10113 7408 4851 -2826 -7703 6703 14385 1799
318 1799 -4265 -5879 -5330 4231 3737 -5181 -2026 -1934 -8492 -4178 1867 2719 2613 -5248 -10500 893
334 893 10877 7078 -763 -4425 -1566 5586 6875 2740 1168 1763 -1139 -4264 532 5340 1970 -4683
350 -4683 -10346 -7802 4005 5498 -5164 -9179 -6644 -2788 2439 460 -4212 -213 -691 -4629 580
365 580 5783 4803 1965 -4277 -4011 6789 9871 2613 -2496 -2610 1870 5717 3599 -178 1237 1718
381 1718 -128 324 2809 5369 2896 -2171 -1982 2423 7512 4663 -2302 -1745 2376 3428 2344 -935
397 -935 -2577 991 -329 -4408 -2683 -1104 -2830 -4915 -8750 -6369 -1620 -3512 -7102 -7449 -5872 -2447
413 -2447 -2357 -5583 -3323 -183 -47 881 394 2468 5820 3633 2295 5123 7744 7887 5582 1913 4179
430 4179 7550 5133 1767 -292 -735 1978 637 -2539 -2357 -3896 -4505 -2736 -3917 -2595 -656 -4817
446 -4817 -4557 1030 2243 3189 1674 -1195 2681 7018 6310 5349 2493 1882 5082 4237 2374 3002 -412
463 -412 -2765 -1099 -2587 -2540 -2572 -6569 -6756 -5840 -5631 -3319 -5226 -7094 -3317 -3413 -4175 -1168 -1529 -1164
481 -1164 1291 -548 -151 2042 1317 3101 3149 -1172 1363 3161 1222 4007 3142 -1185 353 3590
497 3590 3265 4222 2536 1580 2614 3405 6555 6027 1395 2679 3163 912 4401 4326 -2013 -1935 -636 -1612
515 -1612 -403 -3429 -6013 -4647 -4295 -3254 -3715 -7627 -5221 -1618 -3850 -3495 -2694 -3519 -458 862
531 862 212 1808 -557 -526 3426 2343 2927 4523 -1451 -1536 4873 4698 2222 -577 -2884 547 3548
548 3548 2492 1294 -2857 -3571 2394 614 -1357 2462 -1102 -4566 -95 1297 422 727 -2428 -2880
564 -2880 -741 1276 2946 -1056 -2248 3000 2086 -614 2749 2132 2865 4357 300 153 3976 3877 3856
581 3856 755 -3720 601 2428 -1715 297 -922 -6500 -4716 -3303 -2965 -189 -4100 -8612 -6320
596 -6320 -3197 2078 2120 -6183 -6117 267 1917 3681 3627 -1263 -392 2772 3710 4731 4056 2469 793
613 793 -532 3919 7266 1792 -752 -454 -666 3575 4020 -1577 -1006 962 64 1055 -1142 -1438 1869
630 1869 -1001 -3719 -834 -1481 -1076 77 -3743 -4316 -915 -1701 -1822 -1026 -1806 -918 -2017 -2648 1681
647 1681 2868 131 -460 -1351 1382 5715 3258 -7 -758 466 3708 3318 -346 -185 -440 -1437 1008
664 1008 247 -1251 -747 -2837 -3411 1157 886 -1275 -1765 -3140 420 3437 31 -1423 45 380 2708
681 2708 2656 -1085 135 1477 489 1385 440 -335 383 -744 -725 985 216 -974 -1376 -1658 1308 1237 -1064
700 -1064 -943 -584 139 2154 167 -1491 734 86 -352 198 -1200 -657 549 -1831 -1547 -544 -1713
717 -1713 -324 -396 -2014 -621 146 -1563 558 1311 403 837 291 733 3146 3130 1443 638 195 2319
735 2319 3664 1643 330 -453 -1012 593 749 -668 -940 -2933 -2661 -552 -983 -1644 -1414 -3425 -2434
752 -2434 260 -494 -240 -438 -1395 91 1230 848 1448 1058 710 1900 1778 1095 2214 939 -182 1093
770 1093 84 -683 94 -434 -930 -1217 -1909 -1541 -1231 -818 -668 -1505 -1306 -499 -389 -70 1007 -36 141
789 141 783 1135 2214 1894 136 628 948 706 1644 864 -863 33 24 -818 -103 -153 -914 -909 -1431 -1268 -106
810 -106 -238 -698 -227 -765 -96 616 461 736 1132 525 400 133 867 1593 785 -166 -336 -405 1143 1108 -657
831 -657 -1082 -946 -1161 221 262 -663 -130 -1098 -1732 454 1068 541 -63 -1508 -725 1432 1355 -175 -330
850 -330 -927 -770 296 267 -141 -90 -1452 -1740 -914 -62 237 -860 -1899 -1720 -294 800 701 -469 -274
869 -274 536 897 1459 1494 1467 1750 901 733 2510 2639 1610 892 -442 155 1779 783 -707 -881 -1470
888 -1470 -1115 -523 -1313 -1137 -901 -2283 -2262 -943 -304 91 -932 -1690 -566 820 1072 473 -164 84 766
907 766 265 446 403 423 37 -861 -928 384 -3 -1160 -1382 -1638 -730 -113 -974 -1349 -412 -233 -38 75 -322
928 -322 783 1280 380 555 1268 1331 1556 639 553 1423 1240 871 370 471 608 767 123 58 635 620 608 353
950 353 217 626 696 216 259 423 745 450 -629 -551 262 -563 -859 -1200 -2013 -1668 -1097 -2090 -1781 -2117 -2639
971 -2639 -1932 -1905 -1495 -756 -1088 -1956 -923 -30 770 1265 109 274 1208 1600 2259 1905 1232 1427 1641 1030
991 1030 1632 1657 882 439 439 230 1321 434 -260 -311 -457 397 455 -301 96 139 -747 137 82 89 777 28 -676
1014 -676 -185 301 302 319 -272 -580 -36 -383 -100 426 -510 -914 -739 -752 -112 10 -1031 -1194 -1739 -958 48
1035 48 -834 -1337 -1253 -1658 -767 -155 -493 -723 -573 -557 188 661 389 908 511 343 1434 1036 1190 1873 792
1056 792 737 1517 843 1055 1439 750 835 997 223 631 874 655 967 182 -342 659 778 823 692 -404
1076 -404 -486 266 -20 175 -471 -1549 -1389 -1275 -1437 -956 -1542 -2134 -1773 -1976 -1509 -794 -1479 -1712 -858 -887
1096 -887 -47 492 -349 435 760 557 834 1252 880 1708 1031 181 1063 811 978 530 -72 -374 -221 -450
1116 -450 -204 388 -575 -630 -579 -564 625 983 -64 -185 460 866 2261 1396 427 828 583 1212 1852 644
1136 644 608 107 -633 23 395 -780 -732 -1635 -1816 -598 -696 -1433 -1145 -1419 -1339 -215 -936 -833 -451 -752
1156 -752 -472 -158 -449 187 439 -303 -40 122 143 725 246 -116 369 -63 -318 195 -36 582 377 -498
1176 -498 385 851 753 385 197 50 1142 1215 636 695 318 210 1068 370 302 562 -238 -141 20 -99 -210
1197 -210 -311 -839 -591 -275 -773 -708 -1197 -917 -200 -320 -881 -450 -342 57 646 -164 -196 -58 68 519 290
1218 290 305 364 -76 -297 709 536 -80 -237 -416 -390 381 -85 -266 -568 -627 -115 -196 -677 72 61 -505 -208
1240 -208 309 438 694 428 385 698 555 570 673 211 248 397 -198 -19 151 110 -15 -563 -884 -275 30
1261 30 -207 -366 -941 -891 -61 -501 -211 -283 -755 -351 115 181 230 492 -239 113 374 484 540 155 -80 283
1283 283 304 162 381 -41 -212 27 -194 198 186 101 -422 -458 -231 280 219 -272 151 -496 -203 141 -61 -42
1305 -42 195 -377 -472 -265 -10 -29 -324 -395 -306 -193 -163 70 60 -605 -36 -229 -70 340 68 98 151 201 456
1328 456 577 281 245 158 -19 489 389 296 365 86 128 -45 -93 178 274 -300 -96 -265 -155 -230 163 -268 50
1351 50 -281 -118 226 191 3 -51 -166 -292 381 336 177 87 -180 -121 203 23 -220 -187 -523 -576 -90 -196 -599
1374 -599 -476 -669 -485 -182 -41 -434 -392 -13 96 -231 308 676 68 448 347 51 805 748 297 453 374
1395 374 370 670 422 333 615 125 192 8 330 198 147 -122 -240 8 -23 107 201 -254 -260 -73 -287 24 122
1418 122 -333 -285 -487 -70 61 -344 -527 -529 -616 -515 -173 -607 -295 -246 -286 -163 -473 -546 -137 -195 -316 -9 -136
1441 -136 228 276 -38 148 333 278 280 261 200 602 262 -18 354 463 207 420 71 58 199 -146 28 171
1463 171 -68 523 193 -105 352 155 48 207 235 243 403 138 -4 15 -12 -25 -224 -275 -184 -248 -499 -578 -342
1486 -342 -354 -587 -904 -988 -417 -648 -581 -412 -658 -325 -278 -394 -27 96 -15 140 95 380 626 443 37 39
1508 39 337 435 357 231 -168 -95 202 312 280 299 36 -10 -93 143 375 545 448 -45 85 618 326 231 166 -37
1532 -37 86 35 37 -110 91 -579 -440 -264 -184 -412 -355 -632 -396 -461 -146 -114 -70 -233 -210 -32 -225 169 144 -22
1556 -22 -15 -543 -92 408 -12 223 -196 -94 -12 -70 -245 16 -377 -269 134 -19 200 337 27 -139 420 156
1578 156 639 110 247 353 569 383 578 634 281 381 360 364 117 317 103 -185 -37 -81 -45 -112 -31 -175 -359
1601 -359 -291 -247 -199 -176 -110 -129 -2 -121 235 280 -311 -276 -152 -297 112 301 -10 -190 -65 -128 304 537 -206
1624 -206 233 -26 76 -109 -181 69 200 -72 273 97 -138 120 216 -158 293 79 61 228 216 -14 -75 34
1646 34 151 306 -9 85 144 -232 -58 313 -74 206 -55 15 -36 245 -80 -3 -291 -177 -142 22 -44 -102 -189
1669 -189 -304 -163 39 -9 119 -341 -253 -19 -158 -84 -29 -223 147 -258 -291 100 64 -52 -46 -232 -50 -21 -7
1692 -7 179 212 -83 70 63 167 421 81 -81 343 210 232 322 -164 -183 178 -44 210 342 -134 16 -67 -114
1715 -114 3 -240 -247 -239 -371 77 -130 -331 -152 -23 -86 19 -53 54 192 -8 -126 51 61 -141 217 216 29
1738 29 114 -221 122 -27 -68 -34 40 -190 -221 -106 -138 -70 -45 -105 -179 260 47 198 -92 -136 39 203 11 67
1762 67 -188 9 -88 -142 228 316 -10 -88 395 -29 9 353 36 125 -128 70 290 -30 -228 45 -370 -265
1784 -265 -53 130 169 -187 -176 -66 155 113 293 164 -190 83 -35 -137 154 -168 -96 -198 22 49 -137 -97
1806 -97 84 -86 -161 210 365 138 -166 -110 -1 249 -118 49 56 146 -82 -9 -297 64 -87 -212 -147 130 206
1829 206 -154 4 -97 -128 -84 159 108 83 -295 -282 27 238 34 34 9 262 -227 -107 12 211 9 222 -78
1852 -78 74 204 -61 -83 -311 157 -143 -43 90 -192 -132 -208 32 53 -116 236 -14 14 135 -77 121 3
1874 3 133 -38 -208 -36 218 206 -124 -174 -150 -158 -103 -59 -48 266 -245 135 82 300 204 79 -160 195 106 -166
1898 -166 167 136 232 -36 -162 -18 -104 -44 32 4 -205 22 -118 63 118 -109 -131 -5 -200 35 26 -374 215
1921 215 234 -19 -39 193 -126 107 -81 -43 428 147 -57 -33 -89 -133 147 -381 -187 -322 -103 263 -24 -157
1943 -157 -78 26 -14 71 -168 17 245 173 209 175 203 -88 281 408 -108 230 79 146 -54 -184 -173 -264 -96
1966 -96 -368 -167 18 -132 -278 131 -5 -84 -9 -143 -250 83 203 -93 74 -27 201 417 -60 -2 -122
1987 -122 -29 -212 -29 -184 159 -26 -284 -82 -28 73 -342 81 -100 -207 -83 -66 -29 182 -30 69 -28 246
2009 246 307 123 61 199 460 23 219 222 -55 -167 1 -182 -6 147 295 179 -93 73 -179 -115 343 147
2031 147 -250 -45 -132 68 228 -9 95 -114 -297 -9 262 -247 -38 -14 53 -24 -70 -51 -238 -211 191 -86
2053 -86 207 -42 -144 -155 -104 -273 -134 29 -11 -43 -122 -53 51 54 122 155 104 258 91 60 207 -58 53 -44 102
2078 102 76 80 98 -28 -316 -75 -41 40 167 145 -71 68 -134 11 -94 -204 -23 0 221 137 131 -56 9 113
2102 113 -18 149 211 -4 39 -309 -220 -41 -23 89 -43 -161 -29 -27 139 -14 9 78 -151 116 -62 235 -185
2125 -185 -282 19 124 -31 145 50 40 -33 54 275 -72 -277 -120 4 157 -20 -106 -3 -19 217 -13 -31 233
2148 233 181 104 -161 -82 -33 -37 29 75 -13 32 -294 -129 133 -166 -297 -397 -71 110 -8 -102 43 -135 98 37
2172 37 207 76 65 -329 5 -128 20 348 22 39 18 119 -108 222 3 201 -21 -3 106 -100 64 -87
2194 -87 -31 -11 -199 -209 12 97 35 15 145 -192 187 201 255 324 95 56 64 53 188 -17 280 10 -159 68 -392
2219 -392 -100 -236 16 -92 -108 10 -107 -1 -69 18 -29 -69 -42 257 10 146 218 216 30 130 294 -32 -14
2242 -14 81 -73 -172 -232 198 60 -57 151 -95 10 -28 -125 38 35 -18 70 -297 118 -28 -10 171 295 -61 64
2266 64 -47 214 8 -6 -212 180 76 167 -27 59 -114 -112 51 -133 -85 -296 -138 -71 -49 10 -277 -83 86
2289 86 11 130 -220 -21 39 226 -263 -44 63 131 -155 340 -140 -61 243 5 -57 -65 -64 176 217 -52 -151 164
2313 164 -132 -80 16 -69 -281 -203 8 -41 32 27 35 149 -109 -107 208 66 -61 -210 -221 -241 153 -14 -303 -181 -316
2338 -316 -37 88 -66 30 -207 20 161 51 187 245 85 -147 -88 234 111 97 -14 7 67 14 -247 -106
2360 -106 279 169 107 150 6 44 -199 -55 1 -282 12 29 -80 -53 274 -146 33 -238 -70 -20 71 30 4
2383 4 -143 -4 -84 -90 -113 -115 -8 101 -155 113 -5 -166 81 -81 151 -195 -7 -52 91 -17 -27 123 250
2406 250 136 -177 10 -12 127 304 -193 -17 -77 -107 68 -3 -117 273 29 -100 156 -96 -182 91 -289 -4
2428 -4 -135 -31 63 -33 -11 90 206 29 -131 -43 50 -19 -206 21 93 -31 14 -189 -5 169 -153 172 58
2451 58 -70 -46 -362 207 -168 15 249 123 125 50 156 -130 75 42 57 -123 123 38 40 47 189 61 -5 97
2475 97 -140 -207 45 61 278 -101 35 249 -205 14 206 22 88 -200 213 53 180 121 13 78 -167 -63
2497 -63 -77 -181 -74 -164 -178 38 5 -20 -47 32 -140 -16 -321 -41 -99 -98 -242 96 -12 -358 84 -110 -18 -361
2521 -361 -189 220 -136 -33 96 -96 -98 -203 20 280 45 8 110 -90 15 232 207 -47 60 65 15 -7 -164
2544 -164 86 -236 -85 189 220 -177 -62 -72 -261 239 -76 -138 152 32 -150 -78 65 -104 17 98 -175 150
2566 150 -376 95 -115 -115 38 -145 -6 281 125 25 -132 14 306 142 -12 14 182 -2 35 -37 188 6
2588 6 -46 -88 -110 -227 71 102 -44 -113 51 162 -126 125 163 136 -83 -164 84 162 8 -67 109 -73 47 29
2612 29 278 -220 -53 -97 51 -20 -318 -60 -164 1 6 -277 -284 -176 -171 -32 188 129 -170 50 -39 -7 38 -242
2636 -242 -208 75 -90 99 -153 -44 55 -62 272 81 54 194 -90 85 -180 -81 -76 70 8 -327 -139 -9
2658 -9 -425 130 -15 113 -90 -81 67 71 -55 260 -242 132 162 -18 -110 -256 95 -7 149 270 -104 175 -86
2681 -86 -53 100 74 371 -36 93 199 185 -145 28 -129 -12 51 110 -74 11 305 150 -202 140 146 -106 122
2704 122 -160 -173 -230 38 60 27 -91 -66 -57 -258 -60 -42 29 1 279 35 -33 -91 -25 19 173 -46 66 155 -20
2729 -20 -136 -111 106 -42 131 -51 -86 -94 39 -142 -166 -183 -48 -58 40 -9 426 273 -92 -168 153 139 78 -2 193
2754 193 279 33 -214 -8 42 305 -23 -26 108 -190 -100 22 301 -51 -8 -155 -206 177 12 144 -54 19 -9
2777 -9 -186 -26 -254 -65 108 -107 -56 -44 202 117 80 170 -140 -225 -197 227 3 18 18 -45 92 107 -255 30 112
2802 112 -121 -1 53 56 -167 112 -10 -200 91 -27 62 3 -99 268 -113 152 78 24 44 60 156 106 251 -140
2826 -140 -91 -81 -7 -251 -20 5 -289 -52 -226 -54 143 -95 -125 63 -108 248 62 -80 -53 -109 11 -117
2848 -117 100 67 -138 -26 -35 169 313 123 8 -65 -139 44 82 42 89 23 -173 131 121 -280 269 5 151
2871 151 125 -154 165 141 310 117 -102 212 115 57 155 -132 -82 -69 -69 31 120 180 -100 157 -48 -111 -76 47
2895 47 -120 226 -125 4 23 75 199 151 207 -32 -128 -149 -115 60 -98 161 92 1 -118 -108 38 -225 27 -77
2919 -77 102 110 -150 155 -113 45 191 27 189 45 -12 17 -76 3 -87 166 150 38 207 78 147 21 93 -158
2943 -158 168 170 271 153 -141 -145 -65 -165 -50 -168 -152 -47 -199 68 -164 -101 -24 -181 72 -324 -350 -37 128
2966 128 -48 117 5 79 225 -80 83 139 -377 -14 -26 48 60 101 -8 61 115 232 54 -84 57 -31 -120
2989 -120 126 110 66 -55 138 304 -303 71 -203 -50 184 -41 -127 -101 105 37 161 -139 252 89 -123 42
3011 42 131 111 62 -277 -64 -449 -126 137 -71 91 -1 -172 -114 173 -160 -104 66 -37 -16 -54 -106 -97 161 -181
3035 -181 94 85 -84 -107 -40 127 37 -23 88 -99 68 50 149 47 143 -49 29 154 100 -23 -214 217 -69 165
3059 165 -8 -109 75 162 -279 16 -72 36 53 -260 104 355 -61 55 148 -85 120 -116 -81 -137 -45 118
3081 118 84 334 -42 31 87 127 -120 185 10 248 -127 9 55 77 340 -65 46 -139 82 320 25 -183
3103 -183 305 -52 -129 146 137 -278 -292 -194 -206 -107 208 -53 166 -1 -132 115 156 80 -28 -171 -86 104 31 -1
3127 -1 -51 7 -145 -4 11 0 49 -36 -62 100 -151 -246 199 65 428 -7 -81 206 -108 -78 -190 -26 64 12 285
3152 285 44 -83 135 -45 -6 -91 109 19 74 54 -35 22 -171 -125 216 -56 3 293 -70 4 -145 -243 10 65
3176 65 -90 10 -189 138 -245 137 -61 -110 140 -110 -15 -125 217 -38 -70 55 -126 83 180 -228 195 -134
3198 -134 -132 121 -94 76 -68 -182 -90 10 -18 111 -92 -99 -283 119 -127 25 71 78 -94 -276 -91 196 -34
3221 -34 -89 -19 -59 232 -94 172 119 95 28 62 132 -17 -160 24 -39 -17 279 160 9 -210 -85 -105 -127 67
3245 67 -114 -150 67 -139 11 -37 -46 -265 86 179 -159 100 17 -158 -119 -72 -258 -14 19 -254 -29 85 -146
3268 -146 196 -305 -149 17 59 -254 190 -91 -11 118 61 -57 4 104 16 -107 7 -81 29 158 -82 47
3290 47 300 242 41 123 -72 -128 -320 125 -149 290 -238 4 26 0 -128 68 86 -80 171 67 -33 21 -160
3313 -160 -76 74 -168 139 -53 95 -158 -193 -111 199 42 -49 -88 -64 -30 125 192 2 -33 66 61 1 -7 130 82
3338 82 -256 -27 65 -8 59 -76 -143 162 -83 -180 13 -81 79 -9 -129 0 123 -87 -141 -60 45 -188 20
3361 20 21 -42 59 -9 244 -7 -61 19 67 86 361 87 -93 -139 91 -14 -123 -190 -228 190 -105 -205 200 -49
3385 -49 125 -53 -6 -72 -212 -24 -165 -96 12 10 172 31 -34 56 -169 -98 -189 -90 -54 -126 172 -215 146 -93
3409 -93 249 -90 5 14 174 -145 -107 76 -176 -134 124 -114 423 210 83 -83 0 190 -238 209 150 13 -248
3432 -248 -183 22 153 76 245 -39 83 180 286 224 43 17 -19 18 71 -214 122 13 -82 247 -10 -113 -167
3455 -167 95 97 -21 -22 31 67 21 139 248 140 129 -180 -125 121 28 84 -23 40 26 132 176 -1 -122 -110 -328
3480 -328 64 -34 87 -30 105 -80 215 -88 -116 281 -133 263 215 -176 -315 -36 -137 -22 167 -102 -43
3501 -43 131 -40 152 -94 -316 -309 62 80 5 9 23 -34 -106 -52 79 -77 -262 30 22 -40 -45 -119 -392 -109 101 -206
3527 -206 -5 51 -4 -63 -168 -46 -92 71 -108 -44 -253 89 296 135 163 -161 -17 -23 -61 -109 -301 6 -237
3550 -237 79 33 -52 -333 2 176 -53 246 76 -73 62 30 -79 -50 231 -82 75 -52 -31 37 98 -21
3572 -21 -64 33 108 11 -84 -131 -2 87 31 68 189 272 179 -11 339 151 -127 256 -207 87 101 -17 129 222 -2
3597 -2 106 57 242 -35 36 47 134 78 35 -126 -53 153 137 40 -41 64 -112 -74 95 -89 52 17 -21 -21 -64 80
3623 80 31 -30 -115 111 120 170 14 55 214 -180 237 45 9 124 -40 34 -1 129 -132 29 -7 -60 -180 10
3647 10 29 -138 1 -49 -74 165 343 -8 -132 49 -140 -235 -78 9 40 156 129 -175 -10 118 80 43 -107
3670 -107 -102 -238 123 20 208 -129 -86 -73 -147 -17 -131 -219 -101 -170 -149 -146 329 43 -115 79 -56 4 23 -116
3694 -116 238 -17 32 164 52 10 85 -222 87 -133 -171 126 -169 -56 35 5 42 -11 -28 -41 -94 59 -119 76
3718 76 64 228 16 104 -145 -293 27 105 -180 252 -109 102 38 47 47 -112 -20 105 0 113 -352 133 128 11
3742 11 237 38 -174 81 -134 -125 -170 -137 251 138 -88 -1 -37 -25 -55 27 19 -176 242 140 176 76 102 72 -5
3767 -5 -20 263 102 9 255 -174 187 -63 -162 22 139 -34 -104 34 127 68 -50 -86 -204 -1 -74 -34 27 -146
3791 -146 59 45 -120 -53 74 244 -26 81 -41 34 -58 -51 -42 25 -79 132 -40 -73 26 32 -9 -120 29 1 79
3816 79 142 74 123 88 275 -29 7 -55 81 254 99 69 189 57 168 -150 -58 15 78 77 -91 257 123 -38
3840 -38 85 41 44 -29 167 -8 26 225 -186 -143 -52 63 118 -101 173 36 -182 235 -9 -178 -210 -158 49 -1
3864 -1 -46 71 -106 -124 174 -168 -218 35 -141 36 233 -93 -211 100 -172 170 -31 -184 40 -34 230 144
3886 144 259 -51 -167 229 135 52 -115 35 106 31 -199 33 -97 1 -140 110 101 -68 120 -22 -51 33 -169
3909 -169 -199 24 -128 192 -110 -54 93 -87 -114 -44 -10 52 15 -339 -146 150 31 -187 83 -70 298 75
3931 75 -63 44 173 134 -159 139 -184 98 80 49 -151 50 91 -7 -109 19 165 62 -61 59 36 112 -18
3954 -18 5 -163 250 -216 -29 -12 -15 -129 18 96 136 204 -137 -84 2 92 22 4 -14 160 -127 92 24 105 -45
3979 -45 -2 10 12 59 -26 64 -110 -173 44 55 100 21 -35 -107 -181 204 57 124 -21 136 -30 -139 -209 -68 79 -85
4005 -85 34 84 -59 117 57 -14 -48 -120 -80 -17 -208 154 227 -65 205 -14 61 94 145 -65 -29 -20 -125 98 -234
4030 -234 -1 113 -173 -266 169 -16 -138 21 93 -86 -67 68 -95 113 -95 -22 7 -36 82 33 -60 -29 40
4053 40 76 -255 -73 -48 -108 -33 -167 113 47 36 61 85 -309 -17 17 26 -72 105 -210 185 174 -70 37 55 -163
4078 -163 37 -26 -100 10 -169 -132 170 -80 -11 134 -26 -116 -91 -225 -82 165 75 100 -96 84 -261 12 -98
4101 -98 -187 106 79 20 -81 -104 72 63 -101 210 196 15 -111 -207 -10 158 29 52 -35 -221 -259 -6 57 14 12
4126 12 182 -207 -298 82 7 -134 2 163 156 -43 -189 -35 161 61 -21 -59 -50 89 -41 146 177 100 -24 -57
4150 -57 -134 47 -159 101 -50 323 -38 -133 -24 -232 -64 247 -3 -23 14 68 -68 -35 -36 -81 94 162 264 402
4174 402 57 -209 57 -26 112 -53 -59 7 26 -176 0 -65 219 3 -214 -66 -65 -198 -150 -246 -10 -216 42
4197 42 167 26 -12 58 3 70 32 -121 68 178 99 -105 -96 75 91 16 -17 -198 -174 310 -77 -102 -218 -91 -254
4222 -254 -126 138 138 132 188 -9 132 -7 134 -74 -25 18 -203 4 9 36 -228 168 83 21 77 -12 -213 -173 -199
4247 -199 20 283 96 71 -62 -226 161 -80 -18 -169 -32 110 -12 246 89 -65 -66 -188 -13 208 -44
4268 -44 -75 -61 -201 119 23 121 -118 30 -19 -213 126 90 -16 112 151 186 40 -204 276 -40 -85 -147 -46 166
4292 166 -175 29 47 -17 -110 156 -82 69 52 -103 -136 -101 -14 -19 42 -120 -56 -138 -115 -38 -10 140 118 5 39 -175
4318 -175 255 56 -3 -98 -111 -170 -12 222 -26 264 -18 -57 5 -89 219 36 -92 124 196 -188 -107 117 -126
4341 -126 62 -90 -9 -125 106 236 27 108 15 -81 -224 -143 -43 142 311 83 71 69 207 21 230 97 87
4364 87 166 172 30 -235 126 -68 100 55 -4 47 -4 288 54 -105 -67 254 -254 -89 -6 -41 -61 -35 132 -87
4388 -87 -11 -61 -92 -127 -120 -55 227 -226 -77 -61 -89 1 175 -166 63 -2 -26 -85 246 82 23 -24 -189 -74 44
4413 44 98 110 0 -83 -88 -207 131 -111 25 122 -120 90 -80 -37 96 -125 -23 121 167 -225 93 141 -5
4436 -5 -174 -59 -199 176 87 -3 -34 2 -156 58 -10 57 186 116 3 250 163 -276 -181 -152 -20 23 -119 -58 -531
4461 -531 -73 93 -54 120 -134 334 -129 -41 74 44 -57 -75 -64 -350 29 16 -46 -22 -24 48 133 185 123 -152
4485 -152 -152 -51 -232 -266 -120 131 -78 168 179 -164 84 227 -74 236 165 26 54 155 -166 27 93 -111
4507 -111 -195 -31 -35 49 -75 -105 -64 49 -65 -302 -82 -343 -40 40 -88 -420 106 -132 51 125 116 -56 133
4530 133 -21 -2 62 -38 336 -99 -169 204 -162 101 -90 -12 16 -212 69 -134 43 35 88 165 184 43 43 42 -40
4555 -40 -31 -8 138 29 189 -70 212 -32 -45 -51 54 -54 74 24 140 87 -82 -161 212 -30 -58 -113 -295 87
4579 87 104 -39 24 97 48 -54 -75 122 -6 -205 -71 56 73 -179 -29 -24 -133 87 41 -29 -152 30 110 35
4603 35 -9 -69 1 25 -47 -128 -88 203 -4 -338 -162 -46 -338 206 275 157 202 74 68 36 -140 -82 187 -91 -66
4628 -66 -257 88 -123 -104 -302 47 -95 32 29 -55 134 -54 21 183 -25 165 200 46 28 -205 194 107 181
4651 181 64 -120 -157 201 -75 -104 -14 -55 -47 93 -78 19 27 235 -38 168 254 -52 158 -256 83 -211 139
4674 139 6 -26 -26 -73 101 18 263 -236 -53 -39 27 25 62 198 -118 22 248 104 -116 187 -141 -32 253
4697 253 190 -198 34 209 31 -78 232 -92 91 48 -121 165 45 -163 -158 40 -13 -35 -18 -63 -234 -233 182
4720 182 11 13 -135 -171 173 -216 -363 -238 -170 -14 71 -132 -10 37 -115 82 -47 31 158 -1 145 40
4742 40 197 218 91 86 -94 12 -184 43 154 -116 60 143 -108 36 -9 -133 -63 7 26 -185 143 -13 10
4765 10 57 77 132 -4 -33 -183 -37 -132 -15 -109 -340 -67 -48 42 160 66 40 -31 -144 74 38 -104 -33 137 60
4790 60 46 -10 130 -23 -85 67 -29 127 -243 -101 -103 -142 -97 -110 -61 90 102 -148 -111 -10 295 -29 143 37
4814 37 107 -188 49 94 -153 90 89 27 61 26 0 133 91 250 210 53 -115 -89 115 -197 -211 -161 258 -82 -118
4839 -118 -135 -147 70 9 -12 44 -74 -167 37 -150 -75 50 -25 -123 54 -114 -21 4 -197 41 -161 -49 -247 29
4863 29 133 191 41 -20 94 -47 -111 -81 57 -22 101 -160 362 -136 -30 1 -5 119 -120 -135 10 106 7 24
4887 24 5 272 -38 -23 -26 155 59 -8 -191 -39 274 52 -2 223 147 -35 306 -75 -67 128 109 138 -97 213
4911 213 50 -144 -24 40 48 -39 137 56 26 -93 -89 245 -45 -92 -85 -39 114 -125 -96 16 -29 95 14 -234 -235 150
4937 150 -62 -192 205 -154 -210 -31 -268 -94 -4 -171 122 98 -52 -35 -164 -212 -30 174 -194 -14 -91 177
4959 177 -137 -218 27 -126 127 42 55 -110 -114 -49 245 134 -28 87 -143 183 -81 -45 12 -208 282 -174 26
4982 26 -91 67 -1 -96 81 -34 234 4 -137 13 -105 -214 -146 95 -161 17 133 67 135 3 -110 -75
5004 -75 84 -67 56 91 -167 41 -173 235 -85 -90 -123 113 -129 45 -151 -177 111 40 -24 -378 -34 -52 -28
5027 -28 248 190 111 252 -4 41 -62 14 -30 -155 -104 -112 74 299 -66 -75 -128 -123 -31 123 83 57 -233 -149 79 -49
5053 -49 -203 160 108 99 59 -80 57 28 302 -24 170 -33 12 -116 230 54 60 108 -129 130 -67 -7 188 -1
5077 -1 -9 52 -195 130 -39 50 -218 11 -130 -91 92 355 -6 78 -38 124 -68 -22 127 -162 69 92 33 -98
5101 -98 -102 87 148 -119 -87 -157 63 250 -219 81 89 42 -111 -24 137 36 -8 90 38 202 -84 -118 140 77 -42
5126 -42 22 27 -127 106 61 18 -2 18 228 -19 -46 150 -82 112 57 269 -152 -349 -47 -95 -48 -111 93 -183
5150 -183 137 224 -79 -36 -101 -97 -122 53 120 89 120 169 89 13 -269 233 44 43 11 -15 -35 -378 -163 -166 212 -172
5176 -172 -55 -63 12 -148 -42 -159 43 296 133 -132 -84 55 75 71 19 -212 167 10 2 39 -107 29 1 68
5200 68 -39 -89 -175 -64 -10 -12 -191 -113 -13 62 -93 -43 -121 95 -187 105 -121 234 -96 -136 -42 -135 -95 -240 -4
5225 -4 -70 -13 -155 80 62 -23 -323 -28 -39 101 -115 -328 -4 205 29 -120 218 69 -113 48 21 -19 228
5248 228 142 -56 115 -88 -20 206 152 -81 -18 6 46 -61 34 87 63 172 314 -93 -230 -91 -27 -46 -115 111
5272 111 -97 -87 36 222 169 62 -41 -46 -152 -140 -87 -92 55 -122 -393 40 102 -46 30 -222 -160 199 109 -202
5296 -202 -212 -140 110 136 24 -21 -167 60 -44 -136 48 -95 -8 -38 -20 48 125 103 -317 157 101 66 -196 -105 -54
5321 -54 -103 20 63 155 246 -189 70 82 218 -101 9 -198 23 -98 -142 229 -67 38 -100 142 -22 91
5343 91 34 -120 -24 -74 138 -65 10 206 164 94 69 -74 168 -8 -229 -201 133 25 -279 119 81 51 -18 -46
5367 -46 41 7 18 9 -52 141 67 62 170 -158 122 -46 53 -75 106 -173 -226 -7 48 -95 -87 33 -76 -44 17 26
5393 26 -129 -133 -71 -23 76 -117 16 -39 -74 256 -156 -63 142 15 102 71 109 14 175 169 57 -41 89 -53 7 15
5419 15 -9 221 -39 131 -180 120 98 -202 53 272 -275 -61 96 -37 241 -176 13 -151 -30 202 -177
5440 -177 30 -12 -72 54 -227 -70 252 -157 111 -142 50 38 -153 133 -93 -135 73 -42 -14 8 340 -257
5462 -257 -121 226 77 -83 9 -185 -48 -3 65 7 229 37 -54 24 -149 -92 -176 9 192 16 -2 57 -7 29
5486 29 131 -202 -120 -103 15 -109 2 117 46 -235 -166 96 -12 11 -44 14 201 -4 -87 -490 -137 -81 -116 18
5510 18 -179 -37 43 88 -344 -48 -55 -117 -205 -12 -159 151 -132 89 84 77 -135 384 80 -71 -93 51 -12 60 155
5535 155 122 110 61 42 -126 62 -114 -246 80 13 16 124 3 199 47 -69 -121 92 -119 221 233 111 -171
5558 -171 22 -49 140 -79 20 -68 -47 -213 -94 69 128 -88 -335 44 26 43 234 88 -184 -126 -217 3 -144
5581 -144 -161 49 60 -234 -101 223 -78 -37 70 -271 115 9 -68 127 143 -24 65 -103 167 114 128 -104 -62
5604 -62 -3 -245 61 -28 -102 34 52 -354 50 81 -104 -62 -220 -114 125 181 134 -21 -25 -15 4 -257 187 -57
5628 -57 -237 -92 -29 -66 -202 -36 28 -49 -218 -134 123 189 -162 -390 -135 30 78 -118 92 118 71 190 -276
5651 -276 158 -139 54 221 72 8 63 -138 -173 -178 2 -121 89 -59 249 151 138 -3 13 151 -225 -122 98
5674 98 289 -73 -283 164 123 -6 -60 -25 79 -142 336 135 -46 42 -57 163 8 -13 -154 177 -70 82
5696 82 -62 149 -151 176 23 14 -80 -239 55 -61 62 -151 -101 -60 86 -33 81 -62 -173 -27 10 -263
5718 -263 195 5 271 129 -102 4 -197 199 -39 -80 118 -44 -249 -32 -1 -168 -55 -11 -172 -45 -60
5739 -60 154 14 11 133 72 51 75 59 94 -74 98 -180 54 9 -74 116 1 -224 61 -138 120 148 184 111
5763 111 212 -180 110 -229 -27 34 130 209 -104 -94 94 -59 -12 -74 -95 41 -237 -24 -136 40 145 -137
5785 -137 -164 -105 -188 94 6 -155 -39 -60 121 -133 169 -30 -65 -44 -147 -107 19 -1 206 222 -63 177 34
5808 34 -61 6 -277 -66 11 -31 159 -25 185 116 -192 -61 -54 124 -22 267 37 151 -181 -77 -49 -306 38
5831 38 23 -238 10 130 -14 30 -19 -165 22 -129 117 -63 81 -90 124 -27 369 4 231 125 -206
5852 -206 203 80 2 0 -100 -16 -81 111 94 -43 277 -26 53 38 149 373 158 127 -64 28 -2 1 -69 33 -26
5877 -26 -40 102 -134 -67 -69 91 -192 -105 248 -29 -39 -58 34 -252 301 117 -149 80 15 -83 168 -140 -145 334
5901 334 241 -140 188 -28 258 65 -74 36 -107 -173 62 180 -47 -53 37 -88 -108 115 18 -4 -2 6 142 -38
5925 -38 -187 -101 84 -42 -47 -17 -32 116 -5 -125 -183 -91 -233 4 -212 -152 168 -237 71 111 -127 -18 -164
5948 -164 37 185 101 -23 21 -27 -208 201 141 -16 182 -38 -71 -309 9 -61 101 68 69 -225 93 58 95 -32
5972 -32 145 15 13 -122 76 -3 150 176 244 -44 -19 111 -2 20 -89 96 -136 182 15 55 110 27 26 207
5996 207 57 -115 119 14 -273 -32 168 88 121 -139 176 22 16 14 -61 53 114 -163 65 4 139 207 143 29
6020 29 79 -11 -169 210 -259 -4 426 0 -30 -78 -9 -34 -119 -95 105 78 -69 -200 61 -103 218 -99 -79 10
6044 10 -153 -152 257 -179 153 -47 52 -96 52 -114 -217 52 29 -268 189 162 -59 219 68 -28 -51 -50 -146 -44
6068 -44 121 58 -131 -34 -16 62 -123 -39 -5 -127 -236 123 84 3 -170 -58 45 40 76 -59 -45 200 282 -131 251
6093 251 -35 195 74 224 -8 14 4 -222 -84 -147 -134 78 67 214 149 -212 -23 -62 -159 155 245 -15 -2
6116 -2 -103 -120 117 -16 -24 194 126 -64 34 -107 213 -183 130 70 -106 -111 41 84 -21 101 14 -206 -42 314
6140 314 -119 50 0 53 13 -105 -69 55 -162 -146 9 -189 -30 -115 49 -126 -96 -68 123 102 -77 -225 -96
6163 -96 156 158 -170 33 64 119 -43 113 155 -108 72 -88 13 126 232 198 -4 74 170 35 -2 -7 17 -12 184
6188 184 -82 -108 -266 -24 60 25 -55 -115 119 -163 -222 -60 31 90 -53 36 184 -198 -85 27 87 153 61 145
6212 145 -135 -48 122 159 -24 -155 -29 78 -58 -198 -25 -99 258 123 -168 235 -4 157 58 -324 -79
6233 -79 143 38 -31 -253 -156 -69 77 -213 -209 -46 61 76 103 135 -275 55 -84 -46 20 -105 63 50 -37 38 -147
6258 -147 -82 70 -153 -126 -53 -121 -138 81 -196 -43 2 121 118 86 32 -170 -120 198 149 -143 -96 28 124 -3 342
6283 342 -165 -176 120 154 -33 183 278 -89 -129 -93 175 96 57 89 -107 166 -157 119 45 218 124 21 -29 -57
6307 -57 363 -69 -89 -135 135 111 -83 -340 -5 -150 101 -236 2 169 -52 -94 -63 4 -81 101 34 143 67
6330 67 -55 -141 62 141 -321 67 -29 -166 216 138 -2 118 -66 -114 62 -18 110 37 197 31 251 -96 -15
6353 -15 149 -165 26 150 42 75 178 -65 83 -7 -29 46 93 74 9 -23 139 158 -21 203 64 186 47
6376 47 75 -121 106 -140 -82 43 -129 -73 231 -95 -96 4 -2 -84 11 189 -20 265 348 -200 -114 162 -176 -69
6400 -69 183 209 -15 30 -51 -127 -20 155 288 91 -86 -251 175 68 227 -59 107 199 43 -165 -267 -10
6422 -10 -195 -101 195 83 -8 97 -104 28 -174 -124 -114 -88 -2 -34 -82 -35 14 -70 -121 192 -4 -76 40 40 -9 77
6448 77 141 -1 53 13 -289 -1 -147 -14 42 5 -168 -18 -57 -323 -191 140 99 91 -45 -278 104 -197 -68
6471 -68 -116 119 164 -5 60 41 -86 -46 13 92 113 -113 -229 -235 117 -155 -22 119 75 -185 64 181 -25 -56
6495 -56 -45 258 -219 121 -115 110 38 -80 73 -1 -64 76 46 -29 0 15 152 -243 -94 -86 -42 115 54 -18 -30
6520 -30 215 47 -62 207 -263 176 41 -110 -55 140 -193 -57 -79 -123 49 -186 -103 36 -241 152 -166 -232
6542 -232 1 -82 68 -160 63 -124 217 -94 -253 151 25 -129 68 -196 166 31 -39 87 16 12 85 93 -55
6565 -55 48 107 -11 -31 57 35 -179 81 -112 -152 84 -4 -105 130 71 -68 -147 -133 -168 -212 -172 -176 -96 -100 172 -74
6591 -74 99 71 -291 223 -96 -108 62 67 -205 -101 -160 -71 -84 -59 -194 -73 -163 47 -111 -199 251 -350 161 107
6615 107 -76 -145 -91 119 -473 158 241 151 -21 -193 -156 -101 -33 -28 -62 74 -243 110 -36 -5 -19 -146 32 -21
6639 -21 -80 -25 4 71 -27 214 -67 153 346 -191 18 -67 185 49 -148 -69 68 -71 125 -74 -222 195 93
6662 93 -28 160 194 -128 -152 238 -58 17 -180 149 83 7 214 179 21 190 222 130 56 -109 -197 -119 158 -151
6686 -151 -92 83 -40 -250 -66 -121 -277 -29 96 -76 298 -136 147 7 -28 22 204 -148 -71 43 137 41
6708 41 324 117 107 209 134 -1 36 -48 -326 303 -195 -261 -16 35 198 -176 -128 19 95 335 147 -123 34
6731 34 216 17 25 123 201 -10 112 -114 -58 -161 -82 11 -100 -67 300 29 -60 -226 90 -94 -78 66 -207 150
6755 150 13 272 -28 288 -21 57 -197 -202 221 -44 -87 -216 52 233 285 -15 -65 155 -111 101 134 179 -22
6778 -22 135 -69 -96 -146 -93 -83 -68 -14 112 113 -61 187 192 34 -167 63 -52 -189 11 -93 28 -46 -63 -66 -195
6803 -195 -77 198 96 8 -22 -150 139 -153 -74 -99 -1 184 -36 -85 6 10 48 -54 62 105 -49 -74 143 -353
6827 -353 -165 115 322 -74 147 74 -177 82 -152 158 -21 -81 183 74 -8 -85 4 -208 -28 126 -21 222
6849 222 191 -1 -61 105 -143 24 255 55 -179 42 224 57 4 96 -70 168 -36 -132 -81 97 215 -77
6871 -77 -117 -42 210 89 -21 -27 68 97 52 179 -132 131 179 -77 102 -268 -72 -121 104 261 32 -79 13 99
6895 99 116 209 -63 159 173 101 -144 -71 -204 -70 -148 146 -80 111 -116 31 134 206 -183 -131 -40 161 87 -135
6919 -135 154 -180 127 39 71 -233 -331 118 -101 -127 92 -86 -174 -49 -104 -20 105 -215 -28 62 -68 183 -20
6942 -20 -130 208 -88 25 145 -46 28 66 -10 79 113 -42 -31 254 -19 -269 7 141 -89 -31 -52 -2 139
6965 139 209 -133 -84 78 -162 157 -24 -169 -185 -196 -101 8 52 -100 115 -33 88 -34 -64 -321 -103 -92 -136
6988 -136 465 -25 -184 413 -121 -192 63 -262 -1 -23 30 -103 -35 184 20 91 -55 -36 170 -45 87 47
7010 47 100 52 -43 173 151 198 -69 296 92 172 -68 11 -80 88 -20 11 -148 87 -242 132 70 27 -89 29
7034 29 150 -54 -29 -41 37 79 -34 141 75 -55 110 -22 -8 -39 -127 -159 -146 -27 0 88 -176 95 -55 -25 131
7059 131 15 -34 -149 -199 15 74 -28 -1 -326 126 -174 -112 -24 -64 -92 -215 -144 -261 -34 23 16 -62 -5 182 -62
7084 -62 158 -226 132 -38 -116 27 -205 -113 195 78 -24 -215 -68 -20 180 185 -152 95 8 -166 26 -5 103
7107 103 -134 136 161 -174 11 -16 161 36 -131 -67 -143 -74 6 26 -66 -84 112 211 154 -214 118 -67 18 -86
7131 -86 -272 -17 -173 173 24 -138 -17 -21 206 90 64 -158 -231 -21 25 30 249 43 178 243 -20 -38 -23 16
7155 16 -129 163 0 -53 60 -196 207 59 -115 0 -70 114 -327 -112 70 32 -81 -43 -92 150 -52 42
7177 42 -87 -37 -60 -60 110 -142 18 152 -154 12 -189 -71 109 -51 93 317 -92 -125 -8 94 257 88
7199 88 -127 229 13 77 -6 118 12 -148 -230 229 -121 113 -102 17 12 2 -58 -185 -150 -87 26 -10 18 -126
7223 -126 54 -67 -73 104 -57 -92 -166 -39 7 115 -32 98 15 45 -106 -292 -231 291 21 -192 149 94 93 72
7247 72 -93 58 -162 -118 -82 28 -20 142 145 -61 21 -105 2 56 113 -1 121 -225 -292 -57 -41 -9 -62 -89 -205
7272 -205 68 50 165 83 -26 283 -89 -53 -32 72 301 80 62 35 -33 -188 -20 115 66 -212 -230 -197 59
7295 59 34 -9 272 74 1 -86 -17 -173 148 106 147 145 -92 -41 -83 104 -76 -44 20 233 -144 -34 -31 22 -161 -231
7321 -231 164 30 -70 -87 49 -51 14 -17 -47 -265 177 43 -15 141 -309 196 1 247 188 -313 101 -56
7343 -56 -26 53 19 7 53 103 238 -56 -374 -36 -81 -39 -215 86 278 41 -106 59 -55 196 70 32 -118
7366 -118 -178 -32 -57 136 -90 80 128 -97 254 324 87 6 -100 -60 88 -27 -55 39 107 14 -308 -128 -7
7389 -7 -91 68 51 13 -83 -83 -191 114 292 238 -264 65 -113 -120 -94 57 -59 -13 158 -95 79 48 -58 104 9
7414 9 31 -42 -103 -200 246 35 8 52 65 226 -57 -108 -153 3 -266 67 -79 -110 64 -288 -89 -68 -176 232
7438 232 -2 -280 -15 0 -79 293 -82 99 -36 303 82 -4 91 98 -55 227 -48 -16 359 75 45 285 -56
7461 -56 -390 -46 -52 60 68 -258 47 -46 29 77 -5 -269 -76 32 40 194 -68 21 169 -24 -203 -121 46 51 100
7486 100 -78 79 59 -121 141 -144 -13 257 -33 -12 -257 -179 65 -157 52 75 12 89 -39 64 295 85
7508 85 -207 55 41 -5 164 -66 73 54 179 -147 -217 -9 -145 10 27 -145 51 71 13 -106 8 13 -282
7531 -282 -171 -165 -157 55 -27 90 20 -6 -100 -140 12 -202 120 -131 164 -3 -118 -17 -36 -3 48 46 128 -380 -250
7556 -250 73 -193 136 31 102 204 -97 8 75 100 111 23 246 -50 -213 -42 -39 -107 -157 125 50 -163 -95 16
7580 16 -30 132 72 66 100 -36 -18 107 89 56 -59 -190 73 66 128 132 -148 99 51 34 -9 45 28 25 -108 263 157
7607 157 -136 24 -99 -54 -217 95 -352 114 55 41 -18 -126 235 -66 -148 -12 -43 -75 -59 60 132 -143 217
7630 217 145 -87 -9 -21 -48 -45 70 215 -4 -80 45 -77 9 -234 83 -59 -27 23 -61 59 -188 172 309 16
7654 16 29 181 80 67 -147 -66 -188 71 140 -141 67 -45 85 62 -98 -70 -87 -99 167 -177 -46 43 35 -101
7678 -101 -41 -13 -103 -122 -244 44 -65 -128 5 -169 216 249 227 174 -211 -69 75 347 -41 254 -190 -69 102
7701 102 -11 232 147 -93 125 71 87 -133 49 -76 -10 -21 -238 -38 -46 132 -208 22 175 -204 -223 60 -31
7724 -31 -430 98 -73 125 -33 -59 -107 -38 287 266 -172 111 5 -35 4 56 16 4 104 -8 112 89 -34 -127
7748 -127 -97 143 63 -88 -55 -134 151 -89 12 64 -278 -57 -1 179 99 -161 -85 184 127 54 -8 144 133 30
7772 30 148 9 34 -215 -218 197 -52 219 -38 74 -204 110 -29 -7 -47 53 13 49 -158 181 147 -51 -61
7795 -61 -61 -8 -131 -133 -135 129 79 -29 -50 -33 35 -14 70 -29 169 23 -86 -80 204 50 -152 -209 271 71 11 -281
7821 -281 112 145 -75 160 -108 -88 -62 -122 -182 -92 -88 -69 31 4 38 -74 -2 -71 86 -64 -106 46 -111 -161 64
7846 64 27 -21 168 -60 -32 32 250 22 22 22 86 191 -92 69 -97 -239 96 72 159 139 -8 -51 125 27 55
7871 55 -22 -68 -67 167 77 -65 -88 15 -40 -47 289 -44 220 102 248 87 96 273 -41 -176 216 33 -155 -182
7895 -182 87 -115 -31 41 245 -204 18 51 -200 -117 107 -101 -39 13 8 -20 226 109 -126 1 -171 52 217
7918 217 -72 204 200 113 46 219 274 151 147 56 27 -158 74 -106 71 6 -75 -214 99 -213 207 40 90 -37
7942 -37 191 -197 -99 148 45 244 -160 145 -65 87 -150 164 -64 54 -45 114 165 -77 -251 142 -33
7963 -33 -46 147 -112 -102 204 -92 39 167 40 -100 182 -200 172 185 -219 217 121 -318 -224 88 120 -66
7985 -66 94 122 19 262 -86 72 202 -36 8 96 -179 114 91 -247 -72 80 269 -212 333 -208 -209 179
8007 179 27 -49 -147 48 134 175 63 -58 -6 -179 371 -30 107 314 -34 100 -127 165 82 -155 -81 10 -50
8030 -50 16 61 62 72 148 155 141 -169 -95 78 -105 -32 76 -120 -45 -120 128 23 -56 -273 26 99 -258 -36 -56 303
8056 303 263 142 -118 -29 25 -31 -398 -122 -172 138 -93 240 -122 -328 219 -266 -256 70 25 172 -88 145
8078 145 37 -80 -302 -52 152 108 228 30 -98 -15 17 233 -82 -217 21 36 -98 190 123 -4 278 -22
8100 -22 -306 -9 -59 -5 -34 50 187 -44 55 206 5 -312 89 315 13 73 348 50 -11 22 -237 -8 -47
8123 -47 17 150 46 1 -74 16 119 -31 35 -78 -214 -53 -23 87 7 -133 139 84 247 -113 298 -143 20
8146 20 -60 287 205 221 -142 -144 104 -2 -183 -43 328 158 -56 130 8 -198 -104 208 208 -8 125 -234 -99
8169 -99 121 93 -151 29 233 81 -33 25 154 -47 -78 -260 22 77 -42 -68 -56 -147 179 81 136 -100
8191a00
##END NTUPLES=NMR FID
##END=
