##TITLE=1H_LR-758-R4-KA1-CR1
 CCl4
 8 sc, 
 26.9.2023
##JCAMPDX= 6.0         $$ Bruker NMR JCAMP-DX V2.0
##DATA TYPE= NMR FID
##DATA CLASS= NTUPLES
##ORIGIN= UXNMR, Bruker Analytische Messtechnik GmbH
##OWNER= root
$$ XWIN-NMR		Version 3.5
$$ Tue Sep 26 14:42:01 2023 Russian Standard Time (UT+4h)  she@DPX200
##.OBSERVE FREQUENCY= 200.134
##.OBSERVE NUCLEUS= ^1H
##.DELAY= (6, 6)
##.ACQUISITION MODE= SIMULTANEOUS
##.ACQUISITION SCHEME= undefined
##.AVERAGES= 8
##.DIGITISER RES= 18
##SPECTROMETER/DATA SYSTEM= spect
##.PULSE SEQUENCE= zg30
##.SOLVENT NAME= CDCl3
##.SHIFT REFERENCE= (INTERNAL, CDCl3, 0, 15.7039)
##AUDIT TRAIL= $$ (NUMBER, WHEN, WHO, WHERE, WHAT)
$$ ##TITLE= Audit trail, XWIN-NMR		Version 3.5
$$ ##JCAMPDX= 5.01
$$ ##ORIGIN= Bruker BioSpin GmbH
$$ ##OWNER= she
$$ F:/spectra/data/she/nmr/H-F/1/audita.txt
$$ ##AUDIT TRAIL=  $$ (NUMBER, WHEN, WHO, WHERE, WHAT)
(   1,<2023-09-26 14:40:52.06 +0400>,<she>,<DPX200>,
      <created by zg, POWCHK disabled, PULCHK disabled
       configuration hash MD5:
       00 E9 B6 7A A2 85 ED C7 34 08 36 98 17 FE 4E 26
       data hash MD5: 16K
       6D B6 C9 77 DD 5F 8F BC 02 E8 CD 95 20 B8 19 D7>)
$$ ##END=
$$ 
$$ hash MD5
$$ 3C 41 C3 18 9C F4 01 DF CA 0E 5B 82 E9 DF 28 1B
##$RELAX= 
##$RELAX= 
##$RELAX= 
##$RELAX= 
##$RELAX= 
##$RELAX= 
$$ Bruker specific parameters
$$ --------------------------
##$DU= <F:/spectra>
##$EXPNO= 1
##$NAME= <H-F>
##$PROCNO= 1
##$TYPE= <nmr>
##$USER= <she>
##$AMP= (0..31)
100 100 100 100 100 100 100 100 100 100 100 100 100 100 100 100 100 100 
100 100 100 100 100 100 100 100 100 100 100 100 100 100 
##$AQSEQ= 0
##$AQ_mod= 1
##$AUNM= <au_zg>
##$AUTOPOS= <>
##$BF1= 200.13
##$BF2= 200.13
##$BF3= 200.13
##$BF4= 200.13
##$BF5= 200.13
##$BF6= 200.13
##$BF7= 200.13
##$BF8= 200.13
##$BYTORDA= 1
##$CFDGTYP= 0
##$CFRGTYP= 5
##$CHEMSTR= <none>
##$CNST= (0..31)
1 1 145 1 1 1 1 1 1 1 1 1 1 1 1 1 1 1 1 1 1 1 1 1 1 1 1 1 1 1 1 1 
##$CPDPRG= <>
##$CPDPRG1= <>
##$CPDPRG2= <>
##$CPDPRG3= <>
##$CPDPRG4= <mlev>
##$CPDPRG5= <mlev>
##$CPDPRG6= <mlev>
##$CPDPRG7= <mlev>
##$CPDPRG8= <mlev>
##$CPDPRGB= <>
##$CPDPRGT= <>
##$D= (0..31)
0 1.2 0 0 0 0 0 0 0 0.06 0 0.03 0 0 0 0 0.0002 0 0 0 0 0 0 0 0 0 0 0 0 
0 0 0 
##$DATE= 1695724851
##$DBL= (0..7)
120 120 120 120 120 120 120 120 
##$DBP= (0..7)
150 150 150 150 150 150 150 150 
##$DBP07= 0
##$DBPNAM0= <>
##$DBPNAM1= <>
##$DBPNAM2= <>
##$DBPNAM3= <>
##$DBPNAM4= <>
##$DBPNAM5= <>
##$DBPNAM6= <>
##$DBPNAM7= <>
##$DBPOAL= (0..7)
0.5 0.5 0.5 0.5 0.5 0.5 0.5 0.5 
##$DBPOFFS= (0..7)
0 0 0 0 0 0 0 0 
##$DE= 6
##$DECBNUC= <off>
##$DECIM= 32
##$DECNUC= <off>
##$DECSTAT= 4
##$DIGMOD= 1
##$DIGTYP= 9
##$DL= (0..7)
0 120 120 120 120 120 120 120 
##$DP= (0..7)
150 150 150 150 150 150 150 150 
##$DP07= 0
##$DPNAME0= <>
##$DPNAME1= <>
##$DPNAME2= <>
##$DPNAME3= <>
##$DPNAME4= <>
##$DPNAME5= <>
##$DPNAME6= <>
##$DPNAME7= <>
##$DPOAL= (0..7)
0.5 0.5 0.5 0.5 0.5 0.5 0.5 0.5 
##$DPOFFS= (0..7)
0 0 0 0 0 0 0 0 
##$DQDMODE= 0
##$DR= 18
##$DS= 0
##$DSLIST= <SSSSSSSSSSSSSSS>
$$ [...]
##$SUBNAM2= <"">
##$SUBNAM3= <"">
##$SUBNAM4= <"">
##$SUBNAM5= <"">
##$SUBNAM6= <"">
##$SUBNAM7= <"">
##$SUBNAM8= <"">
##$SUBNAM9= <"">
##$SW= 18.0514893171864
##$SWIBOX= (0..15)
0 0 2 0 0 0 0 0 0 0 0 0 0 0 0 0 
##$SW_h= 3612.71676300578
##$TD= 16384
##$TD0= 1
##$TE= 0
##$TE2= 300
##$TE3= 300
##$TEG= 300
##$TL= (0..7)
0 120 120 120 120 120 120 120 
##$TP= (0..7)
150 150 150 150 150 150 150 150 
##$TP07= 0
##$TPNAME0= <>
##$TPNAME1= <>
##$TPNAME2= <>
##$TPNAME3= <>
##$TPNAME4= <>
##$TPNAME5= <>
##$TPNAME6= <>
##$TPNAME7= <>
##$TPOAL= (0..7)
0.5 0.5 0.5 0.5 0.5 0.5 0.5 0.5 
##$TPOFFS= (0..7)
0 0 0 0 0 0 0 0 
##$TUNHIN= 0
##$TUNHOUT= 0
##$TUNXOUT= 0
##$USERA1= <user>
##$USERA2= <user>
##$USERA3= <user>
##$USERA4= <user>
##$USERA5= <user>
##$V9= 5
##$VALIST= <valist>
##$VCLIST= <CCCCCCCCCCCCCCC>
##$VD= 0
##$VDLIST= <DDDDDDDDDDDDDDD>
##$VPLIST= <PPPPPPPPPPPPPPP>
##$VTLIST= <TTTTTTTTTTTTTTT>
##$WBST= 1024
##$WBSW= 4
##$XGAIN= (0..3)
0 0 0 0 
##$XL= 0
##$YL= 0
##$YMAX_a= 27795
##$YMIN_a= -62462
##$ZGOPTNS= <>
##$ZL1= 120
##$ZL2= 120
##$ZL3= 120
##$ZL4= 120
##$ABSF1= 10
##$ABSF2= 0
##$ABSG= 5
##$ABSL= 3
##$ALPHA= 0
##$AQORDER= 0
##$ASSFAC= 0
##$ASSFACI= 0
##$ASSFACX= 0
##$ASSWID= 0
##$AUNMP= <proc_1d>
##$AZFE= 0.1
##$AZFW= 0.1
##$BCFW= 1
##$BC_mod= 2
##$BYTORDP= 1
##$COROFFS= 0
##$CY= 11.3945322036743
##$DATMOD= 1
##$DC= 2
##$DFILT= <>
##$DTYPP= 0
##$F1P= 15.7292609196834
##$F2P= 12.9074282941183
##$FCOR= 0.5
##$FTSIZE= 0
##$FT_mod= 4
##$GAMMA= 1
##$GB= 0.15
##$INTBC= 1
##$INTSCL= 1
##$ISEN= 128
##$LB= 0.24
##$LEV0= 0
##$LPBIN= 0
##$MAXI= 10000
##$MC2= 0
##$MEAN= 0
##$ME_mod= 0
##$MI= 1.114404
##$NCOEF= 0
##$NC_proc= 0
##$NLEV= 6
##$NOISF1= 3.799351
##$NOISF2= 2.8
##$NSP= 1
##$NTH_PI= 0
##$NZP= 0
##$OFFSET= 15.70392
##$PC= 1
##$PHC0= -21706.56
##$PHC1= 4.65271
##$PH_mod= 1
##$PKNL= yes
##$PPARMOD= 0
##$PSCAL= 0
##$PSIGN= 0
##$REVERSE= no
##$SF= 200.130013532006
##$SI= 16384
##$SIGF1= 3
##$SIGF2= 2
##$SINO= 400
##$SIOLD= 16384
##$SREGLST= <1H.CDCl3>
##$SSB= 0
##$STSI= 0
##$STSR= 0
##$SW_p= 3612.71676300578
##$SYMM= 0
##$S_DEV= 0
##$TDeff= 0
##$TDoff= 0
##$TI= <>
##$TILT= no
##$TM1= 0
##$TM2= 0
##$TOPLEV= 0
##$USERP1= <user>
##$USERP2= <user>
##$USERP3= <user>
##$USERP4= <user>
##$USERP5= <user>
##$WDW= 1
##$XDIM= 8192
##$YMAX_p= 0
##$YMIN_p= 0
$$ End of Bruker specific parameters
$$ ---------------------------------
##NTUPLES= NMR FID
##VAR_NAME=  TIME,          FID/REAL,        FID/IMAG
##SYMBOL=    X,             R,               I
##VAR_TYPE=  INDEPENDENT,   DEPENDENT,       DEPENDENT
##VAR_FORM=  AFFN,          ASDF,            ASDF
##VAR_DIM=   8192,          8192,            8192
##UNITS=     SECONDS,       ARBITRARY UNITS, ARBITRARY UNITS
##FACTOR=    0.0002768,     1,               1
##FIRST=     0,             0,               0
##LAST=      2.2672688,     0,               0
##MIN=       0,             -62462,          0
##MAX=       2.2672688,     27795,           0
$$ Real data points
##PAGE= N=1
##DATA TABLE= (X++(R..R)), XYDATA
$$ [...]
$$ plain form
1832 -73 -173 251 -288 -404 -195 -296 -70 -151 -164 -284 -229 -399 -65 7 -7 7 -273 110 363 116 274 157
1854 157 88 90 239 229 357 420 112 53 318 -82 -72 -161 -197 5 -67 -127 -117 -302 -80 -146 -175 -83 -7 -268 40
1879 40 -209 -79 64 89 248 104 -55 10 -219 199 -4 -33 -15 159 19 149 66 197 -181 -20 55 46 42 -82
1903 -82 18 65 -242 -47 257 42 249 134 -83 238 59 -104 437 134 -222 -19 108 -128 149 1 -360
1924 -360 -95 -230 -279 -152 -152 -94 -116 93 203 107 -35 -146 308 144 240 18 88 279 247 -98 180 -206 -76
1947 -76 -86 -421 205 1 50 -209 118 -128 -239 -104 -79 3 -55 -220 -38 189 168 233 153 107 -88 140 212 302
1971 302 68 -95 -226 -294 -226 98 -149 8 -307 -186 -89 -58 -69 -70 39 -276 109 -17 72 51 -16 -46 69 -140
1995 -140 325 38 77 -57 37 -111 157 227 -36 -2 66 24 -70 -95 77 106 66 158 251 119 109 -136 -46 -26 -74
$$ packed form
1832g3j00M24n39j16K09j01K26q1j3j20N5j70L34P2j4J4k80L83K53k47J58j17
1854A57o9KJ49j0J28O3l08n9K65m00J0q9l6K02p2o0J0j85K22o6k9R2P6k61L08
1879D0k49J30J43K5J59j44j59O5k29M18k03k9J8J74j40J30q3J31l78J61P5rmj24
1903h2J00M7l07J95L04k15K07j15k17L21j79j63N41l03l56K03J27k36K77j48l61
1924c60K65j35m9J27%N8k2K09J10r6j42j11M54j64R6k22P0J91l2l45K78l86J30
1947g6j0l35O26k04M9k59L27k46j11J35K5Q2n8j65J82K27k1O5q0m6j95K28P2R0
1971C02k34j63j31o8O8L24k47J57l15J21R7L1j1jJ09l15L85j26Q9k1o7l0J15k09
1995a40M65k87L9j34R4j48K68P0k63L4O8m2r4k5J72K9m0R2R3j32j0k45R0K0m8
$$ plain form
2020 -74 161 142 -93 -46 8 12 48 131 90 79 -26 -163 131 22 49 -65 -219 -77 116 175 -113 -40 -99 -91 37
2045 37 -147 -16 -168 48 14 334 -15 196 -14 -119 257 -132 211 262 -70 -139 117 12 -93 -120 -66 -42
2067 -42 -50 4 8 -37 -62 -127 -73 55 163 -22 333 265 8 100 73 -22 422 229 102 185 317 49 235 4 -160
2092 -160 33 -237 -208 -135 -160 -216 -416 -163 -64 -33 -163 -188 -83 -221 -44 -215 -93 111 -90 -71 -139 131 89
2115 89 26 71 -7 -71 208 47 -68 -120 64 27 -220 76 -159 100 -138 198 74 379 201 163 219 -114 -86
2138 -86 81 128 217 -27 110 244 212 -241 -220 33 -267 109 -247 -325 -236 -247 -409 -250 -165 -319 -169 -174 -47 -37
2162 -37 -262 121 -67 126 192 -68 270 165 -23 -23 195 -75 44 301 137 28 -19 -120 -162 -127 -231 -135 -71
2185 -71 -244 -85 -83 -123 -130 173 -145 -165 15 182 231 188 168 14 68 81 332 103 311 118 -97 -5 -371 95
$$ packed form
2020g4K35j9k35M7N4ML6Q3m1j1j05j37K94j09K7j14j54J42J93N9k88P3n9QJ28
2045C7j84J31j52K16l4L20l49K11k10j05L76l89L43N1l32o9K56j05j05k7N4K4
2067d2qN4Mm5k5o5N4J28J08j85L55o8k57R2k7r5M44j93j27Q3J32k68J86k31j64
2092a60J93k70K9P3k5n6k00K53R9L1j30k5J05j38J77j71J22K04k01J9o8K70m2
2115H9o3M5p8o4K79j61j15n2J84l7k47K96k35K59k38L36j24L05j78l8N6l33K8
2138h6J67M7Q9k44J37J34l2m53K1K53l00L76l56p8Q9j1j62J59Q5j54J50nJ27J0
2162c7k25L83j88J93O6k60L38j05j88%K18k70J19K57j64j09m7j01m2L5j04R6O4
2185g1j73J59Km0pL03l18k0J80J67M9m3k0j54N4J3K51k29K08j93k15R2l66M66
$$ plain form
2209 95 62 -207 97 52 -164 -11 -294 -13 -178 91 -92 322 205 -25 331 -103 -35 -154 123 105 297 -221
2231 -221 -52 43 -292 -311 93 -56 -8 -89 -238 63 -62 -23 -57 -7 64 252 -185 30 2 -162 247 -30 90
2254 90 68 45 -56 60 -134 39 163 -62 184 238 -133 152 103 -226 -134 114 -91 -213 -78 -9 151 28
2276 28 -216 -36 14 11 -179 109 34 200 -9 -154 173 213 156 120 -56 85 239 -6 16 316 -97 -198 -304
2299 -304 294 196 154 -104 209 -302 40 -20 -27 76 61 87 -163 79 -142 -76 -126 -168 -143 21 10 91 -40 -128 -181
2324 -181 3 -16 82 -69 -186 -356 -115 156 -48 -84 288 63 42 179 205 85 -19 126 301 111 244 -5
2346 -5 139 74 119 139 30 88 -25 -50 31 215 -87 199 -140 99 140 -132 -150 259 -4 161 -16 199 73
2369 73 -91 -10 171 115 -256 236 -39 156 -273 -187 -206 -111 -209 -167 2 -311 -61 -11 23 -181 204 -159 -7
$$ packed form
2209I5l3k69L04m5k16J53k83K81j65K69j83M14j17k30L56m34O8j19K77j8J92n18
2231b21J69R5l35j9M04j49M8q1j49L01j25L9l4N0P1J88m37K15k8j64M09k77J20
2254I0k2k3j01J16j94J73J24k25K46N4l71K85m9l29R2K48k05j22J35O9J60j23
2276B8k44J80N0lj90K88p5J66k09j45L27M0n7l6j76J41J54k45K2L00m13j01j06
2299c04N98r8m2k58L13n11L42o0pJ03j5K6k50K42k21O6n0m2K5J64j1Q1j31q8n3
2324a81J84j9R8j51j17j70K41K71k04l6L72k25k1J37K6j20j04J45J75j90J33k49
2346eJ44o5M5K0j09N8j13k5Q1J84l02K86l39K39M1k72j8M09k63J65j77K15j26
2369G3j64Q1J81n6l71M92k75J95m29Q6j9R5r8M2J69l13K50N0L4k04L85l63J52
$$ plain form
2392 -7 164 -48 -71 -84 -82 90 66 97 172 214 240 59 -120 -140 288 25 33 67 -37 -110 133 -2 75 144 -36 -144
2418 -144 -71 -84 119 -19 -49 153 -161 0 37 41 14 61 134 -114 127 -34 -26 -127 -330 -170 -163 68 10 -98 -260
2443 -260 -65 55 -152 -90 -385 -60 -61 0 64 42 124 -96 92 159 149 202 90 203 -84 -63 -96 -25 135 -67
2467 -67 -78 210 73 83 161 -146 87 -19 18 90 70 -151 114 397 311 175 62 257 -148 175 -122 62 17
2490 17 -103 -154 -228 36 26 -357 -13 -423 -54 -270 166 -114 118 -91 5 94 58 -172 318 112 -114 106
2512 106 -57 168 1 -6 -24 45 -37 -109 216 41 61 -92 136 393 39 118 -174 -171 -169 -177 29 -69 -29 -111 92 -14
2538 -14 151 295 251 -1 40 2 56 -73 -336 -8 68 -62 -76 58 -231 -6 -46 -339 46 -235 178 -86 -15
2561 -15 -16 -4 126 -38 101 -11 201 66 125 -105 149 -57 227 13 208 -172 -91 -86 35 80 -97 -53 264
$$ packed form
2392gJ71k12k3j3KJ72k4L1P5M2K6j81j79k0M28k63QL4j04p3K43j35P7O9j80j08
2418a44P3j3K03j38l0K02l14J61L7Mk7M7P3k48K41j61Qj01k03J60PK31n8j08j62
2443b60J95J20k07O2k95L25jO1O4k2Q2k20J88O7j0N3j12J13k87K1l3P1J60k02
2467f7j1K88j37J0P8l07K33j06L7P2k0k21K65K83q6j36j13J95m05L23k97J84m5
2490A7j20n1p4K64j0l83L44m10L69k16M36k80K32k09R6Q9l6k30M90k06k26K20
2512A06j63K25j67pj8O9q2p2L25j75K0j53K28K57l54P9k92LKqK06r8M0q2K03j06
2538a4J65J44m4k52M1l8N4j29k63L28P6j30j4J34k89K25m0k93L85k81M13k64P1
2561a5jJ2J30j64J39j12K12j35N9k30K54k06K84k14J95l80Q1NJ21M5j77M4L17
$$ plain form
2584 264 -229 -212 94 -90 39 -122 64 -176 -173 25 121 -38 320 30 -17 -16 261 -52 93 114 29 266 -27
2607 -27 -188 -164 -130 -121 -12 89 44 -5 -48 -215 2 -269 -6 -210 -15 -84 10 70 57 -215 -119 32 -369 -26
2631 -26 -147 -3 177 91 54 217 -128 185 165 -305 -229 247 -134 -62 -6 -122 -98 83 -284 119 220 13 76
2654 76 -236 25 144 37 225 24 91 47 -194 -89 18 19 -164 54 -45 -81 -75 -230 178 -35 43 -67 145
2677 145 115 53 -254 -24 164 58 -119 -80 -296 -109 3 90 -32 -331 -66 5 327 -6 -101 -52 -56 -20 69 213
2701 213 73 121 -11 43 91 191 89 58 82 223 -6 -31 -3 94 12 227 45 -129 -3 -151 -135 -7 -36 -20
2725 -20 110 -4 -47 -136 -24 27 -212 -285 -59 41 -83 -70 31 91 282 -179 165 186 -7 11 32 70 -220 -60
2749 -60 -228 -35 26 -79 -121 -158 -104 -431 -7 -16 83 -185 -31 -16 358 202 63 -136 116 68 -102 287 107
$$ packed form
2584B64m93J7L06j84J29j61J86k40LJ98R6j59L58k90m7JK77l13J45K1q5K37k93
2607b7j61K4L4RJ09J01m5m9m3j67K17k71K63k04J95o9R4O0j3k72R6J51m01L43
2631b6j21J44J80q6l7J63l45L13k0m70P6M76l81P2N6j16K4J81l67M03J01k07O3
2654G6l12K61J19j07J88k01O7m4k41J05J07Jj83K18r9l6Oj55M08k13P8j10K12
2677A45l0o2l07K30J88j06j77L9k16J87J12Q7j22k99K65P1L22l33r5M9mL6Q9J44
2701B13j40M8j32N4M8J00j02l1K4J41k29k5K8R7q2K15j82j74J26j48J6J28k9J6
2725b0J30j14m3q9J12N1k39p3K26J00j24J3J01O0J91m61L44K1j93J8K1L8k90J60
2749f0j68J93O1j05m2l7N4l27M24rR9k68J54J5L74j56j39j99K52m8j70L89j80
$$ plain form
2772 107 33 113 -193 204 7 -74 -112 -140 -67 25 -35 -171 58 24 -169 -36 -39 -21 151 -93 -37 44 8 17 -52 64
2798 64 11 -24 -1 202 17 -3 -253 -24 175 117 96 -13 148 -32 232 -73 -218 205 -5 -227 -167 -92 168
2821 168 -24 -104 -93 46 -46 -91 26 154 105 215 400 -100 -171 107 -3 58 6 -216 43 -54 11 -83 31 174
2845 174 -21 -113 -89 -278 -25 -78 -62 26 165 289 34 74 -17 303 -21 -7 -128 104 221 -171 -49 -224 1
2868 1 -36 -112 -81 -90 -44 9 271 -173 71 -29 -120 51 -195 -4 181 -50 84 59 -97 45 -71 -4 51 -76
2892 -76 -89 37 -5 41 -51 -7 -5 -39 -12 -139 288 -57 208 226 36 161 174 75 400 -179 -156 -17 -294 55 152
2917 152 -26 -138 -108 -287 -163 -104 -301 0 -160 -82 -251 -35 -279 -121 -96 11 -29 113 8 -47 150 -47
2939 -47 -189 -112 31 -9 -84 70 -95 117 115 -286 133 -42 239 -24 -175 35 -14 129 -59 -21 136 -391 20
$$ packed form
2772A07p4Q0l06L97j97q1l8k8P3R2o0j36K29l4j93J33lJ8J72k44N6Q1l6Ro9J16
2798F4n3l5K3K03j85k0k50K29J99n8k1j09J61j80K64l05j45M23k10k22O0P5K60
2821A68j92q0J1J39r2m5J17J28m9J10J85n00p1K78j10O1n2k22K59r7O5r4J14J43
2845A74j95r2K4j89K53n3J6Q8J39J24k55M0r1L20l24J4j21K32J17l92J22j75K25
2868Al7p6L1rM6N3K62m44K44j00r1J71k46J91J85k31J34k5j56J42j16O7N5j27
2892g6j3J26m2M6r2M4Kl4K7j27M27l45K65J8j90J25J3r9L25n79K3J39k77L49R7
2917A52j78j12L0j79J24N9j97L01j60P8j69K16k44J58K5J07m0J42j05n5J97j97
2939d7j42P7J43m0p5J54j65K12km01M19j75K81k63j51K10m9J43j88L8J57n27M11
$$ plain form
2962 20 105 -81 67 -82 -60 -75 -96 249 129 2 224 227 -131 -211 363 11 -15 -60 -78 228 4 -180 -137 40
2986 40 -222 177 -131 203 161 -131 -165 241 -163 125 132 68 145 -20 38 51 -48 13 294 -33 -132 -28 4 93 -228
3011 -228 -129 162 -11 -102 -156 -114 -68 2 -220 39 51 -46 -136 -193 21 92 16 154 -140 -139 100 282 -92 24 -15
3036 -15 -100 -81 -153 -217 -21 45 -307 121 -81 -136 -42 -136 59 -93 -54 20 56 -111 33 83 -81 -87 168 57 -156
3061 -156 -207 71 18 -73 -15 -29 -99 9 266 200 -406 -53 162 43 -64 -12 235 106 -150 36 -151 -55 -36
3084 -36 198 75 -135 49 194 -79 64 190 153 123 144 -199 130 -79 37 -254 89 -54 9 65 -268 -340
3106 -340 -235 23 113 -100 -180 -127 64 17 -19 -110 221 -111 -15 79 -36 54 -157 94 83 -155 31 92 102 83
3130 83 -125 141 -118 -128 -158 -218 -155 -311 39 123 -35 104 -190 -27 194 -73 59 -1 -134 75 -162 -127 -115
$$ packed form
2962B0Q5j86J48j49K2j5k1L45j20j27K22Ll58q0N74l52k6m5j8L06k24j84M3J77
2986D0k62L99l08L34m2k92l4M06m04K88Po4P7j65N8J3r9O1K81l27r9J04L2Q9l21
3011b28R9K91j73r1n4M2M6P0k22K59J2r7r0n7K14P1p6J38k94JK39J82l74J16l9
3036a5q5J9p2o4J96O6l52M28k02n5R4r4J95j52L9P4L6j67J44N0j64oK55j11k13
3061a56n1K78n3r1N8j4p0J08K57o6o06L53K15j19j07N2K47j29k56J86j87R6J9
3084c6K34j23k10J84J45k73J43J26l7l0K1l43L29k09J16k91L43j43O3N6l33p2
3106c40J05K58R0k13q0N3J91m7l6r1L31l32R6R4j15R0k11K51j1k38J86O1J0j9
3130H3k08K66k59j0l0o0O3j56L50Q4j58J39k94J63K21k67J32o0j33K09k37L5J2
$$ plain form
3153 -115 -106 -140 33 202 73 -143 -73 10 13 98 -28 -88 26 5 -54 144 -3 295 85 -182 292 -162 102 -184
3177 -184 153 -138 26 151 -112 -176 -137 31 -16 -41 -197 48 12 167 49 24 104 -22 -9 91 -138 -172 71
3200 71 13 -217 -117 36 -95 -2 -18 108 -4 15 144 -73 -42 -161 169 135 68 0 -271 116 363 -277 -69
3223 -69 -218 63 -89 83 -93 11 -29 324 -93 -8 286 -142 171 -124 -97 107 -60 66 -193 -193 -134 -3
3245 -3 -196 -211 4 -103 -206 -28 9 77 -217 -160 21 277 50 32 76 47 177 35 198 -130 92 55 49 -85
3269 -85 158 32 -89 136 -44 -156 -35 -265 -161 -31 -72 167 59 33 8 -16 76 -191 -81 129 65 -32 -16
3292 -16 59 -124 28 -159 -354 -64 6 -20 -55 -106 -178 66 291 -40 -290 34 -55 59 -51 7 -144 -145 121 45
3316 45 145 -44 192 -68 -86 69 41 12 182 152 106 163 49 -160 -134 174 -143 -173 -43 -89 -69 4 -142 279
$$ packed form
3153a15Rl4J73J69j29k16P0Q3LQ5j26o0J14k1n9J98j47K98k10k67M74m54K64k86
3177a84L37k91J64J25k63o4L9J68m7k5j56K45l6J55j18k5Q0j26J3J00k29l4K43
3200G1n8k30J00J53j31R3j6J26j12J9J29k17L1j19L30l4o7o8k71L87K47o40K08
3223f9j49K81j52J72j76J04m0L53m17Q5K94m28L13k95K7K04j67J26k59%N9J31
3245cj93j5K15j07j03J78L7O8k94N7J81K56k27j8M4k9J30j42J63l28K22l7oj34
3269h5K43j26j21K25j80j12J21k30J04J30m1K39j08k6k5k4R2k67J10K10o4r7J6
3292a6P5j83J52j87j95K90P0k6l5n1p2K44K25l31k50L24q9J14j10N8j51jK66p6
3316D5J00j89K36k60j8J55k8k9J70l0m6N7j14k09K6L08l17l0J30m6K0P3j46M21
$$ plain form
3340 279 -51 42 -7 -145 118 -113 121 35 134 49 21 189 -32 -133 78 -73 -181 -156 -173 -296 -112 -72 -255
3363 -255 -177 -157 39 78 -117 -5 46 -102 -59 198 259 -34 49 19 50 119 -37 -358 -149 -202 33 -265 -241 -181
3387 -181 -104 27 116 -289 -87 23 160 59 -19 7 -126 163 -26 118 -2 54 130 183 -88 215 -153 -70 -30
3410 -30 197 171 -155 39 35 104 300 -205 -36 -23 85 -238 -39 144 38 56 70 -22 -167 -44 2 178 -29
3433 -29 -102 101 116 -70 237 -53 189 41 0 -153 112 51 -141 186 -56 115 192 -96 114 147 40 -124
3455 -124 242 -153 54 74 -117 199 -75 128 106 52 173 -49 14 -32 96 66 -36 16 -233 -174 -3 214 -253
3478 -253 -137 -91 24 -158 59 166 -3 -151 3 -87 89 -159 97 -308 22 -18 59 -93 -78 -112 63 22
3500 22 28 -170 -21 -261 -54 -148 -168 -193 -170 202 -41 138 128 -142 137 16 43 137 -94 -104 -89 116 -28 -126
$$ packed form
3340B79l30R3m9j38K63k31K34q6R9q5k8J68k21j01K11j51j08K5j7j23J84M0j83
3363b55P8K0J96L9j95J12N1j48M3K57O1k93Q3l0L1O9j56l21K09n3K35k98K4O0
3387a81P7J31Q9m05K02J10J37j01p8K6j33K89j89J44j20N6P6N3k71L03l68Q3M0
3410c0K27k6l26J94mO9J96n05J69J3J08l23J99J83j06J8J4r2j45J23M6J76k07
3433b9p3K03J5j86L07k90K42j48m1j53K65o1j92L27k42J71P7k88K10L3j07j64
3455a24L66l95K07K0j91L16k74K03k2n4J21k22O3m6J28l0j02N2k49N9J71K17m67
3478b53J16M6J15j82K17J07j69j48J54r0J76k48K56m05L30m0P7j52J5l4J75m1
3500B2Oj98J49k40K07r4k0k5K3L72k43J79j0k70K79j21K7R4k31j0J5K05j44r8
$$ plain form
3524 -126 196 -202 -162 -98 39 -118 -185 67 132 -48 -18 29 -239 -98 -35 31 60 -66 222 -28 38 95 -16 -147
3548 -147 15 198 119 -60 -371 234 104 96 -45 63 -120 -193 62 -97 -126 124 59 -16 8 -152 -233 -326 -143
3571 -143 -91 85 38 123 -57 182 -67 -352 -111 166 -22 -148 -98 -210 120 -165 -246 50 -158 91 45 -118
3593 -118 68 -71 24 318 67 -303 96 107 141 -54 44 -101 -95 141 -96 -219 -79 94 -113 -16 -131 8
3615 8 50 -385 -141 57 -36 -27 -121 -109 -147 54 -15 28 -143 29 -179 102 122 74 141 104 396 -39 -29 -157 24
3640 24 -89 184 -267 151 83 -93 -9 -230 -361 -53 176 -2 12 -278 -45 -60 181 -218 72 -33 -5 164
3662 164 -108 281 74 -69 156 -43 -435 -117 28 135 -95 -22 298 110 10 93 -241 27 -43 24 153
3683 153 -100 -272 -246 103 -79 20 -51 144 -70 -188 197 128 5 66 -108 -186 11 -44 254 -221 -161 215 38
$$ packed form
3524a26L22l98M0O4J37j57o7K52O5j80L0M7k68J41O3O6K9j26K88k50O6N7j11j31
3548a47J62J83p9j79l11O05j30qj41J08j83p3K55j59k9K50o5p5K4j60q1r3J83
3571a43N2J76m7Q5j80K39k49k85K41K77j88j26N0j12L30k85q1K96k08K49m6j63
3593a18J86j39R5K94k51l70L99J1L4j95R8j45OK36k37j23J40J73k07R7j15J39
3615HM2m35K44J98r3Rr4J2l8K01o9M3j71J72k08K81K0m8O7l7K92m35J0j28J81
3640B4j13K73m51M18o8j76Q4k21j31L08K29j78J4k90K33j5K41l99K90j05K8J69
3662A64k72L89k07j43K25j99l92L18J45J07k30P3L20j88j00Q3l34K68p0O7J29
3683A53k53j72K6L49j82R9p1J95k14j18L85o9j23O1j74p8J97n5K98m75O0L76j77
$$ plain form
3706 38 22 -24 235 -152 13 184 71 -29 123 142 -195 20 -29 31 -105 -167 60 -198 56 -18 -230 -256 25
3729 25 -296 144 112 -255 -235 -206 -281 -25 15 -2 237 -217 110 61 50 30 221 16 205 8 25 -17 -34 79
3753 79 -272 -73 -16 -43 -73 -246 2 423 -27 324 114 19 -46 112 14 81 -172 -21 32 -1 13 203 124 -25
3777 -25 323 -18 145 53 78 130 21 85 -101 115 -90 90 83 55 2 121 -84 8 295 106 -32 -234 137
3800 137 -226 -154 10 -143 -60 -90 -161 28 135 -88 -108 -148 76 108 83 -48 101 -4 13 66 42 -114 295 -175
3824 -175 -141 -193 -85 139 166 -12 15 -32 -343 -17 -95 28 -129 -107 -60 137 -41 -30 161 -121 -59 61 -269
3847 -269 21 130 -150 142 172 33 38 158 -138 76 195 87 92 -64 -149 -156 2 23 174 -112 -20 -80 -263 -132
3871 -132 166 13 203 -114 -29 158 2 210 -114 7 -7 -30 59 -103 156 -61 106 -101 25 103 -46 180
$$ packed form
3706C8j6m6K59l87J65J71j13j00J52J9l37K15m9O0j36o2K27k58K54p4k12k6K81
3729B5l21M40l2l67K0K9p5K56M0j7K39m54L27m9j1k0J91k05J89j97J7m2j7J13
3753G9l51J99N7k7l0j73K48M21m50L51k10r5o5J58r8O7k53J51N3l3J4J90p9j49
3777b5L48l41J63r2K5N2j09O4j86K16k05J80pk8n3J19k05R2K87j89j38k02L71
3800A37l63P2J64j53Q3l0p1J89J07k23k0m0K24L2k5j31J49j05J7N3k4j56M09m70
3824a75L4n2J08K24K7j78K7m7l11L26p8J23j57K2M7J97j78J1J91k82O2J20l30
3847b69K90J09k80K92L0j39NJ20k96K14J19j08Nj56q5pJ58K1J51k86R2o0j83J31
3871a32K98j53J90l17Q5J87j56K08l24J21j4k3Q9j62K59k17J67k07J26P8j49K26
$$ plain form
3893 180 -70 -111 155 -154 22 -255 150 -101 -90 35 -99 39 97 -65 -185 9 -66 -44 -23 -35 287 60
3915 60 -28 127 -179 -50 -196 26 21 -14 104 -40 -75 -66 -112 -134 172 4 53 -115 21 -103 49 -81 -33 90
3939 90 -52 3 109 -41 60 -36 -93 173 -121 -114 -89 90 -63 -297 -71 -106 220 -101 -53 -178 -173 -141 -89 -222
3963 -222 -73 -52 154 -126 -120 -89 -21 5 95 -215 0 -95 -101 -24 -60 -30 84 -97 109 112 122 -40 -58 18 127 13
3989 13 -11 -97 98 -83 44 49 131 146 -2 46 95 -66 -27 -10 -112 6 4 -11 -270 14 -71 -34 -27 15 64 28 -34
4016 -34 -90 -71 -8 136 102 -89 125 -34 244 -94 -47 93 42 -30 130 173 76 -29 93 127 -74 -51 -174 -20
4040 -20 26 -1 34 110 -184 -5 -45 -216 -93 -120 2 -5 78 -9 -57 -111 -141 -71 245 -10 -111 -250 -39 -83 119
4065 119 -28 205 -33 165 47 207 -63 -57 93 75 -295 -94 245 67 -419 78 58 67 77 104 42 56 177
$$ packed form
3893A80k50m1K66l09J76k77M05k51J1J25j34J38N8j62j20J94p5K2K1j2L22k27
3915F0q8J55l06J29j46K22nl5J18j44l5Rm6k2L06j68M9j68J36j24J52j30M8J23
3939I0j42N5J06j50J01r6n7K66k94PK5J79j53k34K26l5L26l21M8j25NL2N2j33
3963b22J49K1K06k80OL1O8K6R0l10K15r5oP7l6L0J14j81K06LJ0j62j8P6J09j14
3989A3k4q6J95j81J27NQ2J5j48M8M9j61L9J7j02J18kj5k59K84q5L7PM2M9l6o2
4016c4n6J9O3J44l4j91K14j59K78l38M7J40n1p2J60M3r7j05J22L4k01K3j23J54
4040b0M6k7L5P6k94J79m0j71J23k7J22pQ3q7m8n4l0P0L16k55j01j39K11m4K02
4065A19j47K33k38J98j18J60k70OJ50j8l70K01L39j78m86M97k0RJ0K7o2J4J21
$$ plain form
4088 177 -31 161 -208 139 48 271 -16 -123 -19 -186 72 -146 31 3 88 244 -46 14 -90 -7 -309 -236
4110 -236 119 117 111 54 -32 -37 -170 189 -112 29 -174 10 97 221 -89 80 -159 -110 159 -189 59 52 70 38 39
4135 39 199 -116 -92 7 11 -55 6 -80 44 11 129 -50 -196 -115 99 313 -120 114 -71 139 4 -109 -34 -16
4159 -16 -276 162 107 13 -183 25 11 67 88 176 -133 -121 107 -62 -175 38 -134 -72 349 -89 163 -49 -97
4182 -97 16 -27 -89 9 -116 51 55 -21 73 -192 -157 -236 -141 77 -5 -2 -118 -117 -253 -196 54 72 201 -264 7 -8
4208 -8 110 -74 46 -60 -31 40 174 71 -188 -70 28 226 -123 -96 241 -118 -255 49 331 110 93 9 -60
4231 -60 -24 -48 69 -137 42 13 33 313 -264 0 -86 65 102 -129 112 -109 -210 427 -2 -98 -338 -47 64
4254 64 -21 -344 -204 76 158 18 -391 249 13 -48 0 75 -52 61 -132 -138 -92 103 77 45 -44 120 17 112
$$ packed form
4088A77k08J92l69L47r1K23k87j07J04j67K58k18J77k8Q5J56k90O0j04Q3l02P3
4110b36L55kon7q6nj33L59l01J41k03J84Q7J24l10J69k39M9K69l48K48pJ8l2J
4135C9J60l15K4R9Mo6O1q6J24l3J18j79j46Q1K14K14m33K34j85K10j35j13P5J8
4159a6k60M38n5r4j96K08j4N6K1Q8l09J2K28j69j13K13j72O2M21m38K52k12m8
4182i7J13m3o2R8j25J67Mp6R4k65L5p9R5K18q2Lj16Jj36N7K50J8J29m65K71j5
4208hJ18j84J20j06K9P1J34j03k59J18R8J98l49K7L37l59j37L04K82k21j7q4o9
4231f0L6k4J17k06J79k9K0K80n77K64q6J51L7k31K41k21j01O37m29r6k40K91J11
4254F4q5l23J40K80Q2j40m09O40k36o1M8P5j27J13j93oM6J95k6l2q9J64j03R5
$$ plain form
4278 112 -247 9 -145 124 114 -151 184 -62 -47 127 -143 74 -8 67 -99 -132 -275 24 -191 -9 119 -20
4300 -20 128 251 -59 127 39 -79 -4 -188 -143 -117 -55 157 219 60 84 45 -145 150 -46 142 103 -193 -97 79
4324 79 54 -27 -96 -93 -95 -67 -187 -140 111 99 212 -185 76 113 140 169 62 125 23 3 99 24 -29 -58 52 -96 -187
4351 -187 41 62 61 150 45 94 100 210 155 -34 23 84 54 199 70 -39 185 -16 -198 259 64 62 -60 -106 25
4376 25 -21 155 118 -194 -25 -96 -178 -150 172 5 161 212 111 0 80 239 36 -67 98 -118 -172 176 12
4399 12 -6 153 51 24 -102 -33 -185 55 88 159 86 -158 23 -176 68 -1 189 -4 89 29 136 -79 53
4422 53 -303 -221 72 -88 -28 135 27 -26 -56 183 -19 -78 110 -48 -19 220 70 190 114 -14 -187 -40 -93
4445 -93 365 -47 94 32 -181 -180 -158 81 -156 59 79 72 -196 102 94 -119 -74 -21 34 35 154 129 61 53 -123 54
$$ packed form
4278A12l59K56j54K69j0k65L35k46J5J74k70K17q2P5j66l3j43K99k15J82J28j39
4300b0J48J23l10J86q8j18P5j84M5K6O2K12O2j59K4l9j90K95j96J88l9k96R6J76
4324G9k5q1o9LkK8j20M7K51j2J13l97K61L7K7K9j07O3j02k0R6p5n3k9J10j48r1
4351a87K28K1jQ9j05M9OJ10n5j89N7O1l0J45j29j09K24k01j82M57j95kj22m6J31
4376B5m6J76l7l12J69p1q2K8L22j67J56N1j01j11Q0J59k03j03J65k16n4L48j64
4399A2j8J59j02k7j26O9j52K40L3P1p3k44J81j99K44o9J90j93R3o0J07k15J32
4422E3l56Q2K93j60O0J63j08n3l0K39k02n9J88j58K9K39j50J20p6j28j73J47n3
4445i3M58m12J41o2k13JK2K39k37K15K0pk68K98qk13M5N3N5JJ19k5o8qj76J77
$$ plain form
4471 54 -125 163 -11 -145 -24 30 -99 110 -153 -189 30 -274 -87 -167 28 25 -15 16 219 91 116 181 68
4494 68 -69 -141 25 -69 -222 88 19 6 -148 120 19 16 -32 -269 70 -10 193 -176 -136 -143 -32 -175 -102 -249
4518 -249 12 -114 -178 82 161 79 -94 -304 -47 55 -292 -372 40 -277 -62 -145 110 -117 -6 11 -56 -145 -128
4541 -128 -54 -92 78 -20 -124 -43 -14 -20 30 162 -251 126 -353 12 -108 77 44 79 -62 -11 8 5 85 -48 -214
4566 -214 96 -95 65 -168 71 118 -102 -229 -64 47 18 136 143 127 33 49 -265 118 -156 -4 -136 -88 85
4589 85 -4 -37 -438 -10 35 -170 40 75 158 -153 27 116 -40 57 84 -96 86 -51 -27 -173 -174 -5 178 110
4613 110 -106 244 296 -131 -96 -6 423 167 -22 110 126 -18 7 -18 118 -81 -248 269 130 -96 -13 -158
4635 -158 11 4 -202 58 44 34 -61 -3 129 -130 -136 449 -83 113 -311 -109 237 -18 303 157 -61 -24 298
$$ packed form
4471E4j79K88j74j34J21N4j29K09k63l6K19l04J87q0J95lm0L1K03j28K5O5j13
4494F8j37p2J66r4j53L10o9j3j54K68j01lm8k37L39q0K03l69M0pJ11j43P3j47
4518b49K61j26o4K60P9q2j73k10K57J02l47q0M12l17K15q3K55k27J11J7o7q9J7
4541a28P4l8J70r8j04Q1K9oN0J32m13L77m79L65j20J85l3L5j41N1J9lQ0j33j66
4566b14L10j91J60k33K39M7k20j27J65J11k9J18Pj6r4J6l14L83k74J52j32M8J73
4589H5q9l3m01M28M5k05K10L5Q3l11J80Q9j56R7K7j80J82j37K4j46jJ69J83o8
4613A10k16L50N2m27L5R0M29k56j89J32J6j44K5k5J36j99j67N17j39k26Q3j45
4635a58J69pk06K60j4j0r5N8J32k59oN85n32J96m24K02L46k55L21j46k18L7L22
$$ plain form
4658 298 -106 -111 -217 -48 -267 -139 -12 -185 -216 62 -21 42 -60 161 -296 -29 -180 30 257 129 -83 131
4680 131 115 -36 -157 34 -55 -161 59 -52 88 -30 -74 140 -34 -51 128 -109 72 -118 -104 21 186 105
4702 105 289 -82 0 96 -80 -186 216 -146 261 -71 -39 84 235 95 78 -101 30 171 -119 243 -134
4723 -134 -94 111 -138 -66 -287 98 -153 -165 184 66 139 85 196 -186 41 -8 -80 -197 199 -2 -179 -98 -26
4746 -26 171 -77 83 53 -126 94 -74 107 -54 127 -4 62 95 -202 51 121 -27 25 -17 -43 -107 250 3
4769 3 86 -35 250 132 -17 94 46 25 21 73 -81 -226 -235 214 65 -53 33 -9 -266 63 132 -200 -72 -144 114
4794 114 -13 -158 -79 -68 31 -125 14 -16 193 1 -4 53 -60 0 48 214 -186 54 -119 40 226 9 -115
4817 -115 -149 -181 -6 15 251 -335 63 -37 -111 64 -61 53 -76 41 -57 140 -48 213 14 85 -50 214
$$ packed form
4658B98m04nj06J69k19J28J27j73l1K78q3O3j02K21m57K67j51K10K27j28k12K14
4680A31j6j51j21J91q9j06K20j11J40j18m4K14j74j7J79k37J81j90J4J25J65q1
4702A05J84l71Q2R6j76j06M02l62M07l32L2J23J51j40j7j79J31J41k90L62l77
4723a34M0K05k49P2k21L85k51j2L49j18P3n4J11l82K27m9p2j17L96k01j77Q1P2
4746b6J97k48J60l0j79K20j68J81j61J81j31O6L3k97K53P0j48N2m2k6o4L57k47
4769CQ3j21K85j18j49J11m8k1mN2j54j45rM49j49j18Q6m2k57L29O9l32J28p2K58
4794A14j27j45P9J1R9j56J39l0K09j92nN7j13O0M8J66m00K40j73J59J86k17j24
4817a15l4l2J75K1K36n86L98j00p4J75j25J14j29J17r8J97j88K61j99P1j35K64
$$ plain form
4839 214 126 104 -73 -103 -105 -30 -145 200 -293 50 -134 89 90 -204 -53 -53 -142 -165 215 -135 -94 -113 116 -32 76
4864 76 -271 -5 156 -23 49 209 -39 -373 -76 40 -52 -13 -58 114 67 170 166 -109 103 -107 44 -195 42
4887 42 57 -110 175 -79 -184 103 -17 24 -61 -318 -265 3 -39 -66 22 -206 113 -70 -13 -41 138 -96 -263
4910 -263 -181 1 -67 -192 -46 30 36 -128 -14 -224 -18 -38 -108 78 130 -24 -63 258 -122 -14 194 5 -61
4933 -61 63 197 57 61 -90 -8 95 -57 188 174 98 -153 142 188 -85 43 97 318 -5 136 -111 -239 -61
4956 -61 92 -100 -125 222 -198 -286 69 -18 102 150 37 38 143 -191 93 -106 54 20 172 249 224 -159 75
4979 75 69 38 183 32 215 95 109 -54 71 133 -131 -275 -57 180 2 -82 71 88 41 103 -24 -72 -55 56
5003 56 67 -33 156 -83 -95 -188 104 -114 -154 208 90 151 -89 -1 191 -186 46 76 -249 242 -35 45 -46
$$ packed form
4839B14q8k2j77l0kP5j15L45m93L43j84K23Jk94J51%q9k3L80l50M1j9K29j48J08
4864G6l47K66J61j79P2J60k48l34K97J16r2L9m5J72m7J03mk75K12k10J51k39K37
4887D2J5j67K85k54j05K87j20M1q5k57N3K68m2k7Q8k28L19j83N7k8J79k34j67
4910b63Q2J82o8j25J46P6Oj64J14k10K06k0p0J86N2j54l9L21l80J08K08j89o6
4933f1J24J34j40Mj51Q2J03j52K45j4p6k51K95M6k73J28N4K21l23J41k47j28J78
4956f1J53j92k5L47m20q8L55q7J20M8j13JJ05l34K84j99J60l4J52P7k5l83K34
4979G5ol1J45j51J83j20J4j63J25O2k64j44K18K37j78q4J53J7m7O2j27m8J7J11
5003E6J1j00J89k39j2r3K92k18m0L62j18O1k40Q8J92l77K32L0l25M91k77Q0r1
$$ plain form
5026 -46 67 22 47 101 204 -103 -219 -134 153 188 -125 -263 -129 61 30 -112 -62 116 -28 16 -27 -23 12 -5 -266
5051 -266 -63 -289 45 -146 168 7 30 92 24 -76 -46 169 22 -34 320 -86 -58 -16 -92 61 -67 -291 -116
5074 -116 106 -248 39 61 107 -47 -43 -105 44 14 26 83 19 -25 153 -77 -216 -53 109 47 162 -4 -166 -78
5098 -78 -146 -151 40 -160 -162 38 56 199 -90 -16 36 -84 -31 134 106 62 120 237 68 -5 264 -82 50 116 -45
5123 -45 79 167 9 307 -7 74 -298 -160 -193 -112 146 -39 -70 -58 -177 39 155 -105 68 107 -8 -238 -17
5146 -17 -171 -191 -7 -12 34 333 218 149 -31 243 24 -46 -110 -25 -69 209 -82 -129 85 153 227 -154 -104 -46 -105
5171 -105 -28 86 -156 -165 -85 190 -247 4 -71 125 -86 -38 11 -98 157 -131 0 -157 -15 -206 -24 -44 86
5194 86 148 96 -186 20 225 166 -30 129 -246 234 131 -33 -42 140 -65 230 132 -143 102 -15 151 -98
$$ packed form
5026d6J13m5K5N4J03l07j16Q5K87L5l13j38J34J90l1j42N0J78j44M4m3ML5j7k61
5051b66K03k26L34j91L14j61K3O2o8j00L0K15j47n6L54m06K8M2p6J53j28k24J75
5074a16K22l54K87K2M6j54Mo2J49l0J2N7o4m4J78k30j39J63J62o2J15j66j62Q8
5098g8o8nJ91k00kK00J8J43k89P4N2j20N3J65k8m4N8J17j69p3K69l46J32O6j61
5123d5J24Q8j58K98l14Q1l72J38l3Q1K58j85l1J2j19K16J16k60J73L9j15k30K21
5146a7j54k0J84nM6K99j15o9j80K74k19p0o4Q5m4K78k91m7K14O8P4l81N0N8n9
5171a05P7J14k42rQ0K75m37K51p5J96k11M8M9j09K55k88J31j57J42j91J82k0J30
5194H6O2n2k82K06K05n9j96J59l75M80j03j64rJ82k05K95r8k75K45j17J66k49
$$ plain form
5216 -98 -7 308 -121 -100 -236 28 -20 12 -207 -188 138 -192 7 -146 174 -332 -68 92 -111 75 -40 -116
5238 -116 182 -47 -235 -69 117 -296 -110 -198 -141 -332 -10 -228 -4 -14 -12 139 -45 186 -145 -47 -38 -80 -119
5261 -119 106 -124 -66 137 118 -43 -210 -7 -153 -100 -163 122 24 -220 -374 76 -19 -5 78 -343 -83 -90 -16 10
5285 10 51 69 289 57 -90 29 -168 21 46 -48 -143 -64 209 -36 -107 22 -215 -154 -251 19 -21 -196 -137 -106
5309 -106 327 -181 -89 16 -68 -181 -59 -76 17 161 -107 64 -72 158 -294 -116 59 59 46 204 -249 -334 -208
5332 -208 76 69 74 -50 -12 62 -220 62 5 -186 -53 -65 -137 -48 -57 -81 -33 -70 42 -54 -188 8 -59 -81 -108 207
5358 207 -168 322 52 174 -30 -168 268 43 -243 96 179 -223 -16 -125 -329 -193 -154 -81 30 267 31
5379 31 -102 33 80 -140 -115 -96 114 55 50 200 -15 7 221 -37 67 14 -145 40 74 1 -69 200 -194 150
$$ packed form
5216i8R1L15m29K1j36K64m8L2k19J9L26l30J99j53L20n06K64J60k03J86j15p6
5238a16K98k29j88J66J86m13J86q8N7j91L22k18K24j0KJ51j84K31l31R8Rm2l9
5261a19K25k30N8K03j9j61j67K03j46N3o3K85r8k44j54M50r5J4Q3m21K60pP4K6
5285A0M1J8K20k32j47J19j97J89K5r4r5P9K73k45p1J29k37O1r7K70m0j75N9L1
5309a06M33n08R2J05q4j13J22j7R3J44k68J71j36K30m52J78J75%j3J58m53q5J26
5332b08K84pNj24L8P4k82K82n7j91J33j2p2Q9rk4M8l7J12r6j34J96o7k2k7L15
5358B07l75M90k70J22k04j38M36k25k86L39Q3m02K07j09k04J36L9P3J11K37k36
5379C1j33J35M7k20K5J9K10n9nJ50k15K2K14k58J04n3j59J85L4p3p0K69l94L44
$$ plain form
5403 150 25 198 -102 -155 -154 -28 56 -48 76 62 -34 -59 16 -45 169 111 33 -16 286 170 28 -21 83 59 74
5428 74 -96 -98 -18 -80 -203 4 42 48 8 -211 204 93 -358 157 -71 -82 -208 146 -196 84 20 148 129 230
5452 230 210 -119 168 72 -20 23 -143 149 -113 -1 -109 -41 -79 -196 70 148 4 -22 92 108 36 70 250 -16
5476 -16 143 219 -70 -176 132 -48 -254 -131 160 84 -122 83 283 -231 31 -107 -64 -49 -62 55 15 28 -77
5499 -77 67 27 -214 1 -88 -104 -124 43 -360 58 25 -141 -298 241 87 57 -44 -52 -11 -314 -268 -170 -7 -25
5523 -25 -2 107 109 -236 -100 43 145 158 -31 -82 -102 54 -164 49 -3 71 -43 -116 -55 219 241 -337 64 -2
5547 -2 -18 19 -86 -55 -36 115 -49 93 57 -205 -35 -166 -31 -9 15 104 -114 -125 -309 75 8 -18 70 -41 260
5572 260 182 37 119 -30 -190 106 153 55 117 13 213 107 -46 42 -35 -141 46 257 -32 69 173 106 158
$$ packed form
5403A50j25J73l00n3JJ26Q4j04J24j4r6k5P5o1K14n8p8m9L02j16j42m9J04k4J5
5428G4j70kQ0o2j23K07L8Om0k19M15j11m51N15k28j1j26L54l42K80o4J28j9J01
5452B30k0l29K87r6r2M3j66K92k62J12j08O8l8j17K66P8j44k6J14J6p2L4J80k66
5476a6J59P6k89j06L08j80k06J23K91p6k06K05K00n14K62j38M3J5j3J17m0J3j05
5499g7J44m0k41K15q9j6k0J67m03M18l3j66j57N39j54l0j01qM1l03M6R8J63j8
5523b5K3J09Kl45J36J43J02J3j89n1k0J56k18K13n2P4j14p3O1K74K2n78M01o6
5547bj6L7j05L1J9J51j64J42l6k62J70j31J35K2K4Q9k18j1j84L84o7k6Q8j11L01
5572B60p8j45Q2j49j60K96M7r8O2j04K00j06j53Q8p7j06J87K11k89J01J04o7N2
$$ plain form
5595 158 -77 218 89 -54 -120 10 91 112 89 124 -178 81 -78 29 75 -121 -37 -15 152 113 260 -182 -19
5618 -19 -83 -155 21 -61 73 107 149 -164 90 -138 38 -53 38 111 98 215 69 -39 202 164 215 155 104 94 105
5643 105 4 9 70 -195 223 -201 4 -75 302 -105 -36 -20 -72 -8 -272 53 -62 -184 13 -288 27 -49 139
5666 139 25 -193 -127 -339 -33 -199 -82 -85 73 -50 -75 1 -83 166 183 246 82 -134 -24 10 91 157 -190 177
5690 177 -225 -18 197 80 77 -62 -266 -109 34 -1 157 -143 -115 31 -343 255 -129 -159 -127 46 41 -57 -227
5713 -227 17 -71 -91 -53 80 79 -94 -28 21 -19 72 -189 249 2 33 153 87 -72 -153 -91 100 -64 149 317
5737 317 98 -249 0 -230 182 34 102 145 323 -201 -41 -92 51 139 -180 -50 21 88 -120 105 5 62
5759 62 41 106 -128 -93 172 66 -252 88 -11 -197 271 -36 137 -73 4 -124 125 -44 -4 68 -42 -196 96
$$ packed form
5595A58k35K95j29j43o6J30Q1K1k3L5l02K59j59J07M6j96Q4K2J67l9J47m42J63
5618a9o4p2J76q2J34L4M2l13K54k28J76r1R1P3j3J17j46j08K41l8N1o0n1j0J1
5643A05j01NO1k65M18m24K05p9L77m07O9J6n2O4k64L25j15j22J97l01L15p6J88
5666A39j14k18O6k12L06j66J17lJ58j23k5P6q4K49J7O3j64k16J10L4Q1O6l47L67
5690A77m02K07K15j17lj39k04J57J43l5J58l00K8J46l74N98l84l0L2J73nr8j70
5713b27K44q8k0L8J33jj73O6M9m0R1k61M38k47L1J20o6j59q1O2J91j64K13J68
5737C17k19l47K49k30M12j48O8M3J78n24J60n1J43Q8l19J30P1O7k08K25j00N7
5759F2k1O5k34L5K65j06l18L40r9j86M68l07J73k10P7j28K49j69M0P2j10j54K92
$$ plain form
5782 96 -78 117 149 60 114 389 168 -102 -4 -129 170 -99 6 2 -14 -160 165 -19 -291 108 18 80 93 148
5806 148 -111 28 -32 3 164 -12 156 -78 -57 188 -32 68 -101 -127 -113 -74 126 19 251 -32 50 122 -20
5829 -20 -23 -113 26 -51 -85 20 148 32 67 -52 -73 87 -93 -81 150 155 -151 -81 -109 -230 126 166 41 -90 90
5854 90 -304 -160 166 1 180 -163 -41 98 -146 106 -84 92 -148 149 -28 169 -41 -82 183 7 -5
5875 -5 130 -192 69 157 -125 -32 -79 98 7 -62 140 242 24 276 -77 -180 283 157 89 110 177 167 -129 -123
5899 -123 194 -52 233 94 -65 161 -185 136 134 -103 62 79 321 123 -62 157 -169 -44 173 105 142 -153
5921 -153 115 198 -39 36 107 -21 -30 29 -62 -74 -60 -161 -1 15 -88 -264 -111 -157 151 13 8 2 -99 93 -69
5946 -69 -77 -4 -79 36 -78 -31 139 -245 18 89 237 111 39 18 -296 75 -67 -27 -1 135 -75 70 1 204
$$ packed form
5782I6j74J95L2q9N4K75k21k70R8j25K99k69J05mj6j46L25j84k72L99r0O2J3N5
5806A48k59J39o0L5J61j76J68k34K1K45k20J00j69k6J4L9K00j07K32k83Q2P2j42
5829b0lr0J39p7l4J05J28j16L5j19k1J60j80J2K31Nl06P0k8j21L56M0j25j31J80
5854I0l94J44L26j65J79l43J22J39k44K52j90J76k40K97j77J97k10m1K65j76j2
5875eJ35l22K61Q8k82R3m7J77r1o9K02J02k18K52l53j03M63j26o8K1O7j0k96O
5899a23L17k46K85j39j59K26l46L21kk37J65J7K42j98j85K19l26J25K17o8L7k95
5921a53K68Q3k37P5P1j28rN9r1j2J4j01J60J6j03j76J53m6L08j38noj01J92j62
5946f9qP3p5J15j14M7J70l84K63P1J48j26p2k1l14L71j42M0K6J36k10J45o9K03
$$ plain form
5970 204 -113 -44 -75 6 192 -79 49 70 93 126 -175 206 -30 -38 -41 -135 30 -131 -95 28 -3 15 -88 -124 -171
5995 -171 118 -55 -43 -18 -57 -161 -71 57 52 -32 80 148 -4 -135 -288 -49 -158 -94 -16 -75 10 -19 -46 -116 22
6020 22 -150 153 -96 -111 -96 67 -63 -82 -197 -24 376 30 -199 189 192 -91 0 93 267 205 -98 54 39
6043 39 -31 -6 -112 83 -134 51 -135 61 104 134 191 -19 -42 68 -39 103 -146 192 216 183 -427 104 -49
6066 -49 -61 -158 -56 10 -84 5 40 106 59 120 25 170 -119 37 -148 -58 -9 -179 -30 -120 -74 227 -137 127 76
6091 76 -166 98 -82 153 24 202 -39 -56 -169 -49 46 -287 -189 11 -318 137 -178 -234 -141 41 220 5
6113 5 127 -88 185 48 103 108 -20 -134 -106 -379 -265 -69 75 -25 -6 25 -48 104 -134 -108 -176 152 86 -14
6137 -14 -19 -151 -13 -167 121 -24 159 3 -30 -78 -118 -55 141 216 6 36 48 133 -66 -69 36 144 -99 199
$$ packed form
5970B04l17O9l1Q1J86k71J28K1K3L3l01L81k36qlr4J65j61L6J23l1J8j03l6m7
5995a71K89j73J2K5l9j04R0J28nq4J12O8j52j31j53K39j09O4P8n9Q5k9k7p0J38
6020B2j72L03k49j5J5J63j30j9j15J73M00l46k29L88Lk83R1R3J74o2l03J52j5
6043C9p0K5j06J95k17J85j86J96M3L0N7k10k3J10j07J42k49L38K4l3o10N31j53
6066d9j2r7J02O6r4Q9L5O6m7O1r5J45k89J56j85R0M9j70J49r0M6L01l64K64n1
6091G6k42K64j80K35j29J78k41j7j13J20R5l33R8K00l29M55l15n6R3J82J79k15
6113EJ22k15K73j37N5Nj28j14K8k73J14J96J44j00J9L1p3J52k38K6o8L28o6j00
6137a4nj32J38j54K88j45J83j56l3m8m0O3J96P5k10L0J2Q5j99lJ05J08k43K98
$$ plain form
6161 199 -215 298 40 -7 -83 107 -90 -79 -170 28 30 -23 -52 -17 -45 93 -37 12 -236 32 12 -109 226 134
6185 134 75 -77 39 -139 22 -220 -6 -172 59 -44 -165 60 55 72 -20 239 64 -101 -96 -64 62 26 -53
6208 -53 137 -29 20 -85 168 -34 111 167 194 208 151 -41 103 -44 -250 -80 110 -128 159 28 -99 197
6230 197 57 57 150 256 42 -59 23 -43 -361 375 -338 -56 -8 161 108 -119 -98 77 257 -78 -60 238 -27
6253 -27 -135 235 -65 -205 100 -309 180 94 -28 162 -205 174 214 -83 -62 61 -62 28 -254 70 -263 -141
6275 -141 -141 36 -62 21 81 -212 132 63 22 63 -74 109 45 114 175 220 -45 23 25 -22 99 -200 -48 -105 -182 -198
6301 -198 -41 -19 227 123 149 220 46 -83 -8 193 -166 -93 122 -18 -177 -78 49 12 15 61 -118 63 272
6324 272 -225 256 -198 16 -108 146 57 -25 -86 -13 60 -166 27 -250 30 64 -30 93 45 -198 -43 -1 145
$$ packed form
6161A99m14N13k58m7p6J90j97J1r1J98Kn3k9L5k8J38j30M9k48K68k0j21L35r2
6185A34n9j52J16j78J61k42K14j66K31j03j21K25nJ7r2K59j75j65NL2J26l6p9
6208e3J90j66M9j05K53k02J45N6K7J4n7j92J44j47k06J70J90k38K87j31j27K96
6230A97j40%R3J06k14j01Q2o6l18P36p13K82M8J69n3k27K1J75J80l35J8K98k65
6253b7j08L70l00j40L05m09M89q6j22J90l67L79M0k97K1J23j23R0k82L24l33J22
6275a41%J77r8Q3O0k93L44o9m1M1j37J83o4O9O1M5k65O8Km7J21k99J52n7p7j6
6301a98J57K2K46j04K6P1j74j29P5K01l59P3K15j40j59R9J27l7LM6j79J81K09
6324B72m97M81m54K14j24K54q9q2o1P3P3k26J93k77K80L4r4J23m8k43J55M2J46
$$ plain form
6347 145 196 -74 205 -130 -131 -10 76 -65 -164 -15 92 -194 -218 88 23 165 153 188 88 47 -79 46 119 -71
6371 -71 -167 -31 277 100 54 -21 -36 145 227 43 116 -37 -130 -114 67 64 11 -332 -63 -62 -166 -250 75 55 -35 117
6397 117 127 -137 -188 231 206 57 258 -30 166 -65 30 24 -238 2 -44 150 195 61 -3 -156 -15 -174 117
6420 117 -260 -18 -78 98 376 82 -90 -208 -154 -135 -88 46 133 16 -72 93 367 302 -235 78 65 -241 -141
6443 -141 -265 101 -327 185 -16 -14 40 151 -174 94 98 -239 59 139 -69 -295 -164 302 -71 -71 12 -53 37 133
6467 133 116 -226 99 -12 22 143 -41 101 -141 -137 -137 323 5 -5 -138 -28 187 17 130 -121 -91 -20 -79
6490 -79 -37 -277 -299 -91 84 193 68 12 -180 134 -156 -14 -102 53 -22 40 129 50 218 53 217 -41 39
6513 39 141 12 -19 -251 113 -78 56 -214 -273 -7 -116 126 -234 48 159 -37 84 71 -155 -44 158
$$ packed form
6347A45N1k70K79l35jJ21Q6j41r9J49J07k86k4L06o5J42j2L5j00m1j26J25P3j90
6371g1r6J36L08j77m6p5j5J81Q2j84P3j53r3J6J81ln3l43K69Jj04q4L25k0r0J52
6397A17J0k64n1M19k5j49K01k88J96k31R5ok62K40m6J94M5j34o4j53J41j59K91
6420A17l77K42o0J76K78k94j72j18N4J9M7J34Q7j17q8J65K74o5n37L13j3l06J00
6443a41j24L66m28N12k01KN4J11l25K68Ml37K98Q0k08k26J31M66l73%Q3o5R0R6
6467A33j7l42L25j11L4J21j84J42k42M%M60l18j0j33J10K15j70J13k51L0P1n9
6490g9M2k40k2K08J75J09j25n6j92L14k90J42q8J55p5O2Q9p9J68j65J64k58Q0
6513C9J02j29l1k32L64j91J34k70n9K66j09K42l60K82J11j96J21j3k26J11K02
$$ plain form
6534 158 26 153 -282 261 -33 -142 216 -12 92 44 1 -112 -76 -36 78 -181 -162 -9 -120 237 44 86
6556 86 -81 53 -10 58 -51 -259 231 -113 175 -22 -182 -60 -49 38 -4 -131 -30 -80 -12 125 14 103 -367
6579 -367 36 38 119 49 144 45 -116 -2 114 -2 -97 114 6 -159 -72 -43 -27 -88 -151 -111 44 34 40 -11 -38 61
6605 61 -135 -108 42 -101 -150 0 37 -27 140 -12 4 -167 -172 24 -248 34 190 201 44 43 -44 -51 -373 147 62
6630 62 -103 121 -18 116 -285 -80 118 24 -47 -129 -75 274 -197 222 38 -37 -98 -262 84 -206 150 -11
6652 -11 -192 116 -95 -15 59 37 -221 151 -185 -135 -182 -170 61 10 28 114 242 -16 57 186 -25 50 -36 201
6676 201 269 211 87 -89 -166 92 -69 117 157 148 -1 239 33 -42 -113 -106 110 -69 -152 -377 120 65 317 38
6700 38 105 -136 -162 163 79 121 50 4 -32 -172 -105 92 160 22 283 159 105 -34 14 38 -40 12 -179 30 -46
$$ packed form
6534A58j32J27m35N43k94j09L58k28J04m8m3j13L6M0J14k59J9J53j11L57j93M2
6556H6j67J34o3O8j09k08M90l44K88j97j60J22J1Q7m2j27J01n0O8J37j11Q9m70
6579c67M03KQ1p0R5r9j61J14J16j16r5K11j08j65Q7K9J6o1o3M0J55j0On1k7R9
6605F1j96K7J50j43m9J50L7o4J67j52J6j71nJ96k72K82J56J1j57jq7pl22N20q5
6630F2j65K24j39J34m01K05J98r4p1q2N4L49m71M19j84p5o1j64L46k90L56j61
6652a1j81L08k11Q0P4k2k58L72l36N0m7J2K31n1J8Q6J28k58P3J29k11P5q6K37
6676B01O8n8j24j76p7K58j61J86M0rj49K40k06p5p1PK16j79q3k25M97n5K52k79
6700C8O7k41k6L25q4M2p1m6l6j40O7J97O8j38K61j24n4j39M8K4p8N2j91K09p6
$$ plain form
6725 -46 143 -106 -175 -153 120 83 -149 204 -24 -156 -206 -137 46 -85 -214 119 24 -164 -133 -68 53 122 117 -270
6749 -270 -51 -109 -163 -58 -74 1 -68 151 -186 -100 -33 54 76 -51 -62 -89 135 -18 115 -290 -18 -187 -64 117
6773 117 97 108 101 0 -308 99 -54 44 100 40 -24 70 -184 -42 75 -177 -44 9 -52 -56 231 -35 -234 -144 -118
6798 -118 -26 172 -302 194 -172 -157 -65 -47 -99 174 7 -124 -8 -226 -167 112 55 -11 -50 29 -149 -61 -99 -94 132
6823 132 -24 37 -136 171 -365 151 124 -318 267 17 -32 -4 93 -81 54 26 213 -62 5 -176 -149 -62 -26
6846 -26 7 -124 11 -197 56 -48 -37 -6 -178 51 -154 -69 -168 165 93 135 116 -100 -102 17 -206 71 -68 150
6870 150 24 -51 53 43 -48 48 87 9 -55 15 64 113 -111 15 206 -308 508 -221 -121 153 39 130 -6 -104
6894 -104 1 221 113 -84 21 -112 -75 -145 120 5 226 67 112 -97 62 -2 -135 91 197 16 31 -190
$$ packed form
6725d6J89k49o9K2K73l7k32L53k28j32n0O9J83j31j29L33r5j88L1O5J21O9nl87
6749b70K19n8n4J05j6P5o9K19l37Q6O7Q7K2j27j1k7K24j53J33m05K72j69J23J81
6773A17k0J1pj01l08M07j53R8N6o0o4R4k54J42J17k52J33N3o1mK87k66j99R0K6
6798a18R2J98m74M96l66J5R2J8n2K73j67j31J16k18N9K79n7o6l9P9j78Q8l8NK26
6823A32j56O1j73L07n36N16k7m42N85k50m9K8R7j74J35k8J87k75O7j81K7Q7L6
6846b6L3j31J35k08K53j04J1L1j72K29k05Q5r9L33p2M2j9k16kJ19k23K77j39K18
6870A50j26p5J04j0r1R6L9p8o4P0M9M9k24J26J91n14Q16p29J00K74j14R1j36r8
6894a04J05K20j08j97J05j33L7p0K65j15K21j59M5k09J59o4j33K26J06j81J5k21
$$ plain form
6916 -190 -231 228 318 -35 55 61 -65 82 -38 40 -45 -93 31 -35 -147 51 -299 -4 -125 141 -79 132 -106
6939 -106 51 -90 -78 -42 -50 -23 -1 222 214 52 243 -414 -65 -27 -138 89 -83 124 -11 -62 -36 -64 87 -63
6963 -63 -181 -68 -84 -172 176 -55 7 -95 167 75 -185 120 -75 267 -163 28 -55 -223 53 -132 5 84
6985 84 -27 62 413 -98 61 -119 -107 94 -107 134 -126 -191 -125 309 23 112 21 -32 -17 -21 227 -158 -120 -222
7009 -222 62 -247 48 109 198 5 -56 -47 225 144 2 28 42 -24 -252 -159 -41 100 75 69 -122 -3 -98 -61 24
7034 24 77 -57 9 92 -119 16 -117 122 -179 -40 -129 211 324 -80 18 -18 57 24 -118 -17 -34 53 198 -17
7058 -17 -83 -186 113 -120 -131 189 -64 90 -95 210 136 -40 3 -14 -206 13 109 267 4 -43 11 97 -71
7081 -71 10 19 85 315 122 -205 -2 152 7 92 -236 -145 -112 67 -273 7 193 -120 -27 -184 13 144 -85
$$ packed form
6916a90m1M59R0l53R0Oj26J47j20P8q5m8J24o6j12J98l50K95j21K66k20K11k38
6939a06J57j41J2L6qK7K2K23qj62J91o57L49L8j11K27j72K07j35n1K6k8J51j50
6963f3j18J13j6q8L48k31O2j02K62r2k60L05j95L42m30J91q3j68K76j85J37P9
6985H4j11Q9L51n11J59j80J2K01k01K41k60o5O6M34k86Q9r1n3J5mK48l85L8j02
7009b22K84l09K95O1Q9j93o1RK72q1j42K6J4o6k28R3J18J41k5oj91J19r5L7Q5
7034B4N3j34O6Q3k11J35j33K39l01J39q9L40J13m04R8l6P5l3j42J01j7Q7J45k15
7058a7o6j03K99k33j1L20k53J54j85L05p4j76M3j7j92K19R6J58k63m7N4Q6j68
7081g1Q1RO6K30j93l27K03J54j45Q5l28R1L3J79l40K80J86l13R3j57J97J31k29
$$ plain form
7104 -85 216 -75 -47 -35 106 -4 1 -168 191 271 -198 -37 -152 110 -26 214 97 -11 220 95 107 -4
7126 -4 94 320 82 -140 -30 -92 77 -64 3 -101 189 -154 8 -5 24 -222 20 25 -73 -169 -49 -115 7 -81
7150 -81 -24 -206 -117 126 58 35 0 189 101 -90 26 32 -273 -39 225 -142 -210 89 122 -90 373 -140 -181 253
7174 253 49 -5 -113 -65 -28 -48 184 -74 -22 -29 -11 -180 13 -45 -131 -144 -118 81 226 87 157 13 -118 121
7198 121 136 81 -170 219 0 -17 -70 -16 0 -132 -106 181 -231 84 69 -170 -198 -177 -41 -76 4 111 39 4 41
7223 41 15 -32 -132 -83 38 -77 60 0 63 -69 -238 -4 105 -68 -23 391 148 -159 -146 28 -25 41 -117
7246 -117 112 -50 -107 -86 -65 138 15 -151 172 311 -243 -115 -12 -14 39 -156 -176 -40 79 -161 -38 180
7268 180 106 -49 -104 -60 8 27 -250 -14 -14 57 -74 -78 11 -82 92 -161 133 -41 143 -195 38 -200 1 -129
$$ packed form
7104h5L01k91K8J2J41j10Nj69L59Q0m69J61j15K62j36K40j17j08K31j25J2j11
7126dR8K26k38k22J10o2J69j41O7j04K90l43J62j3K9k46K42Nr8r6J20o6J22q8
7150h1N7j82Q9K43o8k3l5J89q8j91J16Ol05K34K64l67o8K99L3k12M63n13m1M34
7174B53k04n4j08M8L7k0K32k58N2pJ8j69J93n8q6j3K6J99J45j39P0j44j31K39
7198A21J5n5k51L89k19j7n3N4J6j32K6K87m12L15j5k39k8K1J36l5Q0J07p2l5L7
7223D1k6m7j00M9J21j15J37o0O3j32j69K34J09j73M5M14k43l07J3J74n3O6j58
7246a17K29j62n7K1K1K03j23j66L23J39n54J28J03kN3j95k0J36J19k40J23K18
7268A80p4j55n5M4O8J9k77K36%P1j31mQ9r3J74k53K94j74J84l38K33k38K01j30
$$ plain form
7292 -129 96 23 67 -45 -82 29 115 266 32 -84 -15 -115 -96 -170 -212 2 -16 20 52 132 -35 -274 97 -80
7316 -80 9 30 -235 -153 -209 -19 -67 58 -35 40 287 87 -186 136 88 148 -255 -123 -49 -146 132 -100 4 -21
7340 -21 -218 79 140 -136 -216 34 -42 -65 -64 177 -49 -121 133 -66 -283 -129 80 102 -113 -168 -89 -1 -41 44 55
7365 55 77 37 -56 -197 158 -92 -166 -29 -19 -127 -62 141 -69 54 -19 157 -2 129 4 -276 -196 -25 112
7388 112 -177 183 26 -59 93 -84 -64 33 93 199 7 98 -180 22 14 56 -79 119 -20 -76 -18 -189 15
7411 15 -71 -12 -156 73 162 -185 33 -154 244 106 57 -120 -345 -102 -68 -89 197 84 -33 -87 5 -68 -160 31
7435 31 -152 155 -149 -76 156 -46 -208 -171 -62 -12 -16 23 92 -46 -15 280 -3 -60 108 -32 -83 186 2 -44
7459 -44 -65 -109 -173 -193 -40 33 -152 -45 3 -104 -28 -1 -14 -283 -139 81 34 -280 -71 -43 -141 8 141 -112
$$ packed form
7292a29K25p3M4j12l7J11Q6J51k34j16O9j00J9p4m2K14j8L6L2Q0j67k39L71j77
7316h0Q9K1k65Q2n6J90m8J25r3P5K47k00k73L22m8O0m03J32P4r7K78k32J04k5
7340b1j97K97O1k76q0K50p6k3JK41k26p2K54j99k17J54K09K2k15n5P9Q8m0Q5J1
7365E5K2m0r3j41L55k50p4J37J0j08O5K03k10J23p3J76j59J31j25k80Q0J71J37
7388A12k89L60j57q5J52j77K0R7O0J06j92R1k78K02qM2j35J98j39n6N8j71K04
7411A5q6N9j44K29Q9l47K18j87L98j38m9j77k25K43L4k1K86j13j17n4R2p3r2J91
7435C1j83L07l04P3K32k02j62L7J09N0mL9O9j38L1K95k83n7J68j40n1K69j84m6
7459d4k1m4o4k0J53P3j85J07M8j07P6K7j3k69J44K20m7l14K09K8r8J49J33k53
$$ plain form
7483 -112 -28 -104 -50 -68 123 208 66 118 94 -183 234 101 72 -91 289 54 288 -22 18 -38 -19 -112 -102 -239
7507 -239 110 -237 121 16 214 -30 38 45 -84 -212 284 15 47 -106 -15 -114 234 11 -191 39 -144 9
7529 9 106 -7 -76 50 167 152 -279 26 -86 163 15 -241 -33 -197 58 76 -36 -50 213 55 14 178 35
7552 35 -88 135 43 -116 43 2 -130 -31 -26 5 91 -72 -7 259 -148 12 -183 -113 -81 -136 222 -68 37 -86
7576 -86 -127 -201 54 -87 -80 57 88 54 -118 128 50 97 -62 -13 39 -98 18 -113 -136 -27 288 -72 166 -179
7600 -179 -178 -63 -171 7 -94 -12 -5 -165 -201 -287 24 -40 19 -79 -21 59 -58 -51 12 73 93 -63 -36 -23 25 -143 -191
7627 -191 135 95 -4 -78 85 -8 30 -35 -108 -76 101 -135 -267 130 -21 -31 66 29 15 110 -12 -6 105 -158 3
7652 3 -110 62 259 3 36 128 -38 56 -258 -33 62 16 -12 -49 -19 30 134 65 -1 118 132 -90 -222 -170 77
$$ packed form
7483a12Q4p6N4j8J91Q5j42N2k4k77M17j33k9j63L80k35K34l10M0n6J9r3J0j37
7507b39L49l47L58j05J98k44O8Pj29j28M96k69L2j53R1r9L48k23k02K30j83J53
7529IR7j13o9J26J17j5m31L05j12K49j48k56K08j64K55J8j12j4K63j58m1J64j43
7552C5j23K23r2j59J59m1j32R9NL1Q6j63O5K66m07J60j95P0L2n5L58k90J05j23
7576h6m1p4K55j41PJ37L1l4j72K46p8M7j59M9N2j37J16j31k3J09L15l60K38l45
7600a79JJ15j08J78j01Q2Pj60l6q6L11o4N9r8N8Q0j17PO3O1K0j56K7J3M8j68m8
7627a91L26m0r9p4J63r3L8o5p3L2J77k36j32L97j51j0R7l7j4R5j22OJ11k63J61
7652Cj13J72J97k56L3R2j66R4l14K25R5m6k8l7L0M9J04o9o6J19J4k22j32N2K47
$$ plain form
7677 77 -48 90 -44 169 -104 134 -13 -136 -16 -275 -37 62 26 -144 44 -8 87 -112 111 121 -61 48
7699 48 -12 173 -117 127 -104 -55 127 34 278 -77 -31 32 -267 66 -141 -32 22 35 -94 -48 135 47 -255
7722 -255 -221 83 17 -82 -138 -125 84 -47 -292 34 55 120 158 -41 -30 195 -38 75 -120 24 -80 72 124
7745 124 118 70 -11 276 -34 -120 -48 145 -5 36 512 -128 123 17 -31 109 -36 59 58 80 206 -47 -1 149
7769 149 -239 73 20 176 2 -24 -154 238 -171 -51 -56 135 140 103 -178 -45 291 108 62 207 -43 -190 16
7792 16 -28 -24 105 125 -88 205 -15 -58 122 17 -134 161 120 -3 -2 87 -85 -79 -84 -110 126 -97 -27 -69 92 -37
7818 -37 148 -220 -12 108 140 137 39 -160 11 335 93 194 69 -167 -37 143 -59 -143 -102 -64 142 -67 -22
7841 -22 185 -28 40 -75 -152 83 118 216 -161 -17 124 218 -262 97 155 75 112 -98 -60 -76 39 13 35 -15 -52
$$ packed form
7677G7j25J38j34K13k73K38j47j23J20k59K38R9l6j70J88n2R5j99K23J0j82J09
7699D8o0J85k90K44k31M9J82r3K44l55M6O3k99L33k07J09N4J3j29M6J83q8l02
7722b55L4L04o6r9n6J3K09j31k45L26K1O5L8j99J1K25k33J13j95J44j04J52N2
7745A24om8q1K87l10q6P2J93j50M1M76o40K51j06m8J40j45R5jK2J26k53M6J50
7769A49l88L12n3J56j74k6j30L92m09J20nJ91Nl7k81J33L36j83m6J45k50j47K06
7792A6m4MJ29K0k13K93k20m3J80j05j51K95m1j23JQ9j72Onk6K36k23P0m2J61j29
7818c7J85l68K08J20L2lr8j99J71L24k42J01j25k36J30J80k02q4M1L8K06k09M5
7841b2K07k13O8j15p7K35L5R8l77J44J41R4m80L59N8q0L7k10L8j6J15k6K2n0l7
$$ plain form
7866 -52 144 275 113 -210 136 72 -167 -299 216 100 118 -96 -3 -10 -50 330 -325 -261 181 -34 314 55 -223
7889 -223 252 27 -76 -44 65 43 4 -32 -156 -82 -102 -121 -56 -166 331 -321 -265 103 -290 -187 106 51 105 37
7913 37 -16 -42 89 -46 64 -13 7 -79 106 29 3 53 -139 -131 96 -194 -62 304 188 64 68 137 44 95 19 83
7939 83 53 184 11 122 -85 -49 27 146 152 -65 70 19 -102 81 -57 -8 -2 -83 126 -109 -286 -36 -64 116
7963 116 98 -151 148 136 -273 -43 -2 -75 -164 -39 -59 -308 73 -17 158 95 188 47 186 145 105 150 71 -145
7987 -145 51 -102 -92 40 81 85 -52 28 -101 67 -147 -59 -55 105 8 -66 70 -10 48 -249 238 -57 309 100
8011 100 15 -42 -26 218 -79 -174 -87 32 -91 -211 -31 -44 -155 -206 -132 1 -90 64 -218 -150 -123 90 -14 68
8035 68 204 -197 259 176 22 -200 -16 -35 -281 339 -30 -78 72 43 146 -73 -178 201 -207 -28 -200 -19
$$ packed form
7866e2J96J31j62l23L46o4k39j32N15j16J8k14R3pm0L80o55O4M42k15L48k59k78
7889b23M75k25j03L2J09k2l9l6j24P4k0j9O5j10M97o52N6L68l93J03K93n5N4o8
7913C7n3k6J31j35J10p7K0q6J85p7k6N0j92QK27k90J32L66j16j24MO9r3N1p6O4
7939H3l0J31j73J11k07L6P6J19Ok17J35n1j21J83j38M9Oq1K09k35j77K50k8J80
7963A16j8k49K99j2m09K30M1p3q9J25k0k49L81r0J75o3R3j41J39m1m0M5p9k16
7987a45J96j53J0J32M1Mj37Q0j29J68k14Q8MJ60r7p4J36q0N8k97M87k95L66k09
8011A00q5n7J6K44k97r5Q7J19j23j20J80j3j11n1P4J33r1J54k82O8K7K13j04Q2
8035F8J36m01M56q3j54k22J84j9k46O20l69m8J50k9J03k19j05L79m08J79j72J81
$$ plain form
8057 -19 115 105 -71 -5 71 -26 53 -121 40 -191 -45 -35 7 -8 -32 -51 14 206 -222 171 14 -305 -211 -136 -33
8082 -33 73 170 -19 115 242 156 169 -84 -75 -186 100 -61 181 -28 316 -51 -131 -76 -99 81 50 -169 -140 44
8106 44 -193 9 35 -81 159 165 -187 145 -60 -55 -240 45 -99 36 -183 245 109 -112 16 31 126 186 -47
8129 -47 220 27 15 -60 -5 -106 62 -75 -86 -174 155 -11 309 69 210 101 -233 146 -16 77 1 170 -117
8152 -117 5 -116 120 355 28 -205 236 -118 -154 91 262 -233 -75 -283 -2 -158 29 44 -120 162 16
8173 16 -28 -17 0 -133 -7 -160 188 -34 -316 -67 139 -99 -86 -164 44 -94 -122 -322
$$ packed form
8057a9J34j0j76O6P6r7P9j74J61k31J46J0M2j5k4j9O5J92m28L93j57l19R4P5J03
8082c3J06R7j89J34J27q6J3k53Rj11K86j61K42k09L44l67q0N5k3J80l1k19K9J84
8106D4k37K02K6j16K40Ol52L32k05Nj85K85j44J35k19M28j36k21J28J5R5O0k33
8129d7K67j93j2p5N5j01J68j37j1q8L29j66L20k40J41j09l34L79j62R3p6J69k87
8152a17J22j21K36K35l27k33M41l54l6K45J71m95J58k08K81j56J87J5j64K82j46
8173A6m4J1J7j33J26j53L48k22k82K49K06k38J3p8K08j38k8k00
8191c22
$$ Imaginary data points
##PAGE= N=2
##DATA TABLE= (X++(I..I)), XYDATA
$$ plain form
0 0 0 0 0 0 0 0 0 0 0 0 0 0 0 0 0 -8 8 -8 8 -8 9 -16 16 -17 24 -24 32 -37 40 -48 56 -64 72 -80 89 -103 113
37 113 -128 144 -160 176 -199 218 -243 269 -296 327 -362 399 -439 483 -532 586 -648 716 -791
56 -791 879 -978 1094 -1230 1395 -1594 1843 -2170 2612 -3249 4257 -6078 10474 -49102 -14868
71 -14868 24683 -47969 971 -4664 -47678 2971 27795 -19250 4720 14877 -8321 7525
83 7525 23087 10079 18464 12761 -3502 7649 26478 12839 -223 7039 2819 -2323 17722
96 17722 4751 -17901 10742 12022 -16986 5074 8923 -10612 12143 5413 -17972 11233 9336
109 9336 -9235 14085 921 -15572 14506 1604 -16209 15365 3810 -23244 -334 3754
121 3754 -8614 2990 -1582 -18997 -9814 7304 3555 -10687 -8220 -1831 -6527 714 6458 -7129
$$ packed form
0@%%%%%%%%%%%%%%%qJ6j6J6j6J7k5L2l3M1m8N6o9P7q8J04j20J36j52J69j92K16
37A13k41K72l04L36l75M17m61N12n65O23o89P61q38R22j015J118j234J364j507
56g91J670j857K072k324K625k989L437m013M782n861P506j0335J6552n9576L4234
71a4868L9551p2652M8940n635m3014N0649K4824m7045K3970J0157k3198J5846
83G525J5562j3008Q385n703j6263J1151J8829j3639j3062P262m220n142K0045
96A7722j2971k2652K8643J280k9008K2060L849j9535K2755o730k3385K9205j897
109I336j8571K3320j3164j6493L0078j2902j7813L1574j1555k7054K2910M088
121C754j2368J1604m572j7415R183J7118l749j4242K467O389m696P241N744j3587
$$ plain form
135 -7129 -6031 1256 -5071 2206 5994 -3633 -1561 -4199 -3973 11154 2750 -9584 1413 -1050 -735
150 -735 10644 -3063 -8385 5568 369 658 6972 -5215 -945 8581 -3626 2030 9890 -3381
164 -3381 260 8248 1079 4829 8021 739 1795 6439 7116 4377 -456 3206 5122 568 3123
179 3123 503 -5516 946 314 -6621 -3509 -5651 -7090 -2172 -7954 -8557 -2644 -10024 -6808 1086 -8280
195 -8280 -6334 943 -7362 -2160 5904 -3397 -2352 3651 -1398 3667 6770 -850 853 3709 1572
210 1572 5159 5108 -534 237 3038 3017 2824 2109 740 -239 2248 5029 1243 528 2722 -445 970
227 970 4848 -226 -513 2076 -2581 -340 3111 -3362 -3368 -668 -4406 -357 399 -6894 -3653 305 -2886
244 -2886 -824 -659 -4509 -707 2500 -1080 20 1992 630 662 2087 1839 1678 2487 247 -1553 1838
$$ packed form
135g129J098P287o327P277L788r627K072k638K26J5127q404j2334J0997k463L15
150g35J1379j3707n322J3953n199K89O314j2187M270R526j2207N656P860j3271
164c381L641P988p169L750L192p282J056M644O77k739m833L662J916m554K555
179C123k620o019O462o32o935L112k142j439M918n782o03N913p380L216P894r366
195h280J946P277q305N202Q064r301J045O003n049N065L103p620J703K856k137
210A572L587n1n642P71K801k1j93p15j369r79K487K781l786p15K194l167J415
227I70L878n074k87K589m657K241L451o473oK700l738M049P56p293L241L958l191
244b886K062J65l850L802L207l580J100J972j362L2J425k48j61Q09k240j800L391
$$ plain form
261 1838 3348 -671 -1288 -958 -2791 441 439 -4638 -1480 770 -4048 -1853 76 -2621 1688 1099 -5149
278 -5149 414 4406 1196 2339 1288 -1736 3404 4639 344 2764 3487 -166 257 843 757 2833
294 2833 242 -4848 -3130 773 1490 -782 -3736 -4540 -1784 876 -107 -2106 -664 -348 -2248 -167
310 -167 2132 1938 1719 -1144 -3295 2350 5653 1627 -744 -1317 -1504 2915 2661 -1556 277 302 -2653
327 -2653 -484 719 428 1655 -1827 -4771 -143 3657 1645 -478 -2772 -2339 1798 2423 -322 -386
343 -386 -115 -1138 -1129 12 1097 1351 -1327 -4085 -2624 1921 2227 -1267 -3057 -3100 -303 2192 288
360 288 -1059 160 311 44 1342 2578 3210 2322 -838 -363 3579 4592 2641 -468 -1417 987 2932
377 2932 625 -800 -1598 -1120 -905 -1970 -1632 -277 -1774 -3358 -3319 -1782 934 216 -2869 -2446 -122
$$ packed form
261A838J510m019o17L30j833L232kn077L158K250m818K195J929k697M309n89o248
278e149N563L992l210J143j051l024N140J235m295K420P23l653M23N86q6K076
294B833k591n090J718L903P17k272k954q04K756K660r83j999J442L16j900K081
310a67K299j94k19k863k151N645L303m026k371n73j87M419k54m217J833K5k955
327b653K169J203k91J227l482k944M628L800k012k123k294M33M137O25k745o4
343c86K71j023RJ141J085K54k678k758J461M545L06l494j790m3K797K495j904
360B88j347J219J51k67J298J236O32q88l160M75L942J013j951l109r49K404J945
377B932k307j425p98M78K15j065L38J355j497j584L9J537K716p18l085M23K324
$$ plain form
394 -122 1121 1649 41 -588 1773 1796 811 1426 1706 1297 1022 -998 -203 2271 777 -882 -1811 -1711
412 -1711 269 -192 -2468 -2329 -1222 -1029 -492 -898 -772 941 41 -713 406 1446 1987 1639 -595 560
430 560 2646 1959 1118 111 -731 816 1413 70 -240 -768 -1071 -294 -691 -62 638 -1006 -1357 185
448 185 1183 1193 546 -783 -362 1237 1540 782 -1114 -959 207 -381 -635 -880 -2121 -2071 -2034 -1989 -1386 -1812
468 -1812 -2885 -2148 -2176 -1187 59 -1466 -1165 930 340 970 1846 1118 1833 3108 1733 2664 2801 2041
486 2041 3443 3139 1365 2355 2181 1129 2681 1831 -351 253 144 -148 252 -1325 -1881 -1900 -2584 -1124
504 -1124 -1801 -3564 -2651 -2986 -3836 -1493 -1515 -3947 -2513 -2164 -1110 227 -791 -1073 124 490 1841
521 1841 2563 110 1352 3003 1778 2201 1817 500 1639 1494 737 1690 -642 -1358 571 -399 193
$$ packed form
394a22J243N28j608o29K361K3r85O15K80m09k75k020P95K474j494j659r29J00
412a711J980m61k276J39J107J93N37m06J26J713r00p54J119J040N41l48k234J155
430E60K086o87q41j007q42J547N97j343l10n28l03P77l97O29P00j644l51J542
448A85R98J0o47j329M21J599L03p58j896J55J166n88k54k45j241N0L7M5O03m26
468a812j073P37k8R89J246j525L01K095n90O30Q76p28P15J275j375R31J37p60
486B041J402l04j774R90j74j052J552q50k182O04j09k92M00j577n56j9o84J460
504a124o77j763R13l35q50K343k2k432J434L49J054J337j018k82J197L66J351
521A841P22k453J242J651j225M23l84j317J139j45p57R53k332p16J929r70N92
$$ plain form
538 193 1245 -1902 -2293 848 1323 731 16 -1696 -406 1601 1716 1657 -856 -1121 1488 562 -108 1342
556 1342 -516 -2065 -719 185 59 -40 -1210 -1897 -1548 420 1225 -1438 -1890 493 111 -156 519 -267
574 -267 608 1372 -789 -1244 -78 -421 920 -1307 -3516 -889 -676 -2134 -579 -1183 -2718 -1410 -1375
591 -1375 -513 1561 330 -949 -694 329 4021 4428 38 -368 1625 2855 4252 3251 -75 14 1470
608 1470 1971 2280 1134 479 -307 -1848 922 2700 -248 -902 -1579 -1576 1615 1808 -1597 -1711 -1263 -539
626 -539 682 -1656 -2400 -421 -2209 -2955 -1402 -2601 -2129 -848 -3417 -3248 -684 -1487 -1192 -636 -1344
643 -1344 287 451 -787 1431 2373 1695 1808 929 1576 3808 3764 1467 444 952 2733 2700 1206 230
661 230 -295 -114 874 247 -378 -38 -1879 -1685 75 39 -75 -1260 -2757 -551 1518 48 -791 -1151
$$ packed form
538A93J052l147l91L141M75n92p15j712J290K007J15n9k513k65K609r26o70J450
556A342j858j549J346R04j26r9j170o87L49J968Q05k663m52K383l82k67O75p86
574b67Q75P64k161m55J166l43J341k227k209K627K13j458J555o04j535J308L5
591a375Q62K074j231j279K55J023L692M07m390m06J993J230J397j001l326Q9J456
608A470N01L09j146o55p86j541K770J778k948o54o77LL191J93l405j14M48P24
626e39J221k338p44J979j788p46J553j199M72J281k569J69K564q03K95N56p08
643a344J631J64j238K218R42o78J13q79O47K232m4k297j023N08J781l3j494r76
661B30n25J81R88o27o25L40j841J94J760l6j14j185j497K206K069j470q39l60
$$ plain form
679 -1151 -1350 1222 1663 -663 -239 -73 -14 941 102 141 193 -593 -328 281 -171 -222 -870 -1897 -455 360
699 360 -897 -1173 -1623 -1291 47 -984 -1549 -507 -771 161 271 -527 398 830 80 842 664 275 1868
718 1868 906 185 1622 1096 313 1346 838 624 1218 -326 -482 560 506 372 -191 -1373 10 1157
736 1157 195 219 -480 -888 378 469 233 299 -793 -1108 324 -229 -297 -178 -1618 -1511 -166 -318 -667 -728
756 -728 -1849 -535 40 -427 -215 -345 -649 366 495 452 1062 372 234 882 1169 454 902 725 873 862
776 862 252 151 175 203 91 -399 -539 -746 -585 -558 -294 -927 -723 -456 -790 246 178 -597 -274 -272 36 787
798 787 290 -314 596 366 309 770 254 369 370 -154 -185 332 263 38 -585 -677 111 132 -261 -128 37 -184 2
821 2 -318 69 759 373 360 -106 -436 1137 884 139 -120 -325 -365 539 21 -478 70 -1129 -1299 -284 -456
$$ packed form
679a151j99K572M41k326M24J66N9R55q39L9N2p86K65O09m52n1o48j027J442Q15
699C60j257k76m50L32J338j031n65J042k64R32J10p98R25M32p50P62j78l89J593
718A868r62p21J437n26p83J033n08k14N94j544j56J042n4j34n63j182J383J147
736A157r62K4o99m08J266R1k36O6j092l15J432n53o8J19j440J07J345j52l49o1
756g28j121J314N75m67K12j30l04J015J29m3O10o90j38O48K87p15M48j77J48j1
776H62o10j01K4K8j12m90j40k07J61K7K64o33K04K67l34J036o8p75L23KL08P51
798G87m97o04R10k30n7M61n16J15Jn24l1N17o9k25o23r2P88K1l93J33J65k21J86
821Bl20L87O90l86j3m66l30J573k53p45k59k05m0R04n18m99N48j199j70J015j72
$$ plain form
842 -456 -426 -84 -1460 -1147 429 234 158 -103 -1100 -349 828 313 393 219 -332 -103 -7 244 870 482 -1028
863 -1028 -674 -247 578 239 -642 -821 -809 -87 134 149 -13 85 -35 16 784 873 1047 951 105 606 1956 1784
885 1784 1164 681 244 923 1389 811 415 91 -223 -458 -521 -618 -250 -1121 -2135 -1858 -1064 -881 -1303 -2034
905 -2034 -2041 -1455 -879 -475 -1010 -765 -728 -703 -543 253 336 496 -28 -313 891 1533 942 373 563 470 962 840
927 840 145 418 507 441 183 -88 454 985 37 -130 556 976 1002 637 -219 402 1012 322 509 282 28
948 28 226 177 -679 -100 -385 -594 -557 -959 -597 -365 -882 -1292 -775 -723 -147 -167 -508 -256 200 326 417 437 61
971 61 413 180 -193 387 124 -773 -775 -834 -635 -298 -1237 -1564 -1112 -747 -156 -324 -1143 -397 -31 98 705 870
993 870 1117 1142 1033 1409 1858 1785 1565 1075 1022 1441 1442 558 311 84 -117 126 -133 -687 -156 -616 -924 -807
$$ packed form
842d56L0L42j376L13J576j95p6k61r97P51J177n15Q0j74n51K29R6K51O26l88j510
863a028L54M27Q25l39q81j79J2P22K21J5j62R8j20N1P68Q9J74r6q46N01J350j72
885A784o20m83m37O79M66n78l96l24l14k35o3r7L68q71j014K77P94J83m22p31
905b034pN86N76M04n35K45L7K5J60P96Q3J60n24k85J204O42n91n69J90r3M92j22
927H40o95K73Q9o6k58k71N42N31r48j67O86M20K6l65q56O21O10o90J87k27k54
948B8J98m9q56N79k85k09L7m02L62K32n17m10N17N2N76k0l41K52M56J26R1K0l76
971F1L52k33l73N80k63q97kn9J99L37r39l27M52L65N91j68q19P46L66J29O07J65
993H70K47K5j09L76M49p3k20m90n3M19Jq84k47k27k01K43k59n54N31m60l08J17
$$ plain form
1015 -807 -881 -307 -41 -712 -853 -506 -807 -371 -157 -680 -313 -604 -657 -332 -421 -286 -740 -1056 -833 -294 -379
1036 -379 -494 -797 -1231 -237 406 -275 145 -335 28 791 827 715 1155 444 572 1547 857 863 1175 575 796
1057 796 1185 484 881 516 -163 393 350 -190 147 -492 -344 112 -807 -1034 -778 -823 -644 -276 -1084 -1337 -526
1078 -526 -380 92 -517 -871 -98 -129 403 837 523 240 422 340 547 1096 513 148 -294 -220 392 179 -921
1099 -921 -902 -833 -774 -455 -686 -1052 -730 -712 -624 -144 -77 -127 322 139 281 1033 918 1038 915 952 954 893 265 915
1123 915 844 472 182 -442 183 640 16 -369 -668 -1013 -119 104 -583 -363 -623 -842 30 206 177 72 -916
1144 -916 -843 296 291 315 59 -1229 -352 340 -32 -161 -541 -1108 -235 -202 -535 -72 -32 -385 362 290 242 1195
1166 1195 465 298 740 503 794 880 241 807 649 -178 66 213 -52 430 -244 -850 -161 -503 -458 -288
$$ packed form
1015h07p4N74K66o71j41L47l01M36K14n23L67k91n3L25q9J35m54l16K23N39q5
1036c79j15l03m34R94O43o81M20m80L63P63L6j12M40p11J28R75o90OL12o00K21
1057G96L89p01L97l65o79N56m3n40L37o39J48M56r19k27K56m5J79L68q08k53Q11
1078e26J46M72o09l54P73l1N32M34l14k83J82q2K07N49n83l65m42P4O12k13j100
1099i21J9O9N9L19k31l66L22J8Q8M80O7n0M49j83J42P52j15J20j23L7Ko1o28O50
1123I15p1l72k90o24O25M57o24l85k99l45Q94K23o87K20k60k19Q72J76k9j05r88
1144i16P3J139nK4k56j288Q77O92l72j29l80n67Q73L3l33M63M0l53P47p2m8R53
1166A195p30j67M42k37K91Q6o39N66j58q27K44J47k65M82o74o06O89l42M5J70
$$ plain form
1186 -288 -1218 -815 -181 -300 4 -208 -343 -158 -89 -122 548 188 -235 106 284 635 961 -153 -284 223
1206 223 405 269 -20 -646 -356 164 200 -258 -437 -205 -44 -78 -113 246 -286 -485 159 -139 509 267 -167
1227 -167 48 490 352 440 116 -331 275 414 35 -78 -373 -554 16 -333 -385 -11 -411 -365 -212 -323 57
1248 57 54 -545 -68 71 117 690 423 190 684 444 133 397 -101 423 295 -621 -462 10 -335 -189 -278 -920
1270 -920 -606 -483 -513 -362 -453 -819 -283 -356 13 596 -53 -259 126 355 490 1048 234 437 502 533 855 372
1292 372 26 -100 -247 -170 270 -302 -207 -257 -594 -611 -76 -558 -775 -298 -752 -262 38 -357 298 213 -35 348
1314 348 358 77 403 459 146 577 421 350 643 320 101 63 -38 128 102 -23 -242 -381 -476 -213 -73 -335
1336 -335 -400 -419 -212 -307 -148 56 -191 -426 54 59 -200 199 -52 -295 157 -42 -101 102 -117 -328 -40 -390
$$ packed form
1186b88r30M03O34j19L04k12j35J85O9l3O70l60m23L41J78L51L26j114j31N07
1206B23J82j36k89o26K90N20L6m58j79K32J61l4l5L59n32j99O44k98O48k42m34
1227a67K15M42j38Q8l24m47O06J39l79j13k95j81N70l49n2L74m00M6J53j11L80
1248E7ln99M77J39M6N73k67k33M94k40l11K64m98N24j28r16J59M72l45J46q9o42
1270i20L14J23l0J51r1l66N36p3L69N83o49k06L85K29J35N58q14K03O5L1L22m83
1292C72l46j26j47P7M40n72R5n0l37j7N35m82k17M77m54M90L00l95O55q5k48L83
1314C48J0k81L26N6l13M31j56p1K93l23k19l8j01J66k6j25k19j39r5K63J40k62
1336c35o5j9K07r5J59K04k47k35M80Nk59L99k51k43M52j99n9K03k19k11K88l50
$$ plain form
1358 -390 -476 -4 9 -97 111 -318 3 344 -79 393 487 209 438 272 463 884 101 354 87 392 437
1379 437 483 40 -15 159 91 44 77 -300 -337 -215 -419 301 -120 -335 -170 -370 -126 298 -76 -500 -62 -62 -91
1402 -91 328 -140 201 -251 -435 -419 -139 -221 177 -311 -868 28 -199 -118 -122 -522 -314 -142 -172 -357 136 -77
1424 -77 -94 -100 -169 266 416 255 521 387 453 745 466 412 615 526 429 748 449 42 169 277 84 163 -51
1447 -51 101 -208 -422 -296 -162 -38 -156 -343 -83 6 -274 -222 212 -300 -110 -374 -200 -44 -132 -414 -509 -722
1469 -722 -407 -226 -723 -779 -590 -588 -291 -482 -627 -109 -215 -327 119 6 340 599 224 349 844 895 846 894
1491 894 589 581 987 257 336 525 19 314 77 -499 122 -222 -268 16 23 68 -77 -496 -240 370 55 -110
1513 -110 -40 -105 173 488 205 -124 -171 -146 96 -156 -67 -268 -411 -779 -270 -240 -552 -277 -934 -284 -159 -236
$$ packed form
1358c90q6M72J3j06K08m29L21L41m23M72R4k78K29j66J91M21p83K53k67L05M5
1379D37M6m43n5J74o8m7L3l77l7J22k04P20m21k15J65k00K44M24l74m24M38%k9
1402i1M19m68L41m52j84J6K80q2L98m88n57Q96k27Q1mm00K08J72l0j85M93k13
1424g7j7oo9M35J50j61K66j34O6K92k79n4K03q9r7L19k99m07J27J08j93P9k14
1447e1J52l09k14J26J34J24j18j87K60Q9k80N2M34n12J90k64J74J56q8k82r5k13
1469g22L15J81m97n6J89KK97j91j45N18j06j12M46j13L34K59l75J25M95N1m9M8
1491H94l05qM06p30P9J89n06K95k37n76O21l44m6K84PM5j45m19K56O10l15j65
1513a10P0o5K78L15k83l29m7K5K42k52Q9k01j43l68N09L0l12K75o57O50J25p7
$$ plain form
1535 -236 -277 -36 -360 -66 44 268 188 198 -29 41 169 311 574 241 366 42 12 129 380 220 221 0
1557 0 207 362 311 259 550 113 173 276 413 569 430 -44 138 -29 45 272 -58 -175 -430 -48 -175 141
1579 141 -180 -456 -279 -425 -403 -384 -424 -722 -353 -287 -291 -252 -313 -128 -219 -261 92 29 -239 17 -111 -155 235 159
1603 159 397 219 87 479 188 256 399 378 127 189 130 38 362 302 -202 26 -120 -80 177 157 6 44 -7
1626 -7 -52 254 17 328 340 -146 195 587 337 -167 76 -258 6 85 -335 119 -218 -432 -275 -546 -388 -243
1648 -243 -439 -344 -306 -595 -360 -10 -121 -78 -300 136 365 102 50 214 63 -114 44 261 292 426 -249 -19
1670 -19 -217 -89 161 -34 -314 -309 67 54 265 10 -175 294 127 592 382 242 263 203 152 535 119 57 135
1693 135 39 -27 115 64 -141 -187 -405 -163 -83 -354 -251 -207 -478 -409 -256 -291 -114 -218 -193 129 -214 -107 237
$$ packed form
1535b36m1K41l24K94J10K24q0J0k27P0J28J42K63l33J25l24l0J17K51j60Jk21
1557@K07J55n1n2K91m37O0J03J37J56j39m74J82j67P4K27l30j17k55L82j27L16
1579A41l21k76J77j46K2J9m0k98L69O6mL9o1J85r1m2L53o3k68K56j28m4L90p6
1603A59K38j78j32L92k91O8J43k1k51O2n9r2L24o0n04K28j46M0K57k0j51L8n1
1626gm5L06k37L11J2m86L41L92k50n04K43l34K64P9m20M54l37k14J57k71J58J45
1648b43j96R5L8k89K35L50j11M3k22M36K29k63n2J64j51j77J58K17L1J34o75K30
1670a9j98J28K50j95k80NL76j3K11k55j85M69j67M65k10j40K1o0n1L83m16o2P8
1693A35r6o6J42n1k05m6k18K42Q0k71J03M4k71O9J53l5J77j04K5L22l43J07L44
$$ plain form
1716 237 42 -15 233 235 140 543 276 237 446 133 -53 366 21 358 -100 43 -154 59 -136 -53 -267 -285
1738 -285 86 -121 -152 159 -71 21 -21 110 22 108 122 240 183 7 229 -21 -19 385 103 -283 -15 12 -235
1761 -235 129 -321 137 163 134 152 35 -208 59 328 -86 92 277 72 156 -3 40 5 -14 -217 105 -200
1783 -200 12 -236 31 5 -270 -113 -49 -62 -128 83 -47 46 -29 -140 -34 236 46 349 166 -11 326 92
1805 92 -224 56 -59 -64 66 39 -199 -78 -211 -238 56 -210 -2 -390 -379 69 -108 -139 -70 92 -402 41 56
1828 56 -73 298 292 -318 191 11 30 86 99 153 12 -37 -159 199 -160 27 -49 25 254 61 160 -44 3 -58
1852 -58 -38 351 100 31 81 -110 184 165 -27 15 -51 98 99 -63 -3 -43 -314 -396 -244 -226 -222 -395 -300 -113 -150 -219
1878 -219 -133 17 48 298 80 349 183 226 49 110 229 414 326 33 156 -113 -7 114 114 121 163 -119 -98 -203
$$ packed form
1716B37j95n7K48Kr5M03k67l9K09l13j86M19l45L37m58J43j97K13j95Q3k14j8
1738b85L71k07l1L11k30R2m2J31q8Q6J4J18n7j76K22k50KM04k82l86K68K7k47
1761b35L64m50M58K6k9J8j17k43K67K69m14J78J85k05Q4j59M3l5j9k03L22l05
1783b00K12k48K67k6k75J57O4j3o6K11j30R3p5j11J06K70j90L03j83j77L37k34
1805I2l16K80j15nJ30k7k38J21j33k7K94k66K08l88J1M48j77l1O9J62m94M43J5
1828E6j29L71oo10N09j80J9N6J3N4j41m9j22L58l59J87p6P4K29j93R9k04M7o1
1852e8K0L89k51o9N0j91K94j9j92M2o6J49Jj62O0m0k71q2J52J8Mj73R5J87l7o9
1878b19Q6J50L1K50k18K69j66M3j77O1J19J85q8k93J23k69J06J21%PM2k82K1j05
$$ plain form
1902 -203 -242 -60 -145 -170 -19 -50 -114 337 -65 -96 146 35 129 62 -36 330 -82 -245 367 -29 -189 -60 -217
1925 -217 -105 -6 196 -5 -92 -95 -51 170 -83 38 126 -197 20 2 -4 -40 226 80 -119 236 -141 51 -139
1948 -139 63 148 -58 -44 167 -267 166 -92 -21 140 73 301 -62 194 -132 46 -15 -78 -196 -93 -294 123
1970 123 -90 -282 228 -487 -65 -111 -68 41 -140 -82 -63 87 16 36 -172 131 49 66 109 12 30 1 -199 -208 76
1995 76 -7 136 87 179 231 110 97 370 382 278 182 366 7 387 282 44 -24 -38 39 -50 -149 -80 -336 -339 -200
2020 -200 -35 -208 -324 -5 -84 4 220 224 89 149 -153 215 411 52 233 112 320 152 184 -16 191 19
2042 19 6 -14 -191 -138 -414 -180 -246 -321 -144 16 113 -169 11 30 96 247 36 67 226 252 25 -170 60 156
2066 156 -75 -12 -37 -13 -179 3 23 -222 -312 -89 -7 -6 -241 -51 -244 -76 -113 16 169 130 269 85 -87
$$ packed form
1902b03l9J82q5k5J51l1o4M51m02l1K42j11R4o7r8L66m12j63O12l96j60J29j57
1925b17J12R9K02k01q7lM4K21k53J21Q8l23K17j8ol6K66j46j99L55l77J92j90
1948a39K02Q5k06J4K11m34M33k58P1J61o7K28l63K56l26J78o1o3j18J03k01M17
1970A23k13j92N10p15M22m6M3J09j81N8J9J50p1K0k08L03q2J7M3r7J8k9k00rK84
1995G6q3J43m9R2N2j21j3K73J2j04r6J84l59L80j05k38o8j4P7q9r9O9k56lJ39
2020b00J65j73j16L19p9Q8K16Mj35O0l02L68J96l59J81j21K08j68L2k00K07j72
2042A9j3k0j77N3k76K34o6p5J77J60R7k82J80J9O6J51k11L1J59K6k27j95K30R6
2066A56k31O3k5K4j66J82K0k45r0K23Q2Jk35J90j93J68l7J29J53l9J39j84j72
$$ plain form
2089 -87 230 30 100 -61 -135 57 33 144 -77 -100 -143 -325 -68 -112 70 -111 -91 -108 186 -135 -151 290 93
2112 93 18 -29 9 146 -76 -89 192 -205 249 95 -62 27 -282 98 -154 160 -37 65 -157 -91 -51 234 -85
2135 -85 -146 69 116 -99 24 48 -102 26 -52 -340 -81 -131 -343 140 63 -266 9 -89 -28 175 -61 -45 -277
2158 -277 24 85 60 -244 -19 219 -172 252 258 -193 0 65 9 24 266 59 23 -27 77 -34 211 -197 41
2181 41 -109 -243 -32 -139 34 -217 4 -54 40 100 -53 -151 -82 110 48 -63 242 107 50 -151 40 115 300
2204 300 -54 310 -61 134 -95 28 -119 -97 -82 -141 42 -115 124 -202 -132 -34 109 248 -118 32 25 266
2226 266 -35 12 -74 95 23 -1 -193 63 203 181 203 171 9 85 -328 176 124 -144 73 -309 10 108 -90
2249 -90 -109 -126 -120 258 16 73 -139 -160 343 10 127 105 331 22 -97 55 181 257 50 151 213 16 47 53
$$ packed form
2089h7L17k00P0j61p4J92k4J11k21k3m3j82K57m4J82j81K0j7K94l21j6M41j97
2112I3p5m7L8J37k22j3K81l97M54j54j57Q9l09L80k52L14j97J02k22O6M0K85l19
2135h5o1K15M7k15J23K4j50J28p8k88K59n0k12M83p7l29K75r8O1K03k36J6k32
2158b77L01O1k5l04K25K38l91M24Om51J93O5n6J5K42k07l6n0J04j11K45m08K38
2181D1j50j34K11j07J73k51K21n8R4O0j53r8O9J92o2j11L05j35n7k01J91P5J85
2204C00l54L64l71J95k29J23j47K2J5n9J83j57K39l26P0R8J43J39l66J50pK41
2226B66l01M7q6J69p2k4j92K56J40k2K2l2j62P6m13N04n2k68K17l82L19R8j98
2249i0j9j7OL78k42N7k12k1N03l33J17k2K26l09j19J52J26P6k07J01O2j97L1O
$$ plain form
2273 53 -8 62 -110 -134 -103 -120 138 -68 -132 -62 -21 7 212 13 433 221 14 216 318 264 -95 222 161 119
2297 119 86 131 -146 -53 -304 -223 -266 -205 -155 49 -179 -285 86 51 -57 -107 107 61 180 -142 39 380 271
2320 271 136 50 335 145 35 166 102 164 235 -95 -19 -93 16 170 121 -160 42 141 -251 103 4 -231 -105
2343 -105 60 85 0 348 201 -4 -129 -106 133 73 5 88 -97 258 -283 -98 38 -363 -36 -74 36 64 -64
2366 -64 60 -16 212 -111 16 52 93 310 -20 19 169 174 104 132 415 -106 -216 -31 15 65 -136 -280 -166 -319
2390 -319 144 -170 158 208 30 -84 -42 148 162 -22 30 -74 334 48 -107 167 171 202 42 240 58 282
2412 282 -126 -224 65 -97 -211 -99 -63 -264 150 -342 -249 -77 -109 58 -85 -165 47 139 41 -152 136 142 105
2435 105 27 -206 -126 103 -208 -126 -171 61 -331 -20 -18 224 -4 -28 31 126 189 23 166 -54 191 -180 40
$$ packed form
2273E3o1P0j72k4L1j7K58k06o4P0M1K8K05j99M20k12k07K02J02n4l59L17o1m2
2297A19l3M5k77R3k51Q1m3O1N0K04k28j06L71l5j08n0K14m6J19l22J81L41j09
2320B71j35q6K85j90j10J31o4O2P1l30P6p4J09J54m9k81K02R9l92L54r9k35J26
2343a05J65K5q5L48j47k05j25K3K39o0o8Q3j85L55n41J85J36m01L27l8J10K8j28
2366f4J24p6K28l23J27L6M1K17l30L9J50Np0K8K83n21j10J85M6N0k01j44J14j53
2390c19M63l14L28N0j78j14M2J90J4j84N2j04M08k86j55K74ML1j60J98j82K24
2412B82m08r8K89j62j14J12L6k01M14m92R3J72l2J67j43q0K12R2r8j93K88Ol7
2435A05p8k33Q0K29l11Q2m5K32l92L11KK42k28k4N9R5O3j66J43k20K45l71K20
$$ plain form
2458 40 162 330 197 -202 84 274 17 198 -48 -14 -11 53 -232 59 -3 -144 -233 -20 109 -236 -180 -318 -321
2481 -321 -117 -65 -58 -307 -64 -72 -61 10 -128 229 105 227 -136 267 -12 327 181 -10 234 130 156 119 96
2504 96 -53 -47 -320 101 474 -17 117 -85 32 81 164 264 51 -9 -87 120 4 -20 -36 190 54 127 -66
2527 -66 100 47 249 295 -92 -21 -137 -30 -331 -263 68 -77 53 -179 217 -71 40 -183 216 69 45 8
2549 8 -4 101 127 183 198 303 -396 -192 -171 -158 -150 -202 -87 73 1 -73 118 -115 -12 30 163 207 39 -85 90
2574 90 118 6 155 9 126 -99 -161 -91 37 -77 -155 -56 58 96 -23 99 114 171 -278 18 19 -137 211 -163
2598 -163 -156 -128 88 -100 108 163 -72 -120 -79 228 17 -227 63 -253 16 -48 91 -139 -86 68 -262 -17 -273
2621 -273 155 -8 -224 -79 -22 -183 56 -10 23 218 198 116 30 109 -56 124 55 35 297 -26 -86 -134 -148 55
$$ packed form
2458D0J22J68j33l99K86J90k57J81k46L4LO4k85K91o2j41q9K13J29l45N6j38l
2481c21K04N2Pk49K43qJ1P1j38L57j24J22l63M03k79L39j46j91K44j04K6l7k3
2504I6j49Ok73M21L73m91J34k02J17M9Q3J00k13o0p8K07j16k4j6K26j36P3j93
2527f6J66n3K02M6l87P1j16J07l01O8L31j45J30k32L96k88J11k23L99j47k4l7
2549Hj2J05K6N6J5J05o99K04K1J3Qn2J15J60p2p4J91k33J03M2J33M4j68j24J75
2574I0K8j12J49j46J17k25o2P0J28j14p8R9J14L8j19J22J5N7m49K96Jj56L48l74
2598a63PK8K16j88K08N5k35m8M1L07k11k44K90l16K69o4J39k30N3J54l30K45k56
2621b73M28j63k16J45N7j61K39o6L3J95k0q2q6P9j65J80o9k0K62l23o0m8j4K03
$$ plain form
2645 55 -299 -118 14 -169 -339 125 53 99 129 43 -88 226 8 160 -79 -28 227 95 197 78 -71 -129
2667 -129 -38 -56 -168 11 -5 23 -112 -278 68 369 -243 42 -123 -300 -39 45 -56 -114 -39 -46 -165 72 110
2690 110 240 9 319 88 24 -28 87 -76 155 196 89 43 -4 38 39 -193 -107 -135 -147 -39 247 148 43 -44
2714 -44 -66 61 95 -208 137 -122 65 131 -58 77 8 -162 -35 18 -96 111 -151 11 41 56 -178 143 -90
2737 -90 260 -206 38 79 -240 -158 -270 39 129 0 203 -41 68 -128 -50 95 -75 162 22 216 -63 -51
2759 -51 -91 70 10 -5 178 -77 -111 157 -163 2 -76 37 -300 55 -48 -203 -255 -12 122 68 -55 -71 -152
2782 -152 -119 26 38 -17 -137 44 139 -17 -4 -56 -192 150 -303 26 166 -99 4 -141 -178 -127 -118 83 30 57
2806 57 83 -120 -29 155 70 -4 -1 -45 185 46 62 16 -62 -335 -125 -294 104 -113 -222 -53 105 3 -5 -58 -62
$$ packed form
2645E5l54J81J32j83j70M64p2M6L0q6j31L14k18J52k39N1K55j32J02j19j49n8
2667a29R1j8j12J79j6K8j35j66L46L01o12K85j65j77K61Q4j01n8P5pj19K37L8
2690A10J30k31L10k31o4n2J15j63K31M1j07m6m7M2Jk32Q6k8j2J08K86r9j05q7
2714d4k2J27L4l03L45k59J87O6j89J35o9j70J27N3j14K07k62J62L0J5k34L21k33
2737i0L50m66K44M1l19Q2j12L09R0j29K03k44J09j96P8J45j70K37j40J94k79J2
2759e1m0J61o0j5J83k55l4K68l20J65p8J13l37L55j03j55n2K43J34n4j23j6q1
2782a52L3J45J2n5j20J81R5j56J3n2j36L42m53L29J40k65J03j45l7N1RK01n3K7
2806E7K6k03R1J84q5p4Lm4K30j39J6m6p8k73K10j69L98k17j09J69J58j02qn3m
$$ plain form
2831 -62 -220 -86 110 95 33 204 -7 178 168 -28 73 188 160 -104 -238 -179 -30 -113 -186 180 -44 41 223
2854 223 -5 150 -83 -52 57 48 223 122 126 118 20 -133 292 55 -319 -49 -61 31 -58 12 239 -112 -45 -137 -150
2879 -150 -77 0 24 106 -3 -30 7 99 14 -139 170 -141 143 85 28 225 148 -32 114 12 77 91 191 -35
2903 -35 225 -174 191 129 -148 -190 -223 -11 104 -27 -76 -325 -74 -27 -265 226 89 -262 132 125 -64 23 96
2926 96 39 -29 153 -64 -90 22 168 -21 178 -10 -54 19 28 45 28 -1 -38 -190 274 -61 -292 -60 -101 217
2950 217 -79 -22 136 175 124 -67 69 83 146 27 225 90 -251 40 -101 25 -55 144 157 90 -52 -238 -135
2973 -135 202 -57 31 111 -187 67 -29 -280 -183 -169 -166 -88 -68 -28 -89 20 -17 -51 -183 -163 -27 -48 20 -138 16
2998 16 -115 -133 -55 -6 -118 142 214 13 -1 147 -146 127 -234 9 -19 24 -69 -180 -76 3 -14 -139 -79 41
$$ packed form
2831f2j58J34J96j5o2J71k11J85j0j96J01J15k8k64j34N9J49q3p3L66k24Q5J82
2854B23k28J55k33L1J09rJ75j01Mqr8j53M25k37l74K70j2R2q9P0K27l51O7r2j3
2879a50P3P7K4Q2j09k7L7R2q5j53L09l11K84n8n7J97p7j80J46j02O5J4J00k26
2903c5K60l99L65o2k77m2l3K12J15j31m9k49K51M7k38M91j37l51L94pj89Q7P3
2926I6n7o8J82k17k6J12J46j89J99j88m4P3RJ7j7k9l7j52M64l35k31K32m1L18
2950B17k96N7J58L9n1j91J36J4O3j19J98j35l41K91j41J26q0J99J3o7j42j86J03
2973a35L37k59Q8Q0k98K54r6k51R7J4LP8K0M0o1J09l7l4j32K0J36k1O8j58J54
2998A6j31j8P8M9j12K60P2k01j4J48k93K73l61K43k8M3r3j11J04P9j7j25O0J20
$$ plain form
3022 41 -237 -309 66 -190 193 83 -201 30 -30 -96 1 -184 222 50 60 148 -100 -234 -19 86 60 -108 -16
3045 -16 -169 5 17 -215 -26 -190 -101 38 -217 -91 -130 -50 12 150 -74 -113 5 37 62 178 142 266 87
3068 87 7 -4 50 -54 -76 -142 -69 111 -92 136 143 50 -28 92 123 139 131 206 117 -23 26 165 164 -21 29 -96 151
3095 151 -235 -339 -69 445 -204 139 55 -56 -20 -99 -49 28 -6 -251 79 136 -8 -184 -179 -35 77 -77 121
3118 121 -64 99 147 -34 -191 50 -37 78 -112 82 170 160 -73 12 -228 -55 124 -129 -65 -18 -38 21 -48
3141 -48 -28 83 -361 3 -132 85 2 -120 47 134 182 247 -88 8 17 20 295 100 71 95 -132 -184 -77 115 -393
3166 -393 146 -68 -201 -319 144 160 284 93 135 -26 -147 42 -102 -64 54 -123 335 123 62 104 -127 -193
3188 -193 -17 -87 -70 -109 130 -109 -112 82 143 126 -196 159 152 -285 -65 -17 40 122 -98 38 -153 4 43 141 384
$$ packed form
3022D1k78p2L75k56L83j10k84K31o0o6R7j85M06j72J0Q8k48j34K15J05k6j68R2
3045a6j53J74J2k32J89j64Q9J39k55J26l9Q0O2J38k24l9J18L2K5J16l6J24j79
3068H7q0j1N4j04k2o6P3J80k03K28Pr3p8J20L1J6qP5q9j40M9J39jj85N0j25K47
3095A51l86j04K70N14o49L43q4j11L6p9N0P7l4k45L30N7j44j76NJ44J12j54J98
3118A21j85J63M8j81j57K41q7J15j90J94Q8j0k33Q5k40J73J79k53O4M7k0N9o9
3141d8K0J11m44L64j35K17q3j22J67Q7M8O5l35R6RLK75j95k9K4k27n2J07J92n08
3166c93N39k14j33j18M63J6J24j91M2j61j21J89j44L8J18j77M58k12o1M2k31o6
3188a93J76p0J7l9K39k39lJ94O1j7l22L55pm37K20M8N7Q2k20J36j91J57L9R8K43
$$ plain form
3213 384 26 391 195 6 -200 -51 -69 -105 222 -7 23 -55 232 -18 -10 -62 226 100 238 -75 27 37 24
3236 24 105 79 33 145 -2 -90 -315 96 -253 -13 88 -129 -80 155 -91 125 232 -225 -109 60 -45 -126
3258 -126 170 -21 -235 -48 51 259 136 198 -240 -258 -131 51 79 -28 206 -96 -16 -59 -7 152 7 -156
3280 -156 -180 -232 147 71 -239 -64 -139 -170 186 -404 -89 -189 18 8 -185 358 204 45 -288 -88 -47 -121 218
3303 218 25 60 74 125 -80 63 -98 -19 -213 -105 -60 -27 170 -84 -59 -348 -97 -139 265 -12 -280 36 -225
3326 -225 167 -16 -61 -61 -63 320 13 180 175 93 -269 -234 -41 118 -74 10 119 -20 -13 -35 29 -266 -64 94 4
3351 4 -247 175 -99 4 -82 -254 16 1 154 -101 -49 -50 24 23 258 217 -295 -308 85 4 104 301 -36 -122 -72
3376 -72 -56 115 312 -7 -17 -148 98 -105 239 -223 -298 -213 -1 47 48 76 85 -303 -22 -35 74 -2 67 79 -242
$$ packed form
3213C84l58L65j96j89k06J49j8l6L27k29L0p8K87k50Qn2K88j26J38l13J02J0j3
3236B4Q1k6m6J12j47q8k25M11l49K40J01k17M9K35k46K16J07m57J16J69j05q1
3258a26K96j91k14J87R9K08j23O2m38j8J27J82K8j07K34l02Q0m3N2J59j45j63
3280a56k4n2L79p6l10J75p5l1L56n90L15j00K07j0j93N43j54j59l33K00M1p4L39
3303B18j93L5J4N1k05J43j61P9j94J08M5L3J97k54K5k89K51m2M04k77k68L16k61
3326b25L92j83m5%kL83l07J67nq2l62L5J93J59j92Q4J09j39Pk2O4k95K02J58r0
3351Dk51M22k74J03q6j72K70j5J53k55N2jP4jK35m1n12j3L93q1J00J97l37q6N0
3376g2J6J71J97l19j0j31K46k03L44m62p5Q5K12M8JK8Rl88K81j3J09p6O9J2l21
$$ plain form
3401 -242 199 -318 242 -38 -153 -11 -64 -175 110 -10 -53 12 11 -36 -102 141 -61 84 -289 -79 -50 46 27
3424 27 7 29 -363 58 -215 -192 39 218 -167 46 -87 62 -195 -162 -147 -109 -35 -235 -21 192 57 -205 -2
3447 -2 -35 -48 -183 81 -11 71 92 21 -280 -20 101 -46 152 118 64 -83 -236 -33 -23 -74 58 -244 -160 -55
3471 -55 -65 -121 -219 -7 145 -153 181 -39 -22 -212 55 47 -134 -23 -4 170 -41 -220 132 224 11 226 -263
3494 -263 -118 -159 -51 93 268 -56 193 -113 114 -108 34 57 -9 -57 72 -159 122 61 -179 37 50 131
3516 131 215 -26 -66 -70 67 -56 58 -66 131 -23 -113 -387 -17 66 -288 -120 -24 -98 -48 0 -57 -71 -113 -143 189
3541 189 99 -185 7 -184 -109 181 -90 -99 47 52 -53 157 -182 108 -141 39 146 233 -99 -32 73 106 -269
3564 -269 41 27 -118 -187 -40 94 5 132 -162 40 -144 -127 -33 -88 -83 -407 -149 -201 162 -76 138 188 -104
$$ packed form
3401b42M41n17N60k80j15J42n3j11K85j20m3O5jm7o6K43k02J45l73K10K9R6j9
3424B7k0K2l92M21k73K3K31J79l85K13j33J49k57L3J5L8P4k00K14K13j35k62K03
3447bl3j3j35K64r2Q2K1p1l01K60J21j47J98l4n4j47j53K03J0n1J32l02Q4J05
3471e5j0n6r8K12J52k98L34k20J7j90K67qj81J11J9J74k11j79L52R2k13K15m89
3494b63J45m1J08J44J75l24K49l06K27k22J42K3o6m8J29k31K81o1k40K16J3Q1
3516A31Q4k41m0mJ37j23J14j24J97j54r0k74L70Q3l54J68R6p4N0M8n7j4m2l0L32
3541A89r0k84J92j91P5K90k71rJ46Nj05K10l39K90k49J80J07Q7l32O7J05L3l75
3564b69L10j4j45o9J47J34q9J27k94K02j84J7R4n5Nl24K58n2L63k38K14N0k92
$$ plain form
3587 -104 -39 25 83 -60 95 -17 26 -153 -136 -40 52 77 -56 72 -30 -137 128 -113 279 129 -183 -24 -24
3610 -24 52 146 -133 59 111 71 39 -66 -80 116 23 90 -92 -116 21 13 -64 267 22 -38 -111 -22 78 24 -11 93
3636 93 -28 -199 77 -40 -189 -301 26 2 123 22 37 222 -98 207 -52 -128 -31 -89 -71 -74 -290 169 -207
3659 -207 128 228 -242 14 -136 -36 99 -63 12 38 279 -134 -86 -126 64 182 -65 -97 -126 -138 -63 208 -61
3682 -61 -88 -92 -283 167 -122 -22 -94 -54 216 -383 -54 172 284 110 63 218 59 190 -43 -135 166 -70 -36
3705 -36 297 -42 17 62 416 169 4 -57 147 -93 -2 -94 -17 -152 16 -7 -188 -2 -222 -116 -8 196 -19
3728 -19 168 -31 68 -15 116 240 -194 -146 -119 -93 -128 143 -40 -61 -85 -108 14 0 60 -48 -36 99 -132 -31
3752 -31 -174 104 -70 55 -24 -82 123 -104 26 295 115 -220 -37 197 -40 -222 -82 15 -96 -166 45 169
$$ packed form
3587a04O5O4N8j43J55j12M3j79J7R6R2K5j33J28j02j07K65k41L92j50l12J59%
3610b4P6R4k79J92N2m0l2j05j4J96r3O7j82k4J37qp7L31k45o0p3Q9J00n4l5J04
3636I3j21j71K76j17j49j12L27k4J21j01J5J85l20L05k59p6R7n8J8lk16M59l76
3659b07L35J00m70K56j50J00J35j62P5K6K41m13M8m0J90J18k47l2k9j2P5K71k69
3682f1k7mj91M50k89J00p2M0K70n99L29K26J12j74m7J55j59J31k33r2L01k36L4
3705c6L33l39N9M5L54k47j65o1K04k40R1r2P7j35J68k3j81J86k20J06J08K04k15
3728a9J87j99R9q3J31J24m34M8K7K6l5K71j83k1k4k3J22j4O0j08J2J35k31J01
3752c1j43K78j74J25p9n8K05k27J30K69j80l35J83K34k37j82J40R7j11p0K11J24
$$ plain form
3774 169 -102 23 26 31 -13 -53 78 77 52 -78 1 238 -34 -329 122 -43 263 87 -151 -64 65 -42 6 -310
3798 -310 -254 -58 117 -102 -111 -122 -173 44 -36 -101 169 304 -35 -45 21 -30 114 73 117 -218 -182 119 58 3 20
3823 20 -188 71 43 -144 171 -117 -175 27 -63 -88 106 35 86 -118 311 -253 -48 59 -113 269 51 -5 -74
3846 -74 -149 -44 123 -45 -75 -53 122 -22 109 -23 -142 221 159 11 187 -86 -1 135 151 116 -120 80 229
3869 229 -220 4 47 73 114 -168 19 48 -45 -248 -276 -265 -47 8 -122 -100 -84 127 77 33 260 -16 195 -22
3893 -22 -169 -78 -15 -130 106 -39 -86 92 247 216 158 -247 -56 25 12 -103 -10 46 -171 238 62 -72 188
3916 188 -87 33 109 47 91 86 237 187 -188 99 178 -13 -89 -105 23 -56 -108 214 31 40 224 -45 -115 -102 -92
3941 -92 -138 102 -132 180 15 39 42 -2 79 173 -46 -183 91 -188 146 -178 230 71 -66 17 -63 39 -159
$$ packed form
3774A69k71J25LNm4m0J31jk5j30P9K37k72k95M51j65L06j76k38Q7J29j07M8l16
3798c10N6J96J75k19rj1n1K17q0o5K70J35l39j0O6n1J44m1M4l35L6L01o1n5J7
3823B0k08K59k8j87L15k88n8K02r0k5J94p1N1k04M29n64K05J07j72L82k18n6o9
3846g4p5J05J67j68l0K2J75j44J31j32j19L63o2j48J76k73Q5J36J6l5k36K00J49
3869B29m49K24M3K6M1k82J87K9r3k03k8J1K18N5j30K2J6K11n0m4K27k76K11k17
3893b2j47R1O3j15K36j45m7J78J55l1n8m05J91Q1j3j15R3N6k17M09j76j34K60
3916A88k75J20P6o2M4nJ51n0l75K87P9j91p6j6J28p9n2L22j83RJ84k69p0J3J0
3941i2m6K40k34L12j65K4Lm4Q1R4k19j37K74k79L34l24M08j59j37Q3q0J02j98
$$ plain form
3964 -159 95 -12 83 -57 251 -163 -81 -123 61 238 -79 -34 59 -182 56 -124 -61 119 -42 -22 203 -33
3986 -33 -81 141 119 -116 59 -67 -62 133 -7 54 35 126 -50 -189 -138 9 18 110 -289 27 115 31 159 -123 -147
4011 -147 29 60 110 227 -112 -64 -134 -61 75 -258 12 -181 -75 110 94 159 161 -2 -45 -39 -73 148 53 -101 -171
4036 -171 80 -51 -261 16 -103 137 45 187 -70 -107 101 76 -23 -63 -121 27 220 -141 3 -3 213 -54 -92
4059 -92 106 -145 -59 -41 -20 163 -78 -74 152 81 110 67 -107 -77 107 313 42 -100 -57 202 56 -181 -4 -38
4083 -38 -164 30 -92 -111 234 168 -17 -48 -57 -104 268 234 -117 -17 159 134 59 -5 216 182 -45 -124 221 73
4107 73 238 135 161 54 -23 -158 -105 -2 -97 -70 -235 369 -164 171 -225 -193 -136 -11 -15 -58 -14 97 -203 -35
4131 -35 -196 -56 -257 4 153 -200 57 -53 -30 -46 66 5 136 -236 35 -58 50 106 -146 152 201 -101
$$ packed form
3964a59K54j07R5j40L08m14Q2m2J84J77l17M5R3k41K38j80O3J80j61K0K25k36
3986c3m8K22k2k35J75j26NJ95j40O1j9R1j76j39N1J47RR2l99L16Q8q4J28k82k4
4011a47J76L1N0J17l39M8p0P3J36l33K70j93J06J85j6O5Kj63m3Ol4K21r5j54p0
4036a71K51j31k10K77j19K40r2J42k57l7K08k5r9m0n8J48J93l61J44oK16k67l8
4059i2J98k51Q6J8K1J83k41MK26p1K9m3j74L0J84K06k71j42M3K59j46k37J77l4
4083c8j26J94j22j9L45o6j85l1rm7L72l4l51J00J76k5p5o4K21l4k27p9L45j48
4107G3J65j03K6j07p7j35N3J03r5K7j65O04n33L35l96L2N7J25mm3M4J11l00J68
4131c5j61J40k01K61J49l53K57j10K3j6J12o1J31l72K71r3J08N6k52K98M9l02
$$ plain form
4153 -101 122 -95 -40 59 2 11 188 -58 7 -50 19 57 164 9 -159 -33 197 -185 -118 15 184 164 -109 106
4177 106 24 40 124 82 50 -82 246 -222 113 136 -122 89 -104 61 14 125 27 54 -16 -98 -15 -6 -153 -103 -52
4202 -52 -106 81 139 42 -210 -60 -134 117 29 -168 -155 -176 -40 206 -75 -107 9 -141 53 309 121 35 -20 -283
4226 -283 272 94 82 -178 -116 -147 190 -26 319 -20 -95 99 140 -56 14 21 -231 112 22 102 -262 -265 -129 36
4250 36 213 -145 183 19 50 85 -27 -48 -92 201 -149 23 -16 -39 -126 -129 -100 99 140 94 -114 176 244 -95 -115
4275 -115 -1 -71 14 -62 -106 297 -102 -121 -75 114 -14 -13 108 226 150 -68 -221 30 199 155 -270 -296 -140 104
4299 104 60 -106 41 112 -27 -26 144 -49 14 35 -127 -142 -79 -62 94 -111 -87 191 -140 -32 34 -70 238 51
4323 51 -84 -19 -73 148 -97 145 -42 17 87 -136 211 88 -149 -31 81 -50 76 -252 -144 -97 131 72
$$ packed form
4153a01K23k17N5R9n7RJ77k46O5n7O9L8J07j55j68J26K30l82O7J33J69k0k73K15
4177A06q2J6Q4m2l2j32L28m68L35K3k58K11j93J65m7J11r8K7p0q2Q3Rj47N0N1
4202e2n4J87N8r7k52J50p4K51q8j97J3k1J36K46k81l2J16j50J94K56j88q6n5k63
4226b83N55j78j2k60O2l1L37k16L45l39p5J94M1j96P0Pk52L43r0Q0l64lJ36J65
4250C6J77l58L28j64L1L5j12k1m4K93l50J72l9k3q7lK9J99M1m6k08K90O8l39k0
4275a15J14p0Q5p6m4M03l99j9M6J89j28JJ21J18p6k18j53K51J69m4m25k6J56K44
4299A04m4j66J47P1j39JJ70j93O3K1j62j5O3J7J56k05K4K78l31J08O6j04L08j87
4323E1j35O5n4K21k45K42j87N9P0k23L47j23k37J18J12j31J26l28J08M7K28n9
$$ plain form
4345 72 -106 32 144 235 -213 -24 241 117 62 -154 121 86 115 -18 -66 128 -57 -2 -3 289 92 -199 -24
4368 -24 59 -14 -26 -162 2 76 112 200 -1 -105 43 -99 -37 -122 -34 -133 123 28 -46 70 -128 64 -63 43
4392 43 -64 -244 46 -27 -70 -179 67 178 -266 -145 80 77 56 43 20 -90 -58 -95 -49 95 -43 98 -18 -78
4416 -78 -180 54 38 -146 -39 3 -36 41 29 14 -257 -60 55 89 16 -135 -287 255 62 26 -49 52 -52 -36
4440 -36 -62 5 -53 -76 -136 318 160 329 -12 -35 92 3 54 72 5 137 -98 111 -119 -75 60 -130 251 -87
4464 -87 -115 -62 119 99 44 -74 245 24 -25 418 103 135 15 140 61 135 -59 114 69 73 -47 38 -71 64
4488 64 21 360 -65 115 -184 -274 -12 144 58 -85 150 148 -26 -139 -387 -19 -195 -100 115 7 111 -23
4510 -23 137 -110 67 25 -35 -135 -36 -50 -271 -67 187 59 113 -51 94 245 100 -22 -89 -98 -236 -115 -121 -68
$$ packed form
4345G2j78J38J12R1m48J89K65j24n5k16K75l5K9j33m8J94j85N5jK92j97k91J75
4368b4Q3p3j2j36J64P4L6Q8k01j04J48j42O2q5Q8r9K56r5p4J16j98J92j27J06
4392D3j07j80K90p3m3j09K46J11m44J21K25lk1j3k3j10L2l7M6J44j38J41j16o0
4416g8j02K34j6j84J07M2l9P7j2j5k71J97J15L4p3j51j52N42j93l6p5J01j04J6
4440c6k6O7n8k3o0M54j58J69l41k3J27q9N1J8o7J32k35K09k30M4J35j90L81l38
4464h7k8N3J81k0n5j18L19k21m9M43l15L2j20J25p9P4j94J73m5Mj20Q5j09J35
4488F4m3L39m25J80k99r0K62J56q6j43K35kj74j13k48L68j76R5K15j08J04j34
4510b3J60k47J77m2o0j00R9j4k21K04K54j28N4j64J45J51j45j22o7rj38J21oN3
$$ plain form
4534 -68 -146 193 134 -225 1 -108 -22 -150 -137 -84 -20 -429 -283 -135 -151 27 -63 -19 -19 187 -4 -138 319 -73
4558 -73 111 72 -69 -12 -108 -52 -105 -69 -142 -21 -114 73 -161 15 -111 121 -163 -61 260 14 -111 -35 -28 -29 -41
4583 -41 47 -61 -199 -67 -40 248 149 -27 68 157 92 209 -198 -43 -56 -151 -34 -203 57 6 106 28 -205 -123
4607 -123 -255 92 59 58 171 182 -222 -48 -129 -1 -29 234 40 -61 -38 -28 -105 145 68 29 235 -142 -178 -334
4631 -334 -7 68 -145 -117 77 -53 175 92 -97 20 130 29 -252 -155 -163 90 22 -114 77 -52 -48 -8 -135
4654 -135 86 -18 -40 -24 -268 178 80 -177 -174 5 -164 96 77 22 114 -63 241 175 121 72 -233 80 97 6
4678 6 -184 88 119 12 -35 92 -47 -112 -28 -150 -34 4 -63 302 -118 -33 102 79 -82 -255 -2 -220 267
4701 267 40 280 -141 -133 -121 41 -357 0 -26 -37 208 -220 -91 136 -97 -13 110 -290 -2 35 39 -86 51
$$ packed form
4534f8p8L39n9l59K26j09Q6j28J3N3O4m09J46J48j6J78r0M4%K06j91j34M57l92
4558g3J84l9j41N7r6N6n3L6p3J21r3J87k34J76j26K32k84J02L21k46j25P6Pjj2
4583d1Q8j08j38J32K7K88r9j76R5Q9o5J17m07J55j3r5J17j69K60n1J00p8k33Q2
4607a23j32L47l3jJ13J1m04J74q1J28k8K63j94j01K3J0p7K50p7l9K06l77l6j56
4631c34L27P5k13K8J94j30K28q3j89J17J10j01k81R7qK53o8j36J91j29MM0j27
4654a35K21j04k2J6k44M46r8k57LJ79j69K60j9n5R2j77L04o6n4m9l05L13J7r1
4678Fj90K72L1j07m7J27j39o5Q4j22J16L8o7L65m20Q5J35k3j61j73K53k18M87
4701B67k27K40m21QJ2J62l98L57k6j1K45m28J29K27k33Q4J23m00K88L7Mj25J37
$$ plain form
4724 51 -1 13 30 -248 71 -8 125 17 -250 -201 -423 122 70 -21 41 31 -105 122 16 126 37 216 -231 203
4748 203 -211 74 -305 60 59 -189 -217 -133 226 -17 -137 -59 218 196 -136 -131 35 174 106 57 83 162 -135 37
4772 37 183 126 151 -128 208 -60 -18 -51 12 186 100 109 69 -39 -120 -34 -10 -130 -354 40 -37 325 -124 -30 -107
4797 -107 168 301 -100 -7 71 -111 258 236 -26 -79 31 -4 -68 -27 -36 4 56 70 -32 12 206 23 323 236 -189
4822 -189 47 -31 124 253 9 -93 283 -152 -191 -93 189 -96 -72 -107 9 -45 -245 -85 116 -13 151 70
4844 70 45 165 54 191 133 -80 141 -39 -98 142 -103 131 6 -96 41 -319 -62 -20 -89 53 -130 -101
4866 -101 -221 -146 79 -21 -26 -151 19 43 -108 20 5 27 20 16 1 -227 77 -257 58 118 -199 -37 -62 -106 -100
4891 -100 103 -15 -2 24 -43 -61 33 243 -17 -134 86 -39 167 38 -148 114 -77 -143 126 -123 -131 -379 -79
$$ packed form
4724E1n2J4J7k78L19p9J33j08k67M9k22N45n2r1O2j0j36K27j06J10q9J79m47M34
4748B03m14K85l79L65jk48k8Q4L59k43j20P8K77k2l32NJ66J39o8m9K6P9k97J72
4772C7J46n7K5k79L36k68M2l3O3J74q6Rm0j08q1Q6K4j20k24L94p7L62m49R4p7
4797a07K75J33m01R3P8j82L69k2k62n3J10l5o4M1rM0N2J4j02M4J94j83L00q7m25
4822a89K36p8J55J29k44j02L76m35l9R8K82k85K4l5J16n4k00J60K01j29J64q1
4844G0k5J20j11J37n8k13K21j80n9K40k45K34j25j02J37l60K57M2o9J42j83K9
4866a01j20P5K25j00nj25J70K4j51J28j5K2pmj5k28L04l34L15O0l17J62k5m4O
4891a00K03j18J3K6o7j8R4K10k60j17K20j25K06j29j86K62j91o6K69k49qk48L00
$$ plain form
4914 -79 49 149 -192 -187 -235 22 -155 -127 21 -129 -58 327 10 -26 -70 -9 41 -69 -33 106 -58 -25 -19 -426 -7
4939 -7 0 0 -88 -38 -111 218 159 246 43 111 255 -13 -137 -72 -81 40 -51 -122 -254 -77 -46 -217 -49 -309 -164 -70
4965 -70 43 72 59 -124 30 133 -9 -107 4 -224 -159 85 -175 244 -101 20 -134 66 64 38 20 270 -138
4988 -138 -99 178 68 -10 42 -1 -161 2 -80 -179 125 -257 209 -19 112 113 179 58 67 -168 87 -268 -28 58
5012 58 -106 -104 58 -30 -137 -172 -23 -58 -194 87 -166 116 162 100 64 81 49 -3 -84 162 175 -115 129 184 -130
5037 -130 -200 -145 3 26 -203 33 -230 68 -11 -2 58 -17 86 -4 -35 -215 55 -202 -135 -26 109 166 22 -72
5061 -72 56 -35 -97 -37 55 -43 134 -196 -63 34 -10 170 -20 102 -39 -53 -133 198 -14 -115 -66 184 6 57
5085 57 -26 170 126 47 -101 -22 31 119 -210 -211 -64 -88 47 58 -39 90 17 -53 -188 226 -32 -178 295 -29 32
$$ packed form
4914g9J28J00l41Nm8K57j77K8J48j50P1L85l17l6m4O1N0j10L6J39j64L3Om07M19
4939gP%q8N0p3L29n9Q7k03O8J44k68j24O5rJ21r1p1j32J77L1j71J68k60J45R4
4965g0J13K9j3j83J54J03j42r8J11k28O5K44k60M19l45J21j54K00kk6j8K50m08
4988a38L9K77j10p8N2m3j60J63q2r9L04l82M66k28J31JO6j21Rk35K55l55K40Q6
5012E8j64KJ62q8j07l5J49l5j36K81k53K82M6o2l6J7l2n2q1K46J3k90K44N5l14
5037a30p0N5J48K3k29K36k63K98p9RO0p5J03r0l1j80K70k57O7J09J35N7j44r4
5061g2J28r1o2O0R2r8J77l30J33R7m4J80j90J22j41j4q0L31k12j01M9K50j78N1
5085E7q3J96m4p9j48P9N3Q8l29jJ47k4J35J1r7J29p3p0j35M14k58j46M73l24O1
$$ plain form
5110 32 30 -67 136 209 -202 -270 -159 90 -104 -41 -37 -253 54 -70 -64 -230 -155 157 9 69 149 7 -93 -173 77
5135 77 296 166 -1 9 26 -91 32 98 -24 35 -10 10 115 205 -251 -130 89 105 23 10 8 17 -30 49 -35 31
5161 31 -200 92 -98 169 -89 -195 26 224 35 73 -139 -107 -210 -23 143 -143 -132 30 -86 -186 8
5182 8 40 -84 150 119 -121 -124 -80 56 -339 -141 15 250 53 51 80 -18 157 1 -4 -53 -131 -89 -187 137 122 -182
5208 -182 -92 -25 -194 -311 -40 -105 -84 -14 145 126 -74 150 127 -2 -115 148 79 100 -13 -22 -110 24 4 21 -136
5233 -136 72 10 -43 42 -355 1 -138 -89 -66 -97 -37 138 -24 48 134 18 -193 -106 209 -108 -137 -116 -40 90
5257 90 53 -111 -85 -65 24 -70 -16 140 136 -19 295 53 19 18 -52 -234 38 13 97 -133 144 69 -194 -29 -104 -58
5283 -58 -39 77 -28 32 -148 38 27 -152 -99 183 132 -137 -86 65 -23 -79 -76 -165 91 -156 -17 81 160 114 -222
$$ packed form
5110C2kr7K03P3m11o8J11K49j94O3Mk16L07j24Oj66P5L12j48O0Q0j42j00q0K50
5135G7K19j30j67J0J7j17J23O6j22N9m5K0J05R0m56J21K19J6q2j3kRm7P9q4O6
5161C1k31K92j90K67k58j06K21J98j89L8k12L2j03J87J66k86J1J62j16j00J94
5182HL2j24K34l1k40lM4J36l95J98J56K35j97kK9r8J75j56nm9p8M2r8L24j5l04
5208a82R0O7j69j17K71o5K1P0J59j9k00K24k3j29j13K63o9K1j13rq8J34k0J7j57
5233a36K08o2n3Q5l97L56j39M9K3l1O0J75j62P2Q6j16k11Q7L15l17k9K1P6J30
5257I0l7j64K6K0Q9r4N4J56mj55L14k42l4jp0j82K72k5Q4k30K77p5k63J65p5M6
5283e8J9J16j05O0j80J86j1j79N3K82n1k69N1J51q8n6Lq9K56k47J39R8P9m6l36
$$ plain form
5308 -222 22 -89 70 8 -142 -165 -60 -22 -108 77 193 35 12 143 -141 166 59 -286 -165 17 -21 -178
5330 -178 -142 -79 -109 -8 -16 -116 -20 10 -76 53 8 133 73 -113 32 133 12 184 66 7 -29 1 -55 -18 -149
5355 -149 -69 -61 -31 10 -91 17 27 -8 -50 101 -70 -86 19 -360 54 20 -83 -106 -137 34 105 266 -11 220
5379 220 116 -129 24 -71 17 128 51 19 -126 -30 230 -141 23 -32 -76 -60 -137 -189 -17 14 114 140 -66 -71 -120
5404 -120 56 -133 18 121 -176 -163 -30 -62 -64 -62 39 -23 161 197 40 10 -11 104 201 191 73 -191 -54 -176
5428 -176 -82 -14 -16 -133 100 81 -174 327 57 29 -14 -61 -20 10 -37 133 -161 -120 89 89 74 -12 -38 132 -119 -19
5454 -19 32 -250 163 192 -166 325 265 -58 -141 196 65 -132 16 35 79 -36 -165 -27 1 -43 196 -65 -106
5477 -106 -43 124 -89 -54 56 3 130 -114 177 149 -26 87 15 17 -39 113 -109 -16 211 -110 -120 331 227
$$ packed form
5308b22K44j11J59o2j50k3J05L8q6J85J16j58k3J31k84L07j07l45J21J82l8j57
5330a78L6O3l0J01qj00R6L0q6J29m5J25o0j86J45J01j21J72j18n9l6L0n6L7j31
5355a49Q0QL0M1j01J08J0l5m2J51j71j6J05l79M14l4j03k3l1J71P1J61k77K31
5379B20j04k45J53r5Q8J11p7l2j45R6K60l71J64n5m4J6p7n2J72L1J00K6k06nm9
5404a20J76j89J51J03k97J3J33l2kKJ01o2J84L6j57l0k1J15R7j0j18k64J37j22
5428a76R4O8kj17K33j9k55N01k70k8m3m7M1L0m7J70k94M1K09%j5q6k6J70k51J00
5454a9N1k82M13K9l58M91o0l23q3L37j31j97J48J9M4j15j29J38K8m4K39k61m1
5477a06O3J67k13L5J10n3J27k44K91k8j75J13p2Kn6J52k22R3K27l21j0M51j04
$$ plain form
5500 227 -73 192 -31 -143 130 -9 -123 -73 195 134 35 74 -1 213 -110 -78 41 57 -38 -69 192 172 -42
5523 -42 215 -407 -157 160 -187 173 -24 -36 -328 72 -164 -89 203 -6 179 -91 -102 -83 -171 -88 122 -58
5545 -58 -238 -26 -130 59 58 -107 -146 -146 -218 -127 112 -112 58 113 -55 57 -88 16 -4 -43 -69 -82 -35 -140 -20
5570 -20 -71 110 143 -123 -64 44 -116 -33 -254 -57 66 -58 70 -34 -202 38 -65 -166 -42 70 -2 90
5592 90 196 205 135 -178 -258 -71 -67 16 80 -127 -18 231 122 179 236 46 -105 -239 201 -144 -183 52 -270 169
5616 169 207 123 10 55 17 53 -70 175 -54 -92 154 -71 8 -333 170 -143 -35 -118 35 -227 -142 -35 -273
5639 -273 -67 -48 13 183 -105 68 212 -10 -299 -75 -138 -320 72 10 -140 -1 -22 58 -157 196 -183 412
5661 412 -139 -269 216 5 -10 91 -11 -147 67 94 148 120 -17 -4 -23 -168 111 -48 81 -247 88 45
$$ packed form
5500B27l00K65k23j12K73j39j14N0K68o1r9L9p5K14l23L2J19J6r5l1K61k0k14
5523d2K57o22K50L17l47L60j97j2k92M00k36P5K92k09J85k70j1J9q8Q3K10j80
5545e8j80K12j04J89jj65l9%p2R1K39k24J70N5j68J12j45J04k0l9k6j3M7j05J20
5570b0n1J81L3k66N9J08j60Q3k21J97J23j24J28j04j68K40j03j01J24J12p2R2
5592I0J06Rp0l13q0J87MQ3O4k07J09K49j09N7N7j90j51j34M40l45l9K35l22M39
5616A69L8q4j13M5l8L6j23K45k29l8K46k25P9l41N03l13J08q3J53k62Q5J07k38
5639b73K06J9O1J70k88J73J44k22k89K24o3j82L92o2j50J39k1Q0k15L53l79N95
5661D12n51j30M85k11j5J01j02j36K14K7N4k8j37J3j9j45K79j59J29l28L35m3
$$ plain form
5683 45 22 26 20 -72 44 37 -80 -48 -52 38 117 157 -89 -210 -40 8 280 -17 -127 84 94 65 -48 106 -40 -61
5709 -61 -162 -87 -55 -57 10 -27 -100 81 86 231 -57 62 112 -118 -110 -145 86 -135 -30 -201 -55 10 62 22 145 -201
5735 -201 49 -174 -279 -98 -82 125 -256 -119 20 21 238 73 107 -9 201 66 81 -27 142 86 -298 32
5757 32 -158 -33 -6 116 -65 111 -101 -250 -2 120 -242 111 111 130 167 -82 -60 121 241 -39 -16 -81 -290
5780 -290 6 -263 -207 -111 -140 -148 46 30 -139 -171 -15 56 -33 -253 -133 126 46 -268 114 -23 314 327 -129 -191
5804 -191 73 -8 133 45 19 -2 204 3 37 -15 -16 -172 -27 -254 -36 -24 -148 -141 -110 -31 39 -111 37 104 51
5829 51 -322 69 -9 122 103 -206 -48 23 -12 -150 89 46 -204 -15 162 57 78 221 273 26 343 -72 53
5852 53 -125 -27 -78 43 115 38 13 -56 81 -89 100 16 92 139 -123 147 -107 244 -222 209 -79 150 203 -31
$$ packed form
5683D5k3Mor2J16pj17L2mR0P9M0k46j21J70M8K72k97j10K11J0k9j13J54j46k1
5709f1j01P5L2kO7l7p3J81NJ45k88J19N0k30Ql5K31k21J05j71J46O5N2m0J23l46
5735b01K50k23j05J81J6K07l81J37J39JK17j65L4j16K10j35J5j08J69n6l84L30
5757C2j90J25K7J22j81J76k12j49K48J22l62L53%J9L7k49K2J81J20k80K3o5k09
5780b90K96k69N6R6k9qJ94j6j69l2J56P1q9k20J20K59q0l14L82j37L37J3m56o2
5804a91K64q1J41q8k6k1K06k01L4n2jj56J45k27K18J2j24PL1P9P0j50J48O7n3
5829E1l73L91p8J31j9l09J58P1l5j38K39m3k50J89J77j05K1J43N2k47L17m15J25
5852E3j78R8n1J21P2p7k5o9J37j70J89q4P6M7k62K70k54L51m66M31k88K29N3k34
$$ plain form
5876 -31 -11 -172 -30 355 152 112 -227 -108 84 64 -41 -58 -128 -135 153 30 122 -235 108 252 102 -277 73
5899 73 -180 45 179 -27 -1 -15 17 -50 0 89 -64 162 84 166 46 -257 -63 -40 183 -35 45 79 164 -164
5923 -164 217 172 25 -160 -61 265 40 275 98 148 -3 95 -6 132 65 -107 203 -59 -35 48 64 -29 6
5946 6 153 76 28 -19 -99 295 -270 196 -62 -15 4 59 25 -44 14 -268 -143 -23 -168 119 166 -140 -140 -157 155
5971 155 67 -83 -212 -15 -85 -42 191 50 -4 78 -7 32 150 107 -241 -140 76 -283 48 68 -226 -69 -3
5994 -3 48 -151 -105 -138 -59 97 101 -214 70 -103 -72 -112 -46 129 -231 -23 7 -152 33 -69 -382 28 74 -11 -271
6019 -271 155 27 -117 -45 -209 -42 169 151 44 -122 23 -84 18 74 -136 141 -103 85 -79 -80 -69 -90
6041 -90 39 -87 -186 -5 74 -395 112 -83 245 16 10 -158 92 -139 86 -114 81 52 168 -206 -227 -14
$$ packed form
5876c1K0j61J42L85k03m0l39J19J92k0j05j7p0pK88j23R2l57L43J44j50l79L50
5899G3k53K25J34k06K6j4L2o7N0Q9j53K26p8Q2j20l03J94K3K23k18Q0L4Q5l28
5923a64L81m5j47j85R9L26k25K35j77N0j51R8j01J38o7j72L10k62K4Q3J6r3L5
5946FJ47p7m8m7q0L94n65M66k58M7J9N5l4o9N8k82J25J20j45K87M7l06%j7L12
5971A55q8j50j29J97p0M3K33j41n4Q2q5L9J18m3l48J01K16l59L31K0k94J57O6
5994cN1j99M6l3P9J56Ml15K84j73L1m0O6J75l60K08L0j59J85j02l13M10M6q5k60
6019b71M26j28j44P2j64J67K11j8j07j66J45j07J02N6k10K77k44J88j64jJ1k1
6041i0J29j26r9J81P9m69N07j95L28k29oj68K50k31K25k00J95k9J16l74k1K13
$$ plain form
6063 -14 -46 -36 -45 216 -27 -164 -164 116 -54 225 74 40 -137 -284 179 223 142 -30 -122 -15 36 -60 -22 0 -165
6088 -165 -8 -203 195 23 151 -115 -161 137 197 -134 82 119 210 35 -142 -46 18 -57 -201 148 11 72 34
6111 34 -82 20 198 79 72 140 -146 1 45 124 73 2 117 -99 120 104 78 180 243 165 -7 34 9 -171 68
6136 68 156 150 -20 -221 -124 -138 14 -12 103 71 126 144 -42 -102 90 136 75 16 -220 120 -33 139 -154 -79 42
6161 42 411 193 -95 112 59 -213 29 -16 93 170 -77 -128 -29 -77 -94 90 -70 -351 199 -50 25 -175 29
6184 29 -121 -1 132 -149 13 74 -49 -267 81 -221 -119 -51 -74 90 -103 -38 -149 279 195 -36 -134 -149 -225
6207 -225 -3 -199 -17 -140 -158 137 166 116 174 -188 77 -165 -41 88 24 62 99 -226 -17 -39 -275 90 20
6230 20 57 102 -90 273 192 -246 243 -62 -131 -123 -105 80 -63 -135 245 -21 -8 49 -88 61 104 139 37 -26 25
$$ packed form
6063a4l2J0rK61k43j37%K80j70K79j51l4j77j47M63M4q1j72r2J07N1r6L8K2j65
6088a65J57j95L98j72J28k66m6K98O0l31K16L7R1j75j77R6O4p5j44L49j37O1l8
6111C4j16J02J78j19pO8k86J47M4P9n1p1J15k16K19j6k6J02O3p8j72M1k5j80K39
6136F8Q8oj70k01R7j4J52k6J15l2N5J8j86o0J92M6o1n9k36L40j53J72k93P5J21
6161D2L69k18k88K07n3k72K42m5J09P7k47n1R9m8j7J84j60k81N50k49P5k00K04
6184B9j50J20J33k81J62O1j23k18L48l02J02O8k3J64j93O5j11M28q4k31r8j5p6
6207b25K22j96J82j23j8K95K9n0N8l62K65k42J24J29o4L8L7l25K09k2k36L65p0
6230B0L7M5j92L63q1m38M89l05o9QJ8J85j43p2L80k66J3N7j37J49M3L5j02o3N1
$$ plain form
6255 25 262 62 -87 -8 -244 -298 22 -10 69 38 226 -72 -32 -291 14 -163 -18 -12 -44 -84 43 -220 -48 160
6279 160 -63 135 67 -161 117 109 -50 11 112 98 75 97 -60 142 60 155 -14 -140 29 -34 -24 174 193 -102
6303 -102 149 231 138 -348 -262 -86 -173 29 88 -89 -111 -121 -93 179 -180 -189 36 -177 -149 -241 -109 92 57 -75
6327 -75 29 -27 -314 146 -50 -220 67 -75 -6 166 -23 -150 82 -228 93 89 47 -99 -41 -53 205 276 -64
6350 -64 104 47 40 -377 -119 277 17 271 -206 118 239 71 -107 238 194 53 91 -199 -98 32 13 226
6372 226 34 -81 68 65 -44 36 -98 -313 -104 -325 -310 207 111 115 -114 85 223 -16 27 97 37 12 -9 165
$$ packed form
6255B5K37k00j49P9k36n4L20l2P9l1J88k98M0k59L05j77J45Ol2m0J27k63J72K08
6279A60k23J98o8k28K78qj59O1J01j4k3K2j57K02q2R5j69j26J69o3J0J98J9k95
6303a02K51Q2r3m86Q6J76q7K02N9j77k2j0K8K72l59rK25k13K8r2J32K01l5j32
6327g5J04n6k87M60j96j70K87j42O9J72j89j27K32l10L21mm2j46N8j2K58P1l40
6350f4J68n7pm17K58L96k60K54m77L24J21j68j78L45m4j41L8k90J01J30j9K13
6372B26j92j15J49lj09Q0j34k15K09k21J5N17r6Mk29J99J38k39M3P0o0k5k1J74
$$ [...]
8191A6
##END NTUPLES=NMR FID
##END=
