##TITLE=1H_LR-758-R3-KA4-FCC14
 CDCl3
 8 sc, 
 3.10.2023
##JCAMPDX= 6.0         $$ Bruker NMR JCAMP-DX V2.0
##DATA TYPE= NMR FID
##DATA CLASS= NTUPLES
##ORIGIN= UXNMR, Bruker Analytische Messtechnik GmbH
##OWNER= root
$$ XWIN-NMR		Version 3.5
$$ Tue Oct  3 13:40:31 2023 Russian Standard Time (UT+4h)  she@DPX200
##.OBSERVE FREQUENCY= 200.13135
##.OBSERVE NUCLEUS= ^1H
##.DELAY= (6, 6)
##.ACQUISITION MODE= SIMULTANEOUS
##.ACQUISITION SCHEME= undefined
##.AVERAGES= 8
##.DIGITISER RES= 18
##SPECTROMETER/DATA SYSTEM= spect
##.PULSE SEQUENCE= zg30
##.SOLVENT NAME= CDCl3
##.SHIFT REFERENCE= (INTERNAL, CDCl3, 0, 15.7039)
##AUDIT TRAIL= $$ (NUMBER, WHEN, WHO, WHERE, WHAT)
$$ ##TITLE= Audit trail, XWIN-NMR		Version 3.5
$$ ##JCAMPDX= 5.01
$$ ##ORIGIN= Bruker BioSpin GmbH
$$ ##OWNER= she
$$ F:/spectra/data/she/nmr/H-F/1/audita.txt
$$ ##AUDIT TRAIL=  $$ (NUMBER, WHEN, WHO, WHERE, WHAT)
(   1,<2023-10-03 13:39:15.21 +0400>,<she>,<DPX200>,
      <created by zg, POWCHK disabled, PULCHK disabled
       configuration hash MD5:
       00 E9 B6 7A A2 85 ED C7 34 08 36 98 17 FE 4E 26
       data hash MD5: 16K
       F4 EA 9D 23 EF 62 1D 52 18 6F 09 3F 01 A9 A7 09>)
$$ ##END=
$$ 
$$ hash MD5
$$ C4 EF F5 DF 25 E9 5C 31 62 28 31 10 EA 05 A7 A0
##$RELAX= 
##$RELAX= 
##$RELAX= 
##$RELAX= 
##$RELAX= 
##$RELAX= 
$$ Bruker specific parameters
$$ --------------------------
##$DU= <F:/spectra>
##$EXPNO= 1
##$NAME= <H-F>
##$PROCNO= 1
##$TYPE= <nmr>
##$USER= <she>
##$AMP= (0..31)
100 100 100 100 100 100 100 100 100 100 100 100 100 100 100 100 100 100 
100 100 100 100 100 100 100 100 100 100 100 100 100 100 
##$AQSEQ= 0
##$AQ_mod= 1
##$AUNM= <au_zg>
##$AUTOPOS= <>
##$BF1= 200.13
##$BF2= 200.13
##$BF3= 200.13
##$BF4= 200.13
##$BF5= 200.13
##$BF6= 200.13
##$BF7= 200.13
##$BF8= 200.13
##$BYTORDA= 1
##$CFDGTYP= 0
##$CFRGTYP= 5
##$CHEMSTR= <none>
##$CNST= (0..31)
1 1 145 1 1 1 1 1 1 1 1 1 1 1 1 1 1 1 1 1 1 1 1 1 1 1 1 1 1 1 1 1 
##$CPDPRG= <>
##$CPDPRG1= <>
##$CPDPRG2= <>
##$CPDPRG3= <>
##$CPDPRG4= <mlev>
##$CPDPRG5= <mlev>
##$CPDPRG6= <mlev>
##$CPDPRG7= <mlev>
##$CPDPRG8= <mlev>
##$CPDPRGB= <>
##$CPDPRGT= <>
##$D= (0..31)
0 1.2 0 0 0 0 0 0 0 0.06 0 0.03 0 0 0 0 0.0002 0 0 0 0 0 0 0 0 0 0 0 0 
0 0 0 
##$DATE= 1696325954
##$DBL= (0..7)
120 120 120 120 120 120 120 120 
##$DBP= (0..7)
150 150 150 150 150 150 150 150 
##$DBP07= 0
##$DBPNAM0= <>
##$DBPNAM1= <>
##$DBPNAM2= <>
##$DBPNAM3= <>
##$DBPNAM4= <>
##$DBPNAM5= <>
##$DBPNAM6= <>
##$DBPNAM7= <>
##$DBPOAL= (0..7)
0.5 0.5 0.5 0.5 0.5 0.5 0.5 0.5 
##$DBPOFFS= (0..7)
0 0 0 0 0 0 0 0 
##$DE= 6
##$DECBNUC= <off>
##$DECIM= 32
##$DECNUC= <off>
##$DECSTAT= 4
##$DIGMOD= 1
##$DIGTYP= 9
##$DL= (0..7)
0 120 120 120 120 120 120 120 
##$DP= (0..7)
150 150 150 150 150 150 150 150 
##$DP07= 0
##$DPNAME0= <>
##$DPNAME1= <>
##$DPNAME2= <>
##$DPNAME3= <>
##$DPNAME4= <>
##$DPNAME5= <>
##$DPNAME6= <>
##$DPNAME7= <>
##$DPOAL= (0..7)
0.5 0.5 0.5 0.5 0.5 0.5 0.5 0.5 
##$DPOFFS= (0..7)
0 0 0 0 0 0 0 0 
##$DQDMODE= 0
##$DR= 18
##$DS= 0
$$ [...]
##$SUBNAM2= <"">
##$SUBNAM3= <"">
##$SUBNAM4= <"">
##$SUBNAM5= <"">
##$SUBNAM6= <"">
##$SUBNAM7= <"">
##$SUBNAM8= <"">
##$SUBNAM9= <"">
##$SW= 18.05172834244
##$SWIBOX= (0..15)
0 0 2 0 0 0 0 0 0 0 0 0 0 0 0 0 
##$SW_h= 3612.71676300578
##$TD= 16384
##$TD0= 1
##$TE= 0
##$TE2= 300
##$TE3= 300
##$TEG= 300
##$TL= (0..7)
0 120 120 120 120 120 120 120 
##$TP= (0..7)
150 150 150 150 150 150 150 150 
##$TP07= 0
##$TPNAME0= <>
##$TPNAME1= <>
##$TPNAME2= <>
##$TPNAME3= <>
##$TPNAME4= <>
##$TPNAME5= <>
##$TPNAME6= <>
##$TPNAME7= <>
##$TPOAL= (0..7)
0.5 0.5 0.5 0.5 0.5 0.5 0.5 0.5 
##$TPOFFS= (0..7)
0 0 0 0 0 0 0 0 
##$TUNHIN= 0
##$TUNHOUT= 0
##$TUNXOUT= 0
##$USERA1= <user>
##$USERA2= <user>
##$USERA3= <user>
##$USERA4= <user>
##$USERA5= <user>
##$V9= 5
##$VALIST= <valist>
##$VCLIST= <CCCCCCCCCCCCCCC>
##$VD= 0
##$VDLIST= <DDDDDDDDDDDDDDD>
##$VPLIST= <PPPPPPPPPPPPPPP>
##$VTLIST= <TTTTTTTTTTTTTTT>
##$WBST= 1024
##$WBSW= 4
##$XGAIN= (0..3)
0 0 0 0 
##$XL= 0
##$YL= 0
##$YMAX_a= 78005
##$YMIN_a= -134711
##$ZGOPTNS= <>
##$ZL1= 120
##$ZL2= 120
##$ZL3= 120
##$ZL4= 120
##$ABSF1= 10
##$ABSF2= 0
##$ABSG= 5
##$ABSL= 3
##$ALPHA= 0
##$AQORDER= 0
##$ASSFAC= 0
##$ASSFACI= 0
##$ASSFACX= 0
##$ASSWID= 0
##$AUNMP= <proc_1d>
##$AZFE= 0.1
##$AZFW= 0.1
##$BCFW= 1
##$BC_mod= 2
##$BYTORDP= 1
##$COROFFS= 0
##$CY= 11.3945322036743
##$DATMOD= 1
##$DC= 2
##$DFILT= <>
##$DTYPP= 0
##$F1P= 15.7292609196834
##$F2P= 12.9074282941183
##$FCOR= 0.5
##$FTSIZE= 0
##$FT_mod= 4
##$GAMMA= 1
##$GB= 0.15
##$INTBC= 1
##$INTSCL= 1
##$ISEN= 128
##$LB= 0.24
##$LEV0= 0
##$LPBIN= 0
##$MAXI= 10000
##$MC2= 0
##$MEAN= 0
##$ME_mod= 0
##$MI= 1.114404
##$NCOEF= 0
##$NC_proc= 0
##$NLEV= 6
##$NOISF1= 3.799351
##$NOISF2= 2.8
##$NSP= 1
##$NTH_PI= 0
##$NZP= 0
##$OFFSET= 15.70392
##$PC= 1
##$PHC0= -21707.31
##$PHC1= 8.85271
##$PH_mod= 1
##$PKNL= yes
##$PPARMOD= 0
##$PSCAL= 0
##$PSIGN= 0
##$REVERSE= no
##$SF= 200.130013532006
##$SI= 16384
##$SIGF1= 3
##$SIGF2= 2
##$SINO= 400
##$SIOLD= 16384
##$SREGLST= <1H.CDCl3>
##$SSB= 0
##$STSI= 0
##$STSR= 0
##$SW_p= 3612.71676300578
##$SYMM= 0
##$S_DEV= 0
##$TDeff= 0
##$TDoff= 0
##$TI= <>
##$TILT= no
##$TM1= 0
##$TM2= 0
##$TOPLEV= 0
##$USERP1= <user>
##$USERP2= <user>
##$USERP3= <user>
##$USERP4= <user>
##$USERP5= <user>
##$WDW= 1
##$XDIM= 8192
##$YMAX_p= 0
##$YMIN_p= 0
$$ End of Bruker specific parameters
$$ ---------------------------------
##NTUPLES= NMR FID
##VAR_NAME=  TIME,          FID/REAL,        FID/IMAG
##SYMBOL=    X,             R,               I
##VAR_TYPE=  INDEPENDENT,   DEPENDENT,       DEPENDENT
##VAR_FORM=  AFFN,          ASDF,            ASDF
##VAR_DIM=   8192,          8192,            8192
##UNITS=     SECONDS,       ARBITRARY UNITS, ARBITRARY UNITS
##FACTOR=    0.0002768,     1,               1
##FIRST=     0,             0,               0
##LAST=      2.2672688,     0,               0
##MIN=       0,             -134711,         0
##MAX=       2.2672688,     78005,           0
$$ Real data points
##PAGE= N=1
##DATA TABLE= (X++(R..R)), XYDATA
$$ [...]
1765E56M4l51q24K31P25K7m11m53j02P30JR6r60N4O44L85j77l42k20N90J70l13
1787A00k08r1J63M95ml45l78K23M73L24o39l08J89N08j56l14m16L32O65r4k70
1808B49o81K14O35N95q27m55J21M28L52j38m40j78L33L92l31m50R9r7O67k47n02
1829b61k69M3N75Pn66k64J59K67J99j39l42R0M51M03p09j22j25R28K24m01m65
1850c17J54R58J70k61p07J02M93J90l81j91k55K51M73l30m79k22K49P80l82l99
1870a04l48J45N70L0p36j80J24L09L90o20l43o9P76M49p57l41J64K89K65j53m48
1891e88mM84M09n16j29j46K95L63j16l47k19N94L18j8m65J47J21N10j49k21n72
1912b49M09O27r3k28l00k03Q43j17m52l12j8L7J43j53p74L64K86J72l14m18k31
$$ y = [556, 600, 249, -575, -344, 381, 408, -3, -456, -558, 172, 173, 269, -691, -637, 7, 392, 215, -127, -347, 243, 413, 100, -108, -199, -36, 459, 455, 110, -268, -45, 428, 752, 113, -195, -6, 502, 346, 32, -384, -52, 613, 519, 249, -432, -218, 417, 1012, 185, -270, -149, 279, 631, 493, 53, -125, 208, 600, 269, -181, -82, -179, 488, 241, -261, -530, -487, 88, 95, -471, -735, -576, -309, -110, -249, -591, -501, -50, 353, -356, -478, -603, 325, 549, 148, -317, -163, 795, 965, 704, -3, 99, 592, 782, 401, 210, -45, 206, 679, 349, -130, -352, -103, 677, 295, -104, -452, -307, 263, 293, -443, -623, -499, -190, 200, -420, -763, -832, -56, 393, -364, -705, -541, -252, 13, -140, -588, -592, -108, 301, -215, -344, -490, -195, 168, 52, -295, -514, 80, 398, 380, -85, 62, 183, 693, 544, 323, -249, 160, 787, 694, 466, 166, -37, 806, 689, 237, -75, -93, -56, 87, -66, -840, -476, -190, -18, -332, -750, -981]
1933i81M85K18j53k95j87J64N92j2N0n23K98N03Q6k25m79M62N77j53k56p8N5O43
1955G91n6k79l85K55L71J50m58k20j1Q5L2K49o99o8L65K82k4o30r9L38L0J40n04
1978c45j47K72L32L3l58l01N89l4L44o51m06M59M50J31n49j85J20M37J33j23j40
1999F1k66O64j34P5l42n8L37J50L66p68K9N40J55k08j77j76K48M87k35n81j69
2020bJ52K39j8j90l99L3K23J72n99k75K34N05Ql91J1l49N02J81q9m00j77M69K42
2043H2N9l03j17N68J22j26j89n1L85K58l78j37j44L76N14m32k58l15R2M14M1k62
2065A99k41p4L95K58m15m01Q2L04J96k58n88M03K87Q3j08l93j25M23M18n81k84
2086d20k10L85K97k03k34j20O17j1J83n35k56K50L85p3j93o4p8O54K75l72l07
$$ y = [-981, -496, -278, -431, -726, -913, -749, -157, -169, -119, -642, -344, 159, 245, 20, -459, 3, 580, 427, 171, 93, 148, 791, 735, 456, 71, 326, 697, 847, 389, 169, 158, 243, 275, 524, -175, -243, 122, 404, 380, -250, -349, -11, 19, 159, -345, -492, -220, 112, 145, -213, -514, 75, 41, 385, -266, -672, -213, 237, 368, -181, -366, -246, 191, 324, 201, 61, -205, 459, 325, 400, 58, 0, 337, 487, 853, 85, 114, 654, 809, 601, 424, 248, 496, 983, 748, 167, -2, 150, 389, 371, 181, -218, -185, 38, 210, -389, -664, -430, 75, 83, -308, -297, -646, -144, 37, -52, -452, -629, -160, 82, 141, -162, -279, 289, 411, 285, 96, 45, 430, 688, 310, 173, 29, 405, 919, 487, 229, -86, 6, 420, 461, 199, -42, -116, 279, 537, 122, -279, -197, 107, 303, 45, -543, -140, 147, 230, 122, -271, -396, 27, 445, -136, -420, -630, -245, 52, -151, -385, -505, 112, 101, 284, -251, -507, -257, 128, 55, -138, -202, -280, 374, 649, 277, -30]
2107c0N6L65L39o27m8j20J46L44j57m19K4M55J40k39n08K83o8J16p8k01k84L92
2129a19N4Q5p22K35j17O91p4j86j29k51N71k4k12k14K65L68L06n45l9l15O13K31
2151D72l73k20j78M31J37l11o6k15K97L47l59K2l65R9N02p0k37k86K07L44mk17
2173d3j29J29J51M3n5l65J94K93k05r5o2j92N10l2L8n03J28J53J49m9p7l90M51
2196D2p7q1j33o5J98J68K52j89k60rL38K18j71m82K22O72l58l35k22L97J43N3
2218C21j62p0k91M25N4j56j14k06L01K04n2m35j51L33K04j90l07J98J62n1K52
2239B69l11J06r9J24L17p1m49o2K77J78l05l24MK89K05l61K6mJ71M40o41J25k61
2262c57M40J45j20l51K24j19M10k8l40R5L07j7J17l72j02J97J33j90oPl3M12j45
$$ y = [-30, 26, 391, 730, 103, 55, -65, 81, 425, 268, -151, -127, 328, 468, 229, -279, 4, -64, 52, -26, -227, -511, -119, -65, 20, -702, -467, -584, 107, 33, -153, -282, -533, 38, 14, -198, -412, -147, 221, 527, -18, -57, -372, 241, 472, 99, -121, -299, 132, 269, -42, -108, -323, -26, 321, -38, -16, -381, -282, 220, 150, -87, -373, -166, 178, 174, -43, -172, -43, 108, 151, 96, -269, -75, 218, 13, -82, -144, -336, 174, 142, 180, -323, -195, -42, 107, 58, -19, -409, 42, -35, -116, -249, -314, -116, 52, 304, 115, -145, -154, 184, 402, 231, -251, -29, 643, 285, -50, -272, 125, 268, 321, 159, 89, -202, 223, 277, 121, 7, -199, 102, 306, 254, -181, -332, 1, 205, 15, -292, -94, 68, 17, 269, -42, 64, -35, 89, 406, 335, -114, -176, 101, 279, -26, -350, -346, -57, 148, -213, -187, -191, -20, 420, -221, -96, -357, 83, 228, 108, -243, -19, -138, 272, 244, -96, -1, 306, 289, 406, 34, -68, 129, 262, 72, 66, 73, 40, 452, 307]
2285C07k29l79M58j03M42o29J0l22N41L57m87l4p8M10l1k1m25J99J46m2K06l91
2307i5q5M85M6l00L7m40N95q4M7k06k18L31l2j32N2j23m7L70O8l62K32J93j2K1
2331C41l80J32R7J99k17q5k69L67o2K90j07n04K38o8J72l23J49o15K71N90m72
2352b56j57MJ90J99j41k56NK57K97j63k75l12L85j3M59k63j51R4K89Lj33o3j7
2375a8M32k44l3j53j29K93L15j62k77j48J81l4N9j42k63L35P1mk19L7L3L95k21
2398A04k23oq5L19P4m66J38M2n9N12m13k30R6L85j12k03M6k5r9K20j92J1j89L76
2422B1J36n6l36l0K47K91J12k00p6M2J19K85n25r6K23L65k71j48j14k26K92k4
2444C1Jk15l57N34Q0j07j42k21Q4J6K49l24J07J99R8J0l21M4K5L54K37l32m3K8
$$ y = [307, 78, -301, 157, 54, 496, -133, -123, -445, 96, 453, -34, -68, -146, 264, 233, 212, -213, -14, 132, 90, 296, -95, -180, 305, 351, 51, 88, -352, 243, 159, 206, 0, -218, 113, 81, -51, 1, -122, -169, 201, 269, -93, 139, 332, 320, 341, -39, 93, 190, 389, 172, 87, -182, 185, 123, 413, 306, -198, 40, -28, 144, -179, -30, -645, -374, 216, -256, -413, -409, -219, -20, -161, -417, -412, -155, 142, -21, -296, -608, -223, -236, 223, -40, -191, -97, 192, 195, 62, -1, -18, 414, 170, 137, -16, -145, 148, 463, 301, 24, -124, 57, 23, 82, -60, -323, 12, 83, 79, -140, -103, -70, 325, 104, -119, -125, -210, 109, 183, -283, -145, -103, -162, 350, -63, -293, -197, 188, 76, -127, -81, -106, -205, 15, -177, -166, -355, 21, 157, 101, -235, -265, -18, 273, 385, 185, 109, 151, 270, 555, 30, -66, 157, 522, 251, 103, -11, -237, 55, 31, 32, -183, -540, -6, 74, -33, -175, -396, -312, -296, -47, -371, -264, -65, 33, 43, -278, -234, -209, 145, 382, 50, 7, 35]
2468C5L39J13l39k08M02j49J68l3n61L82J19nj53k24J12J55J03q6k12m3J75L15
2490D05k47j60J44k77K49n5k28j4N76r5j59k40J64j43J7K49l17LL5M47k54j46
2512d6l33M55p7%J6j81K44Q5N8q1k91K0K24J3J91k34j06K34O4M9m47L24o9J2L00
2537D24k40m23M19k6l50K97l87L16j4L7k40R3M3K56l02j78j1o6M59l3p3l60J22
2560b37J99M5o4j46K39j70L74n4l07J67Q3j2l15J85j68K41l5P8q2j46p1J27J11
2583D2j1k09P6J1L75k37j28L6n4M00l83J1L0oJ87j85J72j18k02J96J43k54J59
2606E1J2q1p6ql74K83J83j28r1M9k0J88J28m36L61M5j28K51l03r3j08L90K03j04
2630A94l33R2J59J59J88o33K94l8O1jj94N8JR4l1k02k5Q4n4j48LJ44R6Q4N2k79
$$ y = [35, 374, 487, 148, -60, 342, 193, 361, 328, -233, 149, 268, 263, 110, -114, -2, 153, 256, 170, -42, -85, 90, 405, 158, -2, 142, -135, 114, 59, -169, -183, 393, 298, 139, -101, 63, -80, -63, 186, -131, -128, -93, 354, 100, -46, -379, 76, -1, -1, 15, -166, 78, 163, 221, 140, -151, -131, 93, 106, 297, 63, -43, 191, 255, 304, -143, 181, 112, 124, 424, 184, -239, 180, 154, -196, 101, -286, 30, 16, 53, -187, -94, -51, 205, -97, -275, -286, -352, 107, 74, 1, -359, -237, -38, 7, -57, -203, 36, -134, 240, 186, -121, 46, 129, 117, -198, -13, -181, 60, 25, 103, 21, -125, -196, -69, 42, 31, -178, -102, -91, 284, 47, -81, -45, -99, 301, -82, -71, -41, -47, 140, -45, 127, 9, -193, 3, 146, -108, 51, 63, -18, -94, -102, -476, -193, -10, -138, -229, -180, -200, -12, 116, -320, 41, 86, -42, 209, -94, -187, -295, 95, 298, 194, -139, -47, 112, 271, 459, -174, 120, 82, 143, 142, -52, 6, 7, 101, 70, -132, -157, -73, -127, -275, -272, -128, -32, 52, 104, -175]
2656a75J07o5m7J28j59m9M50p9P2k46n6k27L11n7J79m30J57M32j35l18J2K37j57
2679a15M7J81k66J54N1J19J0k24k31K15R3j95j40L35p7m2K37j96q4K21k8J12m0
2702A37k62r6K89J44n73K85J28J13j70j81J7j48K14R0l3RJ37Jo9j61n3J09L04
2725B31p8J85l61K37j78R7jQ7q7l57L16l00J79O7r7L20r1j27j20Q2KQ6j78P7J44
2750A35n6K05j87j81j53L33K4J63m36J36K09P1o9j91J3k7M50m24J77k72j81K71
2772A0j08k27R5j69M13j5o0j52j2QM91l42N5J07j21K72J03m04J42Qj14M19l00
2795I9p2j19M96k67j67q0J81J20m5k02j16J82J21k64K47%k02J08j72K32j02j74
2817a96L16O2k84L1L9M8L7j4O3l14OK78Q8j49jj7j2J53j42j38K03j9j0j14l8J34
$$ y = [-175, -68, -133, -180, -52, -211, -260, 190, 111, 183, -63, -119, -346, -35, -92, 87, -343, -186, 246, 111, -207, -195, 42, -115, -68, 113, -153, 1, 52, 171, 181, -43, -274, -59, 34, -161, -301, 34, -43, -85, 152, -44, -128, 93, 65, 177, 137, -125, -221, 68, 212, -361, -76, 52, 165, -5, -186, -169, -317, -103, -13, -46, -37, 100, 101, 32, -129, -182, -73, 231, 153, 338, -23, 214, 36, 133, 132, 219, 132, -225, 91, -209, -30, 37, -60, 260, 169, 42, -78, 4, 6, 92, -86, -9, 135, 79, 284, 97, -84, -237, 96, 120, 283, -153, -17, 192, 263, 194, 3, 16, -11, 439, 15, 192, -80, -261, 10, -98, -325, -230, -399, 14, -1, -61, -213, -225, -217, 274, -68, -13, 94, -27, 245, 348, -56, 86, 94, -20, 399, 99, 27, -92, 404, 137, -30, -110, 71, 191, 146, -56, -172, 10, 131, -133, 114, 114, -88, 20, -152, 80, -22, -196, 120, 182, -102, -71, -32, 16, 53, 39, 102, -212, -206, 72, 160, 11, 10, -7, -19, 134, -8, -146, 57, 38, 28, -86, -124, 10]
2843A0J25j00pJ82m32K65K32j49j83J64K62k31r8j47K94p6j12J97Om23K85K0K07
2866B91n09j20J26P9J11k14QK67J31k78k3k81J62RJ37Pk1M0r2J79j19j9l0J14
2890d5K65l42K44j73J40k39J58K19l38J62n2J13k93L76l2m4M2m71M7L33j30J05
2912D5n4j79L39Q7k07Q2k66L03J29k99M2k19J45K25k09K12k65M3L73k82j25l1
2934a11J30K75j99j25J71k90Q2K57j85J66k4J7k4j76j22K94J1oL9j10N0k91M05
2957B34l49L72l43J83Ok2m5J54l24j1O4k8J89m4poJ3l62J56L33R8j04k26J62O6
2982A59k84J77J1j49k6J84J6M0k37J78K24j50Q0k30m2J97q2q7k65J37J56K42k87
3005c8j70K92K26K8l08k04K11r6M25j56k10K5j28O5n8MP9o9K13j39p1Q6j61K43
$$ y = [10, 135, 35, 28, 210, -222, 43, 275, 126, -57, 107, 369, 138, 40, -107, 187, 111, -1, 196, 202, -221, 64, 84, 291, -218, -338, -212, -133, -22, -236, -228, 39, 170, -108, -131, -412, -250, -241, -104, -97, -118, -78, -170, 9, -110, -129, -159, -45, 220, -122, 122, -51, 89, -150, 8, 227, -111, 51, -1, 112, -181, 195, 163, 119, 161, -310, -263, 70, -60, 45, -9, -188, 151, 238, 31, 113, -153, 150, 279, -20, 22, -197, -52, 173, -36, 176, -89, -46, 327, 45, -80, -111, 19, 294, 95, -30, 141, -149, -67, 190, 5, 171, 147, 164, 140, -36, -158, 136, 147, 141, 180, 70, 120, -171, 234, -115, 257, -86, 97, 103, 81, 36, 190, -134, -145, -81, -109, 80, 36, 29, 23, 36, -326, -170, 163, 261, 157, -69, 93, 159, -125, 52, 63, -86, -112, 72, 88, 128, -109, 69, 293, 143, 223, -7, -49, 148, 66, -21, -286, -149, 7, 249, -38, -208, 84, 310, 338, 30, -174, 37, -59, 366, 210, 0, 25, -103, -38, -96, -92, -13, -82, 131, -8, -79, 7, -154, 89]
3029H9k25k7O5K27j57p0ln1N1m7M57m11j79Q1K38J26j95J97K1K05n05K15k92O6
3053a24nJ97j3p1J98k05J77j23p2m7J11K61l26qN5m2J24j24j00J09j89P4m9L1
3077a61J4M6K86j40j85M1J8M45m17K18j56k31J48J64j19J62l52K58RK18o0l10
3099a04J83K32j13j95q6j04J3J61m4P0J30j3j26jL39k55l65M62l46k30N30j93
3121e5j70J69j2n1q3L58k92P0j06n8m2J05K7P9J54l79J2Q9K89M9k9m1k8j00J20
3146G5j0k02K08j85M3K95k67l8K05j43J78J20k85k67M04J8J36m36KK14j49m0j64
3169b88K83M5N5r7R4k37J64J51p4n6pj55J07J28j38J73j68J21q3%J6j11K75r2
3193A06j78JQQ0K87m33r5Q7J2K01p2J48M5j80j13L07k45K04k09J82o2q8j90K03
$$ y = [89, -136, -163, -98, 129, -28, -98, -101, -152, -101, -148, 309, -102, -281, -200, 38, 164, -31, 166, 187, 392, -113, 102, -190, -124, -129, 68, 55, -16, 182, -23, 154, 31, -41, -88, 23, 284, -42, -50, 5, -37, 87, -37, -137, -28, -217, -143, -192, -161, -147, -101, 185, 45, -140, -99, -81, 364, -53, 165, 9, -222, -74, 90, -29, 133, -219, 39, 48, 266, 206, -104, 79, 311, 198, 3, -83, -187, -174, -13, -57, 13, 143, 130, 4, 3, 342, 87, -278, 184, -162, -392, 138, -55, -225, -56, -68, -119, -202, 156, -136, -66, -172, -230, -272, -167, -140, -61, 93, -286, -274, -185, 104, 153, 124, 83, 55, -45, 75, 65, -137, 71, -114, -71, 224, -43, -81, 124, -19, 159, 279, -6, -273, 131, 149, 285, -151, -149, 65, -84, -124, -288, -5, 40, 95, -2, 92, -145, 19, 170, 96, 40, 33, -122, -15, 113, -25, 148, -20, 101, 18, 18, 34, -77, 198, 106, -72, -71, -63, 17, 304, -129, -224, -137, -125, 76, 4, 152, 197, 17, -96, 211, -34, 170, -39, 143, 81, -7, -197, 6]
3217Fm5L66k73l4M3j37L22j97l29P6J89J01j69J73j85J28O8J11k06k0J26n5K33
3240B92k59o4n3j1K06j76m8p0J85k02J71k16L02L1p2K34k03J2k04J14j21q0J45
3263h7K16l3l9o3o0l4J53j03O6q0J7K12j08J7L3L5M6k53J13p0J98J49k06m4k02
3288a27J29m8J46L3k32P7l3J78j78Q9j18J20j23J92l60K07N0l8J37K44l90J7K76
3311B48k46Pk24K60j61K00j44K48l99J30O0J51k26p0J21k6J49m78L71j2K82j45
3333I6k03J61j21K59M7j58j06M1o4O0L0Qr6N4%J59l87M5J07k3o0n8K82P7K8k02
3359b4R4l88R1M36l29j20L89k90J84Rk38O5o8J69m5J55k19J02m7J71j05j52R2
3382f8P7P5O6l33K80j28q5N1j77mK27lmj23j23K31J77j88L5P6pQ6J7k25J44o8
$$ y = [6, -39, 327, 54, 20, 63, -74, 248, 51, -278, -202, -13, 88, -81, 92, -93, 35, 103, 214, 8, -12, 114, 59, 292, 33, -31, -84, -95, 111, -65, -113, -183, 2, -200, -29, -245, 57, 88, 16, 250, 47, 59, -145, -31, -152, -232, -87, 129, 96, 57, -6, -66, -100, 53, -50, 16, -64, -47, 165, 57, 74, 107, 142, 188, -65, 48, -22, 176, 325, 119, 75, -127, 2, -46, 100, 133, -99, -22, -55, 123, -55, 34, -84, 36, -87, 105, -255, -48, 2, -36, 101, 345, -45, -28, 248, 2, 9, -215, 45, -116, 84, -60, 188, -211, -81, -21, 130, -96, -166, -45, -71, 78, -400, -29, -41, 241, 96, -107, 54, -67, 192, 239, 81, -25, 16, -48, 12, 42, 50, -46, 8, 8, 167, -220, -175, -68, -91, -151, -209, 73, 150, 178, -24, 70, -318, -227, 209, -120, -240, 149, -141, 43, 52, -186, -121, -189, -20, -65, 90, -129, -27, -74, 97, -8, -160, -68, 9, 84, 150, -183, 97, -31, -116, -65, -242, -246, -19, -22, -26, -149, -272, -41, 136, -52, -17, 59, 52, 138, 155, -70, 74, 6]
3408FJ47j19n0k1J11J1N4o8j74L5J76q8j16j6j08J91p3j8j02j7K74k27K39l17
3432b70M21k9pj4j09K3p3M63m94j59M26k34L55l39j14N2MJ45Qn2K1nJ2k17J42
3457d4n8n6L71k9j20j26n3K97k58l0Q7rl9J39j39n0L02Nm1J28nn19K63P9P9k82
3483a08J16J92n1q6j03R6j31l02L07k37L65j22L3j44P0M3j43K35j66K83k09o6
3505a28R0J93l77nj09J77O9MR8k40M10n4q8k4r7Q3N0J7j80J27o4J27R7l02K19
3530I3m7j92J58q8L24l2L0j53j80J68l02K38J8k00O2MK75j9l05L70l03k05O08
3553C22k51k18J63j70L39k58j2R3o6K75k70Rj04K65k58Q9J11j24J23k1o7J91j99
3576c8j44J76m0m5l0J21K8k96P7K54j46M6j58J57Q5o3JP0l59J86J09l8p2j02K33
$$ y = [6, 153, 34, -16, -37, 74, 85, 139, 71, -103, -68, 108, 20, -96, -112, -220, -29, -102, -120, -222, -239, 35, -192, 47, -270, 151, 122, 115, 101, -8, 15, -58, 405, -89, -248, 178, -56, 299, -40, -154, -102, -98, 47, 55, 3, 24, 19, 31, -186, -44, -102, -158, 213, 184, 64, -62, -115, 182, -76, -106, -19, -28, -67, 72, -67, -117, 185, 190, 149, 277, 272, -247, 16, 95, 174, -108, 8, 200, 149, 63, -40, 56, -75, -377, -70, -307, 58, -64, -31, -175, -105, -62, -205, 30, -136, 147, -62, -128, -38, 155, -222, -227, -336, -159, -90, -86, 12, -228, 182, 128, 40, 16, -81, 2, 52, 69, -111, 16, -48, 79, 176, -126, 93, 46, -146, 12, -76, 248, 216, 246, 93, -87, 81, -221, 17, 35, -165, -103, -99, 176, 157, -148, 222, -81, -286, 322, 71, -147, 16, -154, 185, -73, -85, 8, -58, 217, -53, -44, -148, 117, -141, -52, 59, -65, 58, 37, -30, 161, -38, -182, -6, -46, -91, -121, 0, 28, -268, -191, 63, -83, -37, -195, -38, 47, -16, -15, 55, -304, -118, -9, -47, -119, -221, 12]
3601A2k95L96M9j31j15j88J31R3K51n18L71Q5k99J80J23k25L34l56K55O1j55k38
3623a79N24k38k81r4n4J23R8M68j91l96M60l5k76K2j48K70no5m9l1k9J22k53J44
3647i3j21O8L05KJ8j06k14K30k78K11k8j95M42j40o6J32q3j58P7K00l34Q4K46
3670A99j02j74J81pj37lK2K14k89O8j12J73J26l1P2j7k47o7MJ40j81N12k22J15
3694B37l0O2q2n9k19KJ35K28j80o1r1r1K25j33L7k4P0k80M24k72k3M10r9k10q8
3719a12P4J48j79L62k63J85l10r8J29j5L58m02K42MK03k13l09L10J61k33o3j58
3741a79K23K3j07P6k48L38R1j26m09L58j27j64L44j51N2j01K48J51n08L26l92
3762b82L86k26K20l36L1K55K02j90j51J26q2j22J15n9J60j02j65L2K19J4P1j27
$$ y = [12, -283, 113, 162, 31, -84, -272, -141, -48, 203, -315, 56, 141, -158, 22, 145, -80, 254, -102, 153, 214, 59, -179, 345, 107, -174, -268, -322, -199, -101, 367, 176, -220, 240, 205, -71, -49, -197, 73, 68, 3, -46, -77, -106, 16, -237, -93, -214, -146, 159, 161, 179, 73, -141, 89, -189, 22, -6, -201, 241, 101, 35, 167, 84, -74, 3, 203, -131, -47, 199, 97, -77, 104, 97, -40, -43, -21, 193, -96, -28, -140, 33, 159, 128, 200, 183, -64, -131, -127, 13, -168, 344, 122, 237, 207, 269, 187, 128, -91, -89, 46, 274, 94, 33, -58, -149, 76, -57, -20, -44, 26, -254, 170, -102, -125, 285, 186, -24, -112, -38, 110, -69, 293, 30, 215, -95, -193, -64, -79, 279, -123, 119, 123, 326, 113, -196, 114, 275, 42, -21, -179, 44, 67, -40, 36, -212, 126, 217, 91, -318, 40, -87, -251, 93, -58, -6, -107, 141, 292, -216, 110, -282, 104, -122, 98, -238, -207, 48, 250, 60, -91, 35, -47, -169, -54, -113, 47, -55, -220, -188, 31, 45, 116, -11]
3784a1n6o6J08k2J27J20j61j2N1j93n1J50M2j6j57J26P6j6k98J72J12Q5j19M3
3808C4l4l5r0n7J00J44j52l5lK2R1J05K57l86k0n2J37K16l94K05j63L55j20p3
3832E2n9J01Qk29m6L40k43j40L90k53o9K68m5j81qJ91j75K04P0o3M9j70K94l40
3856e4M6K02n0j19LJ50Rj67k10L44p3j20n2j67M09j57J06k34K31M0m38L47j16
3879g0M0J51n0j23Q5n0J61l66M61k01m4L6Qq2p2J66R0n7j55J78j28m7K58j72j44
3904a27K61k50K50q3k41j64O46l71J03J4k84K04j0K35o6k91J10o0J23m1j15K07
3926E0j03O7K13k70N1J15n3m5o2k66M32p7k9Mm0Q2M7o1o0q0J61j84J41q3j14j17
3952b81L13J30p6j28j05L91l02K18k99J52j12J87k79K15k08L9K89k88P3l1J9K92
$$ y = [-11, -67, -133, -25, -47, 80, 200, 39, 27, 78, -115, -166, -16, 26, 10, -147, -21, 55, 39, -259, -87, 25, 110, -9, 34, 0, -35, -125, -182, -82, 62, -90, -125, -128, -106, -15, 90, 347, -39, -59, -111, 26, 242, -152, 53, -110, 245, 125, 52, -7, 94, 102, -127, -173, 167, -76, -216, 174, -79, -148, 120, 75, -106, -114, 77, -98, 106, 176, 113, 162, -8, 286, -54, -8, 194, 144, 25, 28, 178, 187, 20, -190, 154, 81, -39, -91, -258, 151, -6, 100, -134, 97, 137, -301, 46, -70, -30, 121, 71, -52, 33, -17, 144, -222, 239, 38, -6, 30, 38, -44, -116, 50, 140, 83, -72, 106, -22, -69, 189, 17, -127, 134, -116, 134, 51, -190, -354, 292, -79, 24, 38, -246, -42, -52, 183, 117, -174, -64, -124, -1, -42, -157, 50, -53, 14, 227, -43, 8, 123, 70, 25, -37, -303, 129, 52, 23, 27, -13, 69, 116, 55, -5, -85, 76, -108, 33, -50, -164, -281, 32, 162, 86, -42, -147, 244, -58, 160, -139, 13, -99, 88, -191, 24, -184, -145, 144, -144, -71, -102, -83, 209]
3974B09k82K5l0J98j93P4j5k8Q4J0Q4k37J15L1pk31L77k29q3L78j87j56J04J79
3998A90j69lN2N8o8R5k53J96j91J29J0K68j66j00r7k35L43%j26L2j93K82p0K85
4022B69k86O4j12J05m0q1J06k6K56l10p7j90L41J45j50p1P3K53q0j14q9j21J83
4045D8J22J30o1m97K62j24K8K46k94J93l20M04j63J19j94j86J68R1R6m1K1K6r7
4068b3k01J13K63j67j17QJ09J82k02O9k3j14J00N4r3J92J0J1k62K31OJ0n7J50
4092B49k11k61J61q0J24j86L28j60j02P1l9R3M7j85J91j01J44j03J19J4q8p9K5
4115b9N1j33M15j13j77J8l1j2P8J8n0k63J96J83p6o9j40R3j7R8m6p7P8J17k69
4140a57K43r1J14l2M2n2K16k2l62K64J23m61K12j01K29M5l18L31k03o1J29o6J80
$$ y = [209, -73, -48, -78, 120, -73, 1, -14, -42, 42, 52, 136, -101, 14, 45, 38, -193, 184, -45, -128, 250, 63, -93, 11, 190, 21, 18, 70, 128, 60, 155, -98, 98, -93, 36, 46, 314, 148, 48, -49, -284, 59, 59, -67, -35, -228, 54, -16, 269, -17, 47, -65, 40, 0, -81, 25, -1, 255, -55, -132, -322, 19, 164, 14, -57, 16, 269, 189, 75, -14, -135, 48, 170, 300, 239, -258, 4, -120, -92, 154, -140, 53, -267, 137, -26, 93, -101, -287, -119, -28, 68, 27, 48, 74, -23, -224, -111, 152, -15, -132, -124, -15, 167, -35, 34, 11, -103, -3, 51, -42, 150, 160, 171, -91, 140, 146, 156, 99, 249, 38, -223, -62, -142, -18, -204, 124, -36, -138, -67, -106, -13, 34, -151, 40, -61, 83, -20, 99, 113, 25, -54, -29, 22, -111, 304, 191, 14, 32, 1, -11, 67, 85, 35, -228, -32, 151, 75, 6, -134, -41, -58, 40, -6, -83, -5, 112, -157, 86, -5, 109, 77, 119, 67, 283, 261, -101, 163, 286, -175, 37, -64, 165, 210, -108, 223, 20, -41, 88, 22, 202]
4163B02l29J35j45K47j47j02K00j80J73L8Onl55K31J92k79K16j55N5J54j1j6l22
4186a97O7J53j75L15m57L8K85l7m0o8k3L47k83L4K93j06P6j77o8n0J31o8J83j4
4210A59k33p2L36l62J92k31J86l6P3j07K05j79J49l03M26j69K17l67J86m0j54
4231a24o3K18O0j96L42l58L02k83j08J92J03k4j67N5K67l77M6J41j05J32N9j10
4253Bk70L19M3j1m6j67J33q6L3j80J90Q5p3J59j61k65J34L10j97J57l69L77M1
4276A58k3k44q3K60l7j03K12l67L41k45MK58j88K28k98J67j24Km2J80M6P0n2j16
4300Dj18R0P9K9o5Q0o9K21k62m7l1m5K9K27k7k30Q1J95j27K9j21k67M75k0n1k23
4326a64J35J26p5j65J69j04M1n2J4J41k29J32J60Lj12j19J85J84j84M4k8m2Lk59
$$ y = [202, -127, 8, -137, 110, -37, -139, 61, -119, 54, 92, 98, 93, -262, -31, 161, -118, 98, -57, -2, 152, 141, 125, -197, -130, 23, -152, 163, -294, -256, 29, -8, -48, -116, -139, 208, -75, -41, 252, 146, 222, 45, -23, -73, 58, -10, 173, 159, -74, -146, 190, -172, 20, -211, -25, -61, 12, -95, 110, -69, 80, -223, 203, 34, 251, -116, 70, 30, -124, -187, 31, 91, -105, 237, -121, 181, -102, -210, -18, 85, 61, -106, -51, 216, -161, -115, 26, -79, 53, 112, 2, -268, 51, 94, 83, 37, -130, 3, -83, -50, -230, -40, 45, -28, 131, -30, -295, -161, 149, -48, 109, -260, 117, 158, 135, -109, -192, 68, 31, -72, 140, -227, 114, -131, -127, 131, -57, 171, -127, 40, -84, -82, -124, 56, 102, 172, 120, 4, -114, -24, 55, 84, 19, 99, 30, 251, -11, -58, -89, -134, -105, 122, 95, -135, -54, 141, 14, 43, -78, -345, 130, 110, 59, -164, -29, 97, 22, -143, 26, -78, -37, -89, -75, 66, -163, -31, 129, 132, 20, -99, 86, 270, 86, 130, 102, 60, 63, -196]
4350a96J37m8J75J60k29k2O0pl9R4Q6k57K16k81K25j35J25j52J24r4P5j08K16
4373A25k10J70J39l20o5K7o0J64l2N2r4K87j55O4R1or1j97K93k80j63K80j76K65
4397A08k23R7j01j23J72J05L1M0j45K59p9k00J20J63l16L02m7k02J23r4j12J22
4419@K16q1Lj86Q9j67j03L53J1k19K15k49r2Q7K80j36K22Q7l93L0N4j90L8K14
4443H3j69J86j07J11j05q8j9K05p1p3L7n4N3J3p7J63j45N1p6J46j86J20Q7Jn0
4468C6q6J25n1K82k76J67J5l08J56k20L6m1M6QK71j80J76j36O7k99OJ5J88PK2
4493B6q4k6j3J64j73M52k22l29L55k27K78j90O7Nl4k08K00j49J41p8R4k03K60
4516A06Q3j23jJ84l35K38k45j0J14j0k6J60k26K4J81l06J41m8K2O0Q3L2Nk84J68
$$ y = [-196, -59, -107, 68, 228, -1, -23, 37, 30, -9, 85, 171, -86, 130, -151, 74, -61, 64, -88, 36, -58, 17, -91, 125, -85, 85, 224, -96, -161, -134, -194, -30, -62, -10, -104, 183, 28, 92, 183, 177, 86, -111, 182, -98, -261, 19, -157, 108, -115, -18, -119, -242, -70, 35, 66, 106, -39, 220, 141, -59, 61, 224, -92, 210, 163, -39, 84, -10, -122, 0, 216, 135, 138, -48, 41, -126, -229, 124, 135, -84, 131, -118, -210, -123, 157, 21, 243, 330, -63, -33, 21, -169, -131, 83, -86, 100, -7, 104, -1, -89, -108, 97, 26, -47, -10, -64, -11, 2, -75, 88, -57, -6, -82, 64, -122, -2, 85, 86, 36, -50, 75, 24, 306, 30, 197, 212, -96, 60, -160, -124, -165, -119, -111, 160, -20, 156, 20, 87, -212, -206, -191, -3, 4, 26, -58, -84, -97, 67, -106, 346, 124, -205, 150, -77, 201, 11, 78, 83, 49, -159, 41, -108, 33, -45, 49, -154, 106, 189, 66, 65, 249, -86, 152, -93, -103, 11, 1, -25, 135, -91, -67, 114, -192, -51, -99, -77, -17, 66, 98, 103, -181, -13]
4541a3l90M06j0%J67j18j43J09k50P5k6N1N4M36j30j84M6J31o6j65j01J01l7O1
4565DP7k2N5j24n6Q6o7O1Q9J8N7l40K03j5j87K19j30J76p3l15K68M3j54J85o2
4590dQ0j81K04l69L1L52j6l02N3rK95j56jn1P5K7j97J98PK5q8k29K96j02J3N3
4616DJ34k87j8L1K80j71K8k7Q6q1K57k44L4j44L62k06J80k59L8Pk68K22O7j18
4640i3k7L85l98J46J18j6j97R5j41L5m7M21l07M5j27N1K30k17J26j70J41j00J60
4663A13l2p6j03J46O6M2o9k69K54r9m5J21J17j45M8j59J08Oj04L6J94k76J94j15
4687d7K49k12J3K84l43L50k20m9j14L08m7m9k47p5L26R8j77J94k42j18K12l14
4709b20K82j0k69R2J68j17J51j24KJ80r8R7l19L15O0J7J6m8k68M8l5J33p1J35
$$ y = [-13, -403, 3, -7, -7, 160, 42, -101, 8, -242, -167, -193, -142, -88, 348, 218, 34, 80, 211, 145, -20, -121, -20, -57, 4, 81, 59, 114, -10, -66, 20, -47, 14, 103, 121, 178, -162, 41, 26, -161, 58, -72, 104, 31, -284, -16, 27, -127, 58, -4, 76, -105, 99, -270, -239, 113, 97, -205, -152, -161, 134, -22, -23, -74, 1, 28, -169, 29, 36, 61, -27, -256, 40, -62, -49, 4, 138, -149, -167, -136, 144, -27, 1, -26, 60, -21, 236, -8, 26, -118, 244, 38, 218, -41, -3, 4, -264, -42, 25, -93, -120, 265, -133, 13, 131, 115, -82, 13, -128, -93, -140, 281, -26, 19, -108, -57, 173, -44, 82, -88, 53, -47, 113, 81, 5, -98, 48, 114, 156, 87, -182, 72, -27, -72, 49, 166, 21, 69, -90, 18, 24, -80, -44, 150, -126, 68, -47, 202, -10, 3, 287, -56, 294, 74, 25, -89, 219, 172, 123, -124, -199, 127, 225, 48, 242, 0, -118, 94, -220, 62, 52, -217, -125, 43, -74, 77, -47, -45, 135, 37, 134, -185, 130, 190, 207, 223, 175, -93, -45, -80, 53, -18, 117]
4733A17r9J96j84J00k94M01k09k22K24K3m4L8N0r8J69k60L9O7k3j4mJ77j45J27
4757A32n2j4O2q0K58m83J9J37R3J02j83m4qL04j50jR4l2j47p8J76n5n7m4q7J36
4783bk85J43K99k23K47j73O9K20k77jj13l3Q0n5N7L52j25L9k92j2P3Q8k26J04
4807d6Q9m7L1j72J65q9N48p70O2j15K98K6j25o5L15R5r9n1pj89K88j41J30j11
4831B0K68k39j83K76m0j76R7J7K12j96L7J32j18l5j49O5j06K86k68K07l27K44
4853B4o6k69N45j24l15Q3PL28j47r6K23l03J43K1K75k58J08n6l87L49M2k71K76
4876A32k20L14j74k43K34L5k59J44P7k76L22j46K48k14O9l6j8j61L40L9l57q8
4898b38M42k04j65N10K6n13J18r7O1K28k35L6j32J38Q9j54J65r0K2l0j06J14J0
$$ y = [117, 18, 214, 30, 130, -164, 237, 28, -194, 30, 53, 9, 47, 97, -1, 168, -92, -53, 14, -9, -23, -27, 150, 5, 132, 80, 66, 128, 48, 306, -177, -158, -21, 72, 174, -9, -53, -61, 243, 93, 92, 186, 154, 7, -71, 105, 50, -7, -51, -138, -2, -287, -144, 155, -68, 179, 6, 75, 295, 18, 17, -96, -129, -49, -104, -47, 305, 180, 219, -73, -85, -12, 76, -150, -46, 43, -4, 27, -145, 20, -69, 479, -291, -229, -344, -46, -20, -145, -210, 105, 200, 101, 50, 43, -146, 142, 1, 131, 20, 288, 49, -134, 142, 102, -74, 23, 40, 252, 56, 93, 225, 107, 72, -77, -12, -118, 168, -100, 107, -220, 24, -42, -311, 234, 110, -205, -122, -115, 213, 66, -30, 193, -110, 33, 54, 329, 71, 179, 123, -264, 85, 127, -144, 132, -88, 226, 52, -191, 43, 78, -181, -37, 40, -236, 86, -60, 188, -26, 43, 7, -11, -172, 168, 207, -150, -238, 204, 0, -165, 345, 371, -142, -24, -121, -60, 168, -67, -31, -163, -25, 64, -90, 75, -15, 7, -23, -129, -15, -5]
4921el8jl6J04J42k04J61K80k01l87L78k69K14j61j3l81K00J45p7J58p8K98l26
4944i7JL1K0n1n4K48k3L8J1m4j09Rj20j21K84M3j95L40l52L2Q4J22r3P2j09LK17
4971A87j70l3P6k02L19k80K52j88O6L1j42p7J45L3j73L06l44O1J31J19j11j91
4993a85K01K33k63J45p3K8P9j06j69K5l1P4L04j74k51J24K20k23P4j2j45Q9rj04
5017a49j10J66J25n3Q6J86P6j29k24jj33J71J28j90K05k82K48r2j56O7O7N6l32
5040b70K51p1j87L93j98L24m16K05j10rJ18N1k71L36j11n8p4K19k30j76K30k4
5062g8K43k58J77l6K2j39L36n13J73o6J60L50n38J93j26N8l0J01r3O6n8Q3q3j64
5086b20O7K94j69n2J10M9k8o0O6j34O4Qj7m7J28OJ26p9k35J17L7Q0Q0l62J06J18
$$ y = [-5, -43, -44, -80, 24, 166, -38, 123, 403, 202, -185, 193, -76, 138, -23, -36, -417, -217, -72, -149, 9, -69, 229, -97, -96, -65, -45, -96, -150, 98, 75, 113, 124, 80, -29, -20, -140, -261, 23, 66, -129, 211, -141, -109, -25, 97, 4, 76, -33, -30, 187, 17, -16, 60, -142, 177, -103, 149, -39, 27, 58, -84, -161, -16, 17, -156, 150, -194, -133, -2, 117, 6, -185, 16, 249, -14, 131, 58, 86, 165, 59, -110, -85, -116, -42, 262, 88, -163, -39, 181, -42, 32, 20, -125, -36, -45, -149, -259, -93, 32, -21, 65, 251, 327, 198, -26, -27, -160, 11, 139, -51, 154, -128, 120, 28, -128, -61, 6, 62, -270, -19, -90, -277, 116, -82, 242, -174, 31, -79, -88, 30, 81, -190, 146, 35, -23, -97, 122, -108, -284, -54, -78, 165, -93, 84, 48, 70, -69, 267, -246, -73, -139, 21, 371, -167, 26, -100, -42, -72, 29, -64, 2, -56, 27, -56, -220, -153, 141, -28, -80, 30, 79, 51, -9, 57, -77, -13, -5, -22, -69, 59, 65, 191, 112, -123, -6, 31, 111, 191, -171, -65, 53]
5112E3o0R3k23P3J51k13J15J83l68K66j8J72m26J34m5J37K5q7l6M0J35l0r3J37
5136A15l1J33R0r3kj70J5l3p4l8N6j64K70n8n6K82l9l05J45kO3n0k6J62j52k2
5162A6J46r0p3j04N1J74j64p7N2l0O0k50M31N3j76j57K31Pk51K03Q2j62k84K28
5186h4K08n2j98K41q0l8l16K54L87j52r3oP9m8Nq4k46M52l05P4L4P1j56L0j8J03
5212F2k94L45k41K03M7q4J4k32L18j10N0R2k06Q6p1j35J35m0j2m0J39j42m4L77
5236B17m86K75K2l06K30j18K34J23j52K1k33K11J05k2j47J71j18k9k2L11k38M
5258E3k77K40L14m51K45L9k40j07J94l5M3Q0k57j42M41j80K07j99j12J08J39K3
5280A26N4k87j95L40m2j6k67J09R1M8j21M8J65M5J07m28M8O5K44r9mk7k5m3O7
$$ y = [53, -7, 86, -137, -64, 87, -126, -11, 172, -196, 70, 52, 224, -202, -68, -113, 24, 49, -38, -74, -34, 101, 71, -22, 115, 84, 217, 307, 214, 212, 42, 57, 24, -50, -88, -32, -196, 74, 16, -40, 242, 203, -102, 43, 41, 104, 54, 28, 190, 38, 16, 162, 72, -1, -105, -54, 120, -44, -121, -69, -99, -39, -289, 142, 195, 19, -138, 93, 100, -151, 52, 134, -28, -312, -84, 124, 72, -126, 115, 35, -3, -319, -65, 322, 170, 77, 71, 150, 102, 107, 23, -223, 229, -76, -2, 32, 103, -53, -23, -41, 62, -232, 113, -128, 75, 122, 38, 52, -180, 138, 28, 78, 170, -36, 50, -21, -156, -21, -61, -73, -113, 26, -116, -160, 217, -269, 6, 28, -278, -48, -166, 68, 191, 39, 60, -173, 38, 143, 121, -26, 145, 27, -2, -24, 287, 49, 53, -224, 16, 330, -121, 124, 163, -77, -184, 10, -25, 18, 98, -159, -301, 140, -40, 167, -32, -144, -36, 103, 126, 180, -107, -302, 38, -4, -20, -287, -178, -87, -39, -160, -112, 53, 98, 205, -223, -175, -110, 134, 35, 31, 4, -21, -64, 3]
5305CM0K09k95K36j43q5K08j46M6o0J30r1J3K03j89k33J19L1Q9j86L22k12L8L3
5329H0Qk5j17J9r1K72k35J72q8rM9J69m94K38J84j68M6k5J14l4M3j27j47k61M19
5354hK26j18q3mj44p8J62J78o2n8j38J33j30q6Q2l7Q5M6o8J50pO4j91N2Q9l2k44
5381b21J35J87o3Q3j19J92k13J39J12l39Q5J61j57k3R4j00K2J41l07J52k1K96
5403B36k90j2J48J20l51J6J66q4J48%J24k28J17K7k65L61j96J17j77J86o6l34
5425b37L36R5l85J05J14k52J90M7q3k57J13K24J7l4K7L0J18K2j31J26j15j01j26
5448a57K47j12rj14J71r9lL6J6Q5j76J64k46K34O0j13o0R3k8Q9k5j2j01r6K85
5473A29j73j9L03p8j7Jj65nJ33q6J57j87k8l8J30K25j11n2j28J36M4l00j07K82
$$ y = [3, 43, 252, -43, 193, 50, -35, 173, 27, 73, 13, 143, 52, 65, 268, 79, -154, -35, -4, 85, -101, 221, 9, 47, 80, 88, 63, -54, -35, -126, 146, -89, 83, -5, -14, 35, 204, -290, -52, 132, -36, 10, -15, 99, 65, 108, -19, -166, -427, -8, 218, 100, 17, 13, -131, -209, -47, 131, 69, 11, -127, 6, -124, -210, -128, -165, -80, -34, -102, 48, 41, 105, -86, -34, 55, 23, -221, -86, 101, 38, 121, 2, 194, -19, 120, 232, -107, -22, 139, -18, -41, 53, -47, -25, 116, -191, -39, -60, 236, -54, -66, 82, 202, -149, -133, 33, -51, 97, 97, 221, -7, 110, 137, -128, 233, 37, 154, -23, 163, 97, -237, 99, 194, -191, -86, 28, -224, -34, 13, -70, -327, -214, 10, 27, -7, 20, 50, 168, 190, 59, 185, 70, -31, -157, 90, -22, -31, -145, 26, -73, -76, -40, -24, 61, -115, 49, -197, 37, 97, -16, -76, 17, -11, 78, 53, 41, -60, -156, 129, -44, -63, 240, 162, 145, 146, -19, -24, 109, 23, 180, -7, -35, -73, 57, 282, 171, 119, -9, 127, 171, -129, -236, 46]
5497D6n2R9k81L53p6l04q4M76J1k20J25j16J31j94Ll10M81r8J44k91n2L09j87
5520h7K50K5k53J03J96m21J24j1J53j52k61K74q1%J72k4P4L6j60J10k12J03P3
5543C1k54K19K15m32K11k76M22Kp5k9J71j45P2j36j68P6N7P7j18jR0J9j03J7K19
5568A61j90J80j38O2J02k95L05j48J24j57J0o2J49p6P4k36R3L6J8L4K6j74J47
5591D5j21oP8R2j22P9J52k78J61r0j82Q8J6L39k18N5J19j41K3J12o7l9K11j66
5615A40k14J68r5J10j75q9J53Qj45O9m6Q4J0k06R1N8K23n3j85O4L3Qj0j61J67
5640Gq9J15o3P5p0J49j56N1J89l18M4P8jJ7RmK7n0p4J28l3j58L12j27k88K17M4
5667C1p6Q0mj48K09Ok31j00M1K69p1J19k24L8k4m59Q26l39K38k50o8K67j52q8
$$ y = [46, -6, 93, -188, 165, 89, -215, -299, 177, 188, -32, 93, -23, 108, -86, -83, -393, 88, -10, 134, -157, -209, 100, -87, 163, 188, -65, 38, 234, -187, -63, -74, 79, -73, -334, -60, -141, -141, 31, 7, 81, 117, -43, 67, -145, -42, 31, -223, -4, 211, -221, -10, -286, 136, 138, 63, 34, 205, 60, 132, -4, -172, -96, -39, 38, -80, -81, 9, 28, -75, -58, 161, -29, 151, 13, 75, 177, -118, 187, 39, 163, 6, 16, -46, 103, 27, 101, -135, -42, -6, 12, 46, 72, -102, 45, -76, -82, -4, 88, -34, 45, 197, -81, 80, -10, -192, -104, -88, 251, 33, 88, 207, 66, 89, 201, 134, 95, 306, 140, -74, 94, -1, 109, -66, -155, -2, 6, -139, -70, -116, -32, -22, -228, -137, -79, 144, 91, -94, -30, 3, 11, 1, -160, 7, -82, 33, -30, 45, -25, 124, -32, 19, 208, -110, -66, 12, 11, 28, 37, 33, 60, 10, -64, 64, 31, -127, 185, 58, -230, -13, 31, -45, 35, 31, -117, 92, 98, -133, -233, -192, 77, 6, 125, -99, -61, -85, -544, 282, -57, 181, -69, -137, 130, -22, -110]
5691a10Q2J37p7L77n88K26k9n8K70m9j37j02k04L75k06R0j1r1K80k44J33l21K43
5714a4J03j58J9PJ19j47J59r4j01K5k32M03j32qP1J67n5p1R7l14K52N4k53K52
5738A49k04K6J49l51N5K48k14K03j66q0q5K61mJ34l81K91K11k74p1m9J76K29k80
5761b7j18n3L45k33K08j28r7J20J26j51P3O7k97L5K54k20L70l78J44j07j77L02
5783E8j56j79M22j01qpj27K22l01K40K2L3Om8p1J11K5l87K76Rn1K10q5J66L0k42
5809F7o6o4o6L17k53R0j60J62j02n6K34m15M55j29K31m59J8L76l29J07k9J71k6
5832G4j32Q2O2J00m0q5O6k45k69L63m08K16K68LJ47m15J1K82j77J85k7K5K70r3
5856B63k37J69j31l13L48l4q0j37K55j7j00Q8p8k13L30k33L3J97j07o6J36m47
$$ y = [-110, -28, 109, 32, 409, -179, 47, 18, -40, 230, 181, 44, -58, -262, 113, -93, -3, -14, -105, 175, -69, 64, -257, -14, 89, -69, -50, -43, 76, -71, 88, -6, -107, -82, -314, 89, -43, -51, 20, 187, 132, 61, 158, -156, 96, 150, -103, 149, -55, -29, 120, -231, -176, 72, -142, 61, -105, -185, -270, -9, -13, 121, -260, 31, 242, -32, -103, -152, 24, 253, -27, -145, -198, 147, -86, 122, -6, -103, 17, 143, -8, 65, 132, -165, -130, 124, -96, 274, -104, 40, -67, -244, 58, -98, -277, 145, 44, 36, 29, -98, 124, -177, 63, 85, 118, 124, 76, 5, 116, 141, -246, 30, 39, -12, 198, 113, 279, 309, 67, 1, -63, -129, 188, -65, 25, -135, 27, -75, -131, 103, -312, 143, 14, 245, -214, -196, 180, -149, -42, -71, 100, 74, -58, 24, 86, 186, 146, 61, 127, -118, -387, -24, -432, -216, 52, 55, 202, -213, -202, 80, -97, 88, 61, 86, 356, 263, 26, 195, 64, -249, 99, 65, -15, -152, 103, 86, -14, 74, -4, -217, 113, -120, -87, 110, 3, -63, 73, -374]
5878c74N05k53n2M5K37l9k35J37L41k07j76j27J78R3k23L82j31k11O0o2l1J47
5900Dj56K06M1j5o2J03j30j2j39L57k93J7J49l59L64n0J95j65l3k22K44M4k64
5923a76K72k19K08n1P2L1m3k50M44r0j00P7k48K31j55Q1j02Q2J37k80K67J0l25
5946a27J87M7l2K15l18M1k07J60R3J05m7j47p0N8j77K16J5j1k17L50l5Q4k02k5
5970d4j50L63J9k0l55j1L31k50J41k34L99k36q4P7M15m34P1j16J40K4q4O1j09
5993h6pj15K05o4J30j10O2O4k06J52j99J70%RJ79k95J45j36K0q7K75j68K46k33
6017d9Q3Lo5J50j00J9nj8k74M78j81J51k27J28j49K10m8p9K13k27j32O6k26K38
6041d1n4J00p8lJ65l00J78k50K06j20J74o7J92q3m0K04l15K87p9l10N09k45j92
$$ y = [-374, 131, -122, -174, -129, 108, 69, -166, -29, 312, 105, -71, -198, -20, 73, -150, 232, 101, -110, -50, -112, -143, 4, -152, 54, 95, 80, 18, 121, -9, -21, -160, 197, -96, -79, 70, -289, 75, 25, 220, 55, 22, -200, 44, 88, -176, 96, -123, 85, 34, 106, 137, 94, -156, 288, 198, 98, 175, -73, 158, 3, 84, -18, 64, 201, -79, 188, 198, -127, 60, 107, 75, 290, -28, 13, -194, -34, 59, 164, 117, -30, -100, -42, -219, -3, 12, 1, -216, 134, 99, 183, -19, -44, -194, 169, 188, 168, -187, -198, 133, -117, 24, -210, 189, -47, -131, -54, 361, -73, -2, -118, 22, 46, -38, 23, -86, -93, -208, -3, -67, 63, -47, 15, 79, -127, 25, -174, -4, -4, 5, 184, -111, 34, -102, -82, -169, 106, -62, 184, -49, 34, 37, -28, 122, 22, 41, 36, 18, -256, 222, 41, 192, -35, 93, -56, 154, 106, 27, 240, 13, -119, -53, -279, -41, -95, 5, -73, -76, 89, -211, -33, -283, -77, -197, -23, -90, 102, 19, -21, 183, -132, 155, 76, -234, 275, 30, -162]
6064a62M5l2J4K28j86m5J46o7J13r3J59k50J55K5j3J09k57K17k24l0m7J92j77
6087a80o1J17L85l83J55P3j60K01k61M3K76N0k61k15L41J52k88j46J53j43J89
6108C7RJ08k11K03k09j08K57m24L44j34J38k11K50k42J99Nj72K46k30J4L10k30
6130e1J05n0K5l03K05j5n5M5J62k15J81j10p9J94O8k55k8M16l94L04J14j67k93
6153a96J79R5p5m5j82J58l7O2k5J79j12j1j8l66M40k33m6K92k99Q7K98j29o7K03
6177A52R6k15J62Q7k36J43l31K06k71M51l12l2L29l02Q7K10l07J6P4j9k2j75K73
6200F4J17k51K32%l13P3J3J63k05o2on7J81Q8k18J43J86k38J43l5R4m8j48J68
6224H4n4j7j75O2O1R8R3k35L4j61L5m7K75m9P8r9P9o6j75L9J83j15k9j7K25j85
$$ y = [-162, -117, -149, -135, 93, -93, -138, 8, -59, 54, -39, 120, -130, 25, 50, 37, 146, -111, 106, -118, -148, -195, -3, -180, -241, -124, 261, -122, 33, 106, -54, 147, -114, -71, 205, 255, -6, -221, 120, 272, -16, -162, -9, -152, 37, 46, 154, -57, 146, -63, -171, 86, -338, 6, -128, 10, -201, 49, -193, 6, 11, -161, 85, -145, -131, 179, -51, 54, 4, 29, -274, -69, -84, -139, -94, 68, -147, 34, -76, -155, 39, 107, -148, -176, 240, -154, 150, 264, 97, -196, -17, 78, 3, -42, -224, -66, -103, -41, -66, 113, 1, -10, -28, -394, 46, -187, -233, 59, -240, -153, 145, 16, -51, 152, 248, 33, 195, 282, 46, 189, -142, 64, -207, 244, -68, -100, 229, -73, 14, 224, -83, -67, 7, -12, -34, -209, 64, 181, -70, 162, 162, -151, -78, -65, 98, -107, -169, -175, -232, -51, 37, -181, -38, 148, -90, 53, 18, 112, 64, -84, 84, 30, 13, -162, -100, -39, 59, 152, -83, -49, -210, -175, -222, 53, 4, 82, -17, 62, -4, -179, -140, 43, -72, -101, -118, 107, -78]
6250g8L5J79j38J12p1k12K50k79K52j6j09K83j54l5P0j25J21j32K24j32Q7k07
6272g5j05L06O9j07j2k82K64J00j10kK26j85k86K89J09j30l41N5L33j36K98m41
6294a63J99P1K5k10r5J51J17j28O7J03k50J64j89K38l9p8j88K84r4J8J48O7k16
6317Bm2m2J33r4J6PQ3K3m00J65lO6p1K0K07j02j10K36k9k00K15k0k11P3j60M62
6343B24k66M9k54J9K20r9J27L2J75k77J22qj35l0J81j47r7K17Rk2m1p3Q0QJ54
6368A68k56j8m6J92k22K72r0k31J30o4k0J37P9J87j51l9J43Q2j79k22J98j80P9
6391e1J54k8l6nO2j82J48j8j72J09qL2j1j3J37j54J31r2j79M8J18J59k94R4O2
6416A1J65j93j21K30j08J0J5o6J69k25J19m24K18P1K62j12O0o3J72j54k27J29
$$ y = [-78, -43, 136, -2, 110, 39, -173, 77, -202, 50, 34, -75, 208, 54, 19, 89, -36, 85, -47, 177, 45, 132, -75, -180, 126, 195, 88, 76, -206, 58, 158, 48, 46, 272, 87, -199, 90, 199, 69, -272, -217, 116, -20, 278, -163, 36, 107, 132, -78, -173, -22, 95, -33, 34, 137, -113, 51, -138, 100, 61, -17, -205, 79, -15, 3, 151, 218, 2, -40, -82, 51, -43, -27, -20, 63, 86, -314, -149, -152, -86, -157, -137, 70, -32, -142, 94, 65, -135, 80, 60, -151, -78, -238, 224, -42, 7, -247, -228, -8, -107, 20, 52, 227, -50, 72, 64, -71, -101, 80, -67, -164, 53, 62, 40, -1, -74, 6, 14, 168, -88, -106, -152, 40, -182, 90, 0, -231, -101, -165, -185, -48, 31, 218, 67, 28, 171, 253, 74, -148, 50, -130, -51, 103, 75, 39, 34, 96, -86, 62, 44, -128, -19, -27, 5, -6, -19, 118, -36, 95, 3, -176, -128, -10, 149, -145, -51, 11, 176, -17, -138, 92, -16, -6, 9, -57, 112, -113, 6, -418, -200, -129, 133, 21, 81, 18, 190, 36, -191, -62]
6438f2J65j65o9R8J7r0L50l13J06k8J06k10j92J54JJ71R7l9l00QJ32K74m48K98
6462F1j05J3j42L37k54J43Q1l33l6J16J63j02O9m72N67j53k97O53j97m20N09l80
6484a79J88J15l79Q5J75o3k48K60J3n6%J44o8o8r5k9J05k2K46j24n9K32R2n05
6508b40L27J21j84Jm6j50K15l8L3J2JJ8q5k25K44j83K28r5J56K3l4j76o7J18k36
6533b62J24p4K42L2k68J61J76k04J10K3k36L35m6k6l7k86P0K06M0q0Q3J7k58K65
6557A07j64J77Q5j70N8l21L22j17J72k48J45K21j47j77J88j90J60j84L8J20k70
6578a95K14j51m1K69j52L07m2k53j0k16L07p6J90j45j4K9j00K43j51j22L4J27
6600E2J82m36L04j37K10l45lL61l66R2L9k18L73m10K84J26m0J35l44J67K90m63
$$ y = [-62, 103, -62, -131, -33, -16, -106, 244, -69, 37, 9, 115, -95, -287, -133, -132, 39, 136, 97, -203, -195, -63, 211, -237, 61, -44, -31, -173, 164, -90, 53, 134, -199, -235, -119, 44, -58, 11, -461, 106, -47, -344, 309, 112, -308, 201, -179, 9, 124, -255, -170, 5, -58, -306, -46, -33, -89, -89, 55, -13, -81, -176, -205, -100, -122, 124, 0, -59, 173, 265, -240, 87, 208, 24, 25, -21, -171, 44, 6, 39, 51, 52, 70, -15, -240, 4, -179, 49, -46, 110, 133, 99, -77, -144, -26, -262, -138, -212, 30, 62, -206, -45, 131, -73, 37, 60, -176, 159, 113, 87, 50, -236, -166, 40, 80, 0, 83, 100, -158, 107, -57, 120, 205, 35, 93, -228, 94, -23, 149, -99, 46, 267, 120, -57, 131, -59, 101, -83, -45, 75, -195, 19, -132, -173, 96, -56, 251, 209, -44, -54, -270, 37, -39, 151, 6, -8, 21, -79, 164, 13, -109, -75, 52, 234, -202, 102, -35, 175, -170, -173, 188, -178, -86, -47, -265, 108, -302, -18, 108, 68, 203, -141, 26, 316, -147]
6622a47P2k05K88p5NO0l51M11K1q4l26M37j27j2Q4jJ11J09k12p1j68K22j80M65
6646C26k11j53l3M6Jm2q8J17q2J37m9Mo4J92j14M8J31l03J95L1l3k19K3K90j78
6671b8j30J82P4l61J90J68j23J42J81m19K90j69k0K33k27l7p8M9J88n5j62K90
6693A78j86p0J21J5M5j13J75N8l18o3J40R5j53J57j91j72J84r5R7L09k02j1N1
6716E1kj58J72k3N4q9L25l34R8j7m8M9R7L3j21J63k76L9K31k39K2Q7Q9k56p9R4
6742c8l3J24L4o0k21K37n7J00p7Q0k84L34l95K13J80j80J81j82J7MJ14j36k05
6765b50J23R9j1kM0j3O2m1P9j36j63K28Ml1j58L32m3j43N4L6o8JQ6j42L2K3J4
6792A2n3J18J19m55K37j0m7q5j5K7M5K20J49j03l45M7K07ro3p0K72N5l06L3L8
$$ y = [-147, -75, -280, 8, -67, -62, -2, -353, 58, 79, -5, -331, 106, -21, -33, 51, 50, 161, 270, 58, -13, -181, 41, -139, 326, 115, -38, -71, -25, -24, -66, -154, -37, -119, 18, -31, -27, -91, 101, -13, 35, 166, -137, 58, 89, 56, -163, -140, 150, -28, -158, 24, 98, -263, -73, 95, -28, 114, 295, -124, 166, -3, -23, 210, -17, -54, -132, -83, 105, 50, -112, 178, -8, -78, 43, 58, 103, -10, 165, 223, -95, -158, -18, 77, -76, 81, -110, -282, -98, -193, -96, 213, 11, 0, 51, 49, -109, 63, 40, 94, 5, 330, -4, 94, 77, 29, 78, 175, 208, 87, 250, -26, 13, 244, 5, 27, 114, 203, -53, -132, -38, -71, 53, 87, 27, -194, 43, -14, 86, 9, 89, -195, 139, -256, -43, 137, -43, 138, -44, -27, -23, 91, -45, -250, -127, -28, -39, -41, -1, -14, 48, 7, 86, -50, -213, 15, 19, -12, -170, 162, 119, -24, 30, 66, -2, -1, 85, -57, -25, -2, 12, -41, 77, 196, -259, -22, -32, -79, -164, -179, -152, -107, 113, 262, 159, -186, -139, 68, 59, -4, -74, 198, 253, -53, -20, 18]
6817A8r9RJ97pm0l2L9j16j19K05Q4m6k27J66l7k26K78k99J14K41l01K62p4K3N8
6842G1J0k81K87j48P8J32p6r7l9J3PR4k69K10Kk3J94j79L6L4n2j43J82mm8K24
6868B15l39M3K71r9J62l85J5q5J78k29l6K81rQ9j80N9J07L6j44k89L55k4L8j70
6892a40L66l54N3L10k12O7q1j30K51M2l01J66p9J71P8l47J75l8q4K38l93J87j6
6915g1n4m9J83p9j94L3K67j37M4Q1Kr2L62j49j44lJ52l14j2R5J85L3k24L18j39
6940I4k05N7K67l32K09j1l89L43J34k98J89n0R3k26M5J49R4l14K6J60k08L32j59
6963@L7j12K98k75q4k5NJ76L3P3%k66J75k4l04J69R0j2k9kJ27j04O3N8k62K41
6989D6N9j61r4O1p2J83J25j13j89L57k93K09l6Qj04P2M1j44n2K92j21L2q8l2p2
$$ y = [18, -81, -72, 125, 118, 78, 46, 85, -31, -150, 55, 139, 93, -134, 32, -5, -231, 47, -252, -138, 103, -198, 64, -10, 13, 71, 81, -200, 87, -61, 17, 149, 73, -24, -63, -50, -43, 51, -218, -8, -6, -29, 165, -14, 22, 56, 4, -139, 43, 39, -9, 215, -124, -81, 190, 91, 253, -132, -117, -202, -24, -253, -289, -8, -17, 72, -108, -49, 58, 94, -50, -339, 16, -8, 30, -140, 226, -128, -75, 235, 23, 90, 9, -121, 130, 172, -129, 37, -42, 129, 207, -140, 35, -3, -87, 151, -242, -55, -71, -125, -174, 9, -70, -264, -231, 36, -101, -57, 24, 26, -66, 296, 147, 3, 0, 152, -162, -174, -79, 106, 139, -85, 233, 94, -111, -54, 213, -119, 90, 79, -310, 33, 167, -131, 58, 8, 101, -125, -80, 69, 163, -151, -125, 35, -173, 159, 0, 37, -75, 223, -52, -136, -161, -156, 20, 53, 126, 126, -140, 35, 11, -293, -124, -34, -46, -75, -77, 50, -54, 9, 67, -195, 46, 105, -56, -150, -89, -161, 22, 147, 34, -155, 202, -91, 118, 82, 90, -14, 58, 99, -45, -97, 195, 74, 106, 18, -14, -86]
7014h6oJ79Rk88M94j19j05r5J7k61M12j65L7m4p9J67J40r8n9O7k27K41k68K52
7038A15n6J46k38K7q6m5K00J2l0l04J73L01k90N8Q5j15K53k39l5L15k00r8j47
7061a98N9K6m8K31P7j73J30j45j47K86m8p3J0L4j4j36Q9o2K78k35R4j3K4k9J88
7086B05k98P3m6J27j68K74k58J60l1j0K30m05J69m3J51j13P5j61kJ26j62J24N3
7109G0O9j39p3p7rm3N4O9K8J85J0l4j6m66L35j7o3J49m5q5j56N8J97j05J34k34
7135b04j12L08k15L21l00J31R3p5qJ9O3J5J25o0N2M5k41PN2j94P6J3j26K36l3
7160a2k64N93l65p4J05j1K57o4q1n2L85m31J35j22J31j64n3P0jQ9r5m5K92m43
7184b20K53j6p7J38r0j03P1j57K54j96J14j09m3R3O0J06rk69K57j29O3k08J42
$$ y = [-86, -92, 87, 96, -192, 302, 183, 78, -17, 0, -261, 151, -14, 23, -21, -100, 67, 207, 109, 50, 117, -110, 131, -137, 115, 59, 205, -33, -6, -92, -137, 63, 75, 45, -259, -86, 215, -75, -17, 68, -47, 206, -33, -68, 247, 47, -51, -198, -139, -113, -161, 70, 147, -26, 104, -41, -188, 98, 50, -23, -13, 21, 7, -129, -40, -102, 176, -59, 35, 22, 46, 17, 205, -93, -20, -66, 61, -107, 167, -91, 69, 38, 28, 258, -147, 22, -21, 130, 17, 92, -69, -71, 55, -107, 17, 70, 139, 0, -73, -150, -159, -202, -148, -79, -51, 134, 144, 110, 94, -372, -37, -54, -117, 32, -13, -98, -254, -196, 1, -104, 30, -204, -316, -8, -223, 98, -202, -71, 22, -53, -61, -42, 21, 36, 161, 101, 153, 198, -43, -36, 16, -178, -102, -89, -215, 21, -12, -276, 317, -48, -122, -17, -28, 229, 165, 84, 32, 417, -14, 121, -1, 130, -34, -87, -17, -18, 71, -24, -69, 223, -220, 33, 17, -60, 78, -12, -115, -44, -201, 53, -143, -29, -138, -181, -88, -28, 78, 69, -200, 57, -72, -9, -217, -75]
7207g5L36m74N8J77n3N8q7p7J42L6r2P8k96J38J38Qj79L96l08M2J57j08J10k93
7231a68M17j7k34J30l20K96L37k32k41M07m04K5j12J28j01R2m7M9J54k30K09j97
7253e9K05k78L10k91L87j64k36K6lR4K3j50J23Mj18L76l69K29l50L13J50k60k30
7276b68M36l33rK53Q3k13J74J32j30l5m17L29KM3k88K75k38K16n8N8J65j70Q9
7299I6j47R7n0j83K5J25pO3M9k05J22n1J32Pj98Q6j94K34o0J10M9O3j85K23q4
7324A17k28K40j29n5P9j75Q8K36l93L74k78jJ57p4O3j31K18n9o0k64M07o3L7o0
7348D6l97J48K93j25P5j32P2J0J86p7j88m6J78l6j19K02Q4p7m0o0L79l50Kj4J0
7373B4l39L41K4j31J81o8n4k05L26R0j16O1j79J94j63R7o1L0q9Q3nJ28m52J11
$$ y = [-75, 261, -213, -155, 22, -31, 27, -60, -137, 5, 41, -51, 27, -269, -131, 7, 15, -164, 232, -76, -34, 123, 15, 125, -168, 249, 232, -2, 128, -192, 104, 441, 209, -32, 375, -29, -4, -116, 12, -89, 3, -44, 5, 159, -71, 138, -59, 146, -132, 178, -113, 274, 110, -126, -100, -103, -9, 14, -136, -13, -9, -127, 249, -120, 109, -241, 72, 222, -38, -268, 168, -165, -174, 79, 162, -51, 123, 255, 125, 90, -327, 2, 4, 47, -241, 34, -204, 12, -46, 12, 177, 7, 96, -51, 46, -4, -187, -162, -37, -44, 19, 68, -137, -15, -66, 66, 73, -125, -39, -233, 1, -59, 51, 100, 163, -22, 201, 117, -111, 129, 0, -55, 24, -151, -63, 173, -220, 154, -124, -125, 32, -42, 21, -110, 108, 49, -11, -275, 132, 69, 106, 46, -351, -203, 90, -35, 40, -92, -20, -10, 176, 99, -89, -135, 43, 7, -112, 90, 174, 97, 57, -3, 376, 26, 28, 14, 24, -315, 26, 50, -81, 100, 32, -22, -227, 99, 189, 73, 134, -45, 149, -14, 83, 22, 52, -37, 46, 41, 169, -283, -172]
7397a72p4Q7K29k01J20p9J56K22r9k81M3k39K86j07L39l92L81m3r6j72J97r5L5
7420D5o3N4R1L4k91L06j8l57J03MJ11l7J8O7l33K98j12Q1J99j86k29K59J53k23
7444b6O5P2rl87N52k31j7J65j98J32k20K94k52J96J8k50j96K74J05j16m1p4J16
7467b8k22J55J60o4K6n6n4N1k29L46o0P5k5l53L54J50k02q4K89j24j2j40M2K53
7491B48m16L60j31m9q9J5L00n08O9N4L67j11n2j15K00j28R1P3l43K72j13j58J0
7514a54MQ1J21k6O6l85L16k63J37Q6m2j26j67L95j38j63J4L34q9k6K3o9k5N0M5
7539aP7j48K9J09j8n9n9l6M33n05L42k55J30Nk51J64k3j28J82K36l76J78J64m5
7563A45jj11N1J88k99K3j50Q3J04J41l2n1%q7J24q8q4J09l03J31K80o1j26L8J13
$$ y = [-172, -246, -159, 70, -131, -11, -90, 66, 288, 189, -92, -49, -288, -2, -109, 230, -162, 219, 176, 80, -92, 105, 10, 45, -18, 36, 127, 161, -130, 176, 158, -199, -96, -92, 19, -18, 0, 67, -266, 32, -80, 1, 200, 14, -215, 44, 197, -26, 39, 111, 102, -285, 267, 36, 19, 184, -14, 118, -102, 192, -60, 136, 154, -96, -292, -18, 87, -29, -70, -144, -28, -250, -95, 65, 1, 27, -29, -83, -32, -261, 85, 25, 100, 75, -278, 76, 226, 24, -60, 229, 105, 93, -47, -5, 248, -168, 192, 61, 12, -77, -62, 238, -270, -201, -147, 220, 109, 57, -58, 142, 14, 105, 178, -165, 107, -6, -164, -154, -150, -69, 52, 26, 92, -293, 23, -240, -103, -17, -59, -185, -352, 43, -95, -258, -244, 90, 1, -25, -2, -71, -96, -46, -1, 76, -72, -43, 66, 48, -11, -70, -106, 327, -178, 164, -91, 39, 44, -207, -43, -66, -194, -12, 224, -152, 26, 190, 145, 144, 33, 84, 272, -27, -4, -154, -71, 33, 174, 142, 91, 91, 4, 128, 40, -44, 65, -238, -107, 173, 112, -14, 24, 137]
7588A37K9lj78p4J40o7J24K73m15J42j00j52j8L9J1K08j09Q9j39L0O2P0j18k4
7612d3J08l37J66N8J53l4j31m1J27k62L34k3j02P9j40O0M7J9j74K57Q4r8j39L02
7636B70m4Ql1j58K5r3j48M8K56k37n7K25k36R8J00j93J09J2K62l17q6m7J81J39
7660H6o7j0k08l9J80M2r4NJ21k3k53J43K7qJ38O9p7K77o00K97K77k11m0j82M6
7685a04K12k03J75o5N7k28L35q6j10q6O0K17l71P7L01k81p6q0N2J87L4k86L48
7708G9l4j67J74kJ09j46k46M31r9L5n23K93J47k20K07j8j7L1l40K15J18L4M7k7
7732H1o9n1J74n9J4O7j48j20M44l80M04k05k46J34J25k88p1J83P3j09K0j9j54
7755b00J20K75k44J27j42K66k98K93l83L16k74K79J25k41j52P2L00m39m6J32l2
$$ y = [137, 166, 163, -15, -89, 51, -16, 108, 381, -34, 108, 8, -144, -162, -123, -112, 96, -13, 76, -63, -33, 29, 99, -19, -43, 65, -272, -106, -48, 105, 71, -60, -101, 26, -236, 98, 75, -27, 52, -88, -28, 19, 38, -136, 121, 205, 107, -32, 270, 226, 234, 203, 45, 70, -23, -171, -123, 133, -104, -161, 64, -172, -74, 26, -167, -58, -46, 216, -101, -187, -234, -53, 86, 19, 9, -199, -238, -58, -16, -110, -105, 16, -7, -260, -117, -90, -98, 40, 109, 32, 309, -291, 6, 283, 72, 32, -150, -104, 108, -95, 80, 15, 72, -156, 179, 93, -17, -103, -43, 174, -197, -120, 181, -100, -176, -256, -204, -17, 17, -269, 79, 45, -122, 52, 50, 159, 13, -233, 198, 99, 134, -389, -96, 51, -169, 38, 20, 3, 34, -306, -91, 27, 61, 108, 81, 12, -39, 135, 76, 90, 157, 9, -111, 333, -47, 357, 152, -94, 40, 165, -123, -194, -11, 62, -47, -27, -46, -200, -80, 195, -49, 78, -64, 202, -96, 197, -186, 130, -144, 135, 260, 19, -133, -61, 239, -200, -246, -114, -146]
7776a46J64J17j77O1j05K04n3j26n9J41k34L68k8N1p7j59J86j58J9r2K02j31r7
7799a29m9K31l4j19K13j96L39k83j25M21k31j94J44M7j3j6o7k8o4O2m6K68j88
7822e7l1J29j32J32k5j17Q6J32r5K2k9N1J1op6O2m9j9l0J61o4J19O7j20J75k35
7848F2k9K4J67m42J33J80J4j0n3J4j28J70k12L14m8j71N4k85K41m1K52k46j74
7871b14j22L67Q7L8j59O5j02k8r9K29m4j07l3N0K6m0N38m58J42j88j61j34K31
7894a16L3J28j60j62K47J20j19O0m8J10j32p8M1m2O2K32j24L1Lj49j92K57q3J9
7918f2p9Q0K16k82Q7N2l3K33j82j35L75N7l73L9k9k30N62k92j73P5j41K28j54
7941a61o7L27j81J86o9j69k9J44m2P9J68j78np6n8J3J2J68J31k32M5J32k46L31
$$ y = [-146, 18, 135, -42, 19, -86, 118, 65, -61, -120, 21, -213, 155, 127, 178, 101, -58, 128, -30, -11, -103, 99, -32, -129, -178, 53, 19, -100, 113, -83, 256, -27, -152, 269, 38, -156, -12, 35, 22, 6, -61, -89, -153, -91, -137, 131, -57, -88, 41, -91, 41, 16, -101, -15, 117, 22, 44, 15, 66, 77, 71, -5, 57, 8, -11, -41, 120, 56, 175, 242, 122, 297, 62, 33, 57, 224, -218, -85, 95, 109, 99, 46, 60, -68, 102, -110, 204, 156, -15, 39, -246, -5, -46, 206, -40, -214, -336, 31, 118, 156, -3, 62, -40, -68, -167, 62, 18, -89, -122, -72, -46, -86, 452, -6, 136, -52, -213, -347, -116, -83, 45, -115, -277, -30, 90, -29, 31, -17, 93, -39, -117, -76, -118, -56, 176, 52, 83, 86, -63, -255, 2, -81, -62, -141, -61, 155, -127, -40, 12, -21, 212, 30, -105, 270, 327, -46, -7, -36, -266, 296, 4, -169, -94, -235, -7, -161, -228, 99, -82, 104, 35, -134, -163, -19, -61, 18, 186, 8, 3, -73, -131, -118, -106, 62, 193, -39, 6, 138, -108, 223]
7965B23j02K6k20oM3K60l05l6J23P7M3k87l2L32q3o1J29j27j42J14J67k19K19
7988A36j14Lk31L57j88L5k07M2K56k7n4r9L13j71o8N2O8j23q2K21l9k00J79Mk04
8013a41o4J88j7l8R4m8L7J72l54j72L73k7L5J0J28k60L34k24P4k33j30J28K11
8036G6J39l27K00j75o9J46j74L95k43M47n02J50J75l39J99j84M9R8o4l39j28M62
8058hK9j05J35j4l4J56k9k49K86m12N04k88J33N3j75N9K01m53J08J15l5j9J53
8081A11R6k19k06m2K97r0J69l63J64m1l4K7P9K64N6j82l69K27R6M7J06n5k79M5
8105i6K59l5j48p0kJ15j26n7J10J31Rk65M2m2J88qo8m3J79l14K41M2m1j75M59
8130B85l68k44K12k6M89l33P1j72j13J39J43k19M7L25l16q3O2j9K16K41k74l65
$$ y = [223, 121, 147, -73, -79, -36, 224, -81, -117, 6, 83, 126, -161, -193, 139, 56, -5, 124, -3, -145, -31, 136, -83, 136, 22, 25, -206, 151, -37, -2, -209, -167, 89, 62, 8, -91, 222, 51, -17, 35, 103, -20, -102, 119, 80, -120, 59, 63, -141, -205, -17, -34, -72, 22, -26, 11, 183, -171, -343, 30, 3, 38, 48, 176, -84, 250, 26, 100, -133, -263, -135, 76, 215, -112, 88, -87, -156, -10, -184, 211, -32, 415, -87, 63, 238, -101, 98, -86, -37, 61, -3, -342, -470, -8, 21, -84, 51, 37, 3, 159, 130, -119, 167, -245, 259, -29, 104, 157, -18, 41, 242, -211, -103, 12, -23, -42, 111, 207, -12, -218, -260, 37, -53, 116, -247, -83, -124, -158, -131, -52, 212, 268, 86, -283, -56, 40, 87, 193, 138, -141, -96, 163, 128, -20, -90, -92, 23, -103, -160, -50, 81, 90, -175, -133, -175, 13, 5, -63, -106, 73, -241, 0, 42, 1, -174, 285, -83, -327, -115, -141, 348, 15, 86, -86, -199, -60, 83, -136, -89, 236, -80, -163, -101, -120, 96, 337, 63, -302]
8152c02J23K15j75R5m0Q1N4J60j64j97j23K44k37J56P6K78j53k16J50j33L4k1
8174i5J65j85J84J51m60N59m17j47J22J14n3o7M35k65ml8q
$$ y = [-302, -179, 36, -139, -44, -84, -3, 51, 211, 47, -150, -273, -29, -266, -110, -34, 244, 91, -125, 25, -108, -74, -95, 70, -115, 69, 220, -240, 319, -98, -245, -123, -9, -62, -129, 306, 41, 37, -1, -9]
8191i
$$ Imaginary data points
##PAGE= N=2
##DATA TABLE= (X++(I..I)), XYDATA
0@%%%%%%%%%%%%%%Qj6J6j6J6k4L2l7M5n5O3p2Q7r9J11j30J51j68J91k17K44k76
36a46L11l49L91m38M88n40N98o64P35q13Q99r93J093j202J324j459J609j776J962
55A030k171K408k678K989l356L795m327M990n843O990q628J1168j5686K6216j00466
70h3569n1142J11044O513k7820n9804j2279K9228O0166M823k8842q441L8346J8619
83c158j0081j8837L103K1652L8723J3334k6112l0129J1541K4359N176m803N178
96B9946M97q469j2222j2124n533K0667K2694j6662m2562j4790J9096J6672n368
109h158j8116j9311R71K2255M009l3599k4934K0285L2486K614k2445k5582o257
122g5782K6801L3427n281l2567n583K5856J6703l172q675k306J2814K3620O004
$$ y = [0, 0, 0, 0, 0, 0, 0, 0, 0, 0, 0, 0, 0, 0, 0, 8, -8, 8, -8, 8, -16, 16, -21, 24, -31, 32, -40, 47, -52, 59, -71, 80, -88, 103, -114, 130, -146, 165, -184, 207, -231, 257, -283, 315, -349, 386, -427, 472, -521, 572, -630, 694, -765, 844, -932, 1030, -1141, 1267, -1411, 1578, -1778, 2017, -2310, 2680, -3163, 3827, -4801, 6367, -9319, 16897, -83569, -134711, -23667, -17154, -44974, -104778, -117057, -87829, -27663, -22840, -51682, -60123, -21777, -3158, -13239, -32076, -28973, -7321, 31402, 44736, 18624, -11505, 36, 24395, 29571, 24768, 29946, 30443, 21974, 9752, -2372, -7905, 12762, 35456, 18794, -23768, -38558, -19462, -2790, -8158, -26274, -45585, -44614, -22359, -18350, -51949, -76883, -56598, -24112, -21498, -43943, -69525, -75782, -48981, -15554, -20835, -53402, -58985, -33129, -16426, -19598, -28273, -30579, -17765, 5855, 11859]
135A1859k1708j0368K2947K5292j452j2796n044O088J4077Q295j2111j5876R316
148A8519K1181l478k3821j1957P963J2449L208j4523k4577n312J9601R763k0062
161a1046k2460J829J3927N162p782j6874r174J5776K1111o374k3116k515J8915
174b2621J4353J5q731p636P941K2384O919j6388r071J6213J7971P1j0029p145
188D246L685J6364J0282j2484j8006N205J9111L332j3010j1960k60R954R897p354
202A9002k0035n085J6259J0475j1534j6433k797Q128R562j135j5105j2204R718
215a1184J6221l329j7484n679R038J0158J453r056j1791L819J8160N939j4208
228g943j0463Q719J3116M209n020r480j66J4628J2657q668j4722L429J5271P236
$$ y = [11859, -9849, -20217, 2730, 28022, 26570, 13774, 8730, 14818, 28895, 37190, 25079, 9203, 18519, 39700, 36222, 12401, 444, 8407, 20856, 24064, 9541, -15036, -20348, -747, 9016, -11046, -33506, -31677, -17750, -12588, -20370, -37244, -46418, -30642, -9531, -15905, -39021, -41536, -22621, -8268, -8253, -16984, -24620, -16679, 5705, 12624, -3764, -12835, 3378, 21349, 21420, 11391, 4246, 7931, 24295, 34577, 22093, 4087, 9292, 28403, 31735, 18725, 6765, 6505, 16459, 26356, 19002, -1033, -6118, 10141, 20616, 9082, -7351, -10148, -2020, 7542, 6407, -8698, -20902, -11184, 5037, 1708, -15776, -21455, -12417, -2259, -806, -9862, -21653, -17834, 326, 6265, -7943, -18406, -9687, 3429, 7638, 2618, -6862, -7028, 7600, 20257, 11589, -3133, 296, 15567, 22803]
242B2803n955r950m182R001J3125k726j7170o224J1966R717n843j2215o666M335
256A6R769K165j4054j2680O478J3868n01j2337p710L449R207N516o602j2730J389
271a4757J5506O075j0309r339L358R947O586k635j1042m399J2109J1747o511j3171
285f835l82R427P036k023r458p395O821J3249m92j3959o328Q695R716r7p823p477
301g325K022J2063N984j0391j0290M779J1903K717p337p743m68Q494Q259n267
315G400j2688j930J1690O187o957r149k335O272P663j210j1498o658Q553J0469
329E809l316j0484l590N484P634K304p801r042M619J2709J962j0392o036M553
343e587Q296L826m997r028k85J1260O648p392r441J685R162M910l497p516l101
$$ y = [22803, 16848, 6898, 2716, 11717, 24842, 22116, 4946, -1278, 10688, 20405, 14562, 2347, -4319, 16, 9785, 11950, -2104, -14784, -8306, 5562, 5061, -7276, -14986, -11537, -2330, 3186, -3416, -16146, -14757, 749, 6824, -3485, -12824, -9466, 481, 7067, 4432, -6610, -11009, 1100, 12847, 6336, -6835, -7217, 2210, 9246, 7223, -2235, -9630, -2809, 10440, 9948, -4011, -10339, -1644, 8072, 7975, 152, -7325, -5303, 6760, 12744, 2353, -7937, -3158, 8745, 11462, 4125, -3618, -4086, 4408, 12667, 7400, -5288, -7218, 4472, 10659, 3702, -5447, -7782, -1510, 6153, 4943, -6555, -13213, -4660, 5809, 2493, -7991, -11581, -6097, 1537, 3841, -3960, -13002, -8383, 4326, 6288, -4104, -10140, -5587, 2709, 6535, 1538, -7490, -7775, 3485, 10133, 2741, -6700, -5015, 4147, 9057, 5560, -1956, -5057]
358e057Q048R654l025j0951k259R006P343k178p384m259M469R290J318j0161p125
373c271N845R034j160q440n791J151P222L312p500j0655J248R757K237q275p030
388a2316L50O130N475k915r781j833R800P541m295p723M67P249O840N11o448m118
404e066P332J0718l88q593k883O189P424J286n959o205K185R061K616q700p592
419A425K962P222J013o431p478j321O266N172o339j0186o71P240L780n357p193
434i896k460M645O289j310r181m111P473O839k550o411k691M347P224K198o578
449f173n546N330R347J256o216l382L833P128L752l652o535J882R290M385n896
464H803o194J430O730L247l104p260k870N848N548m374r777k456M967L085l193
$$ y = [-5057, 2991, 12645, 9620, -1331, -3590, 5416, 12759, 10581, 3197, -1062, 3407, 12697, 14015, 3854, -3271, 2574, 11608, 10448, 2008, -3783, -2632, 4590, 7902, 402, -10253, -9005, 752, 2989, -5286, -12316, -11966, -5836, -361, -3276, -13057, -14890, -5090, 2451, -1844, -9567, -9100, -1851, 4989, 5500, -948, -5066, 2266, 12984, 12596, 4003, 1120, 7309, 14733, 16019, 10060, 3855, 6040, 15101, 17717, 9017, 1425, 4387, 11609, 12622, 6191, -1287, -2608, 3658, 8830, 2491, -7695, -8366, -1126, 2654, -2703, -9896, -12356, -7711, -1422, -2732, -11913, -16024, -8551, -1712, -4262, -10673, -13364, -9017, -1793, 405, -6173, -11719, -6389, 2958, 4214, -2002, -5384, -1551, 5577, 9329, 5677, -858, 1024, 10314, 14699, 8803, 2609, 4039, 10769, 14016, 10912, 3652, 782, 6630, 12178, 7804, -1973, -4429, 538, 3623, 430]
479D30p586m922K249N948j253r499m803M110N697m66o139m281K077P258L749n641
495a3072n594L695Q951K903l619l693K262O996N592k054o502P60Q613M985l334
510F889n716l17N149M978j500o904l744M805N637k585p690l456L302L896r68o546
526d770n722J668N793m6p352n910K686N105P86m785n477l02O599L875n276n932
542a9060J301O768L476k791m249m45O081O116j056n976n95P116N742q25m215j194
558c806M516O396J170n801l045M291O296k85n327l873K087M657Q65n251o072j27
574c309N528P54o216o002K38L813J269l835o130j945N009L781l794n869l93N130
590a1971L823p27m626j566M726O575J30n204q58N137N887Q91l334k347L209O407
$$ y = [430, -7156, -12078, -9829, -3881, -5134, -14633, -19436, -15326, -9629, -10095, -16234, -20515, -18438, -11180, -7431, -13072, -18666, -14971, -6020, -3117, -6736, -10429, -8167, -1171, 4421, 2367, -4135, -3375, 5238, 10223, 6889, 1173, 856, 6005, 10983, 9483, 2579, -1165, 3640, 9277, 6692, -998, -4454, -1152, 2744, 1776, -4770, -10492, -8824, -3031, -3077, -10429, -16339, -13653, -8548, -7762, -12547, -18024, -18326, -11727, -7852, -13128, -19060, -17759, -10991, -7515, -10306, -14555, -15000, -8919, -2803, -3859, -9835, -10430, -3314, 2428, 1603, -2612, -3806, 710, 7106, 8276, 2475, -570, 3721, 10017, 9732, 4405, 532, 2619, 7276, 8141, 2890, -3182, -3309, 2219, 2973, -3243, -9245, -9007, -5194, -3925, -7760, -13890, -15835, -10826, -7045, -10839, -16708, -17101, -11971, -8148, -8875, -13501, -15067, -10341, -3766, -3636, -8840, -9698, -4561, 1326, 2217, -1117, -3464, -255, 6152]
606F152J871m275l984L148N830J314l901m022M57M615K609l621o160KM957J973
622F965l647n363j232L296L060k145o174k247L868M011k536n328j920K988L801
637b603k79m595l391L035N492M92m832k474K980M885J689k558l655J539O340K976
653E041l002l874K132N297K948k114l411l57M604M120k444n072o25M222K804j887
669H382m584k652K447L620j458n537l231K713L806j402n061l278J696L694R32
684H7m266m111J660N180J211l469l328J445M634K499k362l683M47N034L448k568
700A858l758M43M080K947o05l995j638L697M048r73m748j166K617L350l94l974
716A789k502J888M222L67m612k921J900L825K78l134l174K52L825J830l187m258
$$ y = [6152, 8023, 3748, -236, 2912, 8742, 10056, 6155, 2133, 2590, 7205, 9814, 6193, 33, 35, 4992, 6965, 3318, -2045, -3277, 19, 3079, 934, -5240, -7487, -3619, 392, -2144, -7472, -9392, -6404, -2603, -2882, -7477, -10868, -7833, -2341, -1849, -6681, -9155, -6175, -1290, 399, -2159, -5814, -4275, 2065, 5041, 2039, -1835, 297, 5594, 8542, 6428, 3017, 2660, 7264, 11384, 8940, 3868, 3243, 7465, 10269, 8382, 3798, 1146, 3593, 7213, 5755, 218, -3013, -300, 3506, 2104, -2957, -6235, -4539, -845, 87, -4179, -8290, -6630, -1450, -239, -3708, -7036, -5591, -957, 1542, -820, -4503, -4056, 978, 4426, 1858, -1900, -1457, 2623, 5570, 4965, 970, -668, 3029, 7077, 6104, 1356, 190, 2807, 6157, 5763, 1789, -713, 1175, 5397, 5764, 1152, -1769, 131, 3956, 4234, 1100, -2074, -1822, 2003, 3833, 646, -3612]
732c612M93L675J859k731l642o58L372K939j873m294r28L515L165j604l482r09
748d715K622L525K73l720k135K877M302j80l520j470J966L725Q47k911l142J352
764c04M006J325l413l372J261K901J352k295l623m77L771K255k642l444o15L146
780a68K139j186l464j100K845L224p95l677j555L129L043o00l128j659J797L287
796B132L16l069k993J647L654K24k962k367N42L067J341k391l661O48L602J745
812A475k427k776K32K768K814r86l441o20L313L033p78l369o05K694K758j87k953
829I45j746K158L284j90l523j911J823K735K32k870k287N22K951J105l038l092
845b902P98K781J008j940k840r8K471K138j726l350k14K652K322j611k429q07
$$ y = [-3612, -3119, 556, 2415, -316, -3958, -4616, -1244, 1695, -178, -4472, -5400, -1885, 1280, -324, -3806, -4715, -2093, 1432, 1705, -2015, -4150, -1273, 3029, 2849, -671, -2141, -175, 3550, 4397, 1486, -1656, -304, 3702, 5027, 1614, -1758, -497, 2404, 3756, 1461, -2162, -2639, 1132, 3387, 745, -2699, -3314, -168, 1971, 785, -2679, -3779, -934, 2290, 1495, -2182, -3737, -608, 2435, 1835, -1293, -2952, -1155, 2132, 2448, -621, -3614, -1967, 1687, 1911, -1051, -3418, -2876, 191, 1532, -859, -4520, -3872, -270, 1475, -952, -3728, -3496, -728, 2086, 1100, -2341, -2961, 352, 3385, 2607, -762, -1367, 1327, 4085, 3898, 945, -801, 1357, 4641, 4451, 928, -983, 840, 3575, 3807, 937, -1350, -828, 2123, 3228, 190, -2902, -2104, 677, 1685, -255, -3095, -3193, -722, 1416, -310, -3660, -3874, -1222, 1100, -511, -2940, -3747]
861c747K220K761k07l246j172K522K984n79k611j271J676L107O57k128k386J646
877B26L510N77k298j986J008K977J139j752k517q9L192J522k131k982j25K257
893B528J348j146l347j349J593K398j524l243j722K123J851p58k750j709J263
908d444K719K52k833j603J778K679R96k046j504J036L156J509j746k074J279L098
924B252J739j900j939O22J930K464j415k537o59K298K091j573k329j127J488J834
940C239j007k816j741J400K210o22l085j681J410J736Q4k487k224J106K262O23
956a593k594k013P73K320P96j317k003K58K085K169j241k337L78K539J755o79
972g04j457l28K194K124J37k293q58K444K145j40j954j464J527K213Mk218j895
$$ y = [-3747, -1527, 1234, 1027, -2219, -3391, -869, 2115, 1536, -1075, -2346, -670, 2437, 3094, 966, -1420, 226, 3736, 4313, 2015, 29, 1037, 4014, 5153, 3401, 884, 795, 3987, 5509, 3378, 396, 271, 2528, 3876, 2730, -617, -1966, -373, 2025, 501, -2742, -4464, -2341, -490, -1248, -3998, -5707, -4444, -1725, -1473, -4306, -5909, -4131, -1452, -456, -2502, -4006, -2970, 186, 1695, -51, -2125, -846, 2252, 3991, 2091, 152, 774, 2704, 5168, 3753, 1216, 557, 2855, 4946, 3373, 1044, -83, 1405, 3239, 2232, -584, -2325, -925, 1285, 663, -2422, -4103, -2693, -957, -873, -3360, -5584, -4478, -2216, -1593, -4187, -6200, -5427, -3107, -2311, -3628, -5631, -5373, -3288, -1119, -2360, -4697, -4319, -1780, -25, -704, -2161, -2489, -295, 1829, 1966, -327, -1185, 1259, 3404, 3264, 1310, -154, 1373, 3586, 3590, 1372, -523]
989e23J067J900j51k351k021j6K163o9k163k567j31J845O27j762k412O7J624J290
1007c583j194j802n53K008K099m39k052j77J923K425N1j644m48J664K504P21k120
1024f17r14J684K136O58j943j142O61K075R04j997j758K04K070N78j720j947l85
1041a453J846J035j527k420n39J810J197j343k277o90J222J653o47k156p02J059
1057c932J626J32j986j278J349J956K76j401r88R60K245P82j264j349J052K268
1073D48J289j036j249M62K298J483r84j985L10J899J193r61j573p65J501J279
1089C609j010k037j167J391J065q55j897j504J101J179p8k300j240N90J823O7
1105a263j885r89N97J782J070j084j731J024J831J082r50j289J42K316J536r16
$$ y = [-523, 544, 2444, 2293, -58, -2079, -2095, 68, -1, -2164, -4731, -4862, -3017, -2390, -4152, -6564, -6497, -4873, -3583, -4777, -6579, -7132, -5124, -3025, -3464, -5516, -5693, -3770, -1345, -1294, -2938, -3386, -1722, 782, 1503, -617, -1531, 153, 2289, 2947, 1004, -138, 523, 2598, 3502, 1505, -253, -49, 2021, 2599, 879, -1068, -1453, 393, 1428, -99, -2519, -3058, -1248, -51, -1394, -3671, -4361, -3139, -1486, -2133, -4289, -4991, -3932, -2306, -2174, -4160, -5438, -4089, -2133, -1857, -3258, -4246, -3286, -1041, -259, -1523, -2872, -1820, 448, 1737, 701, -548, -86, 2212, 3695, 2711, 726, 1036, 2935, 4128, 3167, 1594, 829, 2330, 3609, 2599, 562, -605, 786, 1851, 996, -901, -2405, -1304, -125, -203, -2503, -3743, -3153, -1330, -1263, -3148, -4137, -3540, -1758, -688, -1772, -3503, -2479, -648, 434, -516, -1805, -1663, 653, 2189, 1273]
1121A273j474j67K245J159p59j376l17J609J443n16j849q05J264J437j06k002
1137A059j081J017J474J68j802j125J40J798K31j751j574N78J225N21r13j760
1153a795R1J226J021j144j731j85J717Q86o65j641QJ260J413j77j679m45J602
1170b38J543l2j315q30J451J721K6j130j047R44J896J42j363j282L26J647L18
1187B777j314j457NJ539N87j420j390k45J408O68j169j490o50J432J083o52j587
1204a875m08J153J363k15j438o61J140J597j14j461o40Q19J620M5j324q11N05
1221g05J533M78j346j017J39J770N88j087j431l5J627R03q88j658J45J454J117
1238A587q84j393k10J273R67p18j070q41J293J366m30j443o81J016R73Q4j409
$$ y = [1273, -201, -368, 1877, 3036, 2277, 901, 584, 2193, 3636, 3120, 1271, 466, 1730, 3167, 3061, 1059, -22, 995, 2469, 2637, 835, -290, -150, 1648, 1879, 128, -1446, -868, 357, 878, -35, -1795, -1704, -478, 543, -601, -2332, -2517, -800, 86, -579, -2220, -2212, -952, 461, 284, -1395, -1840, -238, 1305, 1273, -42, -872, 579, 2300, 2326, 1196, 149, 1093, 2989, 3131, 1768, 486, 812, 2459, 2777, 1463, 6, 11, 1550, 2137, 717, -673, -918, 490, 1158, -11, -1501, -2151, -719, 364, -288, -1875, -2283, -1130, 233, 18, -1420, -2081, -941, 656, 542, -919, -1559, -740, 880, 925, -399, -1210, -705, 828, 1306, -40, -1057, -918, 852, 1440, 353, -1078, -1113, 514, 1417, 529, -1129, -984, 470, 1587, 703, -690, -900, 373, 1340, 622, -448, -1289, 4, 1370, 940, -503, -1184, -168, 805, 889, -520]
1255e20p28m4J641K87j385j021K30J331M16r28j342L31J416J100j160j157J88
1272a345J037J034o99j011k29R37J332n83j204m74J243J278m46j508n55J077J078
1289I62k34j138q78J018J162j09j287n69O47J088N14j048r79L58J426M72p97j010
1307d02J30J166N99n67j678R4J175J084q92j566m26J204R90q26j424m90J073P02
1325e4O6j360o77R40J028J40j201n08L48J588L84j194n84O31J054Q23p64r38K12
1344f6J174J002q68j070N5J151O77m85j291k61Q14J143n95j217p04Q37J019n52
1362G63j419n56Q27R62o0j309n06K56J385k13j184o12N89R97K60j039q90M18J111
1381b20M02o81j121L55J115L86l72q84k00J305Q84n62j047l8J101R92j43q29n72
$$ y = [-520, -1248, -1292, 349, 636, -749, -1770, -1540, -209, 207, -721, -2063, -1732, -316, 784, -376, -1533, -1345, -308, 726, 27, -984, -1213, -276, 1056, 473, -731, -1205, 38, 1316, 870, -638, -1193, -116, 962, 728, -410, -1288, -270, 892, 783, -504, -1073, -426, 662, 1176, 128, -851, -493, 933, 1405, 608, -402, -272, 894, 1493, 926, -752, -658, 517, 1601, 709, -857, -1283, -79, 911, 85, -1339, -1829, -756, -54, 12, -1348, -2025, -1085, -57, 83, -1118, -1626, -1278, 310, 694, -500, -1084, -453, 601, 1424, 660, -278, -66, 1108, 2110, 1242, 172, 227, 1378, 2055, 1570, 279, 18, 832, 1975, 1380, 163, -541, 296, 1315, 763, -656, -1212, -385, 577, 517, -792, -1298, -1042, 343, 130, -1054, -1666, -1077, -80, 180, -859, -1749, -1331, -220, 182, -499, -1620, -1265, -150, 236, -136, -1020, -1220, 85, 969, 407, -640, -678, 423, 1415, 1272, 443, -129]
1400a29J046Q44k36r44m82Q29P61J30q46r96K87O73Q9j136q84J46Q97J37j130
1419i44q32j63R22L95n70j468K87P34O01l48q87l85J223R20k57q49k85R64R84
1438D2J01r61O5M92J269p2m92p93L14J171K12o60p47K52R61K28q53j088M99P86
1458G26L48q26j256K05O73N20m86j280m27Q83N82k00j153k31O80P65m11j178l23
1477b389N19Q36k42n49m98M29J214K2o65o45N39J020J21o50l30M41J191L46m75
1496B35o06K13J013M90m35q48j16J495K98k71j126n38R46M38k00j115o39O36M53
1515C23m86q12o86L82O39j65r11o72N79P26J54p92o70J32J266J09n29k88M63O20
1535f18N31k45q79N81O44P68l44p14j05Q22M08L04j177q3M90J180k54q46m79O97
$$ y = [-129, 917, 1761, 1525, 581, 99, 928, 1689, 1819, 973, -23, 264, 937, 1026, -110, -994, -848, 49, 186, -944, -1776, -1939, -1017, -622, -1192, -2660, -2373, -1639, -1038, -1386, -2273, -2658, -1435, -515, -772, -1621, -1906, -942, 42, 143, -818, -753, -261, 1008, 936, 444, -349, -35, 1136, 1348, 688, -59, 193, 1154, 1382, 529, -559, -60, 726, 1074, 248, -1008, -803, -130, 390, -96, -1376, -1803, -920, -338, -538, -1691, -1922, -1242, -477, -888, -2066, -2389, -1870, -1034, -1276, -1825, -2323, -1894, -680, -658, -1323, -1968, -1429, -409, -288, -938, -1268, -827, 364, 710, 235, -371, -158, 855, 1345, 910, 62, -54, 1441, 1739, 1468, 342, -196, 750, 1188, 988, -127, -766, -130, 323, -163, -975, -1661, -1279, -640, -805, -1716, -2388, -1809, -1083, -929, -1721, -2391, -2259, -993, -884, -1413, -1701, -1238, -618, -87, -332, -1211, -630, 14, 782, 438, -276, -381, 441, 849, 1153, -24, -107, 383, 1563, 1309, 463, -16, 681]
1555F81M32np02o50M54O61j13n43o66K88M89N16j021p65J51P82M80j134o83j96
1575a544J227J37l39j068Q2O68P98m13n03j70O04R56k71q29K4P48Q07j72q14j71
1595b43P55J136M6o91r31Q89P29n1l85r60K83R59j41n25m52m73P46K20m99p22
1615c10k55M68L41m67q04j32Q21M40l43q83j48Q20O00j8j069j09P43N08J42o54
1635c09l47M47Q68K43q41l77J76R08K85o63p06K24J017K52o35o61k01J087N47
1654A314p45n32j42L97R08n51p42k26M44K99n4l65m90Q8J070k77l93q31N27L48
1674D7Q7p74m57L58O22J85p18l57K63O38J14j64q51J84Q36M30n26o49K17N17O27
1695F29j64p36NL46Q16j42p16l43N15O63k68q09k78J61Q06r2o81k04J49N97k41
$$ y = [681, 1113, 1108, 406, -244, 210, 871, 758, 215, -451, -163, 326, 842, -179, -944, -793, -11, 469, -665, -1348, -1544, -317, -180, -519, -1587, -1505, -837, -39, -452, -955, -1125, -521, 435, 164, -665, -641, 107, 914, 742, -72, -243, 512, 1648, 1694, 1003, 72, 961, 1690, 1639, 1254, 294, 577, 1536, 1395, 870, 418, -55, 691, 911, 412, -310, -565, -97, 244, -223, -1027, -1159, -338, 102, -241, -1124, -1272, -452, 148, 130, -939, -1048, -305, 203, 345, -309, -656, -209, 659, 902, 61, -316, -140, 768, 1053, 390, -316, -92, 925, 1177, 542, -119, -320, 767, 1314, 569, 37, -105, 292, 1200, 649, -93, -319, 125, 424, 370, 5, -485, -397, 673, 396, 3, -828, -301, 47, 134, -640, -1097, -739, -117, 68, -650, -1007, -744, -106, 8, -156, -1007, -823, 13, 443, -83, -732, -515, 2, 629, 465, -271, -266, 80, 896, 754, 38, -305, 210, 873, 605, -204, -482, -321, 485, 393, -288, -492, -343, 254, 13]
1716A3k35n68K81Q51l2k87o78J31N47L24j55q59J76O29J06l74l51j41N05N45l38
1737I0q45J34J79Q61l73o06k34L22O10l00k20l56L57O33Q9o56o29N39M80L42o70
1758b53n32M11P83K63n46l20r5N30L65j16p60O5L99L96k88o85N1L04N19m17m98
1779d24j85M08K12J33n18k46J10Q77q7n70m52K68N19K66o44j26J54K53M69n07
1799i0l23J15N02m6k57m69J37O99J13l39l60l35O83O48m15k30k86K30N02J25n31
1820G3k29N41L81L05j018k7o6P56M25o66p56M09M55J0m79l83KM75J07n84l69l0
1842f68N45J24K6q16q5O24K25j79l24k01K68P01J21p62k3M20N75j64k88m26M28
1863A21O15R3n98l15O55L6J45k84n99K40N76J97o38l33j67L60M60m30l07p1M61
$$ y = [13, -222, -790, -509, 342, 310, 23, -655, -524, 23, 347, 192, -667, -491, 138, 244, -130, -481, -622, -117, 428, 90, -755, -621, -442, 419, 46, -560, -794, -472, 138, -162, -382, -738, -381, 252, 341, -315, -944, -405, 75, 417, -253, -785, -374, 409, 672, 126, -194, -289, 241, 606, 490, -270, -205, 194, 590, 302, -383, -332, -28, 491, 74, -424, -609, -201, 11, 144, -374, -620, -510, 367, 280, -290, -742, -474, 45, 311, -333, -459, -305, -52, 417, -90, -413, -298, 204, 158, -99, -568, -431, 268, 381, 42, -318, -653, 30, 678, 263, 33, -253, -23, 479, 604, 73, -156, 385, 766, 1071, 53, 26, -40, 716, 1141, 475, -281, 128, 583, 593, 114, -269, -267, 208, 315, -269, -638, -668, -123, 1, 27, -789, -874, -250, -25, -204, -528, -729, -461, 240, 361, -401, -424, -4, 571, 407, 119, -307, 121, 736, 829, 231, -84, 571, 607, 752, 468, -131, 109, 685, 882, 244, -89, -256, 104, 564, 134, -173, -244, 217]
1884B17J34l03n24n6J96O38l56o10j16N77K41J5o28j3O1N56l64j54m07J49M17
1905c30L33l33k22J77K29K49l15l31J45M17N02m11m07J24P77J54j97n40rL20L96
1926G28l4m67k45K37K42j77m99j99J56M07l93k99k13Q0O86k96l63m65K33M83K53
1947a45n77k85K51L42L00k79p0j19M11K19k37j34O9L49Q02p47l58m0L21K42j25
1968A90m0k35J61J84K11o09j43L19K10%l75q2j1M91n3l27n12J43N05J01n22l10
1990g04L44J41K18j17o53P2K78J49k5o01O1L76K82k81k39j35L41K37L51n18J90
2011b33J65K70O0j79k97K60O34n0l03l44J95M85k40j68k24Q0N66j35k15l52m26
2032d51P09K80m58n20p2J97K06R6l47n39M37M64j85k83j06M7M36o8l37k1J92N17
$$ y = [217, 351, 48, -476, -532, -336, 302, -54, -664, -780, -203, 38, 53, -575, -588, -527, 29, -335, -489, -896, -747, -330, 3, -330, -552, -375, -146, 103, -212, -543, -398, 19, 521, 110, -297, -173, 604, 758, 561, 21, 12, 332, 728, 694, 227, -18, 219, 461, 284, -215, -414, -258, 149, -244, -543, -756, -676, 10, -286, -649, -1114, -881, -398, -145, -722, -1007, -756, -414, -114, -393, -463, -582, -171, 48, -189, -323, -254, 95, 897, 150, -208, -248, 73, 315, 190, 150, -85, 76, 260, 471, -138, -281, 38, 248, 248, -127, -209, -220, 271, 218, -109, -621, -478, 27, 128, -394, -704, -360, -219, -1, -118, -771, -699, -421, -272, -297, -898, -837, -461, -179, -460, -699, -834, -493, -256, 95, -423, -233, -68, 202, 262, 83, -214, 46, 680, 630, 327, -17, 178, 663, 423, 255, 31, 111, 677, 542, 327, -25, -451, 258, 538, 80, -440, -512, -315, -109, -13, -360, -899, -462, 2, -183, -466, -572, -525, -89, -157, -494, -515, -323, 194]
2054A94m1j11l96K68O31l64j88r9j43N74J92k70l62L91R2P6j17k48j18K71M44
2075F76m81q3PO9R8n1m05p3R9P39l17m92J9J55J34L05n24l24J03K42J00l56j96
2098e56J38M91j40l34j12J10M02N3qk33J85O1K29L9n26j45M59K00J72m52n0N3
2120C6K97K62k62l17k0L87K10n43p3L09j74K58k00l39j20M56o0k65j13j29L68
2141c2K43m14k47K47J86j21l0j59j15J85M34O7m62j94L33L56j89j04j27J70O4
2162I1J12k56k94K44K22p5j87j92K5M14%J79o25K77K55j2M8m32O9J41M18k79k57
2185a14J4J66M48m56l37j5M46O8j46j26n77M54K02K36l79j43j47M00J72m63j38
2206d35J00K88J67k86k84J51M56J53m29p4m7L25K99k45l87K21J43j14m8p9r9K72
$$ y = [194, 153, 42, -354, -86, 545, 181, -7, -106, -249, 325, 517, 247, -115, 276, 368, 444, 327, 79, -39, 232, 676, 195, 112, 119, 188, 286, 235, -170, -243, -144, 595, 278, -214, -195, -40, 94, 399, -125, -449, -346, -104, -4, -360, -556, -418, 73, -67, -401, -513, -403, -1, 52, 44, -189, -4, 57, 286, 325, -201, -346, 113, 313, 485, 33, -17, 36, 333, 595, 333, 16, -4, 383, 593, 50, -23, 286, 112, 370, 170, -169, -289, 167, 107, -158, -271, -400, -32, 211, -203, -450, -203, -17, -138, -168, -327, -442, -257, 177, 244, -218, -412, -79, 277, 88, -16, -143, 27, 91, 203, -53, -347, -103, 119, 44, -143, -335, -310, 104, 104, 283, -342, -65, 190, 178, 226, -206, -137, 4, 422, 143, -114, -100, 66, 514, 58, -279, -294, 152, 220, 74, -52, -629, -175, 27, 263, -116, -259, -406, -6, 166, -297, -435, -335, -47, 120, -166, -450, -299, 157, 310, -119, -193, -240, 85, 384, 139, -248, -27, 116, 2, -46, -125, -224, 48]
2228D8L19j80l15k38P3L31Q3j35k62j36M31M9j66k17J46L12o9Q0l93p8M87J53
2250C23m93R1Mr7N63j56n91L12M4m9k03j49K09O0K20k46j01j56Q2M57r7j58n1
2273a82P5L82p0k67j35L97J0K56n14j52L19Q8L73l75k62J1L10K30m55q9j38N78
2295C90O8l08m27J56L07L5l34M8k2J43o8J32j46k70q3O80ll39j55R2K81j14R1
2318A54k56k00L43J16k93k1j94N53p5M2m76k17N72L69k84j80%K89kJ70l77l31
2340b98L40L24N0m02M5L1L65l05j52o8K62K01j15j24k22J01L00k94k0k59O5j7
2362a92J74o2l17L1M14j40n7k49L6J20K56j50N1l79L63M18l26P3k81L23L13k97
2384A22N8k07p7L32J04l99l8J23L8L12k77j32n4K89N3k47j82p2J40N90m23k68
$$ y = [48, 367, 187, -128, -366, -293, 38, 121, -14, -276, -412, 19, 68, -98, -315, -169, 143, 74, 154, -239, -317, 170, 323, -170, -79, -75, -172, 391, 235, -356, -44, 0, -49, -252, -401, -192, -132, 88, -158, -259, -415, -333, 124, 27, -131, -182, -107, 275, 205, -62, -197, 200, 210, 466, -48, -200, 119, 207, 580, 205, -57, -46, 264, 494, 39, -50, -188, 390, 458, 150, -277, -121, 186, 221, -113, -65, -87, 56, -12, 120, -26, -296, -379, 301, 298, -41, -196, -104, 177, 63, 154, -102, -302, 41, 157, -136, -157, -351, 202, 127, 169, -307, -524, 48, 417, 133, -47, -47, 242, 240, 410, 33, -298, 42, 366, 416, 14, 59, 90, 455, 150, -2, -70, 192, 393, 278, 154, -68, 33, 333, 39, 19, -240, -175, -192, -18, -80, -397, -366, 48, -92, -149, -398, -362, -242, 14, -136, -85, -464, -101, 317, -9, 64, -217, 106, 419, 122, 180, -27, -104, 228, 332, -67, -105, 18, 56, 368, 91, -41, -95, 194, 247, 0, -182, -254, -114, 476, 53, -215]
2406b15K27J05Q0k35K3k09K04m4J4j39k38K71O5J03j94l75K96L90j24m34J36J27
2428a66K8K7J14j92Q0J71J92l51K84q6N4J31j72j26m1M04k67m9j81K1K24K19m73
2451a55J84j36K95l7j42m47J25M74q7n7k35J7r0J07K32m67rK39J29J86l13L4n1
2474b04K50k8O6m04L17K2J93k05k51L95j11K73l24q5P1j32L12K38m43j11K10L9
2496H8j77J12r3j5J39j38Q5k43K47L61p2j47k05K4K22j0j10k58M8m7K06K6l37
2519b94j10M55J36j68m15J71J95j21K07k76R1J50K39p5l96J5N2K06J84k36nm7
2541d2K60J4q1j79K58j99J67P1j65J41j33J73l3m17K74j67j08M94m06k62L06o6
2563a00M2j80J59J73Q3J87m21k22M41j88J41j73k58M43j9j3j12r1L44k64K81j47
$$ y = [-215, 12, 117, 197, -38, -15, -224, -20, -64, -50, -189, -427, -156, -91, 12, -182, -557, -261, 129, 5, -429, -293, -166, -138, -111, 3, -189, -109, 62, 254, -97, 187, 101, 155, 286, 114, -12, -53, 351, 84, 35, -146, -125, 99, 318, -155, 29, -107, 188, 151, 9, -438, -313, 161, 74, 17, -218, -201, -291, -184, 48, -419, -428, -189, -60, 126, -187, -153, -204, 46, 18, 84, -320, -3, 19, 212, 7, -244, 151, 40, 313, -11, -96, -25, -157, 155, 393, -50, -161, 49, 88, -89, 23, -70, -85, 54, -84, 1, -242, 5, 366, 294, 147, -58, -34, 188, 178, 68, -190, -142, -189, 17, 43, -294, -404, 51, 187, 19, -396, -225, -30, -151, 56, -220, -129, 21, 260, 185, -211, -196, -144, 62, 246, 10, 5, -42, 218, 232, 151, -28, 230, 31, 198, 269, 104, 245, 112, 285, 252, -165, 109, -58, -166, 328, -78, -340, -34, -100, -58, -238, -79, 94, 177, 364, -57, -279, 162, -26, 115, -58, -316, 127, 108, 95, -17, -108, 236, -28, 253, 106]
2585A06j82j48M14j47j81q8L0L11N3j27Pj51L52o8j15o5L0k77K39J65n46J73J97
2608a8J30J43j32l01m5L6M03m25K1K37L44k89m95J05K41k15K64j73P7p3K69N0
2630A54k01l3j15J43N0m8k93L62j39J80ql79L67R9o5M1j10k81J59K29k25N0j77
2653b40N15j33j03Q9k68q0J79j80Q9N6j15j83L81o0m84K71N00j12r3j16qJ57L0
2676I2r1j49l3NK98j44qj79J00R9l4k68J85K31k95K34l57J73M9O8J0m3LK1J21
2701H8J25P0n30K93o6J46k9j16n7J8K0l6P5L9j8J29j72J53l37K84j8p8op7N9l5
2727g6R8o1R0K1n6K7M6n9j15K44J30j49k68Q9J79l22o1L72j09j83J29K03l11J1
2751a31M3J32l17K51r1k01K57J8J2k49L37N6j44L11j64j02J08j57N3R2j03M12
$$ y = [106, -76, -224, 190, 43, -138, -226, -196, 115, 168, 41, 48, -103, 249, 181, 66, 1, 31, -246, -7, 158, -388, -215, -18, 112, 255, 123, -178, -223, -187, 216, -209, -188, 49, 393, 104, -391, -286, -45, -260, 4, -169, -92, -165, 104, 154, -47, -80, -195, -52, -2, -50, -343, 19, -120, 60, 52, -327, 40, 139, 74, 115, 5, -276, -117, 112, -113, -63, -240, 275, 142, 39, 128, -140, -220, -41, -221, -132, -76, -191, -374, 7, -53, -537, -266, 234, 122, 29, -87, -95, 62, 92, 1, -148, -181, -176, 122, -22, -30, -209, -109, -10, -44, -312, -127, 104, -191, 43, -314, -141, -92, -24, -14, -57, -54, -33, 88, 213, 283, -247, 46, -20, 126, 97, -19, -76, -58, -38, -74, 1, 40, 22, 151, -21, 132, -205, 79, 61, -17, -23, -100, -41, -76, 22, -39, 51, 72, 16, 43, 89, 30, -85, 159, 289, 140, -128, -39, 140, -182, -243, 129, 20, -163, -34, 169, -142, -131, -88, 44, -273, -22, -113, -314, -57, -39, -27, -276, 61, 117, -27, 284, 120, 18, 126, -31, 22, 114, 11, 423]
2773D23k66k62j23J76K18k76K1k95M25j66N5J53l29J02K0J19J83k26J14j75K37
2794A28k22P4j31N0K37m9n0j27j18L12k17L05j77Q6Q8o7j14k18K07n0J48m9l11
2817b65kL25J45k54j8l45M52K31o4l44J82j38J63q9N2m1K1P3k7j24j05J21r2K06
2841F3l2j97j60O56l85j68O7P7K96j39k34J91L8j15M9J39k19O9o6K72n0k13q8
2864a49K92J33k81j62L10j1q0j11K75k48J40j7J81j70j79Q7J96j42l73R4Q8J40
2886A3o7q9m2J8L15j75J3j46P1J19J95l0j28j47J63o6p7N7j21J52l3p4J40K8l2
2911E7J75k56M9J35k05k8J58l25J82L5J32J04l74L3K52j85Q0J0j69j18M46k95
2933a07j34J95j31M11k84k45K97K6o1J71k28j51m2J89M7J01j27j18pM45j66j93
$$ y = [423, 157, -105, -228, -52, 166, -110, -89, -384, 41, -125, -70, 83, -246, -144, -124, -5, 178, -48, 66, -109, 128, -94, -20, -151, -101, 136, 87, 37, -90, -208, 104, -113, 192, 15, 101, 189, 122, 8, -210, -3, -53, 95, 46, -265, -267, 58, 203, -51, -69, -414, 38, 269, 205, -139, 43, -95, 68, -21, 31, -10, 11, 84, 57, -67, -172, -51, -143, 63, 31, -166, -326, 330, -55, -223, -156, -79, 217, 78, -156, 35, 73, -42, 7, 146, -73, -4, -70, 202, 152, -61, -149, 143, 276, -5, -167, 143, 132, 52, -59, 216, -32, 108, 91, 272, 102, -77, 10, 206, 64, -309, -215, -127, 13, -54, -143, -185, -167, 148, -27, -14, -160, -89, 30, 225, 195, 67, -80, 83, 17, -60, -3, -124, 28, -5, -79, 61, 89, 57, 232, -24, 25, 160, -45, -73, 85, -240, -58, -23, 109, 213, -161, -128, 124, -61, 19, 29, -140, -258, 188, -107, -241, -46, -177, 234, -50, -295, 2, 28, -33, 138, -90, -241, -283, -94, -47, 54, -73, -191, -198, 247, 81, -112]
2955a12K2Q7K77l01J00J7j42J70l1J56l17QK63L28q12K41L3J25k91J57l0r6L02
2978A54l21j61J09j01L84J43k61J08l52L46p1N9j12j59K6K25L8J68j50p5J23J24
3000B44J5l15K57R0k09r8k54R6K21j06K40j78mj40J62L0k89K39R8p8o4m5J86L8
3024A36J09l58K38l9k4J29l31%j78K17N4K50k50j62r3K0K91l0j58P5j38N59l49
3047c2j26J30O3P2j37n0j01K32J34p9J84l74K27j85K98k17j66K53m5J57l91K90
3069A37k56K31P4l18J00j89K51MP7m1k05K30Q4k48k5R7NK41k20p6l9J5O5J56k37
3094h7J21R3k80J03j65K53k60J52J15l3k21L5L3K77Q3l87K86k34m2K04l14N51
3116B83j43J23l62L5QJ33K60l41r8o8K6lJ08J7j37K42k0Q7k44J11K3j80K03l24
$$ y = [-112, -90, -3, 274, -27, 73, 90, -52, 118, 87, 243, -74, -66, 197, 525, -287, -46, -13, 112, -179, -22, -52, -148, 154, -167, -328, -219, -320, 64, 207, -54, 54, -298, 48, -23, 36, -76, -235, -209, 16, 54, 222, 72, -3, 120, 244, 259, -56, 201, 291, 82, -16, -270, -174, 47, -59, 181, 3, -1, -141, 21, 51, -238, 1, 99, 21, -43, -88, 98, 136, 245, -113, 125, 86, 62, 191, -140, -140, -318, -101, -47, 203, -47, -209, -302, -282, 9, -21, -179, -104, -242, 317, -32, -158, -28, 35, 107, -30, -80, -181, 51, 185, 106, 290, -84, 143, -42, 256, 39, -127, 126, 81, 238, -153, 137, -119, 112, 186, -132, -32, -221, 30, 34, 111, 70, -135, 95, 179, -69, -94, 3, 8, 249, 29, -47, -86, -71, -6, 150, -87, 34, 127, -153, -50, -215, 38, -222, -70, 45, 12, -209, -174, -141, 136, 219, -168, 118, -116, -158, 46, -268, 283, 140, 263, -99, -64, -56, 77, 337, -4, -102, -170, -144, -147, -39, -22, -159, 83, 63, 150, -94, 17, 40, -140, 63, -261]
3140b61L9J36r9L21m67M04j28RJ5%L3R7p6q3k22K20j2J42j14J1n5L76l98m4L16
3165A60j99On1J41j97K90k58J4K10j11k24j4j34O88k17j82j33L4K52j97J05k6
3187d3P7k29J24J11j00P3r4R8l2J53l20R1J58m4nm18M59K2j34N0j9j73N7J44J08
3212A14l89J14J55j36K22k44K18n5K88k00j26L9J5J59l9k48Q2m2J30j38j45K03
3234b3k26M83k81k50L17k30N14m40p2J09JL28N0l64N7Qj12o7Q9L6J80q3j62J68
3258C0L8j15K99r3j4k98l0M7J1J95r6j10J70R2j94J07j38Q0J32k20j97J64J13
3281b7J28l1j14J64pj1j58P6k88J75Q9K32q3p0q2K30k02m5PJ20j16J56%k39j6
3306a12J11n9j03M5J60J30j42N7J09j26j10J23j50l8m3K51k5m4lol6K1J28j07
$$ y = [-261, -222, -86, -185, 136, -331, 73, -55, -46, -31, -31, 2, 99, 23, -60, -282, -62, -74, 68, -46, -35, -90, 286, -112, -156, 160, -39, -33, -84, 57, -140, 150, -108, -94, 116, 5, -219, -233, -367, 321, 104, -78, -211, -177, 75, -122, -17, -43, 34, -195, -71, 40, -60, 13, -81, 17, -15, 138, -182, -91, 67, 23, 18, -400, 59, 81, -53, -3, -22, -195, -138, 6, 114, -275, -161, -6, -142, 80, -164, 54, -1, 287, 87, -39, 0, 15, 174, 135, -113, -31, -73, 57, -81, -226, -23, -249, 234, -47, -297, 20, -210, 304, -136, -208, -99, -98, 230, 280, -84, -27, -19, -131, -198, -109, -73, 107, 24, -138, 30, 68, -47, 252, 159, 145, -153, -183, -136, -125, 70, -26, -136, 34, 126, -68, 39, -99, -19, 113, -107, -304, -140, -27, 101, 70, -44, 120, 113, 102, -56, 20, -268, -93, -4, 228, 145, 75, -7, 223, 21, -24, -17, 103, -13, 143, 143, -96, -112, -1, -60, -163, -118, 42, 172, 30, 87, 196, 70, -40, 83, -67, -105, -148, 103, 78, 34, 31, 25, -11, 10, 138, 31]
3330C1J39j70n8J02j74K09k2P9M3k53J45k71M9mK25q8J19j30jK08j89J0k5L30
3354C04m0k23m5N0K65j57j17l42N83k96k23j7K74j6R8l17R7K5k17J18L34k16J56
3377G8j06m7L63l36j23J63J17J19k45Q5l87M61oj63j03k86M09K22Qk29K5j77L6
3400a22L00l39J06j05L41q3o1N5j45M4OJ6r0K31k28k83L33j10j11N89k26m8R2
3423A62l85J69K26l81P4L23l03Q7K94l12k35Q1K46J99j81J26k89K20m9k12j85
3444c25L14j24L35j64L8P6K08l71r0O7J28mO7m8k32O5N3N7k06M8J65k19R0K02
3468A30k80J0K04N4o2r1L4J01j81M4o3J1j3K72j05mj93K26j73J03k49J81M9P5
3492H0J30l28L85l21J10J68k02j8k74L16r2K25k71N2J93j00r7J99K5j62j85L06
$$ y = [31, 170, 0, -58, 44, -130, 79, 57, 136, 179, -74, 71, -200, -151, -155, 70, -18, 101, -29, -30, 178, -11, -1, -26, 304, 264, 41, -4, 46, 311, 154, 37, -305, 278, -18, -241, -258, 16, 0, 98, -219, -122, -97, -314, -196, 138, -78, 78, -28, -75, 288, -48, -171, -8, 109, 228, -17, 68, -319, 142, 136, -27, -130, -416, -7, 215, 223, -6, 19, -158, -122, 178, -161, -55, -160, 181, 98, 37, 92, -53, -9, -3, 13, -77, 154, -74, -357, -24, -134, -245, 344, 118, 70, 162, -223, -54, 172, -209, -135, 188, -115, -28, 266, -46, -281, -200, 46, 245, 64, 190, -99, 121, 72, -140, -325, -11, -135, 200, 36, 74, 150, 358, -13, -103, -36, 92, 88, 155, 107, -125, -60, -7, 50, -156, -108, 57, -162, -72, 130, -150, -140, 64, 118, 56, -35, -1, 100, -81, -37, -100, -89, -102, 170, 65, 61, -132, 94, -79, 24, -225, -44, 5, 80, 210, -118, 267, -54, 56, 224, 22, 4, -270, 46, -46, 179, -92, -40, 153, 53, -44, 155, 180, 18, -167, 139]
3514A39o5k42K15J11k31O9n1K3j5nJ56j93J02N7j14j27K68j41J39j63k1J34o1
3537a6M1K7j06K1Q0n9r0K34o7j2j91L30j21q2q7m2L1mn0K15j9k20M04l42j69J93
3563a01N3j91R5P4j87M18J23k84M7k05K79nk4j48P1P2k4R5l06n7K81K7r4k49J10
3588a30J55M9J8l8nj55J96R9j98l06L80k4o8N4j56m1Q0J54o5j03K78j47K84j95
3612A16j55P9j54L67k55K5j43j27K27J89k35k8n8L96r3j2l38K96l33%j2L82j62
3635b8Q2k59J67J81r3k66J96j82J90J71k4J53k63m5p9L1n0J10l88L45J31j37R5
3658C8K67l70j14J18m6jk08J59J90Nl28K80N0l14L69j65l13P6N02k80J50p2J19
3681A12K9K1K5j99j5k45L88j02lQ6L1m21M26k62R3R8%k25J32OJ32Qj89K17j46
$$ y = [139, 74, -168, 47, 158, -73, -4, -55, -32, -47, -52, 104, -89, 13, 70, -44, -171, 97, -44, 95, -68, -89, 45, -16, 25, 52, -54, -33, 47, -12, -102, 132, 65, 53, -138, 192, 71, -11, -98, -140, -109, -113, -163, 52, 33, -187, 217, -125, -294, -101, -48, -239, -144, -70, -257, 161, 284, 0, 47, -158, 121, 116, 92, -56, 15, 87, 63, 158, -148, -205, 76, 103, 9, -240, -130, 25, 74, 92, 54, 49, -106, 90, 189, -9, -315, 65, 41, -27, 27, -129, -170, -90, 64, -1, -104, 174, 27, 311, 116, -39, 40, -114, 253, -2, 23, -120, -247, -20, 169, -66, -94, -152, 244, 151, 139, -199, 97, -236, -236, -248, 134, -28, 54, -205, -38, 143, 50, -216, -20, -202, -12, 159, 135, 288, 25, -20, -99, -68, -118, -8, -396, -51, 80, -57, 38, 305, -65, -179, -61, -107, -108, -316, -157, 33, 38, -290, -10, 40, -274, 95, -70, -383, -307, 195, -85, 65, -7, 112, 141, 162, 187, -12, -27, -272, 116, 14, 11, 97, 128, -293, 133, -129, -36, 62, 62, -163, -31, -25, 107, 115, -74, 143, -3]
3706cJ86j35j2j32K16k60J08K6K64k19k4J1K6j79K4J26j69J5M9K9l2j00O6J64
3730D5r4Q0k03J65J46k49J26J44L2j27k19L4o5L28k77l0J04o4K52l69K34r5j48
3753b50K26J33j09j61j4K07j0J07k71J63PJ91j61m7p0p1J97k0J6k23O0K16j10
3776FP0l1j93M53l03K2k71K75j95N7m7j79K99q6l6K30m25K73J96p8j90L20j26
3799D1M6j33P0J06N7k28M7K9k38J22M2j3J43l2Qj22J4L04m02J32K01l15K29k90
3823a82J27Q4n9Pj37K80l21o1L73M8k73M4J64J61m81N4M48j15k29J58l9J16J94
3846C61n46J74K34m22J38J44k9j46J49J77j67J4o7K4Jn4k11K01J68k02R5l8l08
3869c10K21K24n4k3k69K30N1J41k24j96Q8L05N3l28j15P5J32Q8L4M7k06k35K49
$$ y = [-3, 183, 48, 36, -96, 120, -140, -32, -6, 258, 39, 15, 26, 52, -127, -103, 23, -146, -131, -82, -53, -85, -185, -119, 45, -49, 31, -172, -7, 139, -110, 16, 160, 192, 65, -154, -120, -185, 143, -134, -164, -60, -124, 128, -241, -7, -102, -250, -24, 109, 0, -161, -175, 32, 22, 129, -142, 21, 28, 219, 58, 11, -59, -130, 67, 47, 63, -160, -100, 116, 6, 76, 45, -148, 305, 2, 24, -247, 28, -167, -110, -157, -336, -37, -123, -159, 71, -354, -81, 115, 37, -153, 167, 41, 87, -46, 24, 130, 187, -41, 6, 35, -203, -81, -39, -52, 91, 59, 67, -55, -41, 263, -139, -7, 194, -121, 108, -182, -55, 29, -30, -23, -160, 120, -201, -262, 111, 159, -114, -70, 94, 255, -226, -172, 276, 161, -68, 90, 51, 167, 361, -185, -11, 223, -199, -61, 83, 54, -92, 57, 234, 67, 81, 14, 38, 39, -15, -226, -25, 143, -59, 36, -2, -310, -89, 135, 81, 58, -211, 19, 70, 211, -13, -209, -121, 184, 237, -91, -206, -131, 1, 89, 123, 170, -36, -271, -22]
3892b2J03j32J88l71K46j6nj22o0J32j42J94K78l70J89J43l57N4k3MK28l1R2k25
3916b5J63q9k85K66k62J86J32m1M5j15K1N7j26j74L73j1r5J01j5q3P2j23K20k08
3940a6M2k44J86J61q5k29J62pJ26J66l3l17qK24j92P1PJ18J31R3l53M0k7J31K73
3965D20m75R5R0K05j91k96J38q1m8j56K78j31O6K02p5r8K9J16l5j00L8k00J28
3988h1N0J86p3R8k18K7k64M46m9p6o0K49k53%L23j36l14J03Q6p1k06J3M33k10
4012Cj85K96j45N3L54l59Pj98J08q1L06j70O1j81J13R4J1j92K67j20k0P6J3M4
4036A55j73KK1j08k3J07N6K19K6m69K51j17J6j32R9Q9k83K18o2P5lJ04k63o8J64
4061i9K87j40j17NJ55l24R6J28q3K52q1J25j37j08Q1J02k82P4L1r4K12j08J36
$$ y = [-22, 81, -51, 137, -234, 12, -4, -9, -131, -191, -59, -201, -7, 271, -99, 90, 233, -124, -70, -93, -89, 139, 108, 200, -25, 138, 49, -236, 30, -232, -46, 86, 45, 90, -25, -4, 53, -73, -247, 126, 115, 20, 121, 106, 23, 95, -28, 192, -16, 26, -218, -32, 129, 44, -185, -23, -30, 96, 262, 229, -88, -96, 128, -64, 7, 14, 132, 263, 356, 3, 43, 16, 147, 420, -55, 40, 130, 335, 144, -152, -14, -95, -143, -299, -21, -152, -86, 116, 41, -57, -28, 88, 53, -47, -9, -209, -81, -31, 155, 82, 180, -38, -11, -275, 171, 122, 46, -14, 235, -18, -18, 305, 169, -145, -42, 44, -27, -233, -220, 213, 3, -182, 114, -31, 22, 376, 17, 24, -174, -66, -147, 159, -11, 50, -131, -18, 76, 87, -105, 162, 42, 22, 98, 111, 155, -18, -16, 5, -103, -126, -19, 37, 256, 282, -187, 64, -53, -37, -169, -70, 19, -264, -46, -108, -33, -36, 68, -195, -263, -99, 188, 48, -69, -64, 91, -233, -137, -9, -92, 160, 79, 204, 67, -41, 40, 142, -140, -66, -35, -129, 83, -25, 111]
4084A11j83K3J21j76J25N0l36J39J25q5K01l4r6K42k82J55j69J32Ln4n8J11j30
4107f5N4J2J64k09j69J19K10J95n54K33n5o5K32m3k13J17m2K13m8j30o6l1J53
4130A2J36l14J91j41J35M3r5j03J77K43q6j72K34m73J43O5L26l38k8n9J79rm7
4153A9O3r9P5p6K94k55J0j0L7n1K24l93J65o0O4j77M0L24k60J8K6J87j83M6j08
4178h0m4o6L71o6k66J38nj6M2n6J11j96P8O4k01J73RL1r1K99j08k78K20k21J95
4203C7J16r7L8n0k2l7N5L0j45R7pJ90l72Q0L7J61o9K13j95J43k33m1J94M3j31
4228C5k60L56k27KK02q6j31J56k58J40p8K67l06K63R0k37N1Q7j06J22j5N5l68
4251b46R9J79o9J94k38j74K77p1q6J01J41R4j23l37L8L82p8m2k79J05J90j54K06
$$ y = [111, -72, -49, 72, -104, 21, 71, -265, -126, -1, -86, 115, 81, -15, 227, -55, 100, -69, 63, 66, 12, -46, 65, -65, -11, 1, 165, -44, -213, -94, 116, 311, -243, -10, -65, -130, 102, 59, -154, -37, -79, 134, 86, -44, -110, -141, 12, 148, -166, 25, -116, 19, 62, -33, -136, 41, 284, 198, 26, 260, -213, -70, -5, 321, -17, -45, -104, 75, 66, 19, 82, -17, 58, -18, 276, 21, 31, 21, 58, 7, 231, -162, 3, -57, 7, -170, -130, 194, -66, -48, -22, 165, -18, 28, -80, -124, -190, 181, 115, -151, -13, -18, -34, 8, -48, 63, -133, -55, 9, -192, -19, -10, 21, -70, 229, 121, -157, 63, -158, 37, 153, 56, 94, 44, 22, -15, 40, 70, -75, 22, 15, 205, -167, -87, -50, 111, 42, 255, 60, 203, -30, -71, 123, 166, 35, -225, 131, -96, -94, 108, 22, -109, 47, -211, -71, -149, 118, -188, 75, 165, -72, -21, 66, -40, 82, 67, 122, -246, -147, 32, -37, 157, -81, -255, 22, -49, -135, -34, 107, 201, 78, -259, -221, 161, 83, 41, -238, -133, 57, -97, 109]
4274A09k92K21j51J24k30K06R9p2j14K58m1k65M5K19J42l29P3Q8J32k69p7K9k84
4297c79L80j37O2l5j84L31l3k10K87j17j5K24n1k03J52j34R1k69J39l5J36j22
4319a22K80Pn4k87K19J09j93K24k23P4M3N2j27j06k37J05J29L9M61n46k1J13J60
4342I9o30N83k17J23On6K3k0J92%k55J25J08r0J97k19J04K06k10j01K8j67N6L2
4366h3J35k54J50j27J44pP6N4l07K29M2j77n8K91k8J07K0j61o2K91r0l46K47l7
4390D9M1j39j6J37n0j7J05j82J49q8J13OJ3n68N85J5j99K53k17j68L35m1j7j69
4414g0O5J82k43j86L14j86K77k54O7jJ39r7k1J41j63O9M8j05J49r1l55L57Q0O1
4438A77l07O2K5J62l24L00j06PQ5m7j18J23l67K79N2o5j06j19L40J43m46M49m07
$$ y = [109, -183, 38, -113, 11, -219, -13, 86, 14, -100, 158, 117, -148, -103, 116, 258, -71, 2, 90, 222, -47, -124, -95, -379, 1, -136, -74, -109, -293, 38, 5, -205, 82, -35, -50, 174, 123, -80, 72, -62, 29, -240, -101, -136, 0, -122, 158, 165, 111, -176, 43, 152, -41, 183, -40, 34, 77, 129, 2, -104, -341, -236, -107, -68, 393, -153, -174, -61, 99, -531, 52, -165, -42, -36, -92, -69, -89, 103, 103, -152, -27, 81, -9, 188, -31, 73, 279, 69, -32, -4, -171, -115, -83, 52, -202, -52, -179, -35, -42, 34, 88, -219, 10, 52, -125, -183, 108, 80, 187, 207, 46, -16, 275, 185, -161, 86, 49, 90, -49, -65, 72, 22, 5, 110, -72, 77, -11, 102, 108, 121, -447, 138, 153, -46, 207, -10, -178, 157, 116, 99, -70, -5, 177, -66, -252, 62, -124, 153, -101, -34, -35, 104, 7, -14, 127, -36, 33, 81, -24, 125, 34, -321, 36, 116, 177, -130, -68, -43, 119, -205, 95, -11, -4, 81, 34, -84, 39, -328, -49, 3, -62, -168, -287, 53, 196, -250, 199, -208]
4461b08J85j81J39k4j1o5J33J5j05rJ40m0J1J20j91J74k6j64k08M87M1k30m1K42
4485A84j68J27j59N5O2j29K78m23L60k38Q6m3r4J77j24R8o5j12L31j06j99p0J57
4508a5r2J09L5k17J40j19L17n4J2k33p7L18p9k42K15j35N1J86j63k1J22K1j59
4531h0Qj30L66k33K91l19L3K43rnk98K57l18K19R0P9q6k17K00K8j90j87M18l74
4555b14L66P4l31J36j54K69j48j20J90j64k6r0J45j19M14k93MK5K9P1K31l48J31
4578G8J31j51K2j6j94J65L0j61J10n9o4P2J5k16j36J49N6J91j29P4r8r7K19O9
4602F0q2J7j59R0P7j67L42q0j79K18j2k4j68p8J03p3q9Q3J89j16j64J66L13l61
4626i4K13j63j2P7J17k38J83k1J10j81J81j98p8N8QR9K55l17Q5k17J31M1j2p0
$$ y = [-208, -23, -204, -65, -89, -100, -165, -32, -17, -122, -131, 9, -31, -20, 100, -91, 83, 57, -107, -315, 172, 213, -17, -58, 184, 16, 143, -16, 39, 101, -28, 250, -173, 187, -51, 35, -8, -102, 75, -49, 49, -16, -128, 203, 97, -102, -172, -15, -107, 2, 37, -180, -40, -159, 158, 104, 116, -117, -194, 124, 45, -197, 18, -117, -66, 120, -43, -64, 58, 79, -80, -72, -202, 164, -69, 222, -97, -64, 179, 170, 165, -133, 124, -194, 25, 115, 194, 108, -109, 91, 119, -71, -258, 160, -214, 152, 226, -105, 31, -123, 146, -2, -122, 68, -96, -122, -212, -67, -186, 228, -65, -61, -36, -7, 64, 295, -53, 78, 209, 58, 80, 64, -130, 35, 65, -96, 14, -45, -109, -37, -22, -238, -374, -225, -169, 22, -107, -33, -131, -228, -9, 60, -22, -5, -164, -74, 3, -164, 178, 98, -81, 137, 125, 101, -67, -145, -42, -115, -204, -121, 68, -48, -212, -46, 267, -94, 119, -44, -56, 21, 138, -100, 83, 62, 172, -9, 172, -26, -104, -46, -38, 61, 316, -1, 84, -133, -2, 39, 27, -43]
4650d3n2M9K28j28l85M47J49k22r4q6j59L1K60r1K45j60P5j4j47M35l60P8p0j1
4674b5J60L0k56P3K35j59j07NJ0r2l0J1M38o3m7l26Q1Qk41K10J55O0k27K25l2
4699I6q7J46o93N65j93QJ53J34K6j2j14K0l30K34K46m18L19j88J65j96K22J24
4721B27j55k93J60j57J12J35j73Q6j18K30k7o9K18k3m0m08J4K38J39l33K02J86
4743A51k87J63N7J07k12K7m4J0M9j73O2M5k2J4J3j22J63J15k03nP4j37J19j6J06
4768E4l1k39L59j28r3J24j17J91j99K43J01m06K02P2m7n9M4M2j9k69Q2J4j85K26
4792c8J81l19J48J50P2j82M7l26L61k78Q6M15m89J75PK68l13K43o4k67K77k90
4814a36l4J47jR6j78L46l72m7L94L7j76k17J70Pk45j59N58l06O1k5O1J37j84K94
$$ y = [-43, -95, -46, 182, 54, -331, 116, 265, 43, -51, -137, -296, -265, -5, -96, 149, -11, 64, 50, -97, 338, -22, 56, -14, -25, 135, 165, -91, -18, 217, 58, -49, -44, -34, -126, -156, -145, 293, 230, 183, -143, -62, -54, -295, -85, 70, 130, -97, 128, 96, 9, 155, -538, 27, -166, -158, -5, 129, 155, 143, 29, 49, -281, -47, 199, -219, 100, -88, 77, -119, 103, 227, 72, -221, -61, -218, -106, 29, -144, -58, -176, 54, 27, -42, 176, 153, 113, -295, -281, -43, 96, -237, -35, 151, -136, 27, 84, 191, -21, 6, -38, -28, 21, -152, -90, -45, -67, -53, -40, -162, 1, 116, -87, -92, -18, -155, -36, -52, 54, 23, -216, 143, 15, -78, 46, -71, 120, -79, 164, 265, -141, 61, 133, 86, 27, 71, 113, 94, -175, -93, -79, -264, -38, 143, -176, -28, 122, 194, 12, 59, -267, 94, -184, -98, 317, -172, 3, 10, 278, -35, 208, 144, -123, 154, -136, -170, -23, -24, 72, -106, 240, -132, -179, 215, 252, 76, -141, 29, 36, -209, -368, 190, -116, -55, -80, -19, 118, -66, 228]
4838B28l09L98r9k43m2L2M5J11p9N6N3j64Q2k25J00K1m6j07Q1M1p8N5J73K18k84
4863A8j97M26k39q7K53j66M8k35M39k68L4o0P7j41j67L84q1k95J57J25nMn3m7
4887g6N2m5m0O3k55M46l22J56j55K71j39r0L33j8j45J59j51j08O2M2j39o9K04
4910C6k2P8j12k09J04J12K1l2L1j46Q4K41m03L00j61P1j8j08p1J95O7j3nlK07
4935B44k09K56m80K89j83J60K42m95J80P0m9J90j61q7rq7R1k0M3k16L37R9j41
4958F4o8n4P2o5J49j18k70L64j13J75J41l66M13l58M2n5J30j90P0Q0k58J37j11
4981a89K67j63K54M1k97qO1r6L01k52j57L00Q1j01n5J4J07k58N29n49J89L26m35
5004i0L16j54m0O8l42R4J64p1J03o4L0P1l26M28j90o1Q7j51lR5j43LL72m10qK24
$$ y = [228, -81, 317, 218, -25, -67, -35, 10, 121, 42, 98, 151, -13, 69, -156, -56, -35, -81, -188, -107, -66, -144, -89, 84, 302, 18, -179, 247, 8, -79, 174, 8, 56, -179, 260, -8, 26, -34, 43, -98, -265, 119, 38, -257, -100, 25, 20, 24, -29, -76, -24, -69, -109, -46, -301, 145, -177, -21, -176, 95, -44, -134, 199, 181, 36, 195, 44, -64, -2, 40, -99, -168, 36, 14, 92, -20, -229, -125, -13, 8, -24, 7, -139, -55, 186, -217, 83, -78, -7, -25, -133, -204, -9, 58, 45, 40, 37, 244, 35, 291, -189, 100, -83, 77, 319, -176, 4, 74, 25, 215, 54, -33, -42, -129, -38, -58, -15, -231, 106, 205, 64, -4, -58, 14, -51, 98, -20, -290, 74, -39, 136, 277, -89, 324, -34, 8, -47, 83, -107, -37, 43, -215, -78, -189, 78, -85, 169, 210, -87, -95, -34, -130, 171, -81, -238, 62, 143, 42, -13, 1, 108, -150, 379, -170, 19, 345, -90, 226, 72, 32, 100, -242, -148, 16, -55, 48, -16, 14, 85, -241, 187, -3, -64, 23, -128, -131, -36, -179, -176, 196, -214, -222, 2]
5030BJ52NJ10l29M3pj28R9J97j23j32K14k47J47j88J72j86J56N0j09l9j7K83j36
5054a1j10k00K10N3L0p3K9R9j47J10k7R2l9J40k7Q9j29l89L35K60j28m48L17J10
5078A46k02K57k86K44l32j44L56P6j44K4j3J08j79J68Oj07k2K4L16n73L19R5q
5101A29n3l7O5j35Q9j46M39n82J29J49J76l35K04R1n6j15j44L90l16J69Ol10L48
5124A55k10K07k77K04J82l12q4M59l14r0K71m0j82j03L4j23J38K3K7Q6k06M18
5146B63m41J21j40K03L6l12J60L86l09j50J10J24o9J26L5j88J85l4Pl26J33J10
5168C0r0J9r2K22m2l47L20n8J54k16P4P0o4j00j0J10J17%j79K16l37K38k32L12
5192A15J37m0l43J12J2L9Q0N0mj83j9N0J35l85K73j12K8l8R9p0P5j96J19K2p9
$$ y = [2, 154, 159, 269, -60, -17, -24, -152, -53, 144, 21, -111, 103, -144, 3, -185, -13, -199, -43, 7, -102, -141, -158, 125, -11, -121, -321, -111, -58, -28, -101, -72, 27, -120, -10, -37, 55, 16, 156, 129, 218, 89, -300, 35, 295, 167, -281, 36, 146, -56, 201, -85, 159, -173, -317, 39, 115, -29, -5, -18, 90, -89, 79, 85, -22, -44, -20, 296, -277, 42, 137, 129, 76, 39, 104, -31, 58, -88, 351, -231, -102, 47, 223, -112, 92, 183, 127, 12, -132, 258, -58, 111, 117, -193, 155, -55, 152, -125, 79, 261, -51, -135, 324, 10, -80, 191, 151, -31, -134, -100, -223, -85, -62, -35, 51, -155, 263, -178, -57, -197, 6, 42, -270, -110, 276, -33, -183, -73, 51, -18, 108, 143, -45, 140, 106, 113, -213, -80, 30, -60, -41, -133, 89, 47, -300, 20, -38, 116, -100, -26, 44, -20, -120, -130, -20, 97, 97, -82, 134, -203, 35, -197, 115, 252, 212, -131, -19, -7, 32, 112, 162, 158, -25, -44, 6, 141, -244, 29, -83, -55, -93, 6, -64, 11, -185, -66, -44, -123]
5217a23J22O7m7l22O49o11J77kO52m53k01K87K2r8l65M15j62J25rk07K03j44M8
5240B3j14J40q6LQ0j32Q4k15K53k1J38m09J78J88j49J86q1j55l5K03KJ92j80k44
5264a51K30J42k95J37O0k83N5K8j02R2J51k93J81J0J60j57K20l54K60p8J49l70
5286b08j8n2N41l11O4K3p3n3J91l4l21J01K85o5j3m9q1J86j09m9J36R4l87J92
5310a0Q4j32K72k29k6o2O1K23k19K75k20R7j70L45m66K90P6j14Q9qk90J08j81
5333b07n9J63Q4J39j41j97J48K23j6k07j07J93k36K39J89k72k6K58Q6k92N0j61
5355a49J5Q5J38l13J72J35k38L51k25q8J99n9K5L68n59K54k22L35j88n2%N5J50
5378A89l49K32k0n5R3q4K17l87J83J90J52l47j44L00k65J08q3O1K26j04k31L27
$$ y = [-123, -1, 66, 19, -303, 346, -265, -88, -90, 562, 109, -92, 195, 217, 119, -246, 169, 7, 132, 123, -84, 119, -25, 23, -91, 49, -37, -34, 46, -86, -2, -217, 36, 15, 153, -256, -78, 110, -39, 147, 66, -89, -124, 79, 81, 273, 93, -151, 79, 221, -74, 63, 123, -160, -105, -77, -179, -87, 64, -229, -48, -38, 122, -35, 185, -169, 91, 13, 162, -208, -226, -278, 263, -48, 16, 39, -34, -87, 104, 70, -251, -150, 135, 70, 57, 8, -73, 113, 4, -45, 91, 185, -202, -10, 74, -58, 214, -15, -41, -103, -42, 181, -38, 237, 17, 114, -56, 289, -177, 113, 189, 75, 164, 156, -134, -26, -207, -266, -103, -19, 120, -21, -218, -70, 153, 137, -70, -177, 16, -220, 19, 208, -64, -90, 168, 254, -38, 12, -149, -134, -49, 89, -224, -52, 83, -155, 196, -29, -117, 82, 23, 48, 416, -143, 111, -111, 224, 36, -16, -16, 39, 189, -160, 72, 52, -3, 90, 6, 223, -164, 19, 209, 361, 14, -130, 170, -95, 13, -70, -9, 217, 113, -118, 209]
5400B09k1j57n4j61M43l51J64N5m1L0M6m7j16n5J61J14q4R2q8j9j00j29K75l33
5424a67P2J47j27O3j1K6J0o7N18o10K50k66O7K07k18J98L2k07J32K68l86M1p8
5447a06L40r6j07k52K77L6j0j79N0k4m9M8P3N1j14j61J05J60K84l68rJ61j38j5
5471d3J1n8J49P3N8p7p0J48l61J06K49m52K60J40j67k11P4J74j55J27ll7K98l13
5495h0j96N12m51K75j03K36j4m87J65L42l62n7J8K21Rq5K30q9l59M99r0j41q6
5518i3l14J88M99q0l81J01J31R2l07L9K8J25L3j02M9k28J76k09L40j00J29k36
5540a20L57l47J04M7n4O2k73L38Q3k79J87k23J82r8J45l9p4J06o0r1J46lj82q3
5564a69J98O1k13K48k3k57J68J66k80J31j47J42k2J39K4J2m27N01m47K40j21m9
$$ y = [209, 188, 31, -23, -184, 259, -92, 72, 127, 86, 116, 162, 115, -1, -56, 105, 219, 135, 227, 139, 120, 20, -109, 166, -167, -95, 52, -75, -12, -23, 3, 13, -54, 464, -146, 104, -162, -95, 112, -106, 92, 124, -83, 49, 317, -69, -28, -106, 234, 138, 31, -221, 56, 92, 82, -97, -47, -71, -120, -72, 1, 52, -62, -223, -118, 42, 326, -42, -51, 110, -28, -43, -32, -90, 59, 132, 190, 113, 43, 191, -170, -64, 185, -267, -7, 133, -34, -245, -171, 3, -152, -25, -28, -65, 233, -80, -276, 236, -215, 60, -43, 193, 179, -308, -143, 199, -163, -220, -202, 19, 28, -57, 173, 84, -275, 224, 134, -7, -93, -407, -219, 280, 200, -181, -80, 51, 143, -164, -125, -97, 28, 61, -41, 8, -220, -44, -253, 87, -13, 116, -120, 237, -110, -6, 41, -13, 49, -224, 114, 197, -82, 105, -118, 64, -34, 111, 72, -2, 104, 44, -47, 99, 96, -86, -169, 29, 90, -123, 125, 102, -155, 13, 179, -101, 30, -117, 25, 3, 142, 166, 178, -249, 252, -195, 45, -76, -125]
5586a25J97K3r8K67k90jL14n02K83p9n1nK47k15k6j01m7K12M4jj47N5O2q0jj7
5612h2j09L25j67J46o8P1r7M8J53k84L28l05j24k4O9O4N7r2O0N7J95j33j03P0
5636E5p9J04k62J77O6o7j35L10M7j59j16mQ9N7Q1Q3l47n4J77j23M0K1k0j9k5N8
5662d5J95J70k55p3K6J01l51K53n0J02k2R4j67J5j02Q1j25L13j52k54J77J33j36
5685g2j24K72j8k87J20J19j48J65j35J16j11K56j8j12M1j76J03O9k51L57l54K30
5707D2j74P8K58l24N3j02J09J63j53k6J31J10j74P5j99J25j10n2K29J6l58N87
5729C04k69J38j19M1k67J34M2l08Q7O7J13L4p2K58j02j53J56l03K87j12m4R8R8
5752A08p5j16L10j61j16j00K22j26%J03Rk2R7m21L89P4l27J04q2Q4J26l3j60K2
$$ y = [-125, 72, 95, -3, 264, -26, -27, 287, -215, 68, -11, -62, -67, 180, -35, -61, -162, -209, 3, 47, 46, -101, -46, 16, -64, -65, -82, -191, 134, -33, 113, 45, 116, 19, 67, 220, -64, 264, -41, -165, -189, -120, -56, 1, -91, -31, 26, 221, 88, -15, 55, -24, 80, -182, -5, 61, -6, -141, 169, 216, 57, -59, -63, 26, 83, 164, 247, -100, -154, 23, -100, -60, -39, -59, -78, -103, -45, 150, 320, 65, -8, 18, 119, -232, 21, -29, 73, 51, 145, -22, -7, -109, -28, -153, 160, 8, -246, -69, 64, -72, -196, 76, 58, -229, -109, 10, -138, 27, -108, 8, -103, 153, 135, 23, 64, -112, -9, 60, -191, 166, -188, 42, -132, -54, 204, -120, -67, -169, -60, 103, -50, -76, 55, 165, -9, 66, -133, -8, -118, -170, 59, 75, -283, 304, 35, 173, 54, 95, -172, -38, 4, -304, -217, -150, -37, -3, -75, 183, 81, -72, 84, -219, 68, -44, -88, 10, 108, 33, -83, 227, 66, -50, -150, 72, -54, -54, 49, 58, 36, 133, -288, 101, 175, -152, -48, -130, -46, 80, 47, -113, -91]
5776i1J00j66L54j15q8P8j94K19m4k21J09L03p2k04k28J94r8K58N2l12L14j86
5798c8P4K32j17r6J62j29m0K5j1n7l72M05M9r6J10P9j28j6j13M54k37l25J51p4
5822a08J93k52K73j44J99M4l02p6J46j22J10J54j1p6L2l6J68k67M4rJ0Lj13qQ7
5847f1j0o6K0J75n72M56M8jJ16q3j24J60K26j97M3l26J51J44k10K15k49R0J05
5870E0k24L31k07K28j77L58m23j98L39K3J38m38O9J74m5P8j34P1k6M2J06k85J64
$$ y = [-91, 9, -157, 197, 82, -6, 72, -122, 97, 53, -168, -59, 244, 172, -32, -260, -66, -164, 94, 146, -166, 148, -38, 36, 268, 151, 55, 217, 88, 48, 73, 62, 5, -367, 38, 87, -9, 101, 180, 52, 36, -77, 377, 140, -185, -34, -108, 85, -167, 106, -38, 161, 205, -97, -173, -27, -149, -39, 115, 104, 28, 60, 24, 192, -75, -31, -40, -30, -27, -140, -148, -61, -71, -137, -117, 58, -514, -58, -10, -11, 105, 22, -102, 58, 284, 87, 130, -196, -45, 99, -111, 104, -145, -55, 50, -174, 157, -50, 178, 1, 359, -64, -262, 77, 100, 238, -200, -131, 43, -2, 76, -58, 13, -13, 29, 135, -150, 14]
$$ [...]
8191A3
##END NTUPLES=NMR FID
##END=
