##TITLE=1H_LR-758-R3-KA3i
 DMSO
 8 sc, 
 3.8.2023
##JCAMPDX= 6.0         $$ Bruker NMR JCAMP-DX V2.0
##DATA TYPE= NMR FID
##DATA CLASS= NTUPLES
##ORIGIN= UXNMR, Bruker Analytische Messtechnik GmbH
##OWNER= root
$$ XWIN-NMR		Version 3.5
$$ Thu Aug  3 15:10:18 2023 Russian Standard Time (UT+4h)  she@DPX200
##.OBSERVE FREQUENCY= 200.13135
##.OBSERVE NUCLEUS= ^1H
##.DELAY= (6, 6)
##.ACQUISITION MODE= SIMULTANEOUS
##.ACQUISITION SCHEME= undefined
##.AVERAGES= 8
##.DIGITISER RES= 18
##SPECTROMETER/DATA SYSTEM= spect
##.PULSE SEQUENCE= zg30
##.SOLVENT NAME= DMSO
##.SHIFT REFERENCE= (INTERNAL, DMSO, 0, 15.7039)
##AUDIT TRAIL= $$ (NUMBER, WHEN, WHO, WHERE, WHAT)
$$ ##TITLE= Audit trail, XWIN-NMR		Version 3.5
$$ ##JCAMPDX= 5.01
$$ ##ORIGIN= Bruker BioSpin GmbH
$$ ##OWNER= she
$$ F:/spectra/data/she/nmr/H-F/1/audita.txt
$$ ##AUDIT TRAIL=  $$ (NUMBER, WHEN, WHO, WHERE, WHAT)
(   1,<2023-08-03 15:08:54.60 +0400>,<she>,<DPX200>,
      <created by zg, POWCHK disabled, PULCHK disabled
       configuration hash MD5:
       00 E9 B6 7A A2 85 ED C7 34 08 36 98 17 FE 4E 26
       data hash MD5: 16K
       CD E4 D3 27 34 37 5A 10 11 F3 61 2F D3 B7 A3 9B>)
$$ ##END=
$$ 
$$ hash MD5
$$ 9D 1C 6C B6 05 F4 03 8B 92 79 A5 27 58 09 05 D9
##$RELAX= 
##$RELAX= 
##$RELAX= 
##$RELAX= 
##$RELAX= 
##$RELAX= 
$$ Bruker specific parameters
$$ --------------------------
##$DU= <F:/spectra>
##$EXPNO= 1
##$NAME= <H-F>
##$PROCNO= 1
##$TYPE= <nmr>
##$USER= <she>
##$AMP= (0..31)
100 100 100 100 100 100 100 100 100 100 100 100 100 100 100 100 100 100 
100 100 100 100 100 100 100 100 100 100 100 100 100 100 
##$AQSEQ= 0
##$AQ_mod= 1
##$AUNM= <au_zg>
##$AUTOPOS= <>
##$BF1= 200.13
##$BF2= 200.13
##$BF3= 200.13
##$BF4= 200.13
##$BF5= 200.13
##$BF6= 200.13
##$BF7= 200.13
##$BF8= 200.13
##$BYTORDA= 1
##$CFDGTYP= 0
##$CFRGTYP= 5
##$CHEMSTR= <none>
##$CNST= (0..31)
1 1 145 1 1 1 1 1 1 1 1 1 1 1 1 1 1 1 1 1 1 1 1 1 1 1 1 1 1 1 1 1 
##$CPDPRG= <>
##$CPDPRG1= <>
##$CPDPRG2= <>
##$CPDPRG3= <>
##$CPDPRG4= <mlev>
##$CPDPRG5= <mlev>
##$CPDPRG6= <mlev>
##$CPDPRG7= <mlev>
##$CPDPRG8= <mlev>
##$CPDPRGB= <>
##$CPDPRGT= <>
##$D= (0..31)
0 1.2 0 0 0 0 0 0 0 0.06 0 0.03 0 0 0 0 0.0002 0 0 0 0 0 0 0 0 0 0 0 0 
0 0 0 
##$DATE= 1691060934
##$DBL= (0..7)
120 120 120 120 120 120 120 120 
##$DBP= (0..7)
150 150 150 150 150 150 150 150 
##$DBP07= 0
##$DBPNAM0= <>
##$DBPNAM1= <>
##$DBPNAM2= <>
##$DBPNAM3= <>
##$DBPNAM4= <>
##$DBPNAM5= <>
##$DBPNAM6= <>
##$DBPNAM7= <>
##$DBPOAL= (0..7)
0.5 0.5 0.5 0.5 0.5 0.5 0.5 0.5 
##$DBPOFFS= (0..7)
0 0 0 0 0 0 0 0 
##$DE= 6
##$DECBNUC= <off>
##$DECIM= 32
##$DECNUC= <off>
##$DECSTAT= 4
##$DIGMOD= 1
##$DIGTYP= 9
##$DL= (0..7)
0 120 120 120 120 120 120 120 
##$DP= (0..7)
150 150 150 150 150 150 150 150 
##$DP07= 0
##$DPNAME0= <>
##$DPNAME1= <>
##$DPNAME2= <>
##$DPNAME3= <>
##$DPNAME4= <>
##$DPNAME5= <>
##$DPNAME6= <>
##$DPNAME7= <>
##$DPOAL= (0..7)
0.5 0.5 0.5 0.5 0.5 0.5 0.5 0.5 
##$DPOFFS= (0..7)
0 0 0 0 0 0 0 0 
##$DQDMODE= 0
##$DR= 18
##$DS= 0
##$DSLIST= <SSSSSSSSSSSSSSS>
$$ [...]
##$SUBNAM2= <"">
##$SUBNAM3= <"">
##$SUBNAM4= <"">
##$SUBNAM5= <"">
##$SUBNAM6= <"">
##$SUBNAM7= <"">
##$SUBNAM8= <"">
##$SUBNAM9= <"">
##$SW= 18.05172834244
##$SWIBOX= (0..15)
0 0 2 0 0 0 0 0 0 0 0 0 0 0 0 0 
##$SW_h= 3612.71676300578
##$TD= 16384
##$TD0= 1
##$TE= 0
##$TE2= 300
##$TE3= 300
##$TEG= 300
##$TL= (0..7)
0 120 120 120 120 120 120 120 
##$TP= (0..7)
150 150 150 150 150 150 150 150 
##$TP07= 0
##$TPNAME0= <>
##$TPNAME1= <>
##$TPNAME2= <>
##$TPNAME3= <>
##$TPNAME4= <>
##$TPNAME5= <>
##$TPNAME6= <>
##$TPNAME7= <>
##$TPOAL= (0..7)
0.5 0.5 0.5 0.5 0.5 0.5 0.5 0.5 
##$TPOFFS= (0..7)
0 0 0 0 0 0 0 0 
##$TUNHIN= 0
##$TUNHOUT= 0
##$TUNXOUT= 0
##$USERA1= <user>
##$USERA2= <user>
##$USERA3= <user>
##$USERA4= <user>
##$USERA5= <user>
##$V9= 5
##$VALIST= <valist>
##$VCLIST= <CCCCCCCCCCCCCCC>
##$VD= 0
##$VDLIST= <DDDDDDDDDDDDDDD>
##$VPLIST= <PPPPPPPPPPPPPPP>
##$VTLIST= <TTTTTTTTTTTTTTT>
##$WBST= 1024
##$WBSW= 4
##$XGAIN= (0..3)
0 0 0 0 
##$XL= 0
##$YL= 0
##$YMAX_a= 32770
##$YMIN_a= -42386
##$ZGOPTNS= <>
##$ZL1= 120
##$ZL2= 120
##$ZL3= 120
##$ZL4= 120
##$ABSF1= 10
##$ABSF2= 0
##$ABSG= 5
##$ABSL= 3
##$ALPHA= 0
##$AQORDER= 0
##$ASSFAC= 0
##$ASSFACI= 0
##$ASSFACX= 0
##$ASSWID= 0
##$AUNMP= <proc_1d>
##$AZFE= 0.1
##$AZFW= 0.1
##$BCFW= 1
##$BC_mod= 2
##$BYTORDP= 1
##$COROFFS= 0
##$CY= 11.3945322036743
##$DATMOD= 1
##$DC= 2
##$DFILT= <>
##$DTYPP= 0
##$F1P= 15.7292609196834
##$F2P= 12.9074282941183
##$FCOR= 0.5
##$FTSIZE= 0
##$FT_mod= 4
##$GAMMA= 1
##$GB= 0.15
##$INTBC= 1
##$INTSCL= 1
##$ISEN= 128
##$LB= 0.24
##$LEV0= 0
##$LPBIN= 0
##$MAXI= 10000
##$MC2= 0
##$MEAN= 0
##$ME_mod= 0
##$MI= 1.114404
##$NCOEF= 0
##$NC_proc= 0
##$NLEV= 6
##$NOISF1= 3.799351
##$NOISF2= 2.8
##$NSP= 1
##$NTH_PI= 0
##$NZP= 0
##$OFFSET= 15.70392
##$PC= 1
##$PHC0= -21056.58
##$PHC1= 29.05272
##$PH_mod= 1
##$PKNL= yes
##$PPARMOD= 0
##$PSCAL= 0
##$PSIGN= 0
##$REVERSE= no
##$SF= 200.130013532006
##$SI= 16384
##$SIGF1= 3
##$SIGF2= 2
##$SINO= 400
##$SIOLD= 16384
##$SREGLST= <1H.CDCl3>
##$SSB= 0
##$STSI= 0
##$STSR= 0
##$SW_p= 3612.71676300578
##$SYMM= 0
##$S_DEV= 0
##$TDeff= 0
##$TDoff= 0
##$TI= <>
##$TILT= no
##$TM1= 0
##$TM2= 0
##$TOPLEV= 0
##$USERP1= <user>
##$USERP2= <user>
##$USERP3= <user>
##$USERP4= <user>
##$USERP5= <user>
##$WDW= 1
##$XDIM= 8192
##$YMAX_p= 0
##$YMIN_p= 0
$$ End of Bruker specific parameters
$$ ---------------------------------
##NTUPLES= NMR FID
##VAR_NAME=  TIME,          FID/REAL,        FID/IMAG
##SYMBOL=    X,             R,               I
##VAR_TYPE=  INDEPENDENT,   DEPENDENT,       DEPENDENT
##VAR_FORM=  AFFN,          ASDF,            ASDF
##VAR_DIM=   8192,          8192,            8192
##UNITS=     SECONDS,       ARBITRARY UNITS, ARBITRARY UNITS
##FACTOR=    0.0002768,     1,               1
##FIRST=     0,             0,               0
##LAST=      2.2672688,     0,               0
##MIN=       0,             -42386,          0
##MAX=       2.2672688,     32770,           0
$$ Real data points
##PAGE= N=1
##DATA TABLE= (X++(R..R)), XYDATA
$$ plain form
0 0 0 0 0 0 0 0 0 0 0 0 0 0 0 0 0 0 0 -7 8 -8 8 -8 8 -11 16 -16 17 -24 24 -32 32 -40 42 -48 56 -64 71 -79 88
39 88 -98 108 -122 135 -148 164 -181 200 -221 243 -267 295 -326 358 -396 436 -484 539 -600 671
59 671 -754 856 -983 1141 -1349 1633 -2052 2729 -4003 7271 -36869 -42386 26418 24721 -6764
74 -6764 -28412 -11700 9078 16554 -1145 -5262 1925 -1392 -6206 15869 22954 -6626 -25946 -497
88 -497 28002 22049 -12511 -29790 -2346 32586 16507 -20787 -18257 9176 13209 3104 -35
101 -35 -754 -3570 -2221 5243 15759 9657 -16156 -19139 15238 30778 -1066 -27504 -11497 16267
115 16267 18691 -3940 -21418 -9298 10861 6567 -7047 -3833 -1662 -9495 -3847 11452 9397
128 9397 -9667 -17977 -1908 21165 15951 -15394 -22865 7167 23843 4250 -14624 -9454 3861
$$ packed form
0@%%%%%%%%%%%%%%%%%pJ5j6J6j6J6j9K7l2L3m1M8n6O4p2Q2r0J04j20J35j50J67
39H8j86K06k30K57k83L12l45L81m21M64n10N62o21O84p54Q32r20J023j139J271
59F71j425J610j839K124k490K982l685M781o732J1274m4140n517O8804j697l1485
74f764k1648J6712K0778P476j7699m117P187l317m814K2075P085k9580j9320K5449
88d97K8499n953l4560j7279K7444L4932j6079l7294K530K7433M033j0105l139
101c5p19k816J349P464J0516o102k5813k983L4377J5540l1844k6438J6007K7764
115A6267K424k2631j7478J2120K0159m294j3614L214K171p833N648J5299k055
128I397j9064q310J6069K3073n214l1345p471L0032J6676j9593j8874N170J3315
$$ plain form
141 3861 8189 2873 -4192 -4391 -3509 -5309 2493 12114 65 -18969 -10473 14190 17318 -4044 -19040
156 -19040 -7245 16344 16508 -6001 -14240 1300 10677 4227 543 542 -2850 -3992 2663 9377 5903
171 5903 -8475 -14623 2227 18500 5392 -17280 -13559 7165 14122 1087 -12122 -8502 4788
184 4788 7632 -463 -2923 -1096 -4416 -3818 6814 8673 -4846 -13894 -4177 11432 10819 -7191 -17434
199 -17434 -2029 14070 7020 -8555 -9253 292 5476 4044 -73 -2427 -2366 -1705 2857 9030 4223
214 4223 -9390 -8549 8804 14965 1089 -12136 -6872 8888 12662 -625 -10066 -3325 5923 4262
228 4262 919 -141 -3009 -4443 923 6946 4553 -4987 -10239 -986 12165 7690 -8982 -11979 2743
243 2743 11117 3775 -6818 -7673 762 5410 2140 -1826 -2024 -3509 -3139 4236 7588 -1991 -10643 -4636
$$ packed form
141C861M328n316p065j99Q82j800P802R621j2049j9034Q496K4663L128k1362j4996
156a9040J1795K3589J64k2509q239J5540R377o450l684jl392j142O655O714l474
171E903j4378o148J6850J6273j3108k2672L721K0724O957j3035j3209L620J3290
184D788K844q095k460J827l320N98J0632J859j3519r048R717J5609o13j8010j0243
199a7434J5405J6099p050j5575o98R545N184j432m117k354O1O61M562O173m807
214D223j3613Q41J7353O161j3876j3225N264J5760L774j3287r441O741R248j661
228D262l343j060k868j434N366O023k393r540n252R253J3151m475j6672k997J4722
243B743Q374p342j0593q55Q435M648l270l966j98j485L70P375L352r579q652O007
$$ plain form
259 -4636 7864 9310 -2350 -11485 -4806 8294 8047 -3426 -7779 -2095 3383 4111 1476 -2053 -3613
274 -3613 -2431 1403 5979 3884 -6640 -9117 3013 11094 2966 -8868 -7483 3384 8809 2275
288 2275 -6374 -4939 1943 3721 1780 -42 -2189 -4342 171 5779 4414 -3436 -7773 -2063 7470
303 7470 7810 -3812 -9680 -1252 8005 5288 -3010 -5755 -1418 3253 3688 837 -1452 -3113 -2365 2899
319 2899 6969 1014 -7574 -4780 5120 8223 822 -7241 -4900 4082 7235 212 -4908 -3076 1529
334 1529 3243 2550 -324 -3297 -2928 741 5040 3577 -3979 -7645 -140 7999 3842 -5946 -6781 411
350 411 5858 3310 -2978 -4845 -1173 2429 2251 456 -1979 -4454 -1785 4188 4396 -1976 -6382 -3247
366 -3247 4460 6523 -1073 -7481 -3034 5067 5226 -605 -3922 -2400 1070 3371 2113 -771 -2989
$$ packed form
259d636J2500J446j1660r135O679J3100k47j1473m353N684N478P28k635l529j560
274c613J182L834M576k095j0524k477J2130Q081q128j1834J385J0867N425o534
288B275q649J435O882J778j941j822k147k153M513N608j365p850m337N710R533
303G470L40j1622n868Q428R257k717q298k745M337M671M35k851k289j661P48N264
319B899M070n955q588K794R900L103p401q063K341Q982L153p023n120J832M605
334A529J714o93k874k973L69L669M299j463p556l666P505Q139m157r788q35P192
350D11N447k548o288j867L672L602j78j795k435k475K669N973K08o372m406L135
366c247P707K063p596o408M447Q101J59n831l317J522L470K301j258k884k218
$$ plain form
381 -2989 -2715 1807 5808 2172 -5340 -5408 2560 6735 1975 -4618 -4889 1446 6006 2003 -3377 -3327 455
398 455 2431 2700 1260 -2437 -3599 142 4331 3351 -2167 -5969 -1882 5339 4385 -3494 -6315 -1155
414 -1155 3269 3089 -984 -4319 -2272 1460 2871 998 -1060 -2997 -2081 3073 5150 42 -4901 -3074
430 -3074 2963 5688 1443 -4925 -3695 2962 4978 695 -2590 -2405 -364 2317 2945 -82 -3024 -2112
446 -2112 825 4111 2972 -2703 -4828 596 5398 3183 -2636 -4315 -335 4089 3340 -1808 -3621
461 -3621 -1146 1289 1901 1168 -1738 -3969 -1537 3040 2955 -1679 -4810 -2761 2798 4528 -661 -4764
477 -4764 -2283 2700 3401 652 -2552 -2633 273 2988 1713 -891 -2336 -2306 675 3890 1385 -4071
493 -4071 -3784 864 3744 1579 -2954 -4002 448 3944 2059 -1665 -2131 -596 1502 3559 1510 -1883
$$ packed form
381b989K74M522M001l636p512o8P968M175m760o593k71O335M560m003n380N0L782
398D55J976K69j440l697j162L741M189r80n518l802M087P221r54p879k821N160
414a155M424j80m073l335K047L732J411j873k058j937R16N154K077n108m943J827
430c074O037K725m245o368J230O657K016m283l285J85K041K681O28l027k942R12
446b112K937L286j139n675k125N424M802k215n819j679L980M424p49n148j813
461c621K475K435O12p33k906k231K432M577q5m634l131K049N559J730n189m103
477d764K481M983P01k749l204q1K906K715j275k604j445L0K981L215k505n456
493d071K87M648K880k165m533j048M450L496j885l724m66J535K098K057k049l393
$$ plain form
509 -1883 -1957 1223 3611 2697 -980 -3657 -1080 3774 3721 -1163 -3800 -1541 2366 2855 -26 -3050 -2156
526 -2156 973 2301 1335 -708 -2675 -1600 2304 3196 -143 -3078 -2255 1365 3548 1190 -3569 -3650
542 -3650 689 2799 825 -1716 -3337 -1260 1781 1876 -822 -2415 -2122 150 2681 2297 -1919 -3388
558 -3388 299 3637 3097 -811 -2896 -839 2993 3402 -191 -2331 -1345 834 2377 1430 -1438 -2957
574 -2957 -212 2099 1703 -620 -2880 -2205 1779 3433 -105 -2973 -2063 1165 2918 1355 -2088 -2558
590 -2558 29 2399 1774 -677 -2344 -1755 1094 2698 601 -2686 -2613 22 2305 1949 -1557 -3484
606 -3484 -423 2683 1911 -668 -2392 -1578 1491 2661 451 -1944 -1492 346 2152 1708 -829 -3020
622 -3020 -918 2225 2342 -49 -2440 -1972 1262 2749 736 -2368 -2160 423 2051 1830 -634 -2447
$$ packed form
509a883p4L180K388r14l677k677K577M854n3m884k637K259L907M89k881l024Q94
526b156L129J328r66k043j967J075L904Q92l339k935Q23L620K183k358m759q1
542c650M339K110j974k541j621K077L041R5k698j593K93K272K531l84m216j469
558c388L687L338n40l908k085K057L832M09l593k140R86K179J543r47k868j519
574b957K745K311l96k323k260O75L984J654l538k868R10L228J753j563l443m70
590b558K587K370o25k451j667N89K849J604k097l287P3K635K283l56l506j927
606c484L061L106p72k579j724Q14L069J170k210k395M52J838J806m44k537k191
622c020K102L143J17k391k391M68L234J487k013l104K08K583J628k21k464j813
$$ plain form
638 -2447 -352 2254 2194 127 -1492 -1571 786 2973 1480 -1801 -2175 91 2140 1827 -491 -2614 -1379
655 -1379 1761 1807 -452 -2208 -1856 345 2112 924 -1619 -2207 -445 1362 1907 -155 -2722 -1631
671 -1631 1639 2178 54 -1867 -1894 176 2148 1111 -1581 -2021 -237 1623 1407 -68 -2088 -1516 1039
688 1039 2259 634 -1374 -1771 -98 2488 1876 -1009 -2352 -229 2080 1532 -100 -1901 -1379 1284
704 1284 2066 453 -1477 -1445 -178 1786 1396 -984 -2053 -335 1197 1820 276 -2007 -1573 1004 2321
721 2321 676 -1657 -1593 -14 1561 1574 -659 -1905 -319 1301 1649 531 -1369 -1710 568 2090 871
738 871 -1257 -1787 -234 1440 1731 -794 -2362 -573 1448 1594 241 -1202 -1602 343 1890 870
754 870 -804 -1402 -517 1547 1778 -562 -2103 -839 1117 1588 224 -1510 -1802 293 1894 777 -1130
$$ packed form
638b447K095K606o0k067j619p9K357K187j493l281l74K266K049l13k318k123J235
655a379L140M6k259j756L52K201J767j188k543n88J762J807N45k062k567J091
671a631L270N39k124j921k7K070J972j037k692m40J784J860k16j475k020N72K555
688A039J220j625k008l97J673K586o12k885j343K123K309n48j632j801N22K663
704A284P82j613j930L2J267J964l90k380j069J718J532O23j544k283M34K577J317
721B321j645k333O4J579J575J3k233j246J586J620L48j118j900l41K278J522j219
738H71k128n30J553J674K91k525j568J789K021J46j353j443m00J945J547j020
754H70j674n98Q85K064K31k340j541J264J956M71j364j734k92K095J601j117j907
$$ plain form
771 -1130 -1707 -261 1362 1421 -383 -1743 -1115 665 1419 658 -904 -1887 -112 2309 1266 -1274 -1625
788 -1625 -280 1297 1701 -86 -1683 -1001 810 1582 591 -991 -1655 -176 1599 988 -618 -1731 -547
805 -547 920 1721 285 -2052 -1224 1006 1709 510 -1132 -1530 189 1589 1055 -517 -1362 -871 580
822 580 1469 263 -1484 -1430 426 1445 981 -898 -1596 -291 1391 1311 -582 -1637 -834 748 1389 230
840 230 -1273 -937 476 1120 620 -633 -1339 -484 1056 1545 -441 -1641 -700 824 1648 446 -1415
857 -1415 -1296 529 1503 551 -872 -1314 -226 922 1158 -163 -1322 -1071 580 1311 539 -1042 -1206
874 -1206 111 1532 730 -924 -1423 -550 1302 1480 -276 -1416 -730 582 932 369 -796 -1252 -199
891 -199 850 871 -226 -1398 -830 1043 1526 57 -1317 -827 428 1268 796 -896 -1119 146 1350
$$ packed form
771a130n77J446J623N9j804j360O28J780P54p61j562r83J775K421j043k540l51
788a625J345J577M04j787j597O82J811P72r91j582o64J479J775o11j606j113J184
805e47J467Q01j436k337Q28K230P03j199j642l98J719J400n34j572q45M91J451
822E80Q89j206j747N4J856J019m64j879o98J305J682q0j893j055Q03J582O41j159
840B30j503L36J413O44n00j253p06Q55J540M89j986j200R41J524Q24j202j861
857a415J19J825R74r52j423m42J088J148K36j321j159K51J651P31p72j581j64
874a206J317J421q02j654m99Q73J852J78j756j140O86J312L50n63j165m56J053
891a99J049K1j097j172N68J873M83j469j374M90J255Q40m72j692k23J265J204
$$ plain form
908 1350 881 -256 -1002 -506 899 1228 344 -960 -846 76 1326 883 -611 -1541 -246 1407 1252 -494
926 -494 -923 -384 525 1100 317 -985 -1044 243 1016 782 -503 -1368 -295 1065 1082 -106 -1352 -834 426
945 426 1394 124 -1093 -941 341 1045 447 -509 -1008 -349 521 1071 -119 -954 -777 396 1219 321 -752
964 -752 -842 213 1205 686 -299 -1241 -528 772 994 -173 -911 -522 78 1030 548 -411 -971 -297 1228
983 1228 1020 46 -914 -573 1058 846 -42 -1054 -324 373 994 566 -640 -1124 196 852 736 -157 -1036
1002 -1036 -584 384 1145 237 -827 -1063 -27 1279 587 -485 -1175 64 687 712 -194 -715 -421 764
1020 764 1074 436 -745 -869 -40 984 842 -671 -1344 -279 814 637 54 -1052 -405 660 766 18
1038 18 -587 -593 117 898 805 -362 -590 -481 659 806 194 -902 -829 458 1016 140 -718 -791 -334 832
$$ packed form
908A350m69j137p46M96J405L29q84j304J14R22J250m43j494r30J295J653j55j746
926d94m29N39R09N75p83j302n9J287P73k34j285q65J073J360J7j188j246N18J260
945D26R68j270j217J52J282P04n98r56m99O59Q70N50j190q35J77J173Q23q98j073
964g52r0J055R92n19r85r42P13J300K22j167p38L89O00R52m82r59n60O74J525
983A228k08r74r60L41J631k12q88j012P30O97O21m28j206m84J320O56j16q93q79
1002a036M52R68P61r08j064k36J036J306o92j072o90J239O23K5r06n21K94J185
1020G64L10o38j181j24Q29J024j42j513o73J065J093j77n83j106O47J065J06p48
1038A8o05oP10P81r3j167k28J09J140J47o12j096P3J287N58q76q58p3M57J166
$$ plain form
1058 832 486 -519 -642 -202 492 525 24 -491 -493 215 651 365 -386 -743 -130 937 698 -169 -881 -229
1078 -229 647 683 45 -728 -375 307 633 -128 -383 -538 -370 377 772 -92 -821 -277 632 655 61 -610 -817
1099 -817 380 845 461 -396 -652 -13 397 640 -42 -777 -330 427 365 304 -519 -745 -130 581 376 -344
1119 -344 -809 -171 665 667 -158 -674 -362 552 658 122 -437 -700 0 809 662 -257 -521 -253 489 624 -20
1140 -20 -776 -486 434 783 278 -554 -792 -67 563 415 -15 -859 -136 453 394 -26 -817 -827 257 802 296
1161 296 -341 -545 -210 682 606 -122 -343 -245 180 628 264 -478 -524 44 675 161 -322 -488 -246 486 631
1182 631 -212 -786 -287 336 582 192 -471 -452 234 576 133 -291 -628 -141 490 545 73 -536 -107 352 524
1203 524 111 -497 -859 -65 856 391 -385 -720 -297 784 558 32 -454 -153 293 380 219 -238 -394 -63
$$ packed form
1058H32l46j005j23M40O94L3n01n15kP08M36k86p51l57O13J067k39q67p12O52
1078b29Q76L6o38p73L53O82L26p61k55j55J68P47L95q64p29N44R09K3n94o71k07
1099h17J197M65l84q57k56O39M10K43o82p35M47P57o2o1q23k26O15P11k05p20
1119c44m65O38Q36Kq25n16L12R14J06n36n59k63P00Q09j47r19k64K68P42J35o44
1140b0p56K90R20L49n05q32k38P25O30j48m30q44P23N89n9m20p91j0J084N45n06
1161B96o37k04L35Q92p6p28k21R8M25M48l64p42m6N68O31n14m83j66K42P32J45
1182F31q43n74M99O23K46l90o63J9O86L42m43m24l37M87O31N5m72o09M29M59J72
1203E24m13o08l62P94R21m65p76l35M23J081k26n26m86L01M46Q7j61m57j56L31
$$ plain form
1223 -63 510 338 -267 -583 -175 219 535 46 -473 -419 -11 623 -189 -134 -643 -104 382 68 61 -352 -372 303
1245 303 885 -132 -386 -747 267 330 188 -296 -566 -69 730 324 -274 -422 -232 388 421 109 -554 -357
1265 -357 210 465 163 -122 -375 -235 268 608 -230 -333 -553 218 953 205 -774 -428 178 517 266 -458
1285 -458 -479 -24 524 565 -319 -424 -223 415 375 444 -393 -423 375 519 352 -256 -729 -35 514 703 -112 -337
1307 -337 -269 -66 441 296 -495 -393 243 290 219 -70 -224 -444 376 204 -123 -596 -77 426 555 456 -368
1328 -368 -250 181 157 396 -255 -293 -206 188 566 76 -346 -354 -154 295 283 -244 -554 -203 420 420 -91 -504 -31
1351 -31 249 422 -54 -454 -225 84 336 290 -377 -675 -256 266 357 -132 -230 -42 312 262 166 -656 -412 63
1373 63 129 276 -399 -490 -169 308 136 51 -254 -216 123 426 315 -192 -203 68 337 479 -61 -643 -207 256
$$ packed form
1223f3N73j72o05l16M08L94L16m89n19N4M08O34q12N5n09N39M86l14pm13k0O75
1245C03N82j017k54l61J014O3j42m84k70M97P99m06n98j48J90O20L3l12o63J97
1265c57N67K55l02k85k53J40N03L40q38j03k20P71P35p48r79L46O06L39k51p24
1285d58k1M55N48M1q84j05K01O38m0O9q37l0P98J44j67o08m73O94N49J89q15k25
1307c37O8K03N07j45p91J02O36M7p1k89j54k20Q20j72l27m73N19N03J29r9q24
1328c68J18M31k4K39o51l8Q7L94L78m90m22qK00M49j2n27l10L51O23%n11m13M73
1351c1K80J73m76m00K29L09K52m6o67k98M19N22R1m89r8J88L54n0r6q22K44M75
1373F3O6J47o75r1L21M77j72q5l05L8L39L03j11n07j1K71K69J42n40n82M36M63
$$ plain form
1395 256 -65 -87 -328 -391 41 364 20 -342 -555 232 378 224 -13 -239 9 194 560 -14 -150 -198 215
1416 215 496 197 -142 -89 -8 199 292 6 -75 -114 261 135 106 -388 -322 -224 320 13 -141 -522 -93 185 10
1439 10 -286 -172 -201 206 482 303 -30 -458 37 487 108 -232 -447 -69 172 109 -107 -79 -273 160 358
1460 358 116 -50 -229 -47 153 276 -221 -125 -202 133 274 222 -135 -279 -2 370 216 -90 -292 -13 208
1481 208 60 -250 -374 -152 203 161 -82 -323 -251 -20 20 49 -198 -53 -24 44 31 -11 -295 10 158 280 -75
1504 -75 -212 -311 78 243 352 -181 -441 -206 152 299 -6 -308 -105 356 371 -10 -61 -290 -140 426 132
1525 132 -116 -59 116 248 233 254 30 -23 219 176 209 -23 -447 51 300 124 -257 -251 -87 199 251 5 -276
1548 -276 -268 177 -22 94 -74 -88 -34 321 81 -131 -235 143 179 157 174 -629 -399 67 96 137 -272 -301 -58
$$ packed form
1395B56l21k2k41o3M32L23l44l62k13P87J46j54k37k26K48J85L66n74j36m8M13
1416B15K81k99l39N3Q1K07R3k86q1l9L75j26k9m94O6R8N44l07j54l81M29K78j75
1439A0k96J14k9M07K76j79l33m28M95M50l79l40k15L78K41o3k16K8j94M33J98
1460C58k42j66j79J82K00J23m97R6p7L35J41n2l57j44K77L72j54l06k02K79K21
1481B08j48l10j24K22L55m2k43k41P2K31M0K9k47J45K9O8j3m2k84L05J48J22l55
1504g5j37r9L89J65J09n33k60K35L58J47l05l02K03M61J5l81n1k29J50N66k94
1525A32k48N7J75J32j5K1k24n3K42m3L3k32m24M98K49j76l81OJ64K86N2k46k81
1548b76QM45j99J16j68j4N4L55k40k12j04L78L6k2J7q03K30M66K9M1m09k9K43
$$ plain form
1571 -58 30 -101 -160 -179 97 243 410 101 -132 20 409 158 103 86 -395 -279 267 224 -4 -207 173 140 441
1594 441 -56 -221 -130 90 225 238 20 -311 18 -39 144 236 -400 -76 24 419 201 -289 -7 -102 202 189
1616 189 -37 -280 -250 182 50 155 -94 -168 31 132 -12 -247 -369 97 175 243 -163 -347 -5 41 138 175
1638 175 -192 -73 69 392 89 -194 -60 -161 225 328 -39 -400 -232 13 -55 -8 -334 -85 213 318 24
1659 24 -174 -216 -101 378 -40 222 65 -84 44 58 146 -121 -221 -67 -15 134 -136 -88 -110 168 45 -15 -283
1682 -283 -20 90 109 -11 -39 9 28 139 165 -117 -264 -87 -63 -34 156 -3 -55 248 13 107 -236 -309 -208
1705 -208 70 53 22 -155 -205 33 121 189 -63 105 11 12 -147 -70 22 139 223 83 51 -29 168 229 14 58 -425
1730 -425 -73 126 204 38 -290 -177 86 232 195 96 -58 163 49 11 -174 -148 -163 -111 62 103 -244 -195 68
$$ packed form
1571e8Q8j31n9j9K76J46J67l09k33J52L89k51n5j7m81J16N46m3k28k03L80l3L01
1594D41m97j65R1K20J35J3k18l31L29n7J83R2o36L24J00L95k18m90K82r5L04j3
1616A89k26k43L0M32j32J05k49p4J99J01j44k35j22M66P8O8m06j84L42M6R7L7
1638A75l67J19J42L23l03k83J34j01L86J03l67l61J68K45o8M7l26K49K98J05k94
1659B4j98m2J15M79m18K62j57j49J28J4Q8k67j00J54N2J49k70M8k2K78j23o0k68
1682b83K63J10J9j20k8M8J9J11K6k82j47J77K4K9J90j59n2L03k35R4l43p3J01
1705b08K78j7l1j77n0K38Q8O8k52J68r4Jj59P7R2J17Q4j40l2q0J97O1k15M4m83
1730d25L52J99P8j66l28J13K63J46l7r9j54K21j14l8j85K6j5N2J73M1l47M9K63
$$ plain form
1753 68 4 250 -52 -138 99 -47 85 244 -227 -211 -89 -8 -102 11 -59 186 248 138 258 -297 -77 243 220
1776 220 89 -189 -193 -153 30 0 -19 6 -274 -87 296 58 -263 -67 -61 104 88 -80 -180 -262 35 6 -29 -373
1800 -373 301 -78 -155 167 -70 -196 114 -73 229 -105 -216 -54 225 171 -160 -366 145 -74 -88 -279 -139
1821 -139 233 67 118 79 -186 -67 -181 -24 43 -59 -44 -185 42 225 -234 14 -215 149 218 301 -67 147
1843 147 193 -31 82 -215 103 250 -95 -102 182 -25 97 11 259 118 -277 -226 -185 283 -7 -154 -301 -294 36
1866 36 -91 -17 -127 -28 12 62 80 159 -125 -59 50 359 179 -152 -115 358 197 107 115 -152 -252 71 294 -157
1890 -157 -464 -338 53 -107 193 208 121 10 88 -107 -196 -73 -12 79 -38 -38 0 231 108 38 -56 174 -122 100
1914 100 -181 -5 95 -290 61 252 128 37 -27 49 185 233 -91 -48 -108 87 37 -31 -334 -136 -75 118 232
$$ packed form
1753F8o4K46l02q6K37j46J32J59m71J6J22Q1r4J13p0K45O2j10J20n55K20L20k3
1776B20j31k78mM0J83l0j9K5k80J87L83k38l21J96OJ65j6j68j00q2K97k9l5l44
1800c73O74l79p7L22k37j26L10j87L02l34j11J62K79n4l31k06N11k19j4j91J40
1821a39L72j66N1l9k65J19j14J57O7j02J5j41K27J83m59K48k29L64O9Q3l68K14
1843A47M6k24J13k97L18J47l45pK84k07J22q6K48j41l95N1M1M68k90j47j47PL30
1866C6j27P4j10R9M0N0J8P9k84O6J09L09j80l31L7M73j61r0Qk67j00L23K23m51
1890a57l07J26L91j60L00J5q7j11P8j95q9J23O1R1j17%L8K31j23p0r4K30k96K22
1914A00k81J76J00l85L51J91j24r1o4P6J36M8l24M3o0J95n0o8l03J98O1J93J14
$$ plain form
1937 232 -183 -86 -140 72 187 -223 60 -127 150 -94 1 -84 -62 43 -45 14 23 62 29 265 -149 -65 248 -224
1961 -224 -56 276 -50 103 -47 178 326 -23 -71 7 -211 171 -157 100 -148 -115 -311 191 2 -12 21 33
1983 33 -293 -121 -67 -248 80 263 24 47 -259 1 79 55 -148 -7 12 72 -75 -250 112 -93 83 -229
2005 -229 100 -60 -57 66 -28 142 -176 227 129 147 118 -56 -128 -195 23 -9 191 80 -80 1 11 -107 88 79
2029 79 -163 6 -13 384 -24 -286 -86 -304 8 -77 -104 -41 149 -9 -68 -78 -377 21 82 19 -35 108 -121
2052 -121 159 153 37 -111 -62 -116 -25 -42 131 4 -266 20 95 -96 204 61 80 -55 171 83 -120 57 -249
2075 -249 -46 23 182 104 -2 102 39 -77 -135 30 -136 -105 -109 295 -9 -153 134 87 -32 20 28 16 -6 11 100
2100 100 -65 -9 142 -311 -162 -68 104 -96 -120 58 -11 -105 -8 84 -34 -158 -103 0 211 -50 -216 74 -2
$$ packed form
1937B32m15R7n4K12J15m10K83j87K77k44R5q5K2J05q8N9RL9l3K36m14Q4L13m72
1961b24J68L32l26J53j50K25J48l49m8P8k18L82l28K57k48L3j96N02j89j4L3J2
1983C3l26J72N4j81L28J83k39K3l06K60P8k4k03J41J9O0j47j75L62k05J76l12
2005b29L29j60LJ23r4J70l18M03r8J8k9j74p2o7K18l2K00j11j60Q1J0j18J95r
2029G9k42J69j9L97m08k62K00k18L12q5k7O3J90j58n9j0k99L98O1o3n4J43k29
2052a21K80oj16j48M9n4R1j7J73j27k70K86P5j91L00j43J9j35K26q8k03J77l06
2075b49K03O9J59p8j06J04o3j16n8J65j66L1mM04l04j44K87m7j19N2Qj2k2J7Q9
2100A00j65N6J51m53J49R4J72k00k4J78o9r4R7R2j18j24N5J03K11k61j66K90p6
$$ plain form
2123 -2 298 -7 -237 21 -126 -60 174 102 188 -186 -56 5 -13 -170 209 -19 -145 -124 -84 -143 -259 -168 -25 -208
2147 -208 -129 64 -33 -158 -111 81 -224 -32 -127 108 35 234 -264 -108 -19 -36 104 177 2 -88 75 -31 -109
2170 -109 -15 61 -25 69 30 -74 32 -29 -15 -81 -133 293 -99 85 -105 75 -59 -170 -26 283 186 -98 -158 57
2194 57 23 -205 -244 89 187 -122 -98 213 -2 38 201 -134 -50 -33 157 -34 -6 -158 -119 -138 23 315 -66 -47
2218 -47 180 153 -92 101 -5 -26 35 179 39 28 55 -165 -18 169 -11 148 72 -136 -35 1 -84 -63 -87 -143
2242 -143 342 -27 -152 31 180 -153 -4 5 -104 -135 182 180 -52 -8 -163 -210 85 74 -1 -99 -29 -130 219 -196
2266 -196 -22 31 21 -115 -2 19 27 -31 127 13 86 306 205 -130 -176 -117 -161 8 49 -1 44 145 -10 -222
2290 -222 37 371 -72 -303 -211 240 166 27 -31 -171 -36 -110 154 21 207 -5 -101 -38 -234 -76 7 -283
$$ packed form
2123bL00l05k30K58j47O6K34p2Q6l74J30O1j8j57L79k28j26K1M0n9j16R1J43j83
2147b08P9J93r7j25M7J92l05J92r5K35p3J99m98J56Q9j7J40P3j75r0J63j06p8
2170a09R4P6q6R4l9j04J06o1J4o6n2M26l92J84j90J80j34j11J44L09r7k84o0K15
2194E7l4k28l9L33R8l09K4L11k15M0J63l35Q4J7J90j91K8j52L9j9J61K92l81J9
2218d7K27k7k45J93j06k1O1J44j40j1K7k20J47J87j80J59p6k08J01L6q5K1k4n6
2242a43M85l69j25J83J49l33J49Rj09l1L17kk32M4j55m7K95j1p5r8P0j01L49m15
2266a96J74N3j0j36J13K1Qn8J58j14P3K20j01l35m6N9m4J69M1n0M5J01j55k12
2290b22K59L34m43k31R2M51p4j39n8j40J35p4K64j33J86k12r6O3j96J58Q3k90
$$ plain form
2312 -283 -17 -52 36 60 34 61 73 -195 -91 -56 0 -16 -57 71 -66 -304 -79 102 57 91 98 110 105 -14 40 312
2338 312 -53 -23 -72 -90 90 -214 -45 208 -192 -71 -84 110 105 -110 -335 -162 45 104 146 165 47 -203 -14
2361 -14 42 -63 -1 -260 -179 -16 -164 173 -84 -238 -182 32 16 -124 -213 106 -6 -174 174 75 12 137 -55
2384 -55 -114 90 -85 23 -137 -79 -105 -18 -63 -110 -312 -24 -80 -172 165 180 222 -277 -128 107 110 165 172 -274 -1
2409 -1 92 -207 130 -209 -174 74 53 -27 -53 302 6 126 127 -147 -184 -35 -125 61 -134 185 -327 -263 -128 -107
2433 -107 56 245 239 67 252 -45 212 18 -128 37 -98 21 37 -6 -148 -107 -490 190 56 -115 125 -101
2455 -101 12 152 -42 89 -69 -33 221 -408 -138 144 -210 66 162 -54 -122 -12 13 -92 -217 89 30 -30
2477 -30 -269 98 150 -354 126 -8 -203 105 -20 -50 -23 105 209 -104 -153 -225 -295 2 -176 -52 -127 171 -99
$$ packed form
2312b83K66l5Q8K4k6K7J2k68J04L5N6j6m1J28j37k38K25J81m5L4PJ2nj19N4K72
2338C12l65L0m9j8J80l04J69K53m00J21j3J94nk15k25J73K07N9M2J9j18k50J89
2361a4N6j05O2k59Q1J63j48L37k57j54N6K14j6j40q9L19j12j68L48r9o3J25j92
2384e5n9K04j75J08j60N8k6Q7m5m7k02K88n6r2L37J5M2m99J49K35LN5Pm46K73
2409aR3k99L37l39L5K48k1q0k6L55k96J20Jk74l7J49r0J86j95L19n12O4J35K1
2433a07J63J89oj72J85k97K57j94j46J65j35J19J6m3j42M1l83O80j34j71K40k26
2455a01J13J40j94J31j58L6K54o29K70K82l54K76R6k16o8J10K5j05j25L06n9o0
2477c0k39L67N2n04M80j34j95L08j25l0K7J28J04l13m9p2p0K97j78J24p5K98k70
$$ plain form
2500 -99 -296 -53 -144 -95 78 115 25 -78 -51 11 113 190 173 -31 173 312 -88 112 214 -41 148 173 -268
2523 -268 17 1 -141 -122 -48 -68 127 292 -93 43 21 132 96 87 -1 227 241 -45 -49 -177 179 74 -50 -150
2547 -150 92 -31 79 80 -185 -1 248 -83 -230 -83 227 -27 23 44 -156 64 6 10 -272 406 -241 4
2569 4 -161 -112 142 98 -32 43 152 31 64 45 115 64 14 9 -118 101 83 -341 179 219 70 -120 -161 112 17
2594 17 -68 -42 -127 -44 57 -107 -109 375 22 -1 -124 12 -60 -178 -33 331 -40 -202 47 35 -29 -139 147 -112
2618 -112 -35 78 21 -29 2 195 41 -41 -34 -183 99 131 11 174 -53 -41 127 157 -4 119 118 54 191 -117
2642 -117 83 190 51 -61 -194 -46 14 -258 22 25 -39 -241 82 26 70 -43 -61 95 -114 31 -231 48
2664 48 -272 -7 -92 26 -98 -80 2 28 219 -122 -168 141 -114 99 73 87 -156 -203 -69 -142 -102 -182 -92 147
$$ packed form
2500i9j97K43r1M9J73L7r0j03K7O2J02P7j7k04K04J39m00K00J02k55J89K5m41
2523b68K85j6j42J9P4k0J95J65l85J36k2J11l6rq8K28J4k86mj28L56j05j24j00
2547a50K42j23J10Jk65J84K49l31j47J47L10k54N0K1k00K20n8Mk82O78o47K45
2569Dj65M9K54m4j30P5J09j21L3j9P0n1n0nj27K19j8m24N20M0j49j90m1K73r5
2594A7q5K6q5Q3J01j64kM84l53k3j23J36p2j18J45L64l71j62K49j2o4j10K86k59
2618a12P7J13n7n0L1J93j54q2Pj49K82L2j20J63k27J2J68L0j61J23jo4J37l08
2642a17K00J07j39j12j33J48O0k72K80Lo4k02L23n6M4j13j8J56k09J45k62K79
2664D8l20K65q5J18j24J8Q2K6J91l41m6L09k55K13k6J4k43m7J34p3M0q0R0K39
$$ plain form
2688 147 17 -156 275 49 -32 -43 85 -127 97 158 34 24 -125 61 39 4 -148 -67 120 -104 -31 40 -80
2711 -80 11 -24 -110 -128 -20 72 -165 56 -115 150 24 -333 120 196 55 73 -98 -220 -160 129 168 -27 133
2734 133 6 -272 -57 18 103 12 1 -61 -157 64 173 -57 -79 237 124 131 65 -180 -128 -89 63 -169 -223 -22
2758 -22 191 -19 14 5 49 386 -20 303 139 -2 154 215 -181 -116 -3 -105 14 119 186 -14 6 35 29 -169
2782 -169 190 113 30 -98 -72 -244 46 -65 135 -193 21 36 156 -225 -8 54 -234 -13 116 -142 -232 7
2804 7 -67 -57 321 265 31 -61 -147 -80 98 38 -123 98 188 183 5 15 95 -252 -34 -138 -145 -169 50 103 206 165
2830 165 -211 194 7 -196 -63 153 25 91 92 154 -112 178 63 -185 32 -171 55 -250 81 203 -54
2851 -54 46 -99 12 53 63 33 -64 -88 9 136 163 -157 286 -4 164 -31 176 -135 27 -25 -237 59 21
$$ packed form
2688A47j30j73M31k26q1j1J28k12K24O1j24j0j49J86k2l5j52Q1J87k24P3P1j20
2711h0R1l5q6j8J08R2k37K21j71K65j26l57M53P6j41J8j71j22O0K89L9j95J60
2734A33j27k78K15P5Q5r1j1o2r6K21J09k30k2L16j13Po6k45N2L9J52k32n4K01
2758b2K13k10L3rM4L37m06L23j64j41J56O1l96O5J13j02J19J05O7k00K0K9oj98
2782a69L59p7q3j28K6j72K90j11K00l28K14J5J20l81K17O2k88K21J29k58r0K39
2804Gp4J0L78n6k34r2q6O7J78o0j61K21R0nj78J0Q0l47K18j04pk4K19N3J03m1
2830A65l76M05j87k03J33K16j28O6JO2k66K90j15k48K17k03K26l05L31J22k57
2851e4J00j45J11M1J0l0r7k4R7J27K7l20M43k90J68j95K07l11J62n2k12K96l8
$$ plain form
2874 21 129 -54 256 -204 25 -100 132 -204 28 -20 311 128 1 -59 97 72 -59 -173 76 -139 107
2895 107 -18 20 126 61 -54 -15 -43 121 91 99 94 34 150 -85 -52 -8 86 -157 13 -118 34 -165 0 256
2919 256 1 292 311 109 210 -25 -24 -405 -42 -152 120 -76 -61 -7 -77 -95 181 -141 -141 0 -114 220 -6
2942 -6 123 25 168 -39 -129 -19 119 -6 -30 10 -193 -57 155 29 162 251 141 82 -264 -93 60 -340 176
2965 176 -148 -71 24 108 -183 -145 51 55 106 76 -68 52 41 107 -148 38 -17 -102 222 -144 -65 -112 -208 49 -32
2990 -32 -132 -45 -98 110 1 154 127 -21 172 -128 -44 86 47 -36 140 94 -91 50 -227 -10 48 137 -40
3013 -40 -105 -23 -171 -17 31 -172 132 181 -44 -18 -32 33 186 11 98 102 -212 -67 361 -22 13 14 -28 452 -57
3038 -57 -56 21 13 -159 -162 52 227 -13 51 14 7 -160 -146 69 72 263 -155 -94 -58 27 -10 202 -264 58 -54 16 -113
$$ packed form
2874B1J08j83L10m60K29j25K32l36K32m8L31j83j27o0J56k5j31j14K49k15K46
2895A07j25L8J06o5j15L9k8J64l0Qno0J16k35L3M4R4k43J70j31J52j99J65K56
2919B56k55K91J9k02J01k35Jl81L63j10K72j96J5N4p0j8K76l22%J41j14L34k26
2942fJ29r8J43k07r0J10J38j25k4M0k03J36K12j26J33Q9j10n9l46J71J53m00N16
2965A76l24P7R5Q4k91L8J96MN1l0j44J20j1O6k55J86n5q5L24l66P9m7r6K57q1
2990c2j00Q7n3K08j09J53k7j48J93l00Q4J30l9q3J76m6j85J41k77K17N8Q9j77
3013d0o5Q2j48J54M8k03L04M9k25K6j4O5J53j75Q7Ml14J45M28l83L5Jm2M80n09
3038e7JP7qj72lK14J75k40O4l7pj67J4K15LJ91m18O1L6Q5l7K12m66L22j12P0j29
$$ plain form
3065 -113 -173 -44 -111 -63 110 -82 -52 151 -68 54 -127 -267 -17 -127 120 260 105 24 105 127 -114 -61 227
3088 227 -13 154 161 -62 -143 -12 53 71 -27 104 121 -184 -96 12 105 -58 -16 99 -6 -48 -26 -13 -22 -234 -117
3113 -117 198 61 -10 145 -111 240 -84 -70 74 144 -120 -84 -16 -65 13 -48 172 -174 289 97 217 -171 112
3136 112 -163 103 64 15 -65 -60 -39 114 -88 -73 -138 -96 -10 168 -27 27 183 -206 -165 58 -13 -247 -122 120
3160 120 -47 -116 -90 -173 -126 46 -298 -164 458 -174 -257 -110 -185 29 31 81 154 137 -153 95 -40 -120 161 -45
3184 -45 163 79 128 69 260 -78 70 119 46 -73 47 -29 -36 25 -118 -221 16 -80 56 90 -309 27 -164 138
3208 138 -8 195 60 -64 70 -12 95 237 101 -134 -18 28 85 147 -76 -125 -30 -120 -27 104 -148 180 66
3231 66 110 -163 54 -137 -37 31 203 52 107 66 -135 -106 87 84 -144 -114 -152 -193 36 -82 35 169 8 74
$$ packed form
3065a13o0J29o7M8J73j92L0K03k19J22j81j40K50j10K47J40j55q1Q1K2k41N3K88
3088B27k40J67Pk23q1J31O5J8r8J31J7l05Q8J08R3j63M2J15j05m2K2J3rk12J17
3113a17L15j37p1J55k56L51l24J4J44P0k64L6O8m9P8o1K20l46M63j92J20l88K83
3136A12k75K66l9m9q0NK1J53k02J5o5M2Q6J78j95N4J56l89M1K23p1k34J25K42
3160A20j67o9K6q3M7J72l44J34O22o32q3J47p5K14KN0P3j7k90K48j35q0K81k06
3184d5K08q4M9n9J91l38J48M9p3j19J20p6pO1j43j03K37r6J36L4l99L36j91L02
3208A38j46K03j35j24J34q2J07J42j36k35J16M6N7O2k23m9R5r0R3J31k52L28j14
3231F6M4k73K17j91J00O8J72j51N5m1k01K9J93lk28L0l8m1K29j18J17J34j61O6
$$ plain form
3255 74 116 -139 -48 16 -331 55 -92 -103 -16 -44 210 -139 -9 -155 204 256 124 -112 -63 80 62 -97 -101 190
3279 190 -49 -200 96 -18 96 -89 -47 -61 153 -37 179 61 1 139 43 8 209 8 7 138 19 -269
3301 -269 216 -49 108 -15 118 -277 -331 -112 90 -143 194 -63 -196 57 -83 -225 133 8 -59 20 -190
3322 -190 -143 216 -127 -212 -81 -72 108 -272 45 125 -23 96 -120 59 48 229 248 -289 104 71 -52 103 215
3345 215 4 51 24 -259 -16 -15 -3 23 -40 113 200 24 -305 26 -137 24 -83 -13 87 35 -48 -44 69 -104
3369 -104 -88 -51 -101 35 -132 -39 27 -132 131 -146 71 153 309 90 -93 26 227 104 -181 -37 35 169
3391 169 -226 69 -114 -206 -73 -43 270 37 36 220 -207 248 -94 282 13 -117 20 42 -129 119 37 165
3413 165 172 52 -107 -57 244 -31 -92 -235 68 36 -206 39 76 -20 227 -31 129 145 -402 125 80 28 -280
$$ packed form
3255G4M2k55R1O4l47L86j47j1Q7k8K54l49J30j46L59N2j32k36M9J43j8j59mK91
3279A90k39j51K96j14J14j85M2j4K14j90K16j18o0J38r6l5K01k01jJ31j19k88
3301b69M85k65J57j23J33l95n4K19K02k33L37k57j33K53j40j42L58j25o7P9k10
3322a90M7L59l43q5J31RJ80l80L17Q0j48J19k16J79j1J81J9n37L93l3j23J55J12
3345B15k11M7k7k83K43JJ2K6o3J53Q7j76l29L31j63J61j07P0J00n2q3MJ13j73
3369a04J6L7n0J36j67R3O6j59K63k77K17Q2J56k19j83J19K01j23k85J44P2J34
3391A69l95K95j83r2J33L0L13k33jJ84m27M55l42L76k69j30J37K2j71K48q2J28
3413A65Pj20j59N0L01k75o1j43L03l2k42K45L7r6K47k58J60J6n47N27m5n2l08
$$ plain form
3436 -280 82 -16 221 65 112 5 22 -41 61 41 221 -63 192 -112 -61 -165 -37 -229 9 268 -149 143
3458 143 17 106 -465 -201 -101 59 212 -1 -167 -8 191 94 152 -15 78 -43 210 203 65 241 -56 -23
3480 -23 -8 -2 -85 89 276 10 41 -27 -143 103 -187 -120 -39 65 -229 -214 141 117 0 -109 -63 -35 83 149 131
3505 131 -124 -40 11 230 -254 -170 -103 -128 12 47 15 -128 -124 -117 -24 -21 300 -119 -29 258 107 315 127 263 83
3530 83 -284 141 -5 18 147 -55 -343 9 -133 181 104 -250 -71 -40 -63 147 -61 175 204 -216 -28 23
3552 23 114 -234 -84 15 -164 -164 126 -121 -201 -13 -121 -10 193 264 -111 201 -157 -35 -27 -16 56 41 -93 -65
3576 -65 160 -119 12 -208 116 -27 -78 124 12 -151 -45 -197 -136 -80 18 -38 -29 -64 -202 -168 136 -20 124
3599 124 65 124 252 -132 35 -1 122 328 -82 18 -152 -22 -47 31 -196 -97 -99 -164 152 12 139 -237 36
$$ packed form
3436b80L62r8K37j56M7j07J7o3J02k0J80k84K55l04N1j04J28j92K38K59m17K92
3458A43j26Q9n71K64J00J60J53k13j66J59J99r7N8j67R3j21K53pj38J76k97L3
3480b3J5Oq3J74J87k66L1o8j16K46k90O7Q1J04k94J5L55k4j17j09M6K8J18O6j8
3505A31k55Q4N1K19m84Q4O7k5J40L5l2j43MPR3LL21m19R0K87j51K08j88J36j80
3530H3l67M25j46K3J29k02k88L52j42L14p7l54J79L1k3K10k08K36K9m20J88N1
3552B3R1l48J50R9j79%K90k47q0J88j08J11K03P1l75L12l58J22QJ1P2j5j34K8
3576f5K25k79J31k20L24j43n1K02j12j63J06j52O1N6R8n6Rl5j38L4L04j56J44
3599A24n9N9J28l84J67l6J23K06m10J00j70J30k5P8k27R9ko5L16j40J27l76K73
$$ plain form
3622 36 -147 -44 -137 -207 -86 125 92 -72 -333 -246 -244 -42 48 54 113 12 -110 298 0 178 83 32 -192 -25
3646 -25 -8 69 223 -88 -142 19 -157 -61 -9 45 14 -122 -99 264 83 41 53 -113 130 60 140 186 -15 -75 414
3671 414 -34 125 125 -10 -54 -144 185 -25 -176 128 -165 -162 -26 82 -37 238 172 -99 -14 -156 -94 193 -48
3694 -48 -170 -142 -169 -109 175 102 -54 -134 -89 80 59 -119 -171 -25 63 -294 -56 -90 9 96 -116 88 -108 -133 -115
3719 -115 -91 82 92 -54 52 -65 -21 -152 -127 138 176 66 -54 260 -14 52 -30 -81 353 90 4 -360 -173
3742 -173 -262 186 126 61 6 -151 125 35 285 14 -64 -13 355 26 -52 10 147 -239 31 83 95 -128 133 -105
3766 -105 -21 -32 145 46 172 270 -418 -81 -226 -6 10 330 -232 32 161 46 253 -4 -149 15 130 -40
3788 -40 127 109 -22 -137 222 51 -122 66 20 -112 157 -22 -61 -259 8 166 37 4 110 -24 174 -120
$$ packed form
3622C6j83J03r3p0J21K11l3j64k61Q7KK02R0ON9j01j22M08k98J78r5n1k24J67
3646b5J7P7J54l11n4J61j76R6N2N4l1j36K3L63j81m2J2j66K43p0Q0M6k01o0M89
3671D14m48J59%j35m4r0L29k10j51L04k93LJ36J08j19K75o6k71Q5j42O2K87k41
3694d8j22K8k7O0K84p3j56q0M5J69k1j78n2J46Q8l57K38l4R9Q7k12K04j96k5J8
3719a15K4J73J0j46J06j17M4j31K5K65L8j10j20L14k74O6q2n1M34k63q6l64J87
3742a73q9M48o0o5n5j57K76r0K50k71p8N1L68l29p8O2J37l86K70N2J2k23K61k38
3766a05Q4j1J77r9J26R8o88L37j45K20J6L20n62K64J29j15K07k57j45J64J15j70
3788d0J67j8j31j15L59j71j73J88m6j32K69j79l9j98K67J58j29l3J06j34J98k94
$$ plain form
3810 -120 231 188 -114 0 -33 -116 65 -4 -71 46 -64 192 35 144 19 -77 83 142 121 126 86 229 90 -4
3834 -4 -96 -246 -91 -195 87 -84 154 147 72 -8 95 286 28 67 1 80 -9 -3 -44 -27 -88 236 18 53 -117 104
3860 104 152 -49 35 -61 59 -9 47 165 -64 233 -69 9 -45 -215 97 -116 74 127 -70 191 -39 131 -6
3883 -6 96 39 -36 80 29 50 81 -75 -58 97 -50 -133 -275 -121 -8 105 -96 35 -217 78 -38 100 -226
3906 -226 -125 -168 32 -24 81 -24 -28 -100 69 52 72 -72 86 -24 -13 61 -65 58 -55 -70 -37 -67 50 -70
3930 -70 -411 50 -327 -64 -126 -6 -12 143 -123 -164 147 164 18 108 -38 66 78 -228 -24 -107 -66 -217 260
3953 260 -108 127 234 -269 -72 -113 191 86 151 -24 -77 291 199 -290 -54 -183 -70 146 40 226 -261
3974 -261 130 60 -93 169 -49 -75 -66 5 -49 -46 29 109 77 19 -94 133 -57 -24 -153 -107 16 -137 -133 -37 104 110
$$ packed form
3810a20L51m3l02J14l3q3J81o9o7J17j10K56j57J09j25r6J60N9k1Nm0J43j39r4
3834dr2j50J55j04K82j71K38pp5q0J03J91k58L9o6P9q9Om1J7o1L24k18L5j70K21
3860A04M8k01Q4r6J20o8N6J18k29K97l02P8n4j70L12k13J90N3j97K61k30J70j37
3883fJ02n7p5J16n1K1L1j56J7J55j47q3j42J54J13J13k01J31k52K95j16J38l26
3906b26J01m3K00n6J05j05mp2J69j7K0j44J58j10J1P4j26J23j13j5L3l0J17j20
3930g0l41M61l77K63o2J20oJ55k66m1L11J7j46R0j46J04J2l06K04q3M1j51M77
3953B60l68K35J07n03J97m1L04j05O5j75n3L68r2m89K36j29J13K16j06J86m87
3974b61L91p0j53K62k18k6RP1n4LP5Q0l2n8j13K27j90L3j29M6J23j53MR6J41O
$$ plain form
4000 110 -26 123 -16 6 -9 -116 -66 -108 -71 -129 6 -81 37 -81 -64 -43 194 106 -34 -62 277 -205 123 -57
4024 -57 -105 -75 33 103 -130 179 93 134 -148 48 -123 -74 370 146 -80 224 -2 -85 28 98 82 56 95 108
4048 108 -5 9 172 -9 191 -43 154 -66 317 31 217 -195 -104 249 126 43 -107 53 -209 -3 135
4069 135 -125 -59 77 173 116 -269 143 -15 49 120 -121 84 -44 31 133 -281 169 123 -96 224 -87 -198
4091 -198 -151 -35 -108 94 -169 149 252 158 -28 -42 -50 156 -27 -4 -73 -219 46 -1 -105 -176 -67 71 162 -158
4115 -158 288 -85 -121 38 -32 121 153 57 -193 94 218 -70 -98 33 -2 -104 295 29 -95 26 -184 83
4137 83 -153 -256 53 -8 -171 -111 -79 -139 -110 182 -32 139 -187 -196 99 -255 37 -114 10 -46 232 18 -92
4160 -92 -174 -63 90 102 70 -25 -155 -27 -116 158 -209 165 -6 -66 109 -137 -48 36 -322 -52 61 -109 84
$$ packed form
4000A10j36J49j39K2j5j07N0m2L7n8J35q7J18j18J7K1K37q8j40k8L39m82L28j80
4024e7m8L0J08P0k33L09q6M1k82J96j71M9M44k24k26L04k26q3J13P0j6k6L9J3
4048A08j13J4J63j81K00k34J97k20L83k86J86m12R1L53j23q3j50J60k62K06J38
4069A35k60O6J36R6n7l85M12j58O4P1k41K05j28P5J02m14M50m6k19L20l11j11
4091a98M7J16p3K02k63L18J03r4j86j4qK06j83K3o9j46K65m7j04p1J09J38R1l20
4115a58M46l73l6J59p0J53L2r6k50K87J24k88k8J31l5j02L99k66j24J21k10K67
4137H3k36j03L09o1j63O0L2o0K9K92k14J71l26rK95l54K92j51J24n6K78k14j10
4160i2q2J11J53J2l2r5j30J28q9K74l67L74j71o0J75k46Q9Q4l58K70J13j70J93
$$ plain form
4183 84 164 173 -180 42 305 -127 -215 -21 133 -19 186 5 98 169 -130 -71 4 -10 141 177 82 -34 138 142 -66
4208 -66 -45 -133 80 139 -86 182 -83 -219 -4 56 27 -49 -39 -54 109 82 28 118 182 293 -231 174 107 -36 114
4233 114 -32 -160 122 12 51 17 -26 79 115 -42 39 66 0 -2 -74 -337 -30 36 -108 -232 -229 52 70 16 198
4258 198 -97 -10 152 -145 94 -2 28 -40 105 35 147 -110 166 236 -252 -73 103 -60 35 135 107 -156 -208
4281 -208 -13 131 75 -59 231 -325 16 -24 -72 161 102 396 -15 -117 -235 -10 -186 129 -143 98 -88
4302 -88 -144 112 -124 68 31 71 33 -234 -218 28 1 -205 103 -71 27 -214 113 -37 -2 23 281 -137 79
4325 79 120 88 -123 30 110 -36 191 -28 -175 -38 -46 126 -181 32 -97 -217 79 -52 8 -210 97 6 12
4348 12 -216 77 -289 -36 84 3 168 137 83 -8 -141 -104 4 -18 -117 87 -239 276 -30 -64 47 121 -199
$$ packed form
4183H4Q0Rl53K22K63m32q8J94J54j52K05j81R3P1k99N9P5j4J51L6r5j16J72Mk08
4208f6K1q8K13N9k25K68k65j36K15O0k9p6J0j5J63k7n4R0O4J11n24M05o7j43J50
4233A14j46j28K82j10L9l4m3J05L6j57Q1K7o6kp2k63L07O6j44j24LK81J8n4J82
4258A98k95Q7J62k97K39r6L0o8J45p0J12k57K76P0m88J79J76j63R5J00k8k63n2
4281b08J95J44n6j34K90n56L41m0m8K33n9K94m11j02j18K25j76L15k72K41j86
4302h8n6K56k36J92l7M0l8k67J6K46k7k06L08j74R8k41L27j50L5K5K58m18K16
4325G9M1l2k11J53Q0j46K27k19j47J37qJ72l07K13j29j20K96j31O0k18L07r1O
4348A2k28K93l66K53J20q1J65l1n4r1j33L7J08k2r9K04l26N15l06l4J11P4l20
$$ plain form
4371 -199 -125 73 170 -159 -48 202 -158 183 197 -247 56 15 -12 70 11 -88 103 194 -37 116 -86 0 15 -38
4395 -38 83 6 -55 -67 46 7 -27 -184 -69 3 -124 -69 -50 11 -6 18 195 158 -128 263 205 -73 323 145 252
4420 252 6 -29 -80 -71 0 104 222 57 -90 -40 -6 177 -65 -4 244 52 73 87 -56 69 -82 89 118 -83
4444 -83 144 128 249 -231 -43 46 -73 169 84 91 -186 -197 -29 -126 -240 92 -141 91 -183 -100 -52 82 194
4467 194 120 132 -15 -164 67 -57 214 84 107 117 -16 98 154 208 -141 -202 -188 -191 -236 -97 122 -14 -127 120
4491 120 27 -32 -56 11 -85 -32 -25 -88 -17 36 149 -171 37 128 -22 125 104 -17 124 139 72 -69 -100 -303 114
4516 114 125 -129 121 -102 -219 48 104 33 168 -24 -22 91 -102 -162 -26 -40 140 -114 -63 -92 -128 -2 93 133
4540 133 205 -17 80 40 -45 240 74 -52 -8 195 -398 8 -49 197 -191 96 69 -196 166 -110 51 -232
$$ packed form
4371a99P4J98R7l29J11K50l60L41J4m44L03m1k7Q2n9r9J91R1k31J53k02Q6J5n3
4395c8J21p7o1j2J13l9l4j57J15P2j27N5J9O1j7K4J77l7k86L91n8k78L96j78J07
4420B52k46l5n1RP1J04J18j65j47N0L4J83k42O1K48j92K1J4j43J25j51J71K9k01
4444h3K27j6J21m80J88Q9j19K42q5Pk77j1J68r7j14L32k33K32k74Q3M8J34J12
4467A94p4J2j47j49K31j24K71j30K3J0j33J14N6N4l49o1J4lm5J39K19j36j13K47
4491A20r3n9k4O7r6N3Po3P1N3J13l20K08R1j50J47k1j21J41J5o7j41l1k03M17
4516A14J1k54K50k23j17K67N6p1J35j92KJ13j93o0J36j4J80k54N1k9l6J26R5M0
4540A33P2k22R7m0q5K85j66j26M4K03n93M06n7K46l88K87k7k65L62k76J61k83
$$ plain form
4562 -232 126 50 155 -9 46 142 15 110 -240 -42 172 -194 58 -20 -130 113 -7 -137 58 -255 117 -79
4584 -79 18 -23 -72 46 -104 -148 -43 198 -44 83 -9 -69 -11 307 -142 205 -71 -194 -66 -234 1 60 -24
4607 -24 -2 209 -43 -176 5 -248 131 -5 41 -128 -147 66 -104 126 -81 -53 -141 -166 -41 18 75 -210 157
4630 157 152 -60 -319 22 74 240 64 188 -6 -195 -205 -39 -120 -47 -39 34 200 41 -86 48 96 205 -33
4653 -33 10 -134 249 -77 48 93 202 -101 164 -26 190 89 24 -66 -14 220 -140 239 107 -85 173 118
4675 118 -29 47 74 -47 -141 -100 -90 4 -57 -192 19 -2 -25 -71 155 41 -42 -131 -38 263 191 226 -148 93 147
4700 147 -44 165 138 75 -101 91 -175 40 95 68 -63 36 -45 10 114 -115 62 83 -330 -93 -34 107 -99
4723 -99 -172 -2 -201 -92 197 34 -96 62 14 -19 153 65 34 -187 -45 -10 -13 -164 -256 11 -31 184 112 -133
$$ packed form
4562b32L58p6J05j64N5R6j27R5l50J98K14l66K52p8j10K43j20j30J95l13L72j96
4584g9R7m1m9J18j50m4J05K41k42J27r2o0N8L18m49L47k76j23J28j68K35N9q4
4607b4K2K11k52j33J81k53L79j36M6j69j9K13j70K30k07K8q8k5J25N9N7k85L67
4630A57nk12k59L41N2J66j76J24j94j89j0J66q1P3QP3J66j59j27J34M8J09k38
4653c3M3j44L83l26J25M5J09l03K65j90K16j01o5r0N2K34l60L79j32j92K58n5
4675A18j47P6K7j21r4M1J0R4o1j35K11k1k3m6K26j14q3q9R3L01p2L5l74K41N4
4700A47j91K09k7o3j76J92k66K15N5k7j31R9q1N5J04k29J77K1m13K37N9J41k06
4723i9p3J70j99J09K89j63j30J58m8l3J72q8l1k21J42L5lj51r2K67m2K15p2k45
$$ plain form
4747 -133 -132 -8 10 -78 -351 314 147 -27 42 74 -80 119 -38 -99 -265 60 100 -171 119 105 64 -132 202
4770 202 -71 159 141 -115 178 -241 83 42 -21 -105 -46 75 161 -166 -146 -53 -145 75 -58 -133 -74 170 27 -205
4794 -205 161 52 198 -213 39 77 135 -219 22 254 -184 -200 123 -41 -43 234 227 33 -161 101 -40 223
4816 223 109 34 -7 18 -205 -73 138 -167 -200 187 44 110 95 117 -111 -156 -9 116 65 104 164 -166 -148 42
4840 42 -238 74 141 -267 -99 58 -173 -78 -49 -183 112 -117 97 -90 43 -26 -96 -57 6 223 117 -57 14
4863 14 4 -152 -116 -116 -125 -210 -57 -94 115 -187 94 -7 -75 -68 305 95 151 255 111 -11 -13 -36 -135 -211 126 54
4889 54 -240 -277 71 126 134 -115 64 -35 147 -10 17 129 34 292 142 14 -10 -47 -246 -123 -77 223 -87 22
4913 22 -66 -20 -319 -52 -142 -136 -229 -30 68 150 187 122 95 93 -84 -11 160 -82 -94 221 74 136 30 -88 -51 113
$$ packed form
4747a33JJ24J8q8k73O65j67j74O9L2j54J99j57o1j66L25M0k71K90j4m1j96L34
4770B02k73K30j8k56K93m19L24m1o3q4N9J21Q6l27K0R3r2K20j33p5N9K44j43k32
4794b05L66j09J46m11K52L8N8l54K41K32m38j6L23j64kK77pj94j94K62j41K63
4816B23j14p5m1K5k23J32K11l05l3L87j43O6j5K2k28m5J47J25n1L9O0l30J8J90
4840D2k80L12O7m08J68J57k31R5K9j34K95k29K14j87J33o9p0L9O3K17j06j74P1
4863A4j0j56L6%rq5J53l7K09l02K81j01o8PL73k10N6J04j44j22kk3r9p6L37p2
4889E4k94l7L48N5Qk49J79r9J82j57K7J12r5K58j50j28k4l7j99J23M6L00l10J09
4913B2q8M6k99K67r0Or3J99R8Q2L7o5k7kj77P3J71k42j2L15j47O2j06j18L7J64
$$ plain form
4939 113 152 196 -122 38 183 29 -43 140 76 -57 -138 -118 28 43 29 -88 5 -128 195 -201 75 21 -38 54
4963 54 -137 14 -270 -76 -25 212 -11 -94 -42 -228 -164 93 80 52 -58 -53 218 -165 -7 -107 141 -119 170
4986 170 207 120 90 57 -26 -189 22 -197 -149 -412 38 -296 -180 22 462 67 103 -69 -14 -202 -66 219 -24
5009 -24 98 160 -166 372 -232 -9 -47 29 64 -212 248 -134 -44 -77 -58 -55 -146 140 12 32 -62 23 -62 -177 115
5034 115 -165 -263 -210 339 116 -109 25 -63 -290 -46 135 -17 218 68 55 -47 229 18 -39 49 70 -1 41
5057 41 -167 -10 -24 162 -28 121 -9 317 189 128 33 44 164 283 -266 3 -180 -127 166 104 145 103 39
5080 39 -17 351 -14 -72 -236 359 211 -150 24 -208 85 -152 23 -195 -124 -19 156 72 -22 7 -20 29 70
5103 70 -315 59 -257 -147 61 100 -199 -229 -113 -152 52 -11 110 238 -140 -87 -54 -71 -122 16 -152 52 187
$$ packed form
4939A13L9M4l18J60J45j54p2J83o4j33q1K0J46J5j4j17R3j33L23l96K76n4n9R2
4963E4j91J51k84J94N1K37k23q3N2j86O4K57j3k8j10NK71l83J58j00K48k60K89
4986A70L7q7l0l3q3j63K11k19M8k63M50l34J16K02M40l95L6j72N5j88J36K85k43
5009b4J22O2l26N38o04K23l8P6L5k76M60l82R0l3J9Lr1K86j28K0r4Q5q5j15K92
5034A15k80r8N3N49k23k25J34q8k27K44J81j52K35j50j3j02K76k11n7Q8K1p1M2
5057D1k08J57j4J86j90J49j30L26j28o1r5J1J20J19n49K69j83N3K93o2M1m2o4
5080C9n6L68l65n8j64N95j48l61J74k32K93k37J75k18P1J05J75q4r4K9k7M9M1
5103G0l85L74l16J10K08L9k99l0J16l9K04o3J21J28l78N3L3j7n1J38j68K04J35
$$ plain form
5126 187 58 -201 307 176 -24 289 -122 69 -257 296 331 -71 20 40 -64 3 104 -48 41 -72 -20 -346
5148 -346 213 -286 -4 -47 140 266 -83 155 109 -68 16 163 61 177 28 -288 68 330 187 -281 -214
5169 -214 -226 8 108 25 111 -45 42 20 -11 188 224 -203 64 50 111 56 33 -75 -246 -30 -29 -100 224 4 -205
5194 -205 88 -71 -29 -129 51 10 -143 90 76 -19 197 134 18 165 -83 -17 -3 64 172 136 -38 -76 71
5217 71 84 187 112 7 34 -221 60 -321 -138 -184 -79 155 -45 -134 -13 163 -237 -18 171 177 85 97 -125
5240 -125 206 -237 -78 35 -153 111 39 165 214 127 -115 331 -36 46 -3 281 249 -51 -118 207 107 54 -72
5263 -72 -189 10 119 -60 -71 -341 -71 149 -339 107 -19 221 132 201 181 -38 -92 -8 164 -224 -70 -93 40
5286 40 165 89 184 58 128 42 36 26 -191 -10 -36 -63 42 -161 3 -81 107 64 -166 50 -139 161 167 121 150
$$ packed form
5126A87j29k59N08j31k00L13m11J91l26N53L5m02R1K0j04O7J01j52Q9j13N2l26
5148c46N59m99K82m3J87J26l49K38m6j77Q4J47j02J16j49l16L56K62j43m68O7
5169b14j2K34J00q3Q6j56Q7k2l1J99L6m27K67j4O1n5k3j08j71K16Jp1L24k20k09
5194b05K93j59M2j00J80m1j53K33j4r5K16o3j16J47k48O6J4O7J08l6j74l8J47
5217G1J3J03p5j05K7k55K81l81J83m6J05K34k00q9J21J76m00K19J89Or2J2k22
5240a25L31m43J59J13j88K64p2J26M9q7k42M46l67Q2m9K84l2l00o7L25j00n3j26
5263g2j17J99J09j79j1k70K70K20m88M46j26K40q9O9k0k19n4Q4J72l88J54k3J33
5286D0J25p6R5j26P0q6oj0k17J81k6k7J05k03J64q4J88m3k30K16j89L00Om6K9
$$ plain form
5311 150 -147 -128 99 215 46 157 -127 -2 -147 -49 99 24 143 -57 -115 -72 -1 241 -15 181 7 -144
5333 -144 36 -118 -200 -116 37 -291 -102 62 -174 355 144 4 29 46 150 -166 -167 252 102 -78 35 -236
5355 -236 41 134 33 -73 16 -5 32 -138 -136 -215 245 -203 -192 160 55 -84 -249 -133 -313 6 -149 -96 -327
5378 -327 -34 -26 -24 135 -172 82 -47 59 119 280 -112 -65 -133 156 217 -39 -78 -245 27 221 -163 24 -239
5401 -239 70 158 182 33 -57 81 47 -54 -64 106 -118 409 150 -66 63 -228 243 90 174 -9 113 -192
5423 -192 -29 271 93 132 176 -41 23 -96 50 29 163 20 -36 -2 128 -9 -209 198 191 -462 -142 260 -126
5446 -126 -99 41 -124 -84 -20 93 -186 -108 12 -54 148 31 -107 -32 -10 13 108 10 -57 172 404 82 80 63 -219
5471 -219 -90 209 -58 -140 -232 95 -82 21 -106 139 -169 166 -52 -42 -293 17 -145 6 -58 -48 -59 -92
$$ packed form
5311A50k97J9K27J16j69J11k84J25j45R8J48p5J19k00n8M3P1K42k56J96j74j51
5333a44J80j54q2Q4J53l28J89J64k36N29k11j40K5J7J04l16jM19j50j80J13k71
5355b36K77R3j01j06Q9k1L7j70Kp9M60m48J1L52j05j39j65J16j80L19j55N3k31
5378c27K93QKJ59l07K54j29J06O0J61l92M7o8K89O1k56l9j67K72J94l84J87k63
5401b39L09Q8K4j49r0J38l4j01j0J70k24N27k59k16J29k91M71j53Q4j83J22l05
5423a92J63L00j78L9M4k17O4j19J46k1J34j43n6L4J30j37k00M07po53L20M02l86
5446a26K7J40j65M0O4J13k79P8J20o6K02j17j38P5K2K3R5r8o7K29K32l22kj7k82
5471b19J29K99k67q2r2L27j77J03j27K45l08L35k18J0k51L10j62J51o4J0j1l3
$$ plain form
5493 -92 209 -54 -390 -171 0 8 -162 224 107 -84 -144 32 79 227 -13 -190 99 50 -62 5 61 -124 69
5516 69 -93 -215 101 -44 -107 -56 -121 -265 -45 -5 200 84 10 -86 173 141 -93 -23 -75 33 51 -131 -257 -104
5540 -104 -145 102 144 116 -114 -55 367 137 259 121 -97 70 -191 44 -31 5 85 122 -6 -157 -61 -89 -112 3
5564 3 -164 -8 -176 132 141 16 -52 -271 -17 -114 92 -244 -91 -184 62 -81 24 94 -75 -169 19 15 -49 -20
5588 -20 -32 134 -25 -1 72 -38 84 122 -32 -30 -142 54 49 -37 172 -64 116 134 77 47 5 64 -43 -79 9 -119
5614 -119 -131 189 1 -24 44 -134 -147 498 -116 -124 243 -52 9 -138 9 115 155 -103 -201 -96 24 64 -68
5637 -68 -39 -130 183 -154 125 -204 -176 122 43 -130 96 69 -55 -53 -111 -144 -93 -9 -213 28 -25 -79 270 35 -42
5662 -42 62 94 -119 132 -110 -132 145 140 27 -73 -80 -135 -42 -184 173 -1 158 206 -118 -82 -26 -94 -48 -35 30
$$ packed form
5493i2L01k63l36K19J71Qj70L86j17j91o0J76M7J48k40j77K89m9j12O7N6j85J93
5516F9j62j22L16j45o3N1o5j44K20M0K05j16p4r6K59l2k34P0n2J08J8j82j26J53
5540a04m1K47M2k8k30N9M22k30J22j38k18J67k61K35p5L6Q0L7j28j51R6k8k3J15
5564Cj67J56j68L08Rj25o8k19K54r7K06l36J53r3K46j43J05P0j69r4J88mo4K9
5588b0j2J66j59K4P3j10J22L8j54Kj12J96nq6K09k36J80J8n7l0m2N9j07l6Q8j28
5614a19j2L20j88k5O8j78j3O45o14qL67k95O1j47J47J06M0k58r8J05J20M0j32
5637f8K9r1L13l37K79l29K8K98p9j73K26k7j24Kn8l3N1Q4k04K41n3n4L49k35p7
5662d2J04L2k13K51k42k2K77nj13j00pn5R3j42L57j74J59M8l24L6N6o8M6J3O5
$$ plain form
5687 30 138 -245 -154 -11 16 -220 18 234 352 -84 -171 140 41 -54 116 -95 109 51 145 -104 -125 224 95
5710 95 -182 211 112 32 -246 -42 -234 -104 -19 -187 16 46 -165 231 234 36 140 -194 -13 76 -94 -52 -161
5733 -161 -51 186 -182 134 -157 147 -37 168 185 -69 101 -338 30 78 103 96 269 175 48 16 193 -65
5755 -65 -134 -114 140 158 127 -59 70 62 -64 159 -257 -96 76 84 28 19 40 411 313 -174 -127 48 69 -128 -16
5780 -16 -273 -105 297 21 -50 -31 -145 -193 87 19 64 143 242 259 374 -133 -134 54 95 -248 77 -5 46 -96 -78
5805 -78 67 -61 -52 135 24 -190 35 -58 77 65 166 80 59 -337 -180 150 -19 272 152 -139 -162 10 -397
5828 -397 56 -220 -81 -209 -27 106 59 247 214 131 -151 16 96 17 82 56 -188 103 -283 4 -198 -187 -179
5851 -179 148 13 -201 81 -146 23 57 22 62 88 -197 -113 155 43 -30 24 -161 -215 -8 181 43 8 10 101
$$ packed form
5687C0J08l83R1J43K7k36K38K16J18m36q7L11r9r5J70k11K04n8R4k49k1L49j29
5710I5k77L93r9q0k78K04j92J30Q5j68K03L0k11L96Lj98J04l34J81Q9j70M2j09
5733a61J10K37l68L16k91L04j84K05J7k54J70m39L68M8K5pJ73r4j27l2J77k58
5755f5o9K0K54J8l1j86J29qj26K23m16J61J72Qn6rK1L71r8m87M7J75K1j97J12
5780a6k57J68M02k76p1J9j14m8K80o8M5P9R9J7J15n07jJ88M1l43L25q2N1j42J8
5805g8J45j28RJ87j11k14K25r3J35j2J01q6k1l96J57L30j69K91j20k91k3J72m07
5828c97M53k76J39j28J82J33m7J88l3q3k82J67Q0p9O5k6k44K91l86K87k02J1Q
5851a79L27j35k14K82k27J69L4l5M0K6k85Q4K68j12p3N4j85n4K07J89j38l5KR1
$$ plain form
5875 101 41 -55 125 -8 -14 -66 90 130 -200 -26 85 8 -207 -95 -80 232 131 3 86 77 112 236 146 289
5899 289 -27 -91 154 -308 -52 224 41 -51 141 -212 74 22 147 209 -52 -139 -50 -19 4 -36 26 -30 3 -113
5923 -113 130 -287 79 -182 95 -227 -43 -103 55 295 -110 -289 51 -7 -132 159 47 -84 22 -43 43
5944 43 208 34 -151 -77 -26 -257 -83 -25 -47 189 260 19 154 -263 -247 -72 -76 -103 -250 106 193 -50 -8 187
5968 187 55 -72 -119 63 223 148 -148 -67 -172 179 -243 84 -56 191 4 -204 -50 61 -34 -19 34 -102
5990 -102 -269 22 -169 -91 125 157 -51 -322 1 -43 104 183 -57 190 -105 117 142 156 -249 -15 126 -9
6012 -9 151 160 93 -187 -181 -160 -253 -157 -176 -12 110 -145 76 31 224 -151 -173 -36 -70 179 -194 -9 71 -92 26
6037 26 80 -106 114 8 -74 102 -26 -15 22 226 -73 240 -185 145 -45 25 -173 -15 12 -38 -67 -41 77
$$ packed form
5875A01o0r6J80j33on2J56M0l30J74J11p7k15J12J5L12j01j28Q3rL5J24r0J43
5899B89l16o4K45m62K56K76j83r2J92l53K86n2J25O2k61q7Q9L1K3m0O2n6L3j16
5923a13K43m17L66k61K77l22J84o0J58K40m05j79L40n8j25K91j12j31J06o5Q6
5944D3J65j74j85P4N1k31J74N8k2K36P1k41J35m17J6J75mk7j47L56Q7k43M2J95
5968A87j32j27m7J82J60p5k96Q1j05L51m22L27j40K47j87k08J54J11r5J5N3j36
5990a02j67K91j91P8K16L2k08k71L23m4J47P9k40K47k95K22K5J4m05K34J41j35
6012iJ60Ro7k80OK1r3R6j9J64J22k55K21m5J93l75k2J37l4K49l73J85Q0j63J18
6037B6N4j86K20j06q2J76j28J1L7K04k99L13m25L30j90P0j98J58K7n0k9K6J18
$$ plain form
6060 77 282 17 -27 22 -2 -78 -6 -272 -130 35 -102 -106 49 363 78 215 -85 -126 -23 -53 -187 37 -199
6083 -199 87 81 4 -103 -113 -164 89 -102 54 -75 -10 -192 67 -193 -79 -13 -111 -83 231 -44 -100 194 -74
6106 -74 -245 94 228 -33 188 -175 -282 9 333 125 -151 47 -98 130 -34 -22 -13 482 -55 301 -156
6127 -156 -67 -196 211 -50 -113 41 19 -14 115 -36 -97 -78 93 131 -228 135 -121 20 120 -45 -102 -45 6
6150 6 144 -23 -6 87 146 21 187 158 23 68 -5 26 53 111 -6 56 5 44 212 218 -35 -20 -50 101 -121 250
6176 250 27 -73 12 109 -153 -6 -151 79 206 -73 66 -232 -155 267 20 70 -158 -17 135 24 -216
6197 -216 11 92 -1 29 -63 220 -24 123 45 134 80 -246 105 -20 -48 -55 25 18 357 22 -163 -145 -61 -28 -245
6222 -245 -32 -42 42 26 51 -47 220 86 271 94 -104 37 -23 55 -118 131 -404 -36 110 191 77 111 39
$$ packed form
6060G7K05k65m4M9k4p6P2k66J42J65j37mJ55L14k85J37l00m1J03l0j34K24k36
6083a99K86op7j07j0n1K53j91J56j29O5j82K59k60J14O6r8K8L14k75n6K94k68
6106g4j71L39J34k61K21l63j07K91L24k08k76J98j45K28j64J2RM95n37L56m57
6127a56Q9j29M07k61o3J54k2l3J29j51o1J9J71L8l59L63k56J41J00j65n7N7N1
6150FJ38j67J7R3N9j25J66k9j35M5p3L1K7N8j17O2n1L9J68Ok53J5l0J51k22L71
6176B50k23j00Q5R7k62J47j45K30J27k79J39k98P7M22k47N0k28J41J52j11k40
6197b16K27Q1r3L0r2K83k44J47p8Q9n4l26L51j25k8pQ0pL39l35j85J8Q4L3k17
6222b45K13j0Q4j6K5r8K67j34J85j77j98J41o0P8j73K49n35L68J46Q1j14L4p2
$$ plain form
6245 39 14 161 -126 405 -123 53 -103 -146 -200 -40 140 -135 -240 62 -23 42 -105 -4 -242 -68 -172 -38
6267 -38 86 182 43 -3 41 80 122 14 -233 -265 -230 -41 78 -34 68 -227 93 146 -41 36 -73 175 184 -2
6291 -2 -26 -34 -75 97 8 -162 77 -91 1 -234 -113 58 18 156 -37 241 -181 39 24 125 -19 -117 94 -295
6315 -295 83 37 125 106 181 -2 112 9 95 -69 -306 -69 17 -24 -82 -156 117 -67 170 23 82 -60 67
6338 67 -25 127 249 -177 -111 1 97 22 234 120 -247 -36 -221 -14 126 -21 78 28 17 158 -139 -143 -76 -158
6362 -158 -371 -131 -18 -181 -87 212 470 112 229 -25 122 -41 -255 -80 84 78 189 97 -157 -163 127 221
6384 221 -36 -43 -77 129 -16 -30 170 51 21 -111 -109 21 -19 -28 197 28 -230 231 79 235 -138 -94 -55 -199
6408 -199 -62 -52 71 161 -43 -360 83 -69 -225 21 -37 94 -23 2 -168 -197 149 385 7 215 -259 88
$$ packed form
6245C9k5J47k87N31n28J76j56m3n4J60J80k75j05L02q5O5j47J01k38J74j04J34
6267c8J24R6j39m6M4L9M2j08k47l2L5J89J19j12J02k95L20N3j87P7j09K48Rj86
6291bk4qm1J72q9j70K39j68R2k35J21J71m0J38j93K78m22K20j5J01j44r8K11l89
6315b95L78m6Q8j9P5j83J14j03Q6j64k37K37Q6m1n8p4K73j84K37j47N9j42J27
6338F7r2J52J22m26O6J12R6p5K12j14l67K11j85K07J40j47R9n0j1J41k97mO7q2
6362a58k13K40J13j63R4K99K58l58J17k54J47j63k14J75J64oJ11r2k54oK90R4
6384B21k57pl4K06j45j4K00j19l0j32KJ30m0rK25j69k58M61j52J56l73M4L9j44
6408a99J37J0J23R0k04l17M43j52j56K46n8J31j17K5j70k9L46K36l78K08m74L47
$$ plain form
6430 88 139 136 -301 156 26 63 86 -222 -94 -158 275 -130 135 37 -60 254 -74 -18 -314 -191 261 160 161 -177
6454 -177 38 -186 -31 -35 146 -195 -14 33 -83 -170 -25 6 244 -97 144 -30 183 -22 -96 -49 95 144 168
6477 168 60 36 -12 -90 172 -47 268 191 121 168 262 -126 -10 -90 -95 279 76 -278 -77 -154 82 240 138 68
6501 68 61 147 -63 11 24 35 -24 155 149 -139 14 -23 -182 96 26 72 43 108 135 -18 167 -132 -182 57 76 27
6527 27 -65 68 -85 96 -127 128 65 182 26 -21 57 51 45 -61 -135 -1 9 -110 96 53 -169 4 147 198
6551 198 24 -48 26 -167 -248 20 38 156 200 -73 -173 -178 -58 -79 -90 -226 212 -34 -213 -131 -65 -100 3 -53
6575 -53 -4 -275 -56 161 152 169 134 -28 -36 150 110 4 52 -124 27 221 -46 -111 58 -74 64 -34 88 -25
6599 -25 70 41 -14 25 -108 56 195 -78 292 37 -90 2 -12 -21 -2 -99 -105 39 36 199 -141 -183 -86 123 -110 -154
$$ packed form
6430H8N1lm37M57j30L7K3l08J28o4M33m05K65r8r7L14l28N6k96J23M52j01Jl38
6454a77K15k24J55mJ81l41J81M7j16q7J45L1K38l41K41j74K13k05p4M7J44M9K4
6477A68j08k4m8p8K62k19L15p7p0M7R4l88J16q0nL74k03l54K01p7K36J58j02p0
6501F8pQ6k10P4J3J1n9J79ok88J53l7j59K78p0M6k9O5K7j53J85k99n0K39J9m9
6527B7r2J33j53J81k23K55o3J17j56m7P8ooj06p4J34J0j19K06m3k22J73J43N1
6551A98j74p2P4j93q1K68J8J18M4k73j00nJ20k1j1j36M38k46j79Q2O6l5J03n6
6575e3M9k71K19K17rJ7l5j62qJ86m0j06M8j76J51J94k67o5J69j32J38r8J22j13
6599b5R5k9n5L9j33J64J39k73L70k55j27R2j4rJ9r7oJ44lJ63l40m2R7K09k33m4
$$ plain form
6625 -154 -89 37 -118 258 40 -7 97 -133 121 222 -209 249 170 62 -176 -108 175 175 -169 -98 -123 -229 40
6648 40 109 -32 -60 -4 -216 53 -60 194 -131 156 2 5 70 -52 -144 -14 111 97 101 -97 14 80 84 268 -343
6673 -343 63 -86 51 -227 97 213 -85 70 -104 51 -115 -149 19 -179 -276 24 -33 50 -80 -180 -54
6694 -54 78 41 7 3 172 125 50 34 -224 -44 28 3 -122 -80 -25 242 -27 186 -214 249 185 286 -15 -56 188
6719 188 -153 -147 -222 -25 -150 -232 81 1 248 -68 45 -98 -26 26 7 189 239 -105 -50 75 121 -48 120 194
6743 194 79 -50 -238 -112 -28 -59 264 -11 1 -113 79 193 82 -86 -112 26 -27 60 -139 192 -47 -14
6765 -14 188 111 317 108 126 59 -97 201 23 -27 12 117 115 -92 114 145 -185 -228 71 -238 174 104 129 88
6789 88 125 355 106 -37 45 -182 -8 145 173 -4 -184 27 -78 156 -96 43 325 -126 36 -170 162
$$ packed form
6625a54O5J26j55L76k18m7J04k30K54J01m31M58p9j08k38O8K83%l44P1k5j06K69
6648D0O9j41k8N6k12K69j13K54l25K87j54LO5j22r2J30J25j4Mj98J11O6MJ84o11
6673c43M06j49J37k78L24J16k98J55j74J55j66l4J68j98r7L00n7Q3j30j00J26
6694e4J32l7l4mJ69m7p5j6k58J80P2k5j25M2N5K67k69K13m00M63o4J01l01m1K44
6719A88l41Op5J97j25q2L13q0K47l16J13j43P2N2j9J82N0l44N5J25M6j69J68P4
6743A94j15j29j88J26Q4l1L23k75J2j14J92J14j11j68k6J38n3Q7j99L31k39L3
6765a4K02p7K06k09J8o7j56K98j78n0L9J05kk07K06L1l30m3K99l09M12p0K5m1
6789H8L7K30k49j43Q2k27J74J53K8j77j80K11j05K34k52J39K82m51J62k06L32
$$ plain form
6810 162 95 -144 -185 69 -130 -69 -43 35 -186 -248 -17 405 -264 -194 -86 11 84 -88 -275 -26 162 119 62 -132
6834 -132 -46 -76 118 -190 72 -4 -30 -84 7 -278 -14 -73 -212 -7 225 -48 67 92 -239 163 7 -51 185
6857 185 50 -42 -38 38 -204 24 -98 -34 -301 159 137 190 102 106 -25 227 -32 6 -75 99 -93 -74 162 -88
6881 -88 304 -64 237 28 278 85 -17 -86 -237 -194 179 -87 -44 -158 77 -176 -184 -145 -91 70 -43 -162 191
6904 191 -129 -86 -72 -24 -53 -34 -112 15 333 56 134 158 151 49 171 117 3 138 66 -45 38 -46 -72 -29 108
6929 108 119 -55 263 38 -71 16 37 105 -99 -280 -303 34 -103 -16 -83 -153 -43 -86 -197 17 -87 -154 243
6952 243 -171 141 -65 172 140 -60 196 -354 158 101 -171 -9 -187 -79 93 263 56 127 -69 -123 68
6973 68 44 214 73 -97 26 -7 5 209 78 255 -29 16 -45 69 65 38 149 9 337 -129 -51 29 -250 12
$$ packed form
6810A62o7k39m1K54j99O1K6P8k21o2K31M22o69P0J08R7P3j72j87K49J88m3n7j94
6834a32Q6l0J94l08K62p6k6n4R1k85K64n9j39K05K32k73J15K5l31M02j56n8K36
6857A85j35r2MP6k42K28j22O4k67M60k2N3q8Mj31K52k59L8q1J74j92J9K36k50
6881h8L92l68L01k09K50j93j02o9j51M3L73k66M3j14K35k53qL9N4J61j13j19L53
6904A91l20M3J4M8k9J9p8J27L18k77P8K4pj02J22n4j14J35p2j11Q3q4k6M3J37
6929A08J1j74L18k25j09Q7K1O8k04j81k3L37j37Q7o7p0J10m3j11K14j04o7L97
6952B43m14L12k06K37l2k00K56n50N12n7k72J62j78J08J72J70k07P1j96n4J91
6973F8k4J70j41j70J23l3J2K04j31J77k84M5o1J14mk7J11j40L28m66P8Q0k79K62
$$ plain form
6997 12 140 -122 -38 102 276 -31 -100 31 156 -116 88 -6 -62 -4 46 99 -159 -52 64 73 62 -190 47 20
7021 20 58 293 -32 172 -45 99 118 -6 -158 -166 -19 -53 69 -348 9 -80 37 0 139 -50 -73 52 63
7044 63 -37 294 119 194 10 72 23 -55 -194 181 11 -70 -225 72 -184 114 -7 93 124 91 187 118 48 117
7068 117 -3 16 -76 -178 64 -99 321 -147 -70 -278 108 53 -87 -20 -27 -13 -144 189 -168 273 216 73 -124
7091 -124 99 21 93 -44 110 -142 113 -62 -118 27 23 280 54 -74 -131 45 -97 -58 58 170 -60 -141 -61
7114 -61 -127 5 -62 -370 57 -244 -56 40 -133 -47 63 99 111 -56 209 -59 60 135 -97 16 -13 -124 67
7137 67 10 -48 14 27 23 57 305 119 -377 13 -18 -1 17 -123 50 -216 106 71 -234 27 -7 -35 7 -13 -151
7162 -151 -48 -171 -33 104 -208 61 -144 23 -90 87 -60 276 -117 -195 -233 -130 118 -206 -9 288 -12
$$ packed form
6997A2J28k62Q4J40J74l07o9J31J25k72K04r4n6N8N0N3k58J07J16Rj1k52K37k7
7021B0L8K35l25K04k17J44J9j24j52qJ47l4J22m17L57q9J17l7J39j89k3J25J1
7044F3j00L31j75P5j84O2m9p8j39L75j70q1j55K97k56K98j21J00L1l3R6o9p0O9
7068A17j20J9r2j02K42j63M20m68P7k08L86n5j40O7pJ4j31L33l57M41n7j43j97
7091a24K23p8P2j37J54k52K55j75n6J45mK57k26j28n7J76j42L9J16J12k30q1Q0
7114f1o6J32o7l08M27l01J88R6j73Q6J10L6J2j67K65k68J19P5k32J13k9j11J91
7137F7n7n8O2J3mL4K48j86m96L90l1J7J8j40J73k66L22l5l05K61l4k8M2k0j38
7162a51J03j23J38J37l12K69k05J67j13J77j47L36l93p8l8J03K48l24J97K97l00
$$ plain form
7183 -12 -21 92 276 172 190 -246 22 -139 -51 -8 101 229 -24 -6 -124 62 85 -71 -198 423 25 -131 -105
7206 -105 -69 -121 160 -60 -42 32 -26 78 -63 31 115 103 6 -137 -39 -39 4 221 182 63 -45 -58 139 -78 -217
7231 -217 61 -59 97 -160 33 -120 -64 9 -120 182 -122 149 98 68 -195 77 96 118 -106 -264 -28 -47
7253 -47 -64 -133 22 277 -74 15 -59 -90 114 -17 180 -237 -36 -185 -95 -72 -86 -133 122 -26 -134 -139 63 -64
7277 -64 242 182 30 159 11 36 -95 -110 -106 58 -83 -307 113 -14 75 1 -133 198 -218 28 -5 49 -50 -155
7301 -155 70 48 -123 -6 -21 11 90 43 -175 88 -1 154 50 4 -88 -351 -83 -9 5 101 64 -57 100 -123
7325 -123 296 61 -38 29 49 99 -43 49 -229 39 81 5 137 21 140 52 -84 -123 -283 142 -172 -19 -154
7348 -154 -76 -89 7 6 -28 162 265 82 -200 15 -10 -66 -197 -248 -15 0 1 162 204 -39 -152 -29 65 95 174
$$ packed form
7183a2rJ13J84j04J8m36K68j61Q8M3J09J28k53J8j18J86K3j56j27O21l98j56K6
7206a05L6n2K81k20J8P4n8J04j41R4Q4j2r7j43R8%M3K17l9j19j08j3J97k17j39
7231b17K78j20J56k57J93j53N6P3j29L02l04K71n1l0k63K72J9K2k24j58K36j9
7253d7j7o9J55K55l51Q9p4l1K04j31J97m17K01j49R0K3j4m7K55j48j08nK02j27
7277f4L06o0j52J29j48K5j31j5MJ64j41k24M20j27Q9p4j34L31m16K46l3N4r9j05
7301a55K25k2j71J17j5L2P9m7k18K63q9J55j04m6r2k63K68P4J4R6l7j21J57k23
7325a23M19k35r9O7K0N0j42R2k78K68M2p6J32j16J19q8j36l9j60M25l14J53j35
7348a54P8j3R6jl4J90J03j83k82K15k5n6j31n1K33J5JJ61M2k43j13J23R4L0P9
$$ plain form
7373 174 0 33 128 -269 -48 74 56 21 -60 61 -217 -74 69 -107 9 -18 -71 75 -13 -54 -120 -84 -270 -146
7397 -146 -113 -126 213 -7 153 -147 207 -124 78 64 -178 -39 -76 -160 159 -332 218 -13 -162 92 -2 93
7419 93 -88 -147 275 9 -121 -39 -48 230 -30 -29 56 38 142 -11 -6 38 -87 -88 180 283 -39 -36 -200 -144 17 -227
7445 -227 -11 -63 -78 7 19 264 -86 -50 -48 159 12 5 -22 78 124 95 -162 -244 -41 49 92 101 68 60 134 -238 -105
7472 -105 223 49 -119 -13 60 131 -72 205 -90 -245 -1 -228 -77 232 -225 121 140 -56 -86 149 121 -150
7494 -150 -56 -133 85 111 -51 142 -112 117 -3 167 -41 157 153 95 -81 152 -92 183 175 86 53 -82 -66 125
7518 125 166 185 272 35 82 -229 -129 -148 89 42 -194 213 -52 -153 69 -62 -383 -216 17 -336 -56 137
7540 137 -75 38 -33 190 314 -179 128 17 -324 57 -68 -63 46 -132 146 -129 109 89 -36 -32 -228 -29
$$ packed form
7373A74j74L3R5l97K21J22j8l5q1J21k78J43J43j76J16k7n3J46q8m1o6L6j86J24
7397a46L3j3L39k20J60l00L54l31K02j4k42J39l7q4L19m91N50k31j49K54r4R5
7419I3j81n9M22k66j30Q2rK78k60JQ5j8J04j53NM4j25jK68J03l22Lj64N6J61k44
7445b27K16n2j5Q5J2K45l50L6KK07j47pk7J00M6k9k57q2K03R0M3Rl3qP4l72J33
7472a05L28j74j68J06P3P1k03K77k95j55K44k27J51L09m57L46J9j96l0K35k8k71
7494a50R4p7K18K6j62J93k54K29j20J70k08J98mn8j76K33k44K75qq9l3j35J6J91
7518A25M1J9Q7k37M7l11J00j9K37m7k36M07k65j01K22j31l21J67K33l53K80J93
7540A37k12J13p1K23J24m93L07j11l41L81j25NJ09j78K78k75K38k0j25Mj96J99
$$ plain form
7562 -29 -149 -49 38 52 103 178 94 -11 -49 220 -33 231 47 167 38 151 -67 143 151 -88 -66 -73 -216 -96
7586 -96 -221 -20 258 -14 7 -30 69 -252 -187 14 47 59 -131 61 154 59 79 -78 135 -197 85 -81 -89 -99
7610 -99 -140 110 18 -15 -98 -56 70 -35 141 -346 -124 -175 10 8 247 -42 -139 244 77 23 32 -30 -106 313 -274
7635 -274 -77 86 306 -110 -17 -116 88 -58 170 136 -66 -165 -324 -68 -46 -116 71 -137 11 -21 40 309 144
7658 144 -54 100 -61 193 -66 -115 -345 -204 69 -21 -165 -87 428 -72 -99 -87 -39 44 4 276 -37 -192 -2
7681 -2 239 -150 122 -77 -80 -97 59 -79 -53 161 57 91 -179 19 99 3 27 -24 50 -128 -201 -69 29 -206 -12
7706 -12 0 77 3 -210 -179 324 -49 -67 10 -222 76 66 -40 -104 -14 92 -44 -133 -126 -11 115 -89 169 -133
7730 -133 -151 62 -81 -161 6 -172 15 -118 -257 -189 56 -6 -209 135 241 137 17 87 27 27 -74 -373 -84
$$ packed form
7562b9j20J00Q7J4N1P5q4j05l8K69k53K64j84J20j29J13k18K10Qk39K2pj43J20
7586i6j25K01K78k72K1l7R9l21O5K01L3J2j90J92R3r5K0j57K13l32K82j66qj0
7610i9m1K50r2l3q3M2J26j05J76m87K22n1J85kK39k89r7L83j67n4Ro2p6M19n87
7635b74J97J63K20m16R3r9K04j46K28l4k02r9j59K56K2p0J87k08J48l2O1K69j65
7658A44j98J54j61K54k59m9k30J41K73r0j44P8N15n00k7J2M8Q3m0K72l13j55J90
7681bK41l89K72j99lj7J56j38K6K14j04L4k70J98Q0r6K4n1P4j78p3J32R8k35J94
7706a2J2P7p4k13L1N03l73j8P7k32K98j0j06o4R0J06j36q9PJ15J26k04K58l02
7730a33j8K13j43q0J67j78J87j33j39O8K45o2k03L44J06j04j20P0o0%j01k99K89
$$ plain form
7753 -84 51 -93 5 134 -58 -10 323 50 76 60 -24 -90 23 149 -15 72 -243 -4 110 -22 -39 295 -338
7776 -338 -40 24 29 -132 -140 -44 60 -105 6 26 -128 261 -87 72 116 -16 84 25 165 208 20 198 190 42
7800 42 -297 -270 44 -179 -181 103 -35 35 91 52 158 108 -102 5 -201 95 -96 -129 170 58 -46 151 -274
7823 -274 -32 -256 31 -161 -106 22 259 -48 43 -13 21 80 128 -6 -219 46 -207 20 -100 261 -49 90
7845 90 85 -89 -21 -158 200 -65 219 53 -23 -42 39 227 147 -5 -149 264 57 -185 -24 255 -22 70 37
7868 37 157 91 9 -315 -107 -23 -185 78 -126 261 205 94 -156 110 165 69 -57 -68 83 80 -88 32 -20 84
7892 84 -10 141 1 61 107 -19 95 442 252 3 -120 13 -8 -119 -308 -195 -47 -205 179 -122 -134 48
7914 48 167 68 -35 -42 -55 -270 -125 212 -240 -137 -147 25 -85 39 129 -104 -47 18 117 -57 -371 96 -27
$$ packed form
7753h4J35j44R8J29j92M8L33k73K6j6q4o6J13J26j64Q7l15K39J14j32j7L34o33
7776c38K98O4Nj61qR6J04j65J11K0j54L89l48J59M4j32J00n9J40M3j88J78qj48
7800D2l39K7L14k23kK84j38P0N6l9J06n0k10J07k06K96j91l3K99j12j04J97m25
7823b74K42k24K87j92N5J28K37l07R1n6L4N9M8j34k13K65k53K27j20L61l10J39
7845I0nj74O8j37L58k65K84j66p6j9Q1J88q0j52j44M13k07k42J61K79k77R2l3
7868C7J20o6q2l24K08Q4j62K63k04L87n6j11k50K66N5r6j26j1J51lj68J20n2J04
7892H4r4J51j40O0M6j26J14L47j90k49j23J33k1j11j89J13J48j58L84l01j2J82
7914D8J19r9j03pj3k15J45L37m52J03j0J72j10J24R0k33N7O5R9j74l14M67j23
$$ plain form
7937 -27 132 -35 315 -243 255 85 -70 -225 8 104 -205 -120 -233 124 -65 -100 -7 66 -262 1 26 347
7959 347 52 2 106 272 -137 223 -251 -40 41 2 -24 74 -120 -303 -78 53 -20 -15 137 -141 147 -69 -29
7982 -29 206 -82 23 -84 244 -88 337 40 97 93 27 -313 194 263 -170 -85 -69 -94 -123 14 -99 -113 -205 11
8006 11 143 86 13 -80 122 221 25 219 -113 -11 -73 -49 -28 84 -55 245 318 -372 -33 48 -35 64 39 47 37
8031 37 45 31 -92 -38 102 -46 -132 -98 -15 96 170 -4 21 46 -13 -112 103 -215 -169 30 -176 -41 -125 67 101
8056 101 -9 -10 -19 -82 -255 -5 -51 25 15 19 39 -32 -35 106 -155 13 -64 -228 -26 -248 83 -118 -123 -68 -419 -105
8082 -105 -273 -59 42 18 -69 -124 7 112 17 101 119 -118 28 92 -56 137 -22 -78 -47 74 257 188 370
8105 370 76 -251 405 -38 -48 -168 -42 -55 -160 -137 67 -212 -110 -69 -107 -12 -174 183 48 -82 -80 117 154
$$ packed form
7937b7J59j67L50n58M98j70j55j55K33R6l09Q5j13L57j89l5R3P3l28K63K5L21
7959C47k95n0J04J66m09L60m74K11Q1l9k6R8j94j83K25J31p3NJ52k78K88k16M0
7982b9K35k88J05j07L28l32M25k97N7mo6l40N07O9m33Q5J6k5k9J37j13j4r2K16
8006A1J32n7p3r3K02R9j96J94l32J02o2K4K1J12j39L00P3o90L39Q1q3R9k5Qj0
8031C7Qj4j23N4J40j48q6L4Q3J11P4j74K5K5n9r9K15l18M6J99k06J35q4J92L4
8056A01j10jro3j73K50m6P6j0MK0p1lJ41k61J68p7j64K02k22L31k01nN5l51L14
8082a05j68K14J01k4q7n5J31J05r5Q4J8k37J46O4j48J93j59n6L1J21J83o9J82
8105C70k94l27O56m43j0j20J26j3j05K3K04k79J02M1l8R5j62L57j35j30KJ97L7
$$ plain form
8128 154 266 -51 -96 36 -99 -88 108 -25 -229 98 -264 -62 -79 50 -40 -3 211 241 227 66 287 4
8150 4 220 -79 148 -139 -12 256 113 -125 -191 13 -35 289 379 -68 -46 -57 -67 119 -115 -102 -96 265 -5 109
8174 109 -120 64 -66 -133 -343 -22 -9 129 -128 -140 -13 91 25 52 -85 119 -197
$$ packed form
8128A54J12l17m5J32j35J1J96j33k04L27l62K02j7J29r0L7K14L0j4j61K21k83
8150DK16k99K27k87J27K68j43k38o6K04m8L24R0m47K2j1j0J86k34J3OL61k70J14
8174A09k29J84j30o7k10L21J3J38k57j2J27J04o6K7j37K04l16
8191a97
$$ Imaginary data points
##PAGE= N=2
##DATA TABLE= (X++(I..I)), XYDATA
$$ plain form
0 0 0 0 0 0 0 0 0 0 0 0 0 0 0 0 0 0 0 0 0 0 0 0 2 -7 8 -8 8 -8 8 -9 14 -16 16 -18 22 -24 26 -30 34 -38 41 -46 51 -57
44 -57 63 -69 77 -84 95 -103 112 -125 139 -151 169 -186 205 -228 253 -284 321 -366 421 -490 583
65 583 -713 903 -1228 1903 -8345 29653 30061 -22889 -34180 -10083 12581 8182 -10113 -18214
79 -18214 -5418 -2547 -6549 5487 12184 -14309 -26106 3533 28436 11251 -20734 -26532 5400
92 5400 32770 10905 -27755 -19032 14881 16247 -3004 -7357 -3517 -3193 -219 5559 9575 2264
106 2264 -15633 -12739 18925 28498 -6401 -27566 -1958 25900 18966 -6932 -18515 -1401 18740
119 18740 10691 -7917 -5533 1772 -3793 -1108 10248 4864 -13692 -15652 2994 19208 8028
132 8028 -20031 -21278 11686 24593 -415 -19331 -6617 10162 10810 1509 -5680 -4037 588 566
$$ packed form
0@%%%%%%%%%%%%%%%%%%%%%%KrJ5j6J6j6J6j7K3l0L2l4M0m6N0n6O4p2P9q7R7j08
44e7J20j32J46j61J79j98K15k37K64k90L20l55L91m33M81n37O05o87P87r11J073
65E83j296J616k131L131j0248L7998M08n2950j1291K4097K2664m399j8295q101
79a8214J2796K871m002J2036O697k6493j1797K9639K4903j7185l1985n798L1932
92E400K7370k1865l8660Q723L3913J366j9251m353L840L24K974N778M016p311
106B264j7897K894L1664R573l4899k1165K5608K7858o934k5898j1583J7114K0141
119A8740q049j8608K384P305n565K685J1356n384j8556j960J8646J6214j1180
132H028k8059j247L2964J2907k5008j8916J2714J6779O48r301p189J643M625k2
$$ plain form
146 566 3517 8215 -2570 -17010 -6310 16371 12729 -11038 -20832 -3385 16964 11209 -12510
159 -12510 -17478 3014 12544 1921 -4935 -1660 -1013 -1169 4691 8361 2390 -7948 -8947 7550 18592
174 18592 2403 -17821 -9351 13511 14935 -2880 -13573 -5480 8553 9118 -2367 -5923 -926
187 -926 -814 -830 6489 6282 -6436 -11472 975 13327 7888 -10070 -15219 1981 15723 4174 -12957
202 -12957 -9940 3083 6432 1186 -4272 -5386 -2788 -485 2098 4658 -395 -10396 -7100 9329
216 9329 12198 -4103 -13942 -3817 11583 11032 -3656 -11231 -995 8805 5368 -1796 -1988 -1605 -1725
231 -1725 3156 6845 1854 -6475 -7286 2807 12086 4684 -10749 -9862 6273 12555 1354 -9025
245 -9025 -5950 3710 7322 1598 -3514 -2522 -910 -182 4654 5692 -3502 -9826 -1333 9578 7258
$$ packed form
146E66K951M698j0785j4440J0700K2681l642k3767r794J7447K0349n755k3719
159a2510m968K0492R530j0623o856L275O47j56N860L670n971j0338r99J6497J1042
174A8592j6189k0224Q470K2862J424j7815j0693Q093J4033N65j1485l556M997
187i26J12j6P319k07j2718n036J2447J2352n439j7958n149J7200J3742j1549j7131
202a2957L017J3023L349n246n458j114K598K303K583K560n053j0001L296J6429
216I329K869j6301r839J0125J5400n51j4688p575J0236R800l437p164j92L83j20
231a725M881L689m991q329q11J0093R279p402j5433Q87J6135O282j1201j0379
245i025L075R660L612n724n112R92J612P28M836J038r194o324Q493J0911k320
$$ plain form
260 7258 -5417 -11172 -1831 10452 6830 -6424 -8694 60 5421 3251 -845 -3612 -3250 -388 2875
275 2875 4405 663 -6900 -6657 4991 10687 -191 -10636 -5584 6368 8745 -704 -8333 -4263
289 -4263 4169 4862 334 -2007 -2592 -2579 1127 5448 2097 -5017 -6555 494 8089 5188 -6191 -9452
305 -9452 1353 9053 3399 -5604 -5662 525 4742 3112 -1478 -3164 -2470 -760 3728 5013 -1463 -7595
321 -7595 -3012 6802 6865 -2018 -8050 -3113 6290 7021 -1575 -6661 -1864 3700 3940 1019 -1741 -3072
337 -3072 -1163 2974 4640 1256 -4370 -5503 2394 8640 2595 -6987 -5738 3367 6991 1998 -4465
352 -4465 -4581 945 4316 2043 -1057 -2597 -3051 344 4714 2985 -3362 -6033 -813 5421 4610 -3078
368 -3078 -7949 -1435 6076 3970 -3376 -5010 -1308 2473 3165 394 -2337 -2918 -818 2660 4215 -21
$$ packed form
260G258j2675n755R341J2283l622j3254k270Q754N361k170m096k767L62K862L263
275B875J530l742p563K43J1648N696j0878j0445N052J1952K377r449p629M070
289d263Q432O93m528k341n85J3L706M321l351p114j538P049P595k901j1379l261
305i452J0805P700n654r003n8O187M217j630m590j686O94J710M488J285o476o132
321g595M583R814O3q883o032M937R403P31q596n086M797N564K40k921k760j331
337c072J909M137J666l384n626j133P897O246o045r582J249R105L624m993o463
352d465j16N526L371k273l100j540m54L395M370j729o347k671N220O234q11p688
368c078m871O514P511k106p346j634L702L781O92k771k731n81K100L478J555m236
$$ plain form
384 -21 -5683 -4056 4191 6222 -432 -5885 -3770 3116 5577 731 -4579 -2842 1957 3333 1794 -445
400 -445 -2874 -2147 2080 4769 2171 -3207 -4288 493 6579 3521 -4417 -5436 1160 5199 2453 -2554
416 -2554 -4421 -1354 2709 2497 -775 -2695 -2946 -1309 3157 3467 -1878 -5371 -1854 4066 4413 -900
432 -900 -5595 -2924 4222 4690 -982 -3975 -1774 1153 2579 2107 -1501 -3310 -1217 2065 3556 948
448 948 -3574 -4008 2114 5773 1474 -4068 -3646 1668 4931 2690 -2582 -3047 1011 3585 2175 272
464 272 -1597 -2678 439 3951 2569 -2529 -4185 -844 3529 3825 -2357 -5450 -1316 3529 2764 -1098
480 -1098 -3481 -1986 1556 3183 879 -1647 -2085 -308 1861 3483 364 -4197 -2909 2425 3973
495 3973 -34 -4194 -3770 1224 3680 120 -3597 -3067 5 1976 1669 -367 -3164 -2076 1728 3129
$$ packed form
384b1n662J627Q247K031o654n453K115O886K461m846n310J737M799J376j539k239
400d45k429P27M227K689k598n378j081M781O086l058p938j019O596M039k746n007
416b554j867L067M063k12l272j920k51J637M466L10n345l493L517N920L47n313
432i00m695K671P146M68n672k993K201K927J426m72l608j809K093L282J491k608
448I48m522m34O122L659m299n542M22N314L263k241n272m65M058K574j410j903
464B72j869j081L117L512j382n098j656L341M373K96o182l093M134M845p65l862
480a098k383J495L542J627k304k526m38J777K169J622l119m561J288N334J548
495C973m007m160M24M994K456l560l717N30L072J971l07k036k797J088L804J401
$$ plain form
511 3129 1401 -1823 -3089 389 4289 2765 -2262 -3507 -72 3491 3027 -766 -3445 -1099 2388
526 2388 2327 341 -1373 -2323 -325 3024 2965 -976 -3410 -982 2802 3724 350 -3623 -2113 2483 3468
543 3468 146 -2680 -2263 469 2309 1505 -1972 -2906 -1016 987 1737 538 -3063 -3449 590 3458
559 3458 839 -2798 -3202 125 3140 2421 -1374 -2813 -158 2190 2556 568 -2029 -1665 1127 2882
575 2882 1407 -1435 -2749 -801 2485 3012 -1036 -3713 -1668 2145 3021 -127 -2583 -1998 1391 2865
591 2865 1217 -1228 -1794 -747 2096 2700 20 -2721 -1595 1475 2726 1058 -2332 -2909 347 3002
607 3002 1030 -1929 -2675 -508 1883 2013 -420 -2473 -1580 742 2092 961 -1553 -2611 -115 2748
623 2748 1911 -1036 -2306 -858 1838 2414 -316 -2998 -1590 1114 1866 347 -1787 -2160 -67 2269
$$ packed form
511C129j728l224j266L478L900j524n027j245L435L563m64l793k679K346L487
526B388o1j986j714r50J998L349n9l941k434K428L784R22l374l973J510M596R85
543C468l322k826M17K732J840q04l477r34J890K003P50j199l601l86M039K868
559C458k619l637m04L327L015p19l795j439K655K348L66j988k597L64K792J755
575B882j475k842j314J948L286N27m048k677K045L813Q76l148k456N85L389J474
591B865j648k445n66J047K843O04k680k741J126L070J251j668l390n77L256K655
607C002j972k959p46K167K391J30k433k053Q93K322J350j131k514j058K496K863
623B748q37k947j270J448K696N76k730k682J408K704P52j519k134l73K093K336
$$ plain form
639 2269 1650 -1131 -2073 -1148 1358 2850 705 -2147 -1840 1364 2704 1228 -1430 -2113 -24 2599
655 2599 2012 -1063 -1992 -630 1093 2038 380 -1956 -1739 852 1929 1269 -885 -2573 -866 2056
671 2056 2275 -1196 -2513 -1127 1189 2239 522 -2139 -1874 560 2000 934 -1139 -2262 -919 1818
687 1818 1717 -471 -1981 -1593 798 2193 792 -1754 -2211 376 2397 1009 -1258 -2183 -654 1844
703 1844 1820 -227 -1804 -1045 850 1928 1067 -1517 -2152 54 1873 1116 -656 -2006 -1027 1523 2195
720 2195 -382 -2488 -1161 1128 1806 491 -1221 -1867 212 1834 1503 -588 -1763 -1002 1344 1879
736 1879 236 -2062 -1381 635 1790 1212 -1217 -1989 179 1929 1188 -729 -1667 -913 1155 1963 263
753 263 -1430 -959 427 1562 1169 -796 -2144 -326 1768 1529 -462 -1414 -902 746 1873 244 -1477
$$ packed form
639B269o19k781r42R25K506J492k145k852L07L204J340j476k658o83K089K623
655B599n87l075r29J362J723R45j658k336K17K591J077o60k154j688J707K922
671B056K19l471j317J386K316J050j717k661K65K434J440j066k073j123J343K737
687A818j01k188j510L88K391J395j401k546m57K587K021j388k267r25J529K498
703A844k4k047j577P59J895J078q61k584o35K206J819p57j772j350R79K550O72
720B195k577k106J327K289O78j315j712o46K079J622l31k091j175P61K346N35
736A879j643k298O81K016J155n78k429p72K168J750p41j917r38P54K068Q08j700
753B63j693M71J386J135l93j965j348J818K094k39j991r52N12J648J127j629j721
$$ plain form
770 -1477 -1338 541 1713 1018 -525 -1815 -499 1482 1339 -141 -1482 -1270 437 2193 714 -1477
786 -1477 -1780 464 1476 935 -942 -1968 -731 1311 1300 -173 -1398 -1124 348 1745 584 -1105
802 -1105 -1449 169 1524 1256 -392 -1977 -915 1514 1568 -215 -1665 -1178 557 1475 566 -1032 -1323
819 -1323 -45 1299 1378 -203 -1668 -646 1045 1647 109 -1348 -1223 165 1688 747 -1081 -1516 162
836 162 1103 1141 -144 -1584 -932 1056 1210 364 -1154 -1393 97 1567 969 -1225 -1603 -531 1002 1258
854 1258 -11 -1784 -1078 952 1793 283 -800 -961 170 1056 930 -701 -1218 -301 1247 1402 244
871 244 -1426 -1218 756 1643 304 -1045 -1144 116 1436 977 -728 -1372 -311 939 1180 9 -1153
888 -1153 -586 370 1384 524 -860 -1345 -336 1018 1002 -575 -1752 -581 654 898 -73 -1263 -802
$$ packed form
770a477J39J879J172o95j543j290J316J981j43j480j341K12J707J756j479k191
786a477l03K244J012n41j877j026J237K042j1j473j225K74J472J397j161j689
802a105l44J618J355k68j648j585J062K429N4j783j450M87J735R18r09j598k91
819a323J278J344P9j581j465J022J691O02j538j457J25J388J523r41j828m35J678
836A62R41L8j285j440O52J988J54q46j518k39J490J470n98k194l78J072J533K56
854A258j269j773P06K030Q41j510j083j61J131Q86j26j631n17R17J548J55j158
871B44j670K08J974Q87j339j349r9J260J320m59j705o44J061J250K41j171j162
888a153N67R56J014q60j384m85J009J354j6j577j177J171J235K44r71j190M61
$$ plain form
905 -802 431 1155 341 -809 -1213 -102 795 1162 -152 -1152 -549 666 1349 468 -1084 -1247 372 1278
923 1278 353 -762 -1219 -86 796 1073 -217 -1070 -569 653 1235 304 -721 -1263 68 1195 968 -668
941 -668 -1434 -57 1169 1109 -233 -1423 -530 872 898 126 -630 -893 143 1176 667 -291 -1132 -761 879
960 879 1036 207 -1003 -1118 791 1099 300 -607 -1043 93 1125 701 -555 -895 -332 510 677 46 -848
979 -848 -1154 340 1082 587 -538 -1077 -280 1278 986 -650 -1089 -299 766 871 49 -731 -869 92 667
998 667 237 -526 -883 -378 589 802 -218 -967 -751 632 1143 273 -1004 -1019 455 1056 402 -732 -727 -113
1018 -113 519 901 -199 -717 -642 485 887 367 -842 -1017 72 868 571 -390 -983 -80 755 1042 -134
1037 -134 -728 -355 395 696 439 -606 -936 142 806 815 -215 -500 -348 767 910 108 -1024 -468 519
$$ packed form
905h02J233P24q14j150m04J111Q97L67j314j000O03J215O83q81j552j63J619R06
923A278r25j115m57J133Q82K77j290q53N01J222N82r31j025n42J331J127k27j636
941f68p66J377J226o0j342j190Q93J402K6p72p56k63J036J033n09r58q41L71J640
960H79J57q29j210j15J909L08p99r07m36J136J032m24j256l40N63Q42J67o31q94
979h48l06J494P42m95j125n39P97J558k92j636m39P90J065J05q22p80j38R61N75
998F67m30p63l57N05R67K13j020p49K16J383N11q70j277j5J474O01o54j134NO14
1018a13O32L82j100n18P5J127M02n20j209j75J089P96k97r61n93R03Q35K87j176
1037a34n94L73P50L01k57j045l30J078O64Rj030k85J52J115J43q02j132N56R87
$$ plain form
1056 519 934 417 -616 -852 93 634 492 -374 -740 -458 321 720 78 -917 -628 343 840 428 -733
1075 -733 -1029 -9 720 743 -480 -635 -260 537 659 -156 -562 -582 258 694 495 -440 -949 -277 705 588
1095 588 -400 -903 -367 696 841 -1 -694 -517 305 813 432 -471 -921 -212 983 365 32 -748 -732 249
1115 249 589 206 -396 -335 285 961 531 -276 -750 2 840 617 -13 -622 -360 89 908 274 -702 -666 224
1136 224 774 589 -238 -705 -409 553 784 -177 -570 -695 297 552 454 -624 -647 -211 424 246 -50 -722
1156 -722 -180 486 556 77 -434 -151 377 693 413 -570 -771 81 637 483 -136 -725 -430 389 718 -133
1176 -133 -474 -266 58 316 427 -306 -937 -320 535 580 93 -926 -478 569 644 139 -599 -479 82 430
1196 430 273 -352 -701 -234 438 284 -103 -628 -585 190 469 -117 -445 -551 82 625 552 -322 -648 -91 256
$$ packed form
1056E19M15n17j033k36R45N41j42q66l66K82P79L99o42r95K89R71M97m12j161
1075g33k96J020P29K3j223j55L75P97J22q15m06k0Q40M36j99r35n09O72R82j17
1095E88r88n03N36J063J45q42o93J77Q22N08l81r03m50P09J195o18l33p80J6R81
1115B49L40l83o02O1O20O76m30q07m74P52Q38k23o30o09K62M49Q19o34r76L6Q90
1136B24N50j85q27m67K96R62K31r61l93j25R92K55r8j078k3M36O35j78k96o72
1156g22N42O66P0m79n11K83N28L16k80r83k01Q52N56j54o19n89K95Q19L29q51
1176a33l41K08L24K58J11p33o31O17Q55M5m87j019M48J047P5n05p38J20N61L48
1196D30j57o25l49M67O72j54l87n25M3P75K79n86l28j06O33N43p3q74l26N57L47
$$ plain form
1217 256 480 115 -378 -290 349 562 314 -165 -412 -117 479 351 -499 -654 -312 525 313 89 -460 -737
1237 -737 115 551 1 -358 -370 393 468 269 24 -626 -390 497 840 87 -362 -365 285 200 138 -441 -441 -58 343
1260 343 470 -120 -685 -367 362 329 92 -468 -453 19 374 458 -200 -284 19 341 611 -32 -337 -71 564
1281 564 347 356 -192 -304 65 447 228 -411 -409 103 534 329 -10 -355 -735 269 452 177 -279 -674 -54
1302 -54 471 309 -302 -312 -41 260 287 -98 -299 -80 74 575 82 -424 -542 -293 351 233 56 -411 -244
1323 -244 387 401 -85 -609 -470 103 344 147 -218 -304 91 478 405 -152 -473 -57 323 520 148 -378 -268
1344 -268 324 416 491 -400 -255 -74 336 362 -58 -370 -390 309 144 293 -168 -500 12 473 102 -161 -278
1365 -278 -114 275 282 11 -276 -218 556 239 85 -430 -196 -61 222 172 19 -358 -192 363 213 198 -628 -171
$$ packed form
1217B56K24l65m93Q8O39K13k48m79k47K95N96j28q50j55L42Q37k12k24n49k77
1237g37Q52M36n50l59j2P63P5j99k45o50K36Q87L43p53m49lO50q5o2n79%L83M01
1260C43J27n90n65L18P29l3k37n60J5M72L55Q4o58q4L03L22K70o43l05K66O35
1281E64k17Rn48j12L69L82k19o39KN12M31k05l39l45l80J004J83k75m56l95O20
1302e4N25j62o11j0K71L01K7l85k01K19J54N01m93n06j18K49O44j18j77m67J67
1323b44O31J4m86n24J39N73K41j97l65q6L95L87p3n57l21M16L80J97l72n26J10
1344b68N92R2P5q91J45J81M10K6m20l12k0O99j65J49m61l32N12M61l71k63j17
1365b78J64L89Pk71k87N8P74l17j54n15K34J35K83n0j53l77J66N55j50j5q26M57
$$ plain form
1387 -171 372 299 -90 -491 -528 217 377 331 -203 -377 -107 138 375 226 -407 -353 77 185 338 -282 -437
1408 -437 -63 331 141 -155 -308 -87 159 423 34 -228 -184 126 198 174 -516 -190 -51 355 555 -53 -493
1429 -493 -373 240 521 173 -124 -249 50 333 11 17 -361 89 345 131 -35 -254 -119 391 378 278 -222
1450 -222 -355 15 255 345 -160 -383 -113 488 198 0 -172 28 79 24 -115 -393 -217 -34 383 -87 -77
1471 -77 -298 -187 99 403 -198 -282 -160 -109 61 35 -28 -272 265 337 -18 -87 -344 103 -42 179 -74 -276
1493 -276 -53 -39 333 262 -397 -369 -139 208 211 -103 -239 -63 218 34 223 -377 -294 138 141 62 -122 -423 -10
1516 -10 231 107 -112 -384 -334 70 300 36 -125 -91 223 16 18 -246 -269 -15 54 86 -127 -429 -238 205 236
1539 236 235 -120 61 158 122 104 -48 -329 -163 619 -110 -72 -228 -238 108 90 -170 -318 -236 -157 305 -16 51 -373
$$ packed form
1387a71N43p3l89m01l7P45J60m6n34j74K70K45K37j49o33N4M30J08J53o20j55
1408d37L74L94j90k96j53K21K46K64l89k62M4L10P2k4o90L26J39M06K00o08m40
1429d93J20O13K81l48k97j25K99K83l22Ol78M50K56k14j66k19J35N10j3j00n00
1450b22j33L70K40R0n05k23K70O01k90j98j72K00N1n5j39k78J76J83M17m70J0
1471g7k21J11K86L04o01q4J22N1J70k6o3k44N37P2l55o9k57M47j45K21k53k02
1493b76K23J4L72p1o59K8K30L47Ll14j36J76K81j84J89o00Q3M32Lp9j84l01M13
1516a0K41j24k19k72N0M04K30k64j61L4L14k07Kk64k3K54O9L2k13l02J91M43L1
1539B36jl55J81R7l6j8j52k81J66P82p29L8j56j0L46j8k60j48Q2P9M62l21O7m24
$$ plain form
1563 -373 48 -9 145 44 -372 -115 231 371 -156 -427 -253 54 41 -27 -91 -129 68 183 40 230 -77 -76
1585 -76 20 169 208 -93 0 -189 108 197 -389 -140 -54 -25 43 -77 -34 -99 147 109 12 -77 -405 -28 61 -18 -300
1610 -300 -302 -59 319 77 21 -217 61 193 125 -100 158 -508 150 89 93 -29 -94 -145 42 -57 167 -32 -310
1633 -310 10 128 196 14 -169 32 -16 116 -218 -367 -335 -23 304 132 -356 -172 -66 89 -102 -17 -313
1654 -313 -201 72 305 103 -452 -128 -17 342 -128 -212 -78 19 17 65 108 -237 77 63 225 29 219 -39
1676 -39 79 285 174 -2 -68 201 39 134 123 -481 -285 171 105 18 -187 -53 -74 27 -94 169 -306 71
1698 71 256 -301 73 -59 26 -10 196 124 -111 -351 -18 282 59 -272 -288 -72 304 322 -182 -77 -178 -74
1720 -74 220 -95 -221 79 8 277 -166 -76 -8 -72 60 370 28 -249 -4 241 -104 -12 76 -155 71 6 88
$$ packed form
1563c73M21n7J54j01m16K57L46J40n27k71J74L07j3o8o4l8J97J15j43J90l07J
1585g6R6J49L9l01R3j89K97Q9n86K49Q6K9O8j20M3o5K46l8r7q9l28L77Q9p9k82
1610c00kK43L78k42n6k38K78J32o8k25K58o66O58o1Mj22o5n1J87r9K24j99k78
1633c10L20J18O8j82j83K01m8J32l34j49L2L12L27j72m88J84J06J55j91Q5k96
1654c13J12K73K33k02n55L24J11L59m70q4J34R7kM8M3l45L14j4J62j96J90k58
1676c9J18K06j11j76o6K69j62R5j1o04J96M56o6q7k05J34k1J01j21K63m75L77
1698G1J85n57L74j32Q5l6K06p2k35k40L33L00k23l31j6K16L76J8n04J05j01J04
1720g4K94l15j26L00p1K69m43R0O8o4J32L10l42k77K45K45l45R2Q8k31K26o5Q2
$$ plain form
1743 88 211 -130 -400 244 118 -233 -103 14 254 4 44 -174 35 -231 -93 -77 -97 -279 -161 -54 -325
1764 -325 -211 31 -106 -251 38 -104 -119 -84 -65 160 210 -202 -128 -65 142 -103 42 163 -81 160 10 -90
1786 -90 -69 -132 -250 -95 417 81 -284 29 -22 -123 99 -155 25 94 101 12 -219 310 141 -79 230 -132 -73
1809 -73 42 -226 107 118 78 -4 -209 -47 50 -123 -355 147 11 315 -54 -250 -22 -89 -87 -34 26 -21 80 143
1833 143 318 126 33 -39 128 -157 -116 -235 -111 35 -45 249 -156 -69 -4 139 48 68 -6 69 319 93 81 -159
1857 -159 -152 -86 -38 -44 -13 -85 171 -102 -184 -103 -163 102 199 102 -161 177 -133 228 -149 270 -179 -302 -206 16 -113
1882 -113 -21 -111 7 105 29 -412 -47 33 -21 -87 -136 -87 -149 91 12 122 46 104 26 -42 108 213 -64 104 -58
1907 -58 38 -143 -163 -154 133 111 205 -34 230 -123 105 -43 -297 27 -216 7 386 206 182 239 -163 30 -75
$$ packed form
1743H8J23l41k70O44j26l51J30J17K40k50M0k18K09k66J38J6k0j82J18J07k71
1764c25J14K42j37j45K89j42j5L5J9K25N0m12P4O3K07k45J45J21k44K41j50j00
1786i0K1o3j18J55N12l36l65L13n1j01K22k54J80O9Pq9k31N29j69k20L09l62N9
1809g3J15k68L33J1m0q2k05J62R7j73k32N02j36L04l69j96K28o7KN3O0m7J01O3
1833A43J75j92r3p2J67k85M1j19J24J46q0K94m05Q7O5J43r1K0p4P5K50k26j2k40
1857a59PO6M8oL1p2K56k73q2Q1o0K65R7r7k63L38l10L61l77M19m49j23R6K22j29
1882a13R2r0J18R8p6m41L65Q0n4o6m9M9o2K40p9J10p6N8p8o8J50J05k77J68j62
1907e8R6j81k0RK87k2R4k39K64l53K28j48k54L24k43K23L79j80k4N7m02J93j05
$$ plain form
1930 -75 -106 -194 -140 -5 123 38 -212 -22 3 -92 -24 -197 -160 -173 -6 447 221 -68 -87 57 128 94 -114 -138 126
1955 126 201 22 -107 120 -96 396 125 304 158 86 -81 169 386 -176 -119 145 102 75 -356 -19 71 7
1977 7 57 132 101 108 -65 243 -28 -270 -95 19 38 -61 -210 -21 -76 96 -104 103 -49 205 319 133 -174
2000 -174 206 100 -42 251 68 -155 -26 114 -114 55 87 -36 -134 -22 68 276 -83 5 38 55 -105 -168
2022 -168 -62 37 14 144 11 -34 -163 -108 -31 -43 120 -220 -153 20 95 -226 -29 -227 -19 42 -20 199 119 -58
2046 -58 -204 146 77 54 60 -96 -134 -104 -37 -23 101 24 -218 -178 18 53 -53 -88 -104 1 -124 43 0 237 -192
2071 -192 127 84 -137 308 -169 66 40 129 -26 -31 -111 -233 -30 100 272 -52 -25 -134 -143 -28 -140 62 233
2094 233 19 26 -114 -142 -291 13 -48 -33 -210 101 154 -10 5 144 -168 -37 144 -5 -185 265 -55 -98 194
$$ packed form
1930g5l1q8N4J35J28q5k50J90K5r5O8j73L7j3J67M53k26k89j9J44P1l4k08k4K64
1955A26P5j79j29K27k16M92k71J79j46p2j67K50K17n62N7K64m3k7m31L37R0o4
1977GN0P5l1Pj73L08k71k42J75J14J9r9j49J89n5J72k00K07j52K54J14j86l07
2000a74L80j06j42K93j83k23J29J40k28J69L2j23r8J12R0K08l59Q8L3J7j60o3
2022a68J06R9k3J30j33m5j29N5P7j2J63l40O7J73P5l21J97j98K08O1o2K19q0j77
2046e8j46L50o9k3Oj56l8L0O7J4J24p7k42M0J96L5j06l5j6J05j25J67m3K37m29
2071a92L19m3k21M45m77K35k6Q9j55nq0j22K03J30J72l24K7j09rJ15j12K02J71
2094B33k14Pj40k8j49L04o1J5j77L11N3j64J5J39l12J31J81j49j80M50l20m3K92
$$ plain form
2117 194 -94 -80 -46 137 38 -75 -79 212 -14 144 114 -1 -161 45 74 -277 81 -136 -113 -363 159 103 -37
2140 -37 87 10 162 159 50 -166 107 -184 -73 11 -62 -437 22 21 -58 -16 -117 126 -187 -45 -45 -335 94 204
2164 204 60 58 133 -201 1 192 -138 -144 -78 183 128 -217 -126 -216 5 53 -68 137 339 -67 -65 102 19 256
2188 256 98 38 -131 -264 102 23 -76 89 190 101 57 -54 262 -42 25 105 119 146 -175 -142 192 -39 -63 -188
2212 -188 41 -30 69 171 -176 58 144 62 36 -143 -87 -216 -89 -293 157 -176 -28 -52 135 -29 66 -184 -214
2235 -214 236 -375 -279 -191 48 141 -171 -90 23 -114 -66 -268 -151 43 101 57 -129 79 -121 -118 -115 -107 -74 267 -47
2260 -47 -9 56 71 -157 -250 241 189 -236 62 125 97 58 63 170 -124 -6 3 128 -137 180 -96 226 339 61
2284 61 163 -61 12 78 -71 -224 -119 79 1 4 136 30 -14 -56 98 -26 74 -4 127 -17 58 41 -140 -32
$$ packed form
2117A94k88J4L4J83r9j13mK91k26J58l0j15j60K06K9l51L58k17K3k50N22n6j40
2140c7J24p7J52lj09k16K73k91J11Q4p3l75M59jp9M2j01K43l13J42%k90M29J10
2164B04j44kP5l34K02J91l30oO6K61n5l45R1r0K21M8j21K05K02m06KJ67q3K37
2188B56j58o0j69j33L66p9r9J65J01q9m4j11L16l04O7Q0J4K7l21L3L34k31k4j25
2212a88K29p1R9J02l47K34Q6q2k6j79N6j29J27k04M50l33J48k4J87j64R5k50l0
2235b14M50o11R6Q8K39R3l12Q1J13j37M8k02J17J94N8m4j86K08k00LLQL3L41l14
2260d7L8O5J5k28r3M91n2m25K98O3k8l9NJ07k94J18RJ25k65L17k76L22J13k78
2284F1J02k24P3O6j49j53J05J98p8LJ32j06m4m2J54j24J00p8J31j44P5j7j81J08
$$ plain form
2308 -32 125 77 -8 235 -31 47 197 28 52 -51 98 197 -119 70 -185 -249 -189 -120 63 47 -230 22 108 -197
2332 -197 137 45 -154 13 -57 79 47 145 80 -28 28 -176 -155 0 127 -78 50 -265 -12 253 53 -183
2354 -183 15 40 -112 131 -66 -80 -188 -28 -88 -24 -1 -181 -94 -27 295 210 157 78 -206 -273 -45 252 -404 -28
2378 -28 -15 -12 42 94 -91 -147 -22 -34 -218 -110 -76 96 61 62 201 -4 -81 -146 86 -32 211 249 61 -100 78
2403 78 76 491 -39 -97 -145 -106 -107 -131 27 120 36 -25 67 -42 24 46 -127 90 -138 39 -64 -38 152 78 45 9
2429 9 21 303 -209 17 215 -41 95 -1 -37 9 -156 14 24 -125 -9 109 14 -23 -97 -61 -15 32 291 5
2453 5 63 -116 -30 -214 41 -113 225 57 153 139 206 -14 -79 188 61 48 4 281 221 -47 -221 -142 -156 -40
2477 -40 204 -17 -15 -42 277 -242 113 -7 228 -8 -73 69 -137 94 71 -153 -88 -127 -40 -26 -17 -70 -19 -32 65
$$ packed form
2308c2J57m8q5K43k66P8J50j69K4j03J49R9l16J89k55o4O0O9J83j6k77K52Q6l05
2332a97L34r2j99J67p0J36l2R8o5j08N6k04K1J55J27k05J28l15K53K65k00k36
2354a83J98K5j52K43j97j4j08J60o0O4K3j80Q7O7L22q5n3p9k84o7K28K97o56L76
2378b8J3LN4N2j85n6J25j2j84J08L4J72l5JJ39k05p7o5K32j18K43L8j88j61J78
2403G8kM15n30n8m8L9jk4J58R3q4o1R2j09O6K2j73K17k28J77j03K6J90p4l3l6
2429IJ2K82n12K26J98k56J36r6l6M6j65J70J0j49J16J18r5l7p4L6M6M7K59k86
2453EN8j79Q6j84K55j54L38j68R6j4O7k20o5K67j27j3m4K77o0k68j74P9j4J16
2477d0K44k21Kk7L19n19L55j20K35k36o5J42k06K31k3k24O5l9Q7J4Rn3N1j3R7
$$ plain form
2502 65 63 37 126 94 117 -196 96 229 90 104 20 73 293 -162 119 -90 -57 4 38 90 -2 -242 -257 -198 10 15
2528 15 -101 -145 60 -8 28 6 259 -85 -11 28 105 -83 76 -10 -257 127 24 -297 25 109 -22 -163 111
2551 111 278 273 120 84 -70 -80 -74 -1 40 -89 -69 -110 78 246 22 212 -161 326 -180 -122 -220 16 84 -303
2575 -303 -74 138 -7 108 -223 -48 10 -16 -17 169 -235 -72 134 266 58 103 -45 -79 -16 -116 -134 291 276
2598 276 -83 124 38 112 16 79 -10 -57 93 156 -52 227 -58 -20 166 -66 9 -118 -183 -138 -39 39 35 -131 108
2623 108 -34 300 53 -142 164 -134 -151 7 -37 233 -47 -70 -195 -67 173 -19 24 27 -94 -82 36 -74
2645 -74 86 95 -100 70 126 120 27 63 -389 31 -46 -119 -143 -87 60 -121 176 136 -129 -131 152 -114 209 68 139
2670 139 161 79 68 12 28 241 65 -121 111 14 -92 189 -64 -42 73 -82 79 68 78 64 30 -65 -45 -30 -101
$$ packed form
2502F5kk6Q9l2K3l13K92J33j39J4q4N3K20m55K81k09L3O1L4N2r2k40j5N9K08N
2528A5j16m4K05o8L6k2K53l44P4L9P7j88J59q6k47L84j03l21L22Q4j31j41K74
2551A11J67nj53l6j54j0OP3M1j29K0m1J88J68k24J90l73M87n06N8r8K36O8l87
2575c03K29K12j45J15l31J75N8k6jJ86m04J63K06J32k08M5j48l4O3j00j8M25j5
2598B76l59K07q6P4r6O3q9m7J50O3k08K79k85L8J86k32P5j27o5M5R9P8mj66K39
2623A08j42L34k47j95L06k98j7J58m4K70k80k3j25J28K40j92M3Lj21J2J18j10
2645g4J60Rj95J70N6or3L6m52M20p7p3k4N6J47j81K97m0k65kK83k66L23j41P1
2670A39K2q2j1n6J6K13j76j86K32r7j06K81k53K2J15j55J61j1J0j4l4r5K0J5p1
$$ plain form
2695 -101 -95 116 34 -25 -134 -52 161 -119 149 -65 8 -127 -186 -152 56 74 -131 17 101 63 190 -191 -132 56
2719 56 -1 106 110 190 -111 268 -219 123 -302 -246 10 -63 79 97 -17 68 67 172 -103 -206 -187 63 225 -130
2743 -130 -51 57 -45 -67 -316 -71 48 -98 -23 -42 39 -59 45 40 -3 -258 26 67 175 -80 9 175 66 121
2767 121 86 50 81 43 235 125 -129 25 186 -21 221 184 -157 40 -310 -117 150 132 35 -174 114 -102
2789 -102 -120 106 -336 -189 -92 -205 -130 200 40 228 50 -174 -98 54 73 -83 -191 34 -112 -164 -179 205
2811 205 -7 -17 -69 -259 -119 -67 222 -137 171 90 366 -155 -87 -74 26 9 38 -219 -72 20 -36 36 113 -26
2835 -26 -77 -221 -1 123 -316 14 30 -88 242 -264 -106 -144 24 8 36 -174 -382 -120 -128 -21 -47 -221 60
2858 60 133 -9 188 -179 29 -24 128 -125 18 -228 49 -247 105 243 -126 48 97 -30 -53 -76 -9 -13 11
$$ packed form
2695a01OK11q2n9j09Q2K13k80K68k14P3j35n9L4K08J8k05J48Q4l8J27l81N9J88
2719E6n7J07MQ0l01L79m87L42m25N6K56p3J42J8j14Q5jJ05k75j03J9K50J62l55
2743a30P9J08j02k2k49K45J19j46P5j9Q1r8J04nm3k55K84M1J08k55Q9J66j09N5
2767A21l5l6L1l8J92j10k54J54J61k07K42l7l41J97l50J93K67j8r7k09K88k16
2789a02j8K26m42J47R7j13P5L30j60J88j78k24P6J52J9j56j08K25j46n2j5L84
2811B05k12j0n2j90J40N2K89l59L08q1K76n21O8J3J00j7K9k57J47R2n6P2P7j39
2835b6n1j44K20J24m39L30J6j18L30n06J58l8J68j6K8k10k08K62qJ07k6j74K81
2858F0P3j42J97l67K08n3J52k53J43k46K77k96L52J38l69J74M9j27k3k3O7mK4
$$ plain form
2881 11 -160 -117 142 208 13 93 157 68 -36 -62 54 -6 15 159 -75 76 -9 -10 32 49 191 -70 35 -73 -231
2906 -231 -221 -121 -17 23 -23 88 -35 99 -60 225 4 -120 -96 -195 -94 -32 -94 2 -87 -87 -93 -68 4 134 -110
2931 -110 2 -129 25 211 76 -197 -85 64 -28 100 190 -37 -40 43 17 11 -165 -104 70 68 140 185 -9 -123
2955 -123 -166 -95 104 101 13 80 93 89 210 -103 -26 -272 -41 -225 -219 98 -33 66 200 47 36 -216 -81 59 -38
2980 -38 108 -17 139 -18 19 97 -89 258 207 -33 -363 84 -126 -86 -175 -10 146 73 -29 148 -114 74
3002 74 -101 44 55 -261 102 -135 -123 -64 181 54 -48 -56 169 329 174 147 88 -168 53 -74 116 96 -6
3025 -6 -39 19 -1 27 -99 241 78 -270 47 3 -4 -24 -17 134 51 -70 209 -165 9 -130 -98 -110 -69 -9 -268 -151
3051 -151 -85 -130 -111 -164 -110 -291 -54 -133 43 -50 -80 -28 -186 289 -136 230 -14 122 -212 160 110 -129 -114 -72
$$ packed form
2881A1j71M3K59O6j95Q0O4q9j04k6J16o0K1J44k34J51q5jM2J7J42k61J05j08j58
2906b31J0J00J04M0m6J11j23J34j59K85k21j24K4r9J01O2o2R6q9%oK5P2J30k44
2931a10J12j31J54J86j35k73J12J49r2J28R0k27lQ3k6oj76O1J74kP2M5j94j14
2955a23m3P1J99lq8O7J3mJ21l13P7k46K31j84OL17j31R9J34j53j1k52J35J40r7
2980c8J46j25J56j57L7P8j86L47n1k40l30M47k10M0q9J65J56p3j02J77k62J88
3002G4j75J45J1l16L63k37J2N9K45j27j02qK25J60j55k7n9k56K21j27J90k0j02
3025fl3N8k0K8j26L40j63l48L17m4pk0PJ51q3j21K79l74J74j39L2j2M1O0k59J17
3051a51O6m5J9n3N4j81K37p9J76r3l0N2j58M75m25L66k44J36l34L72n0k39J5M2
$$ plain form
3075 -72 111 193 105 47 50 -29 -23 17 -79 316 188 -232 126 -4 36 86 -83 -61 149 266 -74 -28 64 -113 4
3100 4 -84 173 -44 17 -204 -35 119 -186 1 202 -18 101 181 93 -448 -129 92 10 -134 28 -39 -80 -177
3123 -177 204 105 72 193 80 -43 187 -64 -320 -22 -126 -225 -35 -37 55 -86 -367 -74 265 191 188 94 67 -116
3147 -116 229 259 278 23 61 11 29 -82 171 -63 365 -51 100 132 147 80 151 47 118 24 24 -66 -42 -107 182
3172 182 47 -1 61 -165 -26 2 -86 117 -83 -55 34 90 17 235 -15 -75 -212 -30 50 -328 -132 -152 -49 -122
3196 -122 -199 -44 62 -85 165 276 168 -24 -111 77 120 16 118 147 85 -119 -18 -71 -84 -103 104 -237 31
3219 31 -9 -88 -62 -326 189 -65 -41 10 126 -46 -116 28 -53 189 255 71 217 -93 -122 142 -42 81 181
3242 181 86 94 63 -72 150 68 22 -46 -228 9 117 -34 -150 65 44 128 -88 -370 123 252 197 -230 39
$$ packed form
3075g2J83Q2q8n8Lp9OM0r6L95j28m20L58j30M0N0j69K2K10J17l40M6R2j77J17
3100Dq8K57k17O1k21J69J54l05J87K01k20J19Q0q8n41L19K21q2j44J62o7m1r7
3123a77L81r9l3J21j13j23K30k51k56K98j04r9J90kR2j41k81K93L39p4lr4k7j83
3147a16L45L0J9k55L8n0J8j11K53k34M28m16J51L2J5o7P1j04P1r4%r0K4o5K89
3172A82j35m8O2k26J39K8q8K03k00K8Q9N6p3K18k50o0j37J82Q0l78J96k0J03p3
3196a22p7J55J06j47K50J11j08j92q7J88M3j04J02K9o2k04J01n3j3j9K07l41K68
3219C1m0p9K6k64N15k54K4N1J16j72p0J44q1K42O6j84J46l10k9K64j84J23J00
3242A81r5Ql1j35K22q2m6o8j82K37J08j51j16K15k1Q4k16k82M93J29n5m27K69
$$ plain form
3265 39 67 -157 -105 -225 -67 -127 57 -336 -58 -56 -310 -112 82 134 -64 -108 -9 125 -6 -194 -57 -220 58
3288 58 43 64 9 90 112 -23 -319 109 -166 -33 373 40 90 66 -35 11 63 77 140 -166 -249 177 -25 211
3312 211 -189 2 191 36 122 -21 129 85 280 -53 34 -101 122 118 192 -60 265 202 -59 -111 4 -130 26
3335 26 53 -124 -43 -64 18 -130 -41 -160 26 -253 -66 40 67 -3 108 -60 287 248 -3 -76 126 -78 91
3358 91 -71 127 -3 -292 22 112 58 -227 0 208 82 7 -80 -259 4 -564 -57 150 110 -247 -68 -284
3380 -284 -94 202 222 222 75 -21 -46 81 56 32 87 253 82 8 -10 -9 279 -23 -96 -176 46 -7 191 130 13
3405 13 388 264 11 -234 140 131 240 -16 -31 262 122 -167 51 190 73 75 95 121 -103 -194 -86 36 -87
3428 -87 83 -73 160 75 73 147 -96 149 -81 -9 -112 -158 -345 218 173 -149 46 177 65 -71 -48 206 67
$$ packed form
3265C9K8k24N2j20J58o0J84l93K78Kk54J98J94N2j98m4R9J34j31j88J37j63K78
3288E8j5K1n5Q1K2j35k96M28k75J33M06l33N0k4j01M6N2J4O3l06q3M26k02K36
3312B11m00J91J89j55Q6j43J50m4J95l33Q7j35K23mP4k52L25o3k61n2J15j34J56
3335B6K7j77Q1k1Q2j48Q9j19J86k79J87J06K7p0J11j68L47l9k51p3K02k04J69
3358I1j62J98j30k89L14R0n4k85K27K08j26p5q7j79K63n68N07K07m0l57J79k16
3380b84J90K96K0%j47r6k5J27k5k4N5J66j71p4j8JK88l02p3q0K22n3J98o1j17
3405A3L75j24k53k45L74rJ09k56j5K93j40k89K18J39j17KK0K6k24r1J08J22j23
3428h7J70j56K33q5kP4k43K45k30P2j03m6j87N63m5l22J95J31j12j36K3K54j39
$$ plain form
3451 67 -39 220 -7 85 94 -132 -67 -102 -9 -54 -153 223 -114 -15 -184 -53 -117 -256 16 -4 -55 169 55 206
3475 206 -62 -175 -88 -196 136 -208 100 -324 65 115 94 -96 129 68 106 114 -88 135 49 165 36 70 -40
3498 -40 161 4 241 77 -33 29 -147 47 -111 -117 287 -22 -219 108 -42 215 218 -138 -43 -85 -62 -90 -28 28
3522 28 88 -10 -218 -117 21 -83 22 57 162 96 141 -285 -14 -17 -126 115 104 -58 53 170 46 -91 -23
3545 -23 -109 -220 194 -83 112 88 -52 -28 126 101 12 -122 93 -203 -43 101 -95 -123 -16 -180 -60 -120 131
3568 131 50 23 148 13 -127 97 54 -49 124 117 367 -98 106 -264 1 -151 54 -102 -64 3 1 -84 254
3591 254 36 -48 82 85 116 -4 -61 -50 44 -154 54 258 -7 -194 84 -207 -219 -59 53 158 42 57 126
3614 126 -29 -50 76 195 -38 11 -72 100 189 -37 -128 -9 209 117 83 -81 -134 68 -30 -66 -114 -95 84 55
$$ packed form
3451F7j06K59k27R2Rk26O5l5R3m5r9L76l37R9j69J31o4j39K72k0n1K24j14J51
3475B06k68j13Q7j08L32l44L08m24L89N0k1j90K25o1L8Qk02K23q6J16j29L4j10
3498d0K01j57K37j64j10O2j76J94j58oM04l09j97L27j50K57Ll56R5m2K3k8O2N6
3522B8O0r8k08J01J38j04J05L5J05o6M5m26K71lj09K41j1j62J11J17j24j37O8
3545b3q6j11M14k77J95k4j40K4J54k5q9j34K15k96J60J44j96k8J07j64J20o0K51
3568A31q1k7J25j35j40K24m3j03J73pK50m65K04l70K65j52K05j56L8O7kq5L38
3591B54k18q4J30LL1j20n7J1R4j98K08K04k65j87K78k91j2J60J12J05j16J5O9
3614A26j55k1J26J19k33M9q3J72Q9k26r1J19K18r2l4j64n3K02r8l6m8J9J79k9
$$ plain form
3638 55 -52 187 -205 96 -135 -66 70 120 -138 -191 -39 150 124 43 81 11 -40 56 -113 -61 -33 93 -19 165
3662 165 23 28 -273 148 221 23 362 -82 -74 -151 -81 106 -41 -177 36 249 260 -93 228 -101 -56 65 48
3685 48 -52 -8 106 1 78 -183 21 -123 199 -173 187 -9 249 24 272 2 -84 130 -23 139 -179
3706 -179 9 -24 -106 16 96 -222 4 -152 46 -244 -141 -129 -184 -173 236 117 -38 43 148 259 31 204
3728 204 92 347 -308 177 210 100 -197 58 39 -116 -62 237 196 -76 39 -123 47 -52 -33 -62 18 -60 53
3751 53 -148 -74 -220 -31 -131 12 -33 -223 -155 -26 -146 263 -318 65 -106 205 75 -17 -80 -273 122 -62
3773 -62 90 -161 -149 -48 172 -164 26 -128 342 180 -10 71 -191 153 -366 9 -91 120 9 141 253
3794 253 -255 104 36 -91 -93 139 -68 -16 -62 -115 -43 -36 98 298 183 -48 178 -71 -29 -78 -18 -3 -128 -36 129
$$ packed form
3638E5j07K39l92L01k31O9J36N0k58n3J52J89k6q1L8p0n1R6j69N2K8J26j12J84
3662A65j42Nl01M21P3j98L39m44Qp7P0J87j47j36K13K13J1l53L21l29M5J21j7
3685D8j00M4J14j05P7k61K04j44L22l72L60j96K58k25K48k70q6K14j53J62l18
3706a79J88l3q2J22Q0l18K26j56J98k90J03J2n5J1M09j19j55Q1J05J11k28J73
3728B04j12K55o55M85L3j10k97K55j9j55N4K99m1k72J15j62J70r9J9k9Q0p8J13
3751E3k01P4j46J89j00J43m5j90O8J29j20M09n81L83j71L11j30r2o3j93L95j84
3773f2J52k51J2J01K20l36J90j54M70j62j90Q1k62L44n19L75j00K11j11J32J12
3794B53n08L59o8j27kK32k07N2m6n3P2PJ34K00j15k31K26k49M2m9O0J5j25R2J65
$$ plain form
3819 129 -16 201 48 96 -113 10 101 -357 72 -76 -19 207 75 170 29 62 170 -35 -129 95 52 -48
3841 -48 -220 227 153 196 94 -96 35 217 290 253 45 33 199 128 209 -364 -173 -69 284 -58 89 -70 -39
3864 -39 308 155 -197 -62 70 152 -46 70 -134 225 317 -47 94 -4 184 163 111 205 -26 35 242 -142 151
3887 151 144 -45 -132 295 135 16 143 48 -126 49 272 43 -154 70 -113 35 129 287 -45 -177 -15 106
3909 106 -80 44 128 55 125 -164 26 -212 -173 60 99 214 4 -53 253 144 -136 -81 126 75 64 282 480
3932 480 -212 134 -32 36 -137 156 3 120 -30 76 46 -261 259 -147 -100 -86 -112 -93 198 170 -29 -233
3954 -233 -160 27 -90 -37 53 5 -119 134 -30 94 88 49 32 -41 57 -180 -69 -15 313 106 14 -1 -290 -193 62
$$ packed form
3819A29j45K17j53M8k09J23R1m58M29j48N7K26j32R5j41L3J08k05r4K24m3j00
3841d8j72M47p4M3j02j90J31J82P3l7k08j2J66p1Q1n73J91J04L53l42J47j59L1
3864c9L47j53l52J35J32Q2j98J16k04L59R2l64J41r8J88k1n2R4k31O1K07l84K93
3887A51pj89q7M27j60j19J27r5j74J75K23k29j97K24j83J48R4J58l32j32J62J21
3909A06j86J24Q4p3P0k89J90k38L9K33L9J15k10n7L06j09k80N5K07n1j1K18J98
3932D80o92L46j66O8j73K93j53J17j50J06l0l07N20m06M7J4k6J9K91k8j99k04
3954b33P3J87j17N3R0m8j24K53j64J24ol9j7p3R8k37J11N4L28k07r2j5k89R7K55
$$ [...]
8191d4
##END NTUPLES=NMR FID
##END=
