##TITLE=1H_LR-758-R3-KA2i
 CDCl3
 8 sc, 
 2.8.2023
##JCAMPDX= 6.0         $$ Bruker NMR JCAMP-DX V2.0
##DATA TYPE= NMR FID
##DATA CLASS= NTUPLES
##ORIGIN= UXNMR, Bruker Analytische Messtechnik GmbH
##OWNER= root
$$ XWIN-NMR		Version 3.5
$$ Wed Aug  2 16:46:20 2023 Russian Standard Time (UT+4h)  she@DPX200
##.OBSERVE FREQUENCY= 200.13135
##.OBSERVE NUCLEUS= ^1H
##.DELAY= (6, 6)
##.ACQUISITION MODE= SIMULTANEOUS
##.ACQUISITION SCHEME= undefined
##.AVERAGES= 8
##.DIGITISER RES= 18
##SPECTROMETER/DATA SYSTEM= spect
##.PULSE SEQUENCE= zg30
##.SOLVENT NAME= D2O
##.SHIFT REFERENCE= (INTERNAL, D2O, 0, 15.7039)
##AUDIT TRAIL= $$ (NUMBER, WHEN, WHO, WHERE, WHAT)
$$ ##TITLE= Audit trail, XWIN-NMR		Version 3.5
$$ ##JCAMPDX= 5.01
$$ ##ORIGIN= Bruker BioSpin GmbH
$$ ##OWNER= she
$$ F:/spectra/data/she/nmr/H-F/1/audita.txt
$$ ##AUDIT TRAIL=  $$ (NUMBER, WHEN, WHO, WHERE, WHAT)
(   1,<2023-08-02 16:45:11.75 +0400>,<she>,<DPX200>,
      <created by zg, POWCHK disabled, PULCHK disabled
       configuration hash MD5:
       00 E9 B6 7A A2 85 ED C7 34 08 36 98 17 FE 4E 26
       data hash MD5: 16K
       54 C9 2B 38 67 66 1E 5F D7 E6 2F 8D 3C 11 3B D6>)
$$ ##END=
$$ 
$$ hash MD5
$$ 23 8F 27 E7 EB 20 7B 6D 82 91 69 13 F6 CC 91 6C
##$RELAX= 
##$RELAX= 
##$RELAX= 
##$RELAX= 
##$RELAX= 
##$RELAX= 
$$ Bruker specific parameters
$$ --------------------------
##$DU= <F:/spectra>
##$EXPNO= 1
##$NAME= <H-F>
##$PROCNO= 1
##$TYPE= <nmr>
##$USER= <she>
##$AMP= (0..31)
100 100 100 100 100 100 100 100 100 100 100 100 100 100 100 100 100 100 
100 100 100 100 100 100 100 100 100 100 100 100 100 100 
##$AQSEQ= 0
##$AQ_mod= 1
##$AUNM= <au_zg>
##$AUTOPOS= <>
##$BF1= 200.13
##$BF2= 200.13
##$BF3= 200.13
##$BF4= 200.13
##$BF5= 200.13
##$BF6= 200.13
##$BF7= 200.13
##$BF8= 200.13
##$BYTORDA= 1
##$CFDGTYP= 0
##$CFRGTYP= 5
##$CHEMSTR= <none>
##$CNST= (0..31)
1 1 145 1 1 1 1 1 1 1 1 1 1 1 1 1 1 1 1 1 1 1 1 1 1 1 1 1 1 1 1 1 
##$CPDPRG= <>
##$CPDPRG1= <>
##$CPDPRG2= <>
##$CPDPRG3= <>
##$CPDPRG4= <mlev>
##$CPDPRG5= <mlev>
##$CPDPRG6= <mlev>
##$CPDPRG7= <mlev>
##$CPDPRG8= <mlev>
##$CPDPRGB= <>
##$CPDPRGT= <>
##$D= (0..31)
0 1.2 0 0 0 0 0 0 0 0.06 0 0.03 0 0 0 0 0.0002 0 0 0 0 0 0 0 0 0 0 0 0 
0 0 0 
##$DATE= 1690980311
##$DBL= (0..7)
120 120 120 120 120 120 120 120 
##$DBP= (0..7)
150 150 150 150 150 150 150 150 
##$DBP07= 0
##$DBPNAM0= <>
##$DBPNAM1= <>
##$DBPNAM2= <>
##$DBPNAM3= <>
##$DBPNAM4= <>
##$DBPNAM5= <>
##$DBPNAM6= <>
##$DBPNAM7= <>
##$DBPOAL= (0..7)
0.5 0.5 0.5 0.5 0.5 0.5 0.5 0.5 
##$DBPOFFS= (0..7)
0 0 0 0 0 0 0 0 
##$DE= 6
##$DECBNUC= <off>
##$DECIM= 32
##$DECNUC= <off>
##$DECSTAT= 4
##$DIGMOD= 1
##$DIGTYP= 9
##$DL= (0..7)
0 120 120 120 120 120 120 120 
##$DP= (0..7)
150 150 150 150 150 150 150 150 
##$DP07= 0
##$DPNAME0= <>
##$DPNAME1= <>
##$DPNAME2= <>
##$DPNAME3= <>
##$DPNAME4= <>
##$DPNAME5= <>
##$DPNAME6= <>
##$DPNAME7= <>
##$DPOAL= (0..7)
0.5 0.5 0.5 0.5 0.5 0.5 0.5 0.5 
##$DPOFFS= (0..7)
0 0 0 0 0 0 0 0 
##$DQDMODE= 0
##$DR= 18
##$DS= 0
##$DSLIST= <SSSSSSSSSSSSSSS>
$$ [...]
##$SUBNAM2= <"">
##$SUBNAM3= <"">
##$SUBNAM4= <"">
##$SUBNAM5= <"">
##$SUBNAM6= <"">
##$SUBNAM7= <"">
##$SUBNAM8= <"">
##$SUBNAM9= <"">
##$SW= 18.05172834244
##$SWIBOX= (0..15)
0 0 2 0 0 0 0 0 0 0 0 0 0 0 0 0 
##$SW_h= 3612.71676300578
##$TD= 16384
##$TD0= 1
##$TE= 0
##$TE2= 300
##$TE3= 300
##$TEG= 300
##$TL= (0..7)
0 120 120 120 120 120 120 120 
##$TP= (0..7)
150 150 150 150 150 150 150 150 
##$TP07= 0
##$TPNAME0= <>
##$TPNAME1= <>
##$TPNAME2= <>
##$TPNAME3= <>
##$TPNAME4= <>
##$TPNAME5= <>
##$TPNAME6= <>
##$TPNAME7= <>
##$TPOAL= (0..7)
0.5 0.5 0.5 0.5 0.5 0.5 0.5 0.5 
##$TPOFFS= (0..7)
0 0 0 0 0 0 0 0 
##$TUNHIN= 0
##$TUNHOUT= 0
##$TUNXOUT= 0
##$USERA1= <user>
##$USERA2= <user>
##$USERA3= <user>
##$USERA4= <user>
##$USERA5= <user>
##$V9= 5
##$VALIST= <valist>
##$VCLIST= <CCCCCCCCCCCCCCC>
##$VD= 0
##$VDLIST= <DDDDDDDDDDDDDDD>
##$VPLIST= <PPPPPPPPPPPPPPP>
##$VTLIST= <TTTTTTTTTTTTTTT>
##$WBST= 1024
##$WBSW= 4
##$XGAIN= (0..3)
0 0 0 0 
##$XL= 0
##$YL= 0
##$YMAX_a= 316031
##$YMIN_a= -307250
##$ZGOPTNS= <>
##$ZL1= 120
##$ZL2= 120
##$ZL3= 120
##$ZL4= 120
##$ABSF1= 10
##$ABSF2= 0
##$ABSG= 5
##$ABSL= 3
##$ALPHA= 0
##$AQORDER= 0
##$ASSFAC= 0
##$ASSFACI= 0
##$ASSFACX= 0
##$ASSWID= 0
##$AUNMP= <proc_1d>
##$AZFE= 0.1
##$AZFW= 0.1
##$BCFW= 1
##$BC_mod= 2
##$BYTORDP= 1
##$COROFFS= 0
##$CY= 11.3945322036743
##$DATMOD= 1
##$DC= 2
##$DFILT= <>
##$DTYPP= 0
##$F1P= 15.7292609196834
##$F2P= 12.9074282941183
##$FCOR= 0.5
##$FTSIZE= 0
##$FT_mod= 4
##$GAMMA= 1
##$GB= 0.15
##$INTBC= 1
##$INTSCL= 1
##$ISEN= 128
##$LB= 0.24
##$LEV0= 0
##$LPBIN= 0
##$MAXI= 10000
##$MC2= 0
##$MEAN= 0
##$ME_mod= 0
##$MI= 1.114404
##$NCOEF= 0
##$NC_proc= 0
##$NLEV= 6
##$NOISF1= 3.799351
##$NOISF2= 2.8
##$NSP= 1
##$NTH_PI= 0
##$NZP= 0
##$OFFSET= 15.70392
##$PC= 1
##$PHC0= -21038.17
##$PHC1= 10.85272
##$PH_mod= 1
##$PKNL= yes
##$PPARMOD= 0
##$PSCAL= 0
##$PSIGN= 0
##$REVERSE= no
##$SF= 200.130013532006
##$SI= 16384
##$SIGF1= 3
##$SIGF2= 2
##$SINO= 400
##$SIOLD= 16384
##$SREGLST= <1H.CDCl3>
##$SSB= 0
##$STSI= 0
##$STSR= 0
##$SW_p= 3612.71676300578
##$SYMM= 0
##$S_DEV= 0
##$TDeff= 0
##$TDoff= 0
##$TI= <>
##$TILT= no
##$TM1= 0
##$TM2= 0
##$TOPLEV= 0
##$USERP1= <user>
##$USERP2= <user>
##$USERP3= <user>
##$USERP4= <user>
##$USERP5= <user>
##$WDW= 1
##$XDIM= 8192
##$YMAX_p= 0
##$YMIN_p= 0
$$ End of Bruker specific parameters
$$ ---------------------------------
##NTUPLES= NMR FID
##VAR_NAME=  TIME,          FID/REAL,        FID/IMAG
##SYMBOL=    X,             R,               I
##VAR_TYPE=  INDEPENDENT,   DEPENDENT,       DEPENDENT
##VAR_FORM=  AFFN,          ASDF,            ASDF
##VAR_DIM=   8192,          8192,            8192
##UNITS=     SECONDS,       ARBITRARY UNITS, ARBITRARY UNITS
##FACTOR=    0.0002768,     1,               1
##FIRST=     0,             0,               0
##LAST=      2.2672688,     0,               0
##MIN=       0,             -307250,         0
##MAX=       2.2672688,     316031,          0
$$ Real data points
##PAGE= N=1
##DATA TABLE= (X++(R..R)), XYDATA
$$ plain form
0 0 0 0 0 0 0 0 0 0 0 0 8 -8 8 -8 8 -14 16 -16 24 -30 32 -40 48 -56 64 -79 88 -104 120 -136 158 -178 201
33 201 -230 260 -291 326 -366 410 -455 508 -564 625 -693 767 -846 933 -1029 1134 -1247 1375
51 1375 -1515 1671 -1845 2037 -2258 2508 -2797 3132 -3528 4009 -4602 5351 -6337 7702 -9713
66 -9713 12987 -19230 35416 -168432 -307250 128235 279899 84529 -208057 -167452 94346
77 94346 195346 -51203 -216129 -49986 211069 181698 -103501 -280807 -67333 233736
87 233736 193381 -103456 -214640 -31761 176252 108070 -139863 -177925 77835 216711 28699
98 28699 -203135 -162086 90573 220378 37755 -188611 -130320 96447 155798 -10369 -161576
109 -161576 -70533 146125 147122 -87911 -192597 -21543 170755 131607 -85352 -183524 -12404
$$ packed form
0@%%%%%%%%%%Qj6J6j6J6k2L0l2M0n4O2p2Q8j04J20j43J67j92K24k56K94l36L79
33B01m31M90n51O17o92P76q65R63j072J189j318J460j613J779j962K163k381K622
51A375k890L186l516L882m295M766n305N929o660P537q611R953j1688J4039j7415
66i713K2700l2217N4646k03848j38818M35485J51664j95370k92586M0605K61798
77I4346J01000k46549j64926J66143K61055k9371k85199j77306K13474L01069
87B33736m0355k96837j11184J82879K08013o8182k47933l8062K55760J38876j88012
98B8699k31834M1049K52659J29805j82623k26366N8291K26767N9351j66167j51207
109a61576R1043K16658R97k35033j04686J71054J92298l9148k16959r8172J71120
$$ plain form
120 -12404 166110 80349 -114167 -126049 41524 147785 35021 -145432 -117247 81786 152551
131 152551 8770 -141354 -101729 79286 142808 -16963 -148029 -46621 114995 99359
141 99359 -59099 -138650 -18720 137642 92401 -85381 -129273 7181 123007 65340 -85437
152 -85437 -108260 35810 121173 20967 -104961 -80833 56353 120719 7993 -125244 -71041
163 -71041 84516 104130 -25033 -110245 -37614 89699 83344 -50833 -105510 -4053 99177
174 99177 64258 -58974 -101048 7052 107969 46868 -75964 -78085 30126 94275 24234
185 24234 -86109 -68509 56875 95498 -7746 -94703 -46633 65160 81792 -23327 -91975
196 -91975 -23353 71359 57835 -35964 -81295 -10165 81850 51366 -58346 -78173 15841 82434
$$ packed form
120a2404J78514q5761j94516j1882J67573J06261j12764j80453K8185J99033P0765
131A52551j43781j50124L9625J81015O3522j59771j31066J01408J61616j5636
141I9359j58458p9551J19930J56362m5241j77782m3892J36454J15826n7667j50777
152h5437k2823J44070Q5363j00206j25928K4128J37186O4366j12726j33237N4203
163g1041J55557J9614j29163q5212P2631J27313o355j34177n4677J01457J03230
174I9177l4919j23232m2074J08100J00917o1101j22832k121J08211O4149p0041
185B4234j10343J7600J25384L8623j03244q6957M8070J11793J6632j05119o8648
196i1975O8622R4712j3524r3799m5331P1130R2015l0484j09712j9827R4014O6593
$$ plain form
208 82434 32448 -62570 -66002 31596 81258 8696 -71720 -44938 45780 72020 -7320 -78083
220 -78083 -31893 58104 58240 -22527 -68926 -20801 57864 52067 -36252 -71169 1089 67650 33941
233 33941 -49038 -61937 16545 70905 18624 -56824 -44969 28966 61327 7625 -58194 -36227
245 -36227 43629 57014 -11493 -58388 -22082 45760 50923 -19238 -61709 -11013 54286 37296
257 37296 -32668 -55692 2904 58361 24439 -45627 -45097 18471 51416 14118 -43350 -39482 25299
270 25299 53666 1760 -48345 -25057 34380 47271 -7298 -51034 -16305 44495 38871 -19761
282 -19761 -47391 -6376 45616 31349 -31546 -44249 9549 44104 15518 -32925 -36930 12191
294 12191 45918 10218 -40258 -29854 22823 42422 1564 -42199 -21743 33975 37796 -12189
$$ packed form
208H2434m9986r5018l432R7598M9662p2562q0416K6782R0718K6240p9340p0763
220g8083M6190Q9997J36q0767m6399M8125P8665n797q8319l4917P2258O6561l3709
233C3941q2979j2899P8482N4360n2281p5448J1855P3935L2361n3702o5819K1967
245c6227P9856J3385o8507m6895L6306O7842N163p0161m2471N0696O5299j6990
257C7296o9964k3024N8596N5457l3922p0066N30O3568L2945l7298n7468L868O4781
270B5299K8367n1906n0105K3288N9437J2891n4569m3736L4729O0800n624n8632
282a9761k7630M1015N1992j4267o2895j2703N3798L4555k8586m8443m005M9121
294A2191L3727l5700n0476J0404N2677J9599m0858m3763K0456N5718L821m9985
$$ plain form
306 -12189 -38944 -9612 34567 33031 -17076 -40642 165 39865 19894 -24689 -32549 4922
318 4922 37550 14998 -31107 -30246 14283 36490 6718 -34382 -26509 22868 36558 -6031 -35599
331 -35599 -11758 25830 28259 -8300 -34208 -7356 32559 24045 -17127 -29970 448 31938
343 31938 19049 -22446 -28273 8977 31438 9299 -25015 -25079 12954 33581 1191 -32738 -15387
356 -15387 20265 24347 -4586 -28342 -11899 23280 22950 -11331 -27210 -4371 25377 20517 -15568
369 -15568 -27894 4425 28985 11034 -18928 -20907 6698 28225 8024 -25352 -18070 16180
381 16180 23711 -1301 -23372 -13575 16645 21902 -6656 -24589 -7522 17921 18632 -8783 -26413
394 -26413 -2727 25575 12702 -16863 -19109 3813 22200 10679 -17600 -18844 10245 22748
$$ packed form
306a2189k6755K9332M4179j536n0107k3566M0807L9700j9971m4583p860L7471
318D922L2628k2552m6105Q61M4529K2207k9772m1100P873M9377J3690m2589k9568
331c5599K3841L7588K429l6559k5908K6852L9915q514m1172j2843L0418L1490
343C1938j2889m1495n827L7250K2461k2139l4314o4L8033K0627l2390l3929J7351
356a5387L5652M082k8933k3756J6443L5179l30l4281j5879K2839K9748m860l6085
369a5568j2326L2319K4560j7951k9962j979K7605K1527k0201l3376P282L4250
381A6180P531k5012k2071R797L0220N257k8558j7933J7067K5443P11k7415j7630
394b6413K3686K8302j2873k9565k246K2922J8387j1521k8279j244K9089J2503
$$ plain form
406 22748 2855 -18742 -14069 11949 21612 -1863 -22129 -8449 14466 16009 -3859 -21554 -8822
419 -8822 19043 15143 -14164 -20108 1127 17167 9259 -13292 -18858 3975 19764 4709 -15106
432 -15106 -13995 6069 19493 3286 -19470 -10991 13218 14589 -2886 -15868 -9776 12390 16436
445 16436 -8255 -20394 -1923 14860 8545 -10320 -17576 -245 16388 5449 -13939 -13681 1861
458 1861 14097 6734 -15188 -14751 9444 15852 -1988 -13461 -7172 8184 14580 -1812 -17129
471 -17129 -4285 13949 10090 -6251 -14217 -2878 14541 8755 -11621 -12786 2336 10730 6117
484 6117 -8822 -15304 2831 16083 1290 -13957 -7746 6374 11049 848 -13360 -6691 10830
497 10830 10161 -3930 -10789 -4239 10519 12014 -6908 -14000 1761 11341 5087 -5773 -11337 -1741
$$ packed form
406B2748j9893k1597M673K6018R663k3475k0266J3680K2915J543j9868j7695J2732
419h822K7865l900k9307n944K1235J6040p908k2551n566K2833J5789j5055j9815
432a5106J111K0064J3424j6207k2756Q479K4209J371j7475j2982O092K2166M046
445A6436k4691j2139J8471J6783o315j8865p256J7331J6633j0939j9388K58J5542
458A861J2236p363k1922M37K4195O408j7840j1473O289J5356O396j6392j5317
471a7129J2844J8234l859j6341p966J1339J7419n786k0376j165J5122Q394m613
484F117j4939o482J8135J3252j4793j5247O211J4120M675j0201j4208O669J7521
497A0830o69j4091o859O550J4758J495j8922p092J5761R580o254j0860n564R596
$$ plain form
511 -1741 12873 5696 -12409 -9697 4417 9256 1029 -10635 -8665 6921 9725 -3616 -10013 -4025
525 -4025 5724 10260 -1620 -13575 -2450 12217 6373 -5200 -7880 -1698 9385 7836 -6980
538 -6980 -9869 3170 9116 2562 -7222 -8334 3775 10359 -1393 -10287 -3426 4712 6500 379
552 379 -9921 -6121 8998 8596 -5049 -8596 -985 7014 7233 -3492 -9140 1124 8852 3726 -4394
567 -4394 -6404 1533 9368 2490 -9100 -4524 5694 5916 155 -6646 -6356 4527 8687 -2685 -9783
582 -9783 -3062 5461 5988 -2697 -8934 -1530 7480 3420 -4182 -5533 -198 6533 4662 -6131 -6551
597 -6551 4387 7213 -66 -5418 -4066 2668 7606 460 -7769 -4043 4530 5540 -1188 -7760 -3384
612 -3384 5960 4147 -4179 -5320 -140 3938 3639 -3181 -6458 1074 7378 1527 -5205 -3806 2942
$$ packed form
511a741J4614p177j8105K712J4114M839q227j1664J970J5586K804j3341o397N988
525d025R749M536j1880j1955J1125J4667n844j1573k680O182J1083j549j4816
538f980k889J3039N946o554r784j112J2109O584j1752q894O861Q138J788o121
552C79j0300L800J5119m02j3645l547P611P999K19j0725n648J0264P728n126q120
567d394k010P937P835o878j1590M576J0218K22n761o801K90J0883M160j1372p098
582i783O721Q523N27q685o237P404R010m060p602j351N335O731j871j0793m20
597f551J0938K826p279n352J352O734M938p146q229L726Q573J010o728o572M376
612c384R344j813q326j141N180M078k99o820l277P532O304n851o732J399O748
$$ plain form
627 2942 6689 1663 -5212 -3237 3828 5817 1002 -5069 -3602 5056 5959 -2308 -5577 4 4002
642 4002 2974 -1740 -5126 -770 5022 2649 -4085 -4469 1129 5738 1996 -4693 -3608 3346 4972
657 4972 758 -2958 -3159 2916 6248 371 -5143 -824 4338 3616 -1226 -3835 -802 4313 2574 -2691
673 -2691 -3813 -160 4008 2807 -3877 -5153 1571 4540 259 -3341 -2968 973 4643 1352 -4352
688 -4352 -2227 3302 3623 -53 -3587 -1260 4255 3295 -1634 -2858 -33 2899 3244 -1446 -4670 58
704 58 4911 1126 -3485 -2654 388 2966 1081 -3176 -2978 1871 2882 163 -2896 -2506 2478 3953
720 3953 -1069 -3481 411 2711 2057 -2 -2820 -1175 4007 2723 -2610 -2630 899 3039 1691 -2695
736 -2695 -2936 1465 2978 -245 -2074 -2374 240 3253 136 -4489 -1176 2900 1221 -1058 -2021 -1361
$$ packed form
627B942L747n026o875J975P065J989m815o071J467Q658R03q267l269N581L998
642D002j028m714l386M356N792k373o734l84N598M609l742o689J085O954J626
657D972m214l716k01O075L332n877n514M319N162p22m842k609L033N115j739n265
673b691j122L653M168j201o684j276O724K969m281l600L73L941L670l291n704
688d352K125N529L21l676l534K327N515r60m929j224K825K932L45m690l224M728
704E8M853l785m611Q31L042K578j885m257J98M849J011k719l059L90M984J475
720C953n022k412L892K300o54k059k818J645N182j284n333k0L529K140j348m386
736b695k41M401J513l223j829l00K614L013l117m625L313M076j679k279r63O60
$$ plain form
752 -1361 1956 2973 -1276 -2861 437 2524 1920 -1262 -2566 835 3354 150 -2064 -946 327
767 327 1972 1476 -2889 -2833 1807 2299 -1337 -2320 -1269 1061 2123 -1128 -2861 -469 1845 1534 -446
784 -446 -2500 -539 3347 1505 -2415 -1017 1302 1273 1009 -649 -2491 627 2787 -59 -2498 -981
800 -981 723 1713 -333 -3083 -872 1548 410 -949 -1574 -1729 1277 2116 -2047 -2577 1094 1461 68
817 68 -637 -1592 77 2553 807 -1630 -868 837 1945 677 -2135 -1436 1887 1151 -1246 -1438 -919
834 -919 -152 1782 -382 -3365 -391 1801 -126 -1485 -1480 -512 1180 505 -1518 -817 488 811 1126 -1221
852 -1221 -1771 1244 2466 -770 -1544 568 754 853 354 -1663 -1242 1688 822 -1403 -1545 -644 960 675
870 675 -1805 -1844 432 436 -67 -369 -1875 -433 2050 333 -2236 -122 1590 601 480 -789 -671 1297
$$ packed form
752a361L317J017m249j585L298K087o04l182j304L401K519l204k214J118J273
767C27J645m96m365N6M640M92l636r83J051K330J062l251j733K392K314l11j980
784d46k054J961L886j842l920J398K319k9k64j658j842L118K160k846k439J517
800i81J704R90k046k750K211K420j138j359o25j55L006Q39m163n30L671L67j393
817F8p05r55J669K476j746k437P62J705J108j268k812O99L323p36k397j92N19
834i19P67J934k164k983K974K192j927j359NR68J692o75k023P01J305L23L15k347
852a221n50L015J222l236p74K112J86R9m99k017M21K930q66k225j42R01J604k85
870F75k480l9K276Mn03l02j506J442K483j717k569K114J712r89j21j269J18J968
$$ plain form
888 1297 1441 -749 -1130 -312 618 1587 -663 -2093 249 1677 -854 -719 -667 -1267 866 714 -1991 -1759
906 -1759 783 496 -588 -961 -982 484 1140 -191 -900 24 612 1091 751 -1320 -751 2419 734 -1159
924 -1159 -31 87 380 909 -301 -1517 418 992 -111 -1013 -919 -92 1305 -325 -1785 -168 637
941 637 -283 278 -245 -1406 933 1589 -642 -934 997 456 632 452 -860 264 1262 392 -605 -330
959 -330 70 795 631 -1817 -973 1092 196 -923 -154 -981 -789 1041 135 -1453 -67 549 -25 -218
977 -218 -568 -221 786 307 -766 -16 477 335 1024 -360 -1114 1098 1417 -622 -671 177 -419 523 628
996 628 -928 -916 367 376 -41 -313 -484 496 740 -718 -468 843 224 585 459 -764 -202 1863 836
1015 836 -1035 -52 671 795 740 282 -312 542 630 67 -145 -297 241 801 -204 -1123 302 616 -341 -411
$$ packed form
888A297J44k190l81Q18R30R69k250j430K342J428k531J35N2o00K133j52k705K32
906a759K542k87j084l73k1J466O56j331p09R24N88M79l40k071N69L170j685j893
924a159J128J18K93N29j210j216J935N74j103r02R4Q27J397j630j460J617Q05
941F37r20N61n23j161K339O56k231k92J931n41J76j80j312J124R98q70r97K75
959c30M00P25j64k448Q44K065q96j119P69q27J92J830r06j588J386O16n74j93
977b18l50L47J007m79j073P50M93j42O89j384p54K212L19k039m9Q48n96R42J05
996F28j556J2J283Rm17k72j71R80K44j458K50J311o19L61j26j223N62K065j027
1015H36j871R83P23J24n5m58n94Q54Q8n63k12j52N38N60j005r19J425L14r57p0
$$ plain form
1035 -411 -126 -270 471 879 -314 -541 638 977 389 -182 -186 405 514 84 10 -34 175 596 354 -571 10
1056 10 856 351 -865 -356 177 162 216 -441 -873 -252 626 609 -360 -704 -38 655 273 -114 -29 45 405 581
1078 581 63 -136 364 742 -38 -547 389 835 193 -359 -309 -201 244 367 39 -727 -492 857 249 -763
1098 -763 -336 222 -11 115 -53 -47 54 546 12 -113 56 826 743 -378 -308 598 620 285 308 -378 -654 361
1120 361 663 -712 -578 -225 95 -124 -255 -247 -16 20 -558 -108 292 -66 260 -104 -1040 83 1057 136
1140 136 -196 237 0 8 809 59 -275 -45 204 255 -46 -175 -75 370 -204 -514 158 -20 -442 222 -436
1161 -436 -862 256 393 -484 -595 -130 -139 317 139 -345 20 -8 197 242 -49 -97 641 404 -727 26 789
1182 789 -418 -91 266 -592 -89 752 -346 -842 -278 -86 91 287 -431 -394 291 -265 -241 298 -312 -92
$$ packed form
1035d11K85j44P41M08j193k27J179L39n88n71mN91J09m30p4m4K09M21k42r25N81
1056A0Q46n05j216N09N33j5N4o57m32O21Q78j7r69l44O66O93l82l87Q5P4L60J76
1078E81n18j99N00L78p80n09R36M46o42n52N0J08M45J23l28p66K35J349o08j012
1098g63M27N58k33J26j68OJ01M92n34j25J69P70q3j121P0R06K2l35K3o86k76J015
1120C61L02j375J34L53L20k19j31QK31L6n78M50M00l58L26l64r36J123R74r21
1140A36l32M33k37QQ01p50l34K30K49N1l01j29J00M45n74l10O72j78m22O64o58
1161d36m26J118J37q77j11M65rM56j78m84L65k8K05M5k91m8P38k37j131P53P63
1182G89j207L27L57q58N03Q41j098m96N64J92J77J96p18L7O85n56K4N39o10K20
$$ plain form
1202 -92 600 -387 -633 521 329 -356 99 149 -184 677 424 -414 20 366 152 215 -361 -635 433 132
1222 132 -626 14 7 -733 68 253 -647 -67 560 -320 -317 253 -96 -62 240 -174 -46 223 264 348 377 -270 -294
1245 -294 903 -407 -888 183 -292 -204 249 -304 -693 250 -37 -463 -225 -28 -331 -80 -274 -37 206
1264 206 -261 -323 291 -63 -455 488 390 -653 81 602 -61 -140 348 39 10 218 100 -299 -121 -142 14
1285 14 -240 -510 74 319 -528 -195 301 -244 -305 611 -126 -263 256 333 -197 -14 26 159 175 250 -175 315
1307 315 65 101 437 -410 -282 471 91 -348 161 -162 -435 -50 343 -634 17 145 -154 -87 -40 34 102 -81
1329 -81 -371 305 137 -282 245 278 -132 -20 677 200 -228 373 101 -42 32 -90 -297 140 49 -415 78
1350 78 -307 -92 116 -578 -52 345 -283 -421 243 77 -502 262 498 -434 -55 323 58 -113 48 -1 208
$$ packed form
1202i2O92r87k46J154j92o85M55N0l33Q61k53q38M34L46k14O3n76k74J068l01
1222A32p58O40pp40Q01J85r00N80O27q80LN70l49L4L02m14J28K69M1Q4K9o47k4
1245b94J197j310m81J071m75Q8M53n53l89R43k87m26K38J97l03K51j94K37K43
1264B06m67o2O14l54l92R43r8j043P34N21o63p9M88l09k9K08j18l99J78k1J56
1285A4k54k70N84K45q47L33M96n45o1R16p37j37N19P7n30J83M0J33J6P5m25M90
1307C15k50L6L36q47J28P53l80m39N09l23k73L85L93r77O51J28k99O7M7P4O8j83
1329h1k90O76j68m19N27L3m10J12O97m77m28O01k72j43P4j22k07M37r1m64M93
1350G8l85K15K08o94N26L97o28j38O64j66n79P64K36r32L79L78k65j71J61m9K09
$$ plain form
1371 208 446 -23 176 17 -279 122 73 -542 265 464 -384 -547 254 -192 -70 235 -329 -215 28 58 -6
1392 -6 244 41 148 513 -220 97 303 6 58 574 -1 -2 707 308 -159 213 193 13 -20 -90 -185 17 14 -426
1416 -426 -70 -101 -341 419 150 -430 -45 361 -105 -33 352 -159 -133 502 67 -31 126 82 447 178 121 -1
1438 -1 290 128 -50 252 -169 138 382 -476 -262 204 -24 -453 -36 -230 -259 33 -170 -4 -132 155 263
1459 263 -102 15 213 275 109 -14 146 -96 -119 254 225 -317 288 158 -337 -52 66 -8 -80 -6 -214 117
1481 117 -62 -131 298 79 -412 55 206 -116 103 348 12 188 137 -94 -64 282 172 26 71 245 174 -411
1503 -411 -340 73 131 -197 188 144 -207 72 231 -87 -374 -93 -71 -338 -50 94 93 82 -281 12 -107 -2
1525 -2 124 145 -83 -139 637 370 -34 72 -120 -268 288 210 -168 -57 86 -335 -293 -119 45 191 -316 -305
$$ packed form
1371B08K38m69J99j59k96M01m9o15Q07J99q48j63Q01m46J22L05n64J14K43L0o4
1392fK50k03J07L65p33L17K06k97N2N16n75jP09l99m67L72k0j80l3p0r5K02lm40
1416d26L56l1k40P60k69n80L85M06m66P2L85n11K6O35m35r8J57m4L65k69n7j22
1438aK91j62j78L02m21L07K44q58K14M66k28m29M17j94k9K92k03J66j28K87J08
1459B63l65J17J98O2j66j23J60k42k3L73k9n42O05j30m95K85J18p4p2P4k08L31
1481A17j79o9M29k19m91M67J51l22K19K45l36J76n1k31L0L46j10j46M5J74p1n85
1503d11P1M13N8l28L85m4l51K79J59l18k87K81K2k67K88J44jj1l63K93j19J05
1525bJ26K1k28n6P76k67m04J06j92j48N56p8l78J11J43m21M2J74J64J46n07J1
$$ plain form
1547 -305 -35 4 -331 147 -83 -192 75 561 83 68 343 -247 33 416 303 92 76 -7 342 149 -113
1568 -113 135 177 -192 -129 322 -279 -509 237 -233 -341 194 -110 -293 -13 -79 -143 34 40 -239 -38 -208 -79
1590 -79 190 -23 -150 211 187 -380 333 178 -297 54 39 -182 59 398 36 -128 -349 -268 62 -5 -360 -109
1612 -109 27 -456 -182 241 -381 -501 303 -457 85 516 -84 -296 289 17 -157 222 -273 -254 64 296
1632 296 -38 140 6 -219 268 -17 -295 139 -23 -409 -164 271 -320 -220 239 -368 -52 253 -106 -99 187
1653 187 -262 87 144 -283 -1 17 -365 134 535 -264 -102 352 -178 -449 87 246 -57 61 -121 -346 -85
1674 -85 -175 4 -109 164 -151 -6 166 -249 468 -67 -237 166 102 -265 193 402 -215 -66 5 196 -176
1695 -176 131 -37 -168 -118 2 -78 115 -200 -255 124 -291 -438 120 -372 -241 181 -233 -42 187 -238 -93
$$ packed form
1547c05K70L9l35M78k30j09K67M86m78j5K75n90K80L83j13k11j6q3L49j93k62
1568a13K48M2l69O3M51o01k30P46m70j08N35l04j83K80o6o4J77Ok79K01j70J29
1590g9K69k13j27L61k4n67P13j55m75L51j5k21K41L39l62j64k21Q1L30o7l55K51
1612a09J36m83K74M23o22j20Q04p60N42M31o00k12N85k72j74L79m95J9L18K32
1632B96l34J78j34k25M87k85k78M34j62l86K45M35n91J00M59o07L16L05l59PK86
1653A87m49L49N7m27K82J8l82M99M01p99J62M54n30k71N36J59l03J18j82k25K61
1674h5r0J79j13K73l15J45J72m15P17n35j70M03o4l67M58K09o17J49P1J91l72
1695a76L07j68j31N0J20q0J93l15n5L79m15j47N58m92J31M22m14J91K29m25J45
$$ plain form
1716 -93 273 357 -367 202 39 -105 208 78 24 209 18 -190 152 279 -458 -96 -48 -158 7 41 -122 -306
1738 -306 24 -305 97 -168 -319 -61 -44 -224 -106 358 -202 109 198 -442 -43 394 -62 11 323 320 159 77
1760 77 88 -197 119 130 -62 116 217 -68 -179 -78 -139 12 34 -41 199 418 -282 20 183 70 -26 110
1782 110 -50 -226 169 135 144 81 -44 133 99 -16 51 114 -204 -49 160 -359 -53 268 -33 37 80 47 -212
1805 -212 184 15 -72 -190 145 112 241 168 -137 151 52 -67 202 -88 69 335 -7 58 36 102 -64 108
1827 108 129 75 -28 2 -226 371 -41 -263 128 -14 -344 85 106 -62 59 149 -55 -190 185 -93 103 200
1849 200 240 345 265 60 124 69 -83 228 164 55 47 230 -42 -243 -64 316 -24 341 -154 22 -191 11
1871 11 147 -282 -61 169 165 305 133 68 29 244 142 76 -118 -76 185 -320 150 106 -147 24 9 66 38 70
$$ packed form
1716i3L66Q4p24N69j63j44L13j30n4J85j91k08L42J27p37L62M8j10J65L4j63j84
1738c06L30l29M02k65j51K58J7j80J18M64n60L11Q9o40L99M37m56P3L12lj61q2
1760G7J1k85L16J1j92J78J01k85j11J01o1J51K2p5K40K19p00L02J63j13r6J36
1782A10j60j76L95l4Ro3j25J77l4j15O7O3l18J55K09n19L06L21l01P0M3l3k59
1805b12L96j69q7j18L35l3J29p3l05K88r9j19K69k90J57K66l42O5k2O6j66J72
1827A08K1n4j03L0k28N97m12k22L91j42l30M29K1j68J21R0k04j35L75k78J96R7
1849B00M0J05q0k05O4n5j52L11o4j09qJ83k72k01J79L80l40L65m95J76k13K02
1871A1J36m29K21K30mJ40j72o5l9K15j02o6j94M2K61n05M70m4k53J71j5N7k8L2
$$ plain form
1895 70 81 -214 -163 -41 323 -29 -73 -15 -71 -506 -232 107 1 114 184 302 198 6 -38 -133 14 152 -23
1918 -23 4 -176 -50 134 -337 47 119 -280 -197 2 -81 -200 141 -147 -194 -115 -142 -31 25 178 -32 295 -16
1941 -16 -71 140 -103 148 151 246 21 215 -56 -284 -20 70 35 -109 27 -111 -122 -137 -35 63 -163 -361 72
1964 72 -143 -132 17 -39 -194 -41 -44 -204 -19 161 -42 -37 159 -100 75 -265 -3 -25 89 -45 237 81 -236
1987 -236 -370 15 -296 -198 19 26 -256 -99 12 -124 -130 8 -92 201 253 -102 135 -41 -167 -47 -63 -125 348
2010 348 8 -181 93 255 -146 -86 321 -90 37 -25 -4 295 -3 -39 197 -56 -205 -171 -53 6 -24 445
2032 445 19 -122 -122 -35 -23 96 -71 -219 34 116 -270 -84 119 263 -34 20 102 506 -17 -143 161 -290
2054 -290 -241 200 163 -214 -43 65 -161 -128 -2 -345 54 231 42 -140 80 89 -84 -96 -137 68 6 -8 5
$$ packed form
1895G0J1k95N1J22L64l52m4N8n6m35K74L39j06J13P0J18j04j92m4r5J47J38j75
1918b3K7j80J26J84m71L84P2l99Q3J99q3j19L41k88m7P9k7J11N6J53k10L27l11
1941a6n5K11k43K51LR5k25J94k71k28K64R0l5j44J36j38j1j5J02R8k26j98M33
1964G2k15J1J49n6j55J53lj60J85J80k03NJ96k59J75l40K62k2J14j34K82j56l17
1987b36j34L85l11R8K17Pk82J57J11j36oJ38j00K93N2l55K37j76j26J20j6o2M73
2010C48l40j89K74J62m01O0M07m11J27o2K1K99k98l6K36k53j49L4J18N9l0M69
2032D45m26j41%Q7J2J19j67j48K53Q2l86J86K03J44k97N4Q2M04n23j26L04m51
2054b90M9M41l7l77J71J08k26L3J26l43L99J77j89j82K20Rj73j2m1K05o2j4J3
$$ plain form
2077 5 39 -150 -219 185 27 -29 113 34 -134 229 123 -359 -4 -134 40 276 59 -91 11 -223 148 -6
2099 -6 211 78 213 117 -121 80 34 -294 81 -11 -56 -29 154 87 492 174 -88 161 70 -182 -263 160 6
2122 6 -198 -123 -56 -204 276 36 174 10 -108 -203 105 206 185 89 2 46 -29 115 85 18 -7 -113 136 16
2146 16 -184 28 -121 -122 77 -25 -160 -34 -19 -185 -29 -130 113 -67 96 106 -36 63 -117 -276 4 -39
2168 -39 58 233 50 -60 -54 3 -109 142 130 40 188 80 -112 113 -32 -160 -7 137 -21 103 -66 24 212
2191 212 -6 -130 13 78 99 -285 14 224 90 158 137 44 -8 -76 91 62 91 162 107 2 87 8 157 13
2215 13 78 96 -28 -12 -39 -300 -73 104 -355 -73 67 20 -99 62 102 184 6 198 85 -247 -87 393 49
2238 49 -131 13 52 74 302 -12 78 50 23 -181 52 -339 -98 36 -10 -45 86 38 -184 67 -94 41 -106
$$ packed form
2077EL4j89o9M04j58n6J42p9j68L63j06m82L55j30J74K36k17j50J02k34L71j54
2099fK17j33J35r6k38K01m6l28L75r2m5K7J83o7M05l18k62K49r1k52q1M23j54
2122Fk04P5O7j48M80k40J38j64j18r5L08J01k1r6q7M4p5J44l0o7k5j06K49j20
2146A6k00K12j49jJ99j02j35J26J5j66J56j01K43j80J63J0j42R9j80j59K80m3
2168c9R7J75j83j10ON7j12K51j2r0J48j08j92K25j45j28J53J44j58J24j69R0J88
2191B12k18j24J43O5K1l84K99K10j34O8k1r3n2o8J67k9K9P1n5j05Q5p9J49j44
2215A3O5J8j24J6k7k61K27J77m59K82J40m7j19J61M0Q2j78J92j13l32J60M80l44
2238D9j80J44L9K2K28l14R0k8k7k04K33l91K41J34m6l5J31m8k22K51j61J35j47
$$ plain form
2261 -106 -13 54 -25 241 -86 -23 62 185 208 -60 -287 295 80 -73 -21 46 18 -67 197 -112 125 -126 -263
2284 -263 91 -50 -52 -28 210 -189 46 -60 -218 -150 75 -113 -362 -23 -83 67 -192 -43 140 -40 112 1
2306 1 0 143 36 72 28 -258 24 17 -26 103 54 -167 273 -45 -234 253 94 77 -8 -37 -84 -70 -25 69 -3 77
2332 77 -40 122 -122 -105 -42 99 -198 -161 -111 -68 -82 -30 61 -218 -82 -302 -160 -131 -67 161 -115 -84 -60 77
2356 77 142 -198 50 126 138 75 -246 -101 198 227 -193 67 4 -40 85 -271 -149 112 100 167 228 13 -84 86
2380 86 -63 40 4 18 -56 138 -57 -166 -20 138 -101 -118 -49 367 206 236 40 -36 -208 -165 104 70 -90
2403 -90 66 333 -117 -20 -46 -102 -250 39 -61 -237 106 66 71 -279 -18 85 5 -135 -218 -224 2 68 -142 -33
2427 -33 -135 -96 53 -5 4 102 -88 107 -26 -66 43 150 -312 -9 119 -100 100 -242 -140 -224 210 221 34
$$ packed form
2261a06R3O7p9K66l27O3Q5J23K3k68k27N82k15j53N2O7k8q5K64l09K37k51j37
2284b63L54j41kK4K38l99K35j06j58O8K25j88k49L39o0J50k59J49J83j80J52j11
2306AjJ43j07L6m4k86K82pm3J29m9k21M40l18j89M87j59j7q5k9m7J4M5R4p2Q0
2332G7j17J62k44J7O3J41k97L7N0M3j4N2R1k79J36k20J42K9O4K28k76L1K4J37
2356G7O5l40K48P6J2o3l21J45K99K9m20K60o3m4J25l56J22K61j2O7O1k15r7J70
2380H6j49J03l6J4p4J94j95j09J46J58k39j7O9M16j61L0j96p6j72M3K69l4j60
2403i0J56K67m50R7k6n6j48K89j00j76L43m0Nl50K61J03q0j40q3oK26O6k10J09
2427c3j02L9J49n8RR8j90J95j33m0J09J07m62L03J28k19K00l42J02q4M34J1j87
$$ plain form
2450 34 -36 -16 108 -234 -8 -93 146 483 -102 -104 144 -164 296 -183 12 277 97 -4 22 280 -125 -183 -227
2473 -227 -38 109 -143 -25 -111 -96 -1 -179 -7 75 -93 -14 -122 -2 -38 254 -210 -61 -124 103 119 78 109
2496 109 -233 -34 -21 235 -19 -178 202 171 -280 -79 -183 -104 260 -232 -86 51 -105 -75 -238 -39 -205
2517 -205 -207 -124 -91 23 101 -192 -7 139 -67 -32 80 170 -32 -144 -74 -22 -157 -72 54 -27 -149 -5 89 -227
2541 -227 -200 -110 -313 -90 -61 63 17 -163 -49 -107 25 -76 -235 -43 77 177 277 159 114 58 66 -28 28 74
2565 74 -180 -161 -66 -132 -33 -46 -16 -73 -189 130 128 79 -76 31 -111 -281 -84 -230 247 88 48 234 -48 -115
2589 -115 118 -13 81 -89 -128 39 30 -109 149 -38 -63 -84 186 268 190 -70 -9 -132 101 -92 -217 177 -115
2612 -115 -41 130 -29 116 79 81 119 147 -211 269 -131 -66 168 -129 -169 -156 -28 -178 -33 -7 -49 142 -67 -272
$$ packed form
2450C4p0K0J24l42K26q5K39L37n85kK48l08M60m79J95K65j80j01K6K58m05n8m4
2473b27J89J47k52J18q6J5R5j78J72Q2j68P9j08J20l6K92m64J49o3K27J6m1L1
2496A09l42J99J3K56k54j59L80l1m51K01j04P9L64m92J46J37j56L0j63J99j66
2517b05kQ3L3J14P8k93J85J46k06L5J12R0k02j12P0N2j35Q5J26q1j22J44R4l16
2541b27K7R0k03K23K9J24m6j80J14n8J32j01j59J92J20J00J00j18m5n6Qr4N6M6
2565G4k54J9R5o6R9j3L0n7j16L19km9j55J07j42j70J97j46M77j59m0J86k82o7
2589a15K33j31R4j70l9J67rj39K58j87k5k1K70Q2p8k60O1j23K33j93j25L94k92
2612a15P4J71j59J45l7KL8K8l58M80m00O5K34k97m0J3J28j50J45K6m2J91k09k05
$$ plain form
2636 -272 13 -175 -78 -54 -128 -76 -99 43 -103 -46 139 4 40 108 -160 135 -154 11 -263 -83 181 -40 -114
2659 -114 121 -82 171 -83 136 0 -66 -379 -134 -259 29 81 -51 155 -153 -191 -2 -40 90 123 -210 -3
2681 -3 -23 -29 -75 137 205 127 30 -23 -127 -43 54 -155 94 -179 98 -194 252 -22 -138 170 196 -101 -20 -73 -149
2706 -149 -38 -88 45 1 134 -66 59 1 -71 -134 184 74 -61 -46 -146 127 -5 -47 194 25 -49 238 -48
2729 -48 62 91 212 27 -157 -159 -10 -60 -251 9 187 -172 27 -4 -113 -56 -292 -83 17 150 62 181 41
2752 41 -87 -75 132 67 122 -123 -20 -40 -325 -109 -142 -218 -95 27 -123 -152 190 91 -39 135 57 -1 282 -43
2776 -43 -143 -184 -156 -109 207 -31 3 11 -170 -83 -166 -85 -87 13 -84 -23 62 -73 115 137 -98 -45 -362 -43 -191 30
2802 30 -149 122 -53 20 178 -25 68 232 -19 -157 77 -90 -21 -179 -108 -73 -99 -4 -77 -61 -91 109 -37 -301
$$ packed form
2636b72K85j88R7K4p4N2k3J42j46N7J85j35L6O8k68K95k89J65k74J80K64k21p4
2659a14K35k03K53k54K19j36o6l13K45j25K88N2j32K06l08l8J89l8J30L3l33K07
2681ck0om6K12O8p8r7n3j04Q4R7k09K49k73K77k92M46k74j16L08K6k97Q1n3p6
2706a49J11n0J33m4J33k00J25n8p2o3L18j10j35J5j00K73j32m2K41j69p4K87k86
2729d8J10K9J21j85j84kJ49n0j91K60J78l59J99l1j09N7k36K09J00J33q8J19j40
2752D1j28J2K07o5N5k45J03k0k85K16l3p6J23J22j50k9L42r9j30J74p8n8K83l25
2776d3j00m1K8M7L16k38L4Qj81Q7q3Q1kJ00r7O1Q5j35J88K2k35N3l17L19j48K21
2802C0j79K71j75P3J58k03R3J64k51j38K34j67O9j58P1L5k6R5p3J6l0K00j46k64
$$ plain form
2826 -301 14 -270 -172 -65 23 92 -99 4 68 -121 50 -158 37 51 50 158 -278 -214 152 -23 62 -95 73
2849 73 102 -36 9 50 166 -47 -109 -110 92 -109 74 -224 233 54 254 31 -64 -124 -86 -71 -170 15 250 251 -128
2874 -128 35 -22 -85 -218 -200 -150 211 133 -191 221 109 125 111 -117 141 13 98 -42 -301 -179 -91 518 13
2897 13 -29 -34 -204 -354 -55 4 5 -4 -82 278 -168 28 -59 24 -127 240 -137 -22 127 3 -125 -102 227 -242
2921 -242 159 -123 107 -163 55 -18 29 -61 -51 -46 177 77 -165 53 -144 -99 -111 23 -21 -79 91 167 -52 -32
2945 -32 -24 -10 49 -249 -41 -83 205 -171 176 2 119 217 -75 32 -28 103 38 158 -138 93 -222 21 -116
2968 -116 -96 105 57 20 -64 -81 198 53 -105 41 -225 -91 154 -10 -137 -45 8 123 -217 187 66 -60
2990 -60 -57 86 -324 40 5 -264 -129 -95 0 -283 53 -72 -113 -26 78 55 -94 -205 15 42 167 -156 75
$$ packed form
2826c01L15k84R8J07Q8O9j91J03O4j89J71k08J95J4jJ08m36O4L66j75Q5j57J68
2849G3K9j38M5M1J16k13o2jK02k01J83k98M57j79K00k23r5o0L8J5r9J85K35Jl79
2874a28J63n7o3j33J8N0L61p8l24M12j12J6j4k28K58j28Q5j40k59J22Q8O09n05
2897A3m2nj70j50K99N9Jrp8L60m46J96q7Q3j51L67l77J15J49j24j28K3L29m69
2921b42M01k82K30k70K18p3M7r0J0NK23j00k42K18j97M5j2J34m4n8J70P6k19K0
2945c2QJ4N9k98K08m2K88l76L47j74J17R8k92J07o0J31o5J20k96K31l15K43j37
2968a16K0K01m8l7q4j7K79j45j58J46k66J34K45j64j27R2N3J15l40M04j21j26
2990f0LJ43m10L64l5k69J35L4R5k83L36j25m1Q7J04k3j49j11K20K7J25l23K31
$$ plain form
3013 75 -155 46 6 65 -11 -136 -49 34 -115 -52 27 -62 151 48 -81 54 100 -197 -22 36 21 32 -51 100 287
3038 287 85 53 -29 67 -197 -263 -44 -16 -204 42 89 -170 -9 -99 -27 58 -56 21 -344 -283 -74 181 10 444
3062 444 147 -55 33 218 283 -204 -224 4 110 25 -8 36 50 59 20 19 26 -223 53 83 36 -96 -9 -34 123 72
3088 72 -33 65 141 165 -98 -6 149 205 -158 3 119 -138 73 93 179 -40 -22 2 40 47 -150 26 -237 206
3112 206 112 -75 -119 -180 -98 -133 163 23 -60 86 98 -45 -14 51 137 -80 -167 258 7 106 127 117 31 -94 52
3137 52 -161 155 173 -103 22 43 -260 37 -19 -82 -39 -1 5 -131 46 149 185 -238 30 -87 -68 39 77 -249
3161 -249 40 -74 60 153 176 19 -26 -83 97 -212 45 17 6 99 85 -241 86 101 42 28 -28 75 53 -78
3185 -78 -102 -24 -239 -55 27 -174 -174 279 -21 171 9 7 -90 76 -161 -143 186 -33 75 45 279 23 -6 74
$$ packed form
3013G5k30K01m0N9p6j25Q7Q3j49O3P9q9K13j03j29J35M6k97J75N8j5J1q3J51J87
3038B87k02l2q2R6k64o6K19K8j88K46M7k59J61r0P2Q5j14P7l65O1K09K55j71M34
3062D44k97k02Q8J85O5m87k0K28J06q5l3M4J4Rl9jPk49K76L0m7j32Q7k5J57n1
3088G2j05R8P6K4k63R2J55N6l63J61J16k57K11K0Q6k19J8K4L8Pj97J76k63M43
3112B06r4j87m4o1Q2l5K96j40q3J46J2j43L1O5Q6k17q7M25k51R9K1j0q6j25J46
3137E2k13L16J8k76J25K1l03K97n6o3M3L8Oj36J77J03L6m23K68j17J9J07L8l26
3161b49K89j14J34R3K3j57m5n7J80l09K57k8j1R3j4l26L27J5n9j4n6J03k2j31
3185g8k4P8k15J84Q2k01%M53l00J92j62kr7J66k37J8L29k19J08l0K34k56k9Q0
$$ plain form
3209 74 -140 47 106 -184 -40 12 310 15 -50 242 -16 -212 -176 23 -99 -16 49 136 -64 -11 303 100 154
3232 154 -108 167 8 -23 46 -91 -172 220 10 -74 -49 -38 -102 -94 21 137 -155 -45 -36 -74 -46 101 -58 -275
3256 -275 29 -62 -108 -348 -82 -137 -6 -257 63 11 205 -36 -83 26 -118 -14 103 -237 -63 -157 -153 151 111
3279 111 -111 -149 -80 -176 8 125 -28 86 -87 107 -87 -67 69 34 40 -49 135 12 205 -35 102 305 -167
3302 -167 -65 -12 -54 178 89 104 -80 -21 -212 77 60 18 53 57 63 -20 56 -47 14 -101 159 418 29 -165 49
3327 49 -56 26 48 77 -32 -89 15 -291 -151 -134 26 -167 72 -78 -4 18 -6 -56 75 46 -140 -127 -81 -18 103
3352 103 79 11 22 -93 -96 -52 31 24 -195 150 -178 -40 -139 23 215 -104 -4 -183 -46 99 155 -250 34 131
3376 131 76 58 -184 -168 -226 385 38 70 175 81 191 -10 16 -46 -38 -215 89 58 93 50 -128 -4 174 -49
$$ packed form
3209G4k14J87N9k90J44N2K98k95o5K92k58j96L6J99j22Q3O5Q7k00N3L14k03N4
3232A54k62K75j59l1O9j37q1L92k10q4K5J1o4QJ15J16k92J10Rl8K8J47j59k17
3256b75L04r1m6k40K66n5J31k51L20n2J94k41m7J09j44J04J17l40J74r4ML04m0
3279A11k22l8O9r6J84J17j53J14j73J94j94K0J36l5Oq9J84j23J93k40J37K03m72
3302a67J02N3m2K32q9J5j84N9j91K89j7m2L5MOq3P6j03O1j15K60K59l89j94K14
3327D9j05Q2K2K9j09n7J04l06J40J7J60j93K39j50P4K2k4n0J31k9j86J3M6O3J21
3352A03k4o8J1j15lM4Q3pk19L45l28J38r9J62J92l19J00j79J37J45N6m05K84R7
3376A31n5j8k42J6n8O11l47L2J05r4J10k01K6o2Qj77L04l1L5m3j78J24J78k23
$$ plain form
3400 -49 -146 59 190 41 237 -225 -242 -187 -77 -155 -12 135 -171 31 -124 41 152 -70 -76 -114 45 -89 209
3423 209 55 -38 -24 10 1 -200 -11 -86 -207 30 -94 -297 -184 -207 -31 -69 -166 81 -83 -353 -119 52 -79
3446 -79 -121 50 -114 64 -209 -67 247 -160 57 -21 146 67 -151 -18 -187 -163 101 -78 177 76 -156 -152
3468 -152 53 7 -227 -59 -208 -14 -219 -11 112 -92 -79 -264 15 -112 383 72 54 -129 -170 -334 -12
3489 -12 -96 28 9 -38 -36 54 -20 -195 68 -174 116 -4 56 -209 -27 -270 -8 -128 2 88 -64 28 165 -173
3513 -173 -23 149 189 99 56 25 210 -104 -192 -36 155 112 76 -69 -173 -57 -35 -22 -61 -129 -22 -34 -212 -73
3537 -73 -14 -179 -91 172 229 -163 177 -46 -68 60 221 -133 15 197 292 -151 -30 -22 246 58 -125 17 -62
3560 -62 -148 104 139 -76 -157 202 48 13 -6 2 -149 122 70 90 -180 -50 280 -249 -191 -108 -164 249 -13 -234
$$ packed form
3400d9r7K05J31j49J96m62j7N5J10p8J43J47l06K02j55J65J11k22ol8J59j34K98
3423B09j54r3J4L4rk01J89p5j21K37j24k03J13k3J76l8r7K47j64k70K34J71j31
3446g9m2J71j64J78k73J42L14m07K17p8J67p9k18J33j69K4K64j79K55j01k32M
3468a52K05m6k34J68j49J94k05K08J23k04J3j85K79j27M95l11j8j83m1j64L22
3489a2q4J24j9m7KR0p4j75K63k42K90j20O0k65J82k43K62j20J30Q6j52R2J37l38
3513a73J50J72M0r0m3l1J85l14q8J56J91m3l6j45j04J16K2J3l9o8J07j2j78J39
3537g3N9j65Q8K63N7l92L40k23k2J28J61l54J48J82R5m43J21QK68j88j83J42p9
3560f2q6K52L5k15q1L59j54l5j9Qj51K71n2K0k70J30L30n29N8Q3n6M13k62k21
$$ plain form
3584 -234 135 82 -3 -61 0 72 340 50 11 -26 162 93 -70 51 -35 5 -72 -48 -49 -75 -109 -145 112 -114 -356 78
3610 78 47 -86 128 -133 -118 -20 -153 -13 -121 179 99 -126 -284 -19 106 -85 86 -42 -208 -138 174 228
3632 228 -285 268 411 -3 213 76 -234 304 63 -21 245 109 74 -169 -134 -72 156 -29 -177 19 51 -157
3654 -157 16 -31 -27 -104 30 -115 24 -161 146 -201 -44 -52 -16 159 124 1 95 -83 113 -186 -191 55 -174 -50
3678 -50 87 37 -217 18 -259 106 -116 71 -115 78 -54 41 -172 -53 -31 -305 -178 17 55 1 108 -1
3700 -1 48 60 -120 26 211 56 -51 14 121 -122 67 -190 61 -10 -94 -27 48 170 -198 72 -172 -193 20
3723 20 -14 231 168 157 87 -61 93 -39 -106 15 -117 242 40 -168 -35 -221 92 -57 -13 91 -87 201
3745 201 -1 -101 1 198 -369 -188 149 98 -168 3 265 51 -66 210 176 -100 -120 -105 283 -8 -56 -43
$$ packed form
3584b34L69n3q5n8O1P2K68k90l9l7J88o9j63J21q6M0p7K4jk6l4l6K57k26k42M34
3610G8l1j33K14k61J5R8j33J40j08L00q0k25j58K65J25j91J71j28j66P0L12N4
3632B28n13N53J43m14K16j37l10N38k41q4K66j36l5k43L5O2K28j85j48J96L2k08
3654a57J73m7Mp7J34j45J39j85L07l47J57qL6J75l5j23R4j78J96k99nK46k29J24
3678e0J37n0k54K35k77L65k22J87j86J93j32R5k13J19K2k74J27J95L8n4J07j09
3700aM9J2j80J46J85j55j07O5J07k43J89k57K51p1q4O7P5J22l68K70k44k1K13
3723B0l4K45o3j1p0j48J54j32o7J21j32L59k02k08J33j86L13j49M4J04j78K88
3745B01k02j00J02J97n67J81L37n1k66J71K62k14j17K76l4k76k0J5L88k91m8J3
$$ plain form
3767 -43 -31 180 90 -10 -4 -36 -65 30 -182 -4 -105 0 86 -21 274 -54 64 -135 -24 26 -83 10 -55 -152
3791 -152 -94 -72 -63 23 -131 36 35 63 -183 84 -128 -176 -236 125 190 27 74 -179 33 -105 129 -77 -146 9
3815 9 67 91 116 226 60 -246 -249 -312 6 -25 -22 297 104 174 22 142 226 -137 47 103 -247 -356 -55 -49 97
3840 97 27 -263 -163 -156 0 57 96 53 -1 20 44 102 113 -290 60 46 132 -106 37 -270 -223 23 -237 34 19
3865 19 -44 -42 -6 -8 5 -232 -59 119 -118 17 -21 7 149 19 -165 -40 -15 71 54 50 -66 -139 206 -76 -18 119
3891 119 -124 18 180 149 -126 48 57 -66 72 17 -32 121 43 -120 124 -131 97 -29 56 -111 -4 131
3913 131 87 -30 -48 -15 3 181 -130 170 -66 88 16 92 80 -172 -188 22 162 147 54 -18 222 -43 186 -181
3937 -181 249 -69 130 108 13 -112 -86 -219 24 109 -71 13 45 146 114 -5 48 -84 -245 71 -66 53 -21
$$ packed form
3767d3J2K11r0j00Ol2k9R5k12J78j01J05Q6j07K95l28J18j99J11N0j09R3o5r7
3791a52N8K2RQ6j54J67jK8k46K67k12m8o0L61O5j63M7k53K12j38K34k06o9J55
3815IN8K4K5J10j66l06lo3L18l1LL19j93P0j52J20Q4l63J84N6l50j09L01OJ46
3840I7p0k90J00PJ56N7L9m3n4K1K4N8J1m03L50j4Q6k38J43l07M7K46k60K71j5
3865A9o3KL6kJ3k37J73J78k37J35l8K8J42j30j84J25K5Q6j7mj16p3L45k82N8J37
3891A19k43J42J62l1k75J74Rj23J38n5m9J53p8j63K44k55K28j26Q5j67J07J35
3913A31m4j17j8L3J8J78l11L00k36J54p2P6j2k52j6K10J40j5r3p2K40k65K29l67
3937a81M30l18J99k2r5j25K6j33K43Q5j80Q4L2J01l2j19N3j32j61L16j37J19p4
$$ plain form
3960 -21 -297 -150 -90 -36 -51 -2 -27 -308 -157 -188 89 -129 -93 0 74 16 -141 223 147 5 -116 -23 -108 -166 197
3985 197 -207 -45 -149 -96 -40 64 56 -56 92 92 -8 175 7 86 -130 227 299 -180 88 -71 -5 70 111 -130
4009 -130 191 179 -150 -89 -32 -190 -313 210 216 -20 -37 -88 -60 133 103 7 -50 -2 -45 30 -48 -37 -148 -245 -21 256
4035 256 -82 151 -62 -68 -146 75 -152 -12 335 -104 190 -119 29 -6 -32 -49 -168 286 73 65 -63 -136 77
4058 77 147 52 196 116 64 118 38 -155 -80 -62 75 107 22 148 181 -359 69 18 96 53 250 219 -42 81 -57
4083 -57 81 -76 54 -98 -136 42 148 126 45 151 145 17 30 22 -49 -89 131 348 -162 -226 101 187 4 -92 -3
4108 -3 -166 119 155 -27 -133 157 18 -87 88 -51 26 -176 -26 -191 -82 233 -267 3 225 262 -60 -92
4130 -92 138 -113 -139 -83 19 -31 -97 196 108 -100 191 356 -25 45 -476 103 58 49 56 135 208 19 112 -209 -143
$$ packed form
3960b1k76J47O0N4j5M9k5k81J51l1K77k18L6R3P4n8j57L64p6j42j21R3q5n8L63
3985A97m04J62j04N3N6J04qj12J48%j00J83j68P9k16L57P2m79K68j59O6P5M1k41
4009a30L21j2l29O1N7j58j23N23Ok36j7n1K8J93l0r6n7M8m3P5p8J1j11r7K24K77
4035B56l38K33k13op8K21k27J40L47m39K94l09J48l5k6j7j19M54k13qj28p3K13
4058G7P0r5J44q0n2N4q0j93P5J8J37L2q5J26L3n40M28n1P8m3J97l1k61J23j38
4083e7J38j57J30j52l8J78J06k2q1J06oj28J3qp1m0K20K17n10o4L27Q6j83r6Q9
4108cj63K85L6j82j06K90j39j05J75j39P7k02J50j65J09L15n00K70K22L7l22l2
4130i2K30k51k6N6J02n0o6K93q8k08K91J65l81P0n21N79m5rPP9P3j89R3l21O6
$$ plain form
4155 -143 -96 6 361 -42 -71 291 211 -47 -130 -110 148 348 -5 -134 -111 -80 121 223 -14 11 -288 16 -234
4178 -234 -235 146 93 -207 42 150 24 -75 66 219 -67 170 -77 -82 216 -53 132 -98 -172 -156 -45 -157 -127
4201 -127 -92 -188 57 -36 -7 -84 -65 5 1 109 51 105 -61 -166 179 44 164 -113 -5 295 105 -292 -89 43
4225 43 141 107 149 24 101 46 -128 102 19 -12 -1 -41 -67 180 -32 -104 -74 20 75 -151 -178 29 -15 -28 141 182
4251 182 -36 -68 -157 75 -202 287 -36 -46 6 44 -36 -40 31 132 -145 28 -12 -39 121 227 -199 -210 -94 -127
4275 -127 -1 94 -131 -6 -50 56 113 -103 -5 -225 -161 -24 78 -64 -231 59 175 0 -64 -50 -39 119 -59
4298 -59 315 -144 -144 -164 19 31 22 24 17 -146 -109 -47 18 260 -134 174 -31 -7 -84 -163 0 -25 117 -147 368 55
4324 55 50 159 -53 169 92 -94 10 155 223 -14 161 62 -196 130 -86 74 -174 -281 242 83 -266 -45
$$ packed form
4155a43M7J02L55m03k9L62q0k58q3K0K58K00l53j29K3L1K01J02k37K5k99L04k50
4178b34jL81n3l00K49J08j26r9J41J53k86K37k47nK98k69J85k30p4J6J11j12L0
4201a27L5r6K45r3K9p7J9P0mJ08n8N4j66j05L45j35J20k77J08L00j90l97K03J32
4225D3R8l4M2j25P7n5j74K30q3l1J1m0k6K47k12p2L0R4N5k26k7K07m4j3J69M1
4251A82k18l2q9K32k77M89l23j0N2L8q0mP1J01k77J73m0k7J60J06m26j1J16l3
4275a27J26R5k25J25m4J06N7k16R8k20O4J37J02j42j67K90J16j75o4J4J1J58j78
4298e9L74m59%k0J83J2rKpj63L7O2O5K42l94L08k05K4p7p9J63k5J42k64N15l13
4324E5nJ09k12K22p7j86J04J45O8k37J75r9k58L26k16J60k48j07N23j59l49K21
$$ plain form
4346 -45 -252 -62 -143 12 -218 106 -81 45 139 -18 -115 -37 -141 160 -81 -39 246 65 -128 198 8 -114
4368 -114 -55 -402 112 -29 245 -149 -114 54 -152 36 -49 -29 111 -18 -45 19 133 -180 -259 -191 -264 -153 128
4391 128 88 124 -61 151 -99 -58 63 -330 -81 -89 -163 80 199 146 -161 -11 -89 -184 -159 -1 195 -110 -259
4414 -259 160 -175 97 50 -47 -17 188 -105 8 38 -131 4 5 -40 -21 58 173 -45 43 -81 78 -77 -147 20
4438 20 52 -118 -64 -111 10 -97 -68 -67 -44 83 -42 8 143 -83 27 110 178 99 -169 282 -130 -179 50 -74
4462 -74 65 22 -27 -19 259 -50 335 57 -35 17 100 85 -47 -237 -110 18 -246 -364 133 154 24 63 -145 -65
4486 -65 -228 -2 53 114 102 -246 125 84 -32 41 106 360 -35 -38 66 -24 -14 -29 -157 179 167 -77 139 -14
4510 -14 232 -142 -74 -49 37 -144 40 7 17 191 -6 30 9 143 224 -77 -153 -41 -192 -13 -1 -53 -91 -144 35
$$ packed form
4346d5k07J90q1J55k30L24j87J26R4j57r7P8j04L01k41M2K85j81j93L26j90j22
4368a14N9l47N14j41K74l94L5J68k06J88q5K0J40j29k7O4J14l13p9O8p3J11K81
4391A28m0L6j85K12k50M1J21l93K49qp4K43J19n3l07J50p8r5K5J58J96l05j49
4414b59M19l35K72m7r7L0K05k93J13L0j69J35Jm5J9P9J15k18Q8j24J59j55p0J67
4438B0L2j70N4m7J21j07K9JK3J27j25N0J35k26J10Q3O8p9k68M51m12m9K29j24
4462g4J39m3m9QK78l09L85k78r2N2Q3j5j32j90J27J28k64j18M97K1j30L9k08Q0
4486f5j63K26N5O1j2l48L71m1j16P3O5K54l95lJ04r0J0j5j28L36j2k44K16j53
4510a4K46l74O8K5Q6j81J84l3J0J74j97L6k1J34Q1l01p6J12j51J79J2n2l8n3J79
$$ plain form
4535 35 154 2 62 103 -64 -287 -74 -143 44 -219 31 -53 -48 114 -153 40 53 -140 -83 128 25 109 76 -147
4559 -147 68 77 39 28 97 154 194 -151 -63 126 -36 -174 47 -47 82 -53 12 81 -124 230 -173 12 148 -37
4583 -37 -154 -154 185 -107 146 -120 -69 111 -102 -23 10 -7 -13 21 93 -324 -45 -94 6 13 -70 181 -14 -95 31
4608 31 92 82 -71 -210 -197 -106 207 -3 48 -24 102 -221 147 252 106 125 -183 -11 -24 150 45 60 -203
4631 -203 -55 -25 -124 164 -127 -151 -100 92 -38 -152 225 41 -86 -97 -8 89 43 47 84 120 -145 109 -49 -213
4655 -213 31 -156 123 37 151 -158 48 -239 -106 303 -6 245 95 50 -76 147 -79 15 -177 -103 -39 -115
4677 -115 -143 183 -245 -163 -176 167 190 33 72 -85 -9 -111 89 -116 116 -29 52 45 -216 171 -14 -185 -55
4700 -55 -139 -137 -40 221 297 103 78 96 -79 62 -131 35 170 -37 -175 -96 -106 13 -13 -56 121 -291 -155 15
$$ packed form
4535C5J19j52O0M1j67k23K13o9J87k63K50q4NJ62k67J93J3j93N7K11j03Q4l3k23
4559a47K15Rl8j1O9N7M0l45Q8J89j62j38K21r4J29j35O5O9k05L54m03J85J36j85
4583c7j17%L39k92K53k66N1J80k13P9L3j7oL4P2m17K79m9J00Pq3K51j95q1J26
4608C1O1j0j53j39J3R1L13k10N1p2J26l23L68J05j46J9l08J72j3J74j05J5k63
4631b03J48L0r9K88k91k4N1J92j30j14L77j84j27j1Q9R7m6ML7L6k65K54j58j64
4655b13K44j87K79q6J14l09K06k87J33M09l09K51j50m5j26K23k26R4j92P4O4p6
4677a15k8L26m28Q2j3L43K3j57L9j57P6j02K00k05K32j45Q1pk61L87j85j71J30
4700e5q4KR7K61P6j94k5J8j75J41j93J66J35k07j38P9j0J19k6m3J77m12J36J70
$$ plain form
4724 15 6 183 309 28 -19 -145 -140 82 -45 -43 166 78 -231 -15 -162 -15 71 -131 89 -166 -53 56 -122
4747 -122 -273 -62 -22 -33 -235 150 -65 -96 -45 232 1 -124 -93 -121 -26 58 76 76 2 15 166 -32 18 -178 34
4772 34 57 -29 199 -108 17 -8 -136 -32 170 -72 -120 -142 -156 -11 7 -27 35 9 -197 64 70 189 75 -4 -121
4797 -121 153 -114 -33 -76 244 237 160 -203 17 -18 43 -265 -103 -83 30 280 25 87 -137 109 -24 -57 -21 -148
4821 -148 -27 3 39 149 -211 103 -223 55 -109 -17 29 33 40 28 -13 247 -23 -174 128 -113 -44 32 -16 -112 -284
4846 -284 61 62 91 176 -84 160 -79 -102 154 -111 55 204 -190 -28 -34 -25 88 -248 -239 -119 -74 51 -58 20
4870 20 129 -30 95 -3 -109 -100 30 -238 -169 -122 -112 261 -16 -28 90 198 -111 342 240 146 118 215 73 36
4894 36 259 -188 98 -146 -141 72 66 -167 86 -116 -67 122 -223 -85 -244 39 38 -44 14 -14 36 116 -9 -19 97
$$ packed form
4724A5rJ77J26k81m7j26NK22j27KK09q8l09K16j47J47Q6k02K20k55J13J09j78
4747a22j51K11M0j1k02L85k15l1N1K77k31j25L1k8R5Q4J8%p4J3J51j98N0j96K12
4772C4K3q6K28l07J25k5j28J04K02k42m8k2j4J45J8l4O2k6k06K61OJ19j14p9j17
4797a21K74k67Q1m3L20pp7l63K20l5O1l08J62K0J13K50k55O2k24K46j33l3L6j27
4821a48J21L0L6J10l60L14l26K78j64R2M6MPj2m1K60k70j51L02k41O9P6m8r6j72
4846b84L45JK9Q5k60K44k39k3K56k65J66J49l94J62oRJ13l36RJ20M5J25j09P8
4870B0J09j59J25r8j06RJ30k68O9M7J0L73k77j2J18J08l09M53j02r4k8R7j42l7
4894C6K23m47K86k44NK13ok33K53k02M9J89l45J38j59K83jq2N8k8N0Q0j25j0J16
$$ plain form
4919 97 40 178 -54 21 -62 2 22 -33 -6 101 -260 -28 216 -157 155 65 29 -83 -48 108 -160 185 43 -56
4943 -56 241 44 37 -14 -182 -79 -37 94 106 -22 42 -152 -154 -74 -207 -159 -202 -170 -157 -53 193 149 -173 -90 -59 165
4969 165 -150 -51 80 176 43 123 113 9 350 59 170 -54 -165 -86 120 -44 177 20 15 47 118 -19 196
4992 196 -226 7 -127 13 -134 34 76 92 132 182 -61 -124 -118 271 117 54 -12 -31 12 51 147 -64 2 -66 -232
5017 -232 -208 -46 -83 36 -392 -39 208 61 26 -81 -129 -162 17 -117 152 -62 -174 -252 -191 -28 -116 35 -17
5040 -17 -9 -220 -25 -38 111 -14 -289 -237 -134 -22 365 28 -24 96 243 28 89 93 81 -32 -60 -196 -181 86
5064 86 22 2 -24 324 -38 -108 53 24 111 -232 -87 -34 126 85 -17 255 -178 -78 -30 30 -185 -36 39 -156
5088 -156 -44 49 20 107 -32 93 -105 -118 89 73 60 -195 -68 103 27 54 106 50 -84 327 66 53 -34 -11
$$ packed form
4919I7n7J38k32P5q3O4K0n5K7J07l61K32K44l73L12r0l6j12L5J56k68L45j42r9
4943e6K97j97pn1j68J03M2J31J2j28O4j94kQ0j33M8m3L2J3J04K46m4l22Q3L1K24
4969A65l15R9J31R6j33Q0j0j04L41k91J11k24j11P9K06j64K21j57nL2P1j37K15
4992A96m22K33j34J40j47J68M2J6M0N0k43o3OL89j54o3o6j9M3L9R6k11O6o8j66
5017b32K4J62l7J19m28L53K47j47l5j07m8l3J79j34K69k14j12p8O1J63q8J51n2
5040a7Qk11J95j3J49j25k75N2J03J12L87l37n2J20J47k15O1Mj2j13k8j36J5K67
5064H6o4k0k6L48l62p0J61k9Q7l43J45N3J60m1j02K72m33J00M8O0k15J49P5j95
5088a56J12R3k9Q7j39J25j98j3K07j6j3k55J27J71p6K7N2n6j34M11k61j3q7K3
$$ plain form
5112 -11 24 -49 309 -5 -28 -106 72 150 91 -110 -71 -131 -56 -133 -144 46 73 -117 122 -17 -20 202 -40 163 -129
5137 -129 67 -30 -81 72 -45 145 16 207 123 -131 -95 31 266 13 23 27 48 268 30 -30 -108 2 114
5160 114 47 -97 60 40 169 -43 -7 -128 75 195 -75 141 20 -27 274 -14 12 53 258 -249 154 -43
5182 -43 30 -35 162 61 -210 -17 7 -127 -21 11 -8 82 176 13 181 105 -144 74 -156 -107 237 226 -208 6
5206 6 -283 54 47 73 -104 77 174 14 -41 -94 -73 -120 -219 -7 142 132 -22 -59 110 -106 -79 188 104 54 133 57
5232 57 -136 178 65 59 -65 -24 -72 -161 36 -123 8 173 -170 271 -177 -138 -27 -105 302 -13 -51 134 -58
5255 -58 -67 -84 41 -261 -224 71 29 1 -71 -46 -96 -72 -34 -82 38 14 173 -26 -62 -203 -68 -43 138 124 -38 -293
5281 -293 21 131 386 87 -13 -220 -57 62 13 -13 102 23 -70 -59 137 117 -31 223 79 11 37 107 -106
$$ packed form
5112a1L5p3L58l14k3p8J78P8n9k01L9o0P5p7j1J90K7j90K39j39lK22k42K03k92
5137a29J96r7n1J53j17J90j29J91q4k54L6J26K35k53J0MK1K20k38o0p8J10J12
5160A14o7j44J57k0J29k12L6j21K03J20k70K16j21m7L01k88K6M1K05n07M03j97
5182d3P3o5J97j01k71J93K4j34J06L2j9R0R4j63J68p6k49K18k30M9L44j1m34K14
5206Fk89L37pK6j77J81R7j60n5n3K1m7r9K12J49j0j54l7J69k16K7K67q4n0P9p6
5232E7j93L14j13oj24M1m8q9J97j59J31J65l43M41m48L9J11p8M07l15l8J85j92
5255e8rj7J25l02L7K95m2k8p2K5n0K4L8m8J20k4J59j99l6j41J35K5J81j4j62k55
5281b93L14J10K55k99j00k07J63J19m9k6J15p9r3J1J96k0j48K54j44o8K6P0k13
$$ plain form
5304 -106 -52 13 -48 105 48 261 -204 239 7 -22 -100 0 -212 187 211 27 -53 -326 -66 -45 65 50 -56
5327 -56 33 161 -13 -47 57 -49 77 -242 -172 7 -50 -51 153 -174 -36 139 -243 45 35 -88 -60 -14 201
5350 201 62 -265 -441 -64 42 -14 131 -126 -120 66 127 77 139 -256 -82 -126 63 -87 -140 -38 -172 -164 -28
5373 -28 -25 -59 59 15 -24 -103 -68 157 8 67 18 48 -77 -221 -12 -12 -81 25 -42 82 17 3 -47 99 -34 49
5399 49 19 -33 33 -112 -72 17 -59 -206 216 175 88 120 136 -135 31 -4 -146 8 -107 -29 -104 11 -310 191 63
5424 63 133 116 171 -146 -6 -182 198 53 -56 111 84 -330 -29 139 -135 -211 -124 190 -12 -32 203 -99 -209
5447 -209 -115 -141 -7 41 -97 -89 21 -77 -1 1 163 -4 -37 58 -149 119 367 -10 75 -119 113 73 162 -183 7
5472 7 -172 178 -133 92 162 -20 -40 -120 -43 195 125 98 -40 -89 -66 61 -32 -5 -203 83 237 -44 -165 88
$$ packed form
5304a06N4O5o1J53n7K13m65M43k32k9p8J00k12L99K4j84q0k73K60K1J10j5j06
5327e6Q9J28j74l4J04j06J26l19P0J79n7jK04l27J38J75l82K88j0j23K8M6K15
5350B01j39l27j76L77J06n6J45k57OJ86O1n0O2l95J74m4J89j50n3J02j34QJ36
5373b8Ll4J18m4l9p9L5K25j49N9m9L0j25j44K09%o9J06o7J24o5j4n0J46j33Q3
5399D9l0n2O6j45M0Q9p6j47M22m1q7L2J6k71J66l5j42J54j15P8p5J15l21N01j28
5424F3P0j7N5l17J40j76L80j45j09J67k7m14L01J68k74p6Q7L14k02k0K35l02j10
5447b09R4k6J34M8j38QJ10r8P6KJ62j67l3R5k07K68K48l77Q5j94K32m0Q9l45J90
5472Gj79L50l11K25P0j82k0q0P7K38p0k7j38m9K3J27r3K7j98K86J54k81j21K53
$$ plain form
5496 88 -24 -136 32 101 41 86 90 119 -105 18 107 80 -25 235 100 51 24 55 -144 -107 -183 -169 -22 104 -75
5521 -75 103 86 -420 -99 -86 84 -215 48 231 -24 138 251 70 -90 -204 -231 89 201 -108 7 216
5542 216 40 327 -172 -273 156 76 11 -195 107 -297 -69 -10 -191 -94 46 -356 49 -133 -73 -67 87 132 185
5565 185 -119 45 242 99 49 -271 93 264 -85 81 52 222 -25 -109 76 83 -3 -311 -46 22 104 25 -356
5588 -356 60 153 89 87 -110 179 34 47 -8 -154 85 80 -162 19 32 -106 -162 -102 -239 -265 -82 -183 -68 -46
5612 -46 224 84 -90 101 -144 126 -215 261 88 -53 -134 -109 -89 -70 -32 122 -9 -132 -30 -22 63 -74 -13
5635 -13 -65 -97 37 -280 -239 129 -172 -132 182 56 126 -102 -32 -113 210 146 19 -75 25 24 -90 -135 -99 247 -188
5660 -188 -59 58 83 -222 -5 -90 -75 76 -175 196 228 -97 -48 -195 95 37 248 -42 281 -16 83 -11 82
$$ packed form
5496H8j12j12J68O9o0M5MK9k24J23Q9k7j05K60j35m9k7L1j99L7p6J4J47J26j79
5521g5J78j7n06L21J3J70k99K63J83k55J62J13j81j60j14k7L20J12l09J15K09
5542B16j76K87m99j01M29q0o5k06L02m04K28N9j81R7J40m02M05j82O0OJ54M5N3
5565A85l04J64J97j43n0l20L64J71l49J66k9J70k47q4J85Pq6l08K65O8Q2p9l81
5588c56M16R3o4kj97K89j45J3n5j46K39nk42J81J3j38n6O0j37k6J83j01J15K2
5612d6K70j40j74J91k45K70l41M76j73j41q1K5K0J9L8J54j31j23J02QQ5j37O1
5635a3n2l2J34l17M1L68l01M0L14j26P0k28P0q1L23o4j27r4J00jj14m5L6L46m35
5660a88J29J17K5l05K17q5J5J51k51L71L2l25M9j47K90n8K11k90L23k97R9r4R3
$$ plain form
5683 82 -229 89 102 -149 76 34 -5 66 -169 132 144 217 -59 -66 -15 115 221 -56 -18 -218 -18 137 247 -22
5707 -22 -6 -153 -386 -137 55 -151 -143 24 -205 86 -147 -196 -134 60 -18 -45 208 -34 101 -114 154 -73 -58
5730 -58 -75 2 89 -157 -179 -72 -132 36 70 32 117 24 101 205 69 97 -171 134 56 270 79 111 19 -108 -68
5755 -68 -93 51 172 185 -59 90 -34 -49 -166 -73 -215 -136 74 380 -144 9 199 -78 58 180 179 -52 -220
5778 -220 55 114 78 201 30 193 -218 31 36 68 80 -106 178 2 -83 -94 91 73 22 -12 -69 -113 204 -178
5802 -178 97 -228 18 281 -149 -118 46 -76 -114 -75 -54 13 -195 77 -9 116 2 -138 -58 -180 -281 -169
5824 -169 93 277 209 155 150 -221 162 64 131 -21 -147 -118 -91 -73 -210 29 8 118 -96 93 -84 -115 -72 103
5848 103 68 -175 -59 -3 -58 -126 22 -22 25 -228 17 13 125 -368 92 149 -380 28 65 -212 -6 -232 -11
$$ packed form
5683H2l11L18J3k51K25m2l9P1k35L01J2P3k76pN1J30J06k77L8k00K00J55J10k69
5707b2J6j47k33K49J92k06QJ67k29K91k33m9O2J94p8k7K53k42J35k15K68k27J5
5730e8j7P7Q7k46k2J07o0J68L4l8Q5r3P7J04j36K8k68L05p8K14j91L2r2j27M0
5755f8k5J44J21J3k44J49j24j5j17R3j42P9K10L06n24J53J90k77J36J22jk31j68
5778b20K75N9l6J23j71J63m11K49NL2J2j86K84j76q5j1J85j8n1l4n7m4L17l82
5802a78K75l25K46K63m30L1J64j22l8L9K1O7k08K72q6J25j14j40Q0j22j01J12
5824a69K62J84o8n4nl71L83r8O7j52j26K9K7J8j37K39k1J10k14J89j77l1M3J75
5848A03l5k43J16N6n5o8J48m4M7k53K45mJ12m93M60N7n29M08L7k77K06k26K21
$$ plain form
5871 -11 151 -84 -100 145 -219 -34 -60 122 227 -91 59 15 -76 -25 -94 67 89 132 -43 -106 -112 -41 300 162
5895 162 -246 -125 -64 -132 155 -18 -201 -224 -114 153 -91 113 -20 119 -228 -221 99 121 -174 62 -70 -31
5917 -31 149 69 120 -9 161 -12 47 -99 44 -10 -49 -201 -15 58 3 12 318 -102 -36 -144 -76 66 -205 -59
5941 -59 189 39 -173 16 54 143 41 -98 2 152 133 215 94 60 -163 279 -82 51 24 32 -86 -315 -110
5964 -110 147 -113 218 188 39 -126 -116 162 118 163 26 -159 -94 -64 -229 -131 32 -94 34 -292 -114 1
5986 1 -191 -64 94 6 87 105 40 140 -196 -89 83 -55 -280 -19 -53 50 81 15 -271 37 127 -111 116
6009 116 161 -128 80 0 116 58 3 -42 -38 -126 -66 -62 12 84 80 -498 175 197 100 69 91 65 13 -47 -201 408 -183
6036 -183 -42 -13 -64 -20 -74 11 71 -144 123 194 -41 -67 -245 -143 70 72 -91 -223 -75 -106 -23 -47 185 -6
$$ packed form
5871a1J62k35j6K45l64J85k6J82J05l18J50m4r1N1o9J61K2M3j75o3oP1L41j38
5895A62m08J21O1o8K87j73j83k3J10K67k44K04j33J39l47PL20K2k95K36j32L9
5917c1J80q0N1j29J70j73N9j46J43n4l9j52J86P3n5RL06m20O6j08O8J42k71J46
5941e9K48j50k12J89L8Q9j02j39J00J50j9Q2j21l4k23M42l61J33k7Qj18k29K05
5964a10K57k60L31l0j49j65J0K78m4M5j37j85O5L0j65R8J63j26J28l26J78J15
5986Aj92J27J58q8Q1J8o5J00l36J07J72j38k25K61l4J03L1o6k86L08R0k38K27
6009A16M5k89K08q0J16n8n5m5Mq8O0MP4P2mn78O73K2r7l1K2k6n2o0j54O09n91
6036a83J41K9n1M4n4Q5O0k15K67P1k35k6j78J02K13Kj63j32J48l1Q3k4K32j91
$$ plain form
6060 -6 -154 -17 -34 -163 96 -14 -94 29 -24 -137 -100 -227 -31 26 -78 -5 -85 48 58 -156 127 214 69 81
6084 81 -168 -21 -153 -120 -9 -118 -101 -81 135 94 -75 68 -2 -94 156 -132 32 91 68 -55 59 106 103 72
6108 72 -67 256 -148 154 -168 214 -157 74 136 259 -119 -21 -49 -90 125 -123 -18 177 -47 -126 241 92
6130 92 78 7 -68 117 154 -114 127 -34 186 -26 117 -245 42 23 15 18 -21 -50 -144 -253 -126 18 79 -38 -199
6155 -199 212 -93 -222 37 161 -15 52 -148 -48 -265 -174 132 -73 202 80 -152 115 -60 151 132 91
6176 91 61 -121 -131 -209 11 -13 -184 199 -261 -50 31 -118 200 -206 40 -223 -153 181 203 -101 -14 -79 -12 154
6200 154 -11 21 33 152 25 -76 79 39 202 -179 -69 89 116 37 188 -32 87 50 -19 124 -73 -63 -481
6223 -481 28 9 -174 -152 -169 -98 0 96 90 -16 156 92 78 -201 89 -99 183 123 -185 -51 -70 94 -28 -87
$$ packed form
6060fj48J37j7j29K59j10q0J23n3j13L7j27J96N7j04P3q0J33J0k14K83Q7j45J2
6084H1k49J47j32L3J11j09J7K0K16m1j69J43p0r2K50k88J64N9k3j23J14M7ll1
6108G2j39L23m04L02l22L82l71K31O2J23l78R8k8m1K15k48J05J95k24p9L67j49
6130I2j4p1p5J85L7k68K41j61K20k12J43l62K87j9qLl9k9r4j09J27J44O1j17j61
6155a99M11l05j29K59J24j76O7k00J00k17R1L06k05K75j22k32K67j75K11j9m1
6176I1l0j82j0p8K20k4j71L83m60K11Q1j49L18m06K46k63P0L34K2l04Q7o5O7J66
6200A54j65L2J2J19j27j01J55m0J63l81J10J58K7p9J51k20J19l7o9J43j97J0m18
6223d81N09j9j83K2j7P1R8R6oj06J72o4j4k79K90j88K82o0l08J34j9J64j22n9
$$ plain form
6247 -87 -8 10 13 102 95 -297 -233 -250 365 -156 -366 -206 34 -105 163 -74 45 131 167 102 86 -258 -72 -139 -41
6272 -41 -16 -137 -249 -8 -57 -32 -61 13 -83 64 239 67 -90 -250 49 -24 23 98 -125 33 223 268 125 -146
6296 -146 168 -12 -49 129 -143 -29 -104 2 76 43 -133 -45 -101 120 100 -152 -66 40 380 -25 67 21 -44 -91
6320 -91 26 148 280 188 66 133 -226 -65 -111 -13 58 147 50 -354 37 78 -177 -4 171 -225 4 -57 29 41
6344 41 -60 -218 -128 -95 -98 115 47 4 248 257 117 -151 76 -293 -65 89 -41 157 50 -90 -124 129 85 28
6368 28 184 -159 4 26 -64 112 -5 -167 1 50 115 -174 6 -268 257 138 113 -19 -68 343 186 165 -10
6391 -10 18 267 -281 -55 17 -178 -127 154 5 29 97 -99 -56 301 38 -247 63 -88 166 207 184 -88 -60
6414 -60 -228 -99 -29 215 226 -22 142 258 -175 -15 -200 -105 258 -96 -22 203 -57 36 49 6 31 151 -120
$$ packed form
6247h7P9J8LQ9pl92O4j7O15n21k10J60K40j39K68k37J19Q6L6o5j6l44J86o7R8
6272d1K5j21j12K41m9K5k9P4r6J47J75j72j57j60K99p3M7P5k23J58J90M5j43k71
6296a46L14j80l7J78k72J14p5J06P4l3j76Q8n6K21k0k52Q6J06L40m05R2m6o5m7
6320i1J17J22J32r2j22O7l59J61m6R8P1Q9r7m04L91M1k55J73J75l96K29o1Q6J2
6344D1j01j58R0L3lK13o8m3K44Rj40k68K27l69K28J54j30J98j07j40l4K53m4n7
6368B8J56l43J63K2r0J76j17j62J68M9O5k89J80k74N25j19k5j32m9M11j57k1j75
6391a0K8K49n48K26P2j95N1K81j49K4O8j96M3L57k63k85L10j51K54M1k3k72K8
6414f0j68J29P0K44J1k48J64J16m33J60j85R5L63l54P4K25k60R3J3m3K5J20k71
$$ plain form
6437 -120 172 -111 48 -134 166 208 143 28 -54 173 -246 -74 -83 47 143 96 -51 -68 25 -162 94 30 73 210
6461 210 100 58 -124 217 77 22 14 -73 -67 -113 -42 146 -6 60 138 70 -221 46 84 -60 99 101 -331 349 29
6486 29 -28 88 184 46 23 28 4 -18 129 -302 172 -165 -14 25 18 -26 -57 76 -210 181 -81 79 146 25 141
6511 141 240 271 178 -1 124 106 -250 -230 -14 -146 245 1 -50 120 33 157 -8 -26 -285 4 62 -256 262
6534 262 -21 -71 157 79 -116 -121 181 99 53 -13 -132 196 -134 -65 -260 -101 -3 -200 126 -84 -87 -232 -111 -52
6558 -52 29 -96 175 77 -154 49 -39 43 182 150 137 124 -184 -98 -217 125 50 65 57 -68 168 -156 -170 -215 -49
6583 -49 -24 -30 -79 170 85 28 -228 135 173 -156 8 96 -3 -5 55 -16 67 -223 117 241 55 106 -295 -19 45 42
6609 42 -52 -51 -137 25 93 32 179 -65 13 68 -159 -33 45 213 -67 -80 -123 -72 -83 71 -176 29 -18 -215 -61
$$ packed form
6437a20K92k83J59j82L00M2o5j15q2K27m19J72rJ30R6m7j47j7R3j87K56o4M3J37
6461B10j10m2j82L41j40n5qq7Om6P1J88j52O6P8o8k91K67L8j44J59Km32O80l20
6486B9n7J16R6j38k3Nk4k2J47m31M74l37J51L9pm4l1J33k86L91k62J60O7j21J16
6511A41R9L1r3j79J25j8l56K0K16j32L91k44n1J70q7J24j65j8k59K89N8l18N18
6534B62k83n0K28p8j95nL02q2m6o6j19L28l30O9j95J59R8j97L26k10lj45J21N9
6558e2Q1j25K71r8k31K03q8Q2J39l2j3j3l08Q6j19L42p5J5qj25K36l24j4m5J66
6583d9K5om9K49q5n7k56L63L8l29J64Q8r9kO0p1Q3k90L40J24j86N1m01K76O4l
6609D2r4Jq6J62O8o1J47k44P8N5k27J26P8J68k80j3m3N1j1J54k47K05m7j97J54
$$ plain form
6634 -61 82 -37 261 136 81 221 -71 31 64 40 -38 56 214 -42 245 -77 -87 107 153 -50 -32 123 -113
6657 -113 54 135 28 136 24 83 -110 28 -86 -113 -170 103 -124 -182 -88 -192 -205 -59 140 -88 -138 120 -67
6680 -67 29 56 -163 266 80 58 181 -67 -112 94 -174 118 -41 -180 -89 -102 -108 -78 -148 -102 -91 85 77 -85 -111
6705 -111 -138 -10 46 -134 -57 88 -70 -248 -177 -168 -52 101 -83 125 70 71 -35 -100 -170 -157 11 46 43 -22 148
6730 148 55 169 -382 -40 63 -27 253 135 10 109 -85 -56 171 103 -10 247 253 -9 175 -152 -226 74 -78
6753 -78 -179 -77 258 240 152 30 21 -24 -33 -35 65 -142 -269 -85 -100 151 60 56 -61 -3 -20 65 257 176 60 -105
6779 -105 218 146 48 -336 -18 33 160 155 -92 2 0 -16 -26 83 -239 14 -122 -231 -20 -70 67 -251 -43 174
6803 174 23 46 45 443 -10 -190 87 -98 -253 166 -24 77 68 -110 -28 20 -43 139 -59 -166 -152 -154 25 -12
$$ packed form
6634f1J43j19K98j25n5J40k92J02L3k4p8R4J58k56K87l22j0J94M6k03J8J55k36
6657a13J67Q1j07J08j12N9j93J38j14k7n7K73k27n8R4j04j3J46J99k28n0K58j87
6680f7R6K7k19M29j86k2J23k48m5K06k68K92j59j39R1j3oL0p0M6J1J76qj62k6
6705a11k7J28N6j80P7J45j58j78P1RJ16J53j84K08n5Jj06o5p0J3J68L5lo5J70
6730A48r3J14n51L42J03r0K80j18j25R9j94K9K27o8j13K57Ok62J84l27p4L00j52
6753g8j01J02L35j8q8j22rm5rkJ00k07j27J84j5K51r1mj17N8j7Q5J92q1j16j65
6779a05L23p2r8l84L18N1J27nk47R4kj6j0J09l22K53j36j09K11n0J37l18K08K17
6803A74j51K3jL98m53j80K77j85j55M19j90J01rj78Q2M8o3J82j98j07J4kJ79l7
$$ plain form
6827 -12 -267 177 -36 173 -17 -24 113 6 -336 39 -76 -56 124 53 128 -265 98 -127 44 -107 14 75
6849 75 44 -24 278 195 88 -119 -49 -106 239 58 -99 1 -71 53 110 -227 -23 -59 39 -31 239 -171 -18 103
6873 103 -92 -19 14 249 -44 27 55 -31 287 21 -75 27 -9 47 -23 -170 48 -41 -286 -43 -34 59 -109 -71 -144
6898 -144 -19 -10 -174 49 318 32 67 76 -132 150 -13 19 56 124 85 9 -11 -51 -26 188 8 193 49 -142
6922 -142 224 -46 -141 138 257 108 -27 141 -161 71 103 -26 300 158 -245 -79 23 -91 -235 -101 299
6943 299 32 -57 60 -92 24 -20 192 31 256 -68 -57 24 -72 -7 -206 -18 -126 35 131 -33 -27 73 124
6966 124 66 317 32 -32 57 123 -156 -127 97 -204 -84 -136 -19 -31 57 -41 -27 144 69 -50 -19 153 133 -17
6990 -17 -49 236 -61 122 -80 -109 -156 -112 -72 -134 13 66 119 174 -141 -159 -152 -74 -43 6 -99 -67 24 -45 -110 -78 235
$$ packed form
6827a2k55M44k13K09j90pJ37j07l42L75j15K0J80p1P5l93L63k25J71j51J21O1
6849G5l1o8L02q3j07k07P0n7L45j81j57J00p2J24N7l37K04l6R8p0K70m10J53J21
6873A03j95P3L3K35k93P1K8q6L18k66r6J02l6N6p0j47K18q9k45K43RR3j68L8p3
6898a44J25Rj64K23K69k86L5Rk08K82j63L2L7O8l9p6k0m0K5K14j80J85j44j91
6922a42L66k70r5K79J19j49j35J68l02K32L2j29L26j42m03J66J02j14j44J34M00
6943B99k67q9J17j52J16m4K12j61K25l24J1Q1r6O5j99J88j08J61R6j64OJ00N1
6966A24n8K51k85o4Q9O6k79K9K24l01J20n2J17j2Q8r8J4J71p5j19L1J72k0j50
6990a7l2K85k97J83k02k9m7M4M0o2J47N3N3N5l15j8PP8L1M9j05L2R1o9o5L2L13
$$ plain form
7017 235 -240 -158 -61 114 -23 -5 -171 8 124 79 -145 -77 -173 -91 105 -133 -91 -54 -56 -236 -28 -133 54 -229
7041 -229 -23 35 87 -17 -83 81 -55 75 -451 -141 -218 -17 140 -57 90 67 -141 -10 -79 -156 -275 -97
7063 -97 -43 -183 105 22 21 -35 120 -42 -221 -116 -31 -54 -121 3 -54 -152 99 -59 -122 -14 -51 -226 133 225 -31
7088 -31 -85 129 17 0 199 -41 -182 83 138 45 -2 -54 36 53 101 254 82 -125 3 -62 -19 -43 -11 67 66 -112
7114 -112 81 128 104 -15 24 -34 -56 -32 -60 214 3 28 -201 20 94 -104 -158 -38 -28 -179 7 -30 -132 13
7138 13 83 156 2 59 11 104 -37 68 -143 208 0 133 -127 -257 -31 -88 176 -242 -123 86 -121 58
7160 58 -262 -166 -2 -119 -202 -150 -112 74 -220 -173 -25 -216 -173 -178 -19 -141 41 42 -168 -58 55 106 102 127 -43
7185 -43 -30 152 -24 118 -54 128 57 -8 -73 -101 203 91 96 -28 29 283 -73 -116 -43 -151 -48 -163 66 159
$$ packed form
7017B35m75Q2R7J75j37J8j66J79J16m5k24O8r6Q2J96k38M2L7kj80K08j05J87k83
7041b29K06N8N2j04o6J64j36J30n26L10p7K01J57j97J47k3k08J31o9p7j19J78
7063i7N4j40K88q3jn6J55j62j79J05Q5k3o7J24n7r8K51j58o3J08l7j75L59R2k56
7088c1n4K14j12j7J99k40j41K65N5r3m7n2R0J7M8J53j72k07J28o5M3k4L2P8jj78
7114a12J93M7k4j19L9n8k2K4k8K74k11K5k29K21P4j98n4J20J0j51J86l7j02J45
7138A3P0P3j54N7m8R3j41J05k11L51k08J33k60j30K26n7K64m18J19K09k07J79
7160E8l20R6J64j17q3N2L8J86k94M7J48j91M3nJ59j22J82Jk10J10J13N1mK5j70
7185d3J3J82j76J42j72J82p1o5o5k8L04j12Nj24N7K54l56m3P3j08J03j15K29R3
$$ plain form
7209 159 32 54 142 -25 -100 13 212 230 110 -26 -177 -154 -15 146 -191 -77 145 89 196 -65 104 -13
7231 -13 22 57 243 -10 -66 20 -111 -79 -345 211 14 43 396 -5 -145 32 80 28 99 45 -256 166 3 -8
7255 -8 99 68 2 -101 -90 69 36 67 -215 -30 140 42 138 60 188 -107 -43 156 128 -70 -153 -26 -42 -23 -189
7280 -189 25 22 -243 281 264 128 -75 95 36 108 -35 -8 44 -22 -84 -23 54 126 -165 -68 158 20 -11 -69 -84
7305 -84 -191 -177 -10 -223 -20 -20 162 -56 49 143 -256 40 25 -48 96 131 -95 -243 -103 -203 88 209 269
7328 269 -19 -62 -169 112 -69 221 146 -184 -126 -154 308 17 -179 -57 18 -151 131 -82 90 -129 -135 -28
7350 -28 -42 -13 -236 -330 -119 57 125 -105 -205 -1 -127 25 -45 68 -76 279 -206 137 119 135 68 -93 43
7373 43 -168 -41 124 -46 -342 -36 -104 178 -39 174 211 30 -14 40 -16 -226 112 -247 -85 -20 128 48 -3
$$ packed form
7209A59j27K2Q8j67p5J13J99J8j20j36j51K3J39J61l37J14K22n6J07k61J69j17
7231a3L5L5J86k53n6Q6j31L2k66N56j97K9L53m01j40J77M8n2P1n4l01M22j63j1
7255hJ07l1o6j03J1J59l3L1k82J85J70r8R6p8J28k95O4J99k8j98q3J27j6J9j66
7280a89K14lk65N24j7j36k03J70n9P2j43K7N2o6o2O1P7P2k91R7K26j38l1n8j5
7305h4j07J4J67k13K03%J82k18J05R4l99K96j5p3J44L5k26j48J40j00K91J21O0
7328B69k88m3j07K81j81K90p5l30N8k8M62k91j96J22P5j69K82k13J72k19oJ07
7350b8j4K9k23r4K11J76O8k30j00K04j26J52p0J13j44L55m85L43j8J6o7j61J36
7373D3k11J27J65j70k96L06o8K82k17K13L7j81m4N4n6k10L38l59J62O5J48q0n1
$$ plain form
7396 -3 -143 28 -102 95 66 121 -8 -21 -49 272 -35 -227 141 19 -144 73 246 179 -103 -106 -120 52 162
7419 162 -80 -193 -70 65 17 -50 10 42 211 38 -42 67 -128 217 -54 -167 -62 -49 85 -65 -217 -24
7441 -24 36 -136 -4 -230 -153 134 -100 312 33 157 55 -96 -29 -175 78 89 233 -76 -91 -71 76 -218
7463 -218 -66 76 -47 -50 258 -142 -31 86 0 -127 -44 -210 -44 -54 -31 44 -86 27 157 105 -108 -10 31
7486 31 -134 31 -4 -91 116 175 -101 75 10 -180 -107 -71 41 151 164 -238 24 50 162 91 -83 -163 42 -119
7510 -119 -48 -89 -12 49 99 -158 86 17 -266 -73 -30 33 -88 -132 229 42 7 148 -65 -187 -108 -26 3 67 39
7535 39 -140 -8 22 -261 67 418 -36 19 -14 109 -29 36 -82 92 -18 -23 -21 132 -44 105 228 120 -53
7558 -53 -155 255 -25 -26 284 82 23 95 227 -46 -291 -31 34 -103 134 -52 43 64 19 103 -80 -65 114 -42
$$ packed form
7396cj40J71j30J97k9N5j29j3k8L21l07j92L68j22j63K17J73o7k82lj4J72J10
7419A62k42j13J23J35m8o7O0L2J69j73q0J09j95L45k71j13J05J3J34j50j52J93
7441b4O0j72J32k26P7K87k34M12k79J24j02j51O7j46K53J1J44l09j5K0J47k94
7463b18J52J42j23lL08m00J11J17q6j27Q3j66J66j0K3P5j30J13J30n2k13R8M1
7486C1j65J65l5q7K07N9k76J76o5j90P3L6J12J10J3m02K62K6J12p1j74q0K05j61
7510a19P1m1P7O1N0k57K44o9k83J93M3O3j21m4L61j87l5J41k13j22P9Q2K9O4k8
7535C9j79J32L0k83L28L51m54N5l3J23j38O5j18J74j10nKJ53j76J49J23j08j73
7558e3j02M10k80jL10k02n9P2J32k73k45K60O5j37K37j86R5K1m5Q4j83J5J79j56
$$ plain form
7582 -42 108 -101 75 85 -96 -50 -232 -44 -46 -16 -142 -155 18 92 -182 194 -10 -130 -266 -333 -94 -120 -10
7605 -10 -131 -18 63 -115 61 98 80 12 46 -216 185 -14 -168 -70 -55 -71 128 -32 -116 116 145 12 -257 127
7629 127 -136 -180 -277 -21 -228 105 39 -59 264 -27 100 130 71 61 57 32 85 45 93 175 -88 2 17 -166 -140 -49
7655 -49 -193 71 76 110 43 71 166 -246 143 15 -48 95 61 -208 -96 -44 291 -311 132 -107 -85 -37 -137 35
7679 35 -55 197 -241 36 -4 78 221 -115 -6 -44 73 -188 -42 -68 -124 37 119 -30 37 -105 -48 -3 -171 -66
7703 -66 -49 -16 64 -89 199 1 -167 -89 -98 181 199 -133 55 -27 62 224 -88 174 319 15 -274 -258 2 -38
7727 -38 -54 55 -87 -35 -60 197 -9 -97 198 -188 -159 -198 52 -94 -141 -301 -261 23 -155 67 -187 183 -77
7750 -77 9 73 -77 73 150 114 -24 107 -245 156 -34 -18 50 -339 41 186 -69 -62 180 15 -92 -31 -17 -24
$$ packed form
7582d2J50k09J76J0j81M6j82J88kL0j26j3J73P4k74L76k04j20j36o7K39k6J10
7605a0j21J13Q1j78J76L7j8o8L4k62M01j99j54R8J5j6J99j60q4K32K9j33k69L84
7629A27k63m4r7K56k07L33o6r8L23k91J27L0n9j0mk5N3m0M8Q2k63R0J5j83K6R1
7655d9j44K64NL4o7K8R5m12L89j28o3J43l4k69J12N2L35o02M43k39K2M8j00J72
7679C5r0K52m38K77m0Q2J43l36J09l8J17k61J46k6n6J61Q2j49O7j42N7M5j68J05
7703f6J7L3Q0j53K88j98j68P8rK79J8l32J88q2Q9J62l12K62J45l04k89J6K60m0
7727c8j6J09j42N2k5K57k06q8K95l86K9l9K50j46m7j60M0K84j78K22k54L70k60
7750g7Q6O4j50J50P7l6j38J31l52M01j90J6O8l89L80J45k55PK42j65j07O1J4p
$$ plain form
7774 -24 82 -75 123 28 -369 -177 -216 91 61 185 120 226 15 -35 -184 275 -47 46 -24 -3 37 -117 -173 30
7798 30 -179 183 70 -39 80 46 71 85 -220 -6 112 -97 -1 -19 -61 114 -44 -107 5 -133 -10 74 -9
7821 -9 -154 -10 35 -39 125 242 173 -213 139 2 83 59 -81 67 -139 -59 176 122 -216 31 -180 -27 -3
7844 -3 -242 41 -54 320 15 -224 17 25 71 87 -8 59 165 -287 -66 94 -124 -15 -225 -85 80 158 77 -119
7868 -119 184 -201 245 -112 -52 -47 96 2 -184 70 18 250 -175 -157 -197 295 -28 -159 -146 22 276 -114 125
7891 125 -153 -50 102 89 -87 -190 -119 -179 -170 -103 8 10 73 -167 -5 133 118 62 49 166 185 111 64 -108 35
7916 35 102 -197 -6 -32 -6 -69 -146 -147 -145 -217 117 52 186 -107 9 -39 -162 58 9 -50 -129 -66 129 114 -106 117
7942 117 253 -17 -33 -96 -223 42 -42 12 17 288 167 88 -36 25 132 -66 -221 -27 -238 -157 17 -53 -73 13
$$ packed form
7774b4J06j57J98r5l97J92l9L07l0J24o5J06k11n0j49M59l22R3p0K1M0j54n6K03
7798C0k09L62j13j09J19l4K5J4l05K14J18k09R6j8m2J75j58o3J12j38J23Q4q3
7821ij45J44M5p4J64J17o9l86L52j37Q1k4j40J48k06Q0K35n4l38K47k11J53K4
7844ck39K83r5L74l05k39K41QM6J6r5O7J06m52K21J60k18J09k10J40J65P8q1j96
7868a19L03l85M46l57O0NJ43r4j86K54n2K32m25J8m0M92l23j31J3J68K54l90K39
7891A25k78J03J52j3j76j03P1o0RO7J11KO3k40J62J38j5n6j3J17J9p4m7j72J43
7916C5O7k99J91k6K6o3p7jKp2L34o5J34k93J16m8j23K20m9n9p9O3J95j5k20K23
7942A17J36k70j6o3j27K65q4N4NK71j21p9j24O1J07j98j55J94k11Q1J74p0k0Q6
$$ plain form
7966 13 229 -68 173 -18 26 0 87 -163 -120 -69 -57 -26 88 102 317 149 -47 194 61 56 -11 12 -126 -63 63
7991 63 -194 -54 -110 -43 -8 78 -217 -79 45 -50 90 -155 25 159 -300 -216 69 124 156 2 -202 61 40
8014 40 -98 -130 -32 -162 0 93 -205 -244 -40 55 47 -36 -46 113 220 307 -40 -193 -48 -250 -104 -32 12 344
8038 344 130 -72 -82 -113 -149 263 10 33 200 207 -108 -107 116 65 102 130 -21 -113 -349 28 -72 183 56 0
8062 0 11 47 31 106 -181 -154 205 -110 112 -117 -136 -91 18 17 -54 -261 16 238 82 90 129 54 378 237 57
8087 57 -21 -47 19 -212 220 -193 -107 341 110 127 -12 7 204 17 57 -79 66 -125 140 -131 -125 -127 -65 -295
8111 -295 -27 -33 6 170 187 142 99 40 -121 -202 -79 -41 120 -161 -161 -127 -61 33 -180 104 -77 -53 131 13 -109
8136 -109 75 3 120 204 24 43 -8 52 82 16 37 -11 -234 113 -57 13 258 360 97 -112 -267 -18 18 -142
$$ packed form
7966A3K16k97K41j91M4k6Q7k50M3N1J2L1J14J4K15j68j96K41j33no7K3j38O3J26
7991F3k57J40n6O7L5Q6k95J38J24r5J40k45J80J34m59Q4K85N5L2j54k04K63k1
8014D0j38l2R8j30J62R3k98l9K04R5qq3j0J59J07Q7l47j53J45k02J46P2M4L32
8038C44k14k02j0l1l6M12k53K3J67Pl15JK23n1L7K8j51r2k36L77j00K55j27n6
8062@J1L6j6P5k87K7L59l15K22k29j9M5J09jp1k07K77K22j56QL9p5L24j41j80
8087E7p8k6O6k31M32m13Q6M48k31J7j39J9J97j87M0j36J45j91K65k71OkO2k30
8111b95K68oL9J64J7m5m3n9j61q1J23L8J61k81%L4O6R4k13K84j81K4J84j18j22
8136a09J84p2J17Q4j80J9n1O0L0o6K1m8k23L47j70P0K45J02k63k09j55K49L6j60
$$ plain form
8160 -142 79 -142 -84 -15 -324 272 182 -141 217 -13 -105 100 -109 75 55 162 -73 49 163 128 -110 65
8182 65 153 104 -95 2 -220 251 -235 240 37
$$ packed form
8160a42K21k21N8O9l09N96r0l23L58k30r2K05k09J84k0J07k35J22J14l5k38J75
8182F5Q8m9j99R7k22M71m86M75k03
8191C7
$$ Imaginary data points
##PAGE= N=2
##DATA TABLE= (X++(I..I)), XYDATA
$$ plain form
0 0 0 0 0 0 0 0 0 0 0 0 0 0 0 -8 8 -8 8 -8 16 -16 16 -24 24 -32 40 -42 48 -58 68 -76 88 -101 116 -130 148
35 148 -166 188 -211 236 -262 293 -325 362 -398 443 -491 539 -595 656 -721 795 -878 967
53 967 -1065 1177 -1302 1443 -1604 1790 -2008 2267 -2583 2973 -3473 4139 -5075 6492 -8899
68 -8899 13997 -48411 193552 316031 -20724 -250500 -147185 143863 177166 -73204 -210505
79 -210505 7592 218275 112837 -173970 -245084 17518 275149 141419 -173245 -215994
89 -215994 31761 197828 75850 -157114 -142486 114507 202983 -30587 -220312 -98794
99 -98794 155491 203345 -24766 -216268 -93207 144213 147862 -52736 -160793 -31222 157137
110 157137 109898 -123916 -175784 38112 192619 82779 -131052 -164082 37632 184679
$$ packed form
0@%%%%%%%%%%%%%qJ6j6J6j6K4l2L2m0M8n6P2q2R0j06J26j44J64j89K17k46K78
35A48l14L54l99M47m98N55o18O87p60Q41r34J030j134J251j377J516j673J845
53I67k032K242k479K745l047L394l798M275m850N556o446P612r214J1567j5391
68h899K2896o2408K41963J22479l36755k29776J03315K91048L3303k50370j37301
79b10505K18097K10683j05438k86807p1114K62602K57631j33730l14664m2749
89b15994K47755J66067j21978k32964J4628K56993Q8476k33570j89725J21518
99i8794K54285M7854k28111j91502J23061K37420L649k00598j08057J29571J88359
110A57137m7239k33814n1868K13896J54507j09840k13831l3030K01714J47047
$$ plain form
120 184679 53167 -139446 -101726 82476 142517 -1323 -149475 -75639 122469 143324 -36969
131 -36969 -152731 -58369 113874 128495 -47419 -150349 -16116 134579 73396 -90947 -123029
142 -123029 21173 144034 58134 -116758 -116041 47904 132018 32865 -105408 -89452 62838
153 62838 119638 -6868 -115460 -50231 85014 105353 -24366 -128035 -41450 109387 91167
164 91167 -56299 -111309 -8305 101646 61570 -73948 -99355 23877 105084 33714 -82936
175 -82936 -87030 33368 109128 21807 -94915 -63955 55394 89866 -1420 -91515 -46494 76119
187 76119 86911 -32335 -97127 -18774 83983 68442 -44428 -90028 -329 85023 42092
198 42092 -55541 -72312 12804 84291 31386 -73740 -68212 38137 82678 8719 -74894 -51132
$$ packed form
120A84679j31512j92613L7720J84202O0041j43840j48152P3836J98108K0855j80293
131c6969j15762R4362J72243J4621j75914j02930J34233J50695o1183j64343l2082
142a23029J44202J22861q5900j74892P17J63945Q4114r9153j38273J5956J52290
153F2838N6800j26506j08592O5229J35245K0339j29719j03669Q6585J50837j8220
164I1167j47466n5010J03004J09951m0076j35518k5407J23232Q1207p1370j16650
175h2936m094J20398P5760q7321j16722L0960J19349L4472r1286r0095M5021J22613
187G6119J0792j19246o4792P8353J02757j5541j12870m5600Q9699Q5352m2931
198D2092r7633j6771Q5116P1487n2905j05126N528J06349M4541p3959q3613K3762
$$ plain form
210 -51132 48840 77039 -10913 -78167 -26632 62120 62067 -25577 -76488 -11636 72563 48570 -40573
223 -40573 -64949 1166 66366 38609 -48510 -63756 19416 71449 16512 -60899 -50492 32899
235 32899 68313 600 -67074 -33538 43653 54779 -10570 -61474 -22781 53631 49446 -27458
247 -27458 -58917 -4400 55285 39559 -32206 -57385 5426 61404 26052 -44025 -47254 18815
259 18815 59176 11215 -54132 -36514 33171 49647 -2623 -50061 -28891 34927 48270 -12734
271 -12734 -53591 -14179 42458 37480 -21431 -50830 -4282 50560 29416 -32418 -43405 7737
283 7737 49038 20928 -39026 -38191 21892 46559 3392 -39479 -27199 23382 42901 -1453 -45880
296 -45880 -21513 32102 36178 -12043 -44840 -13169 38574 30015 -24868 -40529 643 38069
$$ packed form
210e1132R9972K8199q7952o7254N1535Q8752n3q7644n0911O4852Q4199k3993q9143
223d0573k4376O6115O5200k7757q7119j5246Q3172N2033n4937p7411J0407Q3391
235C2899L5414o7713o7674L3536P7191J1126o5349n0904L8693P6412m185p6904
247b7458l1459N4517N9685j5726p1765k5179O2811N5978l5352p0077l229O6069
259A8815M0361m7961o5347J7618O9685J6476n2270m7438K1170O3818J3343o1004
271a2734m0857L9412N6637m978n8911k9399M6548N4842k1144o1834j0987N1142
283G737M1301k8110n9954Q35O0083K4667m3167m2871J2280N0581J9519m4354m4427
296d5880K4367N3615M076m8221l2797L1671N1743q559n4883j5661M1172L7426
$$ plain form
308 38069 22335 -26723 -38166 9385 42532 10927 -32477 -26211 15929 36735 6081 -35252
320 -35252 -23071 24206 34565 -4143 -36934 -17799 28905 31840 -15630 -38428 -3996 30667
332 30667 19799 -18791 -33507 -652 34511 15815 -26566 -28236 8875 31892 10149 -28003
344 -28003 -24530 16678 31580 812 -28645 -17319 19707 31028 -5814 -34384 -8825 27389
356 27389 20260 -13302 -27761 -4899 25786 17402 -19156 -27244 2566 26047 11810 -22085 -26204
369 -26204 9573 29054 2833 -25173 -16433 12917 25377 844 -27475 -13430 21971 21688 -8731
382 -8731 -24432 -6688 20610 18660 -12515 -24756 -710 21147 12438 -14866 -24345 1828 25962
395 25962 6690 -23290 -17750 9383 19788 2528 -21513 -16497 13912 21458 -4091 -21613 -8338
$$ packed form
308C8069j5734m9058j1443M7551L3147l1605m3404O266M2140K0806l0654m1333
320c5252J2181M7277J0359l8708l2791J9135M6704K935m7470k2798L4432L4663
332C0667j0868l8590j4716L2855L5163j8696m2381j670L7111K3017k1743l8152
344b8003L473M1208J4902l0768k9457J1326L7026J1321l6842k8570K5559L6214
356B7389p129l3562j4459K2862L0685q384l6558q088K9810K3481j4237l3895m119
369b6204L5777J9481k6221k8006Q740K9350J2460k4533k8319J4045L5401k83l0419
382h731j5701J7744K7298j950l1175j2241K4046K1857q709k7304r479K6173K4134
395B5962j9272k9980N540K7133J0405j7260k4041N016L0409P546k5549j7522J3275
$$ plain form
408 -8338 15617 18725 -6731 -22782 -3166 19527 13031 -9187 -18898 -2624 20959 12428 -17422
421 -17422 -18834 7588 18629 3564 -16402 -15758 8114 19538 -604 -19118 -10349 10112 16770
434 16770 -1472 -20638 -7544 17264 13234 -8510 -15574 -3188 15085 14281 -10063 -18512 3957
447 3957 18734 5489 -12463 -13366 5018 17870 2758 -16382 -10229 7591 13471 1804 -15979
460 -15979 -12125 11790 15119 -6679 -15899 -2965 10554 11135 -5215 -16668 -1002 16462 7612
473 7612 -9829 -11686 2219 15677 6912 -12837 -10731 7983 12687 2661 -9708 -10891 6370
486 6370 16529 -889 -16009 -4659 9956 9584 -2677 -12834 -4186 12767 8891 -7687 -10551
499 -10551 280 11364 9207 -8193 -12690 5355 14092 2869 -7346 -6977 2984 13886 4959
$$ packed form
408h338K3955L108k5456j6051J9616K2693o496k2218r711J6274K3583q531k9850
421a7422j412K6422J1041j5065j9966O44K3872J1424k0142j8514Q769K0461O658
434A6770j8242j9166J3094K4808m030k1744p064J2386J8273q04k4344q449K2469
447C957J4777j3245j7952r03J8384J2852j5112j9140O153J7820N880j1667j7783
460a5979L854K3915L329k1798r220J2934J3519N81j6350j1453J5666J7464q850
473G612j7441j857J3905J3458q765j9749K106J8714M704j0026j2369j183J7261
486F370J0159j7418j5120J1350J4615l72j2261j0157Q648J6953l876j6578k864
499a0551J0831J1084k157j7400m497J8045Q737j1223j0215L69R961J0902q927
$$ plain form
512 4959 -12167 -6899 9503 10096 -918 -9839 -5304 9360 9862 -5883 -10316 -414 7873 6858
526 6858 -4130 -12688 -920 13077 4433 -9235 -7285 1836 8947 5436 -8120 -9137 5925 10306
540 10306 136 -7428 -4989 6313 10131 -2231 -10589 -909 7762 5109 -2196 -9110 -4167 9557
554 9557 7298 -7931 -9279 1406 7413 3948 -6069 -8987 2481 9151 1040 -6467 -4495 3437
568 3437 8536 1423 -8740 -2899 8552 6367 -2028 -5641 -2335 6362 8649 -3239 -9043 243
582 243 8178 4649 -3803 -7513 412 8187 2053 -6091 -4643 1785 5931 2700 -6510 -5532 5829
597 5829 7495 -1961 -5915 -1649 4732 6829 -402 -7276 -1580 7080 5613 -2225 -6247 -976 7406
612 7406 4359 -5207 -4838 2032 4470 1662 -3902 -5621 1857 6840 -206 -6790 -2920 3720 5245
$$ packed form
512D959j7126N268J6402N93j1014q921M535J4664N02j5745m433R902Q287j015
526F858j0988q558J1768J3997q644j3668J950R121P111l511j3556j017J5062M381
540A0306j0170p564K439J1302L818j2362q358R680Q671k653p305o914M943J3724
554I557k259j5229j348J0685O007l465j0017k918J1468O670q111p507J972P932
568C437N099p113j0163N841J1451k185q395l613L306Q697K287j1888n804R286
582B43P935l529q452l710P925P775o134q144J448O428M146l231r210R78J1361
597E829J666r456l954M266O381K097p231o874N696Q660j467p838m022N271Q382
612G406l047r566L69O870K438k808n564j719P478M983p046o584L870O640J525
$$ plain form
627 5245 -420 -6338 -2551 5035 5142 -1134 -4850 -2134 5428 5726 -2655 -5504 1874 5423 2069 -2462
643 -2462 -3505 777 5543 1986 -4647 -3658 2557 5057 371 -5750 -3404 4117 4153 -1274 -4073 -2277
659 -2277 2910 4795 -1154 -5447 -295 5366 2779 -2226 -3210 767 4949 2620 -3250 -3028 1570 4527
675 4527 1890 -4139 -3974 2841 5047 -1245 -4423 -2086 1640 3322 -556 -5162 -2258 3339 2668 -2242
691 -2242 -3988 -913 3913 2344 -3058 -3071 1260 3102 1569 -1539 -3943 1176 5315 645 -4161 -1738
707 -1738 2151 2601 302 -3579 -2611 2390 2613 -1533 -3612 -1932 2397 2699 -2514 -4397 442 2495
723 2495 221 -1680 -2875 -846 3734 1951 -3349 -2696 2104 2937 581 -2314 -2292 2210 3167 -672
739 -672 -2326 -1106 1144 2932 -254 -4148 -1223 3235 662 -2462 -2063 -906 1500 2074 -2672 -3480
$$ packed form
627E245n665n918L787P586J07o276l716K716P562K98q381k849P378L549l354m531
643b462j043M282M766l557o633R89O215K500m686o121K346P521L6n427k799J796
659b277N187J885n949m293N152N661k587n005r84L977M182k329n870K22M598K957
675D527k637o029J65O815K206o292l178K337L726J682l878m606K904N597o71m910
691b242j746L075M826j569n402j3M331J842j533l108k404N119M139m670m806K423
707a738L889M50k299l881R68N001K23m146k079J680M329L02n213j883M839K053
723B495k274j901j195K029M580j783n300O53M800Q33k356k895K2M502R57l839
739f72j654J220K250J788l186l894K925M458k573l124L99J157K406N74m746q08
$$ plain form
755 -3480 531 2441 569 -2075 -2606 1050 3280 -482 -2693 -336 1525 1470 1144 -2355 -2256 2660 2373
772 2373 -1934 -2434 -110 1372 1566 -1274 -3243 -322 1985 390 -1877 -2417 -690 2459 860 -3637
788 -3637 -1694 1732 962 4 -1131 -1735 870 3138 -398 -2655 27 1902 1572 -441 -2324 -375
804 -375 2301 590 -1301 -1464 -647 1115 1624 -2026 -3056 1319 1547 -1025 -1264 -1010 -407 1745 220
821 220 -2321 -944 1219 1273 201 -1713 -893 2384 1830 -1670 -843 312 886 1375 46 -2484 140
838 140 2822 4 -1856 -1049 423 909 392 -1917 -1185 1033 791 -134 -1400 -1861 1235 2372 -1096
855 -1096 -1962 768 997 386 438 -1075 -404 2115 1362 -1235 -930 605 1606 968 -1356 -1101 1330 1244
873 1244 -279 -500 -923 -369 1961 118 -2708 -511 1620 144 -615 -575 -510 885 1586 -845 -889 759
$$ packed form
755c480M011J910j872k644n31L656K230l762k211K357J861n5l26l499R9M916k87
772B373m307n00K324J482J94k840j969K921K307j595k267n40J727L149j599m497
788c637J943L426p70r58j135o04K605K268l536k257K682J875l30k013j883J949
804c75K676j711j891j63Q17J762N09l650j030M375K28k572k39K54O03K152j525
821B20k541J377K163N4j072j914Q20L277n54l500Q27J155N74M89j329k530K624
838A40K682k818j860Q07J472M86n17k309P32K218k42r25j266m61L096J137l468
855a096q66K730K29o11N2j513O71K519p53k597L05J535J001o38k324K55K431q6
873A244j523k21m23N54K330j843k826K197K131j476p59M0O5J395P01k431m4J648
$$ plain form
891 759 1160 1500 -342 -1524 746 2125 -248 -541 181 128 842 1357 -1361 -1703 1504 971 -750 -1009
909 -1009 -370 466 654 -932 -1426 155 420 117 140 -1117 -539 2073 720 -1435 -2 910 240 1088
927 1088 -33 -1106 589 1521 -243 -750 -231 682 1290 -61 -1591 -89 1117 -280 -232 -278 -981 603
945 603 1448 -1075 -1488 956 936 -81 -76 -379 127 1506 374 -488 -114 759 1299 874 -859 -415 1916
964 1916 961 -875 118 284 -140 1051 171 -1256 -78 1165 52 -463 -399 -69 501 381 -828 -209
982 -209 624 355 556 -85 -887 1140 1725 -567 -630 1051 490 422 721 -403 -695 1087 613 -311 -464
1001 -464 -271 402 383 -690 -631 603 218 -462 -194 -653 -116 1048 444 -1125 -53 905 531 34 -89
1020 -89 -309 542 916 291 -7 182 361 1062 -147 -870 628 672 -727 -768 52 -287 107 447 -689 -906
$$ packed form
891G59M01L40j842j182K270J379k373k93P22n3P14N15k718l42L207n33j721k59
909a009O39Q36J88j586m94J581K65l03K3j257N78K612j353k155J433R12o70Q48
927A088j121j073J695R32j764n07N19R13O08j351j530J502J206j397M8m6p03J584
945F03Q45k523m13K444k0j017Nl03N06J379j132q62L74Q73N40m25j733M44K331
964A916r55j836R93J66m24J191q80j427J178J243j113n15O4L30N70j20j209O19
982b09Q33k69K01o41q02K027N85k292o3J681n61o8K99j124k92J782m74r24j53
1001d64J93O73j9j073N9J234l85o80K68m59N37J164o04j569J072R58l74m97j23
1020h9k20Q51L74o25k98J89J79P01j209p23J498M4j399m1Q20l39L94L40j136k17
$$ plain form
1040 -906 355 651 -23 -566 -361 333 444 -29 -119 81 -68 530 536 -420 87 926 215 -684 11 635 459
1061 459 135 -144 -467 19 272 107 -191 -785 -101 444 -263 -712 -181 -468 -83 -80 -251 -463 293 561 -307
1082 -307 -389 101 725 275 -745 3 412 476 385 203 -776 -208 746 305 -827 -312 213 -36 -318 -346 -530
1103 -530 -317 -70 -440 -443 -141 220 341 -429 -566 470 476 -135 -109 68 -525 429 978 -319 -610 358 341
1124 341 128 -114 -360 230 -14 -553 -242 257 -192 138 5 -1112 -487 611 -57 -961 254 -257 -50
1143 -50 252 -69 -749 261 599 137 124 -230 255 598 -147 -468 803 298 -338 443 -99 -678 375 629
1163 629 -942 -484 127 -82 -47 -80 -746 -153 35 -31 40 -21 -587 293 484 -689 -156 815 -123 -360 371
1184 371 3 -98 621 26 -351 50 454 103 46 -111 -241 312 100 -391 -17 -317 -334 386 -442 -796 190
$$ packed form
1040i06J261K96o74n43K05O94J11m73r0K00j49N98Or56N07Q39p11q99O95O24j76
1061D59l24k79l23M86K53j65k98n94O84N45p07m49N31k87L85Lj71k12P56K68q68
1082c07q2M90O24m50j020P48M09O4r1j82r79N68R54m41j132N15N25k49k82k8j84
1103e30K13K47l70lL02L61J21p70j37J036Oo11K6J77n93R54N49j297k91R68j7
1124C41k13k42k46N90k44n39L11M99m49L30j33j117O25J098o68r04J215n11K07
1143e0L02l21o80J010L38m62j3l54M85L43p45l21J271n05o36P81n42n79J053K54
1163F29j571M58O11k09L5l3o66N93J88o6P1o1n66Q80J91j173N33R71r38k37P31
1184C71l68j01P19n95l77M01M04l51n7j57j30N53k12m91L74l00j7P20q28l54R86
$$ plain form
1205 190 463 -854 -102 301 -70 -72 497 -592 33 703 193 60 -245 -107 339 391 -387 -98 380 -98
1225 -98 406 625 -423 -645 556 -181 -679 238 36 -252 37 -286 -253 36 -132 47 66 -125 87 912
1245 912 19 -525 565 523 -257 350 374 -230 315 633 -341 -91 276 -40 148 -284 -298 123 324 -212 20
1266 20 96 -388 306 306 -523 -256 595 -40 -324 525 266 -230 416 457 42 482 176 360 73 -298 36 440
1288 440 -220 -455 141 -160 -475 489 -340 -661 122 157 -227 -68 252 40 125 -139 -198 173 80 -5 406 222
1310 222 21 456 538 -184 -97 354 -41 -22 678 -193 60 560 -114 -456 35 144 88 -84 -452 258 412
1331 412 -258 -435 123 -195 15 575 -39 -696 195 519 -292 313 165 -124 445 391 -153 40 71 57 288
1352 288 -313 4 253 -53 -325 107 156 -594 2 48 -196 -76 327 -79 -125 -159 -90 193 72 -120 129 312
$$ packed form
1205A90K73j317P52M03l71kN69j089O25O70n10j33l05J38M46N2p78K89M78m78
1225i8N04K19j048k22J201p37m98R17k02k88K89l23L3K89j68J79J9j91K12Q25
1245I12q93n44J090m2p80O07K4o04N45L18r74K50L67l16J88m32j4M21K01n36K32
1266B0P6m84O94%q29K67Q51o35k84Q49k59m96O46M1m15M40l06J84k87l71L34M04
1288D40o60k35N96l01l15R64q29l21P83L5l84J59L20k12Q5k64n9L71r3q5M11j84
1310B22k01M35Q2p22Q7M51l95J9P00q71K53N00o74l42M91J09n6j72l68P10J54
1331D12o70j77N58l18K10N60o14o57Q91L24q11O05j48k89N69n4n44J93L1j4K31
1352B88o01L17K49l06k72M32M9p50N96M6k44J20M03m06m6l4O9K83j21j92K49J83
$$ plain form
1374 312 -270 260 227 -230 206 460 -230 -277 477 -17 -280 207 127 -218 116 64 -235 -164 23 -85 -91 -210
1396 -210 -161 206 -119 -399 -108 158 -296 343 89 -331 92 419 -212 102 474 187 82 355 415 37 345
1417 345 125 159 -116 -343 91 131 -406 -201 562 -203 -363 101 -52 -186 274 149 -107 -58 253 81 230
1438 230 -146 -90 288 253 -42 511 -93 -136 407 231 -431 167 127 -213 173 -68 -20 -277 93 -92 -24 -219
1460 -219 9 308 -250 -202 138 71 -171 -112 -52 -320 39 562 240 -103 363 173 173 149 85 -195 143 -66 -144
1483 -144 28 -363 -176 -91 -408 -164 137 -92 -161 119 -67 16 -21 -80 -297 -388 -55 -228 -27 -124 139 453
1505 453 33 139 417 56 -145 352 53 54 24 203 -375 -203 166 208 -4 -243 -236 -66 185 -78 65 -65
1527 -65 -112 112 96 -210 220 200 10 -91 51 17 -51 107 -7 2 13 185 207 10 -269 -81 104 -345 47
$$ packed form
1374C12n82N30l3m57M36K54o90m7P54m94k63M87q0l45L34n2k99P1J87j08oj19
1396b10M9L67l25k80K91K66m54O39k54m20M23L27o31L14L72k87j05K73O0l78L08
1417C45k20L4k75k27M34M0n37K05P63p65j60M64j53j34M60j25k56M9L11j72J49
1438B30l76N6L78l5k95N53o04m3N43j76o62N98m0l40L86k41M8k57L70j85O8j95
1460b19K28K99n58M8L40o7k42N9O0k68L59N23l22l43M66j90%k4o4k80L38k09p8
1483a44J72l91J87Q5l17K44L01k29o9K80j86Q3l7n9k17r1L33j73K01r7K63L14
1505D53m20J06K78l61k01M97k99Jl0J79n78J72L69M2k12k39PJ70K51k63J43j30
1527f5m7K24j6l06M30k0j90j01J42l4o8J58j14RJ1J72K2j97k79J88J85m49L92
$$ plain form
1550 47 -442 -563 -20 211 -121 -544 77 -309 -185 303 -76 -44 -260 43 -128 -2 -76 -27 -24 154 -114 813
1572 813 72 -385 130 16 -398 203 300 -288 143 -125 -95 47 -61 -237 -204 -15 -406 210 -45 -429 225
1593 225 151 -390 156 524 -257 -11 578 82 -237 362 116 -238 93 139 15 269 -21 -157 105 174 -334
1614 -334 454 -15 -298 -58 -74 -175 472 -2 -368 -44 207 -135 144 90 -296 -143 189 -7 379 162 -119
1635 -119 315 162 -287 224 183 -281 -22 351 -55 -104 303 -194 -155 198 -45 -187 286 -247 -28 25 -143
1656 -143 187 100 -233 -189 453 -375 -248 368 347 -438 356 145 -330 92 85 9 -171 -12 -8 102 87 -398 66
1679 66 -22 40 -197 47 -321 -149 355 -392 191 322 -184 -188 443 112 130 0 192 215 323 292 -27 278 -40
1702 -40 129 366 -239 -139 287 55 -220 272 -94 -541 231 101 -314 124 -67 102 -21 174 256 -204 -40
$$ packed form
1550D7m89j21N43K31l32m23O21l86J24M88l79L2k16L03j71J26p4M9LJ78k68R27
1572H13p41m57N15j14m14O01R7n88M31k68L0J42j08j76L3J89l91O16k55l84O54
1593B25p4n41N46L68p81K46N89m96l19N99k46l54L31M6j24K54k90j36K62O9n08
1614c34P88m69k83K40j6j01O47m74l66L24K51l42K79n4l86J53L32j96L86k17k81
1635a19M34j53m49N11m1m64K59L73m06m9M07m97L9L53k43j42M73n33K19N3j68
1656a43L30q7l33M4O42q28J27O16k1p85P94k11m75M22pp6j80J59MJ10j5m85M64
1679F6q8O2k37K44l68J72N04p47N83J31n06mO31l31J8j30J92K3J08l1l19L05l18
1702d0J69K37o05J00M26k32k75M92l66m47P72j30m15M38j91J69j23J95Q2m60J64
$$ plain form
1723 -40 -242 422 47 -338 290 348 -279 65 200 -95 71 219 159 110 285 -23 -121 216 -84 -127 -22 -138
1745 -138 -50 235 -421 254 240 -218 -176 136 164 -216 442 202 -197 124 -140 -16 129 -136 51 9 -154 -169
1767 -169 163 39 201 1 327 -89 -187 -47 -131 -37 92 -260 -256 202 -163 -68 113 216 93 108 113 238 139
1790 139 -179 328 187 -48 -51 207 29 171 122 -82 -115 182 -168 -167 69 17 -115 -58 101 -59 205 -53 -6
1813 -6 287 -81 187 -123 -103 -410 75 280 130 -97 424 84 108 104 26 -42 -57 73 -5 124 103 -81 143 8
1837 8 -140 85 86 -38 -1 -83 -193 121 52 -16 285 -232 -136 209 -160 167 133 75 5 -61 181 131 81 -72 -216
1862 -216 130 171 45 0 -188 -88 139 20 46 -61 63 -23 104 -77 -218 -68 -80 -148 117 6 -58 105
1884 105 -156 -87 152 148 -15 -204 -90 175 1 -109 211 220 32 -25 -15 158 -111 83 287 -139 -197 82 97
$$ packed form
1723d0k02O64l75l85O28N8o27L44J35k95J66J48o0m9J75l08r8L37l00m3J05j16
1745a38Q8K85o56O75j4m58M2L12K8l80O58k40l99L21k64J24J45k65J87m2j63j5
1767a69L32j24J62k00L26m16r8J40q4R4J29l52MM58l65R5J81J03j23J5NJ25r9
1790A39l18N07j41k35lK58j78J42m9k04l3K97l50JK36n2j32N7J59j60K64k58M7
1813fK93l68K68l10K0l07M85K05j50k27N21l40K4mp8o8j5J30p8J29k1j84K24j35
1837Hj48K25Jj24L7q2j10L14o9o8L01n17R6L45l69L27l4n8p0o6K42n0n0j53j44
1862b16L46M1j26m5j88J00K27j19K6j07J24q6J27j81j41J50j2o8K65j11o4J63
1884A05k61O9K39mj63j89J14K65j74j10L20Rj88n7J0J73k69J94K04m26n8K79J5
$$ plain form
1907 97 50 154 -109 -116 119 -68 -199 -120 -11 328 -47 -134 147 52 -124 -261 -30 -65 47 68 -37 -32 1 -58
1931 -58 -7 -87 110 -75 -6 -72 -346 75 -111 -14 -241 -165 122 149 91 -12 0 299 -58 -83 206 6 52 100
1955 100 302 -21 -258 15 -36 253 -93 75 117 -119 -139 56 -8 63 111 -301 -20 -94 -13 59 84 188 -280
1978 -280 -21 33 22 226 1 167 335 -20 -77 201 -73 -289 163 149 -28 140 112 33 57 -28 -153 -37 33
2001 33 -95 47 43 38 -297 194 -20 -79 89 -85 -6 63 -189 -60 230 -73 36 16 -82 -76 -101 82 117 35 -34
2026 -34 -41 178 138 219 301 -24 -165 228 3 -101 206 36 -213 -16 36 35 -252 181 -47 117 83 -120 -18
2049 -18 -48 -232 11 7 28 72 39 -294 -292 157 -36 69 66 51 108 95 153 -45 -49 -211 -180 26 186 -74 199 -108
2075 -108 -218 8 65 248 252 31 -120 1 63 8 -103 160 -14 -112 107 -168 19 68 -183 14 -150 -76 63
$$ packed form
1907I7m7J04k63pK35j87j31P9J09L39l75q7K81r5j76j37K31l5J12K1j05NL3n9
1931e8N1q0J97j85O9o6k74M21j86R7k27P6K87K7n8j03J2K99l57k5K89k00M6M8
1955A00K02l23k37K73n1K89l46J68M2k36k0J95o4P1M8m12K81p4Q1P2K5J04m68
1978b80K59N4j1K04k25J66J68l55n7K78k74k16M52j4j77J68k8p9K4q5j25J16P0
2001C3j28J42mnl35M91k14n9J68j74P9O9k52J29K90l03J09k0r8Ok5J83L5q2o9
2026c4pK19m0Q1Q2l25j41L93k25j04L07j70k49J97N2jk87M33k28J64l4k03J02
2049a8l0j84K43mK1M4l3l33KM49j93J05lj5N7j3N8j98mj62L1K06J60k60K73l07
2075a08j10K26N7J83Mk21j51J21O2n5j11K63j74r8K19k75J87M9k51J97j64P4J39
$$ plain form
2098 63 107 13 114 -119 -234 -86 24 -29 72 133 -134 -78 341 197 -198 -84 125 44 109 -63 -77 209 99
2121 99 5 66 -7 -391 198 -26 -263 -232 233 -313 -96 -22 -153 -129 -124 -185 67 4 -121 338 100 -80 148 292
2145 292 -49 26 61 -96 22 313 -83 -114 277 212 -207 -53 -83 61 -29 -73 -206 114 120 187 -96 -117 166 136
2169 136 103 8 -33 160 15 18 -235 28 206 18 119 -130 -142 -227 223 173 119 -97 292 34 -66 -64 -152 -103
2193 -103 -22 9 -65 -64 54 53 -197 100 40 -68 247 -9 170 -245 23 22 193 -153 96 135 25 -194 42 -78
2217 -78 78 250 -84 171 154 200 -169 43 -147 -107 -160 -19 -130 59 24 9 -84 12 64 -355 148 -164 169
2240 169 -152 167 26 188 68 129 -2 -54 159 80 -78 110 -124 -90 -169 -44 -150 20 69 -72 -166 -146 -377
2263 -377 -88 -179 -182 38 243 51 -122 117 -102 40 -113 -51 -45 47 -25 130 225 -122 -101 -27 -96 -59 42 -8 100
$$ packed form
2098F3M4r4J01k33j15J48J10n3J01O1k67N6M19j44l95J14K09q1O5j72j4K86j10
2121I9r4O1p3l84N89k24k37L1M65n46K17P4j31K4No1K52o3j25M59k38j80K28J44
2145B92l41P5L5j57J18K91l96l1L91o5m19J54l0J44r0m4j33L20OO7k83k1K83l0
2169A36l3r5m1J93j45Lk53K63J78j88J01k49j2q5M50n0n4k16L89k58j00Kq8M9
2193a03Q1L1p4JJ18jk50K97o0j08L15k56J79m15K68jJ71l46K49L9j10k19K36j20
2217g8J56J72l34K55j7M6l69K12j90M0n3J41j11J89l5j5r3R6N2m19N03l12L33
2240A69l21L19j41J62j20O1j31n2K13p9j58J88k34L4p9J25j06J70M9j41r4K0k31
2263c77K89r1lK20K05j92j73K39k19J42j53O2OR2p2J55R5l47K1P4o9L7J01n0J08
$$ plain form
2288 100 96 5 -226 104 138 -128 12 -267 167 80 -266 164 94 -67 70 -51 101 -36 -100 -76 130 -41 15
2311 15 141 -34 -47 67 -108 -179 -23 -8 -169 -145 125 59 -71 -158 -257 228 156 137 -258 -7 -127 -131 202 40
2335 40 -90 55 -128 -124 84 86 26 -3 -178 129 -41 -101 -120 -15 110 -268 43 134 24 -186 -162 -67 15 -97
2359 -97 125 -26 238 -25 92 62 -192 3 123 -81 -54 26 188 155 -16 155 11 9 -144 151 174 -220 -84
2382 -84 40 -212 -166 -83 -186 -95 105 130 -11 -309 167 150 9 -113 165 67 67 164 -182 227 -87 157 -61
2405 -61 -152 -112 -14 115 136 -24 -50 86 106 92 -85 133 16 33 116 184 -80 -113 -32 -207 -280 28 133 61 83
2430 83 -174 83 -38 -252 121 -74 281 37 99 -88 67 90 192 241 -117 -95 171 -27 -11 229 -187 -125
2452 -125 96 17 295 49 119 236 -71 49 59 38 -8 16 146 23 121 -12 40 64 -22 57 134 62 -106 -50 -126
$$ packed form
2288A00mr1k31L30L4k66J40k79M34q7l46M30p0j61J37j21J52j37o4K4K06j71N6
2311A5J26j75j3J14j75p1J56J5j61K4K70o6j30q7r9M85p2j9l95K51j20mL33j62
2335D0j30J45j83MK08Ko0k9j75L07j70o0j9J05J25l78L11R1j10k10K4R5Q2j12
2359i7K22j51K64k63J17l0k54J95J20k04K7Q0J62l3j71J71j44kj53K95K3l94J36
2382h4J24k52M6Q3j03R1K00K5j41k98M76j7j41j22K78r8%R7l46M09l14K44k18
2405f1r1M0R8J29K1j60k6J36K0j4j77K18j17J7Q3O8k64l3Q1j75p3L08J05p2K2
2430H3k57K57j21k14L73j95L55k44O2j87J55K3J02M9l58K2K66j98J6K40m16O2
2452a25K21p9K78k46P0J17l07J20J0k1m6K4J30j23R8j33N2K4q6P9P7p2j68N6p6
$$ plain form
2477 -126 57 -22 57 -100 -146 100 -88 42 109 -7 127 65 -76 -194 -67 200 97 -1 189 128 9 20 18
2500 18 112 -118 314 10 -174 -90 -64 -137 -9 -57 189 -130 -74 100 -144 0 239 146 -79 62 -80 -260 86
2523 86 -3 49 21 82 -207 145 -83 118 -5 -144 215 -24 -96 -192 202 -74 21 -287 -224 67 -72 7 104 204
2547 204 166 228 -113 -17 205 0 17 68 -238 -94 76 -48 -67 -53 28 -143 -175 -37 -20 84 3 131 65 29
2571 29 -21 -50 272 -20 -161 111 112 -53 95 7 89 -135 -84 -70 -33 40 -2 76 148 -13 24 35 128 -83 -168 77
2597 77 131 -104 110 134 34 -130 27 77 38 70 -94 -187 -95 -80 62 -90 67 -187 -236 31 -55 49 102 -15
2621 -15 114 -364 -42 76 42 38 361 -211 -71 -27 41 -39 201 33 -21 86 169 66 -482 -37 145 22 -190
2644 -190 -95 14 -21 -152 -210 -29 -36 -189 57 45 37 44 74 272 -146 -4 143 49 -20 41 14 342 229 -61 270
$$ packed form
2477a26J83p9P9j57m6K46j88J30O7j16J34o2j41j18J27K67j03r8J90o1j19J1k
2500A8R4k30M32l04j84Q4K6p3J28m8K46l19N6J74k44J44K39r3k25J41j42j80L46
2523H6q9N2k8O1k89L52k28K01j23j39L59k39p2r6L94k76R5l08O3K91j39P9R7J00
2547B04l8O2l41R6K22k05J7N1l06J44J70j24j9J4Q1j71l2J38J7J04q1J28o6l6
2571B9n0k9L22k92j41K72Jj65J48q8Q2k24N1J4L7P3m2P8P2j61L7J1R3k11q5K45
2597G7N4k35K14K4j00j64J57N0l9L2j64r3R2J5J42j52J57k54m9K67q6J04N3j17
2621a5J29m78L22J18l4mL23n72J40M4O8q0K40j68n4J07Q3j03n48M45J82j23k12
2644a90R5J09l5j31n8J81pj53K46j2qPL0J98m18J42J47r4o9O1k7L28j13k90L31
$$ plain form
2669 270 14 74 -200 156 8 -40 -190 157 366 69 54 -58 53 -47 0 -71 25 38 80 -35 -182 37 61
2692 61 -146 -2 -211 15 29 -24 -41 -108 272 36 -93 79 -148 189 -232 185 111 -52 -67 78 15 216 -76
2715 -76 84 47 2 165 234 -62 -24 247 -88 129 15 60 195 7 -92 -3 7 -62 97 67 4 -49 156 161 -184
2740 -184 200 140 142 59 -38 -4 -48 -397 121 -16 -115 -248 -87 -56 -87 -80 22 -15 -70 -140 158 -47 -169 -15 -114
2765 -114 86 140 72 57 42 -240 -22 54 25 -111 -59 246 -21 168 -49 -291 -138 264 108 4 -139 -40 -202
2788 -202 140 -162 111 -205 55 109 132 286 20 -122 -94 56 152 37 -82 -20 31 191 211 -184 64 10 172
2811 172 -84 -67 18 -62 170 -16 -182 -26 2 -92 69 59 156 68 -85 -41 66 -99 -25 203 -170 72 -41
2834 -41 4 -35 195 202 263 -39 -61 -105 125 27 188 -151 -1 -62 -120 -11 180 -3 -108 39 -43 220 106 -179
$$ packed form
2669B70k56O0k74L56j48m8j50L47K09k97j5j12J11j00M7p1R6J3M2j15j47K19K4
2692F1k07J44k09K26J4n3j7o7L80k36j29J72k27L37m21M17p4j63j5J45o3K01k92
2715g6J60l7m5J63O9k96L8K71l35K17j14M5J35j88r9Q9J0o9J59l0o3n3K05Nl45
2740a84L84o0Kq3r7L4m4l49N18j37r9j33J61L1l1PJ02l7n5p0K98k05j22J54r9
2765a14K00N4o8j5j5k82K18P6k9j36N2L05k67J89k17k42J53M02j56j04j43R9j62
2788b02L42l02K73l16K60N4K3J54k66j42K8J50R6j15j19O2N1J60K0l95K48n4J62
2811A72k56J7Q5q0K32j86j66J56K8r4J61j0R7q8j53M4J07j65P4K28l73K42j13
2834d1M5l9K30PO1l02k2m4K30r8J61l39J50o1n8J09J91j83j05J47q2K63j14k85
$$ plain form
2858 -179 140 -27 -127 -121 -49 -118 99 -41 -71 -147 -168 -32 -164 -145 83 -178 51 130 107 23 -92 38 -43 -57
2882 -57 83 -46 50 -139 177 179 35 -51 43 100 -165 201 -219 -64 -114 -250 -43 -273 -42 82 21 -106 190
2905 190 157 55 -124 -138 59 15 96 -149 46 -65 134 11 -30 140 132 13 -244 -11 -150 -85 -39 152 -139
2928 -139 128 -57 -24 103 138 73 -124 4 -106 -208 -317 -128 177 23 -198 -73 57 28 -155 -42 -150
2949 -150 -32 -25 -65 -70 78 101 25 64 82 -32 -12 63 153 -215 -130 -63 34 -59 -9 -178 73 -118 71 -20 125 -17
2975 -17 65 -79 -80 62 224 79 -168 20 -79 -47 154 133 -46 -203 -96 -100 0 -16 67 29 -29 -9 -7 -39 40 201
3001 201 -175 -27 -97 -2 108 -112 257 18 -132 69 28 158 -99 -65 285 0 -244 163 -47 -82 241 -41
3023 -41 -69 43 -50 -49 -400 84 -28 139 183 -50 63 -59 45 -75 108 175 293 -27 29 176 178 254 9 -172
$$ packed form
2858a79L19j67j00OP2o9K17j40l0p6k1J36j32J9K28k61K29P9k3q4j15J30q1j4
2882e7J40j29R6j89L16Kj44q6R4N7k65L66m20J55n0j36K07k30K31J24o1j27K96
2905A90l3j02j79j4J97m4Q1k45J95j11J99j23m1J70qj19k57K33j39O5M6J91k91
2928a39K67j85L3J27L5o5j97J28j10j02j09J89L05j54k21J25J30k9j83J13j08
2949a50J18Pm0nJ48K3p6L9J8j14K0P5R0l68Q5O7R7r3N0j69K51j91J89r1J45j42
2975a7Q2j44jJ42J62j45k47J88r9L2K01k1j79j57J07mJ00j6Q3l8n8K0Kl2P9J61
3001B01l76J48p0R5J10k20L69k39j50K01m1J30k57L4L50k85k44M07k10l5L23k82
3023d1k8J12r3Jl51M84j12J67M4k33J13j22J04j20J83O7J18l20N6J47KP6k45j81
$$ plain form
3047 -172 -60 -20 -99 -1 92 -197 280 -50 25 -186 18 56 5 -75 108 349 -171 -51 205 273 58 50 -113 90
3071 90 -149 -30 30 -143 -42 19 -110 -96 -167 63 -64 233 -40 -91 8 -167 -59 -71 53 212 -55 -80 226
3094 226 209 -209 64 219 -41 -90 -131 106 22 -295 145 232 12 36 152 -145 142 -41 -124 -121 154 107 -44
3117 -44 -101 43 94 -194 -15 223 43 97 12 -5 -32 77 126 -161 -60 21 -14 62 122 -44 126 -19 258 14
3141 14 7 106 291 -385 -33 237 46 261 -68 -48 -389 -81 -1 -78 -197 -12 -7 -203 39 307 212 30 87 -148
3165 -148 114 5 195 133 -121 116 -39 -7 38 -332 -88 -134 7 122 -49 -58 28 -6 281 -97 -37 -414 -121
3188 -121 -54 -77 -46 91 8 -32 145 -119 -40 -88 2 106 -20 21 -17 -280 157 -41 253 -97 25 -116 36
3211 36 -15 338 58 56 -176 -117 -16 -116 138 7 -209 109 -63 82 157 -65 -301 -19 -71 -103 -75 41 -255
$$ packed form
3047a72J12M0p9R8R3k89M77l30P5k11K04L8n1q0J83K41n20J20K56O8k15qj63K03
3071I0k39J19O0j73J01O1j29J4p1K30j27K97k73n1R9j75J08j2J24J59k67k5L06
3094B26j7m18K73J55k60m9m1K37q4l17M40Q7k20K4J16k97K87j83q3LK75m7j51
3117d4n7J44N1k88J79K38j80N4q5j7k7J09M9k87J01Q1l5P6O0j66J70j45K77k44
3141A4pR9J85o76L52K70j91K15l29K0l41L08Q0p7j19J85Nj96K42K68r5j82N7k35
3165a48K62j09J90o2k54K37j55L2M5l70K44m6J41J15j71rQ6l4K87l78O0l77K93
3188a21O7k3L1J37q3m0J77k64P9m8R0J04j26M1l8k63M37j98K94l50J22j41J52
3211C6n1L53k80kk32N9J01j00K54j31k16L18j72J45P5k22k36K82n2l2K8J16k96
$$ plain form
3234 -255 155 -119 121 -120 198 47 100 312 58 177 179 -110 66 43 -143 45 -75 -81 -36 42 190 131 -150
3257 -150 176 -33 113 329 -96 164 -40 -166 -254 -78 -119 -242 -5 -51 -94 -2 -35 122 25 129 -86 -199
3279 -199 -252 117 64 82 217 97 -100 271 -71 -164 21 -36 -136 -88 -77 -58 -53 -23 -107 -9 16 35 -325 -33 -41 -19
3305 -19 -27 -178 -68 -152 64 -121 -18 14 -114 -27 -113 -66 -165 -152 -26 -167 -11 -127 -222 -206 -152 -215 72 49 -85
3330 -85 -72 53 163 -109 -250 -64 -16 -98 53 39 -51 54 -268 88 126 -120 157 -22 9 160 63 82 115 7
3354 7 -75 -101 167 -64 34 328 -176 -38 -34 113 150 -94 82 -84 -4 15 47 85 185 -58 -24 155 287 -281
3378 -281 -115 -30 57 41 -162 152 -347 -14 -122 47 279 -193 88 -63 -102 38 -66 139 -133 39 -129
3399 -129 256 101 79 144 101 -151 -44 -102 152 153 -145 135 -174 28 -61 -115 -35 257 -286 -21 122 -116 224
$$ packed form
3234b55M10k74K40k41L18j51N3K12k54J19Kk89J76k3j86J88j20oM5P8J48n9k81
3257a50L26k09J46K16m25K60k04j26q8J76m1j23K37m6m3R2l3J57r7J04k15j13
3279a99n3L69n3J8J35j20j97L71l42r3J85n7j00M8J1J9NL0q4R8K5J9l60K92qK2
3305a9qj51J10q4K16j85J03L2j28Q7q6M7r9J3J26j41J56j16r5J6N4o3K87k3j34
3330h5J3J25J10k72j41J86M8q2J51j4r0J05l22L56L8k46K77j79L1J51r7J9L3j08
3354Gq2k6K68k31R8K94n04J38MJ47L7k44J76j66Q0J9L2L8J00k43L4J79J32n68
3378b81J66Q5Q7j6k03L14m99L33j08J69K32m72K81j51l9J40j04K05k72J72j68
3399a29L85j55k2O5m3k52J07n8K54Jk98K80l09K02q9n4Q0K92n43K65J43k38L40
$$ plain form
3422 224 -104 12 -18 68 -193 -45 100 -80 42 -84 93 -26 57 61 -100 -147 -35 -162 78 -114 -84 69
3444 69 -57 -123 -127 -109 129 -100 34 195 113 25 2 245 -289 -15 282 11 -70 -129 -119 -28 125 -26 80 -81
3468 -81 -34 -7 54 -41 -115 -5 98 -190 -54 18 230 -90 -47 -129 57 -173 -108 96 262 -183 -64 -69 -148 -79 143
3493 143 -149 246 -40 -80 -91 -220 223 -229 215 218 184 -171 -157 -2 -156 43 -82 -14 -55 -4 269 -150 92
3516 92 110 20 0 -97 -42 -140 -75 -79 198 -176 -141 -159 110 89 -23 -202 269 -79 -247 -131 114 -107 42 -92
3540 -92 90 -25 -142 100 80 185 -66 -18 137 4 -64 -43 -224 -112 -78 -132 -91 -196 -72 -11 -30 38 60 85
3564 85 199 -216 60 115 16 128 100 -104 228 -70 137 168 -96 63 -33 117 74 -62 166 33 -208 -226 236
3587 236 8 125 99 144 -137 -138 -234 -86 99 230 65 -115 128 127 75 90 86 -148 -7 56 17 114 90 48 66 -20
$$ packed form
3422B24l28J16l0Q6k61J48J45j80J22j26J77j19Q3Mj61m7J12j27K40j92L0J53
3444F9j26o6mJ8K38k29J34J61q2q8k3K43n34K74K97k71q1n9J0R1J53j51J06j61
3468h1M7K7O1r5p4J10J03k88J36P2K12l20M3q2J86k30O5K04J66m45J19np9O9K22
3493A43k92L95k86m0j1j29M43m52M44Ll4l55J4J55j54J99j25O8m1N1K73m19K42
3516I2J8r0k0r7N5r8O5mK77l74L5j8K69k1j12j79M71l48j68J16K45k21J49j34
3540i2J82j15j17K42k0J05k51M8J55j33o8K1j81J12L4n4M1j05J24O1j9O8K2K5
3564H5J14m15K76N5r9J12k8k04L32k98K07L1k64J59r6J50m3j36K28j33k41j8M62
3587B36k28J17k6M5k81jr6J48J85J31j65j80K43jn2J5mk34J41O3l9R7k4m2J8q6
$$ plain form
3613 -20 -20 -214 -14 4 -7 26 74 -63 -117 289 7 -327 -136 -31 6 114 -131 161 -30 -8 25 -57 -15 124
3637 124 101 -222 243 -200 -7 89 158 30 149 102 -25 -229 54 95 325 -28 87 157 65 -25 -122 161 -150
3660 -150 266 138 -31 32 139 -129 253 59 -269 -230 -151 -219 -133 21 90 170 59 104 134 274 129 77 -273
$$ packed form
3613b0%j94K00J8j1L3M8j37n4M06k82l34J91J05L7J08k45K92j91K2L3q2M2J39
3637A24k3l23M65m43J93R6O9j28J19m7j27k04K83M1K30l53J15P0r2r0r7K83l11
3660a50M16j28j69O3J07k68L82j94l28L9P9o8Q6J54O9Q0j11M5L0J40j45n2l50
$$ [...]
8191a00
##END NTUPLES=NMR FID
##END=
