##TITLE=1H_LR-758-R3-KA2a
 CDCl3
 8 sc, 
 9.8.2023
##JCAMPDX= 6.0         $$ Bruker NMR JCAMP-DX V2.0
##DATA TYPE= NMR FID
##DATA CLASS= NTUPLES
##ORIGIN= UXNMR, Bruker Analytische Messtechnik GmbH
##OWNER= root
$$ XWIN-NMR		Version 3.5
$$ Wed Aug  9 16:18:15 2023 Russian Standard Time (UT+4h)  she@DPX200
##.OBSERVE FREQUENCY= 200.13135
##.OBSERVE NUCLEUS= ^1H
##.DELAY= (6, 6)
##.ACQUISITION MODE= SIMULTANEOUS
##.ACQUISITION SCHEME= undefined
##.AVERAGES= 8
##.DIGITISER RES= 18
##SPECTROMETER/DATA SYSTEM= spect
##.PULSE SEQUENCE= zg30
##.SOLVENT NAME= CDCl3
##.SHIFT REFERENCE= (INTERNAL, CDCl3, 0, 15.7039)
##AUDIT TRAIL= $$ (NUMBER, WHEN, WHO, WHERE, WHAT)
$$ ##TITLE= Audit trail, XWIN-NMR		Version 3.5
$$ ##JCAMPDX= 5.01
$$ ##ORIGIN= Bruker BioSpin GmbH
$$ ##OWNER= she
$$ F:/spectra/data/she/nmr/H-F/1/audita.txt
$$ ##AUDIT TRAIL=  $$ (NUMBER, WHEN, WHO, WHERE, WHAT)
(   1,<2023-08-09 16:17:07.76 +0400>,<she>,<DPX200>,
      <created by zg, POWCHK disabled, PULCHK disabled
       configuration hash MD5:
       00 E9 B6 7A A2 85 ED C7 34 08 36 98 17 FE 4E 26
       data hash MD5: 16K
       6C E2 90 E3 FD 13 EE 31 35 C0 B7 82 3B DD 5F 8B>)
$$ ##END=
$$ 
$$ hash MD5
$$ 0D 22 67 38 C8 75 56 2B D9 D7 F7 86 3E 1A 57 29
##$RELAX= 
##$RELAX= 
##$RELAX= 
##$RELAX= 
##$RELAX= 
##$RELAX= 
$$ Bruker specific parameters
$$ --------------------------
##$DU= <F:/spectra>
##$EXPNO= 1
##$NAME= <H-F>
##$PROCNO= 1
##$TYPE= <nmr>
##$USER= <she>
##$AMP= (0..31)
100 100 100 100 100 100 100 100 100 100 100 100 100 100 100 100 100 100 
100 100 100 100 100 100 100 100 100 100 100 100 100 100 
##$AQSEQ= 0
##$AQ_mod= 1
##$AUNM= <au_zg>
##$AUTOPOS= <>
##$BF1= 200.13
##$BF2= 200.13
##$BF3= 200.13
##$BF4= 200.13
##$BF5= 200.13
##$BF6= 200.13
##$BF7= 200.13
##$BF8= 200.13
##$BYTORDA= 1
##$CFDGTYP= 0
##$CFRGTYP= 5
##$CHEMSTR= <none>
##$CNST= (0..31)
1 1 145 1 1 1 1 1 1 1 1 1 1 1 1 1 1 1 1 1 1 1 1 1 1 1 1 1 1 1 1 1 
##$CPDPRG= <>
##$CPDPRG1= <>
##$CPDPRG2= <>
##$CPDPRG3= <>
##$CPDPRG4= <mlev>
##$CPDPRG5= <mlev>
##$CPDPRG6= <mlev>
##$CPDPRG7= <mlev>
##$CPDPRG8= <mlev>
##$CPDPRGB= <>
##$CPDPRGT= <>
##$D= (0..31)
0 1.2 0 0 0 0 0 0 0 0.06 0 0.03 0 0 0 0 0.0002 0 0 0 0 0 0 0 0 0 0 0 0 
0 0 0 
##$DATE= 1691583427
##$DBL= (0..7)
120 120 120 120 120 120 120 120 
##$DBP= (0..7)
150 150 150 150 150 150 150 150 
##$DBP07= 0
##$DBPNAM0= <>
##$DBPNAM1= <>
##$DBPNAM2= <>
##$DBPNAM3= <>
##$DBPNAM4= <>
##$DBPNAM5= <>
##$DBPNAM6= <>
##$DBPNAM7= <>
##$DBPOAL= (0..7)
0.5 0.5 0.5 0.5 0.5 0.5 0.5 0.5 
##$DBPOFFS= (0..7)
0 0 0 0 0 0 0 0 
##$DE= 6
##$DECBNUC= <off>
##$DECIM= 32
##$DECNUC= <off>
##$DECSTAT= 4
##$DIGMOD= 1
##$DIGTYP= 9
##$DL= (0..7)
0 120 120 120 120 120 120 120 
##$DP= (0..7)
150 150 150 150 150 150 150 150 
##$DP07= 0
##$DPNAME0= <>
##$DPNAME1= <>
##$DPNAME2= <>
##$DPNAME3= <>
##$DPNAME4= <>
##$DPNAME5= <>
##$DPNAME6= <>
##$DPNAME7= <>
##$DPOAL= (0..7)
0.5 0.5 0.5 0.5 0.5 0.5 0.5 0.5 
##$DPOFFS= (0..7)
0 0 0 0 0 0 0 0 
##$DQDMODE= 0
##$DR= 18
##$DS= 0
##$DSLIST= <SSSSSSSSSSSSSSS>
$$ [...]
##$SUBNAM2= <"">
##$SUBNAM3= <"">
##$SUBNAM4= <"">
##$SUBNAM5= <"">
##$SUBNAM6= <"">
##$SUBNAM7= <"">
##$SUBNAM8= <"">
##$SUBNAM9= <"">
##$SW= 18.05172834244
##$SWIBOX= (0..15)
0 0 2 0 0 0 0 0 0 0 0 0 0 0 0 0 
##$SW_h= 3612.71676300578
##$TD= 16384
##$TD0= 1
##$TE= 0
##$TE2= 300
##$TE3= 300
##$TEG= 300
##$TL= (0..7)
0 120 120 120 120 120 120 120 
##$TP= (0..7)
150 150 150 150 150 150 150 150 
##$TP07= 0
##$TPNAME0= <>
##$TPNAME1= <>
##$TPNAME2= <>
##$TPNAME3= <>
##$TPNAME4= <>
##$TPNAME5= <>
##$TPNAME6= <>
##$TPNAME7= <>
##$TPOAL= (0..7)
0.5 0.5 0.5 0.5 0.5 0.5 0.5 0.5 
##$TPOFFS= (0..7)
0 0 0 0 0 0 0 0 
##$TUNHIN= 0
##$TUNHOUT= 0
##$TUNXOUT= 0
##$USERA1= <user>
##$USERA2= <user>
##$USERA3= <user>
##$USERA4= <user>
##$USERA5= <user>
##$V9= 5
##$VALIST= <valist>
##$VCLIST= <CCCCCCCCCCCCCCC>
##$VD= 0
##$VDLIST= <DDDDDDDDDDDDDDD>
##$VPLIST= <PPPPPPPPPPPPPPP>
##$VTLIST= <TTTTTTTTTTTTTTT>
##$WBST= 1024
##$WBSW= 4
##$XGAIN= (0..3)
0 0 0 0 
##$XL= 0
##$YL= 0
##$YMAX_a= 77845
##$YMIN_a= -173108
##$ZGOPTNS= <>
##$ZL1= 120
##$ZL2= 120
##$ZL3= 120
##$ZL4= 120
##$ABSF1= 10
##$ABSF2= 0
##$ABSG= 5
##$ABSL= 3
##$ALPHA= 0
##$AQORDER= 0
##$ASSFAC= 0
##$ASSFACI= 0
##$ASSFACX= 0
##$ASSWID= 0
##$AUNMP= <proc_1d>
##$AZFE= 0.1
##$AZFW= 0.1
##$BCFW= 1
##$BC_mod= 2
##$BYTORDP= 1
##$COROFFS= 0
##$CY= 11.3945322036743
##$DATMOD= 1
##$DC= 2
##$DFILT= <>
##$DTYPP= 0
##$F1P= 15.7292609196834
##$F2P= 12.9074282941183
##$FCOR= 0.5
##$FTSIZE= 0
##$FT_mod= 4
##$GAMMA= 1
##$GB= 0.15
##$INTBC= 1
##$INTSCL= 1
##$ISEN= 128
##$LB= 0.24
##$LEV0= 0
##$LPBIN= 0
##$MAXI= 10000
##$MC2= 0
##$MEAN= 0
##$ME_mod= 0
##$MI= 1.114404
##$NCOEF= 0
##$NC_proc= 0
##$NLEV= 6
##$NOISF1= 3.799351
##$NOISF2= 2.8
##$NSP= 1
##$NTH_PI= 0
##$NZP= 0
##$OFFSET= 15.70392
##$PC= 1
##$PHC0= -21043.38
##$PHC1= 8.65272
##$PH_mod= 1
##$PKNL= yes
##$PPARMOD= 0
##$PSCAL= 0
##$PSIGN= 0
##$REVERSE= no
##$SF= 200.130013532006
##$SI= 16384
##$SIGF1= 3
##$SIGF2= 2
##$SINO= 400
##$SIOLD= 16384
##$SREGLST= <1H.CDCl3>
##$SSB= 0
##$STSI= 0
##$STSR= 0
##$SW_p= 3612.71676300578
##$SYMM= 0
##$S_DEV= 0
##$TDeff= 0
##$TDoff= 0
##$TI= <>
##$TILT= no
##$TM1= 0
##$TM2= 0
##$TOPLEV= 0
##$USERP1= <user>
##$USERP2= <user>
##$USERP3= <user>
##$USERP4= <user>
##$USERP5= <user>
##$WDW= 1
##$XDIM= 8192
##$YMAX_p= 0
##$YMIN_p= 0
$$ End of Bruker specific parameters
$$ ---------------------------------
##NTUPLES= NMR FID
##VAR_NAME=  TIME,          FID/REAL,        FID/IMAG
##SYMBOL=    X,             R,               I
##VAR_TYPE=  INDEPENDENT,   DEPENDENT,       DEPENDENT
##VAR_FORM=  AFFN,          ASDF,            ASDF
##VAR_DIM=   8192,          8192,            8192
##UNITS=     SECONDS,       ARBITRARY UNITS, ARBITRARY UNITS
##FACTOR=    0.0002768,     1,               1
##FIRST=     0,             0,               0
##LAST=      2.2672688,     0,               0
##MIN=       0,             -173108,         0
##MAX=       2.2672688,     77845,           0
$$ Real data points
##PAGE= N=1
##DATA TABLE= (X++(R..R)), XYDATA
$$ [...]
2017a03J18j69o12P81R15j747m05J431m88p75P47k07p64J316P66j566m75J286
2035D9j75j8M45q67m57J551O94j292l14Q53n6L17M95q31o98J291M39j133j49L28
2055D72j0K21M90j395m86J385j2r00n7J7p57R93O53j296j017J252L54m39l5k61
2075h28q51J483N76r86o99Q63L86L4J93p04n86J107J053j082m96Q66k70K29N77
2094H65q69r77J718M94j057l37M00o61Q69P26j433n43J303N33j102j08Q5n69P67
2113A04J207j629p16J218K51j073L87N5j001R87J013j572p10J456m1o36Q26m45
2131c19j076J231R73j178q55J412j4j68O89l51j220R61J422j428p20J297j57p6
2149D23R49m54j944J448J176j334m96O22m00K3R24m57j405P76J455j445J1N22
$$ y = [-103, 15, -154, -766, 15, 930, -817, -1222, 209, -279, -1054, -307, -514, -1278, 38, 804, -762, -1237, 49, -126, -144, 301, -566, -1023, 528, 1222, -70, -384, 469, 413, 730, 1225, 394, -304, 987, 1426, 293, 144, 472, 462, 683, 1173, -222, -708, 677, 665, -235, -292, -275, -1032, -39, 614, -682, -1699, -447, -93, -532, -567, -828, -1679, -196, 380, -606, -1305, -442, -56, -22, 171, -533, -1119, -12, 1041, -41, -537, 329, 59, 288, 865, -4, -981, 737, 1231, 174, -163, 237, -424, 445, 1171, -262, -805, 498, 1031, -71, -179, -94, -663, 104, 1311, -318, -1034, 184, 435, -638, -251, -196, -1197, -210, 803, -769, -1479, -23, -64, -700, 126, -319, -1395, -164, 809, -369, -1224, 188, 174, 6, 695, 344, -876, 85, 1507, 79, -641, 656, 499, 423, 1372, 918, -1026, 422, 1598, 264, -232, 390, -10, 13, 937, 480, -925, -149, 1306, -139, -128, 394]
2167C94r79L78J299r02j468R38R12m48j52M56j015R1J636m72j479O59P78o11K89
2186C04J95j113%J802l51j277J78N46k05M74J64j105M8J417n88r37L25K85j33
2205B9R27k42j211o1J472l87p82M81k13l95J065Q4j122j3Q45j71l78J06k00j92
2225c58Q69N2j070r2Q83M0l33M4k76k18J015j28j007j9P58LO3Q4n58L4N98K21
2247F05q78K58J53J82O3J82p78j33P71J42n76k5R1o9N70l3r07r5O97J08k88L2
2269G2j51k7O80k9r25N0M07K80l50J69m59j08Q40n4o94l18L55J82j40M44q36M9
2291e63O11J13p41M22j42q0N19m5o78K4P85N1l13j00L25m35P93L73r61m21J058
2312E95j91l45L82n95l19R22K64r56k10P29k83n1R3l92l12O80N21j074j56O36
$$ y = [394, -585, -207, 1092, 190, -1278, -340, 572, 124, -28, 428, -587, -496, 1140, 668, -811, -152, 626, 15, 304, 499, -614, -614, 1188, 837, -440, -262, 284, 79, 553, 717, -388, -340, 1077, 489, -448, -123, 162, 29, 956, 714, -497, -558, 914, 527, -255, 226, 13, -382, 683, 767, -355, -368, 477, 306, -72, 34, -166, -358, 511, 563, -507, -599, 284, 324, -9, 35, -241, -459, 556, 428, -579, -598, 160, 163, 226, 310, -248, -214, 384, 605, -273, -15, 138, 320, 383, 565, -213, -346, 425, 567, -9, -34, 57, -12, 558, 525, -382, -477, 220, 328, 40, 72, -79, -106, 574, 545, -380, -330, 77, 357, 7, 176, -283, -391, 449, 395, -299, -617, -262, -80, -220, 224, -612, -563, 48, 161, -580, -158, -300, -380, 139, 94, -584, -560, 225, 276, -37, -137, 188, -247, 546, 919, -42, -463, 595, 404, 59, 441, -154, -473, 449, 713, -243, -453, 276, -7, -58, 35, -357, -669, 11, 532, -542, -698, -62]
2332f2j19k84N73p18m43J102N99j176J86L24m70J5Q12m15p98J139L33j031M32
2351aJ77l50J75M97l39q62Q91K63m34N5K39q37P16O48n59r89J107J57o12L78r4
2372B26n71L64Q00m95q62O20J02o46N86k1o96L07P81m90o67M22K09n24M82J55
2392H2p85J40J040l63n42M09o9k1L87M19j075L13O51j85k05J93m8k69Q21l13p52
2413a72J27Q11k30n07M69m59k75O20J53n40m88Q21j62k45O7m60J67O10K10q92
2433c75L46R5j58j17L14n74j84P93J02k37n41K87J32L40n4l92k87O11M37m18k77
2454a57k29N61O8J99k89k08N48j68l21J44l43K50K29K64k63n49O73l22J73m09
2474a49J47k86O94r2n14r2J82J73N0j89k78j0K48q7j68k8Q2k80P19J76o95J32
$$ y = [-62, -181, -465, 108, -610, -1053, 49, 648, -528, -342, -18, -488, -473, 339, -76, -874, 265, 598, -433, -1, 176, -174, 1, 498, 159, -703, 188, 451, 17, 72, 311, -526, 190, 838, 279, -710, 397, 554, -58, 320, 226, -345, 19, 819, 324, -538, 82, 184, -462, 124, 103, -593, -286, 495, 5, -662, -240, -31, -555, -73, 82, -703, -563, 477, 114, -428, -19, -88, -109, 278, 697, -378, -65, 586, 401, 196, 389, 341, 72, 893, 580, -172, -45, 766, 536, 29, 498, 39, -236, 384, 537, -3, -491, 330, 168, -77, -10, -470, -303, 307, 517, -375, -29, 66, -92, -209, 105, -469, -653, 140, 242, 5, -536, -249, -117, 223, 169, -223, -510, 101, 538, 120, -157, -386, 175, 243, 442, 153, -55, 493, 325, 4, 148, -195, 55, 284, 548, 285, -264, 409, 87, 260, -149, -2, -288, 406, 314, -200, -292, -110, 63, 113, -76, -354, -364, -116, -203, -371, -399, -317, -597, 122, 298, -397, -265]
2496b65N0K43p3j61M9J63L21K84q13j22N54K12m34L92k82l35P42J17p22J1l0J27
2518B8J73j9j96o90Q46M03q18J33J24k72Q8L28o35j95P24K70l96l45J97j66L83
2539c5J98l80n48Q50J77o74J91P9k63K61M22m65k81O93J41l59J46k57j72K67L92
2560C83m41l02N14K23k33J5J9q4O0N50q05m30O19Q0l65L43J85q29L44O54o44k58
2582d02M01K0l3K27j12q33K45O69L8n26M43l83K38K33J94o01j49R37k68j71j7
2603A50nQL01K5n91J06P83k96l25j1r9l9L37j69j92P8M06n40J20Q5j02k91L40
2626G9L70o42R8J52l8K5k9K5l89M30R7m15j48L85MM0j19P7k19L14R7j69k41L16
2650A00j93O7J61l38m8M69K49o26O8J68J80j61K04l75M2J76J24r0j8l3o2Q1J8
$$ y = [-265, -215, 28, -45, -206, -157, 6, 327, 611, -202, -324, 230, 442, 8, 400, 118, -217, 525, 642, -80, -69, -99, 28, 201, 182, -14, -704, 142, 545, -273, -140, -16, -288, -200, 128, -507, -702, 22, 292, -104, -449, -252, -418, -35, 163, -217, -765, 85, 262, -412, -221, -142, -405, -144, 278, -187, -468, 225, 366, 7, 153, -104, -276, -9, 383, -58, -360, 154, 377, 144, 159, 178, 94, 154, 704, -101, -531, 88, 168, -197, 146, 331, -498, -154, 500, -144, -402, -1, 19, -14, 213, 101, -732, -487, 182, 220, -306, 137, -246, -8, 225, 419, -182, -331, 606, 338, 167, 150, 145, 153, 454, 479, -112, -6, 777, 481, 156, 145, 46, 7, 344, 175, -17, 61, 467, -73, 47, 132, 30, -261, 79, 449, -193, -95, 57, 19, 44, 15, 40, -349, 81, 178, -237, -385, 0, 4, 44, -75, 2, -217, 97, 194, 25, -216, 100, -93, -26, 135, -203, -251, 218, 467, -159, -91, 77, 257, 96, 300, -75, -33, 143, 267, 177, 159, 126, 64, 145, 163]
2673A63k00p6M61k64J22k02K86l10K24j69k80j2L8L99J34n13J30n6M24j77j1r2
2695A9j61M8M61j26l68j10K18M65o93K38Q3l39M12J68l29q9j1k13K00MN9l48M78
2718F6O4j70j37J19K60R7k73l5RK37R8l07K1M5k00K13J88j43m23K59K95m32J2
2741a37q2J88m0J39l26K4j3Q1K03j65m6j82K94J69n18k96P08j1j39K51p4o94N79
2764h7L56m37r4J64Q2j02J47j78l24L15N37l98k1j4J33k58N83m8m61p5K41Ql12
2787b43n9L10l25M40o8m70K62M19j88k23K02j67J34k27J56k99J9O17k67l37J40
2808a74J04k95L08J09o01M07K47j13k4K21j49l5N5J22l43L2L61l6r1K43n75J17
2830a10M94m00k23K30J91j36pJ66l11Q4J63L8k50l52M48K28k10l66R4k10L34J57
$$ y = [163, -37, -113, 348, 84, 206, 4, 290, -20, 204, 35, -245, -257, -219, 180, 314, -199, -69, -125, 299, 122, 111, 19, -142, -94, 367, 241, -127, -237, -19, 446, -247, -9, 74, -265, 147, 315, -14, -103, -114, -327, -127, -123, -64, -412, 66, 130, -40, -177, -58, 202, 299, 26, -9, 0, 237, 335, 28, 49, 94, -106, 107, 295, 152, -271, -12, 283, -149, -137, -219, -31, -71, 68, -258, -234, -247, -166, 37, -128, -174, -356, -62, 107, -411, -707, 1, -10, -149, 102, 28, -666, -87, 269, -168, -262, -98, -16, -118, 29, -149, -473, -158, 379, -19, -40, -54, 79, -179, 404, 356, -105, -180, 61, 69, -243, -302, 8, -317, 123, 55, -415, -153, 266, 78, -145, 57, -110, 24, -203, -47, -346, -327, 290, 23, -314, -174, -70, -365, -57, 52, -549, -142, 105, -8, -32, 189, 40, 5, 60, 182, -161, -129, 232, 196, 105, 348, -227, -110, 384, -16, -239, -9, 182, 46, 39, 205, -106, -22, 141, 179, -71, -423, 25, 253, 43, -323, -229, -439, -105, 52]
2852E2l3k66p3L17k0M43l13k06J50J18k19p4R8p5K21J23J09k50l27N10M9m69J64
2875B9L2Q0m7k05K55k86J06L81k23q1q2PM62k63k21R4l1m1k12K15O2l01N60K8
2899C18n22n9J72M73m13O5l82K56KJ74N4m30M1K68R4l80K53k15K49L25jj07l88
2922a53K90m2nq1J33K86j2m22P7J40J20j47l41K37j19k78N58j83j24n2o2J05M7
2945b8j21J69k60L90J88m17q3oK20l45K09K7j68K25Ql7k7L5n6k63L04j21M8K9
2969h0K57j51l63L13J0M4J55r4j62L13O5k28p4j7K30l33J59J30j37m6J47j7m54
2992c33K87J72j57J12j06oJ03P0l64k57M36K7J92j51J0n31M59J95j11k46L11j88
3014g6rJ99r7K2k87L31L8k73J00J18r9N33o57J71KL01nl70J13k24j15J80K71l26
$$ y = [52, 19, -247, -320, -3, -23, 420, 107, -99, 51, 169, -50, -124, -26, -101, 120, 243, 352, 102, -225, 285, 334, -135, 29, 61, 141, 94, -111, 144, -142, -36, 345, 122, 41, -41, -34, 428, 165, -56, 38, 7, -34, -246, -31, 31, -270, 290, 318, -204, -263, -91, 382, -31, 34, -348, -92, -90, 84, 138, -292, -251, 17, 111, -269, -16, -231, 18, 343, 342, 235, -153, 137, 95, 90, 9, 142, 428, 416, -6, 71, 211, 331, 184, -157, 80, -39, -317, 241, 58, -66, -118, -180, -75, -28, -149, 20, -240, 150, 338, -79, -162, -168, 52, -293, -84, -57, -225, 0, 8, -29, -56, -21, -77, -340, -36, -157, -109, -80, 177, 26, -337, -24, -14, 30, 185, 91, -71, 242, 307, 79, 5, -12, 218, -115, 44, 174, 37, -9, 138, 121, -333, -46, 126, -31, 81, -25, -31, 72, 142, -222, -479, -43, -16, 176, 25, 35, -496, -37, 158, 47, -199, 112, -76, -85, 114, 17, 39, -248, 83, 121, -152, -52, 66, -33, 500, -157, 14, 16, 317, 312, -58, 55, -169, -284, -104, 167, -159]
3038a59K6J65j12K25n6k75K95l8J85l4n39M34o4K9k48J56j4n9K65k59m6L1J92
3061A00k4j64J92q2K23R7l47j29Q0L69j07k14J51k52Q6J10l4r5m5K05j15L91m40
3084d4k5N2L81l77j9r8L7j5k34M90k86j17K97O0j01K14j00j00J05L2j67k15J93
3107c7M8n6j70K89p8L08n26Q4j70K76R5r5O5O1j28j05K14J21m6J24j68km5k67
3131b08L09J40q2j03l2j65M7K78j66j41R9lj45K51k37j09J94K13l04m4k8Q1J70
3154A5m6p6J41k0l51L67L2l28K58j80L55j42l43K01o5K06j55K02j99J83O0m9j66
3177a00L20j55p8Qn8j60j05L39M3Pp6k80L09j49p1j6K03N5j92J0j46J60m8O0K89
3202A69n26L16p3r7J62j12O5J63j6Rr9m4m0L86l72K01l24j34M62p8P6m01M33l75
$$ y = [-159, -133, 32, -80, 145, 89, -186, 109, 71, 256, 222, -317, 117, 53, 82, -166, -10, -24, -83, 182, -77, -123, -92, 100, 76, -88, 104, 22, 245, 342, -5, -134, -54, 315, 208, -6, 145, -107, -21, 89, 55, -40, -85, 120, 5, 396, -44, -69, -17, 364, -13, -32, -130, -93, -108, -342, 148, -138, -255, 42, 102, 1, 215, 115, 15, 120, 152, -15, -230, -37, 11, -45, -215, 74, -4, 304, -222, -138, -308, -32, 63, -32, 33, 94, -34, -139, 75, 196, 150, 274, 106, 104, 59, -208, 101, 241, 159, 56, 24, -141, -94, 184, 18, -123, -24, -27, -172, 79, -158, -267, -73, 140, -164, -208, -236, -155, 15, -31, -107, 34, 14, -337, 30, 62, -266, -8, -188, 167, 25, -318, -117, -182, 24, -131, 71, -128, 55, 115, 66, -100, 220, 65, -13, -5, -63, -223, -328, 11, 54, 61, -15, -295, 14, -135, -206, -222, -19, 36, -156, -146, -292, -132, -180, -120, 169, -357, -41, -114, -211, -49, -161, -96, 67, 51, 60, -39, -83, -123, 263, -109, 92, -232, -366, 96, 18, 94, -307, 126, -249]
3226b49J2n8J59j84N51l00j11J81K03j97j29j67K42k55L54o8n0l7J6N3Lp3L58
3249B54l47J24J00j31P7q0P7k76L53k20k19M91j55r3k09L69j80J84M2k51J3K62
3271A85k24J40j51J29o9n9K62q7p1p4r9J31j49K22k43K11M9k1q2K1NNj22J36m2
3296CJ95Ll32j93J45K30k9k6J07k00K34q9P6J87n56N89n40J29N4j88r3M66l32
3319a60P2k3N9J70j31J20K67n71J99M1m17N59k80K90j42q1L3M2j5j11K97j29j7
3342G2K4j37K32k90p0J15n4j16O1k5K0j7M4J23m8q5J73N4l32P5J55J35j44j10
3366a45L01j41K1L06l80o1K72j59r3K9J81o1J16J82k52k34O0J65l2k02J28O4J11
3389A76%mk57K1J47k33J0L03m22K31J76l27j1L8J49j94K50P3j61p3K44j14r5j
$$ y = [-249, -237, -295, -136, -320, 231, -69, -180, 1, 204, 7, -122, -289, -47, -302, 52, -16, -66, -103, -87, -34, -31, -104, 254, -93, 31, 131, 0, 77, -3, 74, -202, 151, -69, -288, 203, 48, -45, -254, 115, -65, 119, 161, -90, -77, 185, -39, 101, -50, 79, 10, -49, 213, 126, 55, -19, -118, 13, -136, 86, -157, 54, 103, 82, 0, 21, 26, 31, -91, 45, 3, 198, 201, -131, -324, -179, 51, 22, -4, 103, -97, 137, 48, 124, 311, -245, 344, -196, -67, -13, -201, -294, 172, -160, -88, -111, -52, 118, -13, 107, 374, -197, 2, 43, -374, 185, -95, 195, 53, -28, 5, 47, 32, -79, 218, 89, 72, 96, -41, 191, -99, -169, -54, -108, -224, -163, -188, -168, -185, -141, -18, -66, -151, 22, 76, -256, -181, -26, 109, -35, -145, 156, 15, 36, 342, -38, -99, 173, 14, -79, -50, 131, 70, 186, 368, 116, -118, -58, 107, 75, -127, 1, 65, 176, 176, 172, -85, -64, 83, -150, -140, 163, -259, -28, 148, -179, -190, -152, -3, -197, 53, 126, -35, -108, 136, 22, -73, -74]
3413g4j52m7J29L41o3J06k10p8l90L05r8L73K9l8j7q8N4Q0q2o0J3kj79J81M4k3
3439E4J00r0J50k59L48n74J36L40k71P4j48K72j77M0o2k69M11J04l17jK83L10
3461D54n66M4Q9j29K9J81j20J8o0K65j44j05J78n9p0j3J87k89LL13j72K15l73
3484a24l49O31r9r8P5Kj66M23k68rk4p5J33O8mN9j7l21K79K23j19o6O1j98N8%
3510G5j38L79k09k36K51p2N5l83L78j81m6m5L12j12k08J02n1J35j17J7P3M0p9
3533f0J9n8J69k55n8M30n7j02j22k10K95N8j07n4R5L3oj08K41K0k69J30P0r8k51
3558b55M63J9l89M0J17J34j31J68m05Q3J78r7j5K1j7JJ38j77L7k1J50j30n7J72
3582B7K9k34K41p3l14L38O6j47j43L13k32N8K20k94J27K13J77j93j39j4j88J46
$$ y = [-74, -226, -273, -144, 197, 134, 240, 30, -48, -438, -133, -231, 142, 171, 133, 116, 28, 82, 162, 80, 20, 33, 31, -148, 33, 77, 54, 154, 64, 214, -45, 303, -271, -135, 205, -66, 8, -140, 132, -45, -5, -67, -336, 75, 179, -138, -139, 144, 454, -112, -68, 21, -108, -79, 102, -18, 0, -60, 205, 61, -44, 134, 75, 5, -8, 179, -110, -107, 206, 34, 249, -124, -473, 158, 59, -39, 36, 38, -128, 295, 27, 18, -6, -81, 52, 120, 116, 175, 158, -163, 116, 339, 220, 154, 215, 17, 75, 75, -63, 316, 107, -129, 122, 50, 105, -278, 100, -81, -127, -172, 140, 28, -180, -78, -129, 6, -111, -94, -21, 19, -60, -41, -99, 70, -185, -243, 187, 130, 28, -94, -304, -9, 49, -58, -112, -17, 16, 10, -98, 143, 163, -106, 24, 94, -4, -255, 208, 227, -162, -122, -5, 129, -2, 166, -239, -156, 22, -75, -90, -69, -86, -85, 53, -124, -87, -108, 42, -88, -145, 27, 56, -178, 63, -10, -324, 14, 80, -67, -210, 103, -129, -71, 149, -145, -18, 195, 372, 179, 40, 26, -162, -16]
3604a6o0J01k26R7j58K52l6j45L10l16M38k56mm0r2K5p6l4K69k49L42jk21j64
3628b60K25J5K5M6n5O3J08j01O3o8j40j8L23k64pk1J71l2k66K6J13r6M4M20n07
3653a93L5J41L54n16K75o1l33L66j5k78K10K06k23K8L9M8j30k58O17k11j61n8
3675a18J07j88L55j44J12P4k00j27J76J21l6o1L0N0l64K11q3m3j63M50j30p6J99
3698A52l31k6L65j44j01k9L65m09K32k10J09J28P2j77L4L9j37j54K23K20j26j99
3720a04q9J74J62J94l82K25M9o6j11l9j78K38l3q5k27J53N10m9m15r3L42n3j67
3743d4J88k12R1M1J04J6k47K55j99J2o9J54j40L75l23m0o8O3j57J25J92j76l6
3766i5qR1k95O41k19j39J23N5j81l19L70K00j15j84q6J47J96J16k40l6J07r2K54
$$ y = [-16, -76, 25, -201, -104, -262, -10, -46, -191, 119, -197, 241, -15, -19, -59, -151, -126, -202, -236, 33, -216, 126, 125, -96, -260, -35, -20, 5, 51, -4, 59, 167, 66, 129, 61, -79, -97, 226, -38, -45, -66, 105, 73, -193, -167, -54, -150, -106, 314, -193, -158, -17, 337, -179, 96, 35, -298, 68, 53, -225, -15, 191, -32, -4, 35, 83, -47, -305, 312, 101, -60, -118, -11, -199, 156, 12, 124, 198, -2, -129, 47, 168, 132, 71, 101, 151, -213, -2, -85, -128, -291, 159, 29, -47, 152, -179, -205, 160, 16, -85, -114, 251, -158, 74, -136, -27, 101, 173, -4, 30, 69, -68, -222, 1, 221, 95, -104, -193, -19, 143, 337, -45, 180, 229, 163, 52, 13, -165, 73, 40, -45, -272, -119, 391, 342, -73, -166, 176, 123, -44, 144, -68, 23, 64, 168, 184, -63, 192, -7, 5, -64, 90, -50, 325, 2, -38, -106, -43, -200, -75, 117, -59, -95, -103, -12, -307, 334, 115, -24, 99, 154, -27, -346, 24, 224, 109, -75, -161, -14, 182, 298, 58, 22, 129, 37, 291]
3789B91m34L28j81m1m4J30k55K93j20Q5j22M1j19J61J05J33m31P8N7J1J94j18
3811D2j83Q5K7J93k02k21K21J45J3r4k56L42%j93M5P9q7J49k12L48k37k00M27
3834B31k53L1J22k73j61M09J40l47J86N0P1k00L7k5j28L49J07l83J2k7N3N9p7
3857a7J36k07OM12m97K02k21Q1K0m9K4q6L74k44J02n7K02k27J2K1J7j08L62k68
3881a0o4K78j49r5J37j22l8j42L60j05L7O2k64L11k68M4p3K1J65j00K67K7l49
3904g0j70J87M1M9R8L1k10N8o5k2jJ15K24j03j50j69K70k73M0L15k93O1l5L2j21
3929a61K34k16M52l10k26N5K26Q4n8k00O0p2j05L94j89K9K03k9j83j10N0J10k8
3952A0K54l12j78J66l3O6m8j1L3L0K5j25j00M08k61K1J82k61R4j3o1K81k56K97
$$ y = [291, -143, 185, 4, -37, -81, 49, -206, 87, -33, 52, -70, -29, -148, 13, 118, 251, -180, -102, -45, -34, 160, 42, -141, -56, -29, 164, -38, -259, -38, 107, 120, 26, -230, 112, 112, -81, -36, 43, -44, 105, -107, 241, 4, -196, 231, -22, 9, 131, -142, -303, 106, 246, -101, 85, 135, 206, 6, 43, 18, -110, 239, 346, -37, -25, -52, 1, 60, -17, 119, -88, -82, 330, -167, 35, -186, -105, -85, -134, -110, -196, 178, -66, 36, -21, 181, -46, -34, -13, 4, -104, 258, -10, -74, 204, 55, -40, 97, -25, -63, -205, 155, 50, 87, 149, -115, 196, -72, -28, -101, -80, 85, -15, 252, 279, -70, -240, -53, -12, 37, 135, 166, -44, 14, -51, -73, -74, 41, 265, 162, 12, -157, 113, -160, -120, 195, -98, -37, -72, -40, -161, 73, -143, 309, -1, -227, -172, 54, 138, 80, -120, -60, -132, -237, 157, -32, -3, 200, 171, -12, -122, -72, 38, 10, 264, -48, -226, -60, -93, -27, -75, -86, -53, -23, 2, -123, -223, 185, -76, -55, 127, -134, -40, -53, -114, 167, -89, 208]
3976B08k87L2K99j17j24Q4p0j95L02qj57L06m38m3j44J28J83o0K47J09k44MM2
3999E7l07J48K66l85K40K08l18k69L11J23l6O9p4r5K20Q0j08l20J6K56O4m17M55
4022A84j24k72L27K01m47K20j2k26J20K40l60j43M04j71J58r9N6Kl5JN7J19j04
4045I6j67k60L22K8J37k43j59K06j95K49m13K66L75k95J11k28J73Mn8J68k85P8
4067i0R5o4j21L32j47j87J32R7J15m83L00J76m22K92J22l31o0K28l9j22K29k1
4089C1lj62J70j5k48L16K4n1J47k78J94j06M2l48K73J05o6oJ75j09j15O9J45j51
4113C3p6J36j62O0J54k81J05J44r5Oq0m0O5J39Q6j44k46N5J24Q7o8j44Q6J48J50
4138B42k32pK37k48l13K92K91l4j24j46L3J85q2Q4m48L03L6K6q1j63L05j8k08
$$ y = [208, -79, -47, 252, 135, 11, 95, 25, -170, 132, 124, -33, 273, -165, -208, -352, -224, -41, -101, 146, 255, 11, 15, 57, -250, -102, 164, -221, 19, 227, -91, -360, -49, 74, 38, 107, 33, -62, 158, 238, 130, -190, -174, 82, 146, -271, 184, 60, -212, 115, 316, -131, 89, 77, -149, -29, 211, -149, -292, 112, -59, 99, 0, 56, 58, 23, 24, 81, 200, 96, -71, -331, -9, 19, 156, -87, -246, -40, -235, 14, -399, -133, 242, -53, 58, -170, 3, 7, -51, 117, -168, -90, 5, -59, -180, 152, 5, -182, -50, 47, 162, -321, -21, 155, -267, 25, 147, -184, -244, -16, -55, -177, 52, 31, 28, -134, 36, 21, -227, 89, 113, 62, 209, -69, 125, 19, 61, -287, -14, 91, 25, 19, 194, 85, -30, 39, 184, 33, -43, 93, -69, -9, 145, -136, -31, 113, 18, 24, -56, -96, -31, 108, 194, 50, -196, -141, -17, 70, 2, -142, -56, 92, 242, 10, 3, 240, -8, -321, -29, 262, 228, 104, -42, -9, 176, 94, 178, -270, 33, 69, 95, 14, -149, 156, 138, -70]
4161g0J35m1K46m46M06j05k46J93k51J70O7K03j30l5q3O5j1J04lk15m9J44K11
4184B59j99k16K32k66M04k53rk31K31J55r9K49J39m06K25r3k1k93O8K92q3j33
4206d8K20j84j71L18j68j66L61l3k56j1J24m3o9L04k55K9l8O4j38J19L1M74k68
4229A96r3L55n88J62l0k18J24O3J34J95k52K97l46n7P3n7o1J71J1j49K92k65N1
4252Hj82Q1l5L40ql83K35k8k97J72q9K39J41p0k9n2k32K34R1j49k3P4p0k18M23
4277A73k28O4J05k16K0j16j8J70J30l3j12J26l7O9j64j95K26JJ66j32j58J29q3
4300a13K97k53J46j36j85K88P1q5j75J38J55j79k2oj4J86p1m4L3R8j04m0k9n2
4324i6k3J66m3Q5j79M8N5J33J0j31r4K45k44J72l12J22r1L82j16r5q8j00K44j14
$$ y = [-70, 65, 24, 270, -176, 230, 125, -121, 72, -179, -9, 58, 261, 131, 96, 13, 78, 67, 171, 168, -47, -96, 48, 259, 60, -156, 76, -190, 214, -39, -48, -279, -48, 107, 8, 257, 396, -10, 215, 122, 101, -192, -124, 168, 85, -48, 172, -12, -183, 135, -33, -199, 162, 129, -127, -138, -14, -57, -126, 178, -77, -48, -86, -22, -160, -41, -10, 464, 196, 103, 458, -130, 32, 2, -216, -92, -29, 105, 300, 48, 345, -1, -58, 15, -42, -103, 68, 79, -70, 222, -43, 8, -174, -93, -128, 212, 204, -179, 56, 28, -269, -97, -186, 53, 194, 124, 95, 43, -189, 45, 136, -13, -36, 38, -32, -250, 173, -55, 9, 114, -102, -82, -198, -216, -46, 84, 51, -61, 65, 28, 97, -67, -262, -36, -35, 131, -1, -159, -30, -113, 184, -69, 77, -59, -244, 44, 115, 30, -145, -7, 148, -31, -53, -59, -73, 113, 42, -2, 31, 129, 25, -15, -44, -96, -119, 47, 4, 89, -90, -42, 13, 146, 156, 25, -69, 176, -68, 104, -208, -86, -177, 205, 89, -6, -94, -194, 50, -64]
4348f4L32m48P8K37k38J7L59l61J6J72q7O1r0q1N7Q5M4m1J53k53M4r9M0K9J23
4373H5N6j60k58M03K8k4l70k6L77l43K72L7L0j29P8P2j63j77K63j04J05j8K69
4396C03l86L91k1k82j11L78k27L36n00M8j83L02Qj44J74l75J53n7K27o0l89N87
4418A72j97L4k28L90j23J7p4K47l97K3J88l77L15m9j78L64K0o1j99J33J76k28
4440c2RP1l01K55J80l14m6M23k31J58q7jm45L02J40P8k20j01L43k73K87k37r6
4463a38K76R0p2j45k21R9K26P3L1j65k16O9R2j11l7L12j53j09J61j85l8J51m4
4486e4L1k92M57k44l6J71J48l00J20J08k49K45j66J18k8K79k19l3k10J07L80k32
4508A01q7j94l0L43j76j51J92M1p9J67Q0j97Q4J89n26M83L4j61M9l0o1k56M6K04
$$ y = [-64, 268, -180, -102, 135, -103, -86, 273, -88, -72, 100, 13, 74, -16, -97, -40, 45, 89, 48, 201, -52, -8, -107, -67, -38, 85, 141, -19, -277, 126, 154, 130, -240, -266, 111, -232, 40, 77, 107, -22, 56, 128, -35, -212, 51, -53, 52, 34, 303, -83, 308, 287, 5, -106, 272, 45, 381, -119, -71, -254, 48, 56, -88, 86, -289, -136, -193, 34, -26, -415, 172, -25, 9, -219, 171, 48, 65, -9, 238, -159, -136, 52, -325, -10, -59, -237, 127, 147, 86, -113, 20, 196, -32, -23, 48, -253, 2, 182, -132, -178, 245, 14, 172, 85, 84, -361, -59, 81, 159, -61, -162, 181, -92, 195, -42, -138, 138, 228, 156, 11, -210, -111, 115, 188, 219, 54, -162, -93, -1, -112, -149, 163, 10, -99, 62, -123, -161, -10, -54, -23, -315, 142, -102, -138, 33, 181, -119, 1, 109, -140, 105, -61, 57, 29, 308, 89, 56, -154, -47, 333, 101, 14, -180, -210, 133, -43, -194, -2, 39, -40, 127, 207, 10, 94, 283, -243, 240, 274, 113, 162, 132, 71, -185, -139, 65]
4532F5j89Q9O9k6j30J05J23m04J30L05j56J4k10M38n32L64mj70J72j58N53l83
4554F5jp5o1J48j71J73k5j87L93k73P6n8j07m9J0K49o4j92J23J07P0k3m0Q2r3
4579G7j96J4N0LjR6J65j39k8J83k20j59J8J63JO6r8k91L70J8k21K88r3O5K0j8
4605A33j88o4M9J51K6l4j59o0K31j01RR9j65J80j30M8N1J21k50M6J69n3j84J5
4629f0M3k6j03K57j1k1j75r7J98L6k05L89m50L84p3k0Q6l44J39K7J90J43j80N4
4653A81j23O2k26jJ84l26K43J05k17P1L2r6J60O9J10k53o7Q3j74L70j73k08K07
4676A3j13m3J55K93k64K02n28J11L0M15j53m9J70j34m4k75l17l9O47j59K25m41
4698b98j87O45p95P69J57k1p09O30n82P95k39m73L92o1l71P13l25O30j654Q63
$$ y = [65, -124, -35, 34, 8, -122, -17, 106, -298, -168, 137, -19, -5, -215, 223, -309, 55, 51, -119, 53, -105, 448, 65, 64, -11, -72, 76, -95, 78, 53, -134, 259, -14, 62, 4, -103, -152, -142, 107, 43, -149, -26, 81, 151, 128, 88, 170, 77, -119, -105, -55, -52, -53, 43, 208, 69, 41, 224, 4, -155, -137, 26, 27, 93, -5, -296, 74, 92, -129, 159, 66, 131, 151, 133, -55, -119, -70, 81, 107, 73, -86, -146, 85, -16, -7, 92, -73, 107, -23, 25, 76, 197, -53, -7, 162, 109, -75, -60, -17, -43, -146, 111, 100, 79, -96, -193, 5, 41, -164, 225, -225, 159, 86, 66, 152, -192, -53, -26, 164, 307, 127, 181, 58, 120, -106, -107, 77, -249, -6, 99, -118, -47, -15, -111, 49, 118, 228, -25, -92, -9, -183, 187, 14, -194, 13, -100, -143, 12, 305, 41, 243, -285, -174, -144, 271, 118, 69, 239, 105, 61, -214, -531, -570, 77, -82, 143, -298, -485, 160, -635, 134, 291, 270, -439, 191, -391, 404, 165, -308, 84, 23, -348, 365, 40, 670, -984, -121]
4718a21J028p07m11N69J64l02j12m8J78m17O28k29l54J19J42L73m85N6N1M73l57
4739B38L16j085L77K61k66K90L23K8q66J7Q6K41r7O69m07n54L10P71n06o69K71
4760b52K27q6j76P43m82q9j18J80Q4K97n11k17J93N19l31l6P9J5j7Mqj94K23P1
4784A18r0m13N40o8O9Kj69l44N85Kk33j8j22N43m58Q8J32m45L34J02k89J40q5
4807g9j30K55mJ5q8J32k6jL6J11k97L3J25j11j0OJ86k13K49j27L9j81P6J07j95
4832i2J18j0k4O3j96J17J39JM2k38P2j81L61pj64J76j55n7J74j22K7m0r7J26N7
4857I0j81K90j62Nn8k75P1J67Q1n1N5K1J36l09J11k36J21L24j22%r1p7K20O2k02
4882a0m37O87k76N4k3M9J77l03m1L3J64k49J09P3k3J10j09p1k6M1K74l88Q4p4
$$ y = [-121, 907, 200, -211, 358, 522, 220, 108, 60, 238, -179, 449, 220, -134, -15, 127, 500, 15, 71, 122, 595, 238, 554, -531, -154, 107, -159, 131, 454, 482, -384, -367, -281, -40, -137, 532, 125, -429, -119, 652, 146, -523, -252, -25, -111, -287, 456, -26, -115, -233, -53, 31, 328, -183, -400, -207, 312, -19, -55, 24, 39, 22, 26, 18, -176, 47, 118, 28, -385, 155, 87, 156, 158, -11, -355, 230, 232, -1, -19, -141, 402, -56, 32, 164, -281, 53, 155, -134, 6, -79, -209, 46, 42, 57, -31, 101, 75, 74, 110, 221, -76, -43, 82, -29, -39, -33, 153, -60, 189, 62, 101, -80, -4, 103, -92, 26, 16, -8, 55, -141, -24, 115, 116, 158, -80, -8, -189, 172, 165, 1, 177, 22, -35, 139, 17, 44, 4, -93, 33, 90, -91, 199, 37, 42, -16, -291, -220, -53, 28, -23, 32, 53, 189, -120, -9, -245, -124, 200, 78, 78, -13, -90, 130, 192, -10, -447, 240, -36, 18, -5, 44, 221, -82, -123, -90, 74, -175, -66, 7, -16, 94, -15, -86, -112, -71, 203, -185, -101, -175]
4906a75J02K24k62q9O0J79j47L7P9j73M6N5J4p0K83k75K09p2o8J1J02P2l8k19
4930a15J04r0m1K06p1r5j62L59O4k39J92K6q3P4M5k27J8L19l24J0j43J70j37J36
4954dk8j21j38L21Pj21J58k66K38J64k44L8J15KN6l6R3o4q5q0j54K80l24K66j17
4979d4J1O5J39j93L05j77k09J65N7k01J73N9q7r0M0o6q1K10J99l17m1J95lk76
5003a67J45K55m46P5K31l20L13j73j65J44O4q1K63l65K01J87j78L6M8o5K9J70
5025B01Q1j36p7j34O4J02M7m27O19j99j5j0q6R1l21L06l08J10N1O3L1O4j70j3
5049f6J47J16l64J81M5m9q4O3j76K73J39j07j22J52k48K7K28j27J96l45J30K2
5071C1j05K77n0j38O1p8j6J4J55l21K24J01j16J7j41L23j17k67M4r7K01j12J81
$$ y = [-175, -73, 151, -111, -200, -140, 39, -108, -71, 8, -165, -119, -64, -50, -120, 163, -112, 97, 25, -43, -32, 70, 142, 104, -115, -11, -101, -142, 64, -7, -102, -264, 95, 159, -80, 112, 138, 55, 129, 174, -53, -35, 284, -40, -30, -173, -3, -140, -4, -32, -153, -291, 30, 37, -84, 74, -192, 46, 210, -34, 4, 119, 121, 177, 141, 234, 170, 85, 5, -149, 131, -193, 73, -44, -33, 32, 171, -22, 283, 106, -103, 62, 119, -82, 91, 150, 63, -27, 13, -53, -134, 76, 275, -42, -83, 112, 109, -167, -22, 233, -213, -138, 93, -227, 86, -87, -252, -108, -44, -125, 138, -227, -26, 161, -17, 19, 67, 2, 31, 201, 282, 146, 69, -65, -1, 101, 148, -279, 340, 141, 126, 116, 30, 121, -200, 106, -202, -92, -41, 22, 53, 117, -53, -66, 81, 197, -167, 14, 59, 10, -74, -11, -187, 86, 225, 118, -4, 148, -100, -73, 155, 28, 224, -121, 9, 31, -74, 203, 153, 15, 76, -2, -18, -4, 151, -170, 54, 155, 39, 56, -85, 238, 121, -146, -102, -199, 2, -110, 71]
5094G1k68l1L51j48J07j88J67r0M0L4k86N61m1j24q0k55J94J75K00k57l77J93
5116e2J49k18J09jn1o5K12q7j17K84J43l25N8p8r0K05k29K9J11K28j51J32p1j
5140A24j18K16k53J4r7K69k16K71mj65l25LL63ol23K10P8k44J39j5K77k62N8P
5164Ao7n2N87m22j57J68r0J97Q8j85j8k2j76K48r4PJ16k07N7q0J70l33K97k39
5188b06Q6Q8j87Q1L64j22o8j4l00K10j8L40j83q6K18Qj62j51l2k4J86J92o5k70
5212a15L62j72l22J43J37n1J78k4j51K2o0q9J85P2k00k5L19k17r0J64j50K41O5
5235B22p5m2j39k08L30p4J67m8m7NK62l04q7J32k87K64l72J20K82J01o6l63J17
5258a10K16j75K08J3j30LJ50J21j78j38Q7m8R2j55K86l32q8J63r0L49k72j3J12
$$ y = [71, -197, -228, 123, -25, 82, -106, 61, -29, 11, 45, -241, 320, 279, 155, 75, -180, 14, 189, 389, 132, -245, -52, 97, -121, -12, -13, -64, -129, 83, -4, -121, 163, 306, -19, 39, -39, -129, 76, -153, -124, -13, 215, 64, 196, 125, 124, 6, 222, -31, -17, -114, 155, -61, 210, 206, 41, -284, -281, 82, 76, -247, -37, 41, -203, -64, -79, 198, -64, -6, 1, -66, -118, 469, 47, -110, 58, -32, 165, 253, 68, 50, 28, -148, 100, 6, 13, 129, -78, -21, -101, 69, -264, 33, -206, -120, -32, -219, -138, 226, 104, 36, 22, -278, -68, -86, 254, 71, -15, 203, 211, 49, -102, -134, -158, 28, 220, 155, -115, 247, 75, -247, -104, 33, -18, 160, 136, -15, 7, -53, -142, 43, 115, -85, -110, 209, -8, -98, 66, -84, 157, 222, 147, 105, -34, -242, 88, 14, 181, 133, 86, 91, 353, 49, -38, 94, -193, 71, -301, -181, 101, 202, 136, -227, -110, 106, -69, 139, 152, 22, 25, 175, 296, 118, -20, 67, 19, 111, -44, 242, -90, -178, -15, -105, 244, -28, -41, 71]
5281G1J66l99J02q6L52j44J84l65K22r5Q1q5p4J28k68L98R5l46k37M78r6%j10
5304b8J32m9n7j35J24O5l16K41J26j12P0k6l69L53j63Q7K9K33j74M5n5m8Np5N2
5329d5j23L93j97l9L60m60M5J13N3M7k83J21N3Q2j72R0q6K26j53k3L1j56k64M51
5353F4J0R4k74M0K0j38K18n3J01j66J22J16k87K33K30l51J4J94o8Kk00K83q5j2
5377A07M5K6n32L20K8k77L46q1k41K59J09p6RJ84O3m74L05k64K85l50J18J09J20
5400A38m12L16j13J17j79L35j02n04M33l32K90m1J88k0k15Q2j02q8J68L8R1j03
5422a5q2J48K29k75J30l82J01Q1j80K06k35K77J86j86J42j21l8K26q2n7r9J51
5444A25L4k33J49J21j64l32R9J02j71K04M3J80j55K72l10J58r5q9R1j6M0r8K09
$$ y = [71, 237, -162, -60, -146, 206, 62, 246, -119, 103, 8, 89, 4, -70, 58, -210, 188, 283, -63, -300, 178, 82, 82, -28, 104, 55, -2, -137, -13, 52, -264, -23, 103, -9, 61, 35, -334, 19, -144, -57, -28, 205, 31, 76, 21, -27, -22, -97, -45, -168, 225, 28, -11, 349, -111, -66, 47, 100, 147, -136, -15, 38, 120, -52, 38, -48, 178, 25, 2, 33, -123, -387, 64, 74, 168, -106, -66, -46, -184, 34, -19, 82, -84, 38, 154, -133, 100, 330, -21, -7, 187, 119, 121, -79, 204, 119, 107, 152, 178, -354, -34, -6, -283, 63, -18, -259, 0, 109, 33, 42, 226, 289, -185, 120, -144, 141, -209, -91, 18, 138, -274, 42, -71, 46, -133, 202, 100, -404, 29, -303, -13, -54, 134, 114, -101, -19, -121, -209, -41, -3, 88, -15, -97, 51, 280, 5, 135, -247, -146, -65, -245, -39, -274, 3, 189, 3, 145, 24, -14, 212, 130, 73, -26, 125, 159, -74, 75, 196, 32, -300, -201, -99, -270, -66, -23, 157, 2, 274, -36, 122, 27, -62, 29, 13, 53, -45, 164]
5467A64Lq4r0j8J5k5J38k2l03J98J93j26L4j31k6K11l66R1M12l57K16k3m8q9M7
5492A4K6k48J69K26l07Q4o7j56K16J7j51l6J10L69k74j2N9lp0J76n6k30P8J00
5516C4K7j39j19J50q1J60J50Q5j77R7O1j79rK60k51k1K46m38L08o4j26j31j7L37
5540A63l11J86j61K6L5J64j25k18J24m1J7J28M3K2j93K05r7j14K83P0m07L4K59
5563I2r0j15J01r3J90j64K4l5J81k6R1m28K97l3k49J11L9N8k50N65j39k26k9L14
5587A86k94J40q4p1J97mL2k2K14k7Ll22rJ33j30j10L20k05J55k13J13n3J32K36
5611C17m29K35k58J93J97m62J46%K33j07j98L34k43P9j11j9J40j28J18j38J52
5632E1Qp8L47j94q7l1K94k26j18rk6l4q3K73o4M6P9k91J14pN2K80l38K63n19M84
$$ y = [164, 167, 83, -7, -25, -10, -35, 103, 81, -222, -24, 169, 43, 77, -54, -80, 131, -235, -144, 268, -89, 127, 104, 56, -33, 14, 40, -208, -39, 187, -120, -36, -103, -259, -43, -26, -177, -213, -103, 266, -8, -20, 39, 36, -34, 142, 86, -144, -66, 34, 61, -78, -197, -47, -128, 32, 182, 267, 90, 187, 248, 69, 60, 320, 69, 48, 294, -144, 164, 100, -26, -157, -174, 163, -148, 38, -123, -97, -62, 102, -23, -241, -117, -158, -141, -13, 30, 52, -141, 64, -33, -147, 136, 206, -201, -167, 92, 2, -113, -12, -105, 85, -79, -55, -90, 91, 65, 156, -272, 25, -8, -257, -146, -107, -49, -299, 266, 127, -99, -128, 186, -108, 32, -52, -123, 74, 70, 102, 80, 294, 267, 270, -52, -61, 72, -58, -168, 152, -53, 102, -111, 2, -51, 81, 317, -112, 123, -135, 58, 255, -207, -61, -61, 172, 65, -133, 201, -42, 37, -74, -93, 47, -81, 37, -101, 51, 59, -19, 328, 134, 47, 16, 310, 84, -34, -43, -69, -103, -186, 87, 23, 69, 148, -143, -29, -36, 16, 296, -42, 221, -298, 186]
5658A86l15j2J02j02K74L2j41l2P7P3l8k35M3L13k40k92K98j8K26l29K66l37R4
5681a07P4r0J19O3j09J19l8k50K45j08J47l2J27Lk12k23K91p9QK76R0m12L71m14
5705a41k4J00K12O4j69J72k89o7P3Q3j61OP0n4M3K31l00M6J54N9k15J54L92o72
5729b33K31M0o1R1J4K4J26o9j14R4k57J98j27O0P2j76j34L72L7j82j04K58k62
5752a02J38J04k59J24Q7j5N4j20J50j30l65J94J00o8J83n7p8L00Q0m68K99p2M1
5775A20k61K3K24%j65o1j19J47L65m48K45m2M1j06O7Q8K2l47K58J89m18K18k4
5798A6P1q7j27N2k7L23j64k36j7K88q4J03o8j39J65O7k51P1L49k84n9J7j42J13
5822e0q5L6K65r3l0J69j63o0J32J4j10O0k32J89l4j83K27lr8Q9o1J59l71J52q9
$$ y = [186, -129, -141, -39, -141, 133, 165, 24, -8, 69, 142, 104, -131, -88, 225, -15, -307, -9, -27, 199, -130, 136, -201, -107, -33, -123, -4, 59, -50, 69, 31, -219, 26, -82, 65, 33, 160, 163, -49, -272, 19, -60, -52, 224, 314, -98, 273, -141, -165, -65, 147, 211, 42, 214, -75, -142, -69, 14, -147, -141, -71, -125, -82, 149, -151, -105, 49, 108, -107, 47, 439, -233, -2, 38, -23, 68, 82, 106, 232, 163, 49, 143, -114, 84, -43, 17, 89, -87, -221, 151, 188, 6, -98, 160, -102, 36, 140, -119, 5, 92, 77, 131, 11, 161, 31, -334, -140, -40, -108, 75, 18, -60, 240, 320, -148, 151, 79, 120, -141, -118, 106, 106, -59, -120, -239, -92, 273, -175, 70, 28, 69, -37, 30, 118, 140, -207, 51, 240, -178, 40, 16, 87, 0, -127, -75, -102, 221, 57, -179, -196, 92, 8, 111, 43, -96, 69, 136, -115, -44, 305, 21, -38, -21, -163, -50, -135, -99, 166, 73, 43, 212, 49, -11, 121, 135, 25, 85, -147, 42, 8, -175, 52, 49, -49, 40, -21, 138, -233, -81, -170]
5847a70K77j40J18n3m7K8m8K64l46N3K46m38J36K26j4j31K4J4L26m52q7M35l48
5870a27K27K9j9j24L2O8q5rj66K78j8j6p0n2K92l08K30k95qL26k38L16n13K21
5894b9J31R6n91M54L4k78J37p5N7L19l70M5K92j46J46j44j03j10L66m35K57Mr5
5917c8k1j18M66k23j24L49l16N1o2L2l32L14K9j55K21k88J65J66k38J96k89N7
5939a58J84k03M60k85j88N5K81m4l24J17K04j98K81Q1l35j9J10Q6j91mJ0O1J00
5962H1j83q5K49p0K2j99J46q2n1K99J22l69J12j23Lk8L28J0j78O8o3J30n98L77
5986h2l1J33J18j28k88K24r1J77j64J58j03KK89k33pro6K30r3J02j52l0J47k92
6010a89J7L94k4l68l3J81J51j49J35m5j66R7j10o8K28J21j14J05j97k81K50q7
$$ y = [-170, 107, -33, 85, 32, -15, 13, -35, 229, -117, -64, 182, -256, -120, 106, 92, -39, -15, -1, 325, -127, -214, 221, -127, 100, 129, 110, -14, 18, 86, 1, -8, -174, 104, 86, 70, 0, -52, 240, -68, 162, -133, -141, 185, -53, 263, -250, -29, 102, 198, -393, 61, 95, -183, -46, -121, -64, 255, -115, -70, 222, 76, 222, 78, -25, -135, 231, -204, 53, 57, -38, -59, -177, 289, 66, -58, 291, -25, 26, -36, -4, -336, -22, 7, -148, 73, -215, -50, 116, -122, 74, -215, -158, 26, -177, 283, -2, -190, -135, 146, 102, -222, -105, 99, -99, 182, 263, -72, -91, 19, 105, -86, -90, -80, -19, 81, -102, -187, 62, -8, 14, -185, -39, -121, -172, 127, 249, -120, -8, -131, -128, -156, 172, 182, 4, 72, 9, 139, -459, -82, -113, 20, 138, 10, -278, -54, -145, 32, -132, 26, -77, -75, 214, -19, -26, -35, -101, 129, 36, 138, -14, -44, 103, -189, -172, 222, 198, -170, -203, -22, 129, -20, 115, 70, -96, 1, -109, -177, 51, 172, 58, 163, -34, -315, -65, -152]
6032a52K13k85K27k29K39J7j59L15nk02P9j48J77k30K57o0L11j45m17P1J23j44
6054a47j2M66j89l64J40K24r8k11R8M9l8kk7k5j10J49J28j3M8K7o7l7K49q8m1
6079A09P8m9k09p9K89j44L8r5M3j5k64J16K74j14ln2J79k23J30Q3j92n7R7J64
6103A04j53n3J82l4J20k12q4J62J9K0kjLL1J22k92J84m4l16L75j47PJ5k1Q6n0
6129B1k63J96j9P4J58o4M5j44lk39K22J10O0l08K86l07P1J26J0q7J1K59j82j19
6153h6J28p4J03P9j90n8Rj36N38m90k1L02j59K08l38J50K0R3r4n3K72k43L5J55
6177A50J11Kr0J9j36k1J46N6l91K82Pj08m9j38K79q2J25q4q0P7M5j88O7j24j3
6202a38K72k27J33j6N0k59J49o2o6L70k39JJ07Jl13L76k38L28oj84J48j24Q7O4
$$ y = [-152, 61, -224, 3, -226, 13, 30, -129, 186, 181, -21, 58, -90, 87, -143, 114, 54, 365, 220, -197, -126, -3, -147, -159, 307, 118, -246, -106, 118, 20, -191, -93, -44, -82, -84, -111, -136, -246, -97, 31, 18, 66, 93, 26, -11, 238, 150, 109, 187, 138, -71, -150, 139, -5, 33, -62, -19, -34, -298, -182, 92, -22, -25, -77, 102, -121, 9, 92, -100, -157, -60, 104, -49, -102, 80, 46, 166, -46, -130, 32, 51, 71, 69, 68, 71, 102, 224, -68, 116, 72, -244, 131, -16, -9, 6, -15, 71, 21, -242, -46, -65, 9, 167, 103, 148, 4, 1, -238, -16, 94, 154, -154, 132, -175, -104, 22, 32, -55, -44, 215, 33, -86, 42, -32, 71, 150, -40, -98, -89, -225, 313, -177, -198, 104, -55, 153, -185, -35, -15, 78, -16, -69, 203, -40, -5, 150, 261, 263, 173, 192, 56, 35, 181, 237, -154, 128, 135, 27, -22, -160, 119, 37, 162, 78, -2, 75, 120, -68, -1, -125, -138, 134, -93, 40, 24, 74, -185, -36, -98, -164, 206, -33, -32, 75, 76, -237, 139, -99, 229, 223, 39, 187, 63, 150, 214]
6226B14k01J34N3jk61k18K03Q4l4J26j8j19J21k71J88J88m00O7L92m25N7NM5K39
6250A68k44j08R0J45J8m7m6J62k15J17k2k0N6o6N2J18j01k45K64Ll09Q8q8K36
6274Fp6K96j5k12p6M7J02k28O7o2M4K04j51q0J13K62j35k65l2R1l3P1j28K71m
6299G7j07o2J90k86k8M40M1n0k80o9J60m7L5j0j68N0j5Q0q4J86o7L3r2L6j11K35
6325H7j27k30L43l90J17K28m2k2Q3J14k80j6j09M03k17n5o7K63p3J7J54R8l23
6348d4o5k1J22L3J07j00j61N2N3P6o2J09j17P2p3M3j25K34j21MM2P2r5l9JK39
6374B36k18j02J09m7n3K31Qk65M3J78j13J47k11M4Q2q5MJ1j20M6J70k90K57J8
6398H0O7j82Q5r5R2J04j10j07r1N2M5m6j06K78j65K9q5K56J4j5r2j19j50L90L7
$$ y = [214, 13, 147, 200, 199, -62, -280, -77, 7, -27, 99, 81, -38, 83, -188, 0, 188, -212, -145, 247, -178, -121, -116, -71, 168, -76, -184, -94, 51, 69, 22, -24, 138, -77, 40, 18, -2, 54, -12, 40, 158, 57, -188, 76, 79, -230, -142, -230, 6, -70, 226, 211, -1, -77, -30, 72, -156, -89, -151, -107, 97, -54, -134, -21, 241, 106, -159, -191, -100, -133, -62, -190, 81, 77, -30, -92, 98, -188, -216, 224, 265, 215, -65, -134, 26, -21, 14, 4, -164, -114, -129, -49, -133, 53, -14, 19, -73, -37, -148, 87, -40, -270, 73, -317, -200, 28, -14, -36, 47, 161, -119, -135, -244, 159, -58, -113, -180, 83, 10, 27, 181, 279, -44, -109, -130, -8, 25, 132, 32, -129, -77, -24, 52, -10, 99, -18, 54, -19, 24, -101, 133, 12, 16, 58, 130, 35, -4, -3, 236, 18, -84, 25, -22, -75, 156, 164, -101, -58, 120, 7, 154, -57, -13, 69, -16, -12, -1, -121, -75, 95, -195, 62, 80, 147, -35, 50, -45, 47, 151, 41, -66, -157, -105, -60, -106, -212, 66, -99, -70, -155, 101, 115, 100, 8, -111, -261, 129, 166]
6423A66p6j0j22K17l28L93m48J48K9J82j30Q0j39q5J46j8M8k58J82j62J8Q4J40
6446E7mL0j13Q1K6K2p2o7j17J43L28l27j85M19j63k55J94k56L66M6k50J51Q4l06
6470a68N0J38J66j82J79j55j46K45j58j4j56M3Q0PK30k68K69j68j43K12J01j60
6492Bo1m1k67K15R5K18m42L12o7O9q8j6L7j87K19k06J98Q1j90J11L15m02J35o5
6516b5J64l37L00j52Qj1M8nl0J79j98J3K33k89mK25l37M44j84k7K38m49J05Q9
6540bp5K9Q1L0l30K19J96l7J7j45l70J99P7L8P0L5J9K67j48n6j36J45k15L05m99
6565b86M86k14R4k57L48j46M1J53k17j35M6K31j43O0k39P0j27K9K15OM3q0J69
6588A47k08r6r8L38k24L0M0O9K02J10l73J64j20rK15k1k23mo2J08k84K22r8J04
$$ y = [166, 90, 80, -42, 175, -153, 240, -208, -60, -31, 151, 21, 101, -38, -123, 23, 5, 53, -205, -23, -185, -167, -83, 57, 53, 83, -30, 51, 77, 99, 27, -40, -157, -14, 314, -13, -198, 221, 58, -197, -3, -259, 107, 153, -97, 54, 138, -168, -118, 20, 186, 4, 183, 28, -118, 127, -31, -45, -201, -158, -78, -71, 159, -109, 160, -8, -151, 61, 162, 2, -59, -100, -367, -152, -57, 161, -281, 31, -36, 33, -55, -71, -34, -221, -2, -208, -10, 71, -119, -8, 307, -95, 40, -25, 139, -198, 102, -50, -42, -53, -5, -10, -40, 139, -59, -46, 187, -102, -106, 119, -218, 226, 42, 15, 253, -196, -91, -2, -77, -48, 33, 63, -267, -48, 148, 111, 128, -17, -387, -188, -111, -73, -3, 32, 51, 318, 170, 114, -22, 123, -92, 213, -286, 200, -14, 80, -177, 171, 25, 66, 219, 2, -133, -87, 144, 1, 61, -178, -108, -235, -206, 9, 15, 58, -22, 147, -61, -157, -255, 83, -141, -111, -71, -2, 200, 310, -63, 101, -19, -28, 187, 166, -57, -61, -123, -15, -299, -77, -175, -71]
6612g1J83M5l50O6R4r0J12o5j8Q2Q9k61K15j54K76q1j33p1L5J13K97k77J96m47
6636b15K68M5k43J86k50m0j00M60j09J62k47J61j42R8R9j14l57L01K97j63l24
6657b27K42j28RJ81l40K88j84m3j2L02j18J40j61K62n46M69j01j36P4J41l11P8
6679a21K63K3j93n4Rj42m3L57QK78n22J91%J8k45J16N6j38L0k84J90r2L58k19
6703a56K73J38l45J70j3k5J54k55M3P6j64J58J48j14k1n1L2M1l8o3l0r2K35p5
6727B6o9k21K45M8j00K24j94R0q5j92J67J22k00L86mj11k34J78j48J18J15O4m71
6750b46K84J03k84K15J5k75J82k6O2P4q6K0K07k08l3k9L5N2j15J12j28J31j48
6773h6K54k18m1L43k10K89m56j76J96K07j61O0J67l97L49M2k9l46J08K50l22J41
$$ y = [-71, 112, 157, -193, -127, -33, -123, -11, -76, -94, -12, 77, -184, 31, -123, 153, 72, -61, -132, -97, 16, 313, 36, 232, -215, 53, 98, -145, 41, -209, -249, -349, 111, 2, 164, -83, 78, -64, 34, 133, 19, -338, -37, 260, 97, -227, 15, -113, -104, 77, -263, 25, -159, -202, -214, 88, -30, 110, -51, 211, -335, 134, 33, -103, -29, 112, -199, -121, 142, 165, -28, -82, -73, -215, -258, 99, 107, 385, -137, 54, 54, 72, -173, -57, -1, -139, -109, -393, -203, -295, 63, -156, 117, 255, -90, 80, 67, 42, 196, -59, -16, 60, -104, 54, 202, 88, 67, 16, 48, 89, 51, -12, -42, -134, 101, 26, -43, -264, -19, 29, -71, 153, -41, 49, -36, -228, -61, 61, -139, 247, 243, 132, -102, 76, -72, 46, 161, 225, -246, 38, 141, -143, 72, 87, -188, -6, -32, 30, 104, 18, 38, 245, 37, 4, -25, 10, 62, -53, 59, -69, 62, -86, 168, -50, -91, 252, 42, 331, -125, -301, -105, 102, -59, 1, 168, -229, 120, 162, 133, -213, -105, 145, -177, -36]
6795c6J45O3J30k22k41L1L39n11K67j72J40M3%o7R4k38P6J04L01l53R0j20Q1J36
6819H0m35N41K91n04kK5Q1k25J40K09l33Q2K42j49k31J51J08M4J16m6r7j9k56
6842a87j13K24L46q1k84R2K15k47N6J13k6j57K12O1l6j26l8J14J20j13Po1k48
6865a57K00J62j38j15K34M1j19Q1l5k7no3j6l5m5k36L95j68K6O8n0J30k44K34
6889A18j31N4o8J22k48P5j8k6N1o2J84j61L22q5k33p9J67K10m8j33k75L65j98
6912i7J24O2k6Mj10J28l6k49K32m5K2j13K0J84J83n3m70JL57k30R0j27K42q9J55
6937A59p3k65K75J75k80O8J25l61J64K75k37k32L76N3j44j47j4qp8J53j26L12
6959A70k20j9K4j95M87k54j76J62ol79K14K62o3J0k86L79l07r2M22j08p7j6L75
$$ y = [-36, 109, 172, 302, 80, -161, -130, 209, -302, -35, -207, -67, -24, -24, -91, 3, -235, -159, -55, 246, -107, -17, -137, -56, 80, -355, 186, 477, -27, -29, -4, 77, -148, -8, 201, -132, -50, 192, 43, -188, -37, 71, 115, 231, 185, 88, 69, -187, -300, -76, 270, 189, -95, -3, 212, -35, 21, 134, 108, -49, 163, 224, 188, 62, 24, 138, 258, 145, 152, 91, -157, 43, 205, 67, -48, 186, 227, 108, 189, 154, 127, 122, 59, 43, 8, -37, -273, 122, -46, -20, 48, -2, 128, -116, 118, -13, 41, -27, 95, -153, -78, -96, -122, -71, -133, 51, -110, 212, 127, -106, -185, -18, 192, 144, 11, -264, 101, -97, 27, 89, 63, 67, -43, 85, 49, -200, 32, -13, 9, -104, -84, 100, 283, 230, -240, -239, 118, -112, -22, -149, 93, 4, 159, 86, -179, 96, 271, -9, 59, 184, -177, -13, 262, 25, -207, 169, 222, 78, -69, -83, -91, -169, -16, -142, 170, -50, -69, -45, -240, 247, -7, -183, -21, -27, -406, -192, 70, 7, 17, -269, 110, -197, -289, 133, 25, -52, -68, 307]
6982C07J24l14p8j03P9k4K68k16j42J73r0k65J68L7J83r6O9J92j89l70J79Q7j08
7005a29j06M28K07l99J84l13O1M7J14j03j18J90n7k55M88l1l70O9K01J60l58o6
7027a56J52p3K86r2m02K64k9K18m3Lk23k01M63m09P0J14P8q3K92O7k93OJ23Rj20
7052B1J1o0O9OJ89k81K17n6l56J1L17k13J57Pk9j3O1J15k44M5K19J55k47M7j81
7077c3j19J99m8j01J98L1o8j54L36p6k18j49K17Jk02L60l28j42K26q3J94l0k9
7100a8jJ08j62J54k7k0J08k29L61k61j34J11j2j08P6O1j27J10j87J11J32k4K47
7123B69m81p0M71j51Oq8J1Q5O4o4k37J90l34J62K7J29n5K01l0k21J21j89J30L3
7147b1J18j29rO2K55m10j13J88K2l6J45K39l51J0K9Pj40J60n7p4J69k52L31k90
$$ y = [307, 431, 117, 39, -64, 15, -9, 259, 43, -99, 74, -16, -281, -113, -76, 107, 11, 80, 272, 83, -287, -108, -21, -129, -235, 193, 400, 1, 185, -128, -67, -20, 94, -9, -127, 63, 6, -249, 239, 208, -162, -93, 108, 268, -90, -156, -4, -77, 209, 117, -285, -21, -50, 168, 125, 128, -95, -296, 167, -242, -172, -58, 20, -63, 229, 296, 3, 9, 132, 141, 21, 32, -28, 41, 47, 236, -45, 172, 116, -240, -229, 88, -125, 32, 39, 10, -3, 58, 173, -71, -26, 193, 348, 101, 148, -33, -152, 47, -1, -102, 96, 127, 59, -95, 241, 165, -53, -202, 15, 16, -186, 174, -154, -296, -70, -153, 41, 11, -18, -19, 89, -73, 81, 54, 34, 142, -87, 274, 13, -121, -10, -22, -130, -54, 7, -120, -10, -197, -86, 46, 22, 269, -212, -282, 189, 38, 44, -44, -33, 52, 116, 52, -185, 5, -329, -167, -140, -11, -66, 135, 105, -116, 5, -184, -54, -21, 97, -32, -41, 21, 276, -134, -247, -59, -37, -73, 72, 311, -40, -30, -1, 6, -134, 26, -31, -105, 64, -188, 143, -147]
7171a47k18L06lO0k13J19J62k19J19J00J50k33j28O2K42q9j64L5k25K42j8Q3j5
7194HO2j51J76k79J27jl4J10j50N0J57O5m27K52R7J99l99Kl8K07J53j55k68M53
7218B16l05r7J86N9k8k66M75j09j82J56N1p5P5Q9k03J32k76K2O0J00k20J57J6
7241C3j50K18j76p3J97p6j28L38n04J70P9j73J43lO5j14J16j37J05k04J75j36
7263b35L79j50j49J25Q9k72N39k58j05j19J04n8J72J16j71l8k91N53J9k42o7l3
7285i2J58J72k48K46m22L57j03R9k16M4O4jr1L8n7Jj0k05J35R1J61j89J12j59
7309a15Q1j04J55O3n1P9j10Q6j04r2K19k58J54k5jj60M6j32L42l59J27o9J66P4
7333A2Q8r1j81M13l50r2L38k37L47k64m7J40l03M16l36M4L40l68Q6q07Q78J158
$$ y = [-147, -365, -59, -62, -2, -215, -96, 66, -153, -34, 66, 216, -17, -145, -83, 159, 70, -94, -59, -284, -42, -60, 23, 8, 70, -81, 95, -184, -57, -58, -92, 18, -132, -82, 75, 140, -287, -35, 62, 261, -138, -136, -174, 33, 186, 31, -237, 216, -89, -186, 0, 59, 31, -235, 240, 131, -51, 105, 156, 81, 156, 245, 42, 174, -102, -80, -20, 80, -140, 17, 33, -117, 101, -75, -148, 49, -27, -155, 183, -321, -151, -72, -245, -102, -105, -40, -154, -38, -175, -70, -274, -99, -235, 144, -6, -155, -30, 59, -213, 326, 68, -37, -156, -52, -110, 62, 178, 7, -31, -322, 231, 250, 8, -59, -92, 66, 238, -10, 236, -186, 171, 68, 167, -49, -5, 59, 58, -33, 5, -52, -51, -61, -266, -131, -40, 121, -68, 44, -115, -34, -138, 17, 80, 29, 108, -2, 84, -20, -112, 107, -151, 3, -22, -23, -183, -137, -269, 73, -286, -159, -228, -62, 12, 100, 9, -172, 241, -109, -201, 137, -100, 247, -17, -64, 76, -227, 189, -147, -103, 237, -131, -45, -852, 26, 1184]
7355A184j419P2j62Q91q34m7M4Kpk54O40J09k89r4J98pL56n86m84R83o20J38K76
7378I0O8j10o8Q3k4J6n3K09l5k69jJ3J4J5p8J6J12l0K15l54M7L88j85j71L3J29
7404G0j09j63J36J36J09o5J6j72N2J74K18l17j44J92j28Q5M4j36Pm9o5N2J31l7
7428C7o9K05j43O0j75K8O6K2j35J51p0k2K1p5J41J45q2P0r2n9l5K0j83K41k56
7453a89J39r6J70N2j6k7L48l92o5n9R5K21J26Km29L7K20k38J38P0j55m8M5j3J59
7478I5K04l84M64n43J72M8O7k46K91k47K67k63N7J38n8n2jJ84j51J76j28J44k19
7501A5mQ0J47j20N5n2j82m2J00j00J12J77l28J19q4P3j26K04jr5J77k19K11o1
7525E6l5k8nJ89M2k95J86l74L04p9j12K68j75K75m72M75j85Q4k93K17j77N6J10
$$ y = [1184, -235, -163, -325, 566, -268, -315, -271, -269, -276, -530, 110, 219, -70, -164, 34, 27, 383, -203, -687, 296, -324, -186, 90, 158, 48, -20, 63, 39, 55, 2, 211, 176, -93, -94, -81, -67, -52, -130, -114, -2, -32, 183, -171, -124, 264, 79, -92, -59, 70, -39, -202, -66, 70, 179, 114, 130, -42, 10, 184, 402, 85, -59, 133, 5, 90, 134, -2, 5, -44, -109, -57, 74, 37, -32, 173, 30, 90, -85, -57, 9, 31, -104, 47, -23, -45, -24, -99, 42, 187, 105, 175, 83, 24, -11, 9, -174, 67, -189, -50, -146, 24, 76, 60, 33, 381, -11, -76, -135, -40, 181, 307, 309, -120, -83, 137, -101, 37, 107, -48, -96, -51, -64, 95, 299, -85, 379, -164, 8, 56, 123, -123, 168, -79, 188, -75, -18, 120, 62, 10, 9, 193, 42, 218, 90, 234, 15, 11, 91, 238, 118, 173, 121, -61, -103, -3, -103, 9, 186, -142, -23, -107, -34, -160, 44, 43, -52, 125, -94, 117, 56, 21, -7, -12, 177, 219, -76, 110, -264, 40, -39, -151, 117, -58, 217, -255, 220, 35, 119, -174, 43, -134, -78, 32]
7548C2l2n6Q6j2K58j10j40n0J71k77m0J62k21J23J99n0j23j87K16j0n9J47j86
7571a59M8J07J55l45L39l0j68J90m4m6j90M77n58L81j12p6L8P7M8l57L30L6l43
7594b02K58K6l31K70P4o5J59n3n9q5K34l63J77j34q8K41k09K20r3K75l14J0M7
7617em7j03R2j41N28j52j20k47K26L4L0M2j64M9J94q1l4j81J40p4j9K17l05L72
7641B51j00j5r5j11j14j9K00p4K67l38K78k76K29j38r4J53r9K46mm18K02J23J1
7664F5j29J03L6m50K33J38J0N6M50o43J45N9L4j82K55j00l21K86K7k14k31K27
7686a46K42nQ8k58k9J40j7k58J36N1q7J1R4J35O8k24K7J95j75kn1m7j78M04k46
7711a32K39l27P0K03j33L38n13M84k05l6J15j97k39J30L27K4K3j48j28M7K08j99
$$ y = [32, 0, -56, 30, 18, 276, 166, 26, -24, 147, -130, -170, -8, -229, -106, 93, 43, -80, -267, -51, -61, -120, 27, -159, -111, -4, 151, -194, 145, 115, -53, 137, 93, 47, -143, 334, -224, 157, 45, -31, 7, 84, 132, -225, 105, 141, -202, 56, 82, -249, 21, 95, 30, 189, 136, 77, -8, 226, -137, 40, -94, -182, 59, -150, 70, -23, 252, -62, -52, -5, -52, -155, -63, -204, 324, 172, 52, -195, 31, 65, 95, 137, -27, 22, 216, 135, 101, -80, 60, -14, -33, 184, -121, 251, 151, 136, 41, -70, -184, -203, -3, -77, 190, -148, 130, -146, 83, -55, -149, 4, -95, 151, 147, -271, -69, 54, 65, -64, 39, 75, -375, -142, -4, 6, 62, 512, -131, 14, 73, 107, -75, 180, 80, -241, 45, 72, -142, -373, -146, 96, 91, 179, -79, -108, 32, 15, -243, -107, -56, -143, -132, -38, 97, 165, -59, -32, 163, -12, -14, -65, -112, -290, 114, -132, 107, -220, -150, 53, -80, 258, -255, 229, 24, -12, 103, -94, -333, -203, 124, 148, 171, 23, -105, -58, 150, -49]
7733d9j44O9p3k6L45k15j47K15L4R8j60j06L08n16K22K30j95j20J42q0L69k54
7755e3K83m46K26O6j83q7K56J39Qj18j64k2MJ85p4Q9K40m44J32O3j9k49j35L05
7779Bj06o6J51K7Jj21J23n1qj85O3K81j3k10k2J67j13o0N20l89J01j62J06n7O3
7804D2N5q9J31k2O2l14K29l53L49J15j59j43K15J1l05K61J54k20R9j13J86k19
7826b8m5j81K44K73m22J64J26p9P0k61rJ84k08K40J41Q3n29L05j25NJ73K2k53
7849a10K64l55r0M75j66r7R8k0Q3j31J29J83m00L09j50j83K5L28j86p2R0l9K10
7872A95m5k04J20j68K8K81k36K7J97k49R4j36J68J24l37J54%j45J03J00k15K61
7894A17k92K91j47O1J6r9J0J34k91Lk4Q4K77k66J11k88L23j54K23j11J6Q3K8r4
$$ y = [-49, -193, -124, -197, -223, 122, -93, -240, -25, 9, 107, -53, -159, 149, -367, -145, 85, -110, -230, -88, -168, 201, -53, 230, -216, 10, 76, -107, -194, 62, 201, 209, 91, -73, -95, -91, 94, 20, 109, 349, -95, 37, 100, 81, -168, -303, 2, -104, -170, -19, 8, 9, -112, 11, -40, -48, -233, -170, 111, 98, -112, -134, 33, -80, -140, 380, -9, 92, -70, 36, -21, 42, 97, 8, 139, 117, 179, -135, 94, -259, 90, 205, 46, -97, 118, 129, -176, 85, 239, 19, 118, 5, 191, -28, -73, -254, -10, 263, -159, 5, 131, 52, 122, -139, -148, 36, -172, 68, 209, 292, -237, 68, -57, -52, 121, 143, -110, 154, -201, -291, 184, 18, -79, 19, -1, 82, -49, 80, 263, -137, 172, 22, -161, -136, 192, 6, -66, 24, -15, 195, 150, -54, 66, -102, -74, 207, -29, -2, 195, -54, 40, -96, 72, 196, -141, 13, 13, -132, -29, 71, -144, 117, -175, 116, -31, 30, 46, -53, -43, 91, -200, -197, -221, -137, 140, -126, -15, -303, 20, -134, 89, -22, -6, 77, 105, 11]
7918A1k7J22KP0k21j20K48k5j23k32K79K05J40l73K5n1O4L9p0k2J94Qj48k29K05
7943b9r1K94j33l3oj09L07k36P7k4l34J48M2J64j45L3J48j30j35L72n0l66K50
7966A4j1J85k15j60Q3J63j48K0K04k04J09j08J04k41M37j22j84j43L35R6l68L23
7988A69j75K12k65J41m31K51R7l9q5k0M28m05J14M0k45L8J96l7k7Q8m7J61j03
8011E6j42J90n6j51J38j10K36j50r3J81P7ml91J99m35L13K62l96K79L4l22L53
8033F8j95P4Pj20M19k13j49J27k21L00j77l5K83l43K51j63K61k98%J30K25k23
8055Hk91N42l23J82l13K12k6rR8K4j73J1J40p9k67L22m0j53K82K9q8O4q5R0k95
8080a38J14J60r5j00ML00k91j96K62J74k01o8J4P9j44j4K61ko7k71Q0K39J46K2
$$ y = [11, -16, 106, 108, 178, -43, -163, 85, 60, -63, -295, -16, 189, 329, -44, -19, -70, -6, 33, -37, -59, 135, 143, -5, -234, -29, -120, 174, 41, 8, 2, -107, 200, -36, 41, 17, -317, -169, -127, 37, -108, -75, 73, -57, -192, 180, 130, -236, 14, 3, 188, -27, -187, -104, 59, -89, -69, 135, -69, 40, -68, 36, -205, 232, 110, -74, -217, 118, 214, -154, 169, -6, 206, -59, 82, -349, -98, -1, -40, -125, -145, 283, -122, -8, 32, -213, -175, 21, -16, -43, 45, -2, 159, 56, -86, 104, 48, -103, 35, -75, 161, 11, -82, 99, 176, 172, -219, -20, -455, -142, 120, -276, 3, 37, -285, 68, -127, -53, -46, -166, 253, 40, -109, 18, -203, 97, -80, -115, 168, -175, 76, -87, 174, -124, -124, 6, 231, 8, -283, 259, -64, 118, -195, 17, -9, -18, 80, 104, -69, -58, 82, 3, -264, 58, 18, -135, 147, 176, 88, 152, 67, 157, -138, -24, 136, 41, -59, -55, 245, -46, -242, 20, 194, -7, -75, -61, 18, -126, -140, 121, 119, 52, -219, -139, 100, 246, 268]
8104B68m19K25j47P9j14K3M30l72K14k03M2p2j41o3J36L5J9O7R5m2k85Q9K11Q7
8128A62n24J69L5M5J3L85m84L34k49j9K27P7p3N3j48M6j51j3M5K33l50J37J66
8151A16M5m25K44J10k1k07K15j84j02K62k32J86J30J0j89J08l39J51K94k69l9
8172a36K62J33k98j98L39m19K17N7J44l82K43J66j13Jk40N06m46K12k69
$$ y = [268, -151, 74, -73, 6, -108, -85, 345, -27, 187, -16, 26, -46, -187, -250, -114, -79, -60, 7, 102, 60, -225, -136, 75, 162, -362, -193, -158, -113, -100, 285, -199, 135, -114, -133, 94, 171, 98, 151, 3, 49, -102, -115, -70, 163, -187, -50, 116, 161, -264, -20, 90, 69, -138, 77, -107, -209, 53, -179, 7, 137, 147, -42, 66, -273, -122, 172, -97, -136, 126, 259, -39, -237, 102, -317, -100, -43, 101, -281, -38, 128, 15, 16, -224, 282, -164, 48, -221]
8191b21
$$ Imaginary data points
##PAGE= N=2
##DATA TABLE= (X++(I..I)), XYDATA
0@%%%%%%%%%%%%%%%%Qj6J6j6J6j6K4l2L3m1M8n6O6p4Q5r6J10j26J42j60J80k02
38a07K28k56K83l14L51l89M30m77N27n80O40p06P77q55R42j038J146j269J406
57G39j560J738j948K196k495K865l334L954m817O112q316J3075m2748K5137R340
72f2m8162K2348p6056p1176Q9982R0843o3828l5329J7635k4090J8498P5760m3695
85d7332p1152P2503P9164l8511k5460O65k7100M1256R3812k2239p3682J3564K2714
98A8202r173L7162J4671n5441N630N4642l6473m8523L6614J5932k5703K0509l904
111B4145n9058J2361M7256m2965l3919M6721n98m1906J8224l680n4646K8424O4547
124D906l8232n1972K1877N023o667M0970m719n8735K0688N8534k1636k7948K3173
$$ y = [0, 0, 0, 0, 0, 0, 0, 0, 0, 0, 0, 0, 0, 0, 0, 0, 0, 8, -8, 8, -8, 8, -8, 16, -16, 17, -24, 24, -32, 34, -40, 45, -51, 59, -67, 75, -85, 95, -107, 121, -135, 148, -166, 185, -204, 226, -251, 276, -304, 336, -370, 407, -448, 494, -544, 602, -667, 739, -821, 917, -1031, 1165, -1330, 1535, -1799, 2155, -2662, 3450, -4866, 8209, -34539, -9402, -62, -48224, -25876, -101932, -173108, -83126, 7717, -56111, -91440, -73805, -97895, -79397, -3637, -47332, -118484, -45981, 33183, -5328, -30788, -30123, -57223, -15967, 77845, 55606, -18076, -4512, 18202, 9029, 46191, 60862, 5421, 11051, 65693, 29220, -19303, 17311, 33243, 7540, 28049, 24145, -34913, -22552, 24704, -18261, -52180, -5459, -6057, -47963, -29739, -33419, -88065, -59641, 4906, -33326, -85298, -63421, -58398, -65065, -24095, -28814, -87549, -66861, -8327, -29963, -57911, -34738]
137c4738J676K66M2342N41m7685R292M1935Q10M71P497k1979J839M1296o398l6443
152G22J3735K1793j1617J748q47l0061N124L4127j7922l2002J1296J123j7263
165b0044J6530J607m2759L504L9442j7170l2543J3271L299q917K4218J339m0653
178e8876Q152M0337j1444j7486J8364k590q430L0506P070l3640O809L2715m379
191G108n822Q783j3372J053L5150l582l3006J0448K0275j0228L781O820k4935
204B473r27L3200r363k9626J1011N309j5084J7163P343m0673l429L9181j0598
217E980k9408J5125J123k0458K0887J3500l8765l047L7084j0351k2152K0860j305
230a0927k2755K6433K0423l5661m945L5141o532j5529K0139k734j7415K7018J4415
$$ y = [-34738, -33062, -32796, 9546, 10087, -37598, -28306, 13629, 14439, 14910, 22407, 428, 2267, 43563, 37165, 722, 14457, 36250, 24633, 26381, 25534, -4527, 597, 34724, 16802, -15200, -3904, -2781, -20044, -3514, -1907, -44666, -41162, -1720, -18890, -51433, -38162, -34863, -43780, -19562, -18223, -58876, -50724, -10387, -21831, -39317, -20953, -23543, -31973, -1467, 5603, -28037, -21228, 11487, 7108, 1286, 10069, -3303, -2250, 32900, 29318, -3688, 6760, 27035, 16807, 20588, 27408, 2473, 1546, 34746, 25383, -4243, 6768, 12077, -3007, 14156, 21499, -19174, -22603, 16578, 5980, -23428, -8303, -7180, -27638, -6751, 6749, -32016, -35063, 2021, -8330, -30482, -9622, -10927, -33682, -7249, 13174, -22487, -27432, 7709, 1177, -14352, 5787, 3053, -14362, 12656, 27071]
243B7071l3043M22K8772r658q169J9866j2616j9237K8526J1023l0864L21J8022
256B0436j4929P92J9499k3494k0550L2340P497l1824M300J2828k1406O290K6508
269A8287k4779k3616L0262Q316k6110R433J1085k4552R193L1432k2836k4677K8444
282a18R930k1154J0693R599k4210O877K9772j7619k1224K2388O249j6158J1481
295F506M481k3279Q689K6076j6476j7539J5729K062r281J3383j687k2522J1924
308a934K1406j6237j1670J2086m286l428J8818o474k5420J2696K0342j4033p036
321e170R053j0477j257K2621o778k6159J1351J7733j1622k785P325j4154j929
334a2248K4652l029k4516O435J4229p928J039N190j3759j570K1204j805j8672
$$ y = [27071, -5972, -5550, 23222, 13564, 5395, 25261, 12645, -6592, 21934, 32957, 2093, 2414, 20436, 5507, 6299, 25798, 2304, -18246, 14094, 21591, -10233, -5933, 6895, -14511, -8221, 18287, -6492, -30108, 154, 8470, -17640, -8207, 2878, -21674, -12481, 18951, -3885, -28562, -118, 9812, -11342, -649, 8950, -15260, -8383, 21389, 3770, -17454, 4934, 11183, -4975, 6506, 10987, -12292, -3603, 22473, 5997, -11542, 4187, 6249, -3032, 10351, 8664, -13858, -1934, 19472, 3235, -8435, 3651, -635, -4063, 14755, 8281, -17139, -4443, 15899, 1866, -5170, 3883, -6594, -7851, 14770, 7992, -18167, -6816, 10917, -705, -3490, 3835, -10319, -12248, 12404, 9375, -15141, -8706, 5523, -2405, -1366, 3824, -9935, -11505, 9699, 7894, -10778]
347a0778L902P830l758N631J975j5060J230J7766j926j1744J871J264P66J1308
361A0277k708j6190N379J5603l951n725K708o301R95J7826k943j9844M327J3903
375A3356l815j648J728j3007k12K0776k316k1929J890J0745m066J356K038j5509
389a0613l350J9944N39j7399m10N073j427Q117K156j7825j601K0380K111j2067
403f372Q13Q62M44J3444J520j7693J946J8021p17n852L377o372k023J9599K133
418B3130k2786J02J7931k398m531L049j2090m604K2550J675k5988r29J6247m977
432F381l078O020j4847r813K2399O953k3559m850J2073k014K015O379j6830r864
446b2635K3527Q703j9829l351R306k156N698Q634j4964q826K0073Q350j2423l75
$$ y = [-10778, -6876, 954, -2804, 2827, 4802, -10258, -9028, 8738, 6812, -4932, -3061, -1797, -1031, 10277, 7569, -8621, -3242, 12361, 8410, 2685, 5393, -908, 87, 17913, 14970, -4874, -547, 13356, 9541, 7893, 9621, -3386, -3598, 17178, 14862, -7067, -5177, 5568, 1502, 2858, 4896, -10613, -13963, 5981, 6520, -10879, -11289, -6216, -7643, 474, 2630, -15195, -16796, 3584, 5695, -6372, -5559, -4697, -4253, 9191, 10711, -6982, -5036, 12985, 12268, 6416, 9793, 3421, 1398, 20997, 23130, 344, 446, 18377, 15979, 11448, 14497, 2407, -2197, 20353, 22028, -3960, -4889, 11358, 6381, 3303, 9323, -5524, -15337, 7062, 14015, -9544, -14394, -2321, -4335, -2320, 4059, -12771, -22635, 892, 9595, -10234, -13585, -4279, -6435, -737, 7897, -7067, -15893, 4180, 12530, 107, -268]
460b68K570m242J1781J0680j8156r562K1014P150j2327O52l84o637J2484J0429
474B5184j9853r935J7761K414j0642L374m309j3603J2831J4087k0523j4658J4350
487c522M422p864K572n875j3584J3189J5380j6680j3020J2501M436m165O813l434
501h831j3379J0459J7980q268j0797O429L731K833Q875o123j2810J1023J5663
514A6785q102p889L754j46K604Q533p489j2773P285R627n603m556j382p161M122
529b391J2114j0030j6193O545J0469n513m256k406p384N173J1997p663j3863N380
543a8021P964k486J203r59j0164L953J5719k056j2703R13P999L842K385l179q118
558a3708N644J3218j239q050J86L600L482N532l327q438K591R091O33m295m007
$$ y = [-268, 2302, -1940, 9841, 20521, 2365, -7197, 13817, 20967, 8640, 9292, 8908, 2271, 14755, 25184, 5331, -4604, 13157, 15571, 4929, 8303, 3994, -9609, 3222, 17309, -3214, -17872, -3522, 900, -6964, -4392, -10267, -23851, -10662, 4718, -11962, -24982, -12481, -8045, -12210, -5397, -8831, -22210, -11751, 6229, -2039, -12836, -6407, -2676, 157, 9032, 2909, -9901, 1122, 16785, 8683, 794, 4548, 4402, 7006, 15539, 8050, -4723, 2562, 12189, 6586, 2030, 648, -6513, -2391, 9723, -307, -16500, -9955, 514, -4999, -9255, -11661, -19045, -13872, -1875, -9538, -23401, -18021, -10057, -12543, -11340, -12299, -22463, -18510, -2791, -4847, -17550, -16637, -8638, -4796, -2411, -5590, -13708, -8064, 5154, 3915, -4135, -3949, -349, 3133, 8665, 5338, -3100, -509, 8582, 9215, 4920, 913]
573I13l567N173Q113o957j2432L895P323k717l538l230o408L255Q521o186j0259
588a8101K653M493j389J861j808r408L373J3061k202j0371J664O643J800L832
602c899j800p685M702J1844j320n843J659J567J227P053j82r882J133R973J01
617H648l958j341l610K033Q612l238j1875K511P845l444k726J852o954j786J0128
632B697o49j1786J453N861l653J198K782r692k979J3984N97j2881J579Q054l215
647f650J007M533p618l345J2511K811r405J964M263k749M778O033q996n485J2624
662F276M737p684m66J874j971N365M268r863m447R445J815n781J118j912n868
677c094O201O240j0163o516P381J459l707K158l668o675Q167O817j0424m792Q511
$$ y = [913, -2654, 2519, 10632, 3675, -8757, -4862, 2461, -256, -3794, -7024, -13432, -10177, -1656, -7842, -18101, -15448, -10955, -12344, -10483, -12291, -21699, -18326, -5265, -7467, -17838, -16174, -9531, -7731, -3899, -5699, -13384, -8682, 3162, 1842, -4001, -2342, -775, 452, 7505, 7323, -2559, -1426, 8547, 8648, 4690, 3349, -261, 1772, 10384, 7146, -4729, -2218, 5627, 2183, -543, 1309, -5645, -7431, 2697, 2048, -9738, -8285, -2424, -6077, -4879, -2097, -11789, -14768, -784, -187, -13068, -11489, -3435, -6650, -5643, -1110, -8728, -12073, 438, 3249, -6156, -4192, 71, -2678, 2100, 8133, -863, -6348, 6276, 11013, 3329, 2863, 4737, 2766, 8131, 12399, 2536, -1911, 7534, 9349, 3568, 4686, 2774, -3094, 3107, 9347, -816, -7332, 49, 1508, -2199, -41, -3709, -10384, -2217, 4600, -5824, -10616, -2105]
692b105J50l151N295j884p977O748Q933p187m624O120K98p07N709k753q900O584
708E49R512o103n646M802mp31N016k297p969L872O812l049l061M13k126R47O621
725G558k988q661K516O217j188j904j208l452K128O118k826o710J633L558j363
740e72J640o12o480R46Q037j166o751M97K530J26K712n72o510R06P956l73n312
757b998N33J350L77L209O99n669j032O242K256k982k412o01J744M687p66o260
773a623q56M378K733j295l543k964K223N232j146m695j742J756L017K537l165
788H47o544K041O781Qm906j645L63K666M424k488p469P09P353L11m026j203j494
805d272J618N777j176p761p83O549J668k088j731k863J545O816m16p010p31N036
$$ y = [-2105, -1955, -5106, 189, -1695, -9672, -2924, 6009, -1178, -5802, 318, 616, -91, 5618, 2865, -6035, 549, 10061, 3958, -1688, 3114, 3110, 2379, 7395, 5098, -2871, 1001, 7813, 4764, 1703, 2116, -10, 937, 7558, 4570, -4091, -1575, 4642, 3454, 1550, 342, -3110, -982, 5136, 2310, -4400, -2767, 791, -572, 1068, 456, -6024, -5078, 2959, 1793, -4958, -4461, -1931, -1805, 907, 335, -6175, -5269, 2687, 2314, -2998, -2465, -1115, -738, 2471, 3170, -2499, -3531, 2711, 4967, 1985, -427, -1028, 716, 5403, 4637, -1623, -2479, 1899, 4632, 3337, -206, -3170, -947, 4285, 3139, -1556, -3298, -1542, 1475, 4012, 847, -5697, -3656, 3125, 3133, -1773, -3418, -3055, -389, 4035, 1547, -5922, -5213, 2140, 2451, -1575, -2778, -4272, -2654, 3123, 1947, -5814, -6597, -48, 1620, -468, -2199, -5062, -3517, 3299, 2883, -4127, -4858, 178]
821A78K327O04k111m121J898P457K45o679j145L362K482J928j388o885M72Q071
837F695O87o900j613J589N89L642k25q469k355Q700J800o428j666L84o20N040
853H50J987q971l224Q341L014m441j403q8r13N501L816p777m299P608L975k565
869A411j166j320j443N903M610o947m648N422M241j533j13l175k087N700M745
884I600n978n183L680K391L47Q56n034m442O034N294o022n403J809J751J001J764
900B465n127o086N226O301m658n163J293P05J986L852l911p251M200Q187k261
915b42m534O93O99K540M856k277o794K820P873o56l484J2l86J973N301k143o848
932e97N30O289J097l394k554k219K444M383k124p089o86M596J138k436k701l064
$$ y = [178, 2505, 3109, 998, -3123, -1225, 6232, 6477, -202, -1347, 2015, 4497, 6425, 5037, -1848, -1376, 6695, 7382, 482, -1131, 458, 1047, 4689, 4464, -4005, -6360, 2340, 4140, -2288, -3954, -3570, -4190, 850, 2837, -6134, -9358, -1017, 1997, -2444, -3847, -3935, -4848, 653, 4469, -3308, -7607, 1, 3976, 1411, 245, -1075, -2518, 3385, 7995, 1048, -3600, 1822, 6063, 4530, 4417, 1242, -845, 4855, 9600, 3622, -1561, 2119, 4510, 4857, 5713, 679, -3763, 2271, 7565, 1543, -3860, -2051, -300, 701, 2465, -2662, -8748, -3522, 2779, -1879, -7042, -5749, -5044, -3058, 794, -3117, -10368, -6168, 2019, -242, -4776, -4083, -3384, -844, 4012, 1735, -5059, -2239, 5634, 4978, 1494, 1506, 1120, 3093, 8394, 6251, -597, -67, 6222, 7319, 3925, 1371, -848, 1596, 5979, 3855, -3234, -3920, 676, 1814, -622, -3323, -6387]
948f387O89N291m84o636j538L438J963M26j974m672R64O887N98n414j547L202
964e194K297J538p42l585j47O143K103l431j924J703J918K477M32m332j587N097
980B766L488l121l452P01J706K063n16l955k229K468K685j573l248j652O26K323
996i20J72l697l357J465K897L04l266l048J057L528Q36l355k080J249K764J970
1012c481j087k378k02M075K381r70k072m54K900L661M02l753q04L447L017r19
1028C763k463o95J675K580j49l287j703J141J748J38j568l702l2L180O21l728
1044b481k563Q28J711J020j699l441j64L832N24l268q15J002K73K093J273l968
1060e843j243M257K397j856j100K53O65L357J827m118j844M875K506k171o71P00
$$ y = [-6387, -5698, -407, -891, -7527, -9065, -5627, -3664, -3238, -5212, -9884, -8920, -2033, -1435, -6849, -8396, -5194, -2897, -1359, -2101, -5686, -5833, 310, 2413, -1018, -2942, -1239, 679, 3156, 3588, -744, -2331, 2766, 6254, 3133, -319, 382, 2088, 4151, 3635, -320, -2549, -81, 2604, 1031, -2217, -3869, -3243, -920, -748, -4445, -7802, -6337, -3440, -3136, -6402, -9450, -8393, -4865, -4029, -7384, -9464, -8215, -5451, -3481, -4568, -6946, -7148, -3073, -692, -1662, -3734, -4188, -1288, 2373, 2775, -978, -1782, 1665, 4682, 3763, 1300, 605, 2280, 4860, 4711, 1424, -279, 862, 2610, 2748, 1180, -2522, -2554, 626, 1247, -2481, -5044, -4216, -2505, -1485, -3184, -6625, -6789, -2957, -2433, -5701, -6516, -5514, -5241, -3148, -1875, -5843, -7086, -2829, -432, -2288, -3388, -3135, -2470, 887, 2714, -1404, -3248, 1627, 4133, 1962, 1291, 1991]
1076A991r44K286L141l265l118K398K942j711J51j121k858K407L718l543m392
1091a918K454J484j507l01q15k957J910K678l187k992J913L75r71K456j004m233
1107f615J960M920j689l008K176P28J61K861j51m396K641M941j948j677K253n20
1123B637r70M463K62n393K02N117q92k405J035k017q33M110K75o267q7M266j353
1140B150k079J345k061k604M375J492n157j066L166m00K36O83l015j710N116J431
1156A902m454p06K625m36J189J595l263j588M617J459l202n9J038r16K129K826
1172D756m510k536M752K185l131p54Q86j100K475K408m526k665M090J607k416
1187A521l01m13k237K351L445l928m050K521K006r02k08j858k055L034L258l862
$$ y = [1991, 1047, 3333, 6474, 3209, 91, 2489, 5431, 3720, 3871, 2750, -108, 2299, 6017, 2474, -1918, 536, 2020, 513, 212, -603, -3560, -1650, 1028, -2159, -5151, -3238, -2863, -3834, -1378, -2382, -6615, -4655, 265, -1424, -4432, -2256, -1528, -1367, 1494, 1343, -3053, -412, 4529, 2581, 904, 3157, 2637, 1667, 6130, 6392, 999, 1201, 6318, 5426, 3021, 4056, 2039, 1206, 5316, 5591, -676, -763, 3503, 2150, 71, 1416, -645, -3249, 1126, 2618, -2539, -3605, -439, -839, -603, 80, -2935, -4645, 471, 1902, -2552, -3258, -633, -1069, 120, 1715, -1548, -3136, 1481, 2940, -262, -321, 717, -199, 1930, 4756, 246, -2290, 2462, 4647, 1516, 762, 1648, 548, 3023, 5431, 905, -1760, 2330, 3937, 1521, 1220, 807, -1430, 921, 4366, 438, -3612, -1091, 915, 13, -195, -2053, -4108, -1074, 2184, -1678]
1203a678k591J712J330L84R72j922k548K807L368j717k412O86Q11J685J720k998
1219c91k592L289K816j601j678%p6J851J893k825k961K348J959o24q87r52j883
1236b314K489K883l163l030J621K237o9q0k085j690K912L026k415k840J047Q48
1252f23J183J254k745k388K704L116j983k173j0L6K013J995l370l108L284K351
1268A536j760j121l6j462K350L404l319l734L273K241q82j66r61k481L302M201
1284D385l646m053L230K050r38O62j011l499L001M110k725m312K424J300m77J699
1300B200j355m039K337M649k282l460J367M71J60K768j844m769K566M637k302
1315A104k859J303o56n2L827j631n562K093M752k309j382Q68k097R5N144j527
$$ y = [-1678, -4269, -2557, -1227, -843, 129, -1793, -4341, -1534, 1834, 117, -2295, -1609, -798, 887, 2607, -391, -2983, 306, 3122, 1521, -157, -157, -233, 1618, 3511, 686, -2275, 73, 2032, 1408, 521, -431, -2314, 175, 3058, -105, -3135, -1514, 723, 654, 574, -1511, -3201, -289, 2737, 322, -2518, -1471, -623, 560, 1814, -931, -3319, -615, 2501, 518, -1655, -1665, -1629, 384, 2379, -991, -4099, -815, 1536, -224, -1345, -1381, -2843, -493, 2911, -408, -4142, -869, 1372, 490, 324, -637, -3118, 184, 4385, 739, -3314, -84, 1966, 1028, 1690, 679, -2820, 181, 4291, 1566, -2746, -322, 978, 501, 2200, 845, -3194, -857, 3792, 1510, -1950, -583, -112, 48, 2816, 972, -3797, -1231, 3406, 1104, -1755, -452, -1108, -1160, 2667, 1036, -4526, -2433, 2319, 10, -1372, -504, -2601, -2506, 2638, 1111]
1331A111n660K460L722j495q34J476k692N77N089n60n522J747L519j153K54J048
1347C087l668p0N593n40n312J069K599j429O92O09m261m92N140o01m433O66O09
1364g42r34J967N77m850o10M857k7l314P62K15j128L256R20m510m58M632k02k245
1382a834J141p22j179L982J487m528o56L983L9j495J193j386j685M249J654m358
1398a15r94K960l10m86J431k601j579L892J013l626j021J579m55N15Q29l358j683
1415d009L352J270l037n92J8l41J557R16l153j472L328R98j582k22j27r55K878
1432a173J652l057j161L216Q99p14Q84q97j086L031J960k936j045K322J77L7O39
1449B748j938j514K790J418l007j077R87m34K44Q47k418j762K353J126k520k87
$$ y = [1111, -4549, -2089, 1633, 138, -696, 780, -1912, -1335, 3754, 3194, -2328, -581, 2938, 1785, 2039, 3087, -581, -651, 4942, 4402, -910, 159, 2758, 1329, 2021, 2630, -1631, -2123, 3017, 2416, -2017, -1351, -742, -1676, 291, 868, -3982, -4592, 265, 238, -3076, -2314, -2099, -3227, 29, 949, -3561, -4019, 613, 411, -1834, -693, -1415, -2594, 1388, 2875, -1653, -2309, 1674, 1713, 218, 1411, 25, -1660, 2589, 4243, -115, -1109, 1851, 1541, 1055, 2486, -115, -1694, 2198, 3211, -415, -1436, 143, -312, 203, 1032, -2326, -4009, -657, 613, -2424, -3016, -2998, -3339, -1782, -866, -4019, -5491, -2163, -1165, -2747, -2969, -3096, -4051, -1173, 479, -2578, -3739, -523, 376, -338, 546, -351, -1437, 1594, 3554, 618, -427, 1895, 2072, 2109, 2748, 810, -704, 2086, 3504, 497, -580, 407, -27, 217, 1064, -1354, -3116, -763, 363, -2157, -2444]
1465b444p2r82J572J367l094j211K431R77j516M63j88j413K257J925k540j128
1481c596K585P08r62J399m50k294K545K890k542j307K334K14n75J854j118k501
1497h16K682K231k628j272J661o18o25K491j562l087K124K169k533j015R49j633
1513a482rK703j994l311K313J594j912k54J057k236L66L173j404k905K443J424
1529d34j366J036Q94k874J192M040j439k505K234J214j033J440R11l018L71M087
1545D750j420k441J835J07j509J906M57l629j49L749j290k486J136n52j137J981
1561A308L13l753L17L018j393j588J531j250j086K675P03l352R4K513o66l80J033
1578C7j417p28L609L87l048M03K438q40J9J336j671q99K966Q67k823M41J125o94
$$ y = [-2444, -2516, -3498, -1926, -559, -3653, -4864, -2433, -1456, -2972, -2509, -2697, -4110, -1853, 72, -2468, -3596, -1011, -303, -1265, 134, -316, -2610, -65, 2825, 283, -1024, 1310, 1524, 949, 2803, 1685, -816, 1866, 4097, 1469, 197, 1858, 1240, 615, 3106, 1544, -1543, 581, 2750, 217, -798, 151, -1482, -1491, 1212, -782, -4093, -1780, -186, -2098, -2352, -1295, -3531, -3165, 8, -1396, -4301, -1858, -434, -1800, -764, 130, -2744, -1552, 2488, 1049, -1456, 778, 1992, 959, 2399, 3310, 292, 663, 4750, 3330, 889, 2724, 2831, 1322, 3228, 3685, 56, -93, 3656, 2366, -120, 1016, 464, -673, 1308, 1621, -2132, -1815, 1203, -190, -1778, -247, -1497, -2583, 92, 795, -2557, -2463, 50, -616, -996, 37, -1380, -2108, 1501, 1888, -1160, -757, 1681, 841, 860, 2196, 525, -374, 2592, 3459, 636, 1077, 2202, 1508]
1596A508P21J226k404r27K717O06k295m01N28o44Q40J051k354j556K581K83j832
1613c52n3M3j296J650J063k346j477J946N59q12o8l80q64J958J314k062q94J628
1631d43N43Q6N08j338n65K161J546j836q55Q02L80N64Q40j674j410K633R68k021
1649H89p58N44m88O80R97j897j612J765J392j193n38n06p32J098J551k141j511
1666b460J932P36p27M2r18r50K139J304k124j317J430O99n07J094j271j218K188
1683G2J359j735r20J077L8L21R94j569j749K378J562j929o40P20Q0K08J726j699
1701B94k279K336J745j739n16M18j080Q32K081j728k526J906J617j675r2p1j232
1718a709J129K111j945k254J902R59p03N66l52j510Q77K663j550k096J552P84
$$ y = [1508, 2229, 3455, 1051, 124, 2841, 3447, 1152, 751, 1279, 635, 1475, 2526, 172, -1384, 1197, 1480, -352, -405, -362, -1658, -8, 1055, -1291, -2768, -822, -263, -1075, -1143, -1523, -2387, -429, 885, -1177, -2071, -443, 100, 186, 694, -644, -1209, 952, 2498, 662, -193, 609, 989, 1553, 2393, 719, -691, 1942, 2910, 889, 131, 675, 187, 867, 1864, -33, -1645, 120, 1512, 319, -219, -725, -1457, -359, 1192, -949, -2460, -528, 208, -519, -477, -1395, -2345, -206, 1098, -1026, -2343, -913, -214, -721, 373, -898, -2116, 72, 1431, -304, -1224, -147, -109, 212, 1206, -363, -2112, 266, 1828, -101, -741, -21, 59, 267, 1993, 294, -1985, 351, 2096, 357, -159, 259, -821, 11, 2092, 364, -2162, -256, 1361, -314, -406, -477, -1709, -580, 1531, -414, -2668, -766, 193, -510, 56, -296, -1806, -929, 1734, 184, -1912, -360, 424]
1734D24q18J342l34k390J118K806j662j736J677l75j53J428l74k627J106K390
1750A822j082j846J042N8o58K256m85k730P24K491q29j279Q93o79j7K086j31k932
1768a296N21K581q53r75Q43j303k86K312J02k878M73J741m72l77J24j293k39K530
1786A255k19k390L50J067m84Q44L36j923l32K774O6k333M60R05k11O76R94k615
1804g80j79K642n3j767M62K65p18J448L84k303k86K443k3j383K04m21l48J540
1822A127O18k268p88K093No73K24p56o25J621M67j766o33J480J26l17K88j093
1840h70o52J801M56j810k73P64J07L91L89j408o89K042R88j537P8K86n62J087
1858E88P25j514n55J738M90r08J11j30l73J033N95j861l07R15J73l61m7n25p17
$$ y = [424, -394, 948, 614, -1776, -658, 2148, 486, -1250, 427, 52, -101, 1327, 953, -1674, -568, 1822, 740, -1106, -64, -6, -664, 1592, 1107, -1623, -899, 1592, 763, -516, 377, -302, -319, 1767, 1636, -1296, -775, 1806, 953, -22, 821, -482, -768, 1544, 1646, -1232, -759, 982, 510, 133, 257, -1036, -1275, 1255, 1036, -1354, -1004, 63, -421, 423, 759, -1164, -1496, 1278, 1344, -989, -529, 376, 165, 841, 1835, -780, -959, 1683, 1630, -137, 325, 590, -128, 1320, 1704, -599, -885, 1558, 1535, 152, 356, -65, -413, 1127, 1745, -523, -1311, 782, 787, 114, 338, -418, -1043, 578, 1045, -721, -1354, 126, 252, -65, 223, -870, -1522, 279, 735, -1075, -1348, -584, -477, -86, 303, -1105, -1794, 248, 1236, -301, -223, 63, -499, 588, 1313, -201, -756, 982, 1472, 564, 675, 545, 172, 1205, 1800, -61, -368, 547, 720, 359, 312, -213, -930]
1877i30J070N70j596m42R18k03l69O83r10q71J581O01j298l86P67n61N13Q85j003
1896i81q67J127J464j634KJ010r01O48J357j445j094J813M98j170J69L49q85P15
1914A75J338j012j687J692N28r34N91j46j262O56J507j328j062Q10L38r31R84
1931B57j02j972P96J840j548q98J041l26l66J254k53j820J009J672j782n19J310
1948d07m89o9J646j74k078J259J538j111j89J057q05j70J819k81j900R04J252
1965A802j010k42P88j278k61J983l41k191N65J396j484L53M93j294m95J663k03
1982B44j621P95M39o72N68M56j317l79J864N4j692Q12L31q25J089Q62k047N1J875
2001H87j22j061N24K70p61J297O46j450m75J732l14q43N94o1r36J259Q03j594
$$ y = [-930, 140, 710, -886, -1328, -410, -613, -982, -299, -1209, -2080, -499, 102, -1196, -1582, -815, -1376, -863, 22, -981, -1848, -721, 743, -891, -889, 121, -780, -132, 1225, -220, -1314, 499, 997, -173, -4, 345, -540, 175, 1513, 501, -1186, 506, 1034, 100, 691, 545, -717, -61, 1446, 118, -944, -134, 204, -727, 257, 155, -1817, -1021, 819, -729, -1627, -586, -912, -1278, -24, -277, -2097, -1088, 584, -1198, -1717, -407, -896, -965, 681, 507, -1571, -312, 1226, 115, -74, 983, 178, 8, 1827, 1546, -354, 550, 1802, 792, 550, 1338, 60, -201, 1782, 1441, -750, -185, 1211, -273, 80, 573, -721, -1216, 447, 244, -1377, -582, -143, -815, -247, 209, -1108, -1487, 377, 431, -1261, -449, -118, -943, 146, 1008, -1039, -988, 887, 765, -296, 228, 498, -263, 1034, 1680, 230, -245, 1487, 1173, 330, 924, 863, -73, 1186, 1989, 395]
2019C95l90J314m32k76J17n94n74J109P00j577m34R56l92K07K95p75q64J173P89
2038G47j305k10M29pL83N72j376o01J777K76j008L27O8k38P82P91j237o95J524
2057I99K70n35O1j31m63J316K02j160p66Q22K31k07K55q92o18J361N77j491o71
2076h40Q87m26K49L73r26n77R76Q64q44m59K49p5N17N55j098r82J617K44o50J66
2096a80o7j93N73Q97j110n58R57M83j020Q05m68p38J107O58j032q90J573j42n29
2115A26M51l35q69P43J429j693o03R31J09k36M40n49j103J092J202j445n70P16
2133a64k97r2R02o07j423J347Q46j133j62P33q17K93J214o50j410J107P90n08
2151c1k72M57o36M19J237q04j384J127Q00p16j15L60j130K68J606q35j299P37
$$ y = [395, 5, 1319, 887, 611, 728, 134, -440, 669, 1369, -208, -642, 314, -78, 129, 424, -351, -1215, -42, 747, -558, -768, -339, -346, 37, 609, -767, -1368, 409, 685, -323, 4, 72, -166, 616, 1407, 170, -525, 999, 1269, 734, 795, 664, 201, 1517, 1719, 559, -207, 615, 846, 639, 894, 2, -616, 745, 1322, -169, -840, 47, -379, -130, 243, -683, -1260, -284, 580, -264, -723, -474, -549, -32, 523, -575, -1557, 60, 304, -346, -180, -247, -440, 133, 1030, -80, -638, 319, 802, -218, 587, 119, -619, 488, 1146, 114, -776, 797, 655, 126, 577, 242, -627, 116, 1545, -148, -751, 180, 289, 53, 493, -56, -1159, -67, 1135, -310, -880, -164, -461, -553, 349, -258, -1681, -334, 512, -621, -783, -50, -867, -574, 640, -10, -1420, -313, 477, -31, -303, 154, -482, -63, 1174, 370, -1014, 113, 913, 197, 82, 442, -688, -420, 1186, 351, -948, -211]
2169b11O11l69M5K89j114M46J430o11j824P83N27l55N33q8j145L48J803p74j140
2188h16N23J9m8P08K54j829M64J683q00o78N96j11k71R07j52j266K95J283l72
2207C89p26N11k29l04J235k61j112o4J361m40r4K56o84P0J062p4j123L10M40l90
2227A33K33r5n85M8J002n9j048J5L57j90M54J83r72j79R59J37m79K1Q4o7M26O
2249C84o22k95J238j63o05M3r1J10P52j11p58k31Q08j74M4k03k97k17R83J8j060
2270d47j04J048j45J23k14o22O8R04J97q44k0J23L80K24r4p35J0R85j92n17j94
2291f6P2J2L18O7q80N8O13j80k36L25o47M33L23K98j178K19L30oL07R0l84l52
2313d64R15L83j212N0P90l47K57k2l04l89P71M38q70J23K72j87K64J20o39m87
$$ y = [-211, 400, 31, 76, 365, -749, -303, 1127, 516, -1308, -525, 2, -353, 180, 92, -1053, -705, 1098, 324, -816, -293, -274, -322, 386, 640, -1189, -725, 958, 158, -520, 76, -35, -306, 601, 449, -817, -522, 761, 389, -337, 174, -55, -359, 876, 615, -497, -561, 800, 360, 266, 522, -162, -92, 970, 896, -227, 83, 523, 133, 366, 271, -314, -266, 736, 677, -371, -356, 1, -189, 265, 448, -524, -703, 256, 393, -86, -65, 19, -48, 378, 384, -238, -533, 705, 542, -63, -20, -111, -1, 751, 640, -118, -349, 459, 285, 329, 126, -171, -388, 595, 613, -447, -551, 497, 352, 475, 261, -361, -293, 611, 808, -36, -56, 67, 447, 671, 577, -158, -148, 837, 645, 128, -66, 6, 18, 336, 403, -477, -419, 194, 14, -222, 103, -544, -111, 212, 510, -668, -449, -119, -125, 182, 272, -112, -464, 451, 834, -378, -328, 462, 115, 372, 350, 46, -343, 428, 866, -4, 119, 391, 204, 468, 588, -51, -538]
2333e38J152Po62j35J52m70L98M57m95o89R61K71q83M82M6m60j01J156j011o37
2353i99J043p6k27J02J71r47O77Q79p21n60Q20j46o6K32q2p80O55N95l15p12P70
2374C13O7l33L03J81r26M42P77p91l91N27Jk91N15J63q87P2O86j92p52J19N1k27
2396e73P37K4j074M25N12M6n43L97l86QN04K66o56n6P76l56J2J32m00J3P54R8
2418F60n59j79L78n0O9J51n34j17O16J72m55j77Q0J76q4Q9l42k21M72J46n41K02
2440d8L2qj06M04n52m13O45M60o37K7j90J25O3M52l24k76L76J24J05k06l63%N41
2463B31K83m05l28M64k37L63J03o30K36N89q7k82j39MpN48j65m82l8M06K41n27
2485A41N5m10K37L00K4n02j02R5L47o4k14k88R8M44P2l51l26L13k5L34p1n74J84
$$ y = [-538, 614, 621, -41, -176, -24, -494, -96, 361, -134, -823, 138, 409, -474, 8, 54, -406, -507, 649, -362, -999, 44, -32, -259, -157, 14, -933, -256, 623, -98, -658, 162, 16, -50, 182, 100, -680, -25, 570, 255, -457, 313, 380, 47, 350, 531, -395, 47, 824, 33, -358, 169, 170, -121, 394, 557, -330, -258, 428, 236, -516, -397, -346, -573, 164, 188, -886, -461, 51, 97, -446, -49, -435, -427, 77, 343, -313, -369, 407, 51, 63, 195, -205, -192, 562, 660, 101, -78, 300, 250, 319, 470, -64, -181, 435, 607, 152, -25, 55, 231, 147, 236, -106, -327, 145, 291, -250, -48, -16, -24, -130, 274, -278, -691, -46, 414, -223, -196, -386, -261, -198, 254, -70, -346, 30, 154, 259, 53, -310, -310, 231, 514, 109, -219, 245, 8, 371, 474, -156, 80, 669, 582, 300, 161, 165, 158, 706, 541, 59, 21, 427, 668, 141, 196, -214, 23, 323, 347, -155, -257, -162, 185, 121, -93, -381, -283, 161, 233, -118, -444, -131, -156, 178, 107, -467, -283]
2508b83M28L88o05j56K14R7L11O8l81j43L42Q1m73M3L31l64O49o2m18l69M34J43
2530B75p9l00m3j9L97M7m13m03R41P7o38K41j17k19K49K62n09m71P40l1j89K12
2552A0k00k69J49N29k77o09M79K30l23K68k21k79P10L36n24n49O84p8P6K88l79
2573E1m47M24N10l37l84J52k6K49J71m43j98R7M04k91k60P4n2k9N56k67p63L88
2595d21N57k46l02K13j38J18M85j07m75l0O60j25q2j14j85J07n2M28m32rK54M3
2617A47l40L34k02k87Q32j34n58R8M86j0K5j89k27m4J54K26m06k11J79J67K0R9
2639A59l80K13J45K11m27or8O1N34m43K7j76L54K24n95rR3jJ48o5j5j70K41o0
2663c5J01n5M7r9j24L75j4k64L43j12r3j40J93o0J28J73l84p6K6K04OQ5n15J87
$$ y = [-283, 145, 533, -72, -228, -14, 83, 394, 462, 81, -62, 280, 361, -112, -69, 262, -102, 547, 485, 67, -302, 132, 275, 196, -104, -147, -166, 231, 278, -135, -538, 403, 480, -158, 83, -34, -253, -4, 258, -251, -722, 18, -13, -202, 10, -190, -459, -310, 219, -58, -667, -188, 42, -281, -13, -234, -513, 197, 533, 9, -540, 144, 66, 142, 430, 51, -396, 28, 538, 201, -183, -31, -57, 192, 363, -80, -278, -181, 223, -68, -328, -254, -306, -335, 221, -46, -809, -421, 136, -110, -412, -199, -337, -219, 266, 159, -316, -346, 314, 189, 107, -7, -192, -85, -137, 291, -141, -150, 104, 147, -193, 141, -61, -348, 484, 350, -208, -110, 376, 366, 391, 202, -25, -69, 85, 311, -95, -306, -127, 40, 60, 159, -221, -8, 137, 348, -79, -85, -183, -122, 412, -31, -4, -180, 174, 398, -197, -206, -113, -114, 34, -31, -46, -216, 25, -35, 66, 11, 58, -41, -165, 210, 196, -68, 275, 163, 70, -70, 123, 63, 191, 364, -20, -96, -70, 134, 140, 225, -290, -103]
2687a03O4K72j33j6o3j50N26j23k97l2K30J0k45L64k91q0K91k4k00k40K05K07
2709A72L2n3K6j88L43j45l5k56K41l20N62m13l89K53J25N57p74Q7K16K82j09Q7
2731C01k17j04M02n2j77J65k38l39N25p6K8m21N13l22m0M84l77k4jM54n30j78
2753b24M36o2l60P0J44l90L14L99k55m09M04j31k82O70j61m25J36M13l50l06N77
2774B08r7k78M95k79j4j44L97l11O4P4l6Q0o9r4p4J01M37l03P0j71j05P4L56j85
2798A96l29P5K68j47mK07k66k12M84l58l50M40o9k00J32K20l79N9L76J48n05j98
2820d12Q3L86j54L17k71p6K80K0l07N8J21l5q0J47o2k15N89k47k08N5M2J56j99
2843a2O8k26l7R1N15k88o2k02M3M15k03p5k92K34l10L94l66J06K36j76K20%j58
$$ y = [-103, -39, 233, 100, 84, 21, -129, 397, 274, -23, -55, 175, 185, -60, 304, 13, -67, 224, 200, 0, -240, -35, 172, 204, 151, 177, -11, 332, 187, 152, -104, 137, -183, 379, -34, -423, -170, -45, 512, -262, -175, 41, 323, 214, 301, 84, -20, 382, 330, 153, 318, 80, -259, 266, 190, 218, -203, 310, -12, -52, 432, 55, 31, 30, 484, -46, -224, 212, 150, -210, -140, 4, -386, -72, 327, 72, -337, 67, -64, -346, 324, 163, -262, -126, 287, -63, -369, 208, 111, -167, 328, 49, 35, -109, 288, -23, 41, 115, 79, 159, 90, -4, -78, 23, 460, 157, 227, 56, -49, 25, 381, 196, -133, -58, 210, 63, 59, 266, 0, -212, 272, -86, -436, 4, -65, -265, -133, 87, -292, -233, 143, 291, -214, -412, -329, 57, -97, 220, -51, -127, 153, 173, -134, -76, 45, 10, -70, 77, 15, -200, 389, 142, -66, -11, 31, 187, -12, 56, -170, -207, -116, 399, 111, 49, -153, -110, 305, 102, 27, -265, -31, -341, 53, -313, -207, 29, -147, 73, 73, -85]
2866h5j07m4J35M6j29K5K94n4j30M8l49M18J24j70n5J65j41l9J02n5j37R4J94
2889A50J2k67L95j00j79K38j32k25J53K02l23J45j19o7L89mj93k23K43j54n9J02
2911a6m20K38J11J03k50P1N4K03j39j70K96l26j21M78l7k1m70O61L4J12l46k75
2933b30O41m77L83l11q7K14K62k21Q1k01m26N66kk26O1N6p0J21Pl60J51K22j39
2956A5J80k75j37J94J13j44j44k7J82J78l37M7K43q2o8K69l97l0K30K15j70j54
2978i9J49k00L46p9p9j04J12M49m90J20j27L2n5L39l4l10j62L68R0l14K3k55K55
3001b5J68ql02L3M71n03K75l18K37k71M95k98K4k78J07J75K6j51k61L56L73r9
3023B26j86j38J66K90k58k31R7j06L10l3j6k58M3Q4R5O4k96R7J83rn0l99L80P4
$$ y = [-85, -192, -236, -101, -55, -184, -159, 135, 81, -49, -1, -350, 68, 192, 22, -33, 132, -9, -48, 54, -1, -138, -44, 150, 162, -105, 290, 190, 11, 249, 117, -108, 45, 247, -76, 69, -50, -117, 272, 268, 75, -148, 95, -59, -118, -16, -436, -198, -87, 16, -234, -163, -109, 94, -45, -215, 81, -245, -366, 112, 75, 54, -416, 245, 279, 391, 45, -230, 411, -66, 317, 6, -81, 133, 395, 174, 255, 54, -372, 194, 192, -34, 27, 83, 13, 134, 141, -219, -68, 154, 15, 195, -80, -217, -23, 90, -54, -198, -225, -43, 135, -202, -155, 88, 6, -62, 207, -190, -220, 10, 225, 55, -99, 50, -150, 196, 117, 38, -66, 46, 495, 5, 125, -2, 30, -25, 314, 280, -30, -192, 176, 266, -48, -25, -280, -25, 143, 135, -167, -134, 337, -166, 109, -209, 28, -243, 252, -46, -22, -300, -193, -18, 8, -143, -404, -48, 325, 226, 40, -98, 68, 358, 100, -131, -34, -140, 170, 137, 121, -137, -94, -10, 85, 149, -147, -50, 133, 124, 74, -325, 55, 129]
3047A29K6j5j49j42K77j18j5j18N3J74k28j01J46j04L34J67l55p1K4K13k18K25
3069A34K5k04k06M32j6p9L9l4k87N32j98l48NL42l3M0q3l10M35r9J61j83J25L3
3093B23m66K28J44J02l21K64j95r4K8K96P7l40Q0J01j40n1M92m05n3j6J24j76
3115i8P5K64k43J31j83l7K27j59J90J0j55J96l48j2K83l4R7j56N8k08R2O2o5M2
3139B9j4L72m54K40j89Q7L09l36k40K53M0RO7m13K44j84N46k6m35K63j75J35k55
3162a27J77J1j02J8M0k34m2K17J21k34K8O7L65k50j36k6Q1R5l7L59l15j14j99
3185b37M84j74L0Jj57K61j5k34j6J11q6j51R4J44m7K55m36O5K82k82m5K66K9l65
3209b23K39J55q2o8O4k85K1K71K4j71k39K93l8p8N81n81J56j35l1r5K16r4J6j21
$$ y = [129, 155, 140, -9, -151, 126, 8, -7, -125, -72, 102, -126, -227, -81, -185, 149, 316, -39, -110, -86, 127, -91, 134, 159, -45, -251, 181, 165, 86, 125, 91, -196, 336, 138, -210, -205, 137, 104, 144, 61, -249, 186, 87, 248, 65, 190, 223, -243, -15, 129, 231, -90, 174, -21, -115, -87, 209, 286, -54, 26, 127, -13, -64, 428, 23, -30, -46, 78, -98, -23, 241, -2, 129, -54, -91, 136, -23, 167, 177, 22, 218, -130, -142, 141, 107, 204, 48, 106, -102, -10, 52, -13, 29, 15, 387, -67, 173, -16, 71, 380, 44, -196, 57, 97, 106, 173, -240, 4, -180, 366, 340, -95, 168, -7, 128, -127, 50, 61, -41, -23, 17, -217, -259, -42, 79, -155, -127, -60, 305, 55, -81, -107, -26, 69, 32, 391, 76, -38, -237, 247, 73, 103, 104, -53, 208, 193, -41, -57, 54, -32, -183, -89, 55, 8, 263, -173, -108, 174, -108, -153, 113, 142, -223, 16, 171, 89, 21, 85, -200, -179, 92, 116, -55, -294, -1, -39, -117, 464, -117, 39, -96, -127, -222, -6, -100, -84, -205]
3233b05L70k55k76M04p4R8l20J66lM1R7R7m06Q3M30m14j43L66J22k14J5m8K49
3256A80j67M19o44m8N63m47J08N8J2l16O8J22J74q7j28J0LJ73j15k37K47K13k03
3279d2l8j15J74j04K01jk59k1K91j74J56j57j6r1R2J87k93K90R3j46k17J24K42
3302A76j29j01j32Q2L5j97J09J20K57m62N2K20k55O5J91n3m5Q6K26m15jK78j65
3325e8OK6J1J26j12M1l29J76j02P9K70k99J53mP5j15L5j16J54l7R0l33K71N7M7
3350A12r7j08L15k13l3K27j81k6J48j65j12M6K02o6n8L10k29l0j42J70O4j77k3
3373f6J67k94K76P9j27l3q1K76k06J51k26J1K19R7l72L93j58l08M05J3l69L9K69
3396A55l32J12J79j08K12l69K32l03m0N71l07j7n8j06J21K30J47k36K7k59K23
$$ y = [-205, 165, -90, -366, 38, -36, 62, -258, -92, -95, -54, 43, 140, -266, -183, 247, -167, -310, 56, 178, -36, -21, -69, 180, 13, 432, -212, -260, 303, -144, -36, 22, 34, -282, -214, -92, 82, -5, -133, -123, -120, 53, -62, -299, -52, 161, -42, -80, -195, -21, -125, 76, 75, -184, -205, 86, -88, 68, -89, -105, -196, -104, 83, -210, 80, 173, 27, -190, -66, 176, 47, -54, -186, -104, -69, -266, -157, -37, 220, -242, -190, 30, -225, -160, 31, -22, -67, 19, 245, -170, -171, 107, -58, -52, -26, -15, 111, -1, 40, -289, -113, -215, -136, 134, -165, -12, -16, 59, -56, -21, -137, 17, -20, 70, -263, 8, 65, 112, 15, -93, 222, 9, -24, 203, 22, -4, 144, -21, -133, -87, 115, 49, -9, 301, 72, 42, -100, 70, 134, -43, -66, 101, -193, 83, 162, 35, 2, -79, 197, -9, 142, -84, -73, 146, 243, -129, 264, 106, -202, 203, 216, -153, -114, 155, -177, -65, 114, 6, 218, -151, 81, -222, -262, 309, 2, -15, -73, -179, -58, 172, 319, 83, 110, -149, 74]
3417G4J86j76p5K0J79k39j27J42P2j14P6J98m22l2K64L8k56n4M16k3o3o2R2l04
3441a90J3L66k45N5J89J9l44N5J90r3J74K04m44j04K33N3L2k19J67m12J77J16
3463hk1k85K34k6J58J31l41j18K89J29j82k11J75J70n0O4K3l54J71j1MM8j10P7
3487d4lR8j25j0q3M84m45o1J71o0j9K50l61M4J49J30J02l57Q9q6k0J91k59K59
3511C4j51J46Jj75J1O5J26O4l71j24K23R4M9j02R8O8k42K72j61J25m6O9j74J12
3535A1j8J49R9k11j0j88J64J69l5j43J95k71K78l40P8J8N9k0j51L21n6k53R9j57
3559b13J32J7J41j0j86J98j2j79R4M9J35L7j41n5n0j2O2R3n1P1Mj34l8l33M69
3584H8j09nL07l60J61l9k55K12j02K1O1kj40R0M4r7p6N8M97j58j34l2j7r8j9m4
$$ y = [74, 260, 84, 9, 29, 208, -31, -158, -16, 56, -58, 18, 216, -206, -238, 26, 64, -192, -246, 170, 147, 84, 22, 114, -190, -177, 189, -56, -1, 188, 207, -137, -82, 108, 15, 189, 393, -51, -155, 78, 131, 163, -56, 111, -301, -124, -8, -29, -314, -80, -106, 52, 183, -158, -276, 13, 142, -40, -251, -76, 94, 44, 108, 131, -223, -52, -63, -59, -11, -121, -44, -47, 51, -74, -84, -167, 317, -128, -189, -18, -78, -97, 153, -208, -164, -15, 115, 217, -140, -51, -137, -157, 34, -225, 34, -117, 29, 30, -145, -134, -69, 57, 121, -250, -374, -151, -57, -8, -110, -12, 56, -186, 86, -75, 50, 4, 73, -101, 11, -7, 142, 241, 30, 20, -168, -4, 165, 130, -13, 182, -89, 189, -151, -73, -55, 4, -16, -167, 154, 98, -155, -56, -213, -81, -64, 77, 67, -119, 79, 67, -112, -18, 31, 166, 203, 62, 7, -43, -55, 7, 100, 49, 120, 124, -10, -48, -381, 88, -21, -26, 281, -79, 82, 43, -212, 0, -102, -81, -20, -22, -162, -72, -28, -125, -201, -143, 354, 196, 62, 30, 13, -85, -104, -148]
3610a48K05M2k47K10j58J15P1j38m74L77J97k1j95J61J8k10K56k01p7K59j1o1
3632c0K2J18j92j44L9K01m2k23L49k25K3L1J47k40j6K78j62l24L09K12l78J04
3654a43M03m53rJ06J58k59K31j4j78p1K78j45J93R5l04J56j41J79J13j20j08K02
3676A69j63K39m73r1K61j2M8J52j33Q9l00p0J32NK02j38k09K87J75k22J02Qr9
3699d1j12L13Q9k38q1K57k15M7M9j06r7K68j18RJ29j07l72J62L01l83K03Jm4K16
3723A30l1P8k52J19j68J71R3j80k3Q7K32k36k6J22R7nj88k52K30N3Pj46p6L76
3747B12o20L92R4o0l39L80M0j50K63l44kK30m0J31l02J75K34k00m8j36J76j3j9
3770E4p5O4j75J12K8k90K95j0M5K17k24j0J24k46J4N8j7j99L10o9J70r4J3qj05
$$ y = [-148, 57, 99, -148, 62, -96, 19, 90, -48, -522, -145, 52, 31, -164, -3, 15, -195, 61, -140, -217, 42, 31, -30, -8, 110, -82, -226, -187, 14, -28, -251, 98, -127, -104, -73, 74, -166, -182, 96, -66, -390, -81, 131, -247, -143, 260, -193, -202, -96, 62, -197, 34, 20, -158, -229, 49, -96, 97, 192, -112, 44, -97, 82, 195, 75, -33, 169, 6, 245, -228, -319, -58, -70, -22, 130, -3, 86, -214, -284, -152, -147, 55, -83, -292, -5, 170, -52, 50, 58, -41, -153, 160, 249, 11, -70, 187, -28, 19, 68, -38, -135, 133, 15, 24, 153, 46, -326, -164, 137, -246, -43, -42, -86, 130, 99, 177, -75, 44, -124, 47, 140, -40, -63, 24, 256, 20, -6, 116, 213, 208, 20, -232, -2, 51, 58, -88, -164, 212, -408, -16, 78, 18, -321, 59, 99, -51, 212, -132, -134, 96, 56, 187, -115, 60, 294, 94, 46, -90, 86, 73, 54, -21, 43, -132, -20, 8, -282, 13, 3, 48, 265, 41, 31, 155, -91, -77, -19, -36, -235, 75, 6, 176, 82, 95, 87, -18]
3795a8J57j7p2M2j97P6J61r7o1P0J3O2j33O3k1K4j12K74j62k89N12rk76q1L12
3820B21k44j38K44j2r5K77j44k88M28o8l46J81J30l83J80J06R6k61J40j65J81
3841D0N4j12j58j33L91j0k7J3K74m51K87N5o9l8qj25J46M8j55J97k14N5o5j87
3865a92J35M27k59P7l81J21o8J80j22N1J63k08j99K31Q2o7N8k7k04J51J7j22K49
3888I3j10k85K81J26J6o5r9Mm6J75O2q7j73J35K93l66n6N1j43K51K81m18J33n1
3912BK68k01r4n3n4J34K11o5j61K5K77j84o6o0R9J04j21j42L22k18l65M95j29
3935B4K0J38j75J61k05m6J95k50J30n7J2J05N0k9j14m4J40J35p6K7l31K1L55k30
3959d4J11OJ26l50L69j25j32OJ46j09P5M4j88m8q4K58J7k38K17J38k13M5j73O6
$$ y = [-18, 139, 122, 50, 92, -105, -29, 132, 35, -26, 44, 57, 119, -14, 49, 28, 52, -60, 214, 52, -237, 275, 266, -10, -91, 221, -23, -161, 83, 71, -24, 253, 109, -179, 249, 181, -165, 16, 146, -237, -57, 49, 145, -116, 24, -141, 40, 94, -18, -176, -309, 82, 72, 45, 58, 332, -119, 168, 223, 154, 116, 108, -17, 129, 177, 22, 219, 5, 60, -5, -192, -57, 370, 111, 188, -193, -72, -140, 40, -82, -31, 132, -76, -275, -44, 38, -29, 29, 2, -202, -51, -34, -156, 93, -17, -302, -21, 105, 121, 56, -43, -39, -85, 90, 152, 65, -108, 27, 320, -46, -102, -51, -194, 57, 338, -80, 53, 2, 270, 69, -25, -78, -132, 2, 213, 148, -13, 12, 289, 105, 39, -21, 78, 182, 61, -81, 241, 23, -342, 153, 24, 44, 182, 7, 168, -37, -83, 112, -138, -8, -65, -53, 52, 102, 73, -41, -85, 55, 190, 114, 141, -190, -169, 186, -44, 67, 73, 199, -151, 218, 93, -39, -33, 113, 4, 79, 123, -65, -113, -197, 61, 78, -160, 57, 195, -18, 27, -146, -80]
3983h0J69j8j45J01M2m5J52j15J32k73j56J85m6K00k73K01o1L33k67j69O2J54
4005H3j26K95l02K40l62J85J55k07j29L63l86J51J84j39p2L00p6k88J18K43l01
4026g1p0K98l29K86RJ79l75j60Rj11L95k28Q0K7j10M74m02K13k45j30K65j04P9
4049b1K98j06k06P7j66M17k61l7Nj24J84N5r0j01P6O3j20M66k63k37l01K71L9
4072h2r9J63k21L12j78L09k07J14j60J61J92n44K08l13M68O6j07mNQ1R3k86Rk65
4096b85K50j69J12M6J53j67j78J99M6O9J5j33J50k38L0j55K36J62nj40j10J98
4118H6k61j06J42m1nK24j38J08j39J32J52r5j4l3j09Jm4J94J45k22o3K35m41O6
4142b26K69p1L2J07q0k14M72q7k75K14j15J00l23L22k82J72m7J90k76J21J05k35
$$ y = [-80, 89, 71, -74, 27, 69, 24, 176, 61, 193, -80, -236, -51, -97, 103, -170, 31, -30, 303, 36, -133, -71, 83, -43, 252, -50, 190, -172, 13, 168, -39, -168, 195, -191, -40, 144, 5, -67, 233, 157, -131, -13, 230, -71, -141, 157, -172, 114, 123, 302, -73, -233, -224, -335, 60, -168, -88, -61, -171, 303, -99, 114, -131, -261, 4, -100, -21, 277, 171, -35, 42, -124, 293, 32, -5, 0, -124, 60, 115, 25, -76, 0, 63, -57, 409, 146, -91, -392, -121, -82, -181, -18, -239, 73, -105, 204, -3, 111, -49, 112, 304, -240, -32, -345, 123, 189, 82, 78, 83, 164, 257, -29, -20, -285, -35, -204, -92, -46, 107, -60, -238, -39, 7, 76, 91, -42, 108, -130, -100, -255, -19, 143, 138, -2, -112, 86, -175, -281, -139, -180, -185, 39, -99, 9, -130, 2, 154, 59, 45, 12, -97, -96, -140, 54, 199, -23, -86, 149, -292, -226, 43, -28, 4, 111, 31, -183, 289, 202, -73, 141, 26, 126, -197, 125, -157, 15, -32, 158, -118, 3, 108, -127]
4164a27kJ62L9k64L98j51l56M68l95R4J08olo6J6K43j17l59K42L2J29J08k9k04
4188d0l5K2M2P1k2l12J05J62m0o4kL12j58j71J94J25j92K26j74j74K15J42k19
4211A3J18p2l12J32J19L5O4j04L8nk4J15P0L0k84K83l61L89k63K15j50J36j04
4234G8j77L40l07j35J66K28k21J0K94m37l3M09n9m14N12r5l60L58R4j39j81J62
4256I3pk30J75q6J02P8K6j56p5K38k62m3L89j38j9j56J30Q4l93K16K38j18k83
4279a97K31O9k84M73J3j22r1q8p6M5k68K10%J42j62l4k8J10j11K27k08L26J05
4302B82k92L20l39M4j32J96k6j62N1R9J12J2nj75J95l05K17j73l20J89M95k00
4324H3J57j20L1m3j60j05K14j1j04K91k27K45P6k00j85J47o2J14l42K36j27J7
$$ y = [-127, -129, 33, 72, -192, 206, 55, -301, 167, -228, -134, -26, -32, -35, -101, -85, 158, 41, -318, -76, -44, 85, 193, 164, -40, -75, -53, -11, 60, 38, -274, -169, -7, -47, -111, -113, 199, 41, -130, 64, 189, -3, 223, 49, -125, 90, 232, 13, 131, 59, -253, -121, -2, 33, 97, -7, 31, 26, 2, 117, 187, 217, -67, 216, -145, 244, -19, 196, 46, 182, 78, -99, 241, -66, -201, -35, 193, -28, -18, 276, -161, -194, 215, 156, -258, 254, 159, -201, 157, 251, 112, -69, 93, 86, -144, 31, -55, 47, 125, 151, -5, -80, 158, -104, -147, 242, 104, 85, -71, 59, 143, -250, -34, 204, 86, -197, 34, 103, -181, 292, 305, 183, 92, 4, -72, -27, -295, -85, -85, 57, -105, -139, -167, -57, -168, 59, -149, 177, 282, -10, 310, -29, 15, -117, 79, 53, -109, -58, 41, 153, 165, 160, -15, 180, -125, 92, -81, -401, -212, 283, 83, 240, 120, 151, 108, -52, -157, 57, 46, -58, 233, 6, 251, 327, 127, -58, 89, 27, 141, -201, 35, -92, -75]
4346g5L08l2j17j22q1nJ31J94j24r7Q9k30J08J74l02p4Q7J95k6j53j55L28j3J55
4370A63j47J4j40K02N4j46K12j00j80J62k40K38l15L32N4l06J3K17k75m1L64j08
4392B7k97L45Q7l13J57J2m4OL22n42K56L80l11j44J03j48L17j59N8k97K23j97
4414a59L37k27k26M53k32NJ17j37J10j17j8J86j5l37m0L78K0j25k50K10L31k34
4436C0K19M7l11J7J64nk86J31l36N17J58j84L4j48J62j50p8J7J1k28J17J30j39
4459a11J31K1L11k63lk34K96j2k42K50k42j74M41p6l33L83k16K34n1k6j55K22
4481A51n0N3J52k97k6l74N48k67j8K50J37o57M10O1PL5j67Lj95L14J26m3j44l7
4505b8j81M84K4l32p8m0K09k24J88j33K6j6J75k45K40j40J57k33J06L4m2j07L24
$$ y = [-75, 233, 201, 84, -38, -119, -124, 7, 201, 77, -20, 69, -161, -53, 121, -181, -255, -168, 27, 1, -152, -307, 21, 8, 163, 16, 30, -110, 92, 146, 0, 212, 112, -68, 94, -146, 92, -223, 109, 163, -143, -130, 87, -188, -229, 135, 27, -270, 75, 162, -151, 6, 18, -26, -20, 302, -240, 16, 396, 85, -59, 44, -104, 213, 54, 112, -185, 38, -159, 178, -49, -275, 178, -54, -49, 68, -69, 41, -76, -94, 92, 77, -260, -300, 78, 98, -27, -277, -67, 264, 30, 249, 296, -15, 2, 166, 161, -125, 6, -330, 187, 345, 161, 195, 47, 209, 59, -19, -2, 9, -219, -102, 28, -111, 20, 41, 352, 89, 86, -148, 148, 136, -106, 144, -98, -272, 169, 93, -240, 143, -73, 161, 110, 84, -71, 151, 101, 154, 306, 9, -17, -391, 157, -110, -128, 122, 259, -398, 12, 73, 80, 115, -52, -49, -244, 70, 196, 153, 9, -28, -209, 275, 299, -33, -111, -151, 58, -166, 22, -111, -85, -101, 74, -171, 69, -71, 86, -147, -41, -7, -49, -156, 168]
4528A68nk20J51K6mJ00j13l11O0L45l01L0J07p6j00J98J69l50P1J26n5M4kL2l67
4553b77M11j22j67j8J04L41n55L20J8J31M3o24K06K02k56J45j39L11o2K43k06
4574D9L4k49R4K12O2r9o3P5q1K9r6j28K64j87P0J30j69l8L5j26o7K07R8r6K6K34
4600B20k16p6K29kk63J80p5k6J26j17mJ72j15j2L3J16l66K11m9K8j29J80K6l05
4624b34K53q3J30k82L78J50j93r6O7j95K68r6J7qp2Ok02L22j15n1K5l4P0P4p2
4649B7r4mM4q2k11L17R7k30K02o1j7R0K7q3k86J53L10j18j31j67J36J42L16m13
4673c6J26k24j9L23k83K62k44J92k72K75j16K84m51O51o14P08l19l89J012j311
4693d45P34k04r1J38J92n91J49N20r22N89R6j74k17J194p23q7m3o3lK53k68j233
$$ y = [168, 163, -57, 94, 120, 116, 216, 103, -208, -148, 197, -104, -74, 33, -43, -143, 55, 224, -126, -55, 71, 16, 60, 58, 90, -277, 134, 12, -155, -173, -69, 272, -283, 37, 55, 186, 229, -395, -189, 13, -243, -98, -237, 74, 12, 255, 49, 83, -166, -72, 140, 202, 103, 40, 115, 34, 63, -33, -161, 103, -84, -14, 116, -53, -91, -56, -182, -249, -42, 56, -40, -14, 220, 4, -72, 157, 155, -108, 72, -3, -29, 97, -20, -24, 148, 33, 21, 54, 170, -196, 15, -34, -6, -135, 45, 71, -234, 19, -64, 66, -216, 162, 312, 119, 23, 90, -105, 163, 67, 84, 76, 4, 10, -192, 130, 15, -36, -11, -45, 25, 99, 27, -67, -71, -27, -109, -320, -3, 94, -136, 66, 5, -12, 78, 105, 22, -264, -111, 199, 81, -50, -217, -81, 61, 377, -36, 90, -134, -153, 170, -113, 149, -95, 97, -175, 100, -16, 268, -183, 468, -146, 562, 243, -146, 866, -445, 289, 85, -6, 132, 324, -267, -118, 402, -520, 69, 165, -9, -226, 968, 245, 158, 115, 52, 49, 302, 34, -1199]
4715a199R78N58j63n99m31P01m4O3O68j088K39j20Q71O4q19o2Q55l09m60J31O9
4736i7L71p43N48n36L8O43j68O0N79o79M12p86K34j56N20l3m66ML47l54Q35l70
4758B03k04k44O33l54m0M35k85l16m53Q63k50K41k95m6L0L58j34j4m92J66K50
4779E2k29J40K88k82K72k95J96k50K5j23L97l55n5L15k35K49k22K56k8K0o5p7
4801fJ78j57j2J1l26M27j97j37J91N8l7L1j14J69k86L59r0m0L9P4l8jj73K14M
4826A41K2p3K11k06r9J08k89j51M40Q2l24J10k83J27N03k43r5q8J60n4J17p8m7
4849ij11P1J91l55K9K86k0o8r7P9k65J37m4L00j15k30K32j02O5o9R3J96j62j75
4873a43J71j26O5J99K2j98J8n9N0J65l08n1J84%K18L4j45P1j89jj48J77J28N5
$$ y = [-1199, -221, 337, 174, -425, -856, -155, -199, -136, 532, -556, -317, -437, 434, 498, -321, -383, 472, 163, -297, -166, -97, 274, -469, 79, -457, -419, 224, 56, 116, 695, 16, 428, -358, -124, -280, 240, 207, -259, -255, 92, -262, 573, 203, -1, -245, 388, 34, -6, 429, 144, -172, -625, 238, -12, 229, -66, -112, -82, 276, 142, 128, -364, -198, 52, -177, -37, 251, -31, 241, -54, 142, -108, -83, -206, 191, -164, -219, 96, -139, 110, -112, 144, 116, 136, 71, -6, 172, 15, 3, 14, -312, 115, -82, -219, -28, 30, -7, 24, -90, 79, -207, 152, 62, 22, 61, 135, 97, 96, -77, 137, 141, 163, 90, 301, 95, -4, 104, -185, -336, 104, 186, -138, -28, -311, -184, 319, 76, -19, -107, 53, -1, 116, 38, -9, -120, -49, 142, -213, -184, 102, 82, 14, -83, -4, -269, -132, -176, 124, 9, -221, 11, -91, -26, -95, -2, 194, 32, -143, 28, -98, -33, 166, 188, -10, 8, -51, -1, 164, -144, -195, -11, -11, 207, 241, 96, 167, -22, -23, -171, 6, 134, 189]
4897A89j22p4J10J11j46k06R3j5lo9L13l41K25J60k88o3K92l95L5J00K05n24M18
4920EN1K9j14J15R3n50K90K05j40J58j32J1j11J88q7k22R2L14j34l4K89m12P5
4943b1J80j62j69j4J19jK43l70L5K11O1J8k67K71P6l83K84j91P4k52M20J0n6p5
4967D1q0j29J0L52m28J02J81j27R6n6m8R8J46j2j95K1R2j50J89j53jK16j20k44
4991a99J92l1KJ11k52K89k32l4K04j44K76n7j00m1k8J25j46k07K79Q2k84J08j60
5014b47K39P0k32J61J44k18J34M1k66j17K51J41O0j54k04K97k0k65J64j61J97
5035A5p7J79K4l6m3k53o1L48m5j19J33j35J46j76j9j2J94q2J75m99N31Nm26K97
5059F4K9LJ51k17m40L33Q7j26J49K60k21l9L02j35l7j26R3l60M3N1L66k68J60
$$ y = [189, 67, -7, 103, 214, 68, -138, -45, -60, -63, -132, 181, -160, 65, 225, -63, -126, 166, -229, -194, -94, 111, -413, 5, 56, 85, -29, 86, 179, -371, -81, 124, -16, 142, 10, 21, -90, 98, 11, -211, -119, 195, 61, 27, 316, -96, -21, 159, -3, -172, -186, -67, -68, 175, -195, -160, 51, 112, 130, -137, 134, 210, -173, 111, -80, -6, -258, 162, 172, 116, 41, -39, -168, -158, 194, -234, -132, 49, -78, 18, -38, -86, 12, 158, 146, -49, -28, 64, -86, 103, -50, -51, 165, 45, -199, -7, -38, -36, 75, -177, 112, -120, -154, 50, -94, 182, 125, 25, -16, -44, 81, -65, -272, 7, 89, -195, -87, -247, -8, 62, -170, -9, 135, -83, 51, 92, -174, -291, -40, 101, 161, 7, -197, 100, 80, -185, -21, -182, 15, -62, 117, 141, 105, 62, -191, -252, 96, 51, -68, 65, -70, 76, -100, -119, -131, 63, -19, 156, -343, 188, 193, -233, 64, 93, 96, 247, 30, -410, -77, 10, -116, 33, 293, 72, 33, 335, 200, 163, 37, 130, -230, -187, -136, 230, -38, 122]
5082A22K96n27R8K86k74k3J07o1J29M0m6k80K77n3l78K87k0N3J02k82K9J6J41
5105C9K1K4q1J51j5m08J47L14j02K73l18Q7p5j0j9L4j78n6J43J39k33PK5J33k8
5130A4j59L40j99j27N4K39j19MM0q7o9j01lK77r8J06M9m9L17n21J62k9PN9k30
5155a23L29k57j64O06n86J44n1J03m00L95L24m43l1J36j24j96L38J55j27J6Kn6
5177a0J36j96K80n0j3j93j41M78k55K7j08J78j65o3kO5k89O1K28J63j10K80k34
5200F7k47K13m2m3P8M4j19k5o2L5L03k56o6L4K69l68L55k47J03NJ00L0k24k9J89
5225I7k26M83k06j45M2k61J88j13J23m4J10k3J79l59J32J2m8K2J6M6J56j39JK11
5249B54m24J17j27M3K29j03n7n8oN3J32k82J00p5J90J50kj60J72l78OL3K72J41
$$ y = [122, 418, -109, -11, 275, 1, -22, 85, 24, 153, 193, 147, -133, 144, 91, -287, 0, -20, 33, 135, -147, -118, -102, 39, 60, 84, 3, 154, 139, -269, -122, 192, 90, 363, 45, 132, 57, 47, 28, 62, -116, -172, -29, 110, -123, -116, -91, 42, 14, -145, 195, -4, -131, -77, 162, 43, 47, 87, 0, -69, -170, -173, 104, 6, 112, 161, 112, 429, -92, 70, 41, 48, 107, -123, 206, -51, -215, 391, -195, -51, -102, 1, -399, -4, 320, -123, -154, -18, -142, -338, 0, 155, 28, 44, 46, -10, 126, -70, 210, 160, 147, -46, -187, 291, 36, 63, -45, 133, -32, -95, -97, -32, -321, -260, -32, 131, 21, 301, 67, -180, 33, -9, -52, 26, 70, -49, -74, -136, -101, 202, -54, -120, -86, 183, -185, 170, -77, 26, 31, 131, 161, -63, -92, 97, -129, 354, 148, 3, 45, -216, -28, -141, -18, -62, 48, 25, 204, -155, -23, -11, -59, -37, -21, 25, 181, 42, 43, 254, -170, -53, -180, -137, 92, -11, -68, -126, -132, -79, 53, -229, -129, -204, -14, 136, 134, -26, 146, -232, -226, -193, 79, 220]
5273B20J48k64J95m9k53p4nOL7J49r5K5j33k6J84j72J48k15J07j09L09j61j21
5296a49M71q8k82K4L20k62n5J54l50K3L40J75k79K24k03j38K81j44J81l35N3j4
5318e3L57k87J68r5k08J54j31K34j59kJ49k62J45J62m01M09j14l26M59j14k6j10
5340e1L90l39j73J24K88m04N38l49k56Q1l2J79k72L94j42l0L5j5J43j19J85l43
5362a68K56o3K0J08l21L07l00R4J1R8p5J59J21j67m4J03j46K74j67k37p8M52j64
5385G3l38K16LJ6R7L7j45j05L29j09K3n5j34K86k32j77J2L83j4k56J00n7k96L16
5409b7J44p3J4lJ57l18J97q0j24L1M2o6J27k22L2K04J46j80j93P8j78M52k90M45
5433C15k68pp7K21k00J85k05j21K51j7o5l2K29l04k59M52k2OJ10j44l4J47l26
$$ y = [220, 368, 104, 299, 250, -3, -77, -82, -76, -39, 110, 15, 40, -93, -119, 65, -107, 41, -174, -67, -176, 133, -28, -149, 322, 234, -48, -24, 296, 34, -21, 133, -217, -194, 146, 321, 42, 266, 63, -75, 206, 62, 243, -92, -39, -53, 304, 17, 185, 90, -118, 36, -95, 139, -20, -22, 127, -135, 10, 172, -229, 180, 66, -260, 199, 85, 59, -51, 339, 0, -173, -49, 239, -165, 373, 24, -232, -151, -183, -4, -276, 118, -24, -54, -19, -34, 109, -10, 175, -168, 88, 25, 45, 153, -168, 139, -161, -67, -56, 42, -33, 126, 247, 80, 36, 139, -7, 267, 100, -137, -215, 237, 73, -265, -49, -46, -30, 67, 104, -41, -146, 183, 74, 97, 42, -92, 194, -38, -215, -203, 180, 166, -90, 10, -47, -343, -27, 117, 44, 58, 55, 212, -106, 91, 11, -113, -82, -40, -106, 21, -201, -169, 35, 181, 1, -192, -114, -292, 160, -130, 315, 47, 40, -37, 184, -16, 169, -36, -157, 94, 77, 12, -20, 209, -95, -354, 98, 76, 82, 192, 48, 14, 161, -165]
5456a65L71l57L37j22m06L12j86K30N0n0r6K0N0J93l44J49j26j99L69J64K9l70
5478a47K69kj79J32k30J34l62L47lK5R1m27K63J18p5K46j97j34K83J2k30j53K24
5501EQ8L4k30j4K66K0l10K14Q8p3k8P1k12nK73k32L67l03j21qJ78M0k28K76j75
5526a9m7J30r4O0J04k23L12j69oLk67J30L00J2n49K77r4M45l36kj72J40n1j7j76
5551c09L42k33L25p1P2j78j8j9J27j0J45l19P9J94r4R1l59M14l38K35or3j96K15
5575dL62m83J71P6j3k60j01K50n6J50j31Q2j74J78j12R6l9M2k29L69m6j34N1Q
5599E3m9k18L86l44J47R2k01Q4j57K78J38Q8k88j00O5j3r2J14K39k38L96k78o3
5622C9N0r0m2p1J17N8k19K57l09L81k59P9k40K64J74r7J13j35Rj4k17J88q7j10
$$ y = [-165, 206, -151, 186, 64, -342, -30, -216, 14, 64, 14, -82, -62, -12, 181, -163, -14, -140, -339, 30, 194, 223, -147, 122, 120, -59, 73, -157, -23, -385, -38, -41, -16, 75, -352, -89, 29, -46, 200, 3, -131, 152, 164, -66, -219, 5, 93, 127, -103, -117, 149, 169, -141, 73, 161, 88, 60, 131, -81, -86, 187, -45, 322, 19, -102, -110, 68, 108, -120, 156, -19, -66, 64, -30, 30, 134, -89, 223, 54, 48, 51, -216, -86, 214, 226, -323, -46, -140, 305, -31, -33, -205, -65, -116, -133, -309, 33, -200, 125, 54, 126, -52, -70, -89, 38, 28, 173, -146, -67, 127, 33, 124, -235, 179, -159, 76, 70, -23, -219, -4, 358, -125, 46, 122, 109, -151, -252, -2, -58, 92, -39, 43, -131, 47, -65, 31, -8, 34, -195, 174, 128, -6, 45, 53, 4, -214, 172, -172, -25, 67, -134, -50, -207, 71, 209, 297, 9, -91, -26, -39, -131, -17, 222, -16, 380, 102, 39, 89, -1, -43, -114, 3, 61, -158, 99, -210, 171, -88, -9, -249, 15, 189, 92, 205, 70, 79, 65, -152, 36, -51, -161]
5646a61K02k76K75j73K10j59%J47j32q5L60k69J61r0Nq6L23k48J18k01J22o0J53
5669A36j04J50K8L6r0k11N9J44J7p7r9J06j08M4J46j73k2J21K97m78J68j63K12
5692A39L4k55J23Q2J52m29Q8Q8J31k55LJ42j57K20N8P9n6j02k1M1j17R0K6o4k44
5717b04J56j86M01L4m19N90l88O1j69J91lj60J12k14m8LN50k56j89J02N2j12J86
5740I0K69l01j25J78m44L77R7j83L5lM6n9K38n3j44k5J0r7K80j02q5J10q8J21
5764A42j34q2J63j53mJ24K01n77L88J69l77K12q7OJ7J20j58j23j71L18L29k62
5786F1J44k72k05L62M3p0l4J5k23J80q3RM7J16J36j90k25M1P5K31%m95L31Oj18
5811a18K92k02K17j74o6L9K5l8j52L4k6Q3n7j83J71L2J53J85l39jJ77n4L7j07
$$ y = [-161, 41, -235, 40, -133, 77, -82, -82, 65, -67, -152, 208, -61, 100, 10, 15, -71, 252, 4, 122, -79, 43, -17, 136, 32, 182, 210, 246, 156, -55, 4, 148, 165, 88, -11, 95, -13, 31, 177, 4, -18, 103, 400, -78, 90, -73, 139, 173, -82, 41, 123, 275, -154, -66, 22, 153, -102, -99, 43, -114, 106, 164, 243, 187, 85, 64, 105, -12, 78, 104, 40, -204, -48, -234, 167, 201, -218, 372, -16, 45, -124, 67, 64, -96, 16, -198, -246, -243, 307, 51, -138, -36, 16, -96, 90, 359, 58, -67, 111, -333, 44, 141, -42, -7, -10, 36, -23, 215, 162, 18, -7, 3, -94, 186, 84, -1, 109, 21, 142, 8, -74, 89, -64, -68, 56, 257, -320, 68, 237, -140, 72, -15, -9, 8, 128, -30, -153, -324, -6, 323, 61, 205, -67, -272, 90, 133, 63, 29, 44, -179, 1, -82, -73, -26, 90, 226, 36, -189, -148, -73, 158, 158, -337, -6, 0, -118, 174, -28, 189, 15, -51, -12, 13, -25, -177, -143, -169, -86, -143, -326, -155, -123, 30, 215, -124, -125, 52, -2, 35, -72]
$$ [...]
8191C
##END NTUPLES=NMR FID
##END=
