##TITLE=1H_LR-758-R3-KA2BK
 CDCl3
 8 sc, 
 11.8.2023
##JCAMPDX= 6.0         $$ Bruker NMR JCAMP-DX V2.0
##DATA TYPE= NMR FID
##DATA CLASS= NTUPLES
##ORIGIN= UXNMR, Bruker Analytische Messtechnik GmbH
##OWNER= root
$$ XWIN-NMR		Version 3.5
$$ Fri Aug 11 16:08:08 2023 Russian Standard Time (UT+4h)  she@DPX200
##.OBSERVE FREQUENCY= 200.13135
##.OBSERVE NUCLEUS= ^1H
##.DELAY= (6, 6)
##.ACQUISITION MODE= SIMULTANEOUS
##.ACQUISITION SCHEME= undefined
##.AVERAGES= 8
##.DIGITISER RES= 18
##SPECTROMETER/DATA SYSTEM= spect
##.PULSE SEQUENCE= zg30
##.SOLVENT NAME= CDCl3
##.SHIFT REFERENCE= (INTERNAL, CDCl3, 0, 15.7039)
##AUDIT TRAIL= $$ (NUMBER, WHEN, WHO, WHERE, WHAT)
$$ ##TITLE= Audit trail, XWIN-NMR		Version 3.5
$$ ##JCAMPDX= 5.01
$$ ##ORIGIN= Bruker BioSpin GmbH
$$ ##OWNER= she
$$ F:/spectra/data/she/nmr/H-F/1/audita.txt
$$ ##AUDIT TRAIL=  $$ (NUMBER, WHEN, WHO, WHERE, WHAT)
(   1,<2023-08-11 16:07:06.32 +0400>,<she>,<DPX200>,
      <created by zg, POWCHK disabled, PULCHK disabled
       configuration hash MD5:
       00 E9 B6 7A A2 85 ED C7 34 08 36 98 17 FE 4E 26
       data hash MD5: 16K
       F6 49 0E A7 82 85 A6 7B BA 38 A8 AF 9D C5 2F 1F>)
$$ ##END=
$$ 
$$ hash MD5
$$ 17 28 DE 62 8F F7 2A 75 F7 B6 34 AF A2 CF D4 2B
##$RELAX= 
##$RELAX= 
##$RELAX= 
##$RELAX= 
##$RELAX= 
##$RELAX= 
$$ Bruker specific parameters
$$ --------------------------
##$DU= <F:/spectra>
##$EXPNO= 1
##$NAME= <H-F>
##$PROCNO= 1
##$TYPE= <nmr>
##$USER= <she>
##$AMP= (0..31)
100 100 100 100 100 100 100 100 100 100 100 100 100 100 100 100 100 100 
100 100 100 100 100 100 100 100 100 100 100 100 100 100 
##$AQSEQ= 0
##$AQ_mod= 1
##$AUNM= <au_zg>
##$AUTOPOS= <>
##$BF1= 200.13
##$BF2= 200.13
##$BF3= 200.13
##$BF4= 200.13
##$BF5= 200.13
##$BF6= 200.13
##$BF7= 200.13
##$BF8= 200.13
##$BYTORDA= 1
##$CFDGTYP= 0
##$CFRGTYP= 5
##$CHEMSTR= <none>
##$CNST= (0..31)
1 1 145 1 1 1 1 1 1 1 1 1 1 1 1 1 1 1 1 1 1 1 1 1 1 1 1 1 1 1 1 1 
##$CPDPRG= <>
##$CPDPRG1= <>
##$CPDPRG2= <>
##$CPDPRG3= <>
##$CPDPRG4= <mlev>
##$CPDPRG5= <mlev>
##$CPDPRG6= <mlev>
##$CPDPRG7= <mlev>
##$CPDPRG8= <mlev>
##$CPDPRGB= <>
##$CPDPRGT= <>
##$D= (0..31)
0 1.2 0 0 0 0 0 0 0 0.06 0 0.03 0 0 0 0 0.0002 0 0 0 0 0 0 0 0 0 0 0 0 
0 0 0 
##$DATE= 1691755625
##$DBL= (0..7)
120 120 120 120 120 120 120 120 
##$DBP= (0..7)
150 150 150 150 150 150 150 150 
##$DBP07= 0
##$DBPNAM0= <>
##$DBPNAM1= <>
##$DBPNAM2= <>
##$DBPNAM3= <>
##$DBPNAM4= <>
##$DBPNAM5= <>
##$DBPNAM6= <>
##$DBPNAM7= <>
##$DBPOAL= (0..7)
0.5 0.5 0.5 0.5 0.5 0.5 0.5 0.5 
##$DBPOFFS= (0..7)
0 0 0 0 0 0 0 0 
##$DE= 6
##$DECBNUC= <off>
##$DECIM= 32
##$DECNUC= <off>
##$DECSTAT= 4
##$DIGMOD= 1
##$DIGTYP= 9
##$DL= (0..7)
0 120 120 120 120 120 120 120 
##$DP= (0..7)
150 150 150 150 150 150 150 150 
##$DP07= 0
##$DPNAME0= <>
##$DPNAME1= <>
##$DPNAME2= <>
##$DPNAME3= <>
##$DPNAME4= <>
##$DPNAME5= <>
##$DPNAME6= <>
##$DPNAME7= <>
##$DPOAL= (0..7)
0.5 0.5 0.5 0.5 0.5 0.5 0.5 0.5 
##$DPOFFS= (0..7)
0 0 0 0 0 0 0 0 
##$DQDMODE= 0
##$DR= 18
##$DS= 0
##$DSLIST= <SSSSSSSSSSSSSSS>
$$ [...]
##$SUBNAM2= <"">
##$SUBNAM3= <"">
##$SUBNAM4= <"">
##$SUBNAM5= <"">
##$SUBNAM6= <"">
##$SUBNAM7= <"">
##$SUBNAM8= <"">
##$SUBNAM9= <"">
##$SW= 18.05172834244
##$SWIBOX= (0..15)
0 0 2 0 0 0 0 0 0 0 0 0 0 0 0 0 
##$SW_h= 3612.71676300578
##$TD= 16384
##$TD0= 1
##$TE= 0
##$TE2= 300
##$TE3= 300
##$TEG= 300
##$TL= (0..7)
0 120 120 120 120 120 120 120 
##$TP= (0..7)
150 150 150 150 150 150 150 150 
##$TP07= 0
##$TPNAME0= <>
##$TPNAME1= <>
##$TPNAME2= <>
##$TPNAME3= <>
##$TPNAME4= <>
##$TPNAME5= <>
##$TPNAME6= <>
##$TPNAME7= <>
##$TPOAL= (0..7)
0.5 0.5 0.5 0.5 0.5 0.5 0.5 0.5 
##$TPOFFS= (0..7)
0 0 0 0 0 0 0 0 
##$TUNHIN= 0
##$TUNHOUT= 0
##$TUNXOUT= 0
##$USERA1= <user>
##$USERA2= <user>
##$USERA3= <user>
##$USERA4= <user>
##$USERA5= <user>
##$V9= 5
##$VALIST= <valist>
##$VCLIST= <CCCCCCCCCCCCCCC>
##$VD= 0
##$VDLIST= <DDDDDDDDDDDDDDD>
##$VPLIST= <PPPPPPPPPPPPPPP>
##$VTLIST= <TTTTTTTTTTTTTTT>
##$WBST= 1024
##$WBSW= 4
##$XGAIN= (0..3)
0 0 0 0 
##$XL= 0
##$YL= 0
##$YMAX_a= 185951
##$YMIN_a= -306782
##$ZGOPTNS= <>
##$ZL1= 120
##$ZL2= 120
##$ZL3= 120
##$ZL4= 120
##$ABSF1= 10
##$ABSF2= 0
##$ABSG= 5
##$ABSL= 3
##$ALPHA= 0
##$AQORDER= 0
##$ASSFAC= 0
##$ASSFACI= 0
##$ASSFACX= 0
##$ASSWID= 0
##$AUNMP= <proc_1d>
##$AZFE= 0.1
##$AZFW= 0.1
##$BCFW= 1
##$BC_mod= 2
##$BYTORDP= 1
##$COROFFS= 0
##$CY= 11.3945322036743
##$DATMOD= 1
##$DC= 2
##$DFILT= <>
##$DTYPP= 0
##$F1P= 15.7292609196834
##$F2P= 12.9074282941183
##$FCOR= 0.5
##$FTSIZE= 0
##$FT_mod= 4
##$GAMMA= 1
##$GB= 0.15
##$INTBC= 1
##$INTSCL= 1
##$ISEN= 128
##$LB= 0.24
##$LEV0= 0
##$LPBIN= 0
##$MAXI= 10000
##$MC2= 0
##$MEAN= 0
##$ME_mod= 0
##$MI= 1.114404
##$NCOEF= 0
##$NC_proc= 0
##$NLEV= 6
##$NOISF1= 3.799351
##$NOISF2= 2.8
##$NSP= 1
##$NTH_PI= 0
##$NZP= 0
##$OFFSET= 15.70392
##$PC= 1
##$PHC0= -21044.1
##$PHC1= 9.85272
##$PH_mod= 1
##$PKNL= yes
##$PPARMOD= 0
##$PSCAL= 0
##$PSIGN= 0
##$REVERSE= no
##$SF= 200.130013532006
##$SI= 16384
##$SIGF1= 3
##$SIGF2= 2
##$SINO= 400
##$SIOLD= 16384
##$SREGLST= <1H.CDCl3>
##$SSB= 0
##$STSI= 0
##$STSR= 0
##$SW_p= 3612.71676300578
##$SYMM= 0
##$S_DEV= 0
##$TDeff= 0
##$TDoff= 0
##$TI= <>
##$TILT= no
##$TM1= 0
##$TM2= 0
##$TOPLEV= 0
##$USERP1= <user>
##$USERP2= <user>
##$USERP3= <user>
##$USERP4= <user>
##$USERP5= <user>
##$WDW= 1
##$XDIM= 8192
##$YMAX_p= 0
##$YMIN_p= 0
$$ End of Bruker specific parameters
$$ ---------------------------------
##NTUPLES= NMR FID
##VAR_NAME=  TIME,          FID/REAL,        FID/IMAG
##SYMBOL=    X,             R,               I
##VAR_TYPE=  INDEPENDENT,   DEPENDENT,       DEPENDENT
##VAR_FORM=  AFFN,          ASDF,            ASDF
##VAR_DIM=   8192,          8192,            8192
##UNITS=     SECONDS,       ARBITRARY UNITS, ARBITRARY UNITS
##FACTOR=    0.0002768,     1,               1
##FIRST=     0,             0,               0
##LAST=      2.2672688,     0,               0
##MIN=       0,             -306782,         0
##MAX=       2.2672688,     185951,          0
$$ Real data points
##PAGE= N=1
##DATA TABLE= (X++(R..R)), XYDATA
$$ plain form
0 0 0 0 0 0 0 0 0 0 0 0 0 -8 8 -8 8 -16 16 -24 24 -32 40 -48 56 -64 72 -88 104 -120 136 -157 177 -202 232
33 232 -264 296 -332 375 -417 466 -521 578 -643 714 -792 875 -966 1067 -1176 1295 -1427
50 -1427 1573 -1733 1910 -2108 2330 -2579 2866 -3194 3576 -4027 4571 -5240 6087 -7195 8721
65 8721 -10954 14548 -21278 38205 -173092 -215694 121644 -77266 -121646 54839 -47386
76 -47386 -197039 51302 72951 -138649 1043 185951 -29319 -62288 132118 32057 -73940
87 -73940 141421 132674 -55159 77451 177956 -52797 -59422 132725 54665 -6289 134911
98 134911 16422 -169577 18625 133589 -63927 -60043 53038 -87078 -106428 74809 -40378
109 -40378 -205966 -17426 61790 -121062 -80561 10411 -149985 -127625 88685 -16361 -168787
$$ packed form
0@%%%%%%%%%%%qJ6j6J6k4L2m0M8n6P2q8J04j20J36j60J92k24K56k93L34l79M34
33B32m96N60o28P07p92Q83r87J099j221J357j506J667j841K033k243K471k722
50a427L000l306L643m018M438m909N445o060O770p603Q598r811J1327j3282J5916
65H721j9675K5502l5826N9483k11297m2602L37338j98910m4380J76485j02225
76d7386j49653K48341K1649k11600J39692J84908k15270l2969J94406j00061j05997
87g3940K15361q747j87833J32610J00505k30753o625J92147p8060o0954J41200
98A34911j18489j85999J88202J14964j97516L884J13081j40116j9350J81237j15187
109d0378j65588J88540P9216j82852M0501R0972j60396K2360K16310j05046j52426
$$ plain form
120 -168787 200 38719 -127340 -35278 82227 -63296 -48790 119691 2759 -106762
130 -106762 75389 103764 -43476 42105 118634 -22480 10629 150837 26715 -55081 107926
141 107926 109115 -17471 52288 73625 -53675 18346 133655 -7551 -71875 58247 19937
152 19937 -70144 29849 24885 -106935 -23078 69057 -73037 -99946 27329 -31469 -94681 25417
164 25417 1612 -125567 -19856 64647 -74464 -70657 61176 -10244 -65253 57611 28730
175 28730 -80410 35234 104073 -31454 -17723 93907 15087 -18534 99154 51448 -49045
186 -49045 60859 105660 -19780 4063 87010 3786 -9420 88068 18783 -59473 48834
197 48834 61595 -49619 -3703 52162 -43046 -31761 59076 -25120 -81395 31761 22689 -76850
$$ packed form
120a68787J68987L8519j66059R2062J17505j45523J4506J68481j16932j09521
130a06762J82151K8375j47240Q5581P6529j41114L3109J40208j24122q1796J63007
141A07926J189j26586O9759K1337j27300P2021J15309j41206o4324J30122l8310
152A9937r0081R9993m964j31820Q3857R2135j42094k6909J27275n8798o3212J20098
164B5417k3805j27179J05711Q4503j39111L807J31833p1420n5009J22864k8881
175B8730j09140J15644O8839j35527J3731J11630p8820l3621J17688m7706j00493
186d9045J09904M4801j25440K3843Q2947q3224j3206R7488o9285p8256J08307
197D8834J2761j11214M5916N5865r5208J1285R0837q4196n6275J13156r072r9539
$$ plain form
209 -76850 -11768 26844 -70094 -30765 57895 -41251 -81802 40402 19373 -71503 10455 41208
221 41208 -59535 -10548 75591 -23852 -53016 64364 33668 -45545 39486 55670 -43403 12021
233 12021 87925 -11117 -30709 73425 31305 -36863 43477 45428 -40520 19175 69807 -29841
245 -29841 -31967 56760 2846 -44437 34606 14639 -61572 8670 43612 -54014 -38542 39515
257 39515 -21606 -48387 30438 -6907 -72085 14000 39102 -56823 -26425 44602 -25346 -40332
269 -40332 45425 3954 -56843 29229 47072 -44090 -8004 54468 -16522 -23420 56966 9193
281 9193 -46201 36213 44878 -40046 -1913 50415 -16344 -18759 45953 -4004 -44270 32018 29279
294 29279 -41197 -1085 32086 -30365 -15840 39283 -16969 -42119 30294 16640 -40592 4617
$$ packed form
209g6850O5082L8612r6938L9329Q8660r9146m0551J22204k1029r0876Q1958L0753
221D1208j00743M8987Q6139r9443k9164J17380l0696p9213Q5031J6184r9073N5424
233A2021P5904r9042j9592J04134m2120o8168Q0340J951q5948N9695N0632r9648
245b9841k126Q8727n3914m7283P9043j9967p6211P0242L4942r7626J5472P8057
257C9515o1121k6781P8825l7345o5178Q6085K5102r5925L0398P1027o9948j4986
269d0332Q5757m1471o0797Q6072J7843r1162L6086O2472p0990o898Q0386m7773
281I193n5394Q2414Q665q4924L8133N2328o6759k415O4712m9957m0266P6288k739
294B9279p0476M0112L3171o2451J4525N5123n6252k5150P2413j3654n7232M5209
$$ plain form
306 4617 21210 -34960 -3563 40055 -23215 -34854 34401 7654 -37590 16761 21703 -36910
318 -36910 1320 40287 -24246 -29013 36190 5311 -32866 20806 17657 -36752 5224 38668
330 38668 -24896 -24261 35256 3327 -29366 18893 12882 -32279 8879 32559 -23577 -18006 28399
343 28399 -2242 -19908 21787 4472 -29801 13986 26675 -23887 -10814 24598 -6862 -10704
355 -10704 25062 -3235 -26768 20523 21402 -24026 -489 23589 -14727 -6716 29526 -7559 -27211
368 -27211 23400 17706 -25867 1411 18820 -20374 -6136 27393 -13620 -29438 20305 10982
380 10982 -29551 -855 13610 -23142 -7573 22258 -16038 -28011 16681 7829 -23168 2875
392 2875 8774 -20579 1314 23951 -13935 -18715 21101 8407 -13482 11186 8385 -15678 11708
$$ packed form
306D617J6593n6170L1397M3618o3270j1639O9255k6747m5244N4351M942n8613
318c6910L8230L8967o4533m767O5203l0879l8177N3672l149n4409M1976L3444
330C8668o3564O35N9517l1929l2693M8259o011m5161M1158K3680n6136N571M6405
343B8399l0641j7666M1695j7315l4273M3787J2689n0562J3073L5412l1460l842
355a0704L5766k8297k3533M7291Q79m5428K3537K4078l8316Q011L6242l7085j9652
368b7211N0611n694m3573K7278J7409l9194J4238L3529m1013j5818M9743r323
380A0982m0533K8696J4465l6752J5569K9831l8296j1973M4692q852l0997K6043
392B875N899k9353K1893K2637l7886m780L9816j2694k1889K4668k801k4063K7386
$$ plain form
405 11708 24928 -13413 -9455 22519 1878 -10322 17540 2339 -22203 12418 20865 -21243
417 -21243 -13042 17142 -7500 -15803 12901 -6825 -29947 7431 14078 -28125 -16271 13089 -12876
430 -12876 -19118 11117 -7177 -29854 6037 14277 -22891 -13403 11850 -8416 -10941 13859 -4785
443 -4785 -21881 11329 16141 -15919 -5693 12922 -5340 -3061 15666 -3801 -15587 12968 12566
456 12566 -11868 -68 9264 -9293 488 16577 -9255 -16849 12885 7814 -15323 -225 4860
469 4860 -15099 -2126 13009 -14308 -19956 9423 1044 -20086 -2163 1872 -19929 -6694 10885
482 10885 -14873 -21750 6159 1922 -17203 -2772 2186 -14311 -2437 12479 -8228 -13919 9653
495 9653 7226 -7444 3466 7295 -5583 3828 14850 -777 -5222 9778 7636 -562 6652 3595
$$ packed form
405A1708J3220l8341L958L1974k0641j2200K7862j5201k4542L4621Q447m2108
417b1243Q201L0184k4642q303K8704j9726k3122L7378O647m2203J1854K9360k5965
430a2876o242L0235j8294k2677L5891Q240l7168R488K5253k0266k525K4800j8644
443d785j7096L3210M812l2060J0226J8615j8262K279J8727j9467j1786K8555m02
456A2566k4434J1800R332j8557R781J6089k5832p594K9734n071k3137J5098N085
469D860j9959J2973J5135k7317n648K9379q379k1130J7923M035k1801J3235J7579
482A0885k5758o877K7909m237j9125J4431M958j6497J1874J4916k0707n691K3572
495I653k427j4670J0910L829j2878R411J1022j5627m445J5000k142q198P214l057
$$ plain form
509 3595 -5904 5437 10467 -5314 -5953 5944 -507 -5039 3091 -2889 -11174 1249 4329 -10226
523 -10226 -7225 3103 -5628 -7461 3849 -2704 -12224 1705 6829 -7951 -5604 5825 -609 -3686
537 -3686 5903 1567 -6571 4462 9270 -2536 -1816 7634 3124 -775 6674 4891 -1828 3662 8755
552 8755 2452 616 5255 3560 3318 5986 3364 464 4714 5854 1693 2358 3113 1048 2202 4001
568 4001 156 -238 2850 524 -1899 2222 893 -4247 260 3061 -2906 -3312 2879 436 -3573 1513
584 1513 2791 -2279 459 4891 215 -409 5763 4210 -497 4259 7183 1557 2109 7682 5182 1596
600 1596 4947 5978 2372 3248 5425 2856 1733 3779 2642 1453 2357 1726 19 1339 2013 501
616 501 -47 399 470 1427 882 -1600 -401 2319 901 -1044 1447 1639 -1045 1349 3612 -518 -2028
$$ packed form
509C595r499J1341N030j5781o39J1897o451m532Q130n980q285J2423L080j4555
523a0226L001J0328q731j833J1310o553r520J3929N124j4780K347J1429o434l077
537c686R589m336q138J1033M808j1806P20R450m510l899P449j783o719N490N093
552H755o303j836M639j695k42K668k622k900M250J140m161O65P55k065J154J799
568D001l845l94L088k326k423M121j329n140M507K801n967m06O191k443m009N086
584A513J278n070K738M432m676o24O172j553m707M756K924n626N52N573k500l586
600A596L351J031l606Q76K177k569j123K046j137j189R04o31j707J320O74j512
616E01n48M46P1R57n45k482J199K720j418j945K491J92k684K394K263m130j510
$$ plain form
633 -2028 3156 2705 -1488 953 2657 -1628 253 4549 -271 -4183 3104 3824 -2867 -795 4332 -477
649 -477 -1804 4037 2185 -3238 1655 4985 -813 -1103 3814 1012 -578 4081 2482 -3232 1384 5276
665 5276 -306 -1775 1986 630 -1056 2008 -173 -3396 62 1853 -2443 -1633 242 -3013 -2147 2373
681 2373 -1570 -5016 636 1665 -3364 -835 1764 -3439 -1092 4453 -1280 -5028 3558 3804 -4265
696 -4265 367 5433 -2654 -2395 6310 1035 -5747 2823 5284 -3909 -1227 4934 -2548 -3289 5732 495
712 495 -7294 1738 5555 -4178 -2753 3925 -1963 -3433 4218 591 -5739 1098 3749 -3338 -1714
727 -1714 2894 -2652 -2347 3871 -702 -5774 1916 2714 -4463 -978 2009 -3616 -1152 4351 -2413 -5658
743 -5658 3762 2282 -5415 814 4177 -4113 -457 7046 -1783 -5275 5869 4653 -4234 1848 5413
$$ packed form
633b028N184m51m193K441J704m285J881M296m820l912P287P20o691K072N127m809
649d77j327N841j852n423M893L330n798k90M917k802j590M659j599n714M616L892
665E276n582j469L761j356j686L064k181l223L458J791m296Q10J875l255Q66M520
681B373l943l446N652J029n029K529K599n203K347N545n733l748Q586K46q069
696d265M632N066q087K59Q705n275o782Q570K461r193K682O161p482p41R021n237
712D95p789R032L817r733J425O678n888j470P651l627o330O837K651p087J624
727a714M608n546L05O218m573n072P690P98p177L485K987n625K464N503o764l245
743e658R420j480p697O229L363q290L656P503q829l492J1144j216q887O082L565
$$ plain form
758 5413 -3597 315 8135 -1599 -6141 5570 4739 -5179 48 4443 -3875 -1956 5565 -2278 -7190
773 -7190 2368 2389 -5343 -884 1730 -4706 -1569 4352 -2946 -5942 2906 2148 -3435 532 1449 -3139
789 -3139 1760 5403 -2850 -2902 5255 1956 -1955 3759 1620 -3784 3431 6487 -3871 -2941 4957 1071
805 1071 -2488 3773 165 -5980 3391 5954 -5383 -4410 5014 -453 -3708 3028 47 -6736 1876
820 1876 5550 -4879 -4140 3303 -425 -2233 3127 -1294 -5763 2400 4545 -4281 -3042 2599 -700
835 -700 -833 3190 -2066 -4364 3642 3651 -3699 -240 2668 -2160 1553 5363 -2857 -3976 6081 3971
851 3971 -3280 1761 2956 -3278 2337 6371 -4114 -4830 6301 2630 -5573 1019 1791 -6082 388
866 388 5777 -5431 -7162 3936 710 -6040 500 -10 -6862 666 5508 -5514 -5935 4612 1235
$$ packed form
758E413r010L912P820r734m542J1711q31r918N227M395q318J919P521p843m912
773g190R558K1p732M459K614o436L137N921p298k996Q848p58n583L967R17m588
789c139M899L643q253n2Q157l299l911N714k139n404P215L056j0358R30P898l886
805A071l559O261l608o145R371K563j1337R73R424n467l255O736k981o783Q612
820A876L674j0429P39P443l728j808N360m421m469Q163K145q826J239N641l299
835g00j33M023n256k298Q006Rp350L459K908m828L713L810q220j119J0057k110
851C971p251N041J195o234N615M034j0485p16J1131l671q203O592P72p873O470
866C88N389j1208j731J1098l226o750O540n10o852P528M842j1022m21J0547l377
$$ plain form
881 1235 -4333 2598 1571 -4313 3170 6564 -3583 -1972 6515 1550 -1150 5387 1176 -4201 5750
896 5750 7185 -4405 -1541 6484 -173 -1972 5846 -1387 -6826 4807 5306 -7439 -2909 5403 -3787
911 -3787 -3880 5855 -2362 -9231 3977 5193 -7588 -2598 5392 -3698 -3095 6770 -1567 -8071 5043
926 5043 6026 -6091 -703 6421 -2802 -1260 8061 -295 -5889 6156 5927 -4267 1250 5974 -2765
941 -2765 647 8706 -1383 -5134 7074 4673 -4339 2464 4781 -4190 872 8064 -3278 -5651
955 -5651 6421 2240 -5989 2930 2894 -7523 -156 7718 -5472 -7704 5307 515 -7116 2493 2628
970 2628 -8323 94 7727 -4778 -5724 6727 1564 -5186 5261 4216 -5723 2279 9514 -1979
984 -1979 -2831 7821 2426 -2442 6428 3730 -5050 3705 8008 -3330 -2153 6390 -641 -3314 5331
$$ packed form
881A235n568O931j027n884P483L394j0147J611Q487m965k700O537m211n377R951
896E750J435j1590K864Q025o657j799P818p233n439J1633M99j2745M530Q312r190
911c787r3R735q217o869J3208J216j2781M990P990r090O03R865q337o504J3114
926E043R83j2117N388P124r223J542R321q356n594J2045k29j0194N517M724q739
941b765L412Q059j0089l751J2208k401r012O803K317q971N062P192j1342k373
955e651J2072m181q229Q919l6j0417P367P874j3190k232J3011m792p631R609J35
970B628j0951Q417P633j2505r46J2451n163o750J0447j045r939Q002P235j1493
984a979q52J0652n395m868Q870k698q780Q755M303j1338J177Q543p031k673Q645
$$ plain form
999 5331 109 -7035 2148 4427 -6370 -2662 3683 -4648 -4314 4819 -2311 -8676 2735 3793 -6784
1014 -6784 -1502 4249 -4880 -3386 6628 -1444 -7123 4711 4249 -5564 600 5625 -4043 -1659 7930
1029 7930 -574 -5970 5107 4248 -4482 1833 4501 -4214 -723 7033 -2205 -4678 5293 1911 -4765
1044 -4765 2737 2889 -5731 102 5580 -4110 -4518 4200 -1083 -5712 2773 494 -8089 456 4361
1059 4361 -6801 -4879 4234 -2989 -6582 3312 -397 -8662 1114 4741 -6717 -3277 5770 -2668
1073 -2668 -4875 6238 1134 -7172 3738 6657 -5132 -1016 7317 -1383 -3048 6741 794 -6239
1087 -6239 4582 5008 -5964 -530 5678 -4023 -3487 5856 -2342 -7565 3555 2007 -7595 -965 3150
1102 3150 -6809 -2885 5320 -4871 -7554 4790 1102 -8329 1079 3906 -7091 -1333 6863 -4307
$$ packed form
999E331n222p144R183K279j0797L708O345q331L34R133p130o365J1411J058j0577
1014f784N282N751r129J494J0014q072n679J1834m62r813O164N025r668K384R589
1029G930q504n396J1077q59q730O315K668q715L491P756r238k473R971l382o676
1044d765P502J52q620N833N478r690m08Q718n283m629Q485k279q583Q545L905
1059D361j1162J922R113p223l593R894l709q265R776L627j1458L440R047q438
1073b668k207J1113n104q306J0910K919j1789M116Q333q700j665R789n947p033
1087f239J0821M26j0972N434O208r701N36R343q198n223J1120j548r602O630M115
1102C150r959L924Q205j0191k683J2344l688r431R408K827j0997N758Q196j1170
$$ plain form
1116 -4307 -6012 6735 1745 -7055 3354 4815 -6659 553 8124 -4218 -5218 7719 1679 -6482
1130 -6482 4058 4457 -6516 1145 7718 -4704 -4029 7347 514 -6073 4444 2948 -6674 1826
1144 1826 6542 -5896 -3931 6531 -1313 -5828 4098 491 -7442 2692 4618 -7441 -3179 6177
1158 6177 -3250 -5440 5121 -439 -7650 3938 5059 -7407 -1496 6814 -3212 -3568 6782 -523
1172 -523 -6547 6119 5555 -6562 641 7526 -2803 -2198 7157 -517 -5541 6195 4538 -6273
1186 -6273 905 6136 -3891 -1924 6115 -2808 -6271 5188 2022 -6998 385 3757 -5266 -1181
1200 -1181 4874 -4455 -5196 5682 597 -6599 2317 3145 -5032 926 5572 -4582 -3390 6853 505
1215 505 -5493 4021 2381 -5252 2773 5790 -5415 -2523 7130 -488 -5193 4410 1406 -5765 2754
$$ packed form
1116d307j705J2747m990q800J0409J461j1474P212P571j2342j000J2937o040q161
1130f482J0540L99j0973P661O573j2422O75J1376o833o587J0517j496r622Q500
1144A826M716j2438J965J0462p844m515R926l607p933J0134J926j2059M262R356
1158F177r427k190J0561n560p211J1588J121j2466N911Q310j0026l56J0350p305
1172e23o024J2666n64j2117P203O885j0329O05R355p674n024J1736j657j0811
1186f273P178N231j0027J967Q039q923l463J1459l166r020P383L372r023M085
1200a181O055r329p41J0878n085p196Q916Q28q177N958M646j0154J192J0243o348
1215E05n998R514j640p633Q025L017j1205K892R653p618m705R603l004p171Q519
$$ plain form
1230 2754 4803 -5616 -2181 6171 -1615 -4296 4105 248 -5452 3747 4167 -6280 -1152 5944 -2235
1245 -2235 -3308 4572 -1197 -5406 4364 2637 -6593 -232 4880 -3802 -2054 4798 -2789 -5048 5384
1260 5384 1993 -6608 1113 4121 -4551 -443 5355 -3613 -4417 6727 1522 -6421 2349 4051 -4804
1275 -4804 574 6078 -4163 -3584 6553 701 -6056 2913 2973 -5489 856 5413 -5200 -3653 6292
1290 6292 -650 -5989 2730 1742 -5508 1819 4337 -5587 -2116 5882 -1442 -4555 4390 672 -5135
1305 -5135 3466 4489 -5640 -953 6543 -1910 -3229 5205 -380 -5167 4560 3894 -6469 -131 6150
1320 6150 -3311 -3069 5453 -1441 -5939 4728 3179 -6694 -1 5310 -4270 -2338 5544 -2278 -5044
1335 -5044 5109 2425 -6314 884 5030 -4017 -1275 5589 -2217 -4370 5584 1774 -5654 1992 3897
$$ packed form
1230B754K049j0419L435Q352p786k681Q401l857n700R199M20j0447N128P096q179
1245b235j073P880n769m209R770j727r230O361N112q682J748O852p587k259J0432
1260E384l391q601P721L008q672M108N798q968q04J1144n205p943Q770J702q855
1275d804N378N504j0241N79J0137n852o757Q969O0q462O345M557j0613J547R945
1290F292o942n339Q719r88p250P327K518r924L471P998p324l113Q945l718n807
1305e135Q601J023j0129M687P496q453j319Q434n585m787R727o66j0363O338O281
1320F150r461K42Q522o894m498J0667j549r873O693N311r580J932P882p822k766
1335e044J0153k684q739P198M146r047K742O864p806k153R954l810p428P646J905
$$ plain form
1350 3897 -4097 73 5626 -3356 -3505 5462 673 -4990 2561 2836 -4666 884 4589 -3944 -2776
1365 -2776 5468 -148 -4491 3876 1768 -5025 1959 4755 -4556 -2012 5464 -1037 -4320 3357 1008
1380 1008 -5168 2296 3769 -4907 -1823 4849 -1963 -3815 3761 -245 -4785 2716 3149 -4929 -968
1395 -968 4310 -2319 -2336 4045 -613 -3748 3617 2634 -4079 563 4083 -2666 -1156 4589 -1440 -3180
1411 -3180 4052 1513 -4459 1111 2885 -3612 -408 3764 -3401 -3786 3598 52 -5018 1485 1834
1426 1834 -4605 -395 3234 -3846 -3233 4007 -555 -4275 2124 1487 -4009 979 3385 -3507 -1809
1441 -1809 4211 -737 -3349 2849 913 -3784 1642 2851 -4099 -1052 3548 -1794 -2917 2682 -313
1456 -313 -4151 2095 2040 -4334 -481 3199 -2568 -1971 3366 -1234 -3774 2963 1726 -4791 227 3182
$$ packed form
1350C897p994M170N553q982j49Q967m789n663P551K75p502N550L705q533J168
1365b776Q244n616m343Q367k108o793O984K796r311K544P476o501l283P677k349
1380A008o176P464J473q676L084O672o812j852P576m006m540P501M33q078L961
1395i68N278o629j7O381m658l135P365r83o713M642L520o749J510N745o029j740
1411c180P232k539n972N570J774o497L204M172p165l85P384l546n070O503L49
1426A834o439M210L629p080O13P240m562l720O399o37n496M988K406o892J698
1441a809O020m948k612O198j936m697N426J209o950L047M600n342j123N599k995
1456c13l838O246n5o374L853L680n767N97N337m600k540O737j237o517N018K955
$$ plain form
1472 3182 -3206 -1882 3495 -2055 -3815 3233 920 -4831 622 2806 -4026 -1446 2923 -2701 -3582
1487 -3582 2893 268 -4611 1236 2388 -3499 -697 3097 -2501 -2357 3723 59 -3724 2176 1875
1502 1875 -3094 705 2909 -2728 -1703 3855 -566 -3303 2770 1131 -3723 830 2322 -3704 -1445
1517 -1445 3472 -1807 -3343 2357 90 -3728 1305 1924 -3918 -879 3686 -1767 -2828 2763 216
1532 216 -3319 2001 2081 -3518 -42 3642 -1671 -2125 3103 59 -2518 2317 1487 -3357 552 3197
1548 3197 -2144 -1147 2707 -793 -2528 2612 835 -3355 892 2407 -2078 -493 2571 -1235 -1350
1563 -1350 2744 259 -2825 1596 2191 -2041 -40 2433 -1571 -1130 2855 -555 -2664 1755 1185 -2398
1579 -2398 162 2018 -2247 -1046 3021 -769 -2547 1847 1287 -2171 874 1598 -1755 -67 3069
$$ packed form
1472C182o388J324N377n550j760P048k313n751N453K184o832K580M369n624q81
1487c582O475k625m879N847J152n887K802L794n598J44O080l664l783N900l01
1502A875m969L799K204n637J025N558m421k737O073j639m854M553J492o026K259
1517a445M917n279j536N700k267l818N033O19n842L039M565n453j061N591k547
1532B16l535N320Q0n599L476L684n313m54N228l044k577M835q30m844L909K645
1548C197n341R97L854l500j735N140j777m190M247J515m485J585L064l806j15
1563a350M094k485l084M421N95m232K001K473m004M41L985l410k109M419n70l583
1579b398K560J856m265J201M067l790j778M394n60l458L045P24l353J688L136
$$ plain form
1594 3069 -805 -1575 2191 934 -1318 1524 1417 -1872 371 2850 -1153 -1065 2058 105 -1367 1919
1610 1919 622 -2392 838 1925 -1644 -986 1658 -874 -1037 2033 204 -2478 1204 1706 -1795 -327
1626 -327 1928 -991 -812 2347 -6 -1997 1747 1733 -1636 74 1712 -1263 -432 2346 -485 -2058
1642 -2058 1557 1308 -1968 231 1326 -1541 -421 2144 -952 -2031 1262 448 -1807 660 640 -1806
1658 -1806 74 1971 -1102 -1240 1657 321 -1815 1342 846 -2012 579 2131 -1556 -1294 1820 -416
1674 -416 -1569 1251 510 -2554 494 1810 -1794 -1273 1537 -113 -1310 1532 322 -1845 699 2005
1690 2005 -1531 -566 1605 -368 -1047 1642 255 -2022 892 1551 -1358 -379 1287 -894 -1019 1336
1706 1336 -311 -1667 686 800 -1466 -279 854 -1675 -796 1605 -766 -1720 1096 510 -1489 253
$$ packed form
1594C069l874p70L766j257k252K842j07l289K243K479m003Q8L123j953j472L286
1610A919j297l014L230J087l569O58K644k532j63L070j829k682L682N02l501J468
1626c27K255k919J79L159k353j991L744j4l369J710J638k975Q31K778k831j573
1642b058L615k49l276K199J095k867J120K565l096j079L293q14k255K467k0k446
1658a806J880J897l073j38K897j336k136L157m96k858K591J552l687K62L114k236
1674d16j153K820p41l064L048J316l604N21K810j650j197K842j210k167K544J306
1690B005l536R65K171j973o79K689j387k277K914O59k909R79J666k181j25K355
1706A336j647j356K353J14k266J187J133k529Q79K401k371r54K816n86j999J742
$$ plain form
1722 253 705 -1342 -183 1630 -826 -1198 1262 856 -1203 620 1091 -1247 81 1648 -488 -1029
1738 -1029 1303 362 -1033 492 459 -1094 -142 1360 -706 -1262 745 2 -834 501 137 -1286 278
1755 278 1133 -864 -491 782 -267 -478 1103 130 -1200 488 670 -1006 -397 685 -653 -156 1022
1772 1022 -319 -1080 458 660 -486 61 779 -578 -385 1071 -128 -789 541 607 -406 382 715
1789 715 -610 -75 1305 8 -343 710 480 -347 486 424 -548 36 732 -368 -677 646 -155 -678
1807 -678 214 -171 -831 169 370 -859 -386 263 -503 -258 677 -264 -574 409 698 -368 -4 795 -470
1826 -470 -114 921 241 -477 815 937 -376 218 539 -283 -14 1077 -69 -781 625 440 -813 -13
1844 -13 412 -651 -203 742 -300 -821 188 56 -644 132 269 -899 -77 515 -223 -376 309 -135 -360
$$ packed form
1722B53M52k047J159J813k456l72K460m06k059J823M71k338J328J567k136n41
1738a029K332r41j395J525l3j553R52J502k066n56K007p43q36J335l64j423J564
1755B78Q55j997L73J273j049k11J581r73j330J688J82j676O09J082j338M97J178
1772A022j341p61J538K02j146N47P18j357J93J456j199o61J330O6j013P88L33
1789G15j325N35J380j297l51J053k30q27Q33o2r72N84O96j100l09J323q01n23
1807f78Q92l85o60J000K01j229M73O49p66K45R35r41l10R83K89j066L64P99j265
1826d70L56J035o80p18J292J22j313N94L21q22K69J091j146p12J406j85j253Q00
1844a3M25j063M48R45j042n21J009j32p00P76J37j168Q22N92p38j53O85m44k25
$$ plain form
1863 -360 223 312 -534 121 417 -501 -449 255 91 -524 311 39 -1046 7 847 -561 -96 644 50 -640
1883 -640 551 32 -538 179 716 -206 200 798 82 -232 376 297 -274 153 337 -639 -101 209 -400 -307
1903 -307 -114 -652 -584 13 8 -452 -508 -138 -525 -239 39 -412 -235 202 -55 28 100 445 -168 142 564 -186
1925 -186 12 353 9 -439 -131 177 -65 109 369 -122 -66 229 187 -206 -149 353 -298 184 -86 -94 129 46
1947 46 -58 -170 -123 -67 -93 71 199 -179 -172 -132 73 -91 204 -90 75 55 -301 -336 314 -110 -165 56 -69
1970 -69 -579 -1 383 -113 7 333 -207 -19 449 146 -9 208 797 -97 9 217 297 111 308 542 -337
1991 -337 30 237 -99 165 77 -148 -306 196 50 -203 -145 325 -415 -293 -40 -277 84 248 -253 -437 446
2012 446 161 -363 68 216 -365 188 542 184 74 327 244 -220 387 348 -6 157 412 -105 -206 407 345
$$ packed form
1863c60N83Q9q46O55K96r18N2P04j64o15Q35k72j085J053Q40j408M65P40n94o90
1883f40J191n19n70P17N37r22M06N98p16l14O08p9n71M27J84r76N38L10o09R3
1903c07J93n38O8N97nm60n6L70l87K86K78m51J77M37k57Q3P2L45o13L10M22p50
1925a86J98L41l44m48L08L08k42J74K60m91N6K95m2l93N7N02o51M82k70qK23q3
1947D6j04j12M7N6k6J64J28l78PM0K05j64K95k94J65k0l56l5O50m24n5K21j25
1970f9n10N78L84m96J20L26n40J88M68l03j55K17N89q94J06K08Q0j86J97K34q79
1991c37L67K07l36K64q8k25j58N02j46k53N8M70p40J22K53k37L61J64n01j84Q83
2012D46k85n24M31J48n81N53L54l58j10K53q3m64O07l9l54J63K55n17j01O13o2
$$ plain form
2033 345 -128 -47 126 -169 91 580 -148 -457 47 22 -381 149 270 -247 92 268 -167 -20 148 -82 -195
2054 -195 488 -82 -206 261 187 153 45 87 -100 63 410 -388 -288 45 433 -81 -263 25 -31 -146 451
2075 451 122 -204 132 231 81 69 222 31 261 534 176 -107 242 253 -146 191 107 -152 87 203 -113
2096 -113 -374 -96 83 -97 63 -133 -487 -101 85 -54 2 116 -322 -113 323 52 -121 430 346 22 164
2117 164 28 213 24 735 47 -99 260 275 -290 237 137 -288 -176 319 -227 -517 75 -236 -444 -90
2137 -90 -140 -234 64 336 -400 -495 -39 -143 -156 404 313 -11 164 206 34 200 392 296 -132 163 -154 -479 53
2160 53 436 -325 -151 216 -215 -92 350 114 -331 -68 321 -359 -24 324 85 -258 297 39 -473 220
2180 220 367 -265 -190 417 -369 -300 202 -195 -388 183 344 -404 -282 33 -503 -377 229 -157 -251 17 -32
$$ packed form
2033C45m73Q1J73k95K60M89p28l09N04k5m03N30J21n17L39J76m35J47J68k30j13
2054a95O83n70j24M67p4l4j08M2j87J63L47p98J00L33L88n14j82K88n6j15N97
2075D51l29l26L36R9j50j2J53j91K30K73l58k83L49J1l99L37q4k59K39J16l16
2096a13k61K78J79j80J60j96l54L86J86j39N6J14m38K09M36k71j73N51q4l24J42
2117A64j36J85j89P11o88j46L59J5n65N27j00m25J12M95n46k90N92l11k08L54
2137i0n0r4K98K72p36r5M56j04j3N60r1l24J75M2j72J66J92r6m28K95l17l25N32
2160E3L83p61J74L67m31J23M42k36m45K63L89o80L35L48k39l43N55k58n12O93
2180B20J47o32P5O07p86O9N02l97j93N71J61p48J22L15n36J26O06l86r4K68m9
$$ plain form
2201 -32 -314 -178 443 -236 38 474 195 -25 560 434 219 105 346 -212 131 442 211 -316 242 259 -135
2222 -135 159 463 -394 -294 149 -187 -456 281 8 -263 -197 232 -409 -70 255 -219 -422 -106 -16 -120 299
2243 299 288 -191 93 627 -161 -339 260 214 -283 509 76 -518 22 353 -103 -13 166 89 -328 83 67 -311
2265 -311 139 50 116 -24 107 84 -89 231 216 -206 79 300 -376 1 258 -133 -225 343 53 -291 10 3
2287 3 -40 51 178 -202 -304 136 157 -269 51 -120 -203 -100 -152 -134 135 313 -200 -10 228 130 -118 224 329
2310 329 -23 179 438 13 -88 531 12 -113 -3 -1 -616 -47 343 -497 -211 363 -404 -246 42 -11 -458
2331 -458 150 81 -333 -150 138 -224 -388 157 26 -189 68 343 17 -73 174 -21 333 342 225 -233 67
2352 67 91 -342 -84 214 -19 151 308 -309 -434 374 257 -225 117 409 -333 11 320 132 -396 295 281
$$ packed form
2201c2k82J36O21o79K74M36k79k20N85j26k15j14K41n58L43L11k31n27N58J7l94
2222a35K94L04q57J00M43l36k69P37k73k71O6M29o41L39L25m74k03L16R0j04M19
2243B99j1m79K84N34p88j78N99m6m97P92m33n94N40L31m56R0J79p7m17M11j6l78
2265c11M50q9O6j40J31k3j73L20j5m22K85K21o76L77K57l91r2N68k90l44L01p
2287Cm3R1J27l80j02M40K1m26L20j71q3J03n2J8K69J78n13J90K38r8k48L42J05
2310C29l52K02K59m25j01O19n19j25J10Ko15N69L90q40K86N74p67J58K88n3m47
2331d58O08o9m14J83K88l62j64N45j31k15K57K75l26r0K47j95L54Rj17m58L00
2352F7K4m33K58K98k33J70J57o17j25Q08j17m82L42K92p42L44L09j88n28O91j4
$$ plain form
2373 281 -301 150 88 -117 -148 280 -17 -431 400 267 -238 111 294 -596 -226 79 -28 -160 38 60 -295
2394 -295 -360 -64 -133 -258 197 -113 -114 298 64 159 282 54 -187 52 243 61 -133 169 0 -118 357 257
2416 257 -288 226 -11 -238 -137 158 20 -285 57 149 138 -91 -33 -397 -138 207 -62 -85 53 278 -212
2437 -212 137 271 -187 72 257 228 49 184 92 -371 14 -40 65 -249 -119 -113 -394 -198 -43 -95 105 -130
2459 -130 -329 -221 183 -191 -236 103 -51 138 97 202 -172 248 26 -205 -48 223 52 -129 104 2 33
2480 33 -291 55 -317 -57 17 -375 -78 185 25 -157 -254 -158 156 202 -194 -109 -117 -107 105 -51 -73 433 -264
2503 -264 108 142 -109 -253 196 -5 -208 107 373 7 265 64 -204 -173 26 -207 -44 56 -28 -23 123 129
2525 129 -92 152 142 24 -70 -39 80 -151 155 120 -83 -17 17 -256 -54 38 5 14 19 108 20 180 51 -85 216
$$ packed form
2373B81n82M51o2k05l1M28k97m14Q31j33n05L49J83q90L70L05j07j32J98K2l55
2394b95o5K96o9j25M55l10jM12k34R5J23k28k41K39J91j82j94L02j69j18M75j00
2416B57n45N14k37k27J01K95j38l05L42R2j1k29N8l64K59L45k69k3J38K25m90
2437b12L49J34m58K59J85k9j79J35r2m63L85n4J05l14J30Ok81J96J55n2K00k35
2459a30j99J08M04l74m5L39j54J89m1J05l74M20k22k31J57K71j71j81K33j02L1
2480C3l24L46l72K60P4l92K97K63j60j82r7R6L14M6l96Q5qJ0K12j56k2N06o97
2503b64L72L4k51j44M49k01k03L15K66l66K58k01k68L1J99k33J63J00q4NJ46O
2525A29k21K44j0j18r4L1J19k31L06l5k03O6L4k73K02R2l3RNQ9q8J60j29j36L01
$$ plain form
2550 216 -19 20 -189 -203 158 99 -20 20 -96 -49 348 21 -52 13 -38 -5 -186 99 -71 -30 105 -207 71
2573 71 -212 201 -37 44 154 -6 -42 -105 -146 -155 -15 8 -119 -102 143 104 -335 76 78 -93 -134 269 -172 270
2597 270 -79 96 46 90 130 142 -98 20 -22 -111 120 219 -76 -267 -349 -42 -340 -395 210 -237 -78 -331 -77
2620 -77 222 -80 -75 -41 44 -69 -76 78 47 76 194 -141 -46 251 342 75 24 71 -57 -90 -24 42 211 -211 -143 -397
2646 -397 -203 15 -39 -74 -45 -88 -114 68 -74 -31 -30 284 -140 245 -11 -61 9 7 222 -75 -62 222 68 166 -88
2671 -88 188 126 -84 2 0 -42 -142 -49 118 241 -120 -186 -288 -77 36 -119 -2 34 19 80 123 -202 165 66
2695 66 -279 -165 148 -210 -182 39 -17 141 -83 55 252 8 -51 101 -159 60 21 -254 -192 3 -27 -77 -125
2718 -125 -11 19 310 16 -197 14 154 -45 -33 201 -125 41 124 4 -94 21 17 -106 234 -134 -37 -154
$$ packed form
2550B16k35L9k09j4L61n9j19M0j16M7L97l27p3O5n1L3j81K85j70M1J35l12K78
2573G1k83M13k38Q1J10j60l6o3m1rJ40K3j27J7K45l9m39M11Kj71m1M03m41M42
2597B70l49J75n0M4M0J2k40J18m2q9K31R9k95j91q2L07k98n5O05m47J59k53K54
2620g7K99l02NL4Q5j13pJ54l1K9J18l35R5K97R1k67n1M7j28l3O6O6J69m22O8k54
2646c97J94K18n4l5K9m3k6J82j42M3JL14m24L85k56n0P0kK15k97J3K84j54R8k54
2671h8K76o2k10Q6km2j00R3J67J23l61o6j02K11J13j55J17L6j5O1M3l25L67r9
2695F6l45J14L13l58K8K21n6J58k24J38J97k44n9J52k60K19l9k75O2J95l0n0m8
2718a25J14L0K91k94k13K11J40j99J2K34l26J66Q3j20r8J15mj23L40l68R7j17
$$ plain form
2740 -154 215 -178 -219 103 -75 -24 217 10 -124 -129 58 -475 20 69 -53 -4 312 83 139 291 57 -4 355
2763 355 -154 -88 4 214 -17 129 209 72 -38 -157 231 -427 36 -105 137 -263 177 13 -226 -19 105
2784 105 -274 -135 6 -35 -51 1 -19 -301 339 271 -43 -166 84 -244 128 220 -27 -168 16 395 93 -210
2806 -210 -1 -320 -180 224 -45 -153 -72 7 -351 54 -68 -186 -207 505 225 -272 297 11 -192 -10 37
2827 37 -75 -258 299 193 -141 115 136 -68 73 285 -129 23 325 -254 -113 40 144 -489 296 -3 -401
2848 -401 301 57 -4 33 -38 136 -196 146 287 -356 102 293 -22 -8 180 -244 -76 144 97 -39 -110 80
2870 80 -112 -100 106 -115 -81 123 -58 -66 128 219 -6 60 281 -248 -36 96 -19 -232 199 -14 -193 83
2892 83 22 119 -70 283 -157 -164 205 -49 -138 259 89 -89 -14 242 -113 -216 26 227 -222 150 98 -11 195
$$ packed form
2740a54L69l93m1L22j78N1K41k07j34nJ87n33M95M9j22M9L16k29N6J52k34o1L59
2763C55n09O6R2K10k31J46Q0j37j10j19L88o58M63j41K42m00M40j64k39K07J24
2784A05l79J39J41m1j6N2k0k82O40o8l14j23K50l28L72R2k47j41J84L79l02l03
2806b10K09l19J40M04k69j08Q1P9l58M05j22j18k1P12k80m97N69k86k03J82M7
2827C7j12j83N57j06l34K56K1k04J41K12m14J52L02n79J41J53J04o33P85k99l98
2848d01P02k44o1L7p1J74l32L42J41o43M58J91l15J4J88m24J68K20m7j36p1J90
2870H0j92J2K06k21L4K04j81qJ94R1k25O6K21n29K12J32j15k13M31k13j79K76
2892H3o1R7j89L53m40pL69k54q9L97j70j78P5K56l55j03K42K01m49L72n2j09K06
$$ plain form
2915 195 187 -151 -31 111 -62 -95 202 217 -255 256 -16 -35 -147 338 39 -105 312 205 -466 177 -85 56
2937 56 47 134 -145 -54 203 282 -224 69 164 -154 -265 229 -260 -99 442 -21 -357 28 130 -289 -76 9 -19
2960 -19 150 232 135 -351 98 127 -171 18 -62 -401 -254 105 259 -55 39 -164 -271 171 191 -264 -182 303 -205
2983 -205 37 150 -79 53 169 258 77 -115 199 43 28 265 74 -68 252 14 -66 -132 193 115 -144 136
3005 136 -187 27 -92 -91 -224 -183 59 3 -103 145 -134 18 154 -84 -105 100 97 -286 -118 -67 -159 18 188
3028 188 -88 -125 -94 160 -102 -85 349 -46 127 143 -205 -90 -42 120 -412 -221 -279 -194 -29 197 -114 -117 -81
3051 -81 -84 11 31 70 -124 11 261 220 -285 5 -104 -131 45 113 -88 43 160 27 -183 11 -30 -37 -122 -272
3075 -272 -302 -15 75 -70 218 8 56 -117 45 210 74 -111 150 -273 54 -144 -112 -45 251 -66 -87 262
$$ packed form
2915A95ql38J20J42j73l3K97J5m72N11k72j9j12M85k99j44M17j07o71O43k62J41
2937E6rQ7k79R1K57P9n06K93R5l18j11M94m89J61N41m63l36L85J02m19K13Q5k8
2960a9J69Q2r7m86M49K9k98J89q0l39J47L59J54l14R4k03j07M42K0m55Q2M85n08
2983b05K42J13k29J32J16Q9j81j92L14j56j5K37j91j42L20k38q0o6L25p8k59K80
3005A36l23K14j19Jj33M1K42n6j06K48k79J52J36k38k1K05ll83J68N1r2J77J70
3028A88k76l7L1K54k62J7M34l95J73J6l48J15M8J62n32J91n8Q5J65K26l11lL6
3051h1lR5K0L9j94J35K50m1n05K90j09k7J76O8k01J31J17j33k10J94m1pq5j50
3075b72l0K87R0j45K88k10M8j73J62J65j36j85K61m23L27j98L2O7K96l17k1L49
$$ plain form
3097 262 60 -218 6 263 147 13 72 -263 -282 50 54 -245 -26 -23 -71 -143 127 54 3 -22 160 76 62 89 223
3122 223 330 -26 -75 196 143 -45 79 133 66 -260 10 15 -169 -110 28 -272 -34 122 -74 -154 169 -82 -38
3145 -38 139 91 -59 -261 -45 176 -38 220 120 -156 -139 112 153 -224 71 -128 -115 -247 -48 -277 -52 -22
3167 -22 80 47 181 -247 -153 320 15 84 2 83 -33 -68 -10 -91 -39 168 -13 -118 11 -19 -291 102 228 -170
3191 -170 -138 -143 9 -151 234 -34 -32 315 62 10 -101 -11 -83 8 -205 -27 -156 99 -63 -251 180 126 83 -442
3215 -442 -71 -121 153 117 -250 -154 -143 163 -384 122 -45 28 -42 45 -48 -31 -2 -149 47 -183 147 -150 -7
3238 -7 252 16 -212 211 52 -199 335 71 126 -15 146 -116 144 92 -38 -25 214 -64 -165 -105 16 -101
3260 -101 -84 118 -15 -102 153 13 -322 309 81 -55 -64 161 -154 -105 101 182 -168 167 -10 -163 122 348
$$ packed form
3097B62k02k78K24K57j16j34N9l35j9L32Mk99K19Lm8p2K70p3n1k5J82q4j4K7J34
3122B23J07l56m9K71n3j88J24N4o7l26K70Nj84N9J38l00K38J56j96q0L23k51M4
3145c8J77m8j50k02K16K21k14K58j00k76J7K51M1l77K95j99J3j32J99k29K25L0
3167b2J02l3J34m28R4M73l05O9q2Q1j16l5N8q1N2K07j81j05J29l0k72L93J26l98
3191a70L2nJ52j60L85k68KL47k53n2j11R0p2R1k13J78j29K55j62j88M31n4m3n25
3215d42L71n0K74l6l67R6J1L06n47N06j67P3p0Q7r3J7K9j47J96k30L30k97J43
3238gK59k36k28M23j59k51N34k64N5j41J61k62K60n2j30J3K39k78j01O0J21j17
3260a01J7K02j33q7K55j40l35O31k28j36rK25l15M9K06Q1l50L35j77j53K85K26
$$ plain form
3282 348 -41 -46 189 164 -179 107 -119 -175 18 16 76 -246 162 3 -82 -84 1 -225 234 -33 -240 -224 235 -206
3306 -206 -94 -57 122 -164 83 166 9 -2 119 4 100 177 -82 -280 261 95 -350 129 -102 -151 -156 -86 -58
3329 -58 -68 337 27 -108 22 -4 -347 -39 392 -89 -232 224 132 -87 185 74 -120 70 307 51 -198
3350 -198 133 -64 -104 18 23 -257 -205 29 -9 -319 151 228 -251 128 -77 -230 60 0 -245 -75 325 151
3372 151 -80 -20 -45 -63 176 107 -146 -105 330 -201 -12 93 -280 -232 2 10 -124 -249 17 50 -98 206 -105
3395 -105 -174 -103 61 -290 223 0 -240 106 112 102 41 302 96 -147 149 -108 -248 218 281 -137 92 177 193
3418 193 -135 -162 6 -88 199 77 -216 -234 184 -183 -123 86 105 -158 -101 157 69 131 -53 -16 -211 14 -7
3441 -7 -66 239 63 -313 -108 31 -157 -142 156 -224 -275 96 183 -136 -186 -89 -276 202 322 155 -255 19 173
$$ packed form
3282C48l89nK35k5l43K86k26n6J93kO0l22M08j59q5kQ5k26M59k67k07J6M59m41
3306b06J12L7J79k86K47Q3j57j1J21j15R6P7k59j98N41j66m45M79k31m9nP0K8
3329e8j0M05l10j35J30k6l43L08M31m81j43M56r2k19K72j11j94J90K37k56k49
3350a98L31j97m0J22Nk80N2K34l8l10M70P7m79L79k05j53K90o0k45J70M00j74
3372A51k31O0k5j8K39o9k53M1M35n31J89J05l73M8K34Qj34j25K66L3j48L04l11
3395a05o9P1J64l51N13k23k40L46Oj0o1K61k06k43K96k57j40M66O3m18K29Q5J6
3418A93l28k7J68r4K87j22k93j8M18l67O0K09J9k63N7K58q8O2j84L7j95K25k1
3441gn9L05j76l76K05J39j88J5K98l80n1L71Q7l19n0R7j87M78J20j67m10K74J54
$$ plain form
3464 173 87 -128 190 -246 -76 -26 -230 -146 287 139 -57 -2 178 96 -176 262 88 -252 -16 210 -279 79
3486 79 -92 -75 -199 -6 99 -293 269 -62 27 -61 -38 3 159 280 81 -120 139 -102 -425 -75 184 -60
3508 -60 -120 281 -10 3 300 221 -103 190 17 -131 22 12 -243 -293 121 -171 -68 173 210 -206 18 143
3530 143 -13 -250 -79 -127 -22 163 14 19 139 351 -2 199 70 57 -193 120 -140 -134 72 -166 154 -209
3552 -209 130 -379 -195 365 -212 162 -13 -116 103 -78 200 -225 9 4 79 -80 347 -27 -119 151 -45
3573 -45 42 -75 -67 209 12 227 14 -244 43 -3 -259 -93 72 -139 82 -134 -198 -5 13 88 3 -60 29 -95
3597 -95 7 220 -73 -120 75 -53 -232 105 83 -172 82 439 -167 330 108 -14 -37 4 283 -13 -91 41
3619 41 -218 16 148 31 -180 11 20 -373 -84 79 -30 -184 -1 245 -81 183 27 -387 9 257 -305
$$ packed form
3464A73q6k15L18m36J70N0k04Q4M33j48j96N5J80q2k72M38j74l40K36K26m89L58
3486G9j71J7j24J93J05l92N62l31Q9q8K3M1J56J21j99k01K59k41l23L50K59k44
3508f0o0M01k91J3K97p9l24K93j73j48J53j0k55n0M14k92J03K41L7m16K24J25
3530A43j56k37J71m8J05J85j49NJ20K12l53K01j29j3k50L13k60OK06k38L20l63
3552b09L39n09J84N60n77L74j75j03K19j81K78m25K34nP5j59M27l74r2K70j96
3573d5Q7j17QK76j97K15k13k58K87m6k56J66J65k11K21k16o4J93J8P5q5o3Q9j24
3597i5J02K13k93m7J95j28j79L37k2k55K54L57o06M97k22j22k3M1K79k96p8J32
3619D1k59K34J32j17k11J91Rl93K89J63j09j54J83K46l26K64j56m14L96K48n62
$$ plain form
3640 -305 -92 256 -29 -44 -193 -27 -234 -126 276 -243 -161 -43 -98 13 57 37 -192 -34 -108 12 63 -76
3662 -76 5 -330 -46 87 -346 135 119 83 -28 103 0 -53 120 -56 -43 127 -24 -152 -34 -48 20 -157 111
3685 111 -38 -216 27 -101 106 250 -155 86 -127 169 -87 -60 153 -192 -151 221 91 -206 -106 62 -86
3706 -86 -9 94 53 -109 171 -157 -156 -47 144 -165 67 40 -172 -123 -107 103 -375 -47 214 101 63 54 68 68 119
3731 119 -110 70 -212 258 -91 69 -168 22 136 92 -72 154 -25 81 25 9 -26 -446 113 155 -8 -123
3753 -123 130 42 -228 84 87 -268 21 -60 109 -79 70 -110 -190 157 188 -9 -53 -104 -139 26 161 181 -245
3776 -245 130 1 -94 -208 61 131 -80 -21 -280 -113 42 -162 -21 43 237 9 -25 204 55 73 175 -288
3798 -288 8 -65 -17 -62 269 -14 -104 -46 -41 -37 -145 53 -12 -53 274 80 -122 69 111 -104 33 240 -34 74
$$ packed form
3640c05K13L48k85j5j49J66k07J08M02n19Q2J18n5J11M4k0k29J58p4J20N1j39
3662g6Q1l35K84J33m33M81j6l6j11J31j03n3J73j76J3J70j51j28J18j4O8j77K68
3685A11j49j78K43j28K07J44m05K41k13K96k56K7K13l45M1L72j30k97J00J68j48
3706h6P7J03m1j62K80l28JJ09J91l09K32k7k12M9J6K10m78L28K61j13l8rJ4%N1
3731A19k29J80k82M70l49J60k37J90J14m4j64K26j79J06n6j6l5m20N59M2j63j15
3753a23K53q8k70L12Ll55K89q1J69j88J49j80q0L47L1j97m4n1l5J65J35K0m26
3776b45L75j29r5j14K69P0k11N9k59J67J55k04J41O4J94k28l4K29j49J8J02m63
3798b88K96p3M8m5L31k83r0N8NMj08J98o5m1L27j94k02J91M2k15J37K07k74J08
$$ plain form
3822 74 105 -163 13 2 141 75 -161 238 216 41 220 43 -268 19 94 -63 -106 22 19 154 -91 -100 -263 33
3846 33 220 -119 -242 216 89 -64 179 -91 -197 -83 239 -145 -87 49 33 -106 129 0 -43 -37 54 64 -140
3869 -140 -9 -114 -132 65 -7 -85 -174 53 -351 -107 -98 -30 -45 -21 200 265 30 129 34 68 -97 3 207 124 87
3894 87 -26 35 197 24 20 -22 -104 6 -68 -166 -188 56 44 119 40 -82 68 -121 268 -92 40 106 138 -143 54
3919 54 -203 -163 192 -35 -69 -27 222 197 4 205 -58 -23 30 -77 56 -251 28 -125 28 2 -33 -67 70
3942 70 88 -57 75 -144 -21 -73 -38 12 -306 -138 -47 -189 60 -32 187 -133 85 108 -72 137 -208 -49 4
3965 4 -135 43 124 28 -66 -16 -84 -82 -54 83 87 -129 -35 -87 92 -42 136 20 66 163 -13 -196 86 119 -103 146
3991 146 -39 2 -52 204 -283 -59 -312 220 48 -81 -3 44 97 -61 -84 0 54 50 -386 -100 -36 87 124 36
$$ packed form
3822G4L1k68J76j1J39o6k36L99k2j75J79j77l11K87P5j57m3J28lJ35k45rj63K96
3846C3J87l39j23M58j27j53K43k70j06J14L22l84N8J36j6j39K35j29m3OR1J0k04
3869a40J31j05j8J97p2p8q9K27m04K44RO8j5K4K21O5k35R9r5L4j65J00K04q3l7
3894H7j13O1J62j73mm2q2J10p4r8k2K44j2P5p9j22J50j89L89l60J32O6L2k81J97
3919E4k57M0L55k27l4M2K49k5j93K01k63L5N3j07J33l07K79j53J53k6l5l4J37
3942G0J8j45J32k19J23n2L5N0l18J68R1j42K49r2K19l20K18K3j80K09l45J59N3
3965Dj39J78Q1r6r4N0o8KK8J37Mk16R4n2J79j34J78j16M6R7j76j83K82L3k22K49
3991A46j85M1n4K56m87K24k53N32j72j29P8M7N3j58k3Q4N4mm36K86O4J23L7q8
$$ plain form
4015 36 50 -4 146 -127 -76 -19 146 -65 41 67 92 179 124 -182 -155 79 -139 -7 -151 37 244 -110 -124 -26
4039 -26 -32 -53 227 -49 236 -172 4 346 113 148 -150 145 36 -319 -1 -203 -54 -144 14 242 -31 133
4061 133 -141 23 272 37 180 -37 -35 51 202 108 -239 -189 206 224 -39 87 -33 31 -55 -169 -13 -26 191
4084 191 -108 -14 231 -103 -145 130 230 -69 -139 24 -255 -151 -88 172 -73 -22 33 75 94 38 -168 166 -110
4107 -110 -229 112 -24 37 -345 -280 3 -16 130 -160 90 105 52 45 -114 125 29 -145 170 86 265 -41 -26
4130 -26 -35 -58 161 -66 -26 59 160 -237 13 325 -146 86 101 -36 -60 43 225 -152 237 -30 -214 -204 35
4153 35 -161 -28 55 47 -92 65 -42 -7 65 81 62 79 71 -73 -24 205 27 -11 -11 24 58 -39 106 -191 33 227
4179 227 44 -132 115 -107 -539 -60 -131 -12 27 -133 327 41 -187 281 -147 -128 85 135 -3 281 384
$$ packed form
4015C6J4n4J50k73N1N7J65k11J06K6K5Q7n5l06K7K34k18J32j44J88K07l54j4R8
4039b6ok1K80k76K85m08J76L42k33L5k98K95j09l55L18k02J49r0J58K28k73J64
4061A33k74J64K49k35J43k17KQ6J51r4l47N0L95J8k63J26j20O4q6j14J56j3K17
4084A91k99R4K45l34m2K75J00k99p0J63k79J04O3K60k45N1N5M2J9n6k06L34k76
4107a10j19L41j36O1l82O5K83j9J46k90K50J5n3pj59K39r6j74L15q4J79l06J5
4130b6rk3K19k27M0Q5J01l97K50L12m71K32J5j37k4J03J82l77L89k67j84J0K39
4153C5j96J33Q3qj39J57j07L5P2J6j9J7qj44M9K29j78l8%L5L4r7J45k97K24J94
4179B27j83j76K47k22m32M79p1J19L9j60M60k86k28M68m28J9K13N0j38K84J03
$$ plain form
4200 384 18 133 195 6 211 4 -225 -35 38 -77 7 154 237 -112 -70 136 4 -78 -2 25 -28 10 260
4223 260 -150 171 -137 -47 -200 -241 175 -57 -89 -43 -346 421 -54 -51 -155 -20 -223 12 -52 -2 -83 -176 12
4246 12 -92 -167 191 -536 -141 -15 -123 -31 21 25 -192 104 -294 -79 -22 -24 14 -48 11 94 -157 -164 -94 28 16 83
4272 83 -103 -22 217 0 13 -36 -111 14 115 32 149 66 -245 54 71 -135 32 -129 -56 -189 -85 -34 -15 -48
4296 -48 190 260 -300 139 35 -135 65 73 185 87 45 80 61 -205 199 267 229 -69 -23 92 32 56 58 -159 -5
4321 -5 82 -70 172 211 -407 -19 10 -50 -6 -155 -13 -273 -77 -38 -12 96 5 -128 18 65 -172 -186 85 146
4345 146 -206 -33 120 -286 56 -74 -166 -217 -260 27 -103 36 104 -285 301 182 43 -116 40 -108 -34 -101
4367 -101 168 -57 -121 134 -84 16 113 -67 -55 45 -18 236 44 90 -263 249 -114 -119 -260 170 122 -170 -58
$$ packed form
4200C84l66J15O2j89K05k07k29J90P3j15Q4J47Q3l49M2K06j32q2P6K7n3L8K50
4223B60m10L21l08R0j53m1M16k32l2M6l03P67m75Lj04J35k03K35o4N0q1r3J88
4246A2j04p5L58p27L95J26j08R2N2Mk17K96l98K15N7kL8o2N9Q3k51pP0J22j2O7
4272H3j86Q1K39k17J3m9p5J25J01q3J17q3l11K99J7k06J67j61P3j33J04N1J9l3
4296d8K38P0n60M39j04j70K00QJ12r8m2L5j9k66M04O8l8k98M6J15o0K4Kk17J54
4321eQ7j52K42L9o18L88K9o0M4j49J42k60J96L9K6J08r1j33J46M7k37j4K71O1
4345A46l52J73J53m06L42j30r2n1m3K87j30J39O8l89N86j19j39j59J56j48P4o7
4367a01K69k25o4K55k18J00R7j80J2J00o3K54j92M6l53N12l63nj41M30m8k92J12
$$ plain form
4390 -58 91 51 155 -3 -121 -29 35 -89 -93 397 6 8 10 -216 -72 -201 -58 -222 -51 223 12 -10 -40 212
4414 212 47 -160 325 49 -139 -53 65 -24 290 -105 -91 179 -199 -25 -122 -41 -8 -201 46 402 -142 99
4436 99 216 132 -134 -361 -47 70 101 151 -234 31 -153 -168 179 123 256 -34 248 81 -219 29 -172 4
4458 4 -26 278 -148 -286 58 -109 -80 -27 -32 -254 230 87 -298 307 201 74 -73 93 -24 96 209 111 -68
4481 -68 12 -39 2 -128 58 14 -33 240 122 -232 147 69 -26 -46 -9 3 -232 -32 -80 -24 65 212 236 41 45 -222
4507 -222 -396 -5 187 -7 51 118 -138 5 163 -37 -145 17 228 -101 -67 97 -102 -94 185 76 -284 236
4529 236 -40 -261 -68 28 -106 353 164 52 -3 108 -113 158 -87 -39 -232 101 226 -5 108 78 -96
4550 -96 -126 -75 10 173 198 -36 -108 95 79 -19 -152 274 -129 -245 78 1 -113 -387 205 -111 41 54 -128
$$ packed form
4390e8J49m0J04j58j18R2O4j24mM90l91KKk26J44j29J43j64J71K74k11k2l0K52
4414B12j65k07M85k76j88Q6J18q9L14l95J4K70l78J74r7Q1L3j93K47L56n44K41
4436I9J17q4k66k27L14J17L1N0l85K65j84j5L47n6J33k90K82j67l00K48k01J76
4458Dl0L04m26j38L44j67K9N3nk22M84j43l85O05j06j27j47J66j17J20J13r8j79
4481f8Q0n1M1j30J86m4m7K73j18l54L79p8r5k0L7J2k35K00m8N6Q9J47K4j95Mk67
4507b22j74L91J92j94N8O7k56J43J58k00j08J62K11l29L4J64j99QK79j09l60N20
4529B36k76k21J93R6j34M59j89j12n5J11k21K71k45M8j93L33J25k31J13l0j74
4550i6l0N1Q5J63K5k34p2K03j6r8j33M26m03j16L23p7j14k74N92l16J52J3j82
$$ plain form
4573 -128 57 -76 131 -286 62 181 -203 -41 63 96 -80 134 89 155 114 6 76 103 126 91 -50 130 162
4596 162 -246 55 71 -193 -87 76 -23 177 301 -103 -189 106 24 44 -4 235 3 60 89 145 -39 -41 61 -65
4620 -65 162 46 -229 -185 42 -94 108 128 -1 -312 185 247 -171 19 -1 -149 95 -206 145 -128 -142 186
4642 186 -209 79 84 99 102 -36 -48 -319 17 -196 -168 -121 185 14 -27 -178 -66 -58 106 -30 -318 -5 -64 2
4666 2 175 278 -31 -220 -176 40 -35 38 324 54 205 111 -46 50 56 -128 -127 83 -78 139 -432 -146 -130 -254
4690 -254 143 -229 47 426 -194 -26 -34 155 -157 52 145 129 74 46 -167 -148 -7 98 94 192 130 -56 -159 141
4714 141 291 -266 -112 152 -334 -7 44 10 -7 -80 -154 -200 -199 -30 108 -30 -115 -220 -129 -112 -77 -83 83 151 -10
4739 -10 10 55 11 225 212 -90 63 107 120 -203 237 157 167 -274 -14 21 -2 228 -53 20 -18 -154 -122 238 -43
$$ packed form
4573a28J85j33K07m17L48J19l84J62J04L3j76K14m5O6m1j08P0K7K3l5j41J80L2
4596A62m08L01J6k64J06J63r9K00J24m04q6K95q2K0m8K39k32N7K9N6j84kJ02j26
4620f5K27j16k75M4K27j36K02K0j29l11M97O2m18J90k0j48K44l01L51k73j4L28
4642A86l95K88NJ5Lj38j2k71L36k13K8M7L06j71m1j51J12QJ64j36k88L13n9O6
4666BJ73J03l09j89M4K16p5P3K86k70J51r4j57R6Oj84JK10j61K17n71K86J6j24
4690b54L97l72K76L79o20J68qJ89l12K09R3j6n5k8k13J9J41J05mR8o2j86j03L00
4714A41J50n57J54K64m86L27N1l4j7p3p4m6JJ69J38j38q5j05R1J7L5oJ66O8j61
4739a0K0M5m4K14j3l02J53M4J3l23M40q0J0m41K60L5k3K30k81P3l8j36L2L60k81
$$ plain form
4764 -43 88 -11 -11 -6 -197 158 479 -240 100 -90 -90 -213 -54 -193 -322 -224 135 -126 297 -193 -484 -160 178
4787 178 -136 246 85 185 -110 85 -8 20 81 88 -75 -179 138 -277 -27 -127 130 -67 77 -268 -160 -277
4809 -277 -136 -477 111 375 -129 -99 65 -108 56 -49 28 82 -181 51 97 -140 -22 39 142 3 130 18
4831 18 19 163 -118 73 148 7 -117 214 -45 -8 4 3 -345 -10 63 -148 -100 -243 219 -71 183 143 209 63
4855 63 133 119 59 -91 -276 220 -114 97 -102 -176 130 -142 23 -40 47 -144 53 138 -239 73 -128 -271 -192
4878 -192 144 18 -191 37 -23 -6 34 -50 116 34 80 105 110 62 107 115 57 -17 -159 37 106 27 -362 -125 -204 -123
4904 -123 -244 -197 191 -226 102 -45 66 131 -98 27 -110 137 -41 184 78 -40 74 -8 -136 -18 210
4925 210 131 -193 -111 63 -320 91 16 -142 104 224 -303 50 73 201 -45 12 -56 -81 -178 -26 166 114 -143
$$ packed form
4764d3J31r9%Nj91L55L21p19L40j90%j23J59j39j29R8L59k61M23m90k91L24L38
4787A78l14L82j61J00k95J95r3K8O1Pj63j04L17m15K50j00K57j97J44l45J08j17
4809b77J41l41N88K64n04L0J64j73J64j05P7N4k63K32M6k37J18O1J03j39J27j12
4831A8JJ44k81J91P5j41j24L31k59L7J2jl48L35P3k11M8j43M62k90K54m0O6j46
4855F3P0j4o0j50j85M96l34K11j99p4L06k72J65o3Q7j91J97Q5l77L12k01j43P9
4878a92L36j26k09K28o0J7M0q4J66q2M6K5Nm8M5Qn8p4j42J96O9p9l89K37p9Q1
4904a23j21M7L88m17L28j47J11O5k29J25j37K47j78K25j06j18J14q2j28J18K28
4925B10p9l24Q2J74l83M11p5j58K46J20n27L53K3J28k46N7o8k5r7J52J92n2k57
$$ plain form
4948 -143 288 -38 -5 -54 493 79 -40 -95 -19 -11 -207 50 190 -159 75 -167 -101 -62 -156 424 66 -69 -67 -8
4972 -8 -50 -158 -47 62 -129 48 -152 206 99 110 0 -182 -102 -132 175 -98 121 -6 -83 -242 -72 -27 6
4995 6 -27 112 -244 -310 -105 -225 -203 -208 -76 350 22 166 -126 -43 -56 18 -24 -164 384 -154 303 34 -130 -92
5019 -92 -200 93 -269 -181 -415 -174 143 -2 -246 -301 -72 350 -11 -64 -50 -268 -62 -84 -8 -180 288 -245
5041 -245 -51 153 65 165 -17 33 -78 -165 -182 -217 -5 -194 -282 77 -110 279 -30 -80 -79 -262 46 -18 -29 161
5065 161 -50 -123 -117 27 -61 195 -376 150 132 46 -244 23 78 -57 -45 -28 -52 212 98 -157 181 -93 77
5088 77 -27 118 96 41 92 227 -260 41 157 -185 181 333 -105 171 87 35 311 -74 48 80 -358 5
5110 5 -217 84 141 -375 29 46 -129 83 -282 422 18 49 63 12 146 37 43 -14 -93 100 4 117 218 11
$$ packed form
4948a43M31l26L3m9N47m14j19n5P6Qj96K57J40l49K34k42O6L9r4N80l58j35KN9
4972hm2j08J11J09j91J77k00L58j07J1j10j82Q0l0L07k73K19j27p7j59J70M5L3
4995Fl3J39l56o6K05j20K2nJ32M26l28J44k92Q3j3P4m2j40N48n38M57k69j64L8
5019i2j08K93l62Q8k34K41L17j45k44n5K29M22l61n3J4k18K06k2P6j72M68n33
5041b45J94K04q8J00j82N0j11q7j7l5K12j89q8L59j87L89l09n0Jj83L08o4j1J90
5065A61k11p3OJ44q8K56n71N26j8q6k90K67N5j35J2J7k4K64j14k55L38k74J70
5088G7j04J45k2n5N1J35m87L01J16l42L66J52m38K76q4n2K76l85J22L2m38L63
5110Ek22L01N7n16M04J7j75K12l65P04m04L1J4n1J34j09On7p9J93r6J13J01k07
$$ plain form
5134 11 380 -77 42 -167 38 116 33 35 50 -77 -125 -75 72 -170 -275 -397 -115 -3 -183 -129 14 -106 -57
5157 -57 35 -152 9 -97 -2 4 -117 84 168 263 174 406 195 358 -38 367 -95 143 9 20 58 -126 -83 191
5181 191 59 -50 -58 -60 -155 -312 186 55 92 -8 -190 303 -36 181 -110 221 70 -57 147 16 120 65
5203 65 109 -164 118 -79 83 137 -409 134 95 -216 -280 257 52 245 -95 -244 29 -153 -29 -12 -203 -13
5225 -13 -110 -251 46 -66 110 25 -117 -186 -25 -123 -24 -9 157 -107 -13 165 144 -183 240 -129 -203 42 -56 -15
5249 -15 -245 148 219 -104 -133 147 60 -34 -26 -49 -119 153 113 -33 219 282 3 -60 -196 -113 -88 -242 100 18 36
5274 36 108 103 -24 37 1 159 -30 -99 77 -101 86 170 262 -69 -135 -60 106 158 -45 -100 45 -11 -86 76 -61
5299 -61 -191 8 57 -296 132 -88 147 -89 -8 117 186 285 -64 75 -131 7 -18 -137 138 280 -35 73
$$ packed form
5134A1L69m57J19k09K05P8q3KJ5j27m8N0J47k42j05j22K82J12j80N4J43j20M9
5157e7R2j87J61j06R5Oj21K01Q4R5q9K32k11J63l96M05m62K38j34J1L8j84M3K74
5181A91j32j09qkr5j57M98j31L7j00j82M93l39K17k91L31j51j27K04j31J04n5
5203F5M4k73K82j97J62N4n46N43l9l11o4N37k05J93l40j49K73j82J24J7j91J90
5225a3r7j41K97j12J76q5j42o9J61r8R9J5J66k64R4J78k1l27M23l69p4K45r8M1
5249a5k30L93P1l23k9K80q7r4Qk3p0K72m0j46K52O3k79o3j36Q3K5j54L42q2J8
5274C6P2nj27O1l6J58j89o9J76j78J87Q4R2l31o6P5J66N2k03n5J45n6p5J62j37
5299f1j30J99M9l53M28k20K35k36Q1J25O9R9l49J39k06J38k5j19K75J42l15J08
$$ plain form
5321 73 74 286 -144 -29 -27 212 -89 138 25 86 -12 31 103 315 -26 -121 -87 -45 177 94 -29 53 361 269 59
5346 59 -49 38 235 15 -16 -12 124 -234 213 168 248 -10 -166 70 315 50 -37 -160 -280 -211 120 48 20 -5
5370 -5 148 -172 -156 -85 14 192 -211 122 -105 -53 146 185 -62 97 -9 108 -33 -123 -82 99 57 105 68 -66
5394 -66 -175 148 -88 94 78 -70 -58 -89 9 -50 22 57 -113 22 -289 221 86 -97 288 -41 79 -57 325
5417 325 76 62 -91 -55 -92 -121 24 191 -26 248 15 68 64 -90 188 210 215 97 85 88 -154 -145 48 185 151
5442 151 -52 -221 -97 120 -62 41 -52 154 273 77 41 402 -258 -208 32 -65 114 55 -120 52 5 -80
5464 -80 -35 -59 110 249 -63 59 1 -260 -63 -36 -104 223 63 69 -65 108 136 -77 -158 -52 -160 31 90 51
5488 51 142 304 -105 -115 -20 -255 -140 194 159 -247 30 32 65 46 -76 -119 -298 160 119 -113 122 262 8 360
$$ packed form
5321G3JK12m30J15KK39l01K27j13O1r8M3P2K12l41r5L4M2K22q3j23Q2L08r2k10
5346E9j08Q7J97k20l1MJ36l58M47m5Q0k58j56K36K45k65q7j23j20O9L31p2k8k5
5370eJ53l20J6P1R9J78m03L33k27N2J99L9k47J59j06J17j41r0M1J81m2M8l7j34
5394f6j09L23k36J82j6j48J2l1R8n9P2L5j70J35l11N10j35j83L85l29J20j36L82
5417C25k49j4j53L6l7k9J45J67k17K74k33N3mj54K78K2Nj18j2Lk42RJ93J37l4
5442A51k03j69J24K17j82J03r3K06J19j96l6L61o60N0K40r7J79n9j75J72m7q5
5464h0M5k4J69J39l12J22n8k61J97K7o8L27j60Oj34J73K8k13q1J06j08J91N9l9
5488E1R1J62m09j0R5k35J15L34l5m06K77KL3j9j22m3j79M58m1k32K35J40k54L52
$$ plain form
5512 360 199 -76 134 -3 123 53 -70 150 -73 219 76 93 -156 57 -171 -160 -159 69 164 67 -68 -152 2
5535 2 53 -83 -137 187 -309 8 133 -105 118 -40 93 -20 -22 187 -84 -217 9 -139 -186 -158 50 82 -70
5558 -70 -297 57 -78 -97 -45 99 -35 18 -263 48 -11 21 -101 -115 -150 -83 293 160 50 43 175 -109 -156 -114
5582 -114 -214 -149 192 -179 4 -95 43 -328 67 -206 -148 -270 115 141 -168 184 149 -368 154 -79 -48 -86
5604 -86 30 173 -5 334 -63 -158 11 147 -176 -112 42 80 -11 -106 -11 -28 143 -262 246 168 48 -39 1 -11
5628 -11 -45 -282 23 -229 -65 -32 -25 -6 -256 -116 -234 -215 148 96 35 -186 -225 192 -23 15 65 56 93 64 -234
5653 -234 -230 -248 1 -199 99 100 -7 -9 -13 -230 -346 -16 -74 98 265 -69 -170 73 -43 44 228 -86 269 -53
5677 -53 72 9 -157 20 72 47 -150 125 -51 0 39 39 -24 127 -105 -285 -148 141 3 -161 23 -47 171
$$ packed form
5512C60j61k75K10j37J26p0j23K20k23K92j43J7k49K13k28J1JK28R5r7j35q4J54
5535BN1j36n4L24m96L17J25k38K23j58J33j13kK09k71j33K26j48m7K8K08L2j52
5558g0k27L54j35j9N2J44j34N3k81L11n9L2j22j4l5O7L76j33j10pJ32k84m7M2
5582a14j00O5L41l71J83r9J38l71L95k73N8j22L85K6l09L52l5n17N22k33L1l8
5604h6J16J43j78L39l97r5J69J36l23O4J54L8r1r5R5j7J71m05N08p8j20q7M0j2
5628a1l4k37L05k52J64L3PJ9k50J40j18J9L63n2o1k21l9M17k15L8N0rL7k9k98
5653b34Mj8K49k00K98Jj07kmk17j16L30n8J72J67l34j01K43j16Q7J84l14L55l22
5677e3J25o3j66J77N2k5j97K75j76N1L9%o3J51k32j80J37K89j38j64J84p0K18
$$ plain form
5700 171 24 118 -62 -19 36 85 115 95 156 177 163 -162 -148 -80 -182 98 7 -119 -22 4 248 -243 -180 176 -389
5725 -389 178 123 142 -115 -21 32 -302 69 -124 62 -122 17 -22 -144 278 -16 -69 -84 0 -118 -35 133 27
5748 27 -65 216 177 94 13 238 -13 -9 26 -50 19 13 44 35 45 77 -93 102 270 -233 -89 -172 -102 23 132 34 -138
5775 -138 -34 -158 -168 102 -96 59 -70 53 279 -4 17 -19 165 -161 47 -148 -239 25 33 -37 103 162 -35
5798 -35 72 -127 46 10 -18 -64 1 103 86 197 -169 -21 131 -52 12 0 -73 161 87 -88 327 -137 -1
5821 -1 -115 57 -40 -83 -70 72 -142 373 -323 -323 2 160 43 100 -48 -197 6 -64 204 -179 -19 57 -317
5844 -317 -271 -51 25 147 -58 -44 138 97 7 -70 91 115 93 -26 -84 176 -213 -154 181 -184 -38 -107 36 -106
5868 -106 -42 40 -211 199 -145 -45 76 73 281 -151 84 -1 -102 145 -41 -81 131 -45 92 11 -55 123 -225
$$ packed form
5700A71j47R4j80M3N5M9L0k0O1K1j4l25J4O8j02K80r1j26R7K6K44m91O3L56n65
5725c89N67n5J9k57R4N3l34L71j93J86j84J39l9j22M22k94n3j5Q4j18Q3J68j06
5748B7r2K81l9q3q1K25k51ML5p6O9oL1rJ0L2j70J95J68n03J44q3P0J25J09r8j72
5775a38J04j24j0K70j98J55j29J23K26k83K1l6J84l26K08j95r1K64Qp0J40N9j97
5798c5J07j99J73l6k8m6O5J02j7J11l66J48J52j83O4j2p3K34p4j75M15m64J36
5821aj14J72r7m3J3J42k14N15o96%L25J58j17N7j48j49K03p0K68l83J60P6l74
5844c17M6K20P6J22k05J4J82m1r0p7J61K4k2j19n8K60l89N9L35l65J46o9J43j42
5868a06O4Q2k51M10l44J00J21lK08m32K35q5j01K47j86m0K12j76J37q1o6J78l48
$$ plain form
5891 -225 210 183 -154 -83 -31 -58 -39 20 188 -112 113 260 118 -70 104 -10 -40 21 -98 -74 116 -267 118
5914 118 268 272 7 -18 146 220 25 86 -9 -113 184 -72 -17 2 -61 -165 -289 -49 -36 -21 380 -151 89 109
5938 109 114 165 -5 45 -12 32 -8 140 -148 123 -93 -20 100 176 -101 101 134 -84 21 -110 112 119 141 -86
5962 -86 -80 -48 45 60 -161 174 90 -88 90 -35 -61 -8 279 -117 -36 147 -181 -58 -115 246 -23 0 37 196
5986 196 18 20 -55 171 6 -1 -123 -11 213 219 -21 -179 -209 -401 -20 47 110 246 118 41 -149 -100 -81 67
6010 67 -23 -84 -177 -26 -132 -14 24 -167 160 -304 129 102 85 141 -136 -14 -72 15 54 20 99 5 -68 181 -121
6035 -121 94 -43 134 -6 49 186 -157 74 2 -84 -178 -124 56 299 -236 68 -29 -373 160 59 -96 3
6057 3 -3 56 -312 -32 224 59 18 136 -234 23 -18 -25 -267 -226 -118 109 179 74 61 -76 -141 -141 260 -118 -10
$$ packed form
5891b25M35k7l37P1N2k7J9N9J68l00K25J47j42j88J74j14l0O1j19K4J90l83L85
5914A18J50Mk65k5J64P4j95O1r5j04K97k56N5J9o3j04j24K40J3J5M01n31K40K0
5938A09NN1j70N0n7M4m0J48k88K71k16P3J20P6k77K02L3k18J05j31K22PK2k27
5962h6OL2R3J5k21L35q4j78J78j25k6N3K87l96Q1J83l28J23n7L61k69K3L7J59
5986A96j78Kp5K26j65pj22J12K24Ok40j58l0j92L81O7O3J36j28p7j90M9J9J48
6010F7r0o1r3J51j06J18L8j91L27m64M33k7j7N6k77J22n8Q7L9l4P9r4p3K49l02
6035a21K15j37J77j40N5J37l43K31p2q6r4N4J80K43n35L04r7l44N33j01j55R9
6057CoN9l68K80K56j65m1J18l70K57m1pk42M1J08K27P0j05j3j37o5%M01l78J08
$$ plain form
6082 -10 169 234 69 -63 175 241 83 96 226 -48 -12 41 101 11 125 50 -173 106 -64 -69 -3 103 49 -88
6106 -88 -176 -227 -128 -16 -75 -32 -3 -103 -50 -57 96 -123 -169 -9 158 216 -155 31 72 114 -131 -121 47 -43 24 117
6132 117 -89 230 -115 -109 -93 -40 185 191 205 149 -118 98 148 58 -94 94 -13 66 113 -281 248 46 -44 -13 25
6157 25 -64 -143 -239 45 204 124 63 -227 -77 -80 11 -116 -124 -58 64 -78 -30 131 321 -159 -381 57 -58 208
6181 208 -177 -49 -16 145 96 -46 -141 149 135 -40 279 53 -97 -44 251 -20 -11 77 186 115 -30 123 65
6204 65 124 -81 54 55 -291 20 -120 50 -36 113 102 42 45 -150 -88 57 53 25 216 -179 242 257 259 183 143 -22
6230 -22 339 -22 144 -191 -16 278 24 240 -144 -80 -153 -92 37 -65 -110 236 42 -119 -32 6 119 -210
6252 -210 68 167 39 -174 27 -236 135 -142 -168 -187 -89 144 206 14 224 46 202 -51 270 -42 197 66
$$ packed form
6082a0J79O5j65j32K38O6j58J3J30k74L6N3O0r0J14p5k23K79j70nO6J06n4j37
6106h8q8n1R9J12n9M3K9j00N3pJ53k19m6J60J67N8l71J86M1M2k45J0J68r0O7R3
6132A17k06L19l45OJ6N3K25OJ4n6k67K16N0r0j52J88j07P9M7l94N29k02r0L1L8
6157B5q9p9r6K84J59q0o1k90J50lR1j27qO6J22j42M8J61J90m80k22M38j15K66
6181B08l85J28L3J61m9j42r5K90j4j75L19k26j50N3K95k71RQ8J09p1j45J53n8
6204F5N9k05J35Jl46L11j40J70q6J49j1o0Lj95O2J45mk8J91l95M21J5Kp6m0j65
6230b2L61l61J66l35J75K94k54K16l84O4p3O1J29j02m5L46j94j61Q7L8J13l29
6252b10K78R9j28k13K01k63L71k77k6j9R8K33O2j92K10j78J56k53L21l12K39j31
$$ plain form
6274 66 -129 15 -39 96 -14 220 153 -27 56 39 -95 7 182 -39 190 -269 -241 87 115 -87 70 5 -39
6297 -39 117 -246 -21 -93 104 4 -17 -124 -237 164 -95 179 -86 -120 -146 98 102 94 -119 175 -179 192 207
6320 207 -107 115 -16 264 83 168 -33 128 95 -5 -54 -94 -98 156 -24 228 159 136 -25 -26 6 -311 9 75
6344 75 15 110 -153 78 -68 -179 -190 40 -170 1 80 27 10 -145 -29 -149 2 16 -170 95 113 123 -51
6367 -51 57 -54 4 18 -54 6 -56 -250 76 29 -166 26 122 -68 65 8 -58 -36 256 79 29 42 191 -81
6391 -81 -19 247 -35 -194 6 -293 -24 47 -175 -19 -46 -72 45 -124 131 8 -131 275 -169 -7 324 185
6413 185 -40 94 182 109 35 30 -42 -203 142 -127 198 283 209 -95 52 38 31 63 -50 19 -159 -29 24 227 6
6438 6 125 -34 31 -71 155 6 -13 199 211 100 -80 47 -55 -58 -29 -31 -19 103 7 138 16 155 185 122 19
$$ packed form
6274F6j95J44n4J35j10K34o7j80Q3j7j34J02J75k21K29m59K8L28K8k02J57o5m4
6297c9J56l63K25p2J97j00k1j07j13M01k59K74k65l4k6K44Mqk13K94l54L71J5
6320B07l14K22j31K80j81Q5k01J61l3j00m9m0mK54j80K52o9k3j61jL2l17L20O6
6344G5o0R5k63K31j46j11j1K30k10J71P9n3j7j55J16j20J51J4j86K65J8J0j74
6367e1J08j11N8J4p2O0o2j94L26m7j95J92R6j90J33n7o6K2K92j77n0J3J49k72
6391h1O2K66k82j59K00k99K69P1k22J56k7k6J17j69K55j23j39M06m44J62L31j39
6413A85k25J34Q8p3p4np2j61L45k69L25Q5p4l04J47j4pL2j13O9j78J30N3K03k21
6438FJ19j59O5j02K26j49j9K12J2j11j80J27j02lK9kJ2J22r6J31j22J39L0o3j03
$$ plain form
6463 19 146 -13 121 -7 17 26 46 158 -64 -87 56 11 -17 -67 -135 -76 -7 76 272 -63 -108 34 -170 3 163
6488 163 -25 -145 -149 -209 -62 -34 -301 -272 -258 -94 100 72 207 21 -128 56 239 -154 9 -5 -31 32 -36 90
6512 90 131 94 71 -151 -84 -240 -47 115 -29 -11 -82 116 -113 41 17 -169 -109 -64 75 208 -174 -96 45 -8
6536 -8 48 -7 148 111 -81 88 143 263 54 -76 -175 -8 16 -146 -339 -88 333 72 -61 250 37 8 34
6559 34 262 45 216 -169 -132 -67 65 60 90 -170 44 -38 63 186 -147 -26 -56 -276 155 46 79 106 -39
6582 -39 -28 -32 108 76 -251 58 155 127 -105 159 13 198 111 -98 -108 -70 -18 -358 23 161 63 120 -119 -43 -28
6607 -28 47 197 42 -103 -119 -234 -255 79 93 59 -92 129 -109 38 66 72 69 75 121 -53 -145 -283 -235 110 211
6632 211 -259 115 -61 -71 10 82 229 -44 6 -75 -49 -42 -48 63 -100 68 142 57 97 -251 19 -51 -83 94 109
$$ packed form
6463A9J27j59J34j28K4RK0J12k22k3J43m5k8n0o8N9O9Q3J96l35m5J42k04J73J60
6488A63j88j20mo0J47K8k67K9J4J64J94k8J35j86j49J84J83l93J63j4k6O3o8J26
6512I0M1l7k3k22O7j56J93J62j44J8p1J98k29J54k4j86O0M5J39J33l82P8J41n3
6536hN6n5J55l7j92J69N5J20k09j30r9J67K4j62j93K51M21k61j33L11k13k9K6
6559C4K28k17J71l85L7O5J32nL0k60K14q2J01J23l33J21l0k20M31j09L3K7j45
6582c9J1mJ40l2l27L09R7k8k32K64j46J85q7k09j0L8N2l40L81J38r8N7k39P6J5
6607b8P5J50j55j45j6j15k1L34J4l4j51K21k38J47K8OlOM6j74r2j38M8L45J01
6632B11m70L74j76j0Q1P2J47k73N0q1K6PoJ11j63J68P4q5M0l48K70p0l2J77J5
$$ plain form
6657 109 -151 33 -132 12 125 -116 134 124 -311 -46 59 -290 11 71 88 -95 -39 8 -33 -23 -135 48
6679 48 51 79 -51 -64 163 248 43 -5 94 -113 66 -122 4 -54 -48 57 217 -144 -173 -48 -88 -71 77 -68 -2
6704 -2 67 -218 135 -67 15 83 -179 161 114 -50 -3 17 66 -217 109 9 -126 -44 124 179 -64 81 -197 -24
6728 -24 -183 -107 240 24 -15 174 -79 -216 8 -18 -133 109 -76 -160 -223 -94 130 105 -81 -204 -32 4 -137
6751 -137 79 16 133 84 -262 146 -81 -42 -60 -190 -201 22 155 29 49 156 -48 -222 100 22 141 -51
6773 -51 104 -143 -59 12 -67 -236 -61 44 71 -213 -177 -167 -233 123 157 232 -167 112 183 -105 8 -66 -23 34 14
6798 14 -240 21 167 41 45 296 1 21 153 -236 -203 -25 36 273 -96 -231 16 -11 223 211 131 -51 134
6821 134 130 -73 107 157 15 -42 -3 140 -143 181 -160 -132 84 193 -235 -273 134 -6 -164 -62 16 -20 151
$$ packed form
6657A09k60J84j65J44J13k41K50j0m35K65J05l49L01O0J7j83N6M7m1J0j12J83
6679D8LK8j30j3K27Q5k05m8R9k07J79j88J26n8OJ05J60l61k9J25m0J7J48j45O6
6704bO9k85L53k02Q2O8k62L40m7j64M7K0M9k83L26j00j35Q2J68N5k43J45k78J73
6728b4j59P6L47k16l9J89k53j37K24k6j15K42j85q4o3J29K24k5j86j23J72L6j41
6751a37K16o3J17m9l46M08k27L9j8j30j1K23J33j26K0J07k04j74L22p8J19j92
6773e1J55k47Q4P1p9j69J75J05K7k84L6J0o6L56L4P5l99K79P1k88J13p4M3N7k0
6798A4k54K61J46j26MK51k95K0J32l89L3J78O1K37l69j35K47k7K34j2q0j82J85
6821A34mk03J80N0j42n7L9J43k83L24l41K8K16J09m28l8M07j40j58J02P8l6J71
$$ plain form
6844 151 -122 32 204 31 -219 25 82 168 310 56 97 -124 -29 111 -231 -101 -107 -51 -36 101 -189 -115 -5
6867 -5 -29 138 167 -163 -132 -12 49 42 67 -220 -128 -24 129 -60 266 131 123 19 229 41 -131 252 49 121
6891 121 153 -103 145 207 27 -307 -20 -160 109 206 -4 -34 144 186 43 57 -161 -126 81 -89 289 232 -334
6914 -334 20 -166 -167 -54 56 -102 -203 227 -147 -163 -177 -46 37 -34 19 -56 31 26 73 71 -40 -29 84 13 -132
6939 -132 216 -68 -197 -88 -82 -22 -2 -7 63 -57 -50 -23 -208 -81 -19 -9 -79 -56 49 66 -17 -16 149 -225 -64 -124
6965 -124 -21 51 -308 180 -40 -221 -4 -214 -11 79 51 58 270 1 -214 -46 17 138 -104 101 16 131
6987 131 -52 -189 -29 -115 -20 -152 136 47 -280 45 127 323 -8 -180 -34 19 24 -9 107 122 -105 90 100
7010 100 -199 46 -148 -90 209 139 -198 135 -21 17 -9 51 97 -127 211 40 -139 -51 -228 34 121 183 211
$$ packed form
6844A51k73J54J72j73k50K44N7Q6J42k54M1k21R5J40l42J30oN6J5J37k90P4J10
6867ek4J67K9l30L1J20O1pK5k87R2J04J53j89L26j35qj04K10j88j72L83k03P2
6891A21L2k56K48O2j80l34K87j40K69R7k10l0J78M2j43J4k18L5K07j70L78n7n66
6914c34L54j86jJ13J10j58j01M30l74j6j4J31Q3p1N3p5Q7nM7kj11J1J13p1j45
6939a32L48k84j29J09OO0K0nP0j20PK7j85J27O2J0p0K3J05J7q3JJ65l74J61o0
6965a24J03P2l59M88k20j81K17k10K03R0k8PK12k69k15J68O3J21k42K05q5J15
6987A31j83j37J60q6R5j32K88q9l27L25Q2J96l31j72J46N3Nl3J16J5k27J95J0
7010A00k99K45j94N8K99p0l37L33j56L8k6O0M6k24L38j71j79Q8j77K62Q7O2K8
$$ plain form
7033 211 -142 122 10 42 -101 -91 -127 146 16 3 -44 -160 30 36 -80 -111 134 -88 -58 -180 -82 298 10
7056 10 78 -78 -166 -23 181 -34 -417 127 -186 48 40 88 -13 30 99 33 -106 189 -126 50 176 -38 -200
7079 -200 -165 66 -42 11 -18 -18 92 128 -22 285 -103 30 19 83 -109 80 -5 75 348 -437 35 45 70 57
7103 57 165 177 -164 -317 46 -107 111 295 32 -114 322 -131 -179 -208 116 -7 -85 -67 34 24 153 67 -94
7126 -94 249 56 71 234 166 101 9 -241 93 220 282 16 98 27 -17 92 -111 28 -171 -155 -263 -117 12
7149 12 263 74 -117 54 121 -19 205 116 -6 -110 129 -243 -395 -82 180 -40 161 24 -134 -170 -201 7
7171 7 -136 -53 1 27 27 -241 -27 141 -13 265 131 -68 160 -196 -301 -81 -204 126 55 203 -205 56 1
7194 1 -31 -281 86 77 -94 -75 -46 -165 278 -26 220 -83 -72 311 -110 -71 -132 -61 -25 -90 57 154 14 -106 -292
$$ packed form
7033B11l53K64j12L2j43J0l6K73j30j3m7j16J90Oj16l1K45k22L0j22R8L80k88
7056A0O8j56q8J43K04k15l83N44l13K34qM8j01M3O9o6j39K95l15J76J26k14j62
7079b00L5K31j08N3k9%J10L6j50L07l88J33j1O4j92J89q5Q0K73p85M72J0K5j3
7103E7J08J2l41j53L63j53K18J84k63j46M36m53m8k9L24j23p8J8J01j0J29q6j61
7126i4L43j93J5J63o8o5r2k50L34J27O2k66Q2p1m4J09k03J39j99J6j08J46J29
7149A2K51j89j91J71O7j40K24q9j22j04K39l72j52L13K62k20K01j37j58l6l1K08
7171Gj43Q3N4K6%k68K14J68j54K78j34j99K28l56j05K20j23L30p1J48m08K61n5
7194Al2k50L67rj71J9K9j19M43l04K46l03J1L83m21L9o1P1L6o5J47R7j40j20j86
$$ plain form
7219 -292 -91 -128 112 -6 -36 91 -115 7 119 22 115 145 171 -122 15 -28 123 -61 31 11 25 17 -82 219
7243 219 -46 91 102 240 -293 -13 -83 260 147 36 11 -224 -120 32 -113 332 49 -43 35 -121 172 -12
7265 -12 35 92 63 -296 -71 -34 168 232 157 -162 38 103 -34 -85 -111 -121 -257 -29 -138 228 -7 -2 -114 -137 -174
7290 -174 -75 -255 -133 -75 -146 -25 18 126 188 117 -22 157 291 14 124 -27 -141 254 134 -129 21 -124
7312 -124 110 149 70 -420 -101 70 44 -64 83 14 107 -96 -21 35 -4 -3 -108 -93 106 103 -130 73 57 -115 -132
7337 -132 -12 -27 95 -86 -27 -26 -55 -127 -34 73 80 -76 22 -129 44 -144 8 -66 -164 98 151 122 252 -183 241
7362 241 346 115 20 0 -57 -61 -123 -16 -23 133 -86 -152 36 22 35 -62 86 62 102 -122 5 -54 -171 121 -197
7387 -197 -36 57 -2 237 -148 230 -161 335 37 -89 257 68 -167 46 -77 -25 174 251 -173 -129 24 178
$$ packed form
7219b92K01l7K40j18l0J27k06J22J12r7R3L0K6k93J37m3J51j84R2k0J4qr9L01
7243B19k65J37J1J38n33K80p0L43j13j11k5k35J04J52j45M45k83r2P8j56K93j84
7265a2M7N7k9l59K25L7K02O4p5l19K00O5j37n1k6j0j36K28j09L66k35Nj12k3l7
7290a74R9j80J22N8p1J21M3J08O2p1j39J79J34k77J10j51j14L95j20k63J50j45
7312a24K34L9p9m90L19J71k6j08J47o9R3k03P5N6l9Jj05J5J99lk33K03j6j72j7
7337a32J20j5J22j81N9Jk9p2R3J07Pj56R8j51J73j88J52p4r8K62N3k9J30m35M24
7362B41J05k31r5k0n7mo2J07pJ56k19o6J88j4J3r7J48k4M0k24J27n9j17K92l18
7387a97J61R3n9K39l85L78l91M96k98j26L46j89k35K13j23N2J99P7m24M4J53J54
$$ plain form
7409 178 -36 49 167 -276 -220 -214 -114 21 -247 -93 154 16 -20 -56 107 169 -270 -47 197 -196 92 221
7431 221 129 -16 118 -45 41 -144 221 -269 -55 -129 -114 -72 -253 -61 -74 -71 320 -201 -267 113 -6 48 127 63
7455 63 -82 -83 159 44 -98 90 296 174 -47 48 165 -9 66 -152 -214 -2 51 313 -154 92 142 -36 -47
7478 -47 -147 -317 290 81 193 -178 7 123 125 112 -19 124 -52 -129 -206 -11 98 256 43 68 -224 -138 -60
7501 -60 -50 -142 187 98 28 -227 -197 -59 7 86 -226 31 5 -33 47 175 23 -97 28 -192 -205 -235 -153 -184 -90
7526 -90 110 -34 148 -236 -267 135 49 17 83 34 193 32 34 -127 -172 211 -242 -246 186 161 16 57 -108 -158 59
7551 59 118 -64 187 -21 92 125 121 -15 -22 93 208 -187 -123 -141 -45 -168 178 102 44 7 -167 -231 -76 236 -39
7576 -39 95 -159 -17 -149 -144 -68 45 145 -1 93 -14 130 188 14 -39 -143 23 -87 -93 -136 -156 75 253 56
$$ packed form
7409A78k14Q5J18m43N6OJ00J35k68J54K47j38l6l6J63O2m39K23K44l93K88J29
7431B21r2j45J34j63Q6j85L65m90K14p4J5M2j81J92j3LL91n21o6L80j19N4P9o4
7455F3j45jK42j15j42J88K06j22k21R5J17j74P5k18o2K12N3K62m67K46N0j78j1
7478d7j00j70O07k09J12l71J85J16Kj3j31J43j76p7p7J95J09J58k13K5k92Q6P8
7501f0J0r2L29q9p0k55L0J38O6P9l12K57k6l8Q0J28j52j20J25k20j3l0Q2l1R4
7526i0K00j44J82l84l1M02q6l2O6m9J59j61Kj61m5L83m53mM32k5j45M1j65n0K17
7551E9N9j82K51k08J13L3mj36pJ15J15l95O4j8R6j23L46p6n8l7j74o4J55L12k75
7576c9J34k54J42j32NP6J13J00j46R4j07J44N8j74n3j04J66j10om3k0K31J78j97
$$ plain form
7600 56 -177 194 25 69 -12 62 76 -235 38 166 122 115 -48 269 -33 -243 167 -63 247 347 -27 -30 -18 -41
7624 -41 -92 -19 259 4 93 32 -15 -90 -112 -176 162 -93 -232 68 94 -111 279 174 -98 32 64 125 -279 -50
7648 -50 153 43 186 -193 247 3 -125 263 20 -39 -239 -137 -73 -136 70 -144 -316 -14 -11 -117 -120 -143 -215
7671 -215 -106 -88 169 67 -129 197 227 180 -192 -21 254 108 -35 87 6 -104 -78 -103 -190 -156 247 -13 -17
7694 -17 201 82 27 -3 -1 103 17 116 -139 -102 113 -21 -11 138 2 33 6 -93 -78 30 -12 -141 -6 40 196
7719 196 182 -111 -326 -230 115 64 -33 17 122 -116 61 -14 -107 150 11 72 73 -31 149 -133 -135 255 -9 -58
7743 -58 -69 -63 -51 -153 37 18 -195 9 -43 150 -122 38 36 -8 67 158 8 80 -12 1 -7 -237 108 -18 -48 300
7769 300 -81 160 -103 -364 48 130 21 180 55 -380 59 18 -31 -22 186 153 101 88 86 -84 36 -20 -86 -46
$$ packed form
7600E6k33L71j69M4q1P4J4l11K73J28m4pj63L17l02k10M10k30L10J00l74lJ2k3
7624d1n1P3K78k55Q9o1m7p5k2o4L38k55j39L00K6k05L90j05k72J30L2O1m04K29
7648e0K03j10J43l79M40k44j28L88k43n9k00J02O4o3K06k14j72L02Lj06lk3p2
7671b15J09J8K57j02j96L26L0m7l72J71K75j46j43J22q1j10K6k5q7L4M03k60m
7694a7K18j19n5l0KJ04q6R9k55L7K15j34J0J49j36L1k7r9J5J08m2j29J35M6J56
7719A96j4k93k15R6L45n1r7N0J05k38J77p5r3K57j39O1Jj04J80k82kL90k64m9
7743e8j1OJ2j02J90j9k13K04n2J93k72J60km4P5R1j50P2r2J3qk30L45j26l0L48
7769C00l81K41k63k61M12Q2j09J59j25m35M39m1m9RK08l3n2j3kj70J20n6o6M0
$$ plain form
7793 -46 -84 32 -63 55 2 -69 144 -123 48 164 46 133 72 146 -21 47 -72 -246 -3 -141 215 -100 -113
7816 -113 -42 -96 -62 183 -21 115 1 -154 98 36 30 87 147 -157 94 324 134 -45 109 -113 -47 59 93
7839 93 -50 -128 -98 265 198 16 221 -89 -59 -13 99 3 14 -167 -76 133 -23 56 -225 120 159 -191 51 248
7863 248 37 -46 -92 203 -171 -88 -191 86 -62 -18 136 -153 -155 146 66 -183 85 67 6 94 -114 -162 81 94
7887 94 23 35 -237 -79 -18 154 33 14 -53 63 72 -52 99 -148 -104 -83 -190 3 45 -108 -115 70 -22 172 -221
7912 -221 184 -163 4 31 182 53 -115 -12 -2 -205 -7 -133 -187 -50 68 212 70 -60 20 -180 42
7933 42 35 -245 110 57 54 -152 -55 -178 -83 98 -138 -143 101 48 -85 -22 -170 276 147 231 -9 81 -93 -89 105
7958 105 -248 116 -89 34 -27 -66 208 53 -278 -230 78 -108 28 -120 -41 -79 52 -94 27 -102 126 42
$$ packed form
7793d6l8J16r5J18n3p1K13k67J71J16j18Q7o1P4j67O8j19j74K43j38L56l15j3
7816a13P1n4L4K45k04J36j14j55K52o2oN7O0l04K51K30j90j79J54k22O6J06L4
7839I3j43p8L0L63o7j82K05l10L0M6J12r6J1j81R1K09j56P9k81L45L9l50K42J97
7863B48k11q3m6K95l74Q3j03K77j48M4J54k89kL01q0k49K68j8o1Q8k08m8K43J3
7887I4p1J2k72J58O1J72j21j9o7J16Rj24J51k47M4K1j07J93M2j53pJ85r2J94l93
7912b21M05l47J67K7J51j29j68J03J0k03J98j26n4J37J18J44j42j30Q0k00K22
7933D2pk80L55n3lk06R7j23R5J81k36nK44n3j33O3j48M46j29Q4k40R0j74MJ94
7958A05l53L64k05J23o1l9K74j55l31M8L08j86J36j48P9l8J31j46J21j29K28q4
$$ plain form
7980 42 -23 -124 100 263 21 -168 -31 -42 -177 132 -226 -118 143 26 -15 9 44 -48 344 -135 38 -9 -94
8003 -94 98 3 -95 -285 75 18 -59 -169 172 130 -87 138 -116 61 10 -282 12 -283 -22 96 41 -92 -77
8026 -77 96 -363 -50 -13 -99 80 275 66 -4 -227 179 -187 -48 -28 188 -35 49 -277 49 -25 -29 151 84
8049 84 158 200 85 -121 -76 -13 316 -177 288 20 48 -94 90 38 184 -252 -242 118 19 -13 -205 170 -81
8072 -81 -155 -23 86 300 -113 -46 -10 -80 -125 122 233 -248 12 288 -64 -296 -42 3 96 315 -29 237 116
8095 116 -24 -115 -103 -23 -78 -175 157 -81 31 17 240 -74 51 -27 137 -57 -119 -18 59 313 -103 1 218
8118 218 120 44 -265 -40 77 157 -201 130 -183 -127 305 -206 -25 -20 89 23 -3 -289 48 48 93 -71 49 29
8142 29 -85 -222 63 -154 -185 -237 -108 -39 191 114 -157 -95 -227 -78 46 -6 28 226 -198 226 41 -143 124
$$ packed form
7980D2o5j01K24J63k42j89J37j1j35L09l58J08K61j17m1K4L5r2L92m79J73m7q5
8003i4J92r5r8j90L60n7p7j10L41m2k17K25k54J77n1k92K94k95K61J18n5j33J5
8026g7J73m59L13L7q6J79J95k09p0k23M06l66J39K0K16k23Q4l26L26p4mJ80o7
8049H4P4M2j15k06M5O3L29m93M65k68K8j42J84n2J46m36J0L60r9l2j92L75k51
8072h1p4J32J09K14m13O7L6p0m5K47J11m81K60K76l52k32K54M5R3K19l44K66j21
8095A16j40r1J2Q0n5r7L32k38J12j4K23l14J25p8J64j94o2J01P7K54m16J04K17
8118B18r8p6l09K25J17Q0l58L31l13N6M32n11J81NJ09o6k6k86L37%M5j64J20k0
8142B9j14j37K85k17l1n2J29O9K30p7k71O2j32J49J24n2L4J98m24M24j85j84K67
$$ plain form
8165 124 34 92 -34 -122 -215 115 91 -84 -141 -99 54 198 -120 141 -88 135 135 20 -103 -60 -357 -30 112
8188 112 -64 -57 -206
$$ packed form
8165A24r0N8j26q8r3L30k4j75n7M2J53J44l18K61k29K23%j15j23M3k97L27J42
8188A12j76Pj49
8191b06
$$ Imaginary data points
##PAGE= N=2
##DATA TABLE= (X++(I..I)), XYDATA
$$ plain form
0 0 0 0 0 0 0 0 0 0 0 0 0 0 0 -2 8 -8 8 -8 9 -16 16 -16 24 -27 32 -37 43 -51 59 -68 76 -89 100 -115 130 -145
36 -145 165 -184 206 -231 257 -285 317 -351 389 -430 475 -523 576 -637 699 -771 850 -939 1035
55 1035 -1144 1268 -1409 1570 -1759 1984 -2255 2590 -3018 3580 -4363 5536 -7496 11642 -41134
70 -41134 81253 -3792 -137966 48121 -84776 -306782 -73697 106001 -135722 -147987 7480
81 7480 -129773 -162769 67131 -37406 -233392 -12664 128572 -70821 -61416 43334 -99992
92 -99992 -66879 181748 83386 -98941 51756 96861 -59805 45402 155852 -16383 -6685
103 -6685 168314 26865 -100293 90669 105227 -64263 34324 102214 -82175 -47311 108714
114 108714 -55371 -148887 62151 50115 -131189 -42952 -787 -166390 -78702 93426 -78231
$$ packed form
0@%%%%%%%%%%%%%kJ0j6J6j6J7k5L2l2M0n1N9o9Q0r4J10j27J44j65J89k15K45k75
36a45L10l49L90m37M88n42O02o68P40q19R05r98J099j213J336j470J621j789J974
55A035k179K412k677K979l329L743m239M845n608O598p943R899j3032J9138n2776
70d1134J22387q5045j34174J86087j32897k22006K33085J79698k41723j2265J55467
81G480j37253l2996K29900j04537j95986K20728J41236j99393R405J04750j43326
92i9992L3113K48627r8362j82327J50697M5105j56666J05207J10450j72235R698
103f685J74999j41449j27158J90962J4558j69490R8587O7890j84389L4864J56025
114A08714j64085r3516K11038j2036j81304Q8237M2165j65603Q7688J72128j71657
$$ plain form
125 -78231 -185511 -10958 -23680 -142489 -20002 7273 -154106 -64681 83765 -67599 -131914
136 -131914 28841 3953 -77510 49615 52089 -93601 -3528 107755 -19339 -31956 100593
147 100593 34714 -31179 86992 57285 -61024 53025 124725 -23872 -22911 86138 374
158 374 -39494 77689 15691 -96960 27369 70247 -83397 -59179 40864 -58898 -76679
169 -76679 48123 -31115 -140786 -8694 32644 -101487 -58217 27391 -75664 -74451 49094
180 49094 -29260 -111980 21584 45045 -73519 -16701 52445 -44518 -24355 83663 721
191 721 -58751 61223 58610 -36956 31597 67890 -28728 13401 98855 -3262 -41519 72861
203 72861 44308 -37718 39997 48248 -52446 7023 76624 -34677 -51645 56726 3058 -67674
$$ packed form
125g8231j07280J74553j2722j18809J22487K7275j61379Q9425J48446j51364o4315
136a31914J60755k4888q1463J27125K474j45690R0073J11283j27094j2617J32549
147A00593o5879o5893J18171k9707j18309J14049P1700j48597R61J09049q5764
158C74l9868J17183o1998j12651J24329M2878j53644K4218J00043r9762j7781
169g6679J24802p9238j09671J32092M1338j34131M3270Q5608j03055J213J23545
180D9094p8354q2720J33564K3461j18564N6818O9146r6963K0163J08018q2942
191G21n9472J19974k613r5566O8553L6293r6618M2129Q5454j02117l8257J14380
203G2861k8553q2026P7715Q251j00694N9469O9601j11301j6968J08371n3668p0732
$$ plain form
215 -67674 25331 19213 -82287 -8274 55666 -61475 -67110 42052 -15414 -73362 23370 9121
227 9121 -83617 -720 54079 -58725 -49320 53674 -6413 -50488 43227 18959 -62107 23922
239 23922 67433 -33398 -15000 64540 -1132 -22264 63873 22767 -43599 43633 63056 -33234
251 -33234 -440 61258 -12851 -18399 60505 4288 -50206 37403 36331 -53581 -3524 45188
263 45188 -37229 -29263 46483 -21022 -65203 31112 24646 -62420 -8623 34124 -44917 -26593
275 -26593 46483 -22029 -56853 37866 25646 -52760 3670 38131 -35907 -10459 56389 -11592
287 -11592 -41626 40348 24954 -36304 17849 35370 -31199 819 50194 -17582 -30760 41255
299 41255 13297 -33849 20892 22232 -36803 4206 39561 -27068 -24242 37961 -1892 -34108
$$ packed form
215f7674R3005o118j01500P4013O3940j17141n635J09162n7466n7948R6732j4249
227I121r2738Q2897N4799j12804R405J02994o0087m4075R3715k4268q1066Q6029
239B3922M3511j00831J8398P9540o5672k1132Q6137m1106o6366Q7232J9423r6290
251c3234L2794O1698p4109n548P8904n6217n4494Q7609j072q9912N0057M8712
263D5188q2417P966P5746o7505m4181R6315o466q7066N3797M2747p9041J8324
275b6593P3076o8512l4824R4719j2220p8406N6430L4461p4038K5448O6848o7981
287a1592l0034Q1974j5394o1258N4153J7521o6569L2018M9375o7776j3178P2015
299D1255k7958m7146N4741J340n9035M1009L5355o6629K826O2203l9853l2216
$$ plain form
311 -34108 23542 10314 -41289 12364 37449 -34245 -22953 36689 -6536 -29858 27424 6697
323 6697 -40578 15435 33894 -33904 -17290 35131 -9135 -24448 29561 3723 -39680 15114
335 15114 31321 -28109 -12300 28485 -11003 -17514 27026 -1859 -32138 18204 22406 -26988
347 -26988 -4713 22545 -15434 -9807 27156 -7278 -26710 20854 14125 -25060 4071 17561
359 17561 -19383 -179 29593 -14822 -22969 28009 12752 -22951 11489 17586 -20636 5556
371 5556 32576 -14463 -18785 30638 10517 -20047 14994 14445 -23416 6614 31853 -16172 -20654
384 -20654 23558 5265 -20035 10729 6179 -25197 4189 21624 -20785 -19181 16560 -3168
396 -3168 -17487 11381 -372 -24816 7574 18457 -18715 -10252 17318 -4264 -6910 19447 -1747
$$ packed form
311c4108N7650j3228n1603N3653K5085p1694J1292N9642m3225k3322N7282k0727
323F697m7275N6013J8459o7798J6614N2421m4266j5313N4009k5838m3403N4794
335A5114J6207n9430J5809M0785l9488o511M4540k8885l0279N0342M202m9394
347b6988K2275K7258l7979N627L6963l4434j9432M7564o729l9185K9131J3490
359A7561l6944J9204K9772m4415q147N0978j5257l5703L4440O097l8222K6192
371E556K7020m7039m322M9423k0121l0564L5041n49l7861L0030K5239m8025m482
384b0654M4212j8293k5300L0764m550l1376K9386J7435m2409J604L5741j9728
396c168j4319K8868j1753k4444L2390J0883l7172Q463K7570k1582k646K6357k1194
$$ plain form
409 -1747 -18551 20412 21675 -16238 435 23657 -3915 -889 26673 -745 -17476 23521 21087
422 21087 -17056 1576 20099 -9709 -2598 24475 -7313 -24455 17132 15425 -21589 -5085
434 -5085 11741 -14666 -8159 16559 -11221 -25525 10307 8559 -20675 -4709 6725 -16012 -5186
447 -5186 15141 -10812 -20032 10587 7283 -13887 906 5362 -12018 3083 16284 -10410 -11901
460 -11901 15931 6031 -10345 8367 6550 -12198 7489 19140 -9931 -9756 16683 4412 -9147
473 -9147 10026 4076 -15471 6430 17836 -13557 -14241 12496 318 -14112 3908 -294 -20056
486 -20056 -1898 9749 -15806 -17747 3247 -5759 -15953 -419 -4478 -20243 -4460 6612 -12624
499 -12624 -14482 2381 -2603 -8629 1935 -2051 -10323 3337 7944 -6431 -4017 6901 -218 -1142
$$ packed form
409a747j6804L8963J263l7913J6673K3222k7572L026K7562k7418j6731M0997k434
422B1087l8143J8632J8523k9808P111K7073l1788j7142M1587j707l7014J6504
434e085J6826k6407O507K4718k7780j4304L5832j748k9234J5966J1434k2737J0826
447e186K0327k5953r220L0619l304k1170J4793M456j7380J5101J3201k6694j491
460a1901K7832r900j6376J8712j817j8748J9687J1651k9071J75K6439j2271j3559
473i147J9173n950j9547K1901J1406l1393o84K6737j2178j4430J8020m202j9762
486b0056J8158J1647k5555j941K0994r006j0194J5534m059j5765J5783J1072j9236
499a2624j858J6863m984o026J0564l986q272J3660M607j4375K414J0918p119r24
$$ plain form
513 -1142 8108 -495 -7194 6442 7880 -5954 -1966 4353 -4208 -2204 6044 -5980 -12204 3283
527 3283 3158 -12196 -6204 991 -9163 -8238 2430 -6583 -14612 -1288 904 -10674 -6742 -478
541 -478 -8277 -7567 2222 -4189 -11656 -1593 2158 -6660 -5685 190 -3611 -4191 977 -1834 -4957 69
557 69 764 -2499 -556 451 -1825 357 2869 -570 -901 2270 1339 124 2408 306 -1958 2929
573 2929 3222 -3023 -1173 3146 -1624 -3921 1310 -559 -6216 -1904 1261 -5065 -5114 -234 -3870 -6048
589 -6048 -504 -1395 -6913 -2802 1068 -3372 -4329 1027 289 -3844 347 3225 -644 -607 2388 1577 529
606 529 3016 2094 862 2542 3661 1544 1266 2641 1746 1474 2189 797 804 1363 533 541 1691 -86 -1670
625 -1670 1893 2282 -2026 -1599 2999 801 -1750 1337 1645 -1832 1360 3691 -1662 -2196 3760 1906
$$ packed form
513a142R250q603o699J3636J438j3834L988O319q561K004Q248j2024o224J5487
527C283j25j5354N992P195j0154R25J0668r013q029J3324K192j1578L932O264
541d78p799P10R789o411p467J0063L751q818R75N875l801n80N168k811l123N026
557F9O95l263J943J007k276K182K512l439l31L171r31j215K284k102k264M887
573B929K93o245J850M319m770k297N231j869n657M312L165o326m9M880l636k178
589f048N544q91n518M111L870m440r57N356p38m133M191K878l869L7K995q11j048
606E29K487r22j232J680J119k117k78J375q95k72P15j392PN59q30QJ150j777j584
625a670L563L89m308M27M598k198k551L087L08l477L192K331n353n34N956j854
$$ plain form
641 1906 -2661 1312 2897 -2684 -702 5179 -362 -4721 2085 3815 -2272 -599 2852 -1048 -986 4251
657 4251 971 -3578 2264 4368 -744 324 3744 376 -47 4811 2770 -1274 2313 3967 816
672 816 1607 2294 -52 1377 4511 -22 -1992 2984 2296 -1813 865 1593 -3024 -320 3889 -2320
688 -2320 -4397 2564 898 -4182 1624 2281 -5249 -1093 6304 -2059 -6228 3939 3432 -4160 1350
703 1350 4773 -3904 -984 7349 -39 -5410 4349 4185 -4187 1072 5470 -3306 -2215 6458 483
718 483 -5482 2851 4440 -3215 115 3394 -2658 -918 5611 -1078 -4336 3669 2828 -3439 828 2573
734 2573 -3406 -163 4794 -2460 -4313 3514 710 -4186 1613 1201 -6282 -223 5416 -4560 -6129
749 -6129 4354 280 -5715 1739 2245 -6185 162 6666 -3916 -5001 6252 2197 -4833 4006 4267
$$ packed form
641A906m567L973J585n581J982N881n541m359O806J730o087J673L451l900O2N237
657D251l280m549N842K104n112J068L420l368m23M858k041m044L587J654l151
672H16P91O87k346J429L134m533j970M976o88m109K678P28m617K704M209o209
688b320k077O961j666n080N806O57p530M156P397q363m169J0167n07p592N510
703A350L423q677K920Q333p388n371R759j64q372N259M398q776J091Q673n975
718D83n965Q333J589p655L330L279o052J740O529o689l258Q005q41o267M267J745
734B573n979L243M957p254j853P827k804m896N799m12p483O059N639r976j569
749f129J0483m074n995P454N06q430O347O504j0582j085J1253m055p030Q839K61
$$ plain form
764 4267 -4916 1415 8710 -1677 -4395 6073 3458 -3100 2423 2980 -4359 1082 6024 -3250 -4918
779 -4918 3844 1171 -3903 1273 -270 -5682 290 3714 -4400 -4419 2016 -1248 -2569 2752 -1619 -5573
795 -5573 3086 4548 -4655 -2148 4431 -658 -1471 5068 -382 -4929 4914 5554 -4566 -856 5288
810 5288 -1330 -1226 6054 -450 -6185 4375 6090 -4770 -2293 4042 -1158 -1609 4593 -1622 -5854
825 -5854 3663 4352 -4566 -1924 2238 -2460 -565 4102 -2760 -5682 2818 2532 -3625 -834 -173 -3815
841 -3815 1042 3961 -4813 -4657 4055 1274 -3671 1710 519 -4389 2785 5682 -4313 -3494 6311 1374
857 1374 -2749 4318 1647 -4717 4585 7421 -4536 -3315 6821 1474 -3418 3757 729 -6008 2925
872 2925 5869 -6036 -4705 4223 -1260 -4546 2164 -1938 -8055 1641 4110 -6912 -4901 2547 -2549
$$ packed form
764D267r183O331P295j0387k718J0468k615o558N523N57p339N441M942r274j668
779d918Q762k673n074N176j543n412N972L424q114j9O435l264j321N321m371l954
795e573Q659J462r203K507O579n089q13O539n450m547R843O40j0120L710O144
810E288o618J04P280o504n735J0560J715j0860K477O335n200m51O202o215m232
825e854R517O89q918K642M162m698J895M667o862k922Q500k86o157K791O61l642
841c815M857K919q774J56Q712k781m945N381j191m908P174K897r995Q19R805m937
857A374m123P067k671o364R302K836j1957J221J0136n347m892P175l028o737Q933
872B925K944j1905J331Q928n483l286O710m102o117R696K469j1022K011P448n096
$$ plain form
887 -2549 -2993 3220 -3045 -6242 4148 4205 -5463 -815 4860 -2443 -287 6879 -1660 -4688 6743
902 6743 5359 -4852 1298 5522 -3465 611 8232 -2644 -6569 6513 4400 -7299 579 4803
916 4803 -5463 -1772 6940 -4341 -8516 5098 3006 -7785 -348 3148 -6610 -1360 6736 -4435
930 -4435 -8131 4981 2814 -6547 745 2778 -6296 220 7258 -3843 -5927 5853 1849 -4984
944 -4984 3474 3127 -5694 2607 8112 -3713 -3403 7320 1700 -3235 5995 3144 -5793 4073 8844
959 8844 -4644 -2881 7989 422 -4797 5906 1988 -7847 2428 7076 -6338 -4630 5734 -2155
973 -2155 -5977 4243 -76 -9597 1705 6260 -6614 -4564 5091 -2324 -4341 5644 947 -6866
987 -6866 3731 6796 -3908 -276 7056 -1047 -721 8670 1502 -4285 6011 7082 -2853 2225 6386
$$ packed form
887b549m44O213o265l197J0390N7r668M648N675p303K156P166q539l028J1431
902F743j384j0211O150M224q987M076P621j0876l925J3082k113j1699P878M224
916D803j0266L691Q712j1281m175J3614k092j0791P437L496r758N250Q096j1171
930d435l696J3112k167r361P292K033r074O516P038j1101k084J1780m004o833
944d984Q458l47q821Q301N505j1825L10J0723n620m935R230k851q937R866M771
959H844j3488J763J0870p567n219J0703l918r835J0275M648j3414J708J0364p889
973b155l822J0220m319r521J1302M555j2874K050R655p415k017R985m697p813
987f866J0597L065j0704L632P332q103L26R391p168n787J0296J071r935N078M161
$$ plain form
1002 6386 -2264 175 8419 -732 -5085 5826 3487 -5234 1652 4643 -5272 -1005 7209 -3154
1016 -3154 -6703 4684 1640 -6320 1528 3185 -6629 -786 7301 -3462 -5977 5540 1988 -5333
1030 -5333 3086 3759 -5640 658 7471 -2738 -3653 5928 1431 -3400 5124 3186 -5103 2822 7176
1045 7176 -2788 -1387 6667 352 -1938 6333 2069 -4848 4470 6124 -4088 -278 6542 -2459 -2715
1060 -2715 6467 -346 -6852 3820 4406 -6665 -1375 4592 -5056 -4104 5594 -2210 -8251 3754 3185
1075 3185 -7655 -947 5121 -5250 -3228 6690 -1700 -6477 5205 3885 -5607 1614 5515 -4296
1089 -4296 -83 8546 -1333 -4464 7118 3673 -4676 3385 4980 -4740 861 7276 -3572 -4561 6150
1104 6150 509 -6408 3446 2654 -7805 223 6138 -6515 -5302 5936 -1292 -7511 3631 1442
$$ packed form
1002F386q650K439Q244r151m353J0911k339q721O886K991r915M267Q214j0363
1016c154l549J1387l044p960P848J657r814N843Q087j0763k515J1517l552p321
1030e333Q419O73r399O298O813j0209r15R581m497m831Q524j938q289P925M354
1045G176r964J401Q054o315k290Q271m264o917R318J654j0212L810O820r001k56
1060b715R182o813o506J0672N86j1071N290N967r648R52R698p804o041J2005n69
1075C185j0840O708O068j0371K022R918q390m777J1682j320r492P221L901r811
1089d296M213Q629r879l131J1582l445q349Q061J595r720N601O415j0848r89J0711
1104F150n641o917R854p92j0459Q028N915j2653J213J1238p228o219J1142k189
$$ plain form
1118 1442 -8360 1122 6008 -7299 -4289 6936 -1676 -6572 5023 1697 -7850 2514 6534 -6360
1132 -6360 -3446 7197 -1429 -5120 5826 1408 -6795 3647 6030 -6316 -1765 6959 -2190 -3869
1146 -3869 6066 280 -6297 4947 4932 -6520 -478 6582 -3933 -3192 6386 -2006 -7012 5255 3188
1161 3188 -8315 117 5079 -5636 -2854 5971 -3988 -7296 5351 1698 -8496 610 4707 -6249
1175 -6249 -1850 6229 -3976 -6241 6825 2439 -6801 2233 4936 -4732 469 7385 -3179 -3984
1189 -3984 7545 2282 -5312 3375 3918 -4790 1181 6017 -4535 -3652 6402 -275 -5674 3063 1392
1204 1392 -6121 1971 4859 -6358 -3069 5987 -1812 -5009 4031 185 -5991 3487 4362 -6668 -1164
1219 -1164 6575 -2301 -3670 5621 -231 -5614 5039 4510 -6561 -695 6115 -2477 -3006 5680 -1020
$$ packed form
1118A442r802R482M886j3307L010J1225q612m896J1595l326r547J0364M020j2894
1132f360K914J0643q626l691J0946m418q203J0442K383j2346M551Q724r149j679
1146c869R935n786o577J1244j5j1452O042P060j0515P41R578q392n006J2267k067
1161C188j1503Q432M962j0715K782Q825r959l308J2647l653j0194R106M097j0956
1175f249M399Q079j0205k265J3066m386r240R034K703r668N201O916j0564q05
1189c984J1529n263p594Q687N43q708N971M836j0552Q83J0054o677n399Q737j671
1204A392p513Q092K888j1217L289R056p799l197R040l846o176R478Q75j1030N504
1219a164P739q876j369R291n852n383J0653n29j1071N866O810q592n29Q686o700
$$ plain form
1234 -1020 -5263 5089 3447 -6124 148 5413 -3243 -1767 5469 -1873 -4644 5418 2291 -5665
1248 -5665 1362 4208 -3791 -166 5074 -3553 -4050 6072 1108 -5838 2317 3003 -5167 711 4658
1263 4658 -5369 -3720 6191 -326 -6049 3208 1984 -5653 2029 5043 -5803 -2768 7218 -802
1277 -802 -5175 4379 1678 -5462 3120 5162 -5738 -1687 7070 -1160 -4275 4829 581 -5658 3721
1292 3721 4052 -6352 -1247 5820 -2591 -3668 4528 -1273 -5724 4015 2689 -6751 -338 5039 -3755
1307 -3755 -2603 4988 -1828 -4912 5436 2548 -6460 1266 5008 -4247 -1059 6083 -2627 -4510 6128
1322 6128 2144 -6361 2175 4591 -4731 -290 5862 -3669 -4667 6017 1105 -6316 2064 3524 -5293
1337 -5293 9 5476 -4042 -4066 5496 192 -5297 2723 2540 -4997 1309 4611 -4242 -2524 5669 -441
$$ packed form
1234a020m243J0352j642r571O272N265q656J476P236p342k771J0062l127p956
1248e665P027K846p999L625N240q627m97J0122m964o946Q155O86q170N878L947
1263D658j0027J649R911o517n723R257j224p637P682L014j0846L035R986q020
1277h02m373R554k701p140Q582K042j0900M051Q757q230l115R104m248o239R379
1292C721L31j0404N105P067q411j077Q196n801m451R739j326r440O413N377q794
1307c755J152P591o816l084J0348k888r008P726L742r255L188P142q710j883J0638
1322F128l984q505Q536K416r322M441O152r531r98J0684m912p421Q380J460q817
1337e293N302N467r518k4R562n304n489Q020j83p537O306L302q853J718Q193o110
$$ plain form
1353 -441 -4499 3608 1652 -4628 1970 4516 -4709 -1774 5296 -1404 -3499 4193 517 -4584 3291
1368 3291 3840 -5174 -1012 5555 -2081 -2859 5041 -75 -4622 4108 3567 -5041 11 4994 -2799 -2009
1384 -2009 4787 -823 -4664 4190 2593 -4970 233 3827 -3368 -1694 4223 -2035 -3932 3805 1226
1399 1226 -4791 1129 2746 -3551 -230 4149 -2297 -2472 4526 1108 -3749 2709 2765 -2943 1350 4595
1415 4595 -2681 -1561 5061 90 -3117 3429 1877 -3763 1918 3853 -3785 -1476 4479 -1248 -3334
1430 -3334 2943 518 -4204 1820 3185 -4287 -1257 4035 -1871 -2771 3362 247 -3673 2439 2515 -4062
1446 -4062 -272 3801 -2048 -1394 3665 -716 -3172 3187 1929 -4078 635 3256 -2712 -765 3682
1461 3682 -1633 -2794 3926 924 -4215 1776 2803 -3456 -172 3713 -2538 -2404 4265 302 -4031
$$ packed form
1353d41m058Q107j956o280O598K546r225K935P070o700k095P692l676n101P875
1368C291N49r014M162O567p636p78P900n116m547Q730n41q608N052M983p793P90
1384b009O796n610l841Q854j597p563N203L594p195J674N917o258j897P737k579
1399A226o017N920J617o297L321M379o446j75O998l418m857O458N6n708M293L245
1415D595p276J120O622m971l207O546j552n640N681J935p638K309N955n727k086
1430c334O277k425m722O024J365p472L030N292n906r00O133l115l920O112P6o577
1446d062L790M073n849O54N059m381k456O359j258o007M713K621n968J947M447
1461C682n315j161O720l002n139N991J027o259L284L885o251J34O669l963m333
$$ plain form
1476 -4031 2015 2281 -3414 620 3655 -3013 -2623 3992 -420 -4280 1878 1722 -4097 285 2828 -3550
1492 -3550 -2285 3461 -1504 -3851 2115 526 -4015 863 2365 -3719 -1193 3559 -1613 -2749 2846
1507 2846 231 -3324 2412 2257 -3642 -183 3834 -2251 -2083 3202 -779 -3182 2333 1310 -4494
1522 -4494 -2 2907 -2813 -2223 2821 -1586 -3305 2344 607 -4276 112 2434 -2770 -1726 2829
1537 2829 -1757 -2984 2752 498 -3574 910 2196 -2826 -754 2395 -1638 -2068 2592 42 -3468
1552 -3468 1052 1465 -3127 -336 1911 -2267 -1681 2744 -966 -3255 1384 1076 -2838 402 1823 -2726
1568 -2726 -999 2636 -1114 -2396 1953 914 -2273 1174 1526 -2915 -352 2881 -1581 -2280 2169
1583 2169 111 -2736 1286 1122 -2866 -244 2191 -1938 -1938 1884 -429 -2312 1463 476 -2562 197
$$ packed form
1476d031O046K66n695M034L035o668L90O615m412l860O158j56n819M382K543o378
1492c550J265N746m965k347N966j589m541M878J502o084K526M752n172j136N595
1507B846k615l555N736j55n899L459M017o085J68N285l981k403N515j023n804
1522d494M492K909n720N90N044m407j719N649j737m883M388K322n204J044M555
1537B829m586j227N736k254m072M484J286n022K072L149m033m30M660k550l510
1552c468M520M13m592K791K247m178N86M425l710k289M639l08l914L240J421m549
1568b726J727L635l750j282M349j039l187L447L52m441K563L233m462o99M449
1583B169k058k847M022j64l988K622K435m129%L822k313j883L775r87l038K759
$$ plain form
1599 197 2007 -1836 -892 1660 -449 -1135 1914 393 -1864 1202 1697 -1788 -200 1828 -955 -898
1615 -898 2094 -254 -2376 1555 1326 -2110 -67 1640 -1892 -576 2076 -809 -2371 1156 867 -2102
1631 -2102 503 1463 -1777 -230 2176 -774 -2019 1659 890 -1316 917 998 -1751 208 2397 -1204
1647 -1204 -1335 2015 381 -1415 1190 785 -1825 422 1788 -1432 -1078 1860 -406 -1109 1371 583
1663 583 -2132 910 2016 -1660 -643 1694 -652 -1170 1883 97 -2182 1378 1723 -1698 -440 1543
1679 1543 -838 -1074 2010 -79 -2361 966 1384 -1873 -351 1306 -998 -578 1771 -480 -2013 1323
1695 1323 1163 -1648 110 1360 -1108 -472 1962 -520 -1259 1327 880 -1129 480 1068 -1406 172
1711 172 1668 -928 -1446 855 255 -1436 545 532 -1854 -37 1462 -1356 -1346 1178 -338 -1404 530
$$ packed form
1599A97J810l843R44K552k109o86L049j521k257L066M95l485J588K028k783N7
1615h98K992k348k122L931k29l436K043J707l532J316K652k885j562L527k89k969
1631b102K605R60l240J547K406k950j245L678p69k206K233Q1k749J959K189l601
1647a204j31L350j634j796K605m05k610K247J366l220L54K938k266p03K480p88
1663E83k715L042J106l676J017K337k346n18L053j786k279L560L45l421J258J983
1679A543k381k36L084k089k282L327M18l257J522J657k304M20K349k251j533L336
1695A323j60k811J758J250k468O36K434k482p39K586m47k009J609N88k474J578
1711A72J496k596n18K301o00j691J981j3k386J817J499k818J0K524j516j066J934
$$ plain form
1728 530 441 -2033 66 1557 -1064 -1081 1236 75 -980 1027 419 -1650 295 1719 -880 -684 1138
1745 1138 -560 -777 913 88 -1240 279 1089 -678 -381 742 -540 -563 872 -376 -1234 393 663
1762 663 -728 -39 749 -879 -264 1060 -353 -827 436 39 -735 312 255 -1049 -282 763 -808
1779 -808 -1136 659 154 -677 399 261 -915 -55 1044 -599 -983 603 22 -793 777 573 -838
1796 -838 366 950 -133 -277 893 122 -30 574 54 -694 379 650 -600 147 453 -559 -306 626
1814 626 -239 -820 462 157 -940 65 220 -811 -393 667 -727 -966 543 414 -643 41 502
1831 502 -587 87 1081 -101 -631 980 649 -406 626 731 -575 18 855 -420 -488 663 -25 -781
1849 -781 414 378 -407 213 880 -250 -237 704 64 -513 302 186 -746 296 778 -572 -191 304 -196
$$ packed form
1728E30q9k474K099J491k621j7K317j161j055K007o08k069J945J424k599J96J822
1745A138j698k17J690q25j328J519Q10j767K97J123j282k3J435j248q58J627K70
1762F63j391O89P88j628O15J324j413m74J263l97p74J047n7j304P67J045j571
1779h08l28J795n05q31J076j38j176Q60J099j643l84J586n81q15J570k04j411
1796h38J204N84j083j44J170p71j52O04n20p48J073K71j250P47L06j012K53R32
1814F26q65n81J282l05j097J005J55j031M18J060j394k39J509j29j057O84M61
1831E02j089O74R94j182n30J611l31j055J032J05j306N93Q37j275o8J151o88p56
1849g81J195l6p85O20O67j130J3R41o40n77Q15j16r32J042M82j350L81M95n00
$$ plain form
1868 -196 -411 421 -161 -851 349 369 -513 -391 579 -386 -155 584 -162 -709 289 606 -481 -114 474 73
1888 73 -222 624 241 -506 366 506 -326 394 706 -175 245 558 32 -388 247 117 -186 -178 320 -118 -213
1909 -213 173 52 -417 -174 -275 -699 -294 -21 -418 -146 -17 -581 -272 360 -139 -476 -29 138 -351 66
1929 66 421 -327 45 533 -140 44 299 303 -107 270 260 -187 72 192 -50 -117 -234 -224 -420 -64 -84 -70 -92
1952 -92 -344 110 -213 -153 -332 -12 199 -131 -176 -82 -152 -314 215 -38 -277 3 254 -259 -205 -25 -206 -397
1974 -397 9 -215 -604 -162 42 -521 -175 -136 -187 -214 54 -154 -231 -20 219 -42 94 65 55 -202 362 -41
1996 -41 -141 346 -7 -270 38 -15 -642 -215 80 -288 -516 -12 -469 -457 58 -110 -551 -82 -16 -463 -919
2017 -919 -16 -79 -276 103 84 -393 -35 370 -4 -28 210 179 -151 312 572 -58 138 318 -150 -75 153 246
$$ packed form
1868a96k15Q32n82o90J200K0q82J22R70r65K31P39p46n47R98L17j087L67N88m01
1888G3k95Q46l83p47Q72J40q32P20L12q81M20L13n26m20O35j30l03QM98m38r5
1909b13L86j21m69K43j01m24M05K73l97K72J29n64L09O32m99l37M47J67m89M17
1929F6L55p48L72M88o73J84K55Mm10L77j0m47K59J20k42o7j17J0j96L56k0J4k2
1952i2k52M54l23O0j79L20K11l30m5R4p0j62N29k53k39K80K51n13N4J80j81j91
1974c97M06k24l89M42K04n63L46L9n1k7K68k08p7K11K39k61J36k9j0k57N64m03
1996d1j00M87l53k63L08n3o27M27K95l68k28N04m57J2N15j68m41M69O6m47m56
2017i19R03o3j97L79j9m77L58M05l74k4K38l1l30M63K60o30J96J80m68P5K28R3
$$ plain form
2039 246 -145 187 -216 -335 -312 443 -469 -101 87 -63 -153 260 -169 -417 180 274 69 -84 192 -81 33
2060 33 315 -21 -270 73 13 190 52 165 -146 -217 449 -282 -182 32 251 -56 190 133 -135 -123 4 195
2082 195 -140 70 58 3 225 343 -162 318 409 4 135 230 -24 150 234 -136 -323 211 211 -59 -120 -37 -144
2105 -144 -125 234 -76 -336 -18 -8 -162 50 -48 -263 -4 556 -108 245 200 110 7 325 425 -172 250 511
2127 511 218 -155 163 136 -302 137 57 -283 -72 105 -175 -157 225 -192 -385 89 23 -230 229 172 -169 -160
2149 -160 86 -268 37 95 169 -232 348 267 -255 102 157 24 -71 210 36 -422 280 4 -447 -390 141 -285
2171 -285 -346 505 192 -820 165 175 -321 200 66 -352 -233 430 24 -156 307 278 -234 123 398 22 -92
2192 -92 446 -153 -456 428 315 -564 53 -49 -327 -113 -54 -204 -412 332 -38 -306 -19 278 -260 180 195
$$ packed form
2039B46l91L32m03j19K3P55r12L68J88j50r0M13m29k48N97R4k05j53K76k73J14
2060C3K82l36k49L43o0J77j38J13l11p1O66p31J00K14K19l07K46n7k68J2J27J91
2082A95l35K10j2n5K22J18n05M80R1m05J31R5k54J74Q4l70j87N34%k70o1Q3j07
2105a44J9L59l10k60L18J0j54K12r8k15K59N60o64L53m5r0j03L18J00n97M22K61
2127E11k93l73L18k7m38M39q0l40K11J77k80J8L82m17j93M74o6k53M59n7l41R
2149a60K46l54L05N8P4m01N80q1n22L57N5j33r5K81j74m58P02k76m51N7N31m26
2171b85o1Q51l13j012R85J0m96N21j34m18J19O63m06j80M63k9n12L57K75l76j14
2192i2N38n99l03Q84j13q79O17j02k78K14N9j50k08P44l70k68K87K97n38M40J5
$$ plain form
2213 195 -89 -293 485 197 -284 147 217 -232 32 424 46 12 241 55 17 437 -29 -416 122 273 -289
2234 -289 -387 -188 -144 -368 -83 -96 -366 -317 72 -325 -463 206 -121 -444 158 330 -288 -123 174 -41 -253
2255 -253 390 -166 17 310 121 -89 395 58 -145 -201 107 -58 -84 186 -67 -304 157 334 -142 2 346
2276 346 -271 -162 174 -345 -209 178 132 -82 139 63 -383 -146 125 -43 -305 205 118 -414 88 -177 -472
2297 -472 -36 -144 -470 -12 42 119 -165 217 20 -78 207 325 -322 -96 -13 -72 -146 600 221 -34 220 309
2319 309 -286 -57 242 -43 45 317 16 -343 285 89 -82 10 165 -308 -122 247 43 -409 -61 -59 -443
2340 -443 177 197 146 -173 270 -67 -276 235 96 -61 -94 -125 -191 -169 344 -355 -194 348 104 -423 -143 290
2362 290 -135 -370 -97 -173 -122 267 74 -364 211 298 -253 267 155 -96 -326 234 70 -298 -23 395 -436
$$ packed form
2213A95k84k04P78k88m81M31P0m49K64L92l78l4K29j86l8M20m66l87N38J51n62
2234b89r8J99M4k24K85j3k70M9L89l97j38O69l27l23O02J72o18J65K97k15k12
2255b53O43n56J83K93j89k10M84l37k03n6L08j65k6K70k53k37M61J77m76J44L44
2276C46o17J09L36n19J36L87m6k14K21p6m46K37K71j68k62N10q7n32N02k65k95
2297d72M36j08l26M58N4P7k84L82j97r8K85J18o47K26Q3n9p4P46l79k55K54Q9
2319C09n95K29K99k85Q8K72l01l59O28j96j71R2J55m73J86L69k04m52L48Kl84
2340d43O20K0n1l19M43l37k09N11j39j57l3l1o6K2N13o99J61N42k44n27K80M33
2362B90m25k35K73p6N1L89j93m38N75Q7n51N20j12k51k30N60j64l68K75M18q31
$$ plain form
2383 -436 364 356 -416 -49 505 130 -390 308 -97 -178 -122 117 -145 71 254 -252 -407 -128 -202 -302 104 274
2405 274 -344 -384 252 -11 -232 67 43 -344 139 240 -185 -10 477 -33 -263 317 -58 -138 53 65 -188
2426 -188 -119 344 -86 -91 33 -296 -230 134 122 -291 -112 52 -181 -31 145 -58 -28 141 129 -31 39 -17 104
2449 104 -4 64 70 -262 172 31 -50 -29 208 -190 106 16 45 -236 135 219 -304 130 -1 -83 -75 227 156 55
2473 55 3 -46 21 40 187 -265 -54 141 2 194 368 -52 -113 13 -75 -8 88 136 -127 -238 194 -249 -65
2496 -65 -98 -155 -114 19 -53 -23 -266 65 -141 10 334 -52 -9 365 29 -97 113 89 1 120 146 41 -137
2519 -137 34 113 -108 -6 421 -41 -91 58 -221 -59 167 57 -130 -94 38 80 -219 234 -38 21 -31 223
2541 223 206 -25 238 -89 -8 -40 -248 50 149 87 -28 10 67 90 38 -50 92 39 -193 87 -364 -54 105 -28
$$ packed form
2383d36Q00qp72L67N54l75n20O98m05q1N6K39k62K16J83n06j55K79p4j00M06J70
2405B74o18m0O36k63k21K99k4l87M83J01m25J75M87n10k30N80l75q0J91J2k53
2426a88O9M63m30nJ24l29O6L64j2m13J79J64k33J50J76k03L0J69j2j60P0n6J21
2449A04j08O8Ol32M34j41q1K1K37l98K96r0K9k81L71Q4n23M34j31q2QL02p1j01
2473E5n2m9O7J9J47m52K11J95j39J92J74m20o1J26q8O7R6M8k63j11M32m43J84
2496f5l3n7M1J33p2L0k43L31k06J51L24l86M3L74l36j26K10k4q8J19K6j05j78
2519a37J71P9k21J02M27m62n0J49k79J62K26j10j87L6J32M2k99M53k72N9n2K54
2541B23j7k31K63l27Q1l2k08K98R9o2j15L8N7K3n2q8J42n3k32K80m51L10J59j33
$$ plain form
2565 -28 -174 413 -17 -71 24 -10 -249 189 87 -16 -17 -114 -67 44 444 357 105 78 74 -121 -241 190 137 -65
2589 -65 274 24 -220 52 18 -45 -109 316 -261 -277 -5 -92 88 -68 158 -136 -180 129 129 -26 198 113 -127
2612 -127 216 123 -16 250 120 262 -6 -149 -16 -122 18 -78 -23 155 -255 -26 -4 -181 -135 -139 38 33 -104
2635 -104 143 133 298 -43 158 27 206 -137 106 54 -37 173 -66 -69 86 153 -242 -133 76 -64 -153 330
2657 330 96 83 139 47 -14 43 95 67 -93 216 35 -78 -222 122 -269 228 -105 83 73 330 18 -221 -16
2680 -16 25 111 -30 122 175 108 10 17 -123 134 -65 -141 141 7 -115 -9 196 -57 113 205 116 63 95 90 -116
2705 -116 3 25 -14 165 308 -55 -118 199 91 -118 126 36 157 -250 228 -40 46 -168 1 -23 72 -35
2727 -35 29 -205 -7 26 -221 233 52 140 172 230 -347 -114 191 -169 181 22 218 -172 -160 101 -115 124
$$ packed form
2565b8j46N87m30n4R5l4k39M38j02j03jr7M7J11M00q7k52k7mj95j20M31n3k02
2589f5L39k50k44K72l4o3o4M25n77j6K72q7J80j56K26k94m4L09%j55K24q5k40
2612a27L43r3j39K66j30J42k68j43J33j06J40r6N5J78m10K29K2j77M6mJ77nj37
2635a04K47j0J65l41K01j31J79l43K43n2r1K10k39lJ55O7l95J09K09j40q9M83
2657C30k34j3N6r2o1N7N2k8j60L09j81j13j44L44l91M97l33J88j0K57l12k39K05
2680a6M1Q6j41J52N3o7r8Pj40K57j99p6K82j34j22J06K05k53J70R2q9n3L2nk06
2705a16J19K2l9J79J43l63o3L17j08k09K44r0J21m07M78k68Q6k14J69k4R5j07
2727c5O4k34J98L3k47M54j81Q8L2N8n77K33L05l60L50j59J96l90J2K61k16K39
$$ plain form
2749 124 61 73 -168 6 -77 -136 18 47 -292 5 10 -356 -28 334 -80 -135 144 109 60 -91 367 -282 278
2772 278 55 -46 -40 1 6 -175 21 93 -225 138 246 -244 -65 168 -18 -346 -15 166 -22 99 20 -25 -228
2795 -228 -65 -163 -100 155 198 -227 233 122 -241 147 347 -4 91 170 341 52 -10 157 -73 -217 299 -84
2817 -84 -157 -29 -245 -102 92 32 -204 -98 -135 -72 102 80 97 -87 297 64 169 -20 68 31 134 152 125 42
$$ packed form
2749A24o3J2k41J74q3n9J54K9l39K97Nl66L28L62m14n5K79l5m9j51M58o49N60
2772B78k23j01OM1Nj81J96P2l18L63J08m90J79K33j86l28L31J81j88J21p9m5k03
2795b28J63r8O3K55M3m25M60j11l63L88K00l51R5P9J71k89o2J67k30j44N16l83
2817h4p3J28k16J43J94o0k36J06l7O3J74k2J7j84L84k33J05j89Q8l7J03J8k7q3
$$ [...]
8191G6
##END NTUPLES=NMR FID
##END=
