##TITLE=1H_LR-758-R3-KA1i
 CDCl3
 8 sc, 
 2.8.2023
##JCAMPDX= 6.0         $$ Bruker NMR JCAMP-DX V2.0
##DATA TYPE= NMR FID
##DATA CLASS= NTUPLES
##ORIGIN= UXNMR, Bruker Analytische Messtechnik GmbH
##OWNER= root
$$ XWIN-NMR		Version 3.5
$$ Wed Aug  2 16:30:57 2023 Russian Standard Time (UT+4h)  she@DPX200
##.OBSERVE FREQUENCY= 200.13135
##.OBSERVE NUCLEUS= ^1H
##.DELAY= (6, 6)
##.ACQUISITION MODE= SIMULTANEOUS
##.ACQUISITION SCHEME= undefined
##.AVERAGES= 8
##.DIGITISER RES= 18
##SPECTROMETER/DATA SYSTEM= spect
##.PULSE SEQUENCE= zg30
##.SOLVENT NAME= D2O
##.SHIFT REFERENCE= (INTERNAL, D2O, 0, 15.7039)
##AUDIT TRAIL= $$ (NUMBER, WHEN, WHO, WHERE, WHAT)
$$ ##TITLE= Audit trail, XWIN-NMR		Version 3.5
$$ ##JCAMPDX= 5.01
$$ ##ORIGIN= Bruker BioSpin GmbH
$$ ##OWNER= she
$$ F:/spectra/data/she/nmr/H-F/1/audita.txt
$$ ##AUDIT TRAIL=  $$ (NUMBER, WHEN, WHO, WHERE, WHAT)
(   1,<2023-08-02 16:29:48.14 +0400>,<she>,<DPX200>,
      <created by zg, POWCHK disabled, PULCHK disabled
       configuration hash MD5:
       00 E9 B6 7A A2 85 ED C7 34 08 36 98 17 FE 4E 26
       data hash MD5: 16K
       F6 91 2F DE 8E A9 24 1C DB D0 4F A8 43 72 95 3D>)
$$ ##END=
$$ 
$$ hash MD5
$$ EA BB 8F 78 50 7E A2 28 B7 64 5A 3A 99 9A 23 41
##$RELAX= 
##$RELAX= 
##$RELAX= 
##$RELAX= 
##$RELAX= 
##$RELAX= 
$$ Bruker specific parameters
$$ --------------------------
##$DU= <F:/spectra>
##$EXPNO= 1
##$NAME= <H-F>
##$PROCNO= 1
##$TYPE= <nmr>
##$USER= <she>
##$AMP= (0..31)
100 100 100 100 100 100 100 100 100 100 100 100 100 100 100 100 100 100 
100 100 100 100 100 100 100 100 100 100 100 100 100 100 
##$AQSEQ= 0
##$AQ_mod= 1
##$AUNM= <au_zg>
##$AUTOPOS= <>
##$BF1= 200.13
##$BF2= 200.13
##$BF3= 200.13
##$BF4= 200.13
##$BF5= 200.13
##$BF6= 200.13
##$BF7= 200.13
##$BF8= 200.13
##$BYTORDA= 1
##$CFDGTYP= 0
##$CFRGTYP= 5
##$CHEMSTR= <none>
##$CNST= (0..31)
1 1 145 1 1 1 1 1 1 1 1 1 1 1 1 1 1 1 1 1 1 1 1 1 1 1 1 1 1 1 1 1 
##$CPDPRG= <>
##$CPDPRG1= <>
##$CPDPRG2= <>
##$CPDPRG3= <>
##$CPDPRG4= <mlev>
##$CPDPRG5= <mlev>
##$CPDPRG6= <mlev>
##$CPDPRG7= <mlev>
##$CPDPRG8= <mlev>
##$CPDPRGB= <>
##$CPDPRGT= <>
##$D= (0..31)
0 1.2 0 0 0 0 0 0 0 0.06 0 0.03 0 0 0 0 0.0002 0 0 0 0 0 0 0 0 0 0 0 0 
0 0 0 
##$DATE= 1690979387
##$DBL= (0..7)
120 120 120 120 120 120 120 120 
##$DBP= (0..7)
150 150 150 150 150 150 150 150 
##$DBP07= 0
##$DBPNAM0= <>
##$DBPNAM1= <>
##$DBPNAM2= <>
##$DBPNAM3= <>
##$DBPNAM4= <>
##$DBPNAM5= <>
##$DBPNAM6= <>
##$DBPNAM7= <>
##$DBPOAL= (0..7)
0.5 0.5 0.5 0.5 0.5 0.5 0.5 0.5 
##$DBPOFFS= (0..7)
0 0 0 0 0 0 0 0 
##$DE= 6
##$DECBNUC= <off>
##$DECIM= 32
##$DECNUC= <off>
##$DECSTAT= 4
##$DIGMOD= 1
##$DIGTYP= 9
##$DL= (0..7)
0 120 120 120 120 120 120 120 
##$DP= (0..7)
150 150 150 150 150 150 150 150 
##$DP07= 0
##$DPNAME0= <>
##$DPNAME1= <>
##$DPNAME2= <>
##$DPNAME3= <>
##$DPNAME4= <>
##$DPNAME5= <>
##$DPNAME6= <>
##$DPNAME7= <>
##$DPOAL= (0..7)
0.5 0.5 0.5 0.5 0.5 0.5 0.5 0.5 
##$DPOFFS= (0..7)
0 0 0 0 0 0 0 0 
##$DQDMODE= 0
##$DR= 18
##$DS= 0
##$DSLIST= <SSSSSSSSSSSSSSS>
$$ [...]
##$SUBNAM2= <"">
##$SUBNAM3= <"">
##$SUBNAM4= <"">
##$SUBNAM5= <"">
##$SUBNAM6= <"">
##$SUBNAM7= <"">
##$SUBNAM8= <"">
##$SUBNAM9= <"">
##$SW= 18.05172834244
##$SWIBOX= (0..15)
0 0 2 0 0 0 0 0 0 0 0 0 0 0 0 0 
##$SW_h= 3612.71676300578
##$TD= 16384
##$TD0= 1
##$TE= 0
##$TE2= 300
##$TE3= 300
##$TEG= 300
##$TL= (0..7)
0 120 120 120 120 120 120 120 
##$TP= (0..7)
150 150 150 150 150 150 150 150 
##$TP07= 0
##$TPNAME0= <>
##$TPNAME1= <>
##$TPNAME2= <>
##$TPNAME3= <>
##$TPNAME4= <>
##$TPNAME5= <>
##$TPNAME6= <>
##$TPNAME7= <>
##$TPOAL= (0..7)
0.5 0.5 0.5 0.5 0.5 0.5 0.5 0.5 
##$TPOFFS= (0..7)
0 0 0 0 0 0 0 0 
##$TUNHIN= 0
##$TUNHOUT= 0
##$TUNXOUT= 0
##$USERA1= <user>
##$USERA2= <user>
##$USERA3= <user>
##$USERA4= <user>
##$USERA5= <user>
##$V9= 5
##$VALIST= <valist>
##$VCLIST= <CCCCCCCCCCCCCCC>
##$VD= 0
##$VDLIST= <DDDDDDDDDDDDDDD>
##$VPLIST= <PPPPPPPPPPPPPPP>
##$VTLIST= <TTTTTTTTTTTTTTT>
##$WBST= 1024
##$WBSW= 4
##$XGAIN= (0..3)
0 0 0 0 
##$XL= 0
##$YL= 0
##$YMAX_a= 35989
##$YMIN_a= -44362
##$ZGOPTNS= <>
##$ZL1= 120
##$ZL2= 120
##$ZL3= 120
##$ZL4= 120
##$ABSF1= 10
##$ABSF2= 0
##$ABSG= 5
##$ABSL= 3
##$ALPHA= 0
##$AQORDER= 0
##$ASSFAC= 0
##$ASSFACI= 0
##$ASSFACX= 0
##$ASSWID= 0
##$AUNMP= <proc_1d>
##$AZFE= 0.1
##$AZFW= 0.1
##$BCFW= 1
##$BC_mod= 2
##$BYTORDP= 1
##$COROFFS= 0
##$CY= 11.3945322036743
##$DATMOD= 1
##$DC= 2
##$DFILT= <>
##$DTYPP= 0
##$F1P= 15.7292609196834
##$F2P= 12.9074282941183
##$FCOR= 0.5
##$FTSIZE= 0
##$FT_mod= 4
##$GAMMA= 1
##$GB= 0.15
##$INTBC= 1
##$INTSCL= 1
##$ISEN= 128
##$LB= 0.24
##$LEV0= 0
##$LPBIN= 0
##$MAXI= 10000
##$MC2= 0
##$MEAN= 0
##$ME_mod= 0
##$MI= 1.114404
##$NCOEF= 0
##$NC_proc= 0
##$NLEV= 6
##$NOISF1= 3.799351
##$NOISF2= 2.8
##$NSP= 1
##$NTH_PI= 0
##$NZP= 0
##$OFFSET= 15.70392
##$PC= 1
##$PHC0= -21038.06
##$PHC1= 10.85272
##$PH_mod= 1
##$PKNL= yes
##$PPARMOD= 0
##$PSCAL= 0
##$PSIGN= 0
##$REVERSE= no
##$SF= 200.130013532006
##$SI= 16384
##$SIGF1= 3
##$SIGF2= 2
##$SINO= 400
##$SIOLD= 16384
##$SREGLST= <1H.CDCl3>
##$SSB= 0
##$STSI= 0
##$STSR= 0
##$SW_p= 3612.71676300578
##$SYMM= 0
##$S_DEV= 0
##$TDeff= 0
##$TDoff= 0
##$TI= <>
##$TILT= no
##$TM1= 0
##$TM2= 0
##$TOPLEV= 0
##$USERP1= <user>
##$USERP2= <user>
##$USERP3= <user>
##$USERP4= <user>
##$USERP5= <user>
##$WDW= 1
##$XDIM= 8192
##$YMAX_p= 0
##$YMIN_p= 0
$$ End of Bruker specific parameters
$$ ---------------------------------
##NTUPLES= NMR FID
##VAR_NAME=  TIME,          FID/REAL,        FID/IMAG
##SYMBOL=    X,             R,               I
##VAR_TYPE=  INDEPENDENT,   DEPENDENT,       DEPENDENT
##VAR_FORM=  AFFN,          ASDF,            ASDF
##VAR_DIM=   8192,          8192,            8192
##UNITS=     SECONDS,       ARBITRARY UNITS, ARBITRARY UNITS
##FACTOR=    0.0002768,     1,               1
##FIRST=     0,             0,               0
##LAST=      2.2672688,     0,               0
##MIN=       0,             -44362,          0
##MAX=       2.2672688,     35989,           0
$$ Real data points
##PAGE= N=1
##DATA TABLE= (X++(R..R)), XYDATA
$$ [...]
1938A043j385j336J993K83k107P06J871k090K51J720q02p88J556q62r71J658J64
1955I04j414Q06J169j796k40K290r54j738J434O31j767M44J102j592J21J400r41
1972a41q07J518m80j037R34K08j428Q01J134j321m10K013r29j259J301P44j659
1989h18N52J367j529j94J383r38l59J137o21j104J531L4j896J083J327j486m27
2006i58J794o17j435J642J55j523R72Q09j061K93R23r86n8J179o62j139J267M11
2024A006j520M59J290j467m69J790j009q95R86k79p14O09M62r93L64P69j173l89
2042a173J433l46q13J281K26j685M62J488j080l51J542p75n58N91k86l12R41R2
2060F77r73J93P00j115M32Q68p58q51J376j0j501N53J174j039l67J126p19k64
$$ y = [1043, -342, -1678, 315, 598, -1509, -803, 1068, -1022, -771, 949, 147, -641, 915, 53, -918, 740, 904, -510, 296, 1465, -331, -571, 1719, 765, -973, 461, 1092, -675, -231, 871, -721, -600, 800, -141, -948, 570, 90, -947, -13, 195, -1233, -432, 702, -619, -1029, 984, 55, -1204, 97, 841, -818, -266, 1101, -428, -622, 761, -177, -536, 601, -20, -1124, 407, 441, -1455, -372, 955, -531, -958, 836, 219, -1216, 426, 581, -942, 30, 839, -222, 71, 994, 8, -50, 1129, 467, -672, 595, 1006, -514, -55, 1235, -232, -701, 1089, 80, -815, 171, -108, -822, -213, 249, -744, -380, 389, -784, -1173, 260, -86, -899, 382, 608, -1077, -615, 873, -207, -558, 984, 209, -349, 242, -44, -356, 585, 677, -296, -103, 597, -518, -86, 782, 24, -827, 549, 539, -962, -409, 765, -274, -641, 485, -234, -498]
2078d98R27k8o11P89J29j343Q21O77j153n4J787j222j161J338K79j484O93Q82
2096G68j372j34J162q83k86J069n85r11J072L38j644J267J191j684k87J556n63
2113G4p39J509P4j395N27Q73j074Q4J008p89l06J110r00r66J659O0j547R18Q07
2132I87j989J35J622p46j132J447J46j404L61J204j352M23J233j502j24J595p02
2149B02j012J603L42k037N94J622j896k24J874q45j669J539L98j057P23P31j725
2166h37N48P76j072k79J459m43j112J642j48j616O89J838j527m86J587n41r68
2183d90Q84L20j011J13J087j201R0J176j313n32J666l54j989J856L98j934O49
2200e85J558j416o26J500l67j020J024K74j027P59N41j128M47J474j579n23J884
$$ y = [-498, 429, 401, -210, 579, 708, -635, 186, 863, -290, -344, 1443, 221, -940, 398, 677, -807, -114, 768, -604, -738, 424, -459, -745, 324, -261, -1172, -100, 238, -1406, -139, 1052, -632, -919, 637, 74, -665, 844, 918, -477, 50, 923, -151, -67, 941, 152, -154, 956, 56, -910, 749, 809, -738, 180, 987, -1002, -867, 755, 9, -1123, 324, 470, -934, -573, 631, -721, -298, 935, -567, -691, 904, 202, -810, 793, 1135, -902, -308, 1314, -582, -806, 1068, 223, -1446, 93, 491, -566, 157, 888, -837, -289, 487, -585, -864, 595, 152, -960, 682, 534, -1082, -393, 1445, -82, -568, 1019, 478, -490, 394, 714, -297, -184, 903, -298, -208, 968, -345, -877, 789, 435, -1554, 302, 700, -1234, -585, 973, -443, -1069, 431, 64, -956, 68, 342, -685, 74, 615, -513, -66, 1408, -171, -694, 1190]
2217A190n83j427J119Q28j424k9J536j071q30J325k17j085R66r2j022Q33P28j501
2235g56J08J371j080p34K258o63j520J031J377j820k21J519q95l37N64k47o98
2252g43J037J26j331J149N67j666J80J988j208j133J513j04j445P62J081j389
2268f16RR99p41QJ040m74o24J089jj690J221P43j768N68J423j193q56J503l5j193
2288e88P27L15o23k53R76p01m27N72m30k54O77P5j375J282N55j179K73J318r22
2307A8p86J126K13r48N61N79j116J58O38m81j52P57m18m44J153l70j382Q16R51
2326H73j286l15J310p49o93J073J08o78K38O51r45K07J066j095J17J061p55q59
2344f71J389J6j415Q51O76j177l08J130k30j136R93P0j092N60M70q50L59R54r44
$$ y = [1190, 607, -820, 299, 1127, -297, -326, 1210, 139, -691, 634, 417, -668, 298, 206, -816, 17, 745, -756, -648, 723, -357, -1091, 1167, 504, -1016, 15, 1392, -428, -649, 870, -25, -362, 202, -45, -743, 294, 420, -911, 238, 805, -861, -681, 1307, 99, -1034, 479, 375, -1070, -308, 773, -616, -607, 392, -349, -341, 699, 225, -399, 690, 689, -1001, 220, 963, -805, -237, 1186, -7, -863, 640, 605, -588, 139, 454, -169, -422, 554, -147, -574, -2, -432, -686, -9, 66, -1309, -27, 528, -651, -378, 940, 18, -768, 358, 571, -377, 184, 763, -353, -195, 443, -38, -190, 567, 149, -295, 858, 488, -894, -78, 873, -413, -728, 582, -167, -860, 213, 321, -357, -119, 532, -413, -206, 860, -235, -118, 943, 188, -671, 718, 734, -681, 170, 846, -331, -639, 491, 261, -875, 118, 188, -904, -344, 126, -724, -365, 589, -355]
2363c55k12J318q03r42J370P0j023O52Q50j173k30J452m28j000R34J19q31K68
2381C6Q52j339N08P53j184K2J116p35q33J039K33j267L06J140j102n9Q54o07p1
2400c38N41j01p71O93N26r55N41N35p80k63J293p79n63P08L17j418P93O86r37
2419b72J00Q66p98m52N16K31p39N14K74q45J77Q62o07j65R39m58o30O72O25j178
2439c68N67J58m45j26R67l79n93O39m43l46P01m9j094O70N10q57K1O70j68q34
2459g99R34J85j049N80P41j083K73M18l57n9P92n40o50J031J11q62M80Q45j110
2478a19j07O75k34j049J642l63q52L66M92p75J46P03j150K16O74l18n54J083M4
2497E20j512R52P94r51k52J087k35n20N81J39j013L89N27q25K98L65n94J54N74
$$ y = [-355, -567, 751, -52, -994, 376, 446, -577, 75, 925, -248, -478, 974, 546, -454, 480, 599, -232, 36, 888, -451, 57, 810, -374, -352, 764, 29, -804, 235, 468, -799, -493, 647, -455, -514, 340, -267, -338, 203, 102, -669, 24, 550, -405, 136, 671, -109, -372, 921, 142, -421, 287, 604, -814, -21, 665, -272, -172, 694, -104, -556, -40, 191, -548, -34, 240, -605, -428, 434, -173, -338, 601, 143, -487, 185, 810, -368, 199, 357, -88, -214, 753, 374, -219, 420, -23, -369, 332, 283, -811, -141, 369, -488, -467, 203, 35, -799, 135, 320, -729, -149, 592, -491, -218, 200, -157, -216, 576, 36, -614, 417, 528, -334, 146, 991, -119, -226, 449, 215, -834, 808, 445, -407, -41, 451, -324, -178, 525, -625, -409, 265, -53, -607, 476, 520, -992, -40, 754, -197, -449, 638, 403, -117, 464, 603, -410, -21, 506, -319, -21, 344, -250, -96, 478]
2516D78m70o65J017j23r62K92R28q61r2O61k51n65P94l2m37K86L95r34M44Q92
2536G95j000q9J352p21j064J180L62j467N47J250j274m45J000m26o10Q66j53o28
2554e25N13L60j036J71J205j054l50J104j08j118J013M42q31R6R69q02n75J017
2572D91j29q19Q01J46r46M99M85r92L26R91j084n71J515m27j123J023O58j177
2590c33j48J126o67l61Q77m40o03P59K99q74N60O76j352J41J163p66p53J138P0
2609E12r16J95N80p39j76J187o34n08R72o46k55M68R2r03P24M18j076nJ185l08
2629A67p35R39J04j049N66N55l43l62O67l42k21K79n2k59O10r2r68O52M05q92
2649c71l2J020l40j012O05M92q60L07N17n32n9L42n46R1P68m72l47Q65j55q80
$$ y = [478, 8, -657, 360, 237, -725, -433, 495, -366, -458, 203, -48, -613, 181, 149, -288, -2, 393, -541, -97, 795, -205, -294, 1058, 337, -727, 453, 815, -652, -105, 1145, -129, -574, 426, 0, -610, 256, 103, -525, -12, 348, -688, -517, 688, -366, -716, 388, 280, -838, 175, 617, -214, -118, 851, 49, -526, 491, 362, -457, 344, 490, -456, 43, 528, -464, -138, 853, -231, -802, 713, 286, -837, 186, 844, -333, -481, 645, -22, -383, 494, 54, -549, 210, 509, -365, 195, 871, -481, -340, 823, 57, -696, 442, 512, -404, -209, 371, -368, -544, 643, 9, -499, 473, -173, -428, 40, 132, -771, -47, 371, -705, -710, 475, 167, -568, 371, 475, -574, -8, 547, 204, -158, 509, 167, -54, 225, 173, -86, 524, 432, -536, 116, 521, -371, -403, 617, 277, -735, -130, 362, -498, -191, 326, -206, -265, 77, -469, -378, 390, -82, -429, 436, 281, -599]
2669e99K52J038n75k70O18n08m48J77P86p18K61K96o65R1P24p63j11O99l38m14
2689d67J002j47j123O13Q35q84J8O59l44l66N79O6p36O66j14n11L19K96m47l25
2709d11P28m97m53J018n3p80J62M98p09o5Q70m51n07O97J41n27L15J06l36L80
2729A26K74o99P6P50m33n04Q74p3o85M03N54p09j82P03m12m41N27K4m27N02j53
2750I5p61N43O79r83N02L68o65n40R98j7o07M45L40n37m9M46r4l55P01l60n08
2771c59O13q4o12J49P41q90o1Q27k44l87L65K94o65K44J75l28P3K55l10R1M38
2792C25k79m06P46O6q04N77R2j95m62Q99j45q35P49J27q30M80P8l65N2L64m81
2813b47j47M67l70j98N27L16q19L53P66j013k40J040l41o21P42J09m82J69L20
$$ y = [-599, -347, 691, 116, -154, 464, -44, -492, -315, 471, -247, 14, 310, -355, -264, 460, -303, -414, 285, -53, -467, 535, 388, -735, -122, 713, -171, -153, 506, 162, -204, 375, 441, -295, 371, 257, -254, 65, 361, -86, -411, 317, -180, -633, 385, 332, -448, -286, 212, -497, -562, 308, -143, -650, 47, 188, -339, -24, 82, -254, 126, 400, -299, -223, 527, 94, -410, 464, 391, -294, 109, 663, -46, -228, 475, 63, -378, 149, 173, -254, 248, 95, -666, -123, 556, -427, 75, 443, -222, -762, 236, 219, -388, 57, 397, -140, -189, 257, 163, -192, 509, 149, -359, 254, 170, -442, -293, 448, -442, -503, 324, 80, -307, 58, 352, -313, -69, 106, -222, -149, 106, -204, -113, 325, 46, -360, 386, 452, -352, 225, 317, 122, -340, 559, 414, -421, 328, 455, -375, 105, 183, -182, -130, 234, -247, -394, 73, -297, -495, 32, 348, -471, -118, 648, -365, -605, 435, 94, -527, 215, 324, -158, 11, 331]
2832C31o13L61L77n31q9M54n0p68P78J11o86K59O59r05MO89k54m10N44J01p97
2853d35N00K43k86r3L67o23K25O27k65p07Q74m7n44L1L59j28n34N91m42K8J67
2874i2K46m14J0M26m83J32M38n11j4M42j00n60M95L01n73Q8P02n22k77P55l49
2895A40k98M20k6k83J0L41l20l1L61l62k82Q11l50n72L90M33r98K48L59O7k35
2916a77K27j43k16N58j17n28O85j58o60O72N70j030j75Q55k12n36M95J62n00K34
2936FJ48m85M0M54q3j43N13m11k84M84M32p74n3Q18p01l81P70Q5o26M10K86l15
2958A90m22M37k25K43K41k76m86N88k01m17M31M30q38r7O58n95p5J73L99o86M77
2979e1J84l97j27O54m29Q4K99l67k36R37n30m37L73O25m34n12R44m88m96N14R7
$$ y = [331, -282, 79, 456, -75, -164, 290, 240, -528, 250, 361, -325, -66, 593, -312, -308, 381, 127, -283, 261, 362, -435, 65, 308, 22, -71, 296, -327, -102, 525, 260, -447, 427, 380, -164, -133, 226, 98, -436, 155, -287, -259, -92, 154, -260, -250, 176, -307, -175, 263, -248, -262, 180, 80, -480, 15, 316, -257, -169, 533, 11, -266, 489, 140, -158, 262, 236, -47, -37, 304, -16, -47, 314, -48, -330, 481, 131, -441, -51, 382, -616, -368, -9, 58, -177, 50, -93, -309, 249, 132, -396, 289, 131, -529, 143, 713, -317, -492, 363, 151, -385, 110, 272, -228, 6, 154, -331, -291, 163, 80, -63, 450, 39, -245, 239, 671, -103, -156, 662, -39, -420, 350, 435, -191, 219, 505, 190, -232, 205, -20, 223, 464, 188, -298, 290, 89, -328, 103, 533, -305, -402, 256, -339, -414, -241, 158, -528, -51, 133, -264, -391, 263, -166, -82, 217, -150, -386, 551, 21, -416, -43, 582, 148, -364, 580, 92, -404, 110, 207]
3000B07k92K64j4l40L0M28p06M06J99l84j49P51j48m23N6P31o64k92O20k74k85
3021b79N82j22j05J34J62n08J69K57o75L14M07l76l89M53l5p1N1N00q19r5M38
3042gP4o03L63L07k68J20n5M1R3J92k79K8L67k38n04M47N00r24K23K97k80j29
3064b35N31j15k47J98lo13M88K22n76M25J48p02J69O01l37m54N36K77k63j32K61
3085A79m6NM5l63J4M37n02L06J86m09K23n4M5k12j88N27j87l59L81O3l31N9J97
3108A6m8l6J60j74J55J01l26J91L00K3l93l4M42m43n4M75l47k21L66k42k10L26
3130B7J36m03K98J76m15q3L56k58q3L51j50l74K94K45l81N6K53j4k35M36k24q1
3152g3L2k3K9J76K3k41P4K46k19l11M96j53k60K09K21m51k89N11j01k08M94k99
$$ y = [207, -85, 179, 165, -175, -145, 283, -423, -17, 182, -202, -351, 400, 252, -171, -115, 616, -48, -340, 280, 6, -279, 303, 181, 76, 210, 372, -136, 33, 290, -385, -71, 336, -40, -429, 24, -11, -82, -31, 469, -350, -445, -7, 67, -536, -173, 134, -134, -14, -69, -28, 65, 257, -22, 6, 373, 135, -369, 78, 578, -346, -123, 174, -106, -235, 296, 181, -66, 132, 129, -484, 4, 226, -350, 75, 223, -479, -310, 291, -46, -500, 36, 313, 50, -82, 179, 133, 138, 183, -180, -166, 271, -231, 75, 261, -148, 75, 21, 66, -146, -334, 193, 6, -353, 28, 91, -240, -181, 16, -32, -68, 92, -82, 73, 174, -152, 39, 339, 362, -31, -65, 377, -66, -120, 355, 8, -213, 153, -89, -299, 27, 163, -240, 58, 234, -181, -264, 92, -166, -249, 102, -48, -422, -128, 117, -264, -208, 45, 31, -204, 232, 8, -73, -41, -64, -35, 141, 164, -77, -3, 243, 24, -287, 209, 56, -204, 5, 226, -225, -514, -3, -104, -312, 182, -117]
3174a17j48K4M15l68L74K7n73M62jJ2j49L31j70p03P45K81n28j10O85l73l29K58
3196D5N6m50L81j8l25L67K16o09J28N62m38k42P62k56k73M0M77l30P3J6k32m6
3218i6K77R9n29M35j02l13L53M4j90j87M46J10l52J36j51l46K50N28n00l19L93
3239a4M5l61M25o5m28M49J20n59J88O86n88L8L20j1l54L75p1n25L37J62k33j43
3261b07M04j63l06M17k71r6N09k03k07J3M2M1k87M01p6l76M43J28q5j63K51k06
3283Ck11M27k44n6R3O3l02L48K22o55k8M25j53l07O28L3n18P6L82l04o8K71k70
3306a45J3L43l70k84N57Q7m69L65K63n50r9P49k96m62M62lr3J90j14k41P1P0k99
3329b55J63J01j15j95L18Q7m99L76K47n74K02K80P6m39M07j46l11K61p2Q4j31
$$ y = [-117, -265, -241, 174, -194, 180, 207, -366, 96, 95, 107, -42, 289, 119, -584, 161, 442, -86, -196, 489, 116, -213, 45, 101, -349, 32, 14, -311, 56, 272, -337, -209, 353, -85, -327, 435, 179, -94, -54, 423, 93, 166, 182, -50, -96, 181, 280, -249, 186, 84, -229, 124, 168, -22, -209, 237, 347, -5, 131, -20, -366, -116, 412, -88, -407, -14, 31, -330, 95, 30, -398, 51, 171, -388, -200, 486, -102, -64, 256, 245, -109, 266, 195, -330, 7, 169, -64, -207, 197, 34, -272, 145, -126, -222, 287, 84, -123, -110, -68, -27, -314, 87, 11, -365, 78, 206, 121, -42, 209, 3, -208, 219, -25, -81, 12, 75, -227, 121, 343, -312, -340, 85, -68, -375, 253, 286, -232, -156, 226, -78, -146, 125, -145, -132, 211, -159, -443, 114, 201, -268, 97, 360, -190, -289, 460, 164, -298, 164, 161, 68, 258, 144, -97, -26, 44, -255, -92, 9, -106, -301, 17, 104, -395, -19, 228, -346, -144, 136, 212, -227, 180, 34, -277, -16, -88, -4, -135]
3350a35L49l13J99J43m33L3N45k94l44M75r8l51k00O65j73k12J28K3l35L27K21
3371B20p12Q05r4n22L21M63l51l09L08k21k92O22Q9m97J80J0k3k12M02K6l46K37
3393A04k95j30K02L78n17P8L60k53l35M88j56o6N9M39n07J46Q4N0k11K74k16n4
3415g8K82j57j40J82L33n16J74J01J33m21K6K12m87J81J87k27J96J59Q5m11M75
3436B89j31l31Q1M17m60M57j51k63K70l1J08l47L13k92o1K63J15k59ML17m91J37
3458d6k27L7K21J13k84Q3k2K43l54l5P36o43j93K47K76n7L20j82k81K81Lj12k53
3481a29K55m7j84L20l00p3L21J22n18q7M19l83N6J37l9j86L03n3j07P7J36m10
3503c70N41K60j64m85K94j22k2K27Q3n44K69J03J06k51J8J63l75K98m6k04L22
$$ y = [-135, 214, -99, 100, 243, -190, -157, 388, 94, -250, 225, 127, -224, -424, 241, 68, -144, -16, 7, -328, -1, 220, -492, 313, 219, -303, 18, 481, 130, -179, 129, -92, -384, 238, 327, -170, 10, 20, -3, -215, 187, 213, -133, 104, -191, -321, -119, 259, -258, -180, 180, -73, -408, 80, -76, -142, -83, 356, -151, -5, 79, 129, -82, 192, -24, -78, 204, 47, -93, 89, 422, -94, 80, 181, 314, -107, -81, 131, -356, -175, 12, -215, -19, 140, 225, -186, 289, 158, -173, -92, 325, -135, 322, 171, -92, 178, 147, 255, -92, 221, -71, -132, 131, 246, -13, -9, 308, -183, -46, -273, -236, -15, 98, -186, -103, -125, 118, -236, -271, 465, -178, -371, -124, 152, 95, 415, 233, -48, 233, 236, 124, -129, 126, 79, -105, 215, -85, -158, 163, 285, -233, -320, 99, -284, -228, -91, -130, -316, -13, -66, -173, -96, 40, -370, 171, 431, 267, -218, 76, -46, -68, 159, 242, -302, -33, 70, 176, -75, -57, 106, -269, 29, -17, -221, 101]
3524A01p6l81L22L31l36m67O50l6m79M47J19j35j87J86o2J30J94l36m2M60l21
3545H2KN8P8l34o9K28j10j70L26p5l42J97L03l07j87M71j01k57L45j15k73O50
3567D00l85l40M74k5l01j1M55j93j49L16Rm75L54P7o0k79K50j31j78L95m67K90
3589B6J0k2m00L50M70o83rL45l73QL97Q0l84j2N20m37k30M39k72L9L26j68k83
3612b63M14J14m35J27M39n17k65O73k45o6P2J64l97M09j2m47M84q5k92J6L24j03
3634A09l48N28j12l73L12J02j93j01K17Oj81K10%k97m4M80l77r9K72m60J04L72
3656A27j05m5J20%m48J07M81k81j73L53J97o76M86j75K32l39M24l84J45K51l08
3677a1j30K68j54j08K56L5m17J8N81o14k1L44m04K69J48N0k31N9L02l56m7N53
$$ y = [101, 25, -356, -34, 297, -39, -506, 144, 108, -371, 76, 195, 60, -127, 59, -3, 127, 321, -15, -57, 403, 82, 84, 142, 220, -114, -183, 45, -65, -235, 91, 16, -326, -129, 174, -133, -320, 151, 50, -207, 138, 23, -250, 400, 15, -325, 149, 124, -177, -188, 267, 74, -75, 241, 250, -225, 129, 206, 146, -133, 117, -14, -192, 203, -264, 26, 36, 14, -386, -36, 434, -249, -258, 87, -286, -278, 119, 199, -185, -197, 323, -114, -344, 95, -177, -138, 188, 20, -263, 151, 265, -170, -43, 396, -121, -386, 287, 42, -24, 48, 212, -185, 224, 212, -235, 249, 164, -128, -112, 212, 109, -239, 289, 177, -196, 116, 218, 25, -76, 141, 147, -34, 176, 176, -121, -165, 315, -62, -161, 111, -349, -245, 127, 22, -23, 97, 97, -351, -244, 237, -44, -217, 136, 333, -343, 143, -32, 200, -139, 285, -99, 46, 297, -11, -141, 127, -27, -135, 121, 156, -261, -243, 338, -276, -297, 47, -357, -88, 60, 110, -121, -62, 240, -116, -163, 390]
3699C90n25k7L41N8l71K65K81o53K63K9K06m38L76L9m40P9J54l3NJ11k60J3L81
3722B44m08p0K68Q1j14k10J73J06k06L14j65K06j88Q4l02K51K55l89K27n6k33
3743a32k39Q26n43q3K73kk75%K56j04j19r5J76q2K79k07j62J7M22o46N45J60k58
3766Gj94P01m91j48K61q8j1Q3k8j43J30j11j62l9M18l17QM17j60j69j34L14k01
3789e7L9L56l92j93M00m27J36J65J63l69J57L68n99L23M67o05PJ08k7j95J86L14
3811C25n95K1M06j62l0m3L46m24jq9q8M63n8o2m4k43L60m30P21j05n02K65K65
3834B96l24M0J34j91J00J01j57J17K9J37k77j9j55K26k06L42j82k28J69j39j30
3855c17K17K45k21J76L6j45K2J17JO1K64m85q3K31P2j38j37J52j11l04K07M80
$$ y = [390, -135, -162, 179, 237, -134, 131, 412, -241, 22, 51, 257, -181, 195, 234, -206, -127, 27, -6, -1, 110, -150, -137, 244, -164, -234, 34, 115, 1, -209, -36, 70, -136, 178, 13, 219, 31, 115, -187, 64, 319, -70, 157, 101, -132, -371, 455, -88, -171, 102, 100, -175, -175, 81, -23, -142, -237, -61, -143, 136, -71, -233, -216, 206, -440, 105, 265, 7, -187, 514, 23, -125, 136, 48, 37, 120, 92, -51, 79, -32, -194, -233, 185, -132, -124, 293, 133, -36, -170, 144, -57, -18, 338, -54, -247, 153, -274, -138, 27, 190, -179, -22, 346, -253, 70, 537, -68, -61, 47, 20, -175, 11, 325, -270, -249, 157, -5, -35, -78, 268, -156, -157, -246, -334, 129, 71, 9, -35, -278, 82, -348, 373, 268, -234, 31, 296, -28, 12, 146, -45, 55, 156, -1, 116, 145, 282, 5, -14, -169, 57, -149, 193, 11, -217, -48, -187, -317, -100, 145, -76, 100, 136, -9, 13, 130, 131, 192, 456, -29, -112, 119, 191, 53, -84, 68, -43, -347, -140, 340]
3877C40o35K46M24l83j13K35k96J0M77k97j22K35K5j54j26L54l80J54J77j70l81
3898c80N55j12j26m8k4K2l3L21l12M9K40k68N2o6K61l55J31J43j44K72P0k32k44
3921b28J58J67k2k19R4J78r3j63J39K5K59k16j40J34J39k78K03r4j99J27J11k34
3943a52k2L82ol20j43J76J37k01J13j02J79J07k47J13R8j2l27J81J49k31m8J88
3965A2K58m60K15P9j63P2J34m09l7M16k72n6M47k42l90L70p5j59k9K65n1k40O89
3988C74k50j76Q8J44l50L62K4n90J15L70j95L39Q8j27o12N47o1l98J20M06j68
4009E0k83J54Rm03M64j29J40j13L83l52N1J31j53K3q0K05m35N50l45O0K6J76m11
4032b82J95L03k84k17L40J02k85J79j21k30L72J61m48k39M31k10r4K55J14l95
$$ y = [340, -295, -49, 375, -8, -121, 114, -182, -172, 305, 8, -114, 121, 146, -8, -134, 220, -160, -6, 171, 1, -380, 175, 63, -63, -111, -135, -113, -146, 175, -137, -88, 152, -116, -64, -130, 131, -224, -93, 50, -94, 178, 248, 16, -228, -70, 97, 75, -144, -50, 128, 35, -128, 11, 36, 295, 79, -61, 73, 212, -66, 137, 43, -156, -29, 82, -152, -174, 208, 202, -118, -261, -85, 52, -149, -36, -138, 41, 148, -99, 14, 112, 100, -227, -46, 103, -128, -176, 12, 270, -190, 25, 104, -59, 13, 147, -262, -299, 117, -155, -211, 236, -6, -396, -26, -101, -260, -289, -24, -75, -315, 374, 124, -52, 36, 180, -170, 192, 216, -374, -259, 111, -84, 255, 343, 216, -396, 151, 90, -308, -188, 218, 50, -233, -79, -70, -473, -9, -138, 2, -111, 272, -80, -29, 102, -51, -28, -108, 97, -338, 212, -133, -73, -47, 129, -282, -87, 216, -68, -285, 55, 157, -128, 51, -70, -300, 72, 233, -215, -454, -23, -233, -327, -72, 42, -353]
4052c53P4K17J09l3j01J68j81N7J52j61J8P7k29L41L4j22j99L05o3j13Q9k69O
4075a77J30N9r0n3L20j15j60Q3Q6k06J4M01n63K28J12j52J33K31j68o1J11K13
4097C76o63L01J94k67j3N81p97L61j12Q9p9q7K73j16J1k1J75k19K27k84Kj1L85
4120C06k82j62J05j0O3K17k38nJ82j59j43J28J09j39O4k30K13j91R3J99j58j56
4142a94P9j71J67N3j86K91J51k20O0J10k77K08j72K31o7J0j59J05j10M0O8j44
4164a27K01l7l32K08J08j18J8Q4Ll14M81o8o1qJ18j98O5J78l45J01K50j70l9J02
4188A00k44J18L35m75m5K98K38k83p1k3J07j46J01k7j99J35K89k03n1j40K3K07
4210D4J92q7l34K72q8l07K25L18j82j11L09j38j05J26J33l68j14P6J91k7K39j48
$$ y = [-353, -279, -62, 47, 14, -87, 81, -100, -43, 109, -52, -34, 43, -186, 155, 189, 67, -132, 173, 110, -3, 86, -183, -177, -47, 12, -78, -131, 189, 74, -86, -3, 83, -123, -109, 292, -271, -43, 69, -83, 50, 281, 113, 52, 163, 376, -287, 14, 208, -59, -72, 509, -288, 73, -39, 50, -29, -116, 157, 41, 52, 31, 206, -13, 214, -70, -68, -79, 306, 24, -138, -33, -43, 20, 237, -1, -6, 176, 17, -126, 2, 111, -28, 36, -194, 19, -172, -79, 120, -38, -194, -115, -286, -119, -66, -252, 39, 190, -30, 30, 140, -137, 71, -101, 130, 63, 73, -86, 19, -91, -51, 17, -127, 74, 37, -295, -87, 21, -97, -79, 5, 8, -306, 175, 107, 46, 38, 156, -42, 23, 201, -144, -43, 207, 37, -2, 100, -144, -26, 309, -166, -211, 87, 325, 42, -29, -52, 55, -91, 10, -17, -216, -81, 208, 5, -46, -186, -163, 44, 236, 149, -185, 87, -1, -308, -83, 235, 53, -58, 251, 113, 8, 134, 267, -101, -215, -139, 52, 25, 264, 116]
4232A16k11J90k84k8K06P5n38N60J7j26j12J95J35n98K71M61k77j42K54r8J47
4253B13j25o0N2q8q5K85MN8j08k17K74j07p8Q7r4qQ8o1K6%k03K4J89J39j63k10
4279a68O0K83J26n50M70k34j43M67l25j34L52j86Q8k3J19l14K03J12l78K20L3
4300G8j36k38P05k60l56M48l96J38k56L26j00j10R9K7p7J99m2m8J12j21k1J95
4322A66J62j26j37m0J12p9k08K17k02P6J48j54l0j2J40N9M8l49J21rM5m9j41L98
4346A56J10l54K19p7l48K45L08k2k45P7R0L9k11L4r5K44j44K69m02QO3J45j11
4369bj47j18L55j85j14o2K63l8j4J11m18N99j09J69n57M82J03l25k00m0%K97J26
4392A76k30n5J49p7nJ8J75k35K06j4j24Q3oJ53j39J17j1m97K01J75l7J29Q1j94
$$ y = [116, -95, 95, -189, -217, -11, 64, -474, 86, 103, -23, -135, 60, 195, -403, -132, 329, 52, -90, 164, 66, 213, 88, 28, 80, -8, -93, 192, 196, 254, 146, -71, 203, 96, 18, 105, 11, 3, 91, 30, 56, 56, -147, -123, 66, 205, 42, -168, -108, 175, 301, -249, 221, -13, -156, 311, -14, -148, 204, 18, 106, 83, 202, -112, 91, 203, -175, 45, 78, -58, -296, 409, 149, -207, 241, -155, -17, -273, 53, -47, -157, -58, -31, -108, 91, 49, 1, 113, -8, -29, 166, 328, 202, 65, 25, 137, 58, -150, 67, -135, -59, 89, -65, -95, -107, 33, 92, 140, -209, -88, -97, -52, -101, -242, 156, 266, -88, 131, 54, -294, -49, 259, 237, -8, 69, 159, 198, -13, 21, -74, 170, 26, 295, -107, -99, -36, 109, -2, -149, -267, 88, -97, -211, -273, -10, -48, -62, 49, -369, 230, 121, 290, -267, 215, 318, -7, -207, -247, -247, 50, 176, -54, -109, 40, -37, -42, -24, 151, -84, 122, 108, -16, 67, 61, 214, 75, 192, 181, -316, -115, 60, 23, 152, 233, 39]
4416C9mK3ol34K06j98O3J23L22k39j40K47j93K6m0L47m60Q1L83n27K79m8L5m9
4440f4N9K33m01M7O2j9N1J97k43J52j37m4L1K46l03P8J00j00J13m38P78j50j00
4463A48k78P0L57m96N36m57M6K20j16j61K79L4k08K05k29N5k00M53k91R8J25P
4485A97l96L08j20j42Q4lk8K34R3j11k21k19M08k09k1Q9k08L41j04k1K01m4Q1
4508A89k68J66p9j08J5K80j24l65N89k15k57M9P1L6RN8o8k1N0M9M0j19k52L20
4532D5K01k75K0K1R7k75K16L07l17r9j32J68n1P4J84j78j9N4p5K21j12J08o4k04
4556h5QJ36m9K11l34kJ44k97K54J33j11r7o9J18j59K10p1j41L52nO2k22L4O2j46
4581f4J00K50m20kJ05K03K38l47k58n0J24Q1J5j41J80j04M8J47k58K90kj03l4
$$ y = [39, 35, 58, 52, -282, -76, -274, -211, -88, 234, -5, -145, 102, -91, -65, -105, 242, -218, -137, 246, -281, -2, -50, -15, -64, -5, 228, -173, -126, -64, -83, -32, 165, -78, 74, -63, -107, -76, 170, -133, -55, 45, -55, 58, -380, 398, 248, 148, -130, -60, 297, -199, 337, -120, -74, 146, 30, -131, 148, 182, -26, 179, -50, 5, -195, 258, -33, 65, 190, 197, -199, 109, -11, -153, -69, -72, -100, 134, 227, 116, -105, -324, 84, -125, -146, -57, -265, 76, -28, -49, 152, 108, 189, -79, 87, 8, -100, -85, 195, 71, -294, 295, 80, -177, -128, -57, -21, -12, 46, -22, -43, 7, 56, 96, -23, -275, 45, 246, -29, -9, 12, 109, -166, 50, 357, 40, -59, -191, -23, -74, 0, 184, 6, -13, 41, -34, 187, 75, 183, 119, -85, -77, 59, 10, 221, -113, -115, 29, -268, -14, 119, 8, -89, -158, -40, -199, 11, -60, -201, 151, 146, 208, -14, 20, 82, -64, 36, 286, -134, -136, -31, 172, 410, 63, -195, -245, -121, -40, -25, -166, 14, -90, -42, 105, -153, 137, 135, 32, -2]
4604bj1J58m22K01L01k30j16K85N3j05j41J4l5K1K15j41j74J97r0m29O2M84j66
4627g1K44k41K9J45j66j04N0nJ79k18L85Nk30J88N9n52L22L5j99N0J13J87r5q4
4651B6L50l54j32k0R4j11L17k40J92P2k70j98K98J10K2j78j49L39l72L63j85J20
4673I4QO6k77J94j50r8K44p9o7M1J73k80N0P8J17k34j63L65r2M0p9k7J1K12M0
4698A87l24J52N3j20O4m7J60q2L8jj12j0O4p5J27J43l4n9R5j39k19pJ62M5L6l07
4724b10K92k85K49k39k2L26j47K9Q3J55l68J91p6L66l80R2j3l4R7k0Kk60J35o5
4748a02J71n8j0Lj9J11k7j88L66k13m89L35L27l48L6J45J4J08n8nK00j78k5r7
4772ak1J20n7R1M7k92J37p6p1o5k2K54j83M25m75K60q4o1jl2q6J46J89q9L7j16
$$ y = [-2, -13, 145, -277, -76, 225, -5, -121, 164, 217, 112, -29, -15, -50, -29, 186, 45, -129, 68, -22, -451, -389, 95, -71, 173, -68, -39, 106, -60, -164, -114, -119, 60, -158, 227, 232, 2, 190, 249, -303, 19, 54, -145, -95, 18, 205, 110, 26, 376, 22, -110, -130, -36, -147, 170, -70, 122, 194, -76, -274, 24, 134, 156, -22, -171, 168, -204, 159, -26, 94, 102, 168, -109, 85, -65, -163, 81, 2, -65, -24, 149, -131, -81, -3, 114, -120, -283, 82, -10, 30, -49, -76, -65, 147, 187, -137, 15, 68, -52, 12, -35, 125, 43, 81, 80, -32, -42, 22, -53, 74, 217, 183, 124, 219, 80, -139, -146, 16, 61, 97, -210, 82, -203, 46, -193, -215, 111, -36, -7, 76, 231, -137, 54, -22, 344, -36, 56, 43, 9, 106, 86, 88, -172, -37, -102, 69, 11, 1, 4, -15, 96, 69, -119, 247, 34, -455, -120, 207, -141, -105, 40, 54, 162, 104, 99, 299, 121, 96, -1, -22, 98, 41, 132, 179, -113, 24, -52, -123, -188, -210, 44, -139, 286, -189, 71, -13, -74, -75, -107, -193, -47, 142, 53, 90, -26]
4798b6L26M9n42L5L89k52J19K55k54q7r7K45k16K14K5l27J34J72k95j57M75j59
4820B6k29K80k9k70J14R9J32Q5k60J8n5J94m51K50J88K30k00p1o1nJ41j02n7N2
4844A9j2n1K60Qj97j20m3Q5N4J69j30j88J80j52n3J02j06K14k69L56k45J57M9
4867H7j40K63k36J51j0J6l81L29Rq1R9j15j03M1K39l98O7M84m02L9R3j40j24J79
4891c4J20j33o3J01j29J80M03m67k5L33l49j50J10J00n9J14J16m90J96Q3J54J06
4913B17m81L54j15L44k29k44k6L65j74j37J74K71m11J49N1k01K67K6l68K14J27
4934A73l61K11M6k53J50K6J27o7R1k78J20l12L59K6l01M10k62J79k28Q6J77q1
4956C8k8O0k21J41K20l15L39k36p3M8K25k91J10J10j70p9N2J07L2p0O4k0j39l5
$$ y = [-26, 300, 349, -193, -158, 231, -21, 98, 353, 99, 12, -85, 160, -56, 158, 183, -144, -10, 162, -133, -290, 185, 26, -203, 77, 48, -222, -108, -9, 123, 208, -52, -34, -89, 105, -346, -96, 92, 322, 122, 51, -10, -15, 126, 24, -33, 19, 7, -44, 216, 224, 27, -93, -136, -51, 3, 172, 42, -146, 34, -118, -171, -69, -175, 39, -230, 126, -119, 38, 87, -53, 210, -26, 125, 115, 131, -250, 79, 88, 7, 106, -9, -112, -71, 168, -230, -163, 321, -81, -42, 51, -89, -213, -34, 86, -47, -110, -9, -138, 42, 445, -22, -47, 286, -63, -213, -103, -3, -62, 52, 168, -322, -126, -43, 111, 217, -264, 90, -25, 319, 90, -154, -180, 185, 11, -126, 48, 319, -92, 57, 108, -93, 174, 200, -168, 46, 173, -188, 23, 69, -184, -34, -8, 119, 52, 143, -135, -15, -327, 32, 58, -243, 167, -95, 84, -144, -58, 119, 38, 10, 70, -151, -10, 210, -105, 234, -2, -75, -27, 198, -93, 17, 127, -43, -122, -70, 37, 69, -1, 63, 43, -96, -131]
4980a31J00Rq7K10k20P3J40j11K1J78o0K56o29L36k22K71k5k57L77j9k22k62M71
5003A97k45OJ08j35L6L7J61j84n4P0J15k71R0L3R7j28k2J51j59K67j05k4P2l9
5027G4j51J7Lj3K01J62m75N7L10r0J54k17j08J83o3o3J44j89M0K11j35j51K03
5050A04j38J98Rk89L56j85j43j92K21K91m39L23p1JK17l55Q8J09k03J06l19J30
5072a81k8L61j71QOr7J58k44K10N6k89J61J53n2J24k2j97K9Q9l4p7k61K79L3r3
5097g9K21J5O6k56N6K05l21K08J06l61K68k22j5k6R0j62K84O7k92K34J73j48l44
5120b33K59M2j46m1L3K31l60R2j46K66J5j09J47n2M5Pk47K52k44J08j4M13m79
5143a61nK41j57Q8J67j76j15l9J83R3M8M0k03j25RJ28m5J58qk89P7K17r1R1j84
$$ y = [-131, -31, -22, -109, 101, -119, -46, 94, -17, 4, 182, 122, 378, -251, 85, -137, 134, 109, -148, 229, 210, -12, -274, 197, -48, -42, 66, -69, -33, 4, 165, -19, -73, -3, 112, -159, -69, -36, 61, -67, -89, 62, -97, 170, 65, 41, 113, 74, -77, -60, -57, -70, 131, 293, -182, -125, 185, 95, 249, 32, -76, 107, 44, -19, 125, -64, -24, 187, 52, -99, 104, -34, 164, 173, -116, 240, 55, -88, -280, -59, 232, -207, 116, 45, 46, 263, -92, -4, 105, -98, 8, -311, -181, -209, 152, -19, -11, -5, -102, 56, -188, 22, 78, -211, -50, 103, 51, 175, 153, -44, -15, 74, 40, -37, -298, -19, 14, -79, 142, 157, 223, -33, 23, 228, -93, 115, 221, -140, 128, -94, -109, -135, -45, -207, 77, 144, -148, 86, 259, 111, -233, 26, 68, -78, -119, -86, 145, -215, -123, -269, -3, 12, -97, 50, -2, 43, 50, -197, 55, -189, -81, -95, 318, -161, -166, 75, -82, 6, 173, -3, -118, -157, 26, 119, 167, 207, 4, -121, -112, 16, -29, 129, 121, -168, -91, 126, 35, 126, -58]
5168e8J32k4L0Lj03J52j56J00o5j1J22k24J89k93L37m30L76J47k40k11J26J46
5190D5J08o4j10J46m9j44J09J41m02J30J63k22J85N6j67JL78l27O9l4J03k12Q0
5213a7K5N7j03J85j73o0J50j9J19j15J19m21M71k30j8m9K81j77j70K3K35l9j60
5236h6K38o2k53K55kl18J85N0J5J01j05k62L52N9j86o4J6L20n88M68j64q9J78
5259E8j83J4J89J52m1j01K26l44k82N44k0k71J51r8k1P4J4j2n4J14j98n5K47m4
5283E9k11J64m1n9N4L01k85J20Q3k63J93L7k49J82k12k8K13k2k1k50M04m2r3l80
5307c46N14k34j10L51j5k39K26j41K59k45J1L8r5J02n4l4j83L24J77m43o6K37
5329C4o5M8qj00K77j66N4j50P2K5jj34L22k06k74K77r4J08j36L74j60p6K7k11
$$ y = [-58, 74, 50, 80, 83, -20, 132, -24, 76, 11, 0, 122, -102, 87, -206, 131, -299, 77, 224, -16, -227, -101, 45, 153, 89, -21, 125, 76, -68, 41, 182, -220, -90, 73, -149, 36, 92, -75, -74, 304, -23, 46, 12, 115, -97, -17, 8, 65, -38, 147, -26, -86, 64, 45, 164, 49, 168, -253, 218, -12, -30, -79, 202, 25, -145, -122, 113, 74, -86, 152, 90, -163, 92, 90, -228, -43, 7, 22, 123, 18, -244, 108, 167, -19, -83, -67, 253, -335, 133, -31, -120, 58, -125, -111, 78, 230, 189, 88, 314, -30, -312, 232, 212, -59, 92, -6, -27, 47, 61, 49, -5, 109, -89, -144, 103, 59, -152, 12, -29, -88, -34, 267, -18, 102, 185, -78, 115, 152, -97, 85, -127, -155, 58, 36, 15, -235, 169, 127, 34, -346, 168, -66, -176, 175, 160, -79, 147, 6, 265, 20, 31, 69, -26, 76, 22, -12, -195, 129, 306, -137, -203, 34, -31, 17, 9, -91, 186, 20, 74, -76, -4, 21, 20, -114, 208, 2, -272, 5, -89, 19, -117, 257, 97, 21, 48, -163]
5353a63J39J04p5J54K21m81P4rM4k3M6j1k52L03L7K9n3k36K11o4l3Q2q5m65N95
5378H9l15L89j33J7r2p7J02K07q7K4j89J55N4M1j63m2K5l37M58n1k74l7L45J71
5402B80k14Q1j40j97P3O5l07M08J9J5l82L77nk42K13O3j89J46k59K96J53l04L8
5425a2K9J20l3k95oK35R3k90M22m21J83K6J93k55j74K10l14L34j73K36j41kJ74
5448A39k13K70jk25p6M8m0m4L98l98K22o9q9L0N8j69l4Q0J28m9Q9j83M41m06O6
5473b7K01k28m3J37j91K13J32k05k57K44K2J78k6k92K22k41J47N9j23J39j89l1
5495a59J06R7k63K50j66m4J19K16Qk62O0N6k60J28R7j08K10J33j49K30l22q2j
5518a06K90k61j3j00K72o2K4P5k55j04J57Q6K4J12j38j3J18o9p6l4n3K06j81n1
$$ y = [-163, -24, 80, 5, 159, 380, -101, -27, -36, 8, -15, 31, 20, -232, 71, 108, 137, 84, -152, 59, -5, -38, 44, -41, -506, 89, -226, 163, 30, 47, -45, -122, -20, 187, 100, 124, -65, 90, 144, 185, 22, -20, 5, -332, 126, 75, -199, -236, 109, 280, 66, 147, 7, -190, -117, -52, -359, 49, 68, 83, -299, 78, 73, -169, 44, 107, -82, 64, -195, 101, 254, -50, -12, 17, 137, 104, -191, -197, 38, 131, -159, 263, -158, 25, 51, 244, -11, -185, 25, -289, 45, -128, 108, -33, -35, 139, -74, 196, 195, -30, -106, -58, -98, -142, 256, -142, 80, 11, -78, -48, 10, -159, -193, -113, 15, -34, 55, -128, 313, -93, -27, 174, -54, -97, 40, -151, 62, 194, -11, -268, -24, -2, 176, 150, -142, 80, -161, -14, 45, -78, 61, -128, -159, -53, 44, -219, 31, -135, -179, -60, 156, 164, -98, -38, 18, -242, -114, -17, -125, 85, 218, 69, 299, -23, -105, -106, 184, -77, -90, -190, 82, 20, 44, 119, -136, -240, -83, 3, 27, 139, 1, -12, 106, 37, -39, -73, -126, 80, -101, -152]
5542a52M44n00M78m32p5L43o1k30J89o9N6Q3P0R3j84J20O7j81o0J20j14R4k68
5565a69K41k53K52K07k14l25N61l77J35n0J3n4q9K72k92k5O7J71J6k67J56MM9
5588B9J63k11J90j28l4j8j71J27K56j98J30k63J04q7N4j23K00k4Q5Nj61K4Q0M7
5612G6k75J34R5q8K25l14n7J08J47p8K65l12j02K02Jk18L68l43J39j96R0J00j5
5635d8k69M1O1Q8K33j81j24J28K98j4j51k0K2n2J98m81K54K53R1l66p0J66j80
5658a23J81j85L9j8j98N49l37K06k00K91l07l2Q6MJ67j02m9J8j21m9o2M54k84
5681g2m6J23j38J64J7oo6l3J64k36l34L74j0l3qJ86j52J84j80O9J77j33j20K91
5705A82J59m43J35P3K52l75j35J85m03M0N07m01K60O1Qj34Q4k70KJ60J62o4j93
$$ y = [-152, 292, -208, 270, -162, -237, 106, 45, -185, 4, -65, -9, 74, 144, 237, 53, 173, 240, 59, -1, 119, 5, 99, -169, 72, -181, 71, 278, 64, -261, 300, -77, 58, 8, 21, -33, -122, 150, -142, -167, -100, 71, 87, -180, -24, -20, 29, 192, -19, 171, 43, 9, -9, -180, -53, 203, 5, 135, -128, -24, -111, -57, -180, 20, -4, 81, 86, -75, -51, 29, 76, -199, -65, 30, -58, 167, -147, -204, -96, 51, -27, 238, -74, -176, 26, 27, -191, 177, -166, -27, -223, -133, -33, -48, -317, -276, -215, -127, 106, -75, -199, -71, 227, 213, 62, 42, 64, 12, 210, -271, -17, 236, 327, -39, -109, 57, -123, 58, -127, -88, -106, -304, 245, -92, 114, -86, 205, -102, -134, -48, -44, 123, 21, -28, -10, -131, -180, -242, 212, -72, -118, 5, -133, 31, 48, 42, -24, -57, 107, -129, -463, -89, -99, -132, -140, 46, -106, 78, -102, -33, 144, 11, -109, 182, 341, -102, 33, 106, 358, -17, -152, 33, -370, -330, 177, -224, 36, 97, 105, -29, 55, -215, -213, -53, 109, 45, -148]
5728a48K05k08J11j3Pk04K53l4KK21j35K7k66L56Pl50K93n9j90J26j1J4P9M5j04
5753B4m07L29P6P5k77R9J98k88K89K0k15N0J07k21J88M1j89K05J67m63K04J93
5775B05k94J65k72K70J06Rq5QR2l40l5J38j59L18k46J75j31K71l03M4Q4j36J60
5798D4j5j83q6L04J15j86J03j55K18oj2k09J77j07j05K90k56n1J85k18J7J86j18
5821f8m4K8J05N8j03n5O5L5j84L29k39p5N5L86l52J9j7j61J84Q9K7kj33J58j23
5846a8j15J08J75n5P3r8Lj78J10j70J65j2j33K55k81J51j9Q0N9j55Q9J7j1k05
5870a65K93r9J46p6j33j9q2L16k29j57K25l3j04K44m89M34%l09N2P5K08l25J02
5893a25o4K31j16q7J73k65L36o2mm7K7J08J15k60K45k30K7J06j62l0P4K30m00
$$ y = [-148, 57, -151, -40, -53, -46, -250, 3, -31, -29, 192, 57, 84, -182, 174, 181, -169, 124, 65, -125, 1, -10, 4, 83, 128, 24, -383, -54, 22, 97, -180, -81, 117, -171, 118, 138, -77, -27, 80, -141, 47, 88, -101, 104, 271, -192, 12, 205, -89, 76, -196, 74, 180, 189, 104, 112, 204, -136, -171, -33, -192, 126, -120, 55, -76, 195, -108, -64, 20, -116, 44, 29, -154, -240, 64, 179, -7, 96, -59, 159, 153, 141, -68, 109, 2, -103, 187, -69, -120, 65, -153, -136, 50, -68, -112, -84, 21, 79, -24, -79, -14, 21, -163, 166, -73, -148, -93, 293, -59, -40, -57, -218, -34, 55, 82, 80, -53, 105, -18, -133, -25, 150, 95, 168, 70, 73, -105, 5, -165, 0, -12, -145, 110, -171, -20, -39, 41, 100, -55, 34, 51, 40, -165, 128, 29, 175, 99, -34, -53, -135, 181, -48, -205, 20, -13, -117, 127, -362, 72, 72, -237, -185, -110, 98, -227, -125, -189, 42, -74, -161, 12, -253, 83, 21, 17, -30, -3, 105, 220, -40, 205, -25, 2, 108, -54, -84, -10, 220, -180]
5916a80J15l12J41O00m10k47R4O7K14o1J51j61O3P2k67j0J70rmm3K56j63k00J01
5940b3J90k54J59P3m42J70K54m7L6pl84M77l48j38J11K2Q6P6J3J91m49J91jr4
5964a38J39J9J28l52L39l14K4K42j07r7J48L1k1j31J18Qj79K63j43K2j16J83L3
5987I9oj50R5M6k30J4O8K78k59Mk16M26p1q8mP0j19J13o0p5K71p0k83K50J2k55
6013a40J78o5j06o7K09J00q4J34k7j05p1K08Ql28L35j24q4M2j8J0j53O0J04K7
6037D3O3k66J94j76J56j95K61J29n8l67K69P2n09P26j40j94O2l7p8J48k02L27
6059B28j63K9j07kL1j13qK61K19k20j86Q9k9k20J15P9l7N9M71m77J43J60k51j43
6083g2j88J86n1O3N0r8J82N5kk06J08N9j80P2K42k19j6n0K01j23J42l85K32J0
$$ y = [-180, -65, -377, -236, 364, -46, -293, -199, -132, 82, 21, 172, 11, 74, 146, -121, -131, 39, 30, 26, -17, 239, 76, -124, -23, 167, -87, 72, 145, -297, -127, 127, 80, 116, 109, -275, 202, -146, -284, -173, -151, -65, 11, 24, 215, -234, -43, -44, -138, 1, 20, 148, -204, 135, -179, -155, 87, -20, -117, 31, 62, 41, -90, 28, 36, -143, 120, -23, -1, -117, 66, 99, 93, -57, 38, 84, -146, -132, -64, 214, -45, -41, -257, 169, 98, 10, 6, 76, -43, 70, 10, -65, 206, 136, -147, 103, 115, -140, 38, -27, -133, -200, 9, 109, 25, 159, 132, 27, -44, 164, 172, -156, 179, 55, -29, 13, -5, 5, -148, -88, 16, 43, 106, -160, 34, -142, 14, -181, 80, 209, 151, -216, 53, 125, -384, 342, 202, 8, 70, 33, -45, 103, -99, 228, 65, 94, -13, -15, 16, -97, -105, 156, 375, 155, -31, 58, 29, -191, -76, 3, -34, 25, 496, 19, 162, 322, 71, -72, -260, -74, -125, -62, -12, -110, 72, 127, 125, -81, 27, 86, -94, -22, 220, 1, -15, -65, 136, 13, 155, -230, 2, 12]
6107A2J09q4J62j02o1K08j69p1n7L5O1j74R5J51n3J10j37J2j8j26R7J03J28k75
6131d4mQ7RN8m4j98J51P8q0k33r1M23l30K06M7q4l0N3K37k36l8L09k82q8L8L17
6157B31m13K56k3j80J60J5k40L38j35J94k27j65n9L32l3j6R2Mo0K3j91O4J84j37
6181A4J74k03K55k69Q8o9r5J33L2j36r0j43J21N2J76r2J02N6j11j3q4J46M7p4
6205A7o5J76j45l3J8J22J06k94J29K17j03k01O9r7J12J38p2k09K29k75K20p2n5
6228f8N04n45P7%j63J86j79M79o74M39R9nj0j40q4l35L35L93k59j8j04P7K0j01
6252g6pJ28k69J78l3K71l3k78J56J00J75n14P1J68j37L22m77J45L10j49l0Q0k11
6275a10L29n71L51p9J80j97K61j33J5k3N0J45k02Rm2J05P7l33Ll6K12M1j36J47
$$ y = [12, 121, 37, 199, 97, 36, 244, 75, 4, -53, -18, 43, -131, -36, 115, 62, 172, 35, 47, 29, -97, 0, 103, 231, -44, -48, 39, 48, 106, 62, -136, 15, 93, 13, -220, -311, 112, -218, -12, 35, -49, -79, -26, 211, -25, -63, 246, -36, -124, -86, 231, -182, 74, 51, -129, 31, 46, -194, 144, 9, 203, -24, -189, -248, 84, 51, 35, 127, 131, 71, 94, -97, -33, 151, 14, 188, -15, 240, -29, 59, -10, -105, 28, 60, -76, -166, -309, -188, -136, 40, -52, 50, 106, -5, -18, -102, 44, 91, 17, -48, 128, -17, -50, -32, 90, 196, -98, 31, 248, 145, -56, 13, -84, 28, 166, 94, -115, 114, -161, 59, -13, -68, 436, -109, -32, -32, -195, -9, -188, 291, -383, 56, 155, 150, 140, 0, -84, -419, -84, 309, 50, 32, -72, 5, 25, -76, -83, 45, -224, -46, -79, 192, 159, -119, 37, 137, 312, -202, -131, 37, -100, 222, -255, -110, 200, 51, 21, 101, -110, 219, -352, -1, -80, 100, -97, 164, 31, 46, 23, 73, 218, 16, 25, -17, 88, 165, -168, -165, -201, 11, 52, -84, 63]
6299F3j79K24k14K87n7q4p4J9J58k90p1K69n7n4o5K17p9q3K07o7j86q4L35j49
6323a4l7K7N0j29L70j24j82M2K42k67M7n6P2r6O5P3p4j22K47O9j68j30K30K25
6347C60m85j07K02J15j4L3l63K57j8n5J50J58k99J4j86L05q2N8Jm9l7j29J36K43
6371B08N8n9r9j75O3K00k05k42k0K11M8j95J92J2NJ1O9K21l33n2j96J72J00R8
6395I2j56J10R6j41k6J7JJ24K35m13k1J06n4j42K10P9j86J41J2p2j14n1K40J0
6419I7j31j24K43L8l12L86l38M2K74j13J08j88m0K07l45NJ78j69L51j61J34M6
6441A88j62P3R2j00k99K16R6j75J55N5K6j22j39K26k4OPK1M9j69j06j38J36R4
6465Fj39K46k67J54K9l7k65j37K31j12L17q1j34K45k92K90J37l25K38j41m8N5
$$ y = [63, -116, 108, -106, 181, 124, 40, -34, -15, 143, -147, -218, 51, -6, -60, -125, 92, 13, -70, 137, 70, -116, -200, 135, -14, -51, -24, 26, -103, 267, 143, -39, 3, 245, -22, 25, -31, 41, -55, 10, 83, 9, -113, 134, 203, 35, -95, 135, 360, -125, -232, -30, 85, 71, 104, -259, -2, -20, -75, 75, 233, -66, -52, -238, 67, -15, 43, 44, -5, -42, -171, -35, 208, 266, 207, 108, -67, -4, 196, -9, -251, -271, -60, -12, -207, -15, -3, 2, 13, 82, 303, -30, -82, -278, -106, -6, 92, -64, 46, 142, 1, -25, -8, -7, 117, 352, -61, -82, 24, -30, -172, 38, 117, -69, 72, 84, 12, -102, -153, 87, 97, -34, -158, 85, 123, -189, 197, -141, -99, 175, 62, 170, -18, -58, 149, -196, -191, -13, -182, 169, 8, 142, 188, 26, 99, 191, 91, -208, 8, 104, -71, 84, 139, 165, 43, -96, 130, 106, 112, 119, 140, 189, 20, -86, -224, -88, 6, -133, 113, -154, 0, 29, -8, -273, -410, -179, -291, 26, -55, -189, 56, -236, 54, 191, -134, 104, -37, -85, -30]
6487c0%L56l05o0n9J00k26L52J04j70k0j51Q6k30M53j50n6KK09k15N0r7%K24j47
6512B0j52Q0N5J9r3J68k72J61O2j05Q4p9P6J1J18l35L02p7P7j48K3r5K85j88M
6537AN1r5J42J18p1k17K33l43J21j72M01j44K3l7m05N06r0rJ1o2nq8K08k04J46
6562A9k00LJ28j4J8K26k13l5l5L5P3N8o6kj38O8K6K08j28J22l14J91k4j76J2M08
6588B50l22M0L0M7J28P7l34J15L5n2m3m6oP7Q7L9Rj39j3l9r9o9M59l90J31Q0J48
6615B00k40j71K65j33J14pj71P7J75j34J93j44K4L6m5J1N4p7j86QJ90k4J51l38
6639a72rJ08J78j6K18l00k42J22m4k7L26n4R4j00J83o3j78k0r0J06ql43J70L96
6663B35n5j69j19N3Q5L1r9J66k12k2O5j81L50j35j08K77j60J62j23L4k23L54K0
$$ y = [-30, -30, 326, 21, -39, -98, 2, -224, 128, 232, 62, 42, -109, -23, -253, 200, 50, -6, -4, 205, -10, 40, -57, -57, 167, 20, -132, -52, 3, 22, -71, 97, -175, -14, 48, -57, 27, -52, 24, 35, 153, -182, 120, 43, 120, -28, -5, -100, 185, -3, 1, 52, -43, 99, 217, 146, -71, 162, -181, -60, -232, 169, 25, 48, 11, -394, 112, 22, 13, 24, -38, -43, -131, 77, -127, 19, -181, -178, -50, -64, -46, 180, -33, -68, -103, -68, 5, 63, -3, -5, -143, -75, -49, 159, 31, 153, -161, 30, 6, -170, -158, 250, -72, -32, -2, 45, 173, 250, -84, 31, 66, 14, -29, -75, -81, -4, 83, 122, 131, -8, -21, -60, -159, -228, 231, -159, -28, 52, 200, -40, -211, 54, -79, 35, 28, -143, -66, 109, -25, 168, 24, 48, 84, 39, 50, 104, 27, -159, -151, 39, 15, 166, -172, -181, -73, 105, 89, 307, 7, -235, -113, -157, -184, 142, 88, 182, 82, 265, 202, 24, 4, -86, 20, 12, -331, -161, 235, 180, 11, -108, -55, 30, 61, -38, 128, -84, -106, -41, -222, 128, -7, -115, 162, 2, 164, 41, 75, -148, 206, 226]
6686B26j69K7k52J77p6M71l80j25j28J64L2R4K2J0n6J34l49J67K8o9J98o8k05
6709a27M0K9OK02j65M2L5J4j58J4J23J20k34L2N5j15m7L9J15K1k05K75k32j11
6733b32K77Q8M0j11N2q0k26K20q3L4k10l4L09M1O4j06j34K33j30K48n1l14J11
6756Fo8j61L08l0M6j78o9L2J29j20J20J27l6j90K25K51l05j35l0P8J32j49j1J41
6780A13j69j62M46k43K89n11M28l9k62K52k52j14L05k5l56K60q1k2J16Q1OO1m8
6803G3r4j40L08j43kP0J37o5n3q3Q7l5j06K9j07N3L0K6J99j07j83K96l12J52J68
6828A98j89j85J89JKj21K99k41M8J5k07L09l2k2k20L5l8R8j20L5J98q9j73J83
6852b7K01k01j20K52k72K80J00j73j14l2J84N2N7l46L83k50M1O7K5n5j98j42M42
$$ y = [226, 57, 84, -168, 9, -67, 404, 24, -101, -229, -65, -33, 61, 83, 93, 37, 171, -178, -11, 17, -52, 146, 78, -127, -87, -58, -52, 150, -15, 27, 62, 76, -82, -68, 55, 175, -59, -27, 28, -87, -134, -95, 20, 41, -164, 111, -121, -232, 45, 133, 173, 62, 114, 34, -192, 28, -55, -21, -231, -265, 44, 85, 149, 43, -91, 142, 12, 260, 209, -105, 6, -62, -223, 85, 55, 101, -77, -146, -114, 15, -105, 15, 142, 106, -84, 141, 392, 87, -48, -78, 0, 132, -17, -28, 113, -56, -218, 228, -15, 274, -237, 191, 152, -110, 142, -110, -224, 81, 56, -300, -40, -121, -143, -27, 54, 60, 121, 73, -21, -161, 147, 4, 2, 72, 209, 144, 91, 8, 95, 60, -46, -17, -124, -71, -41, -15, 184, 77, -106, 190, -122, 30, 198, 9, -176, 13, 14, 16, -105, 194, -47, 1, 16, -191, 118, 86, 64, -156, -121, -159, -61, -181, -146, 52, -37, -210, -27, 174, -27, -147, 105, -167, 113, 213, 40, -74, -106, 78, 130, 187, -159, 224, -26, 15, 82, 107, 52, -146, -288, 154]
6875A54j1l10J01J76l40L50Q7j82L0n8Mm3N6l06L81k94J33J0L08m34K71j1k82
6898b10K47m7nj97J90M4m3K35j40j02Q9j94J63j11M02l39J53j61J49j10p2J54
6920I5k99R1J90m08L30k05J65K42j12l06L50j63j57L53m1k14OJ30J2q7J93K9j43
6943E1N3k29J51m8j36K74o5j85K15l43M7J85J24l47J83J88k97l5J37N2P0k77K24
6966hp6K40j15K3l4n1L8l8L29m73L37Jk85J04j27O5R2j89R8J5P3j52L78k45l14
6991c14n1L35P8J55j23m20K44P5J99j96r3R6J35l02L15m2O6k92L46j63j03j2J68
7014A01n0j53j60N8K12J4K21j09j44J35j12J45k0J9j07oj12j32L59k90J11j68
7036a88N9J97r1j4j55n4L78J62j77j49K16j33J93m13J45m3mj5J1K47l33L69j99
$$ y = [154, 143, -167, -66, 110, -230, 120, 207, 25, 55, -3, 1, -42, 14, -292, 89, -205, -72, -62, 246, -188, 83, 72, -210, 37, -10, -15, -212, -22, 22, -21, 214, 74, -28, 61, -133, 30, -81, 321, -18, 135, -26, 123, 13, -59, 95, -204, -113, 77, -331, -1, -206, -41, 201, 89, -217, 133, -30, -187, 166, 125, -89, -83, 47, 59, -28, 165, 194, 51, 104, -125, 26, -22, -158, 116, 51, -134, 81, -262, -215, -30, 94, -253, -70, 118, -179, -214, -77, -25, 45, -232, -8, -84, 156, 41, 64, 30, -21, 17, -21, 308, -165, 172, 173, -112, -8, -135, -70, 22, -167, -69, -54, 19, -133, 245, 0, -314, -365, -30, 48, 203, 80, -340, -96, -21, 178, -18, -111, -15, 120, -182, 133, 91, 157, -135, 211, 48, -55, -67, 101, 51, -102, -262, -204, 8, 22, 243, 134, -10, 125, 13, 158, 138, 157, 50, 44, -68, -200, 159, -131, -20, -188, -129, 68, -23, -37, -192, -246, 132, 294, 117, -32, 184, 51, 244, -169, -24, -67, -71, -86, -75, 172, -161, 208, 9]
7059Ij0j79J16K70j95p8K16K0m56J37N04o39K51N7O0N7j96K60k16K87m55K56M8
7082A24k70K57P1Nj10n7j60K02l30K09O3R0k7p1K3q3O3o0L8j87K28j82J27O8k49
7107b18K58O3J40l09j17L63l19L33j59P8j53j3L0K82l29p7n5J88r2l5K11j74J9
7130h5J58J66l23J71m3J2k92L6J93n3J40l74K36K4J12Q6j18K1k49j61L35k21L36
7153A07q3p1l7j3K32q7j09J02L66l92J43k7Qj25J57o4k06o1J65j98K03O1K3j51
7177e7J8J41p5o7L7k9j4J99k59L76n32K59p4R7j3l9L9K04j47J15j62J86j28k8
7201D7k27J46l9k9J51j11K83k40N4k27L35J15m24N7L41j30l13J98j90J81J60j30
7223Hj62O2m0J8m3J99k67M8J0J07O4M0L34p9k12l6j53J83J41k94K5o0K81k06L20
$$ y = [9, -1, -180, -64, 206, 11, -67, 149, 169, -287, -150, 354, -285, -34, 23, 83, 140, -56, 204, -12, 275, -180, 76, 124, -146, 111, 182, 187, 77, 20, -140, 62, -268, -59, 4, 94, 67, -4, 19, -64, -1, -61, -23, -210, 18, -164, -37, 31, -218, 40, 103, 243, -66, -183, 180, -139, 194, 35, 113, -40, -53, -23, 259, -70, -147, -202, -14, -106, -141, 70, -104, -85, 73, 239, -84, 87, 44, 56, -236, -200, -7, -60, 80, -294, -58, -34, 78, 164, 46, 67, -182, -343, -8, -229, 107, 24, -47, -84, -97, 135, 48, -61, 41, 407, 15, 158, 131, 139, 14, 171, 107, -99, -160, 5, -193, 10, 71, 94, -57, -39, 102, 27, -40, -3, -32, -46, 153, -106, 270, -262, -3, -77, 20, 7, -32, 7, 211, 64, 179, 17, 203, 75, 47, -180, -34, -73, -102, 49, -62, 221, -19, 35, -192, 143, 258, -166, -109, 232, 102, -211, -13, -203, -22, 138, 8, -154, -92, -132, -114, -157, 42, -225, -177, -167, -60, 4, 44, 378, 299, 87, 51, -102, 81, 222, -72, -47, -107, 174, -32, 288]
7248B88k19l30N51n26J16lK56j71k7O9O0j81KJ65j27j19j5J86q0K77j75r9J81
7271G9j65L9Q0k0P9J45k29k8j73K12j47M3l1K6R6J11k36K60j22M4l3k35K52J2
7295E9m5o2J11j09l8J73j7K9J47l00J53j8j10nM0j48K42p4Lj97J65j40J65P3o9
7320B8l06L72qm0J0l3n7J75k7j29Nj02k4J80o9J18j95K30K4k90K46O5k62J58n7
7345A2MM3j2j77O9J69j17J87k23J6Q8M1J8J81k87o4J47j74K79n9m56K70L36m29
7369a38K32K5j04N1j89J86MJ01j74l7p8j14K33m0J13J24k84m2O1L4j78J95jL3
7393A3J66j44j06N3n5M8j72J68p1K47l26J93r5K49n5j84J43J7P8j44K4j44J19
7416B2O4j3m3j53L5m1K54j91j01K8J39k6J31Jk03N2k9pN3j60L03O0j60J61k97
$$ y = [288, 69, -261, 290, -236, -120, -123, 133, -38, -65, 4, 64, -117, -115, 50, -77, -196, -211, -25, -105, 172, -3, -102, 79, -86, -47, 33, 13, 92, 237, 8, -20, -193, 19, -128, -85, -116, -90, 6, 117, -119, 141, 19, 63, 30, -205, 47, 59, 14, -48, 63, -46, -84, 89, 72, 101, 248, -52, 101, 83, -27, -32, 8, -140, 102, 28, 31, -166, -1, -141, 24, 97, 28, -278, 94, 86, 46, 56, 23, -34, 141, 114, -15, -10, -112, -136, 44, -25, 93, -102, 128, 152, -138, 108, 173, -89, 69, 12, 16, 59, 47, -130, -61, 108, -9, 178, -45, -29, 59, 100, 118, 299, 12, -52, 95, -79, 200, 141, -315, -45, 291, -138, 94, 119, 15, 66, -123, 63, 67, 168, -6, -43, -121, -235, -2, -42, 71, 195, -89, -131, -70, -36, -214, -19, -20, 13, 179, 35, -71, -18, -73, -25, -197, -29, -100, 147, -179, 14, -81, 168, 113, -71, 72, 89, 167, 23, 47, -97, 22, 86, 73, 30, -123, -88, -129, 125, -66, -167, -139, 0, -26, 105, 106, -97, -45, -74, -81, -28, -188, 115, 175, 15, 176, -121]
7441a21L1J55J8j39J01N0r4j22J92k39O8J42j00L05l24K39j43n6RJ91l10m8J57
7464c8J62j20j16J83jJ31r8j21P0j77K6K05m5j4k01L38k69J0J00J03m15L96j41
7487c2J46l4q6lj28L02n6j1M8j72J11n3Qj28l69L43K4J59J28r7j91j08J00K08
7511A09K5j39k66K11Q3J48q5p6j75K96N0j81J32j75P8O5j10N2j85J39NN4O9l1
7535I3n5m1o9K39K3j91j16J31o7o9n4L15j59J00p9r9J2J06M6p7Q4j28M2oJ81j85
7561b3j04k4K64j86j1Q8j73J25Kr8J16j28K30j69Oj4J59r2k9K4r3K90Qk11P2l
7587B6j22K03j49L8k6r6O6M5J21k6k87R3r3K53r7lj15J04K39l15J99j01M2j19
7611a20K62j16j8O2L6N2j74K50j72j86j38J61jK58k75J00J31L7k27O0K8J37r4
$$ y = [-121, -90, 65, 83, -56, 45, 95, 1, -121, 71, -168, -100, 42, -58, 247, -77, 162, 19, -37, -28, 163, -147, -195, -38, 124, 4, -112, 71, 70, 201, 103, -18, 52, -125, -99, 106, 61, 47, -154, 184, -85, -75, 25, 128, -287, 109, -32, 114, 80, -6, -9, -137, 165, 109, 98, 146, -26, 85, 32, 40, -88, -457, -114, -90, 69, 197, 100, -91, -199, -99, 109, 134, -5, -271, -60, 23, 171, 86, 10, -165, 131, 181, 0, 132, -43, 35, 100, -10, 42, -143, -4, 1, 55, 124, 93, 38, -3, -72, 167, 190, -1, -117, 14, -53, -122, -176, 139, -20, 80, 1, -98, -86, 20, 66, -11, 73, -55, -13, -19, 162, -23, -127, -151, 113, -73, -84, 4, -169, -44, -42, -140, -24, -152, 78, -91, -85, -99, 60, -32, -61, -37, -130, 160, 168, -43, 29, 26, -96, 107, -42, -4, -30, -126, -60, -15, 106, 80, -207, -114, -207, 46, -51, -54, -169, -65, 174, -141, 58, -43, -1, -120, 142, 26, 8, 70, 106, 158, -16, 234, 62, -124, -262, -101, -102, 156, -119, -19, 112, 149, -78, -18, 10, 147, 53]
7634E3Q0r3j08J05j36OK35j81J58j65J26j19m2J39j50q6n8M11k92L66j55N3l31
7657a84J61j05J98m81L22M8k51L34q6Q6Nq3K3J11n4j08J11j21N3L0J69j62J7l51
7681c18L88Q5pk34j09R8J07N1r0N8m6q3j6J20Jk4K53j5k08J55J05k04p4R1k56
7706a72J57J67j23M6l7k0j29J61r2J66k04J51J11k44R0n5K0J31k12j48L32O7j24
7729C9l03J44m6MJ89j86J39r7L01j67Q2k07k02O28m50K64j76J31k77L31k93j10
7751b62L42n9R2l43K20J91j67K1Qj84N6K61o1oL0j91J6Nj37K07j63M30k03R7j71
7776B9J10j89n6L90l84j17J87L1p8J38k52J65j44L64k22J77k0l08N6L75l70J03
7798a5K52k82l00L22j94K65qJ58j49j47k9M22j86j12J21j99K33l09L83k90L08
$$ y = [53, 133, 40, -68, 37, -99, -93, 142, -39, 119, -46, 80, -39, -81, 58, -92, -178, -236, 175, -117, 249, 94, 147, -184, -23, -128, 70, -411, -89, -41, -292, 42, -44, 42, 47, -36, -13, 98, 44, -64, 47, -74, -21, 9, 178, 16, 33, -318, 70, 155, 148, -86, -195, -97, 10, 61, -29, 29, -17, -100, -116, 4, 5, -19, 234, 219, 11, 166, 271, 67, -7, 84, -172, -15, 152, 29, 75, 38, 18, -111, 50, -42, 124, -80, 71, 182, -62, 28, -27, -7, 124, -88, -236, 96, 163, 39, -264, -120, -166, -162, 27, -159, -20, -117, 184, 17, 99, -108, -310, 318, -132, 132, -44, 87, -190, 141, -152, -262, 80, 21, 113, -230, -10, 181, 14, 35, 43, -141, -85, 176, 115, 109, 139, -52, -36, -31, -168, 39, -124, 306, 103, 200, 29, 139, -50, -106, 284, -100, -217, -30, 1, -77, 61, -191, -26, -170, 194, -28, 149, 129, -179, -123, 252, -118, -15, 237, -45, -345, -23, -217, 48, 40, 198, 49, -98, -127, 295, 109, -3, 118, -81, 152, -157, 226, -64, 244]
7819B44j83J48pk26r6J01k9m5L6r0R7N7Q7j75n0L2J56l52M75j19N7j78J08o8o2
7844h2J44j24J51J57k94K8J3j34K22k62K80j63J3o2J55j96j75K79j04j2J08J28
7866G0l9m3J80r3j92j67J06J53j04j34K97JJ22o4k7Rj84N9L6K55k25O0r1r6J09
7891br6J23j89L96j62k63J37P9K33k06k9r1J34QL82n87K60K8m06K20J47j19N0
7914D7j84L10k45n8J55j52N0j49L01j79k45L35Q7l1k52J00r0jK87k86M4J26j26
7937a56J36l9J99j71J43p8K9j42j00O1J32N1o6Ok91L10p1K5k0omK1q1J72q2J58
7963A36J62k56j08P5l2J96j70Q8k91L35k28k6m6o0L47j48L1j7m7Rj42QL4L04j1
7988A43%l90J51K99l04L3KL9J46Jk08Q4J72L2k00j0O6P9n9o6J16R2m41M19k52
$$ y = [244, 61, 209, 202, -24, -120, -19, -48, -93, -57, -147, -50, 7, 94, -81, -131, -99, 57, -295, 180, 61, 118, -60, 48, -20, -82, 62, -62, 89, 246, -48, -20, -7, -141, 81, -181, 99, -64, -51, -113, 42, -154, -329, -50, -154, -166, -58, 70, 31, -12, 168, 75, -117, -284, -178, -25, -129, -263, 34, 35, 157, 93, 66, 75, -109, -50, -14, 241, 16, 76, -15, -111, -2, -98, 25, -164, 232, 70, -193, -56, 23, 256, 50, 21, -70, 64, 72, 454, -133, 127, 155, -251, -31, 116, -3, 47, -137, 173, -72, -130, 25, -127, -77, -226, 75, -104, -349, -14, 73, 42, -210, -110, -200, -201, 86, -200, -156, -30, -156, -20, -59, 140, -31, 112, 34, 63, -79, -179, -118, 14, 65, -1, 5, -286, 24, -47, -22, -42, -48, -52, -31, -112, 60, -22, 136, 298, 42, -66, 9, -23, 173, 3, 91, -200, 135, -93, -119, -165, -225, 122, -26, 5, -12, -59, -50, -192, -184, -150, 154, 143, 143, -247, -96, 203, -101, -68, -66, -27, 119, 120, -88, -4, 168, 200, 0, -10, 56, 135, 76, 10, 126, 218, -223, 196, -56]
8013e6j56j44N52j77O3k22J8K32j13R8l20K39q6L24l74m3K69l64K11r4J16K13
8035A86l09J8o5N08n22K11J13l63K66j59J63j97J42J63M7j20J08j29k2J87l02
8056g6K24o6k14J85k74K78r9q8L94k86%K42k03k21J73q9P6J38j1L2j67K77l41
8079a16K29n9jl04L23J04n0q2Q6q6j27R3q2O5J64r9m6J55k13J56J5j88J90j25
8103Br3m7p4L07n4rm4k9k93J86J57L74m41j1O5j57J09j84L55j52J81k52P5j83
8127b12K66Q7m22L87j49j48M10k72PrK71l30k7K11j19J94r6J6j7R1r0l53L76j20
8151d8p3K07jl02M34m39K25L20k76q7K83k37J04l7n5K01j8k17OJ45k50J58m4K00
8175A99k83J04j51L35k72K21l59L12n5l79K19J39J03k23M4J59
$$ y = [-56, -212, -356, 196, 19, 82, -140, -122, 110, -3, 95, -225, 14, -72, 252, -122, -165, 104, -260, -49, -143, -27, 186, -123, -105, -170, 338, -184, 27, 140, -223, 43, -116, 47, -150, -8, 155, 202, 82, 190, 61, 39, 226, -76, 148, 82, -132, 53, -221, 57, -42, -130, 264, -22, -22, 220, 17, -204, -31, -120, -44, 94, 83, 115, -52, 225, -116, 113, 54, 53, -251, 72, 176, 126, 44, 130, 44, -83, 10, -72, -7, 157, 58, 12, 167, -46, 110, 125, -63, 127, 2, -91, -138, -212, 95, 41, 32, -12, -41, -334, -148, 9, 383, -58, -69, -4, -161, -52, -236, 119, -33, 148, -104, -29, -212, 54, 141, -281, 106, -43, -191, 219, -53, -46, -55, 216, -114, -141, 70, -49, 145, 49, 65, 48, 139, 49, -304, 72, -48, -121, 86, 85, -217, 217, -222, 3, 323, 47, -40, 243, 6, 110, 73, 18, 219, 201, -16, -10, 135, -115, 43, -1, 199, -84, 20, -131, 204, -68, 153, -206, 106, 51, -328, -109, 30, 133, -90, -46, 113]
8191A13
$$ Imaginary data points
##PAGE= N=2
##DATA TABLE= (X++(I..I)), XYDATA
0@%%%%%%%%%%%%%%%%%%%%Oj4J6j6J6j6J8k6L2l2L7m5M9n5O3p1Q2r1J00j14J29
41F8j43J58j75J93k13K35k59K86l15L48l83M21m66N13n66O27o94P74q67R74j102
62e86J261j462J722k079K597l429N063j4727L7315k0156m6155N0495j870n2351
76d4362K5987M3236m0570j0381L6693j4286k0972L2189j523k6570K4888J5826
88B0155l0915M057K1097j7826p85K6553j4635j9551K0494p2j7547J8866N379k5106
102i836J2437J5699l1069J722L6308k1616k5248L7145L065m1947K2121L0895m0276
115a0600q543M5547j6569l5705L1365J2148l2968J2136K2312l1625o814L2716
127A3400j2009k0915K2927L36k4475J6538J4564k5236R33K2964j3045j0161J7811
$$ y = [0, 0, 0, 0, 0, 0, 0, 0, 0, 0, 0, 0, 0, 0, 0, 0, 0, 0, 0, 0, 0, 6, -8, 8, -8, 8, -8, 10, -16, 16, -16, 21, -24, 25, -30, 33, -38, 44, -47, 53, -61, 68, -75, 83, -92, 101, -112, 123, -136, 150, -165, 183, -200, 221, -245, 268, -298, 329, -365, 409, -458, 516, -586, 675, -787, 935, -1144, 1453, -1976, 3087, -11640, 25675, 5519, -40636, 9859, 7989, -44362, -18375, 24861, -15709, -26090, 10603, -3683, -24655, 7534, 6011, -20559, 4329, 20155, -10760, -6703, 14394, -3432, -4217, 22336, 7701, -11850, 8644, 8572, -8975, 9891, 15270, -9836, 2601, 18300, -12769, -11047, 25261, 3645, -21603, 15542, 18607, -23340, -1219, 29676, -10600, -19143, 26404, 9835, -25870, 5495, 17643, -15325, -3189, 19123, -12502, -19316, 13400, 1391, -19524, 3403, 3739, -20736, -4198, 10366, -14870, -13937, 9027, -4018, -14179, 3632]
140C632k618j0940J4100L18j4097J3013P112j7247Q543J4547k0567j910K6239
153B0125j3685k0875K6915P831l0874P383K2564k2173o838K6606j0691k2922K0866
166D232P975k3233P506J5070j9497k037K0993j2823j5093K1573L265k0720Q792
179c997J1807j5972L67J5433r153p693J2473k025q010R001j359q381J1684K354
193F529j7181P059J4848j5263m090J8988q423j5637J8729N721k1605O776J6570
206A3021j4748n217J6746p197j1053J6956J257j9108J0315J2019j6484n72J6335
219A2270j0742j0189J6226p8j6575P971R592j1944j406Q031p472q30R105p212
233c253n888J0624k772q684J1091J872j5122P884J3086j4811m374J7709m364j1677
$$ y = [3632, 1014, -9926, 4174, 4492, -9605, 3408, 10520, -6727, 1816, 16363, -4204, -6114, 20125, 6440, -14435, 12480, 20311, -10563, -3180, 19384, -2789, -9627, 16979, 6288, -16634, 4232, 12207, -11026, -3520, 11550, -7947, -9984, 11009, -1814, -16907, 4666, 7931, -12789, -3997, 7810, -8162, -7795, 7638, -1515, -9208, 3265, 1240, -6770, 2231, 872, -7509, 4175, 6529, -10652, -3593, 11255, -4008, -8098, 10890, 2467, -13170, 5559, 11280, -10325, -3549, 13021, -1727, -6944, 9802, 2605, -8448, 8508, 9765, -9343, 972, 12991, -3493, -4065, 12270, 1528, -8661, 7565, 7487, -9088, -1117, 8475, -3469, -4875, 3156, -4316, -5146, 3959, -3253, -9141, 1483, -1289, -9973, 1118, 2990, -12132, -4248, 8838, -5973, -10347, 7362, 2998, -8679]
247h679J3032K927j5054Q653J0822j4420p41J4802q852q346J4660k081j5020J2405
261D108Q439j8221j94J5722q706q332J2339j216j1495Q463N073j1650K594P547
275D471p277N90P485r271l406J3931l869j1303J0310M372j4400N274J0909j2397
289d581l758J5157n904j1500J2131K289j1983P514O636j3650K505J4121j0753
302a776q294J6448l82j3879J0114P719j5493K139J5200q699q221J1426k41q567
316b506P296J583r965N702O209j0915m1R658r032l954J2384m600j2658J0938N568
331E667j3591J879J0899r166l375J0989n584p343J2335J19j1910Q212O901j2850
345f818K871J3491j1622p130J6880n90j5378Q447Q547j1746N39J0797q592m962
$$ y = [-8679, 4353, 7280, -7774, 879, 11701, -2719, -3460, 11342, 2490, -5856, 8804, 6723, -8297, 4108, 12547, -5674, -5868, 9854, 1148, -7184, 5155, 3939, -7556, 907, 5980, -5670, -3076, 4471, -2806, -2216, 5269, -4002, -7408, 6523, 2654, -8649, 1661, 6033, -8367, -3093, 7816, -4581, -8339, 6818, 914, -10586, 1545, 3834, -8149, -635, 6001, -7649, -5144, 8977, -1776, -10070, 6378, 5996, -7883, 2231, 9950, -5543, -3404, 11796, 3097, -5124, 6302, 6061, -2506, 4790, 6373, -3592, 2110, 8319, -2596, -2637, 7021, -2011, -5965, 6419, 1819, -10839, 99, 5667, -7924, -6045, 4854, -4312, -7687, 3302, -2282, -9625, 2710, 2829, -9081, -869, 6032, -6818, -3947, 9544, -2078, -9208, 7672, 7082, -8296, 151, 8698, -3048, -2509, 8288, -304, -5266]
359e266J1047k524p978Q428N28r527P972N079j3150J940J3260q978p281J2281
373E831j114j0618Q199M842j1661K746Q987r232k497R988o225n981J1924k623
387B566j3475R933Q379j4812o3J3652q696q086J4089n90j3303Q101P963j0956
401e298Q87R225p303j729J0704n806p353J2091J375j2575P428P918j2345N07J2802
416A0528q205p852J2176J30j1215O592M216j0140L976P081j0788j704J2239o849
430A85q529J2396N3j3911Q638R096j4676j112J4707o341r466J1181O79j0363P574
445A11N482j1235K157R654q953l035J1534m960q283J1685J868j4340N582J1449
459H716j0658l420J1210m777p541J0190M32r822P110M858j0062K835Q393r785
$$ y = [-5266, 5781, 3257, -4721, 3707, 4235, -5292, 2680, 7759, -5391, -3451, 9809, 831, -6450, 5831, 4717, -5901, 2298, 7140, -4521, -1775, 7212, -2020, -4517, 5471, -754, -6735, 5189, 2566, -10909, -976, 7403, -7409, -7472, 6180, -2516, -10602, 3487, 2897, -10406, -2305, 5658, -5298, -4411, 4814, -2489, -4218, 6486, 680, -6673, 5418, 6793, -5782, 1646, 9564, -2781, -2274, 10528, 2323, -5529, 6647, 6777, -4438, 2154, 6370, -3770, 206, 7287, -3501, -5205, 7034, 185, -8344, 4052, 4105, -9806, -1168, 7928, -6748, -7860, 6847, 506, -8960, 2221, 2900, -7463, 111, 5593, -5642, -3485, 6169, -2784, -5819, 5715, 755, -7528, 4157, 6025, -8315, -2733, 8716, -1942, -5362, 5848, 1071, -6470, 3720, 4152, -5670, 1440, 6298, -3764, -929, 7464, -2321]
473b321j374J3162o187j1211J1981M172j3465M488R677j0671l750J1969n111q742
487g383R845J338j0027M587M521j0216L335R841r619n172J2156k459j0215R609
501A41M958j0974K987R500q391l711J0686j663o478O946m03p877O982M874j0444
516b867J766R468q864m831J1259k761r503Q547M177j2246J352R456o359l063Q034
531C565l684o059Q403K09q189O391N336r443J46Q829o786m221J0848q49j0632
546f136N640N017p775O54O844n623k692O659l474n096P530N42o892M906L225q791
562e462K274R505o027m933Q824l96p971N771L860o886K442N198o229k350O927
577D547k683l656O227k037p603N557M312q559O74P845n543m916O914o75o090N365
$$ y = [-2321, -3695, 9467, 3280, -7931, 4050, 8222, -5243, -755, 8922, -1749, -5499, 6470, 1359, -7383, 2462, 3800, -6227, -1640, 2881, -7335, -4000, 5841, -3778, -8950, 3206, 747, -9468, 141, 5099, -5875, -2888, 6612, -1779, -5490, 5196, 3533, -2945, 4001, 3598, -4279, 2703, 7577, -2867, -1101, 8367, -497, -5328, 5931, 3170, -6333, 2214, 6391, -5855, -4503, 4953, -1406, -4469, 3565, -119, -6178, 2225, 2434, -5755, 636, 5972, -3471, -3325, 5504, -1282, -5503, 5345, 4496, -6136, -496, 4521, -3254, -2600, 4244, -1379, -4071, 2588, -886, -5982, 1548, 2090, -4802, 104, 3329, -5462, -3188, 6317, 290, -4643, 4181, 3785, -4186, 1585, 5445, -1441, 1001, 6199, -30, -2380, 4547, 1864, -1792, 4435, 2398, -5205, 352, 4664, -3895, -3221, 4624, -919, -5835, 1079, 404, -5686, -321]
593c21L303o599P05M207l791J42N695m369k789O577j089o695N928M252p204O69
609a379O213n813k848P625o79n846L567J458m908K600L130n406J288N585n295
624g08l649P570r45n992N785K592q386J384P403m320l410N734j239m395M027J75
640A626m531L882K792o750N88N650n496j891P458k548p038N527L688p466J072
655c437O318m364k301N541k496l799O269O11n328L900K681o748K312P036o319
670a24k952Q302j159p733N335M013o837J252N200n802k043N745j764m120N081
685B394r87o017N348K577p764J668P455o125m338P600q39o268N576L016p361J567
701b498N545m664j150N194l016l175O814j418p020N630M486q239M68P458n128
$$ y = [-321, 2982, -3617, -2912, 1295, -2496, -2354, 3341, -1028, -3817, 2760, 1671, -5024, 904, 5156, -2048, -1379, 4834, -979, -3827, 3798, 3119, -2727, 840, 2298, -2610, -10, 3120, -2286, -998, 4587, -708, -4357, 3213, 2268, -3724, 2061, 4653, -3733, -2349, 5054, 734, -2676, 3058, 1819, -2576, 1451, 1626, -2905, 977, 3769, -2981, -2393, 3257, -2239, -4130, 3328, 780, -6258, -731, 2957, -4509, -3437, 2881, -1483, -3784, 1757, -739, -4538, 1731, 2342, -2986, 914, 3595, -3153, -841, 6195, -124, -3076, 5226, 4067, -3666, 1669, 5682, -1155, 97, 5297, -505, -2548, 3197, 1433, -2687, 2394, 1407, -4610, 738, 3315, -4449, -2781, 4674, -1451, -5789, 1811, 972, -5296, 280, 3296, -4065, -2498, 3047, -1617, -2767, 2427, -589, -3764, 3050, 1632, -5388, 242, 4728, -3511, -3043, 4415, -713]
716g13m195Q204o67p199M588M051n945N71M890m156p61N694l707l686O942q2o815
733b986M561L896p595M95P730n276m827P108N85p097L294K896n920J771M077n678
749b966r49O290l838l960O682o20o797N349M562p946k48Q122l287m907O051M42
765A980n053M043K429n457J786M564m692n39N639m115l859P146K12q067L649N629
781E295o647j314O159k707m260N598k29n145L461K272n100K273L655n731Q0O570
797D230l973n081P200R37p176L146M719o352q07O471l478l825M952j32m044L491
813B78P06n187L032M836o572r55P296l034m783O416J431p295L536N122n524j013
829a710N409k407k518M513j170m313N077Q79o430K832M757o427r67O496l302n370
$$ y = [-713, -4908, 3296, 2629, -4570, 18, 4069, -1876, -1305, 3585, -571, -1332, 4362, 655, -3031, 3911, 3829, -2986, 1575, 5471, -2124, -1629, 6101, 825, -4002, 3106, 3691, -3406, -112, 2784, -3136, -1365, 2712, -2966, -3915, 2375, -1463, -5423, 1259, 639, -6158, -809, 3753, -4193, -4441, 3681, 394, -4513, 1538, 1980, -3073, 970, 3399, -2058, -272, 4292, -400, -939, 4700, 585, -3274, 3872, 4084, -3983, -334, 5295, -1352, -2666, 3493, 786, -3474, 2124, 1895, -3250, 211, 2483, -2617, -344, 3311, -2420, -2340, 4230, 257, -4824, 2376, 3313, -3863, -717, 4002, -2350, -3157, 3314, -164, -3989, 963, 831, -3213, 278, 984, -4203, -1171, 3665, -2907, -3862, 3434, 400, -4383, 2033, 3464, -3831, -295, 4827, -697, -1710, 3699, 1292, -1226, 3287, 2117, -2196, 2881, 3760, -2670, 162, 4919, -1508, -2475, 4021, 719, -4651]
845d651N677J655o658J942M533m667q15M571l080k026N172j387m751M921J657
860B093n733K762M967o330j134P442k284n751N016K454n726J975L546m605k00
875a508N020l533k610N449j607l975M512J329o481K761N354n488k566O571j594
890A634m680M435J636n244J916L687m089o01M029k924k118N041j822n150M935
905F85K623p011J101N505m775k252N767j380m872M175K155m750J373L242l438
920a852K23M392l891j921O350j139n094M199K467n347J204N256m448k390N487
935C496q17m598L453Q49l483J634J954m360N40M193l578k235M737j329m756M450
951A50K268n557J365M694l564k592M334o25k774L115N90l948K607K087l781P06
$$ y = [-4651, 1026, 2681, -3977, -2035, 2498, -2169, -2984, 1587, -1493, -3519, 1653, 266, -4485, 436, 2093, -3640, -878, 4089, -2241, -3375, 4067, 1783, -3968, 1048, 3502, -2224, -249, 3297, -1308, -1508, 3512, -21, -2631, 2818, 1211, -2764, 1748, 3077, -3404, -643, 4711, -777, -3343, 3228, 1634, -3046, 1389, 3025, -2219, -303, 3384, -705, -1306, 2723, -201, -2319, 2722, 900, -4250, 685, 3308, -3703, -2602, 2903, -1872, -4124, 1643, 263, -4609, -434, 1721, -3029, -1656, 1586, -1852, -1629, 2763, -1128, -3049, 3301, 2162, -2932, 1267, 3734, -1613, -409, 4847, 399, -1991, 3496, 2679, -1919, 1534, 2383, -1100, 534, 2488, -1872, -1332, 2861, -717, -2952, 1785, 456, -4300, 150, 2418, -3139, -1774, 2920, -644, -3236, 1098, 473, -2301, 814, 1404, -2544, 63, 2150, -1631, -925]
967i25L534l423j748M945j472m748M224K583n138M27L621k862j097L934j048l073
983b266L572J43l164K579J982l840J237L763m341j513N375q49m350L199J251m271
999a493J054L383l036j733L574j360l056L070k35l329L465O88m659J133M388l531
1015a677j531M805j350m140M065J669m150J318L509k911p18K685j544j168M143
1030C005j175m070L528J569m932J442M602m235j867M752j324m357L887J952l878
1045a101Q59K195l473Q37L377k772j822M576j310m539M220J734m987J672M567
1060D033n037k448N186l15m090L291Q33m485K026K275l540K77L965l451k072M996
1076A444j498m171N023K506o015M57N145l204k201N233p63l812L305J332m346
$$ y = [-925, 2609, -814, -2562, 2383, 911, -3837, 387, 2970, -2168, -1741, 1880, -982, -2079, 1855, 807, -2266, 1306, 1449, -1715, 864, 2846, -994, 243, 4006, -335, -1848, 3527, 2678, -1672, 1527, 2778, -1493, -439, 2944, -92, -1825, 1749, 389, -2667, 403, 168, -3161, 304, 992, -3667, -2534, 1854, -1677, -3208, 1597, 247, -3893, 172, 1841, -2309, -991, 2518, -393, -1111, 1574, 30, -1138, 3005, 1830, -2240, 1288, 2857, -2075, -633, 3969, -266, -2133, 2619, 1295, -3062, 825, 2777, -1101, -242, 1953, -1520, -683, 2694, -78, -1900, 2676, 1366, -3173, 1047, 2781, -2206, -534, 4033, -1004, -3452, 1734, 1419, -2671, 620, 1453, -3032, -1006, 1269, -2271, -1994, 1971, -1480, -3552, 1444, -54, -4225, 798, 3304, -2711, -2254, 2891, -313, -2514, 2719, 1956, -1856, 1449, 2781, -1565]
1091a565K211L064l865l4L821m004k356O163q11n623L472K678n660L97N091l213
1107b34k793M704j381l867L539J399l836K064K257m797O27N244l328l258N479
1122A819J06n270K668L767m817j27N291l389k845M129k84k990K977R24m496K306
1138b31K967m475k09N563k879m051N344M66n529K936M315m954q58M342k262j993
1154a508L819p94l082L031J024m915J901L537m760p71N398l356l640M725J320
1169A929n139J490L702l988o96L665j860j926M098q16l637L643R57l717K433L496
1185C634m855r70N517j983l682M135J402m637J493K784l150m79L561k104k308
1200a642L087o56l205L386R19m759J747M182m336j499M869j229l480L077J210
$$ y = [-1565, 646, 3710, -155, -189, 3632, -372, -2728, 3435, 2624, -2999, 473, 3151, -2509, -2112, 2979, -234, -3027, 1677, 296, -3571, -32, 1367, -2469, -405, 1852, -2945, -2318, 2926, -402, -3660, 1819, 1925, -3345, -677, 3090, -1727, -1854, 3437, 48, -2797, 1332, 1048, -1942, 1035, 1959, -2537, -231, 2736, -1739, -1948, 3615, 736, -3315, 2029, 2495, -3034, -98, 4217, -737, -1595, 2747, 485, -1508, 2311, 1517, -1565, 1466, 2490, -2425, -524, 3013, -1747, -2518, 2880, -476, -4116, 609, 1929, -3210, -1720, 1982, -2006, -2702, 963, -897, -2823, 1275, 459, -3178, 465, 1422, -2295, 138, 3634, -1221, -2191, 3326, 1343, -2339, 1796, 3198, -1439, 54, 2838, -312, -791, 2770, 666, -1642, 1445, 789, -2416, 970, 1889, -2870, -1123, 3059, -1277, -2776, 2093, 864, -2616, 461, 1671]
1215A671l823J324K861l082l35L089k400j072L295j259l164L707J273m754J389
1230a280L607l154j696M348j320l429L014J415l266J118K068k674P72K454k668
1245f91p18M049j370l331L587J414m265J221L617l384j516L789q50l170K765L91
1261A538l164J999J049l113M87L040k866j208L372j112l298L355J443m413J129
1276a762L635k969j091L277r03k093K831R8k785K246J517l055N92L059l095j165
1292a663L951j409l268L230J458l903J019K937l096l91K704j286k197L063j09
1307A040k642K048J245l544J479L156l050j465M070j148l399L020J302l991J569
1322c10K627l257q63L018j296j840K547m57k808L001P85l571P94L788l183j776
$$ y = [1671, -2152, -828, 2033, -1049, -1384, 1705, -695, -1767, 1528, 269, -2895, 812, 2085, -2669, -1280, 2327, -827, -2523, 1825, 505, -2924, 90, 1505, -1761, -643, 1425, -1249, -477, 1977, -691, -1409, 2640, 1270, -2061, 1526, 2940, -1325, -104, 3513, 129, -1387, 2402, 1552, -1618, 1147, 1538, -1626, 373, 1422, -1691, -1204, 1836, -1030, -2238, 1134, 22, -3276, 79, 1522, -2891, -1762, 1873, -1096, -2187, 1090, 187, -1906, 925, 1023, -1762, 484, 2001, -1054, -462, 2597, -498, -1663, 2288, 879, -2389, 841, 2299, -1604, -585, 2352, -744, -1135, 1569, 283, -1914, 1149, 1040, -1602, 446, 1691, -1853, -374, 2782, -268, -1733, 2337, 1189, -2210, 810, 2112, -1879, -310, 2317, -940, -1803, 1215, -81, -1921, 626, 169, -2639, 362, 1147, -2424, -1630, 2158, -1025, -2801]
1338b801M363j069l193K660J849l399Q84K702k221o06K762j335j394K919o29l027
1354a535K786J522l792L84L149k471j890L755p08l504K220J955l537O56K367k796
1370a439m6K692k016j293L142l53l193K815J812m188J004L712k862j965L888l47
1386A363l349K551J030k872J097J872k484k15K444j887j212K887n30l121K937
1401E11J415l668N04L556k202j923L507l73k872K319J269k765J007J733k523J91
1417c14K732k552j539L642o97l395K261K068l864m3L494k781j500L232n31k595
1433b382J897P06k530J645J889k866N69L249k588k038L949j39l105K158K308l763
1449a041J54L577k184j863L150l44k477J991J49k520J894J511l384NL554k658
$$ y = [-2801, 1562, 493, -2700, -40, 1809, -1590, -706, 1996, -225, -831, 1931, 596, -798, 2121, 1492, -1535, 1251, 2773, -1019, -635, 2514, 43, -1847, 1908, 1200, -2304, -84, 1871, -1666, -1010, 1357, -1439, -1485, 1207, -809, -2102, 1040, 687, -2506, 309, 2121, -2067, -1063, 2649, -213, -2178, 1710, 1363, -1986, 565, 1595, -1277, -180, 1692, -792, -1007, 1437, -450, -1662, 1225, 695, -2426, 511, 1926, -1742, -1238, 2318, 116, -1807, 1700, 1327, -1545, 774, 2043, -722, 285, 2018, -505, -314, 2418, -134, -1673, 1969, 1272, -2123, 138, 2206, -1658, -1701, 1793, -988, -2488, 744, 213, -2382, -485, 221, -2309, -664, 1225, -1641, -1072, 2177, -411, -2449, 1500, 1361, -1744, 414, 2722, -1041, -887, 2690, 506, -1357, 1793, 1449, -1028, 963, 1112, -1408, 486, 1997, -1387, -1382, 2172, -486]
1465d86j966L962l40l796K267K513l629J13L239j895j445K742j190j762K748J71
1481A246k826J756J821l591j35M322k839k621L986K48m156K047K284k839j9K683
1497A367k041j402K982o02k031K693J80k968J990K636l594l53M247j850l177L209
1513A286P46l512K041J824k771o23K606j749j284K769r72k535K625P03m024J919
1529i51L302l803j029L545q61l132L552J038l517R99K256k315k30K876j913j070
1545a253K928r79k773K950J172l505J223K967l327j304L962q26l097K396J101
1560A635l059Q69K038k430L26K231k040j156K667n59k199K541J222l462O33K900
1576B157k566j245L534o31l109J830J046k328R74J687k277j32K144k093j014K836
$$ y = [-486, -2452, 1510, 1170, -2626, -359, 2154, -1475, -1362, 1877, -18, -1463, 1279, 89, -1673, 1075, 1246, -1580, 176, 1997, -1594, -1729, 2593, -246, -2867, 1119, 1367, -2789, -742, 1542, -1297, -1316, 1367, -674, -2076, 906, 304, -1727, 966, 1146, -1822, 168, 2804, -790, -1143, 3104, 1254, -1923, 1286, 2032, -1480, 561, 2385, -386, -1009, 1597, -152, -1436, 1333, 361, -2174, 451, 1154, -2870, -951, 2351, -1452, -2481, 1064, 203, -2929, 623, 1661, -1856, -857, 1399, -916, -1146, 1730, -183, -1253, 1675, 696, -2077, 873, 2045, -1460, -237, 2730, -597, -1901, 2061, 1235, -1862, 534, 1635, -1424, -555, 1483, -947, -621, 1610, -430, -1586, 1081, 522, -1677, 864, 2086, -1376, -743, 2157, -409, -1654, 1880, 1249, -1860, -30, 1016, -1312, -338, 1349, -928, -1060, 1084, -1009, -2023, 813]
1592H13n34k488K289J146l077M05L309j994j345K524n27j720J649J073k234J349
1608F38R44j793q4K011j578p48K730q25k927J857J493k425J17K139j713j587K208
1625D57r1j925J910J65j764P92Q97j798O59J955j755j008K380n20j876J591J150
1642A219j820k00K218j979n15J909l27j262J374n57j375J459J048k198J94J937
1658A125j613j011K431k22j976K034N42k056K13J907j287l29J697j380m43J730
1674A362m82j833J726Q15k363L80J796j792q53K338o54k232J623Q75k006N27J273
1691E00j380j82J737j396o38K055m62j605J674R25k545N75K569k088o61K038o3
1708A053k102J809P80j937N38J544j889r5J409j236j021K275o80j998K002P95
$$ y = [813, 279, -2209, 80, 1226, -1851, -1446, 1863, -131, -1476, 1048, 521, -1199, 450, 1523, -711, 638, 1582, -211, -295, 1716, 138, -610, 2120, 1295, -1632, 225, 1718, -707, -590, 1549, -164, -1751, 457, 366, -1559, 351, 516, -1248, -456, 441, -1357, -698, 1257, -498, -1506, 874, 354, -1522, 69, 1219, -601, -801, 1417, -562, -1077, 832, 505, -757, 617, 60, -1315, 144, 1192, -1006, -812, 1125, -488, -1499, 932, 710, -1266, 768, 1310, -746, -533, 1374, 87, -242, 1455, 75, -368, 1362, 880, -953, 773, 1588, -775, -395, 1401, -391, -1244, 1094, 440, -1792, -169, 706, -1300, -773, 500, -880, -1062, 675, -721, -1359, 696, 234, -1371, 303, 1228, -1317, -742, 1827, -261, -922, 1116, 1053, -1049, 760, 1540, -397, 141, 1685, -204, -299, 1110, -126, -1147, 1128, 448, -1550, 452, 1247]
1724A247k432J77K318j571j115K066j96j793J630N33j775N51J276j736K46K106
1740A532j955p84K526p53k435K111J262k741M21K129j819j030K323m95j617J300
1756b5N99j706J044J011j956M59K088j600j338K792m94k209J984J270k720J79
1772f22K566j461j308J969m11j441J240M03j829J008R06k059J00K169j803j063
1788a636K351m32k306J774J570k574qK049j127j007J897n10r94J598J00k060J354
1805C9J204k050K33K459j818j510K585J28k453R48J636j839l42J643q73j038J853
1822H05l62j511J770J42j849J272J289k433p3K729j332k024K602K94k230J203
1838B92J033j652k76J767j636o13J831r60j111K022j07k418J582J478k597n7K186
$$ y = [1247, -1185, -1008, 1310, -261, -1376, 690, 494, -1299, 331, 864, -911, -360, 916, -820, -574, 1532, -423, -1207, 1319, 566, -1869, 242, 1504, -1237, -816, 1313, -506, -1536, 787, 292, -1325, -25, 574, -1132, -88, 923, -1033, -574, 1514, -86, -1424, 1368, 874, -1335, 649, 1919, -801, -622, 1944, 483, -825, 1144, 733, -708, 532, 935, -894, 114, 1020, -1039, -939, 1230, -573, -1636, 715, 283, -2023, -249, 1321, -1253, -1261, 788, -339, -1346, 551, 41, -953, 645, 745, -1315, 39, 1243, -807, -574, 1885, 67, -1443, 1142, 1270, -1183, -235, 1401, -438, -780, 863, -10, -1048, 805, 443, -1068, 702, 844, -1005, 267, 1556, -877, -950, 1779, 447, -1577, 1025, 1319, -911, 292, 1325, -327, -603, 1164, -472, -1085, 746, -214, -1325, 697, 590, -1828, -246, 1232, -1365, -1422, 764]
1855G64r12j562K112K86k033J062J665j667LJ354j162k65J830j254j171J865L80
1872A295k371J174J608k078l85K133p63j803J524O52k021P31J118j606L29J388
1888I25j765l47K182r95j334J984K64k297R05K186k128p33K443o52k131J994M01
1905I02j568N13Q96j450J38J428j458l15J893j117j636K217N12k258N46K200j826
1922c83r64K332l15j833J905K02j412Q56P99j476M71J099j409n19J943n92j876
1939a172J513Q59k028n8J981j539j000K029n16j214P98P44j481P80Q19j611J47
1956i49K180j909n53K073k75j943J377J141j792J19J949j090r19J414n34o77Q14
1973D26L71j810J120Q02k104O31J813j516q49J683j80j944J562J172j470l05J812
$$ y = [764, -148, -1710, 402, 688, -1345, -283, 1382, -285, -282, 1072, -90, -355, 1475, 221, -950, 915, 1295, -1076, 98, 1706, -372, -757, 1376, 613, -1190, 334, 986, -1035, -304, 814, -792, -463, 925, -840, -1187, 995, 0, -1334, 650, 914, -1383, -478, 1708, -420, -1153, 1290, 638, -1493, 501, 902, -666, -153, 743, -707, -569, 859, -599, -914, 979, -138, -1774, 443, 955, -1303, -757, 1443, -383, -1347, 985, 670, -1163, 742, 944, -468, 388, 1187, -289, 182, 1281, -128, -647, 1296, 704, -1172, 341, 1200, -828, -886, 1095, -444, -1444, 585, 69, -1145, -347, 397, -1084, -304, 515, -1096, -949, 1231, -678, -1231, 842, 567, -1376, 1, 1142, -650, -531, 1418, 328, -591, 823, 289, -388, 426, 797, -1013, 107, 909, -1195, -564, 1249, -267, -1116, 567, 387, -1557, 5, 1177, -293, -598, 1214]
1990A214j253n40J034m18o14J512l55j323P40Q80j434K53J699j544q63J468L4
2007D90j733R95J105j715K90Q59q72k85J265m88o73J102m36q30J358N49j610K46
2025c83J667j246o42J602jj150O40M33j259M57R22r24j78O32p19n07J207m81j011
2044i41J161N90k080L67J530j033m60J447l99j263J259J73p21M64M04q77J44R75
2062G40j084j16J428n75j277J098P38j483J17J254j011n79J025l12n86P91J74
2079C42r59O32O6q79M53J317j163m67J565l92j068J073N32j295K12J184j139o15
2097f01J347o86o39J227m91j022Q26L21j285Q06Q85j189p45J851m70j558J584
2114A61L06j217J76J097j113J34J315m71o67Q87nj415J355O06j645N13J222j443
$$ y = [1214, -39, -579, 455, 37, -577, 935, 580, -743, -3, 877, -557, -304, 1395, -149, -1012, 456, 490, -1243, -248, 857, -858, -568, 291, -581, -866, 399, -89, -762, 340, -96, -926, 432, 981, -629, -383, 1284, 38, -604, 998, 997, -153, 487, 920, -339, 118, 1040, 116, -62, 570, -149, -656, 551, 70, -941, 220, 810, -1270, -903, 627, -406, -866, 581, 182, -1081, 178, 351, -370, 94, 498, -379, -235, 740, -344, -460, 968, 393, -884, 214, 952, -531, -414, 840, -171, -750, 275, -37, -623, 168, 342, -617, 15, 81, -798, -345, 972, -191, -658, 907, 515, -553, 520, 1052, -243, -31, 1153, 14, -601, 746, 60, -579, 648, 157, -865, -39, 282, -1003, -197, 688, -501, -1246, 605, 135, -1423, 161, 467, -750, -574, 523, -590, -456, 859, 388, -279, 608, 603, -812, 543, 1149, -496, 17, 1239, -204]
2132b04p09K032n62j353J179N08j615P9J603j122m55J027m54j031J572k76j283
2149a064J278P22j814M21J652j357n93J796l06j953J472P50j440J87J097j143
2165b95j82Q12o33l90J169L8j712R45J136j851N33J457j073q49J211M17j571P79
2183e9J038j117Q0P36r64J08J514q16r83J252M6j792J205P52j510j43J637j015
2201c1j184J758j63j099L72N80r96M02R53j227j70J471q88o18J240o5j440J026
2219g9J343j677k15J482n43r82J242M12j359L02P54j233N06J010j021p26J858
2236A074q77j322J626L06j989Q30J319j595j22J236k88j175J015L93j136R66J97
2253D58q10L72P70j097o36K003p87j377J346P47j926O50J095j153o05J221l06
$$ y = [-204, -913, 1119, 557, -796, 383, 891, -724, -645, 958, -164, -619, 408, -46, -1077, 495, 219, -1064, 214, 936, -878, -457, 1195, -162, -755, 1041, 735, -1218, 254, 1004, -436, -249, 848, -295, -477, 335, -298, -688, 481, 519, -1193, -248, 888, -963, -430, 1027, -46, -895, 316, 733, -838, -59, 979, -138, -58, 678, -286, -178, 1336, 520, -463, 789, 835, -957, 248, 1000, -510, -653, 984, -31, -1215, 543, 380, -719, -347, 233, -763, -361, 592, -635, -805, 666, -222, -840, 400, 335, -1105, -79, 1264, -413, -628, 854, 311, -671, 571, 983, -376, -74, 680, -553, -47, 963, -58, -784, 1074, 197, -1125, 501, 807, -1182, -352, 967, -628, -750, 486, 198, -977, 38, 431, -705, 261, 458, -352, 20, 790, -307, -943, 1060, 273, -1104, 242, 989, -937, -287, 808, -345, -950, 271, -35]
2270c5q04J001l6j034J097J82j391R25J159j513k03J430n28j096J272O44j659
2287e89O07R03r04m32J214n48p11J042j55q68Q75K30j568M39J221j180p90J859
2305F45o54j155J330J66r20n3J103p24l34R78m78n33J289m03q79P58M27j021M27
2324c1J058j111n17J404k93j202R18M98j208j49J328r44l09J148q55N8O33k31
2342A95q61R75J53j071L40J394j279m48J430k03j159O40N39r37L38N07q79K24
2360a02N96m87o84J055k40j193Q51O30j016j64J438j053l09Q10r7r34J028N56
2378F85j228L85P57o67k11J052p82m00J294k89j238Q89N38j197L63J070j078m17
2396d74P73J03j298Q33M30r60L78O02q34J11Q48q67k10J063k67j003P98O04j136
$$ y = [-35, -839, 162, 126, -908, 189, 371, -1020, -95, 1064, -449, -652, 778, 250, -846, 426, 1070, -589, 18, 921, 17, -415, 799, 251, -460, 582, 427, -441, 434, 664, -904, -465, 756, -424, -1214, 645, -9, -1164, 166, 332, -588, -641, 462, -262, -596, 382, -96, -629, 660, 257, -622, 136, 563, -458, -31, 1027, -84, -601, 803, 510, -692, 226, 724, -484, -633, 695, -249, -558, 590, -265, -207, 426, 195, -666, 309, 462, -609, -269, 1125, -154, -602, 828, 625, -534, 106, 645, -292, 46, 553, -326, -102, 494, 7, -677, 378, 138, -1055, -204, 426, -590, -754, 684, -369, -678, 132, 35, -899, 129, 685, -543, -158, 599, -68, -279, 773, -9, -409, 885, 596, -642, 247, 785, -412, -49, 1021, -57, -474, 299, 402, -896, -63, 367, -593, -215, 387, -447, -336, 512, -355, -565, 498, 231, -772, 26, 630, -506]
2415e06M76P66l76n79O12q8o53O18j39m74K09N85j015K16O96n04l52P87j14j079
2435i14Q77O01j099K75P59l55m31O43j27n49N63K56r42R59J01q34J94Q57q70n64
2455f00J151M6j258M21N79q72K68P82p67k68R05n46n18P28M3q34O62K81j009M20
2475c86J041r61j92R00r2p73N80K63m68j62R00o82J33N46o35l09Q41j47r66Q77
2495C08L05j429L57J075j015m30J262m7q02M73M98j107O24L25n06J51O30p08n72
2514f08J281j87q93O08N24j368L3J476p76q47J051J29j172P65K48r91L28M68n00
2533d31R6N18n38k23J071j74j184J167O39j301j14J519r25o16J026Q4r66O10M71
2552G29r65J88N60p40k75J224o62n94P13J23j365O43J005j087j61R88m48p15J331
$$ y = [-506, -30, 736, 360, -219, 393, 305, -348, 270, 131, -343, -134, 451, -564, -348, 348, -156, -508, 279, 165, -914, -37, 564, -535, -260, 499, 144, -287, 356, 229, -320, 243, 499, -443, 516, 617, -217, -23, 834, -36, -600, 551, 597, -661, -240, 339, -533, -265, 517, -250, -518, 387, -159, -677, 51, 94, -740, -78, 203, -806, -386, 655, -306, -498, 402, 310, -463, 117, 380, -88, -250, 650, -32, 101, 647, 12, -297, 544, 397, -569, 308, 613, -816, -459, 616, -399, -829, 433, 386, -416, 57, 555, -552, 72, 397, -109, 42, 672, -36, -608, 673, 486, -407, 201, 725, -643, -610, 866, 90, -757, 294, 423, -749, 16, 264, -727, -399, 69, -431, -335, 183, -355, -578, 493, 319, -865, 302, 941, -360, -474, 1045, 120, -496, 530, 614, -352, 258, 729, -236, -48, 512, -228, -503, 721, 59, -535, 178, 301, -1064, -421, 584, -503, -664, 324, -124, -839, 492]
2571D92l33p69N43M64j084P86M02o67j01R44p63p43J199L71j284N32O64q67m09
2590f23J090k84q59Q92k8q86N90N61p32K51Q94j104m96J389n54q14J163M19j467
2609e98L47J187r27l76P54k46r19J031j86n92N08M87r78K27O31p05o23J144Q5
2628B51j241R53N90j074J24O82m53k97N95j07l29N81P9n99P08K6q12m2J166r40
2648a39l58J251j58j152O56M26o65l7N14m48k70M25j68n02Q41j82o56O06L90q04
2668d30J1J153q83m89J143j82o99L63N71p79R6O66o27l21O46l67o7N54l16q07
2688g64P69K97q63L85M80l98o36J097k46n40L60L22o89J99N90m90K71L60m89m28
2708d13J128j77p58O12L01r38k4R17n70k79M27k13m66N44J17o83L19L91n91r9
$$ y = [492, 159, -610, -67, 397, -687, 99, 501, -166, -267, 677, -86, -829, 370, 741, -543, -11, 653, -214, -623, 467, 183, -676, 216, 188, -698, -108, 453, -279, -28, 866, -238, -734, 655, 101, -713, 450, 869, -598, -251, 936, 9, -367, 387, 141, -778, 253, 67, -525, -17, 470, -508, -281, 350, -355, -978, 166, 251, -990, -37, 553, -521, -397, 285, -168, -465, 130, 23, -306, 275, 354, -245, 463, 489, -323, -365, 801, -139, -497, 754, 596, -556, 100, 526, -139, -176, 338, -110, -380, 45, -123, -625, 216, 34, -622, -16, 374, -430, -419, 734, -149, -638, 505, 323, -376, -13, 558, -221, -125, 541, -86, -407, 239, -128, -195, 359, 43, -764, 5, 302, -561, -176, 304, -94, -730, 367, 121, -419, -59, 263, -426, -227, 363, -127, 144, 504, 15, -413, 715, 538, -220, 392, 693, -245, -269, 648, 78, -201, 226, 13, -453, 91, 208, -475, -156, 235, -356, -455]
2728d55M66m37j2P86k78p11Q80N89j118L61O03l95o80P65j13k23K21M8o88M60
2748F9R4m40N2N84m33n64R96Q8j161P89L53n95j07M98l33l61Q27m50j97N35K34
2769D78o90M34J05m07Q8P17p74k21N43R0q77N85M6k65r7M99m67l0M12l57j44K91
2791d1p1j53M46m8o23J31Q81m30k82M42m4l53L7N50n34j22R57m38m11M25k16m76
2813c73M52J56n38K90M21q16J42P28n51l50O11Lq33M94L04l06K75J32m55K14K93
2834B93k0o51Q66j87m29M88L86r55k5P18n20k59M08J35m52Q2M64q89N84J25n25
2855c63J5O82l63l97P71j83l47J10M00p54L10O43m57j61P91k15o74N44O8n93J87
2876A4J56m10Q2M69k01o45O68k0o21J82M67k59r9L12J62q24P77j91n44N48J91
$$ y = [-455, 11, -426, -438, 348, 70, -641, 239, 828, -290, 71, 674, 279, -401, 364, 251, 28, 249, 297, -391, 69, 163, -277, -225, 359, -74, -638, 358, 446, -715, 74, 427, -168, -275, 223, -110, -471, 356, -94, -291, 244, 478, -212, 222, 327, -80, 8, 725, -49, -270, 273, 363, -514, 71, 117, -148, -245, 254, -213, -243, 169, -188, -332, -41, -112, -265, 181, 133, -490, -359, 522, 92, -190, 252, 208, -145, -108, 442, -92, -214, 743, 305, -106, 319, 103, -373, 79, 235, -303, -13, 408, -408, -266, 462, -89, -439, 172, 175, -658, -164, 140, -166, 109, 241, -214, 0, 293, 273, -378, 488, 301, -128, 360, 746, -209, -234, 484, -36, -295, 113, 248, -204, -122, 342, -547, 37, 162, -363, -348, 334, -29, -426, 345, 162, -185, -75, 325, -429, -119, 524, 67, -94, 697, 482, -192, 352, 420, -173, 14, 170, -240, -158, 311, 110, -535, 133, 113, -508, -326, 141, -118, -217, 95, 257, -567, 210, 19, -525, 23, 214]
2897B14l67K66K21n15J11P22n67k51N38K2r48M15O55p30J87L28k0n22R9M67n04
2918a79M1K82p59M83M85o79o0R05p10l02P69Lq32L96O88n27n8M22j99l60M85N0
2940C44p18O21rp72M83K08m47j4P11n29n59O09N23q68J98O09p35K35M27l05l76
2961c64P13k79l20O63M5o22J00O83q41J7Q77m53m14L76L39n77J4P2m68L57L58
2982B76m65k60O42j63m62M14L15q45K89M08m53J09N66m4n07L20J95o60K22N63
3002D60n54j32N35m24j89N58j25p10O43J86n00L6O04o27k09O86P4n10lL92n18
3023c27L62K67m00J63J18l21k6L81N6o75N35j34k06P2N87m10m78P42l54k37K11
3044g4K45l85N6K3j40N6L03l43j24P16l52m52N40L91o66p2N66l01qL03q9m32N93
$$ y = [214, -153, 113, 334, -181, -70, 652, 85, -166, 372, 394, -554, -139, 516, -214, -27, 301, 281, -241, -142, 325, -179, -138, 144, -615, -132, 353, -326, -386, 519, -191, -493, 276, 279, -553, -157, 531, 4, -54, 368, 169, -191, 294, 344, -374, 247, 238, -534, -51, 157, -290, -304, 407, -122, -681, -72, 451, -417, -219, 390, -345, -110, 317, 12, -364, 349, 70, -250, 413, 458, -164, -64, 619, -222, -205, 672, 219, -195, 181, 520, -57, -43, 29, -439, -82, 276, -189, -449, 193, 30, -432, -18, 297, -548, -259, 149, -304, -195, 371, 327, -180, 140, 335, -325, -103, 460, -94, -226, 309, -115, -304, 254, 129, -581, 62, 248, -252, -216, 388, -239, -448, 238, 312, -198, -201, 191, -327, 35, 302, -98, 65, 183, -138, -164, 217, 273, -402, 133, -1, -207, -135, 452, 42, -436, 306, -48, -285, -74, 171, -214, -158, -135, -275, -219, 84, -259, -383, 333, -19, -471, 69, 460, -206, -278, 288, -13, -21, 282, 193, -239, 354]
3067C54m1k39K57l31q4l2K19o9k62L90N3n51K87L63p49J8M71j12k04K80O4k46
3089a64J24J71k10J98J65l65K17L98n86l71R66m58l86J51L62m69J22L34k17k98
3109c16J88k9r6L35m9l30L91J59n57J37M63j52l94P42k04o50M82K95o91L08M83
3130E15o26K37J68j42k95M65j96m29M67K29o66J83L93m51k3k4L13n18L01J62r7
3151c4j55J16K0J17J31j83j12L27o46M27K62k00k58L6K70n3k45N12K30p16K88
3172A34J17l27MJ85m57L38M1l04k03N31o3l99N52K84p80N57R6m73r2P78k94m34
3194b09M26r0l06K63L0j58m2K54m68N8N44l05m96N48M27j115L43M28j61l08M54
3215A17l8l14K04K16k87J23J66l24j20O13k41l99O27j04n16L47J19l20J0M46m18
$$ y = [354, 313, 74, 331, 0, -84, -116, 103, 34, -228, 162, 215, -336, -49, 314, -435, -417, 54, -58, -262, 18, 82, -164, -40, 131, -79, 119, 284, -81, 136, 534, -52, -423, 543, 85, -301, -150, 212, -257, -135, 199, -18, -316, -128, -157, -253, 82, 33, -297, 94, 253, -304, -167, 296, 144, -250, 492, 288, -362, 120, 415, -276, 32, 515, -111, 126, 294, 152, -143, 322, 126, -303, 164, 393, -273, -90, 303, -148, -171, -195, 118, -400, -99, 63, -34, -189, -73, -53, 64, 195, 12, -100, 227, -419, 8, 270, 70, -188, -152, 118, 65, -180, 332, 562, -154, 134, 251, -76, -72, 113, -344, -6, 35, -269, -472, 59, -4, -403, 149, 433, -347, 210, 306, -167, -259, 519, 225, -209, 217, 127, -179, 84, 114, -44, -86, 168, -300, -242, 302, -3, -499, 49, 476, -639, -296, 132, -29, -337, 117, 79, -235, -31, 185, -102, 21, 187, -137, -257, 356, 115, -284, 343, 239, -277, 70, 189, -131, -121, 325, -93]
3236i3o4R8K17m45K90J62l58J54K3l28N2M89l61k18K72K48m42M65n8k78J60L93
3258C78n92o0N97j74j53P3J6m3K64p0j75l32P62m15m08M62o2m21L02J83l35K09
3280FJ12j07q8K52j14l6K43l21j01L5K63l88Q8Q60p84l22O12L7l89R0J22k81J08
3303a03L18k36k51L22k74l0L74k96j39J46M69n47k7N85l89j89L61K06o68K33M35
3324C00k03k2J28k21m9J89k21j17L11P5l35L58nj57m05O45m06J26n4K54l67J21
3346e5P7k76K23L30l15j29L44j95k36M36L6l94J10N03p07J7K26J04l35K45J28
3367A37l96R2L52l54N7M67m61k30P03m37k52K13K35m04J9L82k76j0K85j07k97
3388b82M40J18k54J29P5j47l7J91m47j61P39l64k50J52N10m07k3K3r6j29K86k67
$$ y = [-93, -157, -59, 158, -287, 3, 165, -193, -39, -16, -344, -292, 197, -164, -382, -110, 138, -304, 161, 103, -175, -15, 378, -214, -274, 323, 149, -4, 69, 85, 42, 306, 236, 61, -271, 491, 76, -332, 130, 68, -353, -51, 132, -203, 6, 118, 11, -77, 175, 61, 25, 268, -53, -154, -119, 144, -244, -156, 704, -80, -402, 210, 247, -142, -52, 70, -211, -103, 215, -21, -272, 50, -224, -254, 120, -176, -315, -169, 300, -247, -274, 311, -78, -267, 94, 300, -368, -135, 300, 97, 75, 203, -18, -67, 122, -99, -216, 95, 170, -165, 193, 188, 31, -374, 271, -135, -9, -63, 191, -176, -55, 22, -254, -31, 299, -16, -145, 199, 4, -232, 204, 240, -154, -44, 459, -248, -231, -5, 99, -236, 9, 137, -259, -167, 185, -169, -112, 355, -106, -336, 367, -70, -322, -109, 126, -278, -259, 123, -153, -163, 122, 15, -282, 158, 276, 22, 151, 226, 79, 42, 233, -214, -375, 364, 0, -250, -98, 412, 5, -18, 5, -91, -220, 66, -201]
3410b01J12J55R2l83K62J66m99K52M53n02j56M78r3q9J26n3k85J33K59m24p7M22
3432A48k63K11n6j86j06L61O8k25P6J26n47k2N11k18l6L50j63j42m3K89m1lNl5
3456E9j13M23m98p9J88Q3rL1j21q7j24J67n8l61M76j41q6K97K06o44K40k8J49
3479c0k72L50J76l81L77J07m41K28R1m44J17L42j73k04M08m4l65K44j83M5J7J3
3501b2j23J24K39j49j84J46lk08J74J22k44n9O62m80o5K3l0j25J76J00j64k8N96
3524D78o51j9L75q1k16L81q3m67K42P4k18J99K84k52j37K68J1n80K96J63Q2j33
3546A6K62j18k81M71j97m43N19K16o43J08M39m74Q3j12Q5K44p9Q6m2j22J56n86
3568d12M62l3k37j61L52Q6n17L56K58j72j52M82m25J56K71N2n76M22o7j68Q7K21
$$ y = [-201, -89, 66, 158, -225, 37, 203, -296, -44, 409, -93, -249, 229, 136, 47, 173, 120, -165, -32, 227, -197, -274, 148, -115, 96, 40, -146, -252, 109, 177, -48, 28, 154, -393, -415, 96, -122, -158, 192, 29, -113, -156, 133, 92, 89, 94, 59, -54, 369, -129, -208, -20, 63, 54, 85, -36, -123, -247, -80, -138, -499, -23, -164, -250, 47, 253, -391, -151, -179, -30, -302, 48, 224, -157, 220, 327, -114, 114, 205, -239, -122, 220, 47, -157, 251, 207, -158, 86, -97, -52, -35, -22, -145, -21, 218, 69, -115, 31, 28, -180, -6, 116, -128, -187, 475, -5, -70, -47, -77, -202, -26, 74, -90, -118, 478, -173, -192, 183, 102, -114, 267, 184, -283, -41, 33, -185, 14, 298, 46, -91, 177, 188, -392, -96, 67, 149, 16, 278, 160, -121, 350, 153, -290, 229, 445, -198, -90, 349, -125, -42, -154, -69, 175, 96, 182, 140, 18, 174, -412, 50, 17, -220, -381, -29, 57, -460, -104, 154, -18, -170, 312, -113, 43, 314, 366, -210, 212, 145, -23, 64, 285]
3590B85m77j1M56l97m9O13k96l23L47j5m59J54N35m24l8M09j22j25J36j65m02
3611c68N02J79k99lK33k47k52M71j81k80K34q8m8J34K32l04j83L68q5k26N37k80
3633D6m11K72L36n46J16L17Q5n03M10K32n37L42Pk44J57L32m19L8L88m26l37K92
3655e3K29m34L45J09m90J24K21k7k52L06K31o51K48J71j13J23r3j14n5O22l32
3676A15o8J35J9m47L21K53k44n6L26l64n2L04K7o11Q3L16k83ML54l07j6N49m46
3699h8j58O01k04k25J51J30k47j55L64r1j69J65R7r3j54K52k42K28J29l83j67
3720b59K85O7k94L11O2n31K33J03Kj74K15j86j47N51j94p3O6P0l36J24L10j86
3742A9p7K26p0k72K10l9j39J31J24K4l02K57n7pj72P6J11J73l28J08KK61k74k04
$$ y = [285, -192, -203, 253, -144, -193, 420, 124, -199, 148, 133, -326, -172, 363, -61, -99, 310, 188, 63, 199, 34, -368, 134, 313, 14, 11, 244, -3, -255, 216, 35, -245, -11, -99, -147, -13, 219, -85, -268, 100, 15, -211, 326, 46, -365, -93, 243, -303, -187, 130, 215, -288, 122, 354, -183, 159, 166, -78, 79, 411, -8, 30, 418, -8, -345, -53, 176, -258, 87, 196, -294, -170, 51, 24, -228, 78, 309, -342, -94, 77, -36, 87, -6, -120, -175, 447, 115, 47, 182, 201, -246, 75, 328, 84, 28, 354, -10, -62, 242, 269, -342, -259, 57, -226, -222, 132, -175, -191, 358, -88, -246, 355, 151, -74, 77, 207, -40, -195, 169, 78, -91, 74, 171, 78, -76, 176, -66, 162, 291, -92, -259, 26, 93, -201, 110, 172, -359, -126, -23, -21, -195, 20, -166, -313, 238, 44, -29, 37, 107, -229, -105, 205, 19, -58, 168, 98, -174, 36, -3, -142, -11, 113, 137, -165, 92, 35, 28, -144, -68, 43, 216, -112, -4, -2, 259, -15, -219]
3766b19K82l12r1M37L2j43K16l3k33P8R0Rk73K46j17j77L16Pk38N4L85o44j2M97
3790A57Rl26K06k5j59j01K09m5pL75m57P2R8L4q4p2L16l19j64M83j02k00M30N9
3814C87l52o9Q1k36L07l98j30M55r8p7k80O19l65n1L87Jl25qJ80l09L80O1j88
3837b8j71M56j65n8n3o5K73k85L44m88J8M65k43Lk1K09l22J9R7K7j51K40K1l63
3861b41N25o3k93L22k44L32m84M79m35m8M97l08r2J5j4QJ47j80K6j53K85K5l64
3884b58M55k1k94K09j55j17OK71N2j57J91m7j52kK93n09L57j06J27k67K81j08
3906D9m49M59J69l18J06J73m54K71P8q9o7K50l49j59L73r2k49K5J62J34j21Q2
3928a6K5J24j65k51r3M99j34j7J44p3j59l9K86K32l24j20M29p74J97K48o6J14
$$ y = [-219, 63, -249, -340, 97, 129, -14, 202, 169, -64, 14, 104, 113, -160, 86, -31, -208, 108, 115, -123, -69, 316, -328, -340, 157, 166, -160, 46, 21, -138, -239, -30, -75, -82, 293, -164, -92, 6, 40, -44, -116, 200, -119, -283, 200, 98, -102, 328, 387, 35, -34, 47, -189, 118, -280, -410, 45, -53, -130, -410, 209, -156, -207, 180, 181, -144, -152, 28, -281, 99, 160, -28, -199, 257, 92, 34, -19, -84, 189, -96, 248, -240, -222, 243, 0, 3, -18, 191, -131, -112, -15, 12, -139, 101, 122, -241, 284, 221, -72, 250, 6, 338, -146, 333, -102, -150, 347, 39, -53, -38, -52, -44, 103, -77, -51, -204, 81, 106, -258, 197, 176, -118, 91, -64, -181, -175, 96, 148, -9, 182, 135, -17, -19, 274, -235, 122, 16, 143, -124, 157, 49, -400, 59, 228, -90, 16, 189, -265, 6, 84, -5, -72, 178, -171, -330, 43, -49, -298, -273, -111, 23, -98, -16, 9, 133, -32, -283, -376, 123, -11, -28, 116, 43, -116, -155, 131, 363, 39, -81, 348, -426, -229, 19, -47, 67]
3950F7m5k5R2n6j47j69L43R2k74J46K24k91l1k1M66k97J68j17k11k8K82l7j20
3973A1J74k47j52M05l52j82N64j12k23P5L10k90N4k15p1k36M91m3j75J15K14k31
3995a16R1L03l59j30K11K74l42L62j97k33P1J55O2j22j5K75m48K82p6k8q7L29
4017B62l54K8M5R5k35L6L23l86J0J75lo0M32k49o5J1K02m99M66r0j01j94K40j50
4041f1j40M73k07k50J56L14l56J30K33l95j4O3J88j81n6R7n9KJ37k3K07J18m27
4064e1j28M96k17m82L40J74j92J55L53m76K6J00L9j92L61Pl04R1p2j45o6M85l45
4087d3r6Kj57K35K65k07N4q1J29k25J80K83k24k69L75j96k51K30M81l49r4R2o2
4110G2k31K81k06L00k79J91j18j44J20K2J80K5l23K7J58n3q3J59J3j72J55qJ14
$$ y = [67, 22, -3, 89, 33, -114, -283, 60, 152, -122, 24, 248, -43, -74, -95, 371, 74, 242, 125, -86, -114, 168, 131, 11, 185, -62, -214, 191, -161, -343, 221, 109, -114, -39, 271, -19, 35, -180, -251, -487, 4, -39, -214, -99, 115, -116, -25, 278, -81, -211, 0, 274, -68, 294, 97, -136, -65, 90, 152, 30, 15, 290, -158, 124, 48, 20, -67, 262, -92, -64, -19, 76, -159, -123, 200, -186, -176, -1, -4, -64, 368, 119, 54, 65, 267, -232, 234, 144, 43, -151, 89, -61, -201, 272, 65, -185, -29, 285, -71, 59, 292, -103, -117, -54, 134, -47, -103, -6, -65, -63, 74, 51, 258, 376, -51, -179, 317, 100, -382, -42, 132, -60, 95, 448, -28, -2, 98, 137, -55, 306, 313, 9, 100, 28, -117, -183, 302, -43, -139, -137, -294, -59, 206, -1, 53, -28, 101, -124, 56, 339, 115, -154, 221, 25, -226, 4, 485, 136, 42, 134, 72, -159, 122, -84, 216, -63, 128, 10, -134, -14, 8, 188, 213, -110, -83, 75, 22, -61, 98, 111, -61, 94, 86, 200]
4133B00l13Q5jk30K12R9l70J19K37j01O8k23M23l12M78l86j07J05K36m85L75r3
4155A6j8r1J63J73j53j48R4Qo1J99k60J81J8k84O6J75j46j83J15Q2m9K17j07l4
4179b7j00j1J04l1k9N6j68J57k7l3R4J35j43J05L7k00q8K63K5k83R2M14m56JQ0
4204c3j81K34L09l57J6r3K64j11r7K02m09J54L07k43l1R4k52K48M5O7j14Nk19
4227a95K74L0o7L9q1K93k32j39J95J06j24N8M0k22k54K58j07J82MK08l66j35J92
4250d3l7r4K11r3J40m7J24l16J20j0p6k6L81k47o2L70j05o9m5K29k51k69J36J61
4274H2l59J42K39k01Nm1j79L17J74j09J25k17Pm2K94j51q2j9Oj29J98P5j6j20
4298aL9l0k89K24J76k46J07K36q6l36L60n0j04l2J93m15K42P4K1l5K21m05K21
$$ y = [200, -113, -28, -29, -259, -47, 52, -318, -199, 38, -63, 5, -218, 205, -107, 371, -15, -122, -17, 219, -266, 109, 16, -2, -93, 70, 243, 90, -58, 36, 44, -17, 182, -78, 103, 121, -163, -97, 78, -68, -251, -136, -54, -103, 114, 7, -27, -127, -138, -34, -65, -94, -38, -206, -49, -76, -109, -15, 120, -23, 82, 119, -81, -169, 94, 119, -164, -72, 342, -114, -113, -33, -214, 20, 329, -28, -12, -105, 159, 48, -49, 153, -256, -102, 205, -38, -69, 25, -227, 21, 66, 133, 19, 24, -195, 79, 109, 42, 81, 0, 293, 61, -78, 117, 223, 99, 157, 197, -25, -279, -21, -128, 54, 58, 266, -100, -235, -43, -80, -174, 37, -56, 84, 37, 161, -155, -35, -45, -121, -147, 234, -13, -75, 295, 190, 121, 76, 305, 54, -215, -79, 82, -277, -135, 104, -97, -92, -133, -312, 5, 179, 70, 195, -22, -15, -57, 237, 86, 4, -15, -9, -138, 60, 135, 119, -1, 38, 8, -281, -57, 119, -127, -20, 216, 130, -206, 154, 104, 0, -32, 161, -254, -12, 62, 83, 48, 269, -136, 85]
4321H5j27LQ2J6J19l70n0J20L14k52K45J3k47J97l04J63O0N1j08j83L58k90J46
4344D1Ol23K77J0Lk42L3J91K41k54Kl2N9J35k8n9j2J61j98j40L24j30ML4L3l11
4370a75J72L66l77q9K38j04l0R0k50J14J12o2k17M55K2k86o7J81j4J23m4j15j69
4393a26M08j69j82p8M07j52k17j63L93J9j74M6N1K00n8k64J10q3l27Q1M39J9k09
4416b9j56J66M2J01n4M8J08k39k8K7J49p5p3l7J46k63n5K72j06J25N3K9j76J50
4440A25j40J83o3j92J3K13k03J0j08J18o3k95K45J67k03L07L8l66J41M31l13m6
4462aj76L78k12J32k51n5L66j54L2j46Q5q4O7J75k54J28k18K85J13k58O4J59j02
4485G3j1r4j17J29J13k0l7o2R1j17K45j75j19J4L1J7M7l5P0q3J1ll6oJ19l59M63
$$ y = [85, -42, -39, 43, 59, 178, -192, -242, -122, 192, -60, 185, 198, -49, 148, -156, 7, 67, 118, 10, -173, 185, -105, 41, 47, -276, 1, 11, 14, -228, -195, -4, 237, -17, -15, -47, 12, 147, 119, 60, 48, 209, 11, -129, 195, 65, 69, 103, 136, -175, -3, 363, -14, -103, 135, 31, 1, 91, -159, -45, 67, 5, -212, 243, 265, -21, -88, 93, 79, 202, 158, 43, -126, 282, 113, -69, -147, 260, 108, -109, -272, 121, 140, -34, 12, 63, 263, 205, -59, 51, -32, -359, -278, 161, 180, -29, -185, -19, 23, 124, 70, 118, 226, -13, -41, -14, 135, 60, -13, -50, 96, -167, -222, 50, -56, 69, 122, 151, -25, 125, -15, 168, 105, -87, -74, 139, -64, -54, -162, -44, -107, -402, -157, 10, -193, 114, 152, -214, -73, 358, 45, -1, -177, 201, -11, 121, -130, -185, 181, 27, 59, -87, -2, -86, -19, 156, -98, 30, -188, 97, 210, -48, 16, 175, 73, 62, -32, -149, -20, 93, 73, 36, -26, 65, -52, 193, 18, -101, -87, -56, -39, 8, -27, 43, -40, -29, -32, -68, -74, 45, -314, 149]
4512A49J21l69kJ53l2m7K41j00R8k21j5n8J1K36j36M1R9j26k50J03K31l20K18
4535B5J18j58j4J37l83M9K41K8K5j8p0k2J90L6p9j27n8J13o4J41k85Q1j85L57
4559G8j49N9J4o6J40M3j40l67L24K09k82J71k77J00p1m3K21n8L77l33O5o0J62
4582A17J6k25L47m37J30Q5j1j12K28j70j17P7L28k43o3J53j22K6K1p5k48L48L15
4605C68l82P8P1j50R3j17J8k57J31M43l10J34q7P9o8pj73L22l02L71l44n3J78
4628C6m2j54K52k20N6K28l15K14Q0m06K79j12J96k36m2L11l7k82K37R0k27J73
4650G9l7M8j41J75j93J29M9j63k3M05k38j55R6K74l83K0K18j55m3qP3Q3k75L54
4674A89k21O5J96j00K74l99J43k81K49j01Kj5J67j70%J75J2l18M7N6O9k63K48
$$ y = [149, 270, -99, -101, 52, 20, -27, 214, 114, 212, -9, -24, -82, -71, 165, 29, 70, 169, 43, -207, -104, 127, -193, 25, 143, -15, -29, 108, -275, -226, 15, 43, 68, 50, -20, -42, 148, 184, 105, -22, -80, 33, -31, 110, -175, -94, -279, 78, -71, -12, 2, -64, 76, 119, -21, -388, -64, 145, -137, 34, -243, -143, -214, -257, -36, -94, 283, -50, 15, -45, 117, 133, -92, 255, -182, -52, 33, 22, -90, 138, -32, -149, -72, 256, 13, -50, 103, -19, 7, 28, -47, -295, 53, 368, -14, 64, 135, -15, 78, -39, -21, -278, -147, 296, -14, 120, 33, 112, 44, 37, -136, 186, -116, 255, -89, -142, 36, -6, -160, 92, -128, -72, 156, -159, 55, 135, -271, 8, -104, 92, -144, -186, 125, 88, -194, 43, 133, -94, 79, 42, 90, -51, 124, -69, 60, 109, -54, -77, 328, 90, -65, 31, 305, -78, -58, 160, 5, -38, -46, 27, 110, -165, 189, -32, 33, 229, 129, 403, 4, 147, -134, 115, 14, 16, 1, 168, -2, -2, 173, 185, -133, -86, -30, 39, -224, 24]
4697B4k4k30K55k94J36L13k6j76N9J03k79j12L34q3l47K20m3K49M0kl29K13J71
4720A72p2k12K93Q7l67J06M6j34P4J95l4k14L16l05l1K9J20j43J63K89l32J25
4742A71Ml78K87j06P9l75L48N8l77L20O5k46j85N74m42R7K76k19m9J51K6l18L27
4765H8j73j1K05J28j38j43K42j70lk04l5K13P3j8K3k60J56k25L79k50J78j98J72
4788B9j00M76k85o9j1l62M83k35J0l8K31n01J85M87l98K63j05k33M9K0K01O2N8
4811B17j81j69M42l44N8J26j91J94j35N8j71jq5L54m4l51J96j28O3J07k24R3P7
4834c9R3j19l47M45n5j87L46k05R1r7L19j52m3l0l24L91o1J57k41M9J08o7j03
4857g1O2R3l90K98J36l79L24Nj26j9N4O6j22M10n02L66k99J52k03L02k32J36j94
$$ y = [24, 0, -230, 25, -269, -133, 180, 154, -22, 37, 140, -139, -251, 83, 0, -347, -127, -170, 79, 119, 117, -212, 1, 172, 100, -112, 181, 268, -99, 7, 53, -81, -7, 188, 154, -60, 256, -49, -80, -51, 69, -74, 89, 378, 46, 171, 175, -203, 84, -22, 57, -318, 30, 88, -289, 31, 96, -150, -335, 239, -203, -106, 170, -49, -98, 53, 79, -239, 88, -85, -96, 109, 237, 99, -44, 198, 28, 25, -179, -214, -1, 72, 54, 77, -183, -27, -252, 127, -123, 55, -143, 29, -71, 405, 120, 51, 40, -322, 161, -74, -64, -102, 129, -372, -187, 300, -98, 165, 60, -173, -124, -104, 97, 159, 217, 36, -133, 309, -35, 23, 149, -42, 152, 17, 75, -96, -97, -182, 172, 128, -223, -27, -155, -92, 15, -209, -116, -39, 54, -65, -412, 33, -22, -209, 137, -68, 23, -74, 245, 93, 50, 20, -304, 87, 26, 183, -58, -9, 99, 32, -71, -9, 84, -306, -8, 128, -251, 73, 78, -48, -67, -13, 53, -69, 341, -161, 205, -94, 58, -145, 157, -75, 61, -133]
4880a33J25P4j12L00m2k87K14J88n59J80n8j39M03k24nr5K78j89r4j63L10J37
4902A09j57K61j54L0J3j93M0J43j16n6J23k6j28Q9J47k33M3J87k09J14l8l2L8
4925eJ61j39j34J55j18j7m8P9J57k80L74P3l35Q0o6j1P3M0Mj86K56j12Mj53L7
4950a11n4m9K80j84N7M4m8R3J52M6k39k2J80l75L57j00J00j59J24n0j71L9J82
4973I2j98m9Q8p1K78j59j53rJ74J00m3j74K44q5j98J46k91R3M54j13j05L9o1J82
4997A81O1j79j49o4L06k32K11m0k8j75J64M3j25J01Oq2p3j15K87n0J66p9k32J27
5021C0K9Rj48J04j9J13k0p6j23L2Q1j88L81k57J48l8k7K81l99K86o1k45L44k72
5045c5k43K02L7lM8K6k41J60N9k54K74j33J00j4k68M77m33L70MM6k03J37n0lq8
$$ y = [-133, -8, 66, -46, 254, 212, -75, 139, 327, -232, -52, -110, -249, 154, -70, -75, -170, 108, -81, -175, -338, -28, 109, -48, 213, 59, 89, 102, -91, -51, 92, -24, -80, 43, 17, -111, -22, 125, -108, -65, 122, -87, 27, -11, -43, -5, 156, 17, -117, 38, -80, -97, -145, -66, 91, -189, 185, 258, -77, 3, -63, -74, -1, 39, 43, -143, 113, 1, 5, -148, -111, -165, -214, 66, -118, -61, -17, -65, 28, 180, 226, -13, -35, 145, -230, 127, 27, 127, -32, 92, 42, -129, -90, 92, -106, -155, -67, -138, 140, -19, -172, -181, -7, 93, 50, -124, 120, 35, -163, -17, -308, -215, 239, 126, 21, 60, -1, 181, 242, 63, -86, -150, 156, -76, 135, 95, 67, -108, 56, 99, -26, 75, 81, -1, -74, -189, 98, 48, 214, 135, -97, 30, 59, 68, -80, 24, 5, 118, 98, 22, -101, -69, 12, -176, 205, -52, 96, 58, 31, 312, -87, 199, 138, -107, 237, -35, -278, -76, -39, -42, 6, 32, -209, -49, 10, -244, 30, -103, -3, -17, -285, 192, -241, 129, 133, 179, -24, 113, 63, 60, -28]
5070b8j03J52P4q5K53l32K29K40n51LL84l81K8J16J18l69K73p1q2M8J60o5Q9J16
5094B16P1o08K71J08j46j38M19ok92J15K27l47R9K16k22R0N4j48p2R2q0l4J16
5117An5o2J97R1l35J10LQ6J35p5o6j28J16o5J29j44j22J28K60K01n14j58L53j24
5141c8j24R8R3J98m37K11ok59P6K05j39o5K90k24J42l5J78j71j31R9NM0j38K12
5165H0j40L24j92P3l6kk53K26j33O1j48J68KL2O1p2j27J91j09o8%PL4j0K14k61
5191g8O6R0N7r6J25p2j06M4l5k35L65L3r0j76J98M3j96J01J3J7mk33K91j25j53
5216a56P0lJ32K40l35r4J15k40K39P6j68K02j32K59m03K21k12K85k6M3L0k52L27
5239B18k16l6O7j3j67L24j13j58N2J65j98M8J79L2J11l15J7J16k10L21k01m5J91
$$ y = [-28, -131, 21, 95, 10, 263, -69, 160, 400, -151, -148, 236, -145, -117, -1, 117, -252, 21, -50, -132, -84, 76, 11, 100, 216, 287, -321, -50, 58, -88, -226, 193, 187, -105, 10, 237, -110, -11, 205, -17, 73, 127, -21, -93, -1, -81, -115, 1, -54, -116, 81, 172, -163, -53, -50, 36, 171, 96, 30, -98, 18, -47, 82, -62, -184, -56, 204, 405, -109, -267, 86, -38, -162, -64, 29, 227, -210, 1, -5, -264, -188, 17, -122, -187, 103, -121, 21, -14, 164, -7, -138, -39, -34, 6, -132, 80, -60, 264, 72, 145, 109, 107, -146, 80, -53, 8, -140, 28, 30, 62, 123, 51, -76, 115, 6, -62, -62, -55, -21, -31, 183, -78, -12, 78, 135, 39, 164, 92, -14, 30, -5, -240, 125, 158, 68, -108, 90, 133, -63, 38, 51, 68, 64, -169, 122, -3, -156, -86, -89, 43, 283, -52, -146, -31, -271, -32, 44, -124, 78, -54, 205, -198, 23, -189, 96, 70, 113, 143, -109, 218, 2, -34, 33, 20, -147, 177, 64, -94, -42, 123, -75, -27, 152, 184, 295, -20, -3, 113, -97, 224, 23, -22, 169]
5262A69j32j18J24j23m0k6R0J14l10M28m02J27j25K18k41Q6L17k71j11q1J14K59
5284F6j07K74k77K58j12j51j18O3O3q2J70l1j7J33j2J63l92K13p8J19k05JJ59
5307A00oJJ68j95j22K76l34N1J04Q2m6o8j93J27P8k58M42p8k43L76l41Q4k39J54
5331h0K8p7p4M34m43J71K03j38P8K01j74l25J04O8r4m3K31J21n5l44J91J55r5
5354D3l10M09j77J34j93N4j03K7j5O1K25n77K70%R9m6N7k0J45j07N4M7K8j53l0
5379g8RK80l83N2j53J35N13m17J49o3O8O9k92O4L0J59k80n6L50j37J10j59J27
5402I7j07J46j41J32j94R7J2J4j49J19j17qJ39k16Q5M7O2mj70J04K31N3l28M14
5426C18j19k15Q4j26L0P9K00j44j85K01j19j27K24j00J7%O9q3J1J94l64J92j94
$$ y = [169, 37, -81, 43, -80, -120, -146, -56, 58, -252, 176, -226, -99, -224, -6, -247, -161, 156, -115, -226, -307, -193, 66, -41, 233, -44, 214, 102, -49, -167, -104, -41, -123, 47, 16, -1, 132, 120, 283, -109, 104, 26, 145, -60, -59, 100, 94, 95, 263, 68, -54, 222, -112, -61, 43, 125, 79, 11, -182, -55, 23, -235, 207, 129, -114, 262, -79, 5, -234, -80, -52, -129, -203, 231, -212, -41, 162, 24, 102, 303, 129, -196, -92, -24, -118, -161, 70, 191, 136, -208, -17, 138, 43, -267, 142, -35, 99, -94, -40, -143, -116, -131, -70, 155, -422, -152, -152, -53, -99, -42, -62, 83, -24, 30, 77, 105, -48, -78, -69, 211, -172, -120, -273, -138, 375, -42, 107, 44, 112, 181, -111, -47, -17, 142, -138, -194, 156, 19, 129, -30, 97, -10, 136, -5, 127, -67, 30, 42, 56, -93, 26, -91, -99, 40, -176, -91, -44, 18, 14, -156, -52, 179, 232, -96, 318, 199, -16, 68, -58, -28, 51, 251, 107, -78, 123, 4, -123, 101, 1, 18, 18, 87, 4, 15, 209, -155, 37, -157]
5449a57J98K8j00J11j93K24k04K28j07L54m05O7l1k97J67K08q9j13l08L23J80
5470H4R4N4Q5m78J70m6r4J4J87j57j5K36j65n8J88l80K23L8j07J42j86K12P7P0
5494A88j63L5j97J71m7j33P5J77M8j38J74k95M6J55j0m47K80P9J15l18K13n7J60
$$ y = [-157, 41, 69, -31, 80, -113, 111, -93, 135, 28, 382, -23, 44, 13, -284, -117, 91, 2, -111, -419, -96, 84, 178, 232, 317, -161, 9, -37, -131, -117, 70, -87, -102, 134, -31, -89, 99, -281, -58, -20, -127, 15, -171, 41, 118, 188, 25, 60, -137, 34, -13, -146, -71, 106, 154, 16, 190, -105, -59, 96, 86, -361, -81, -2, 113, -205, 8, -49, 111]
$$ [...]
8191A01
##END NTUPLES=NMR FID
##END=
