##TITLE=1H_LR-758-R3-KA1a
 CDCl3
 8 sc, 
 1.8.2023
##JCAMPDX= 6.0         $$ Bruker NMR JCAMP-DX V2.0
##DATA TYPE= NMR FID
##DATA CLASS= NTUPLES
##ORIGIN= UXNMR, Bruker Analytische Messtechnik GmbH
##OWNER= root
$$ XWIN-NMR		Version 3.5
$$ Wed Aug  2 13:52:31 2023 Russian Standard Time (UT+4h)  she@DPX200
##.OBSERVE FREQUENCY= 200.13135
##.OBSERVE NUCLEUS= ^1H
##.DELAY= (6, 6)
##.ACQUISITION MODE= SIMULTANEOUS
##.ACQUISITION SCHEME= undefined
##.AVERAGES= 8
##.DIGITISER RES= 18
##SPECTROMETER/DATA SYSTEM= spect
##.PULSE SEQUENCE= zg30
##.SOLVENT NAME= D2O
##.SHIFT REFERENCE= (INTERNAL, D2O, 0, 15.7039)
##AUDIT TRAIL= $$ (NUMBER, WHEN, WHO, WHERE, WHAT)
$$ ##TITLE= Audit trail, XWIN-NMR		Version 3.5
$$ ##JCAMPDX= 5.01
$$ ##ORIGIN= Bruker BioSpin GmbH
$$ ##OWNER= she
$$ F:/spectra/data/she/nmr/H-F/1/audita.txt
$$ ##AUDIT TRAIL=  $$ (NUMBER, WHEN, WHO, WHERE, WHAT)
(   1,<2023-08-02 13:51:29.39 +0400>,<she>,<DPX200>,
      <created by zg, POWCHK disabled, PULCHK disabled
       configuration hash MD5:
       00 E9 B6 7A A2 85 ED C7 34 08 36 98 17 FE 4E 26
       data hash MD5: 16K
       B3 A2 D8 0E 57 2C 21 24 19 C3 C5 A1 AC A7 83 DF>)
$$ ##END=
$$ 
$$ hash MD5
$$ 91 39 76 C3 05 53 52 89 3A 37 38 96 C1 E1 D9 27
##$RELAX= 
##$RELAX= 
##$RELAX= 
##$RELAX= 
##$RELAX= 
##$RELAX= 
$$ Bruker specific parameters
$$ --------------------------
##$DU= <F:/spectra>
##$EXPNO= 1
##$NAME= <H-F>
##$PROCNO= 1
##$TYPE= <nmr>
##$USER= <she>
##$AMP= (0..31)
100 100 100 100 100 100 100 100 100 100 100 100 100 100 100 100 100 100 
100 100 100 100 100 100 100 100 100 100 100 100 100 100 
##$AQSEQ= 0
##$AQ_mod= 1
##$AUNM= <au_zg>
##$AUTOPOS= <>
##$BF1= 200.13
##$BF2= 200.13
##$BF3= 200.13
##$BF4= 200.13
##$BF5= 200.13
##$BF6= 200.13
##$BF7= 200.13
##$BF8= 200.13
##$BYTORDA= 1
##$CFDGTYP= 0
##$CFRGTYP= 5
##$CHEMSTR= <none>
##$CNST= (0..31)
1 1 145 1 1 1 1 1 1 1 1 1 1 1 1 1 1 1 1 1 1 1 1 1 1 1 1 1 1 1 1 1 
##$CPDPRG= <>
##$CPDPRG1= <>
##$CPDPRG2= <>
##$CPDPRG3= <>
##$CPDPRG4= <mlev>
##$CPDPRG5= <mlev>
##$CPDPRG6= <mlev>
##$CPDPRG7= <mlev>
##$CPDPRG8= <mlev>
##$CPDPRGB= <>
##$CPDPRGT= <>
##$D= (0..31)
0 1.2 0 0 0 0 0 0 0 0.06 0 0.03 0 0 0 0 0.0002 0 0 0 0 0 0 0 0 0 0 0 0 
0 0 0 
##$DATE= 1690969888
##$DBL= (0..7)
120 120 120 120 120 120 120 120 
##$DBP= (0..7)
150 150 150 150 150 150 150 150 
##$DBP07= 0
##$DBPNAM0= <>
##$DBPNAM1= <>
##$DBPNAM2= <>
##$DBPNAM3= <>
##$DBPNAM4= <>
##$DBPNAM5= <>
##$DBPNAM6= <>
##$DBPNAM7= <>
##$DBPOAL= (0..7)
0.5 0.5 0.5 0.5 0.5 0.5 0.5 0.5 
##$DBPOFFS= (0..7)
0 0 0 0 0 0 0 0 
##$DE= 6
##$DECBNUC= <off>
##$DECIM= 32
##$DECNUC= <off>
##$DECSTAT= 4
##$DIGMOD= 1
##$DIGTYP= 9
##$DL= (0..7)
0 120 120 120 120 120 120 120 
##$DP= (0..7)
150 150 150 150 150 150 150 150 
##$DP07= 0
##$DPNAME0= <>
##$DPNAME1= <>
##$DPNAME2= <>
##$DPNAME3= <>
##$DPNAME4= <>
##$DPNAME5= <>
##$DPNAME6= <>
##$DPNAME7= <>
##$DPOAL= (0..7)
0.5 0.5 0.5 0.5 0.5 0.5 0.5 0.5 
##$DPOFFS= (0..7)
0 0 0 0 0 0 0 0 
##$DQDMODE= 0
##$DR= 18
##$DS= 0
##$DSLIST= <SSSSSSSSSSSSSSS>
$$ [...]
##$SUBNAM2= <"">
##$SUBNAM3= <"">
##$SUBNAM4= <"">
##$SUBNAM5= <"">
##$SUBNAM6= <"">
##$SUBNAM7= <"">
##$SUBNAM8= <"">
##$SUBNAM9= <"">
##$SW= 18.05172834244
##$SWIBOX= (0..15)
0 0 2 0 0 0 0 0 0 0 0 0 0 0 0 0 
##$SW_h= 3612.71676300578
##$TD= 16384
##$TD0= 1
##$TE= 0
##$TE2= 300
##$TE3= 300
##$TEG= 300
##$TL= (0..7)
0 120 120 120 120 120 120 120 
##$TP= (0..7)
150 150 150 150 150 150 150 150 
##$TP07= 0
##$TPNAME0= <>
##$TPNAME1= <>
##$TPNAME2= <>
##$TPNAME3= <>
##$TPNAME4= <>
##$TPNAME5= <>
##$TPNAME6= <>
##$TPNAME7= <>
##$TPOAL= (0..7)
0.5 0.5 0.5 0.5 0.5 0.5 0.5 0.5 
##$TPOFFS= (0..7)
0 0 0 0 0 0 0 0 
##$TUNHIN= 0
##$TUNHOUT= 0
##$TUNXOUT= 0
##$USERA1= <user>
##$USERA2= <user>
##$USERA3= <user>
##$USERA4= <user>
##$USERA5= <user>
##$V9= 5
##$VALIST= <valist>
##$VCLIST= <CCCCCCCCCCCCCCC>
##$VD= 0
##$VDLIST= <DDDDDDDDDDDDDDD>
##$VPLIST= <PPPPPPPPPPPPPPP>
##$VTLIST= <TTTTTTTTTTTTTTT>
##$WBST= 1024
##$WBSW= 4
##$XGAIN= (0..3)
0 0 0 0 
##$XL= 0
##$YL= 0
##$YMAX_a= 49057
##$YMIN_a= -118203
##$ZGOPTNS= <>
##$ZL1= 120
##$ZL2= 120
##$ZL3= 120
##$ZL4= 120
##$ABSF1= 10
##$ABSF2= 0
##$ABSG= 5
##$ABSL= 3
##$ALPHA= 0
##$AQORDER= 0
##$ASSFAC= 0
##$ASSFACI= 0
##$ASSFACX= 0
##$ASSWID= 0
##$AUNMP= <proc_1d>
##$AZFE= 0.1
##$AZFW= 0.1
##$BCFW= 1
##$BC_mod= 2
##$BYTORDP= 1
##$COROFFS= 0
##$CY= 11.3945322036743
##$DATMOD= 1
##$DC= 2
##$DFILT= <>
##$DTYPP= 0
##$F1P= 15.7292609196834
##$F2P= 12.9074282941183
##$FCOR= 0.5
##$FTSIZE= 0
##$FT_mod= 4
##$GAMMA= 1
##$GB= 0.15
##$INTBC= 1
##$INTSCL= 1
##$ISEN= 128
##$LB= 0.24
##$LEV0= 0
##$LPBIN= 0
##$MAXI= 10000
##$MC2= 0
##$MEAN= 0
##$ME_mod= 0
##$MI= 1.114404
##$NCOEF= 0
##$NC_proc= 0
##$NLEV= 6
##$NOISF1= 3.799351
##$NOISF2= 2.8
##$NSP= 1
##$NTH_PI= 0
##$NZP= 0
##$OFFSET= 15.70392
##$PC= 1
##$PHC0= -21039.12
##$PHC1= 10.05272
##$PH_mod= 1
##$PKNL= yes
##$PPARMOD= 0
##$PSCAL= 0
##$PSIGN= 0
##$REVERSE= no
##$SF= 200.130013532006
##$SI= 16384
##$SIGF1= 3
##$SIGF2= 2
##$SINO= 400
##$SIOLD= 16384
##$SREGLST= <1H.CDCl3>
##$SSB= 0
##$STSI= 0
##$STSR= 0
##$SW_p= 3612.71676300578
##$SYMM= 0
##$S_DEV= 0
##$TDeff= 0
##$TDoff= 0
##$TI= <>
##$TILT= no
##$TM1= 0
##$TM2= 0
##$TOPLEV= 0
##$USERP1= <user>
##$USERP2= <user>
##$USERP3= <user>
##$USERP4= <user>
##$USERP5= <user>
##$WDW= 1
##$XDIM= 8192
##$YMAX_p= 0
##$YMIN_p= 0
$$ End of Bruker specific parameters
$$ ---------------------------------
##NTUPLES= NMR FID
##VAR_NAME=  TIME,          FID/REAL,        FID/IMAG
##SYMBOL=    X,             R,               I
##VAR_TYPE=  INDEPENDENT,   DEPENDENT,       DEPENDENT
##VAR_FORM=  AFFN,          ASDF,            ASDF
##VAR_DIM=   8192,          8192,            8192
##UNITS=     SECONDS,       ARBITRARY UNITS, ARBITRARY UNITS
##FACTOR=    0.0002768,     1,               1
##FIRST=     0,             0,               0
##LAST=      2.2672688,     0,               0
##MIN=       0,             -118203,         0
##MAX=       2.2672688,     49057,           0
$$ Real data points
##PAGE= N=1
##DATA TABLE= (X++(R..R)), XYDATA
0 0 0 0 0 0 0 0 0 0 0 0 0 0 0 0 8 -8 8 -8 8 -9 16 -16 18 -24 25 -32 40 -42 48 -56 64 -73 85 -96 108 -121
36 -121 137 -153 172 -190 212 -236 262 -288 319 -353 391 -429 474 -522 574 -633 697 -769 851
55 851 -941 1046 -1164 1305 -1468 1668 -1910 2219 -2621 3177 -3990 5308 -7793 14187 -68217
70 -68217 -118203 -15797 -12259 -26676 -38104 -35596 -46506 -20544 -3837 -10530 -7639 28856 30111
83 30111 1739 -5277 18545 28169 30886 35143 32829 22649 26848 27380 9172 -1878 23698 49057
97 49057 30284 -12617 -28815 -16163 5019 17453 4878 -34266 -51332 -21644 -541 -26516
109 -26516 -51836 -43491 -28933 -22886 -21531 -42798 -69872 -49597 -4888 -7010 -41134 -46865 -32147
122 -32147 -22937 -10105 -4571 -21122 -23735 4434 15939 -4970 -11966 8266 24170 26038 22902
135 22902 13100 8688 26311 45546 34488 13944 18594 37931 40648 24925 13184 13407 21775
148 21775 31545 26656 926 -14702 2497 20771 7028 -16347 -20876 -15262 -9195 -5420 -17268
161 -17268 -38712 -33160 -6793 -6855 -30299 -36608 -23689 -14154 -7495 -7833 -22489 -26240 -2612 13537
175 13537 -99 -12498 -2207 12343 18276 17369 8461 3055 17193 35295 30395 10730 8312
188 8312 24459 34607 28668 16841 10609 14866 26299 29512 13680 -2382 6353 23044 18756
201 18756 1601 -5078 -2380 4327 10784 3354 -15829 -17913 1624 6757 -9196 -18901 -14100 -8044
215 -8044 -2229 -2314 -15925 -23270 -7350 6931 -2155 -15852 -13499 -3171 5009 7085 -1985 -10459
229 -10459 -984 15575 16443 2519 -3083 7342 19717 20272 11182 3820 6506 18512 25797 16463
243 16463 1313 3249 18746 21970 10064 940 851 6171 13820 11190 -5571 -12436 1747 10877
257 10877 185 -10676 -11101 -7124 -364 3373 -8160 -19645 -9665 5138 960 -11113 -13097 -7262
271 -7262 799 5419 -1741 -13104 -8800 6152 9712 -756 -8909 -5025 5045 9828 3969 -5646
285 -5646 -6311 3858 12345 7078 -5834 -8427 3779 12284 5909 -3712 -5884 -19 9066 10740 -1255
300 -1255 -10039 -296 12270 8343 -2003 -4853 -1762 5930 11394 3697 -9499 -5580 9066 10108
314 10108 -748 -6653 -5014 1489 7724 3363 -9325 -11016 1514 7841 62 -9475 -10012 -2529
328 -2529 4825 2478 -7784 -12478 -4093 5429 3883 -7022 -11964 -3909 5991 4507 -4362 -9196 -5144
343 -5144 4712 8776 125 -9980 -4618 7623 9063 912 -4529 -3022 4818 12592 8254 -4285
357 -4285 -4166 9251 14919 7860 -20 -360 5878 14223 12945 1208 -3810 5632 14229 10094 212
372 212 -4315 279 8186 8647 -1965 -9853 -6010 3301 4203 -5833 -14331 -10756 -1414 32 -7683
387 -7683 -15242 -14056 -5415 1077 -4612 -14847 -13268 -1443 3783 -1113 -7050 -7466 -70 10033 9331
402 9331 -1885 -3602 7586 15851 12914 5532 2733 7751 17045 18533 8075 991 7227 15817
416 15817 15586 6910 -277 1136 9484 12130 3542 -6436 -5470 2758 6318 -1625 -11791 -12123 -3532
431 -3532 339 -5939 -14723 -16548 -9889 -2491 -5607 -16297 -19017 -9787 -2838 -5949 -12336 -15391 -10360
446 -10360 -389 2194 -7487 -12885 -3925 5769 5851 128 -3652 -751 9074 14709 7200 -795 3798
461 3798 13647 16176 10605 3471 2821 10782 16630 10247 -698 -1666 5441 9698 4413 -5890 -10443
476 -10443 -4425 1238 -3573 -13796 -18362 -14608 -8324 -8928 -18938 -25807 -20095 -11614 -12461 -19604 -24317
491 -24317 -21419 -12198 -6994 -14098 -21397 -15595 -5063 -1998 -6066 -10385 -9152 -525 7523 3827 -4717
506 -4717 -2938 6673 11448 8162 1940 -809 5470 13370 10586 542 -2671 3508 8654 6415 -2127
521 -2127 -8200 -4658 2462 736 -8273 -14548 -12326 -6314 -4875 -13125 -21728 -19473 -11321 -10139 -16954
536 -16954 -23208 -23127 -15938 -10297 -15120 -23860 -22528 -13394 -8775 -11725 -16493 -17480 -10842 -1922 -2455 -10074
552 -10074 -10928 -2591 4859 4733 -274 -3355 1881 10900 12143 4415 376 5452 11810 12673 6882 314
568 314 1272 7877 9597 2537 -5156 -5509 -34 2670 -3314 -12780 -13998 -7513 -5104 -10462 -17651 -19969
584 -19969 -15106 -9273 -11569 -20060 -21900 -14837 -8958 -10530 -15429 -17984 -13589 -4599 -2520 -9456 -12313
599 -12313 -6083 1614 3649 -136 -4273 -1800 7191 11107 5438 295 2604 9586 13143 9430 2695
614 2695 2200 8947 13045 8698 1618 114 4478 8933 6373 -2043 -5425 -51 4262 915 -5525
629 -5525 -9446 -7133 -1510 -1376 -9223 -14013 -9942 -4515 -4573 -9130 -13794 -12484 -5224 -1617 -7713 -12806
645 -12806 -9448 -2277 101 -1703 -6325 -6372 1446 7491 4454 -1327 -128 6349 10927 10313 5081 2527
661 2527 8413 14749 12821 6418 3972 7228 12388 12403 5605 163 3300 8467 7676 1909 -3137 -2899
677 -2899 2190 4253 -1437 -8186 -7045 -1413 248 -3313 -8674 -9935 -4227 851 -2381 -9178 -8364
692 -8364 -2654 990 275 -4175 -6574 -1950 5090 3966 -1911 -3256 1167 6489 7002 2353 -1868 1479
708 1479 8549 9373 3573 96 2339 7537 9758 5507 -323 1056 7037 9198 4712 -300 -1135 3676
724 3676 7921 4674 -2542 -3433 1618 4704 2380 -3219 -5802 -2316 2962 1572 -5147 -7345 -3381
739 -3381 670 504 -3842 -8097 -5664 787 1682 -3374 -6955 -4265 1203 3202 -233 -5282 -3796 2508
755 2508 5411 1701 -2893 -2059 2485 6708 4093 -1904 -2466 2807 6583 4302 -891 -3123 722 5616
771 5616 4657 -1825 -4428 -452 4370 3723 -961 -4926 -2622 3242 4373 -1197 -4932 -2706 2139 4144
787 4144 555 -4453 -3983 2074 4471 612 -4463 -3607 289 3768 1531 -4503 -5751 -702 3258 242
803 242 -4481 -5999 -2784 1849 1254 -4548 -7151 -3056 1715 1453 -2834 -6024 -3671 2114 3534 -1704
819 -1704 -4809 -1800 3269 4970 1832 -2534 -1676 4187 7120 3084 -1439 -538 4033 6927 4933 -601
835 -601 -2281 3314 7022 4227 -967 -2238 1084 4681 4183 -1394 -4762 -809 3845 2608 -2264 -5178
851 -5178 -3148 1404 2573 -2485 -6654 -4406 528 1239 -2361 -6156 -5860 -571 2247 -1362 -6147 -5105
867 -5105 -301 2442 637 -3806 -4244 775 5287 3080 -1304 -1399 2792 6656 6560 2394 -229 4043
883 4043 9378 8484 3355 1645 4036 8292 9031 4269 -168 1903 6617 6812 2100 -1990 -1649 2323
899 2323 4127 -197 -5769 -5675 -1215 572 -2855 -7256 -8568 -4702 -709 -2861 -7951 -8447 -4200 -911
915 -911 -1597 -4926 -7242 -3293 2247 2225 -1860 -3638 132 4215 5714 2249 -918 1400 7172 8094
931 8094 4086 1159 2858 6673 8674 5641 1030 1385 6220 7428 3892 -100 -971 2134 4715 2427
947 2427 -3066 -4605 -1087 1426 -873 -5401 -7961 -5384 -1454 -2626 -7994 -10435 -7600 -4126 -4183 -7659
963 -7659 -10872 -9028 -4017 -2687 -6651 -9235 -7044 -2626 -410 -2454 -5848 -4620 989 3565 1281
978 1281 -1527 -839 3244 6557 5303 1476 636 4758 7663 5809 2151 307 2248 5747 4598 -371
994 -371 -3387 -1066 1955 992 -3774 -7142 -6189 -2887 -2740 -7271 -10733 -9621 -6305 -5691 -8473 -12341
1010 -12341 -11752 -7201 -4922 -7840 -11056 -9899 -6450 -3151 -4066 -7751 -7885 -3048 190 -721 -3731 -4032
1026 -4032 -1061 2923 3130 -447 -2263 1184 4850 4443 1559 -864 938 4288 5431 1399 -1900
1041 -1900 -252 2728 3028 362 -3429 -3787 -457 1129 -2426 -6311 -6229 -4035 -2772 -4311 -8562 -10034
1057 -10034 -6804 -4366 -6354 -10077 -10319 -8195 -5199 -5188 -8580 -10437 -7162 -3070 -3082 -5602 -6837 -4560
1073 -4560 -681 1605 -1319 -3745 -1206 3204 4351 2612 253 860 4450 6991 4505 739 1365
1088 1365 4685 5851 3897 897 -1013 1508 4301 2203 -2440 -3541 -1474 513 -466 -4113 -6734
1103 -6734 -5005 -1514 -2336 -6314 -7802 -6214 -3325 -2368 -4983 -8180 -6328 -2155 -1513 -3861 -5583 -4672
1119 -4672 -1528 1209 -532 -3681 -2980 1110 2978 1823 -390 -879 1876 5221 4655 563 666 3339
1135 3339 5952 5203 2503 508 2362 5606 5668 2005 -297 1505 3900 4263 1241 -1919 -1443 1959
1151 1959 2324 -857 -3312 -3143 -1126 477 -1287 -5068 -5342 -2026 -269 -2242 -4864 -4943 -2555 114
1167 114 -447 -3802 -4574 -1084 1934 1078 -946 -2030 -84 3567 3993 900 -816 1747 4644 5137
1183 5137 2968 396 937 4557 5656 2607 26 848 3400 4451 2554 -929 -1239 1628 3322 1120
1199 1120 -1983 -2382 -274 2009 1203 -2515 -3677 -1121 1579 414 -2454 -3590 -2139 796 1307 -1933
1215 -1933 -4057 -1958 1024 1189 -1116 -3170 -2581 772 2223 -375 -3053 -1867 1014 2264 578
1230 578 -1965 -2159 1124 3075 1214 -1630 -1457 981 3092 2437 -674 -1836 927 3513 2161 -416
1246 -416 -1849 41 2815 2883 -711 -2829 -915 1832 1934 -804 -2860 -2486 536 1973 -795 -3772
1262 -3772 -2375 255 1195 -358 -2984 -3509 -408 1669 -39 -3051 -3029 -259 1309 281 -2194 -3475
1278 -3475 -1041 1801 450 -2198 -3140 -970 954 1269 -1362 -3582 -1841 1196 902 -1629 -3045 -2021
1294 -2021 749 2219 -262 -3115 -1357 1454 2326 509 -1483 -1262 1482 3573 1768 -1283 -769 1884
1310 1884 3396 2252 -202 -1388 513 3323 2485 -1194 -2478 -273 1692 1404 -1266 -3639 -2284
1325 -2284 712 666 -2511 -3913 -2798 -642 412 -1753 -4168 -3295 -244 742 -1026 -2772 -2502 -177
1341 -177 1888 841 -2020 -1741 1119 2929 1366 -477 -699 1230 3661 3330 365 -408 1858 3981
1357 3981 3507 1229 -129 1090 4241 4132 952 -459 864 2816 3112 1317 -1428 -988 2103 2736
1373 2736 137 -2033 -1759 217 1299 -179 -3077 -3541 -1090 366 -1071 -3484 -4060 -2170 54 -295
1389 -295 -3176 -3722 -1407 609 509 -1346 -2187 -842 2185 2901 571 -516 1436 3824 4305 2808
1405 2808 862 1498 4595 5502 3340 1022 1926 3903 4722 3081 151 -164 2167 3434 1216 -1292
1421 -1292 -1709 -343 1037 121 -2703 -4032 -2470 -524 -1703 -3796 -4637 -3608 -1494 -963 -3615 -4909
1437 -4909 -3328 -994 -521 -2406 -3507 -2703 -20 1130 -318 -2168 -1370 1114 2119 1543 -293 -673
1453 -673 2133 3903 2355 210 572 2163 3625 3214 815 1 1626 3635 2579 410 -732 157
1469 157 1768 1879 -667 -2718 -1507 160 -366 -2541 -3980 -4109 -2354 -1554 -3513 -5817 -5166 -3184
1485 -3184 -2640 -3747 -5522 -5422 -3156 -1714 -2560 -4531 -4190 -2011 -134 -410 -2159 -2717 -454 2124
1501 2124 1859 -200 -589 833 2719 3024 1710 -149 1005 3225 3103 1186 -363 -124 1112 2459
1517 2459 460 -2329 -1704 -248 190 -1010 -3346 -3466 -2200 -828 -2409 -4618 -4876 -3065 -2177 -3107
1533 -3107 -4283 -5501 -4059 -1805 -2243 -4391 -4854 -3535 -1585 -1297 -2595 -4007 -2752 -94 223 -1262
1549 -1262 -2315 -1285 352 1796 836 -1214 -522 2048 2783 1450 216 254 1632 3221 2321 -243
1565 -243 -384 1563 2301 1162 -575 -1269 -591 965 422 -2269 -3326 -2142 -604 -991 -2796 -4310 -3961
1582 -3961 -1879 -1354 -3722 -4794 -3975 -2038 -1668 -2168 -3969 -3468 -771 6 -1165 -2204 -1887 -87 1616
1599 1616 1260 -798 -1051 1164 2869 2018 528 331 1171 3192 2950 968 -275 1376 2693 2307 715
1616 715 -460 -102 1534 2149 -5 -1511 -743 847 1091 -15 -2033 -1840 56 899 -827 -2629 -2224
1633 -2224 -899 306 -670 -2411 -3017 -1132 691 -301 -1986 -2188 -1113 518 492 -1204 -2136 -637 1440
1650 1440 1178 -136 -966 27 2272 2537 991 -355 847 2566 2795 1436 -90 721 2053 3026 1686
1667 1686 -392 -29 1505 2257 1433 -447 -1096 188 1472 402 -1457 -2258 -877 534 351 -1335
1683 -1335 -2701 -1522 453 130 -1466 -2294 -1190 27 970 -416 -2047 -1009 687 1304 -299 -1282
1699 -1282 -969 854 1754 909 -1296 -908 993 1508 812 -357 -1126 461 1918 668 -897 -1122 298
1716 298 1439 1061 -507 -1504 -90 1554 1306 -786 -1480 -305 996 1318 -293 -1592 -993 936 1235
1733 1235 -647 -1624 -1126 -178 802 -349 -2207 -2110 -185 458 -796 -2053 -2407 -847 441 -323 -2438
1750 -2438 -2319 -494 398 -46 -1346 -2084 -1017 622 649 -858 -1737 -420 726 738 -271 -1400 -1014
1767 -1014 793 1255 -440 -1187 -821 533 1031 294 -1256 -1279 727 1361 270 -1358 -1191 -111 918
1784 918 575 -1223 -1528 123 1080 510 -934 -1548 -572 1093 904 -1054 -2098 -855 388 451 -972
1801 -972 -1931 -1728 37 395 -1275 -2257 -1852 -583 -8 -611 -2178 -2216 -471 660 -652 -1516 -1386 0
1819 0 1242 708 -448 -721 533 1888 1315 -107 -27 617 1965 2228 625 -433 944 2119 1671 566
1837 566 -489 50 1106 1550 90 -1451 -997 702 838 -582 -1513 -1494 -211 727 -629 -1738 -1652 -718
1855 -718 175 -239 -1674 -2040 -691 676 256 -1387 -1360 -477 705 639 -412 -1151 -199 1248 1498 346
1873 346 -439 436 1282 1984 784 -260 602 1759 2030 1390 308 486 1923 2484 1695 54 169 1467
1891 1467 1863 1174 -127 -497 398 1286 595 -1119 -1419 -558 220 -212 -1413 -2295 -1531 -192 -329 -1713
1909 -1713 -2233 -1842 -470 88 -1048 -1844 -1406 397 523 -268 -651 -265 958 1570 1147 -254 149 1621
1927 1621 2046 1500 779 334 1163 2544 1995 456 195 1001 1764 1564 47 -594 114 1227 870 -552
1945 -552 -994 -723 -16 250 -777 -1965 -1622 -331 -300 -1542 -1862 -1725 -779 -303 -1004 -2125 -2279 -691
1963 -691 -119 -487 -1673 -1867 -587 399 240 -1176 -1254 -287 988 848 -182 -577 387 1450 1462 421
1981 421 -284 644 1437 1538 678 -190 -21 1613 1602 481 -822 -358 245 720 56 -1221 -1633 -687 18
2000 18 -1075 -2200 -2092 -1686 -1035 -1459 -2299 -2588 -1704 -588 -1485 -2072 -2461 -1811 -702 -331 -1437 -2120 -923
2019 -923 195 348 -115 -979 -523 889 1468 368 -929 -155 1015 1426 760 -9 -428 864 1601 685
2037 685 -623 -524 310 748 404 -862 -1396 -387 541 219 -869 -1365 -962 -70 29 -1204 -1789 -1258 -463
2056 -463 -437 -1173 -1783 -1683 -557 -45 -1098 -2153 -1530 -387 -198 -628 -1202 -1603 -264 612 371 -939
2074 -939 -808 309 1317 944 10 -370 710 1884 1296 497 219 682 1562 1633 496 -199 234 1302
2092 1302 1262 93 -431 -595 179 672 -170 -1421 -907 -253 383 -574 -1476 -1447 -708 211 -388 -1452 -1308
2111 -1308 -73 364 -61 -631 -952 -149 775 499 -602 -672 51 909 818 218 -386 77 1299 1429 26
2130 26 -319 207 1014 1279 668 -152 -17 1126 1356 537 -286 -71 565 1057 717 -528 -448 663 926 546
2150 546 -98 -445 19 889 535 -555 -943 -162 303 190 -654 -1079 -577 358 478 -854 -1129 -480 -168
2169 -168 559 -177 -853 -703 661 869 26 -583 -333 380 1012 878 -506 -229 634 916 662 16 -84
2188 -84 247 974 830 -118 -657 350 752 389 -338 -836 -484 373 581 -616 -1359 -422 419 442 -104 -666
2208 -666 -553 580 772 -164 -701 -499 174 423 241 -843 -880 -66 575 -87 -770 -1240 -441 292 97 -878
2228 -878 -1312 -482 443 91 -922 -1127 -697 92 194 -405 -1094 -275 237 599 -101 -672 -469 582 893
2247 893 -113 -435 -45 486 531 252 -694 -666 232 724 -49 -695 -959 -291 95 -47 -782 -1349 -268 238
2267 238 -50 -1214 -1002 -832 16 -53 -581 -1308 -971 -13 292 -586 -1094 -891 98 158 -682 -1002 -778 294
2287 294 165 -176 -814 -836 -60 549 -73 -567 -664 -70 373 441 -386 -434 -147 904 668 -204 -243 334 671
2308 671 618 -22 -615 -43 889 576 -139 -469 -395 222 345 8 -977 -657 -107 220 -393 -819 -946 -526 121
2329 121 -509 -1041 -1154 -812 -131 -145 -983 -847 -290 428 170 -506 -483 281 559 1040 232 -434 35 940 1007
2350 1007 214 43 419 757 1156 561 -43 155 542 858 317 -280 -463 465 620 326 -840 -559 146
2369 146 624 17 -313 -791 -328 445 211 -531 -781 -381 203 30 -189 -838 -766 293 159 -382 -976 -271
2389 -271 151 519 26 -624 -555 347 742 224 -356 -37 557 1064 838 214 89 692 1263 887 477 260
2409 260 684 1132 1162 163 -142 604 605 852 102 -300 -590 84 272 -469 -976 -645 -119 -228 -695 -1233 -904
2430 -904 -390 20 -756 -1031 -1073 -495 274 126 -289 -898 86 461 483 -179 -238 180 766 721 -74 -458 273
2451 273 938 888 202 -135 140 452 1050 181 -448 93 853 656 145 -426 -620 196 788 337 -728 -685
2471 -685 215 190 -107 -621 -973 -489 -106 -393 -964 -1169 -521 -149 -514 -982 -1018 -724 85 -322 -780 -1002 -482
2492 -482 -131 83 -313 -692 -579 501 671 48 -223 -133 398 1019 462 9 97 823 755 417 -206 -282 391
2513 391 753 241 -335 -556 -155 256 -363 -587 -1053 -421 -88 37 -470 -931 -620 -158 -257 -598 -893 -856 6
2534 6 208 -668 -428 -491 -38 254 -164 -625 -504 147 367 126 -107 -276 -51 608 376 -267 -363 256 604
2555 604 544 -289 -120 -165 617 602 -123 -36 188 362 532 209 -334 -41 452 634 -139 -421 -135 402 110
2576 110 163 -427 -421 -55 279 48 -523 -596 -263 251 -113 -747 -632 -118 246 128 -143 -392 -87 454 364 164
2598 164 -181 70 768 803 611 -212 253 744 716 486 -222 395 455 616 499 -21 -316 291 857 -14 -450
2619 -450 -43 148 333 302 -609 -503 55 746 181 -278 -304 -20 332 319 -221 -606 41 412 434 110 -112
2640 -112 -117 233 639 291 -570 -16 569 320 152 -117 -281 271 757 311 -181 -89 339 534 333 164 -192
2661 -192 358 748 461 23 36 208 699 614 102 -196 135 621 350 -253 -355 14 247 253 0 -572 -289
2682 -289 290 48 -482 -559 -346 -44 469 192 -486 -594 -174 159 -72 -441 -205 -56 264 498 -214 -273 69
2703 69 453 254 68 -586 -338 518 264 118 -431 -243 222 325 -231 -476 -310 136 -177 -119 -401 -513 124
2724 124 393 190 -536 -225 351 119 116 -211 -194 81 375 147 -381 -346 -51 134 194 -268 -752 -579 48 -59
2746 -59 -305 -733 -460 -36 110 -487 -786 -443 -160 -182 -410 -670 -615 -134 61 258 -497 -445 239 227 10 -136
2768 -136 -144 187 416 58 -259 -209 21 473 167 -257 -517 -397 445 59 -380 -574 -339 142 219 -123 -507
2789 -507 -404 109 29 -255 -643 -455 217 267 94 -317 -401 91 81 16 -456 -550 -318 -100 -65 -578 -649 -200 141
2812 141 -115 -223 -604 -338 112 165 -224 -601 28 225 345 58 -12 -102 328 513 197 -189 -22 232 228 198
2834 198 -8 -409 77 394 -60 -267 -298 83 46 -281 -423 -548 -297 86 99 -460 -497 -362 7 104 -460 -494
2856 -494 -351 419 222 -99 -204 -24 304 629 -105 -382 -99 254 264 202 -162 -294 274 496 201 -284 -31
2877 -31 176 520 245 -67 -162 144 240 352 -93 105 201 459 259 55 -369 -18 236 118 -169 -447 -220
2898 -220 164 396 -70 -610 -510 90 64 -278 -277 -377 -202 29 135 -423 -549 180 258 16 -324 -498 141
2919 141 421 119 -45 -283 273 674 344 32 -69 405 528 596 -19 -177 159 218 465 164 -384 -220 154
2940 154 73 -158 -276 -260 10 173 12 -409 -339 -372 97 -22 -207 -554 -260 129 91 -435 -411 -57 224 77
2962 77 -251 -377 -271 112 121 44 -227 12 350 295 17 -548 -298 -72 432 211 -146 263 174 319 65 -270
2984 -270 -198 287 132 220 -105 -287 77 248 217 -110 -372 45 169 341 28 -173 -127 -42 80 -328 -685 -346
3006 -346 -97 -233 -297 -713 -313 193 -201 -57 -182 -109 -9 136 42 -82 -297 190 436 313 -76 175 308
3027 308 530 253 -89 -325 213 344 274 -124 -10 127 195 454 -157 -244 10 59 17 -202 -196 -144 242 390 -105
3050 -105 68 -226 111 221 63 -510 -365 90 -1 105 -83 -152 -63 253 61 -318 -239 37 198 90 -102
3071 -102 -79 77 271 364 61 -48 40 343 71 103 -199 -17 369 392 415 -145 -157 390 427 372 207 -127 129
3094 129 473 255 97 -132 189 350 -37 -134 -99 -96 209 145 -402 -175 118 291 410 -83 -178 98 281 221
3116 221 164 39 -77 351 134 338 49 -173 424 583 270 -52 -104 285 413 112 -116 -190 139 229 94
3137 94 -147 -84 -110 343 265 -134 -168 441 174 138 25 -163 165 438 380 112 49 166 182 176 71 -140 -162 108
3161 108 286 -91 -70 -134 263 258 -64 78 -302 82 80 114 39 -176 -198 162 302 -117 -56 55 355 417 -85 -65
3185 -65 36 511 461 -94 -51 -9 114 172 283 -166 -323 70 181 153 -142 -209 -215 106 -300 -245 -382 -57 88
3208 88 -78 -137 -259 1 51 45 8 -3 -12 4 -44 168 -236 -59 142 -14 -62 -163 -80 125 -124 -210 -193 -439 -135
3233 -135 82 -140 -292 -252 86 -303 -107 -20 -324 -70 217 146 -391 -304 162 -16 218 12 -319 -100 409
3254 409 258 -103 -61 31 -25 85 33 -661 -323 143 56 -142 -437 -258 22 149 31 -471 -261 -182 196 -129
3276 -129 -417 -99 -59 28 -231 -111 -290 29 226 5 113 -342 27 314 102 31 -182 -424 -68 -48 -212
3297 -212 -150 -214 206 70 -11 -108 -125 160 19 106 -169 -219 -42 245 190 -143 -45 282 320 181 -169 -22 92
3320 92 224 22 -110 -178 -112 338 -68 -294 -185 -92 -2 -34 -86 -245 -80 89 100 -81 -269 14 -197 338 107
3343 107 26 -107 372 130 91 -76 -139 -57 420 204 394 -273 -147 463 161 -11 -343 63 32 129 -194 -281
3365 -281 -140 -34 122 126 -455 18 0 218 56 118 -9 271 101 116 35 -263 157 35 -241 -242 -322 -29 224
3388 224 152 -138 -108 -62 -17 -23 -52 -429 -247 244 282 62 -73 -152 294 302 -72 -177 -63 287 138 -175 -240 -157
3412 -157 82 372 153 51 -32 211 399 58 12 -232 -276 147 -237 -295 -277 91 -62 15 -165 23 -267 114
3434 114 105 -150 -128 -158 120 43 136 -291 -130 179 202 81 -72 154 358 82 -132 -115 -257 -285 183 20 -32
3457 -32 -150 27 141 -23 15 -141 13 574 198 -98 -245 128 251 108 -3 -89 -179 28 48 29 -33 -192
3479 -192 351 161 -168 -91 -202 -35 220 -206 -312 -240 110 196 285 -295 -47 109 23 60 75 -37 114 90 167
3502 167 -93 29 -34 22 46 23 138 127 169 64 6 -258 -5 -35 -87 -130 -71 -185 134 -44 241 -180 -249 -85
3526 -85 207 53 -245 -304 71 4 76 -39 -38 -91 -131 165 -114 -27 110 174 65 -17 -65 92 385 268 -117 -118 -177
3551 -177 280 115 192 -238 -324 -187 172 -48 -50 8 242 118 22 -357 121 86 117 299 113 -92 239 248 -27
3574 -27 -16 76 196 276 148 -144 -49 12 114 27 37 35 245 84 282 210 -191 95 79 183 -55 -262 8 166
3598 166 53 359 6 294 112 94 95 -79 208 86 171 59 -178 -118 13 130 301 15 -30 20 361 133
3620 133 -266 -313 -27 45 433 9 -14 123 -18 141 -22 -224 -96 35 -17 81 67 136 15 319 14 -227
3642 -227 51 185 223 142 168 57 12 230 181 -117 60 11 334 -61 -146 -259 -6 485 9 -63 -46 12 192
3665 192 341 67 -1 230 201 156 -66 -10 -11 31 221 180 -207 -126 -9 357 -4 -64 -171 117 179 -139 -157 -30
3689 -30 -28 -73 54 11 -125 145 110 82 78 -239 -404 79 31 -159 -60 -104 -75 61 -121 -114 -194 -207 64 80 -341 -16
3715 -16 -144 -161 120 54 -12 -22 -79 -199 -211 -166 86 118 -1 -8 -180 -7 161 16 -287 -147 -140 -79 -205 86 -319
3740 -319 -131 15 -282 -46 -141 -176 55 174 53 -140 -161 92 -8 173 -108 -116 -65 -71 93 -293 -184 119 276
3763 276 56 108 97 125 219 258 5 -80 -80 44 -144 -85 -170 7 -6 68 -6 -428 -203 -122 -19 99 119 -33 -16
3788 -16 77 -49 137 143 86 -237 99 56 -94 118 -201 72 22 114 167 342 -22 -21 -123 -157 32 -56 -161 -337
3812 -337 246 1 109 -61 -34 -29 139 -60 26 -35 -8 72 -24 93 129 -169 113 237 -115 -159 14 114 84 89
3836 89 80 -134 51 -98 167 -2 -325 -32 -104 -68 -56 -258 -196 -98 101 7 -107 -45 91 64 35 -96 -238 92
3860 92 163 -126 12 -116 95 105 -97 40 -94 297 244 -165 61 142 -60 217 86 122 -74 -177 -60 82
3882 82 -236 -48 -67 74 -44 -24 10 20 204 138 18 58 37 189 306 145 -294 -151 -72 -89 95 -76 -216
3905 -216 114 238 -156 -122 -271 -61 -5 -146 43 -110 -112 -7 -140 76 25 -14 -116 118 -116 2 -126 161
3927 161 -88 -35 18 -88 43 20 198 -227 186 7 264 -130 102 -11 157 9 -102 172 158 -182 -89 79
3949 79 -30 -59 -128 118 71 143 -120 66 23 153 125 -7 -33 49 119 196 -13 116 50 9 196 -25 37 51 64
3974 64 -77 97 -153 78 42 172 -33 -85 -96 310 109 -110 134 -256 -335 41 -25 -9 -117 -86 -125 -88 -74 46
3998 46 157 27 -130 38 29 -143 144 64 -8 17 -45 189 -1 -126 -36 119 33 -101 129 65 176 248 138 -78
4022 -78 -223 293 137 210 74 -63 -192 251 347 119 -4 111 -141 -5 -27 67 26 229 -170 -52 -20 -83 140
4045 140 111 -65 -137 -153 120 308 -99 -302 63 -30 2 -43 -108 -39 -3 32 86 -91 46 66 -136 191 -195 -296
4069 -296 -22 -9 -67 -151 -341 53 334 187 -50 128 -104 245 -1 132 152 -29 -96 267 118 36 217 155
4091 155 86 -27 -43 85 -151 14 263 -222 41 -177 -10 -159 -67 -47 -90 100 -132 -228 -163 -263 -85 206
4113 206 28 -83 147 190 22 -66 -45 111 10 -50 13 138 88 -1 -171 29 -26 137 -44 92 152 158 36 -37
4137 -37 -41 36 -299 -90 -202 -131 168 2 -117 45 110 328 -30 -73 -120 -113 88 171 -183 -157 -1 123 81 -227
4161 -227 -4 -61 165 39 79 -380 24 98 -90 17 10 -103 -88 11 65 -25 -140 -7 118 -56 69 93 101 -94
4185 -94 54 183 -30 79 138 -58 -49 -178 -57 114 199 -86 -109 35 -28 7 -37 71 71 -45 -160 -95 -51 -109 87
4210 87 -10 -11 -145 -128 -47 175 -83 107 -93 249 244 -200 -229 -1 291 78 -33 -244 -39 19 -51 15 -45 -134 -205
4235 -205 -135 83 -83 78 -183 -103 152 -164 -93 13 347 115 -26 91 -117 70 225 -327 -282 -272 153 67
4257 67 -35 10 47 97 54 -323 -159 -150 97 68 52 -199 -221 -65 36 -175 57 -19 203 61 -28 -96 -32 -75 -106
4282 -106 300 -44 -45 22 178 223 -32 226 210 112 3 104 9 32 265 0 110 -146 -82 -55 26 128 -121 -183
4306 -183 -72 264 -35 -62 -8 28 49 27 -42 49 -69 96 89 -184 322 -422 -96 165 106 -127 -251 -6 -1 118
4330 118 -109 -95 -109 97 18 13 -75 128 13 198 33 70 6 -11 84 -145 -124 -31 -131 -217 -108 -25 -359 56 312
4355 312 223 -78 -229 126 50 -255 -117 -143 92 246 8 -239 53 86 41 -95 -40 97 142 211 7 -30 -153
4378 -153 -108 56 102 -14 -48 -103 360 -123 -9 -215 59 -136 135 -119 -45 151 137 -66 19 -98 147 -183
4400 -183 137 149 48 -45 -99 91 -65 -130 -123 150 -30 16 76 -14 -99 196 111 -54 -38 -179 40 -47 -161 -90 38
4425 38 -32 -23 55 -23 -73 -125 77 102 -202 -44 18 149 3 40 -191 -89 71 89 59 -64 -23 145 71 -99 200
4450 200 161 -109 -149 -205 173 -451 56 -241 10 15 55 106 45 -92 111 -6 46 155 71 3 -122 166 -128 -63
4474 -63 136 343 -5 -69 -4 -88 -137 -124 -98 -166 -28 91 114 12 -87 -143 55 -147 45 70 124 -1 -152 54
4498 54 59 -35 -8 84 6 -10 68 33 90 223 -22 205 147 20 -4 -10 -211 -13 -160 -29 -185 264 -39 328 -44
4523 -44 101 241 67 -61 -7 18 -322 5 -123 -112 150 28 8 -28 -42 23 -38 270 -95 79 23 296 -52
4546 -52 -123 277 101 210 -53 -91 -42 81 192 -9 -88 -87 141 -85 91 -33 86 -158 276 -50 -29 -48 -7
4569 -7 -52 -103 21 -97 -245 10 8 -125 -91 128 168 16 175 34 -78 -71 -74 -8 108 97 173 29 -41 74 113 -49
4595 -49 -124 60 -106 48 33 217 261 -127 -48 -64 99 144 -101 -2 50 -21 48 2 5 -34 -1 22 -37 30 113 -88 -147
4622 -147 17 192 153 51 256 293 -87 193 206 81 118 -126 130 140 362 73 -81 -94 18 64 47 176 150
4645 150 -98 191 305 -249 -82 63 -162 -217 131 -175 -40 -166 -73 90 59 87 -77 30 176 -70 137
4666 137 -92 -98 -40 136 98 57 180 134 -47 4 -68 -112 -139 150 87 -82 -64 -119 84 55 118 -385 81 -150 -334
4691 -334 -19 -82 17 -290 -69 -11 123 -249 -2 166 213 55 -112 222 45 150 47 83 -68 2 96 159 -103
4714 -103 128 -91 52 241 24 3 -71 -15 -50 -66 -181 -205 -97 -47 284 -13 17 343 158 -2 -6 24 12 -81
4738 -81 83 -142 257 -234 -34 0 6 313 85 -6 -68 -2 -54 -190 -125 -151 -138 57 -50 30 -107 133 -169 -197
4762 -197 -71 164 270 137 -95 -122 192 -43 209 -185 93 116 4 -134 246 223 -39 -53 193 146 37 104
4784 104 108 30 -60 110 75 46 110 153 -80 -85 131 71 -48 -71 -143 -22 -312 57 -158 86 -71 -147 159 -65 -88
4809 -88 42 337 -187 7 -30 -42 -175 -251 127 -18 -65 -59 68 67 -69 -228 64 127 -181 123 81 31 -58 4 -51
4834 -51 -57 7 -53 -122 -111 -139 27 247 -73 -181 220 -19 151 -35 58 -8 -80 -67 -153 -22 70 -2 186 11 103
4859 103 30 91 207 -17 -41 193 0 41 135 44 -24 86 16 -31 -89 45 17 61 174 2 -14 -103 110 14 -143
4884 -143 52 217 63 -61 -75 -153 -265 -286 59 -27 -94 1 -31 122 -104 -354 142 61 -107 136 23 238 -138
4907 -138 38 38 -94 15 -124 -87 141 -26 -12 -39 0 -55 75 -141 -156 179 -93 149 -144 -91 -180 33 158
4930 158 146 184 -23 -45 -292 123 -115 167 207 -112 -76 -61 130 241 122 -157 202 104 -78 -140 90 -99 38
4953 38 94 -198 38 -14 -210 97 26 183 104 32 -81 125 142 209 91 173 154 -59 -16 -53 -54 -119 198 -247 -64
4978 -64 23 -12 -47 74 196 153 0 -33 224 45 73 158 -97 -90 -85 -245 -120 130 -169 -426 -282 30 183 -124
5002 -124 91 -2 -75 191 -50 93 92 -124 -84 -36 -48 -223 -85 164 -51 -77 -181 24 54 97 -154 58 129 253
5026 253 -191 -27 -52 -170 24 17 58 -78 284 -317 189 -227 154 83 164 209 -6 109 28 -74 -130 -146 300
5049 300 140 64 22 90 -211 -47 20 -277 89 -235 77 -402 -194 186 200 -20 -50 -90 -199 52 -168 107
5071 107 -77 15 84 2 -120 39 -105 -34 -7 22 21 181 91 -47 -81 23 -113 -141 69 117 -147 209 195 -103
5095 -103 71 -107 0 -62 16 -76 -201 -97 -159 101 20 208 44 -57 160 -62 -171 -79 86 -155 233 129
5117 129 20 -60 -149 60 14 188 -80 -91 -126 105 46 -218 107 -178 203 200 -86 -207 -34 -24 -207 4 -254
5140 -254 51 128 -43 13 185 33 -146 -32 -36 -8 118 35 107 64 109 -204 -155 140 217 208 -59 128 107 -101 193
5165 193 -80 208 187 -144 77 -117 -83 -92 -47 315 -139 -199 72 10 -96 4 160 -26 -39 117 -146 197 -11
5188 -11 -27 273 -251 169 208 -106 31 31 5 100 -329 -46 -18 9 -77 62 -109 157 -23 -120 56 -28 -14 81 -177
5213 -177 -158 48 -131 -136 -58 245 143 87 -136 180 -21 -53 47 118 91 -19 195 -15 3 -170 74 146 7
5236 7 280 -105 52 -107 -54 -155 101 -175 56 170 75 -65 -3 302 231 -16 183 93 -83 -58 -40 179 96
5259 96 -27 -75 91 -102 -256 56 190 39 -44 -156 214 142 25 107 -164 -24 10 -106 11 47 -92 -74 -126
5282 -126 50 52 99 -53 119 -57 -156 -15 -231 293 159 123 -120 -298 -117 121 -158 117 119 63 -74 99 59
5305 59 -122 60 154 76 187 75 159 -132 124 -125 -143 103 -41 169 1 59 128 188 33 -4 -137 -190 39
5328 39 -139 -20 -82 -82 23 -13 -251 6 -156 188 -155 -34 45 -139 -221 131 70 -144 -42 -36 234 -13 -4 151
5352 151 143 244 92 -121 -179 121 46 -71 -69 -93 -302 -26 3 89 -150 -30 -171 -45 -27 -88 -25 270 -23 -130
5376 -130 54 -54 -154 -40 -116 -126 -56 -53 -45 -46 -30 106 -120 79 213 -143 -55 -37 -14 73 115 220 -49 -68 54
5401 54 77 -208 -70 -160 125 153 157 -17 -71 34 119 55 -308 -70 56 -29 -118 -84 -44 102 131 -36 99 52 -115
5426 -115 6 -195 175 36 -154 127 2 -114 30 -151 121 81 72 -51 -341 29 80 -80 -55 110 -71 55
5448 55 -98 45 -23 54 -194 230 53 247 83 -78 -122 -42 134 69 18 -293 32 56 100 -75 6 -243 5
5471 5 36 -157 -14 15 -8 -27 7 84 327 196 15 30 -112 -17 -251 -61 101 -9 220 -188 9 197 115 39
5495 39 -122 -140 30 -60 80 -17 106 -4 -221 265 -46 -287 -212 127 -198 -143 46 -22 178 80 -80 145 135
5518 135 132 26 -32 61 17 -129 -94 331 165 -82 154 -9 243 -145 53 -30 -284 -21 143 16 13 -188 -107
5541 -107 -172 -252 13 -35 -239 -3 278 -267 -58 -54 -49 62 -188 -54 206 -82 -140 160 -166 405 23 72 -36
5564 -36 -200 104 -148 -197 23 56 -45 -122 -97 73 -47 20 -134 108 -157 -299 86 -42 77 -190 79 -62
5586 -62 10 -180 -64 56 -2 -141 -80 -134 -188 8 -2 15 40 -86 28 -33 90 -110 147 18 -76 90 -219 192
5610 192 207 32 -129 13 -308 129 -52 -116 -101 -150 87 -33 -33 -30 -29 110 -139 -30 31 -68 -55 31 117 174 222 190
5636 190 -154 16 1 -36 116 -54 -94 -152 9 34 -146 19 -38 -121 95 42 39 373 -11 -92 134 -258 -144 200
5660 200 315 108 -176 103 -15 -38 4 -93 -156 -197 -72 -162 81 67 22 -149 137 70 6 48 -196 -176 115 133
5684 133 -191 26 125 100 26 46 107 -69 42 -101 -11 107 162 -64 -1 132 -264 -117 -3 -168 37 34 -148
5707 -148 -185 75 -163 -91 73 -64 114 251 -46 -97 5 -44 162 -85 -121 154 -94 6 -36 -58 -73 26 -317
5730 -317 -141 190 -72 -168 78 142 92 -154 -5 271 -27 -220 -95 150 100 51 226 -51 6 -100 -124 10
5752 10 -47 81 128 -3 129 168 -232 -97 226 -266 -182 128 66 127 153 -50 -102 -57 180 -163 43 -194 27
5775 27 -2 -76 346 -68 2 62 -139 75 58 -127 -81 52 98 -65 -176 4 -121 -17 -131 -13 -62 -242 45
5798 45 26 -45 20 -5 55 -121 24 263 61 -144 63 71 148 32 115 192 0 106 -46 -100 -28 164 -24 328
5822 328 16 158 24 142 56 189 -28 -212 -69 -76 176 116 -125 -44 -345 -118 12 59 -116 19 -45 -45 -156
5845 -156 68 146 148 52 -448 -77 171 -24 -349 -33 354 98 -114 -46 115 -25 110 -47 60 117 202 -54
5867 -54 -9 -217 85 15 136 204 -239 15 -84 156 25 -5 -86 -41 -18 -73 -178 -164 -60 -280 162 -43 51 148
5891 148 -82 41 -7 -50 -143 -185 89 -213 21 -25 39 232 -29 -151 -125 62 -79 87 -151 30 36 -34 -243
5914 -243 29 -119 -39 122 -158 -225 73 63 -63 50 221 89 -261 160 84 79 -141 -105 48 78 -14 -78 155
5937 155 66 159 -72 130 43 27 151 -57 37 69 91 31 -90 57 78 14 21 -199 -153 123 281 170 99 223 155
5962 155 152 73 208 -96 -13 -126 64 -75 -93 -18 49 145 67 29 -268 -23 93 128 -297 -204 120 42 -60 178
5986 178 82 -7 55 -318 56 302 -50 -237 -106 54 62 -106 81 -69 40 -65 68 76 -17 50 162 -134 40
6009 40 28 121 111 75 37 -76 -21 33 115 -8 109 -145 125 -130 -193 -57 190 127 -12 91 -96 143 -107 -61
6033 -61 87 -157 33 21 21 63 -228 -272 208 -21 77 209 -168 37 79 4 -240 94 -84 -20 12 -234 -161 -221
6057 -221 101 -20 110 -160 131 -130 -16 14 185 -169 -74 214 221 20 -322 -254 -75 -196 -130 93 230 -110
6079 -110 -164 -72 -146 -3 98 36 118 -286 8 141 183 -165 -1 14 123 0 -58 83 203 216 158 50 -28 92
6103 92 -58 -112 -46 121 -188 -67 22 31 229 36 45 -4 -22 -75 -123 86 55 189 -7 23 -42 21 48 115 -243 115
6129 115 -127 -96 136 233 -80 -205 142 -1 -25 -241 -48 -76 31 167 126 -219 -12 -29 -46 -200 -58 -42 70
6152 70 109 309 3 124 -22 -107 77 148 58 16 -61 -168 -267 51 -239 -65 -83 -58 -172 123 2 24 -101 91
6176 91 -75 67 -96 16 67 -141 -133 -41 126 -215 -14 129 -88 192 -45 -62 -86 -36 -18 190 -30 116 39
6199 39 81 111 -125 168 212 -59 116 89 -20 11 -21 131 -85 -66 39 -51 -52 35 -100 -108 8 -200 -6 104 -140
6224 -140 -230 -61 -38 132 48 131 -93 52 -252 -140 -156 32 130 -147 -52 122 -85 -60 248 -46 -226 29 -125
6247 -125 -18 36 -213 -187 -108 31 124 41 -147 -89 269 -103 97 -80 -37 285 85 242 17 -19 -247 105 46
6270 46 -35 -78 -153 60 -245 -104 -21 -109 -79 38 141 271 64 -98 150 -154 268 57 15 -185 -39 78 143
6293 143 -80 -63 -15 62 -99 -176 37 -17 104 -49 -177 -115 -152 -2 -191 125 4 195 -98 -171 -319 5 -43
6316 -43 -161 140 -162 -240 -286 -45 -49 -143 -177 66 80 260 89 -286 -77 -49 -110 -240 -240 -165 -55 102 -16 -55 -241
6341 -241 -66 157 -118 -140 190 167 126 224 4 -22 51 -16 -22 11 -113 -161 17 33 -9 119 236 -28 -12 -108 217
6366 217 94 -227 240 -129 144 28 -91 47 -207 263 49 -95 -251 165 62 188 -158 -222 -77 -77 -95
6387 -95 -233 -14 110 -55 -81 39 26 118 40 -52 66 68 189 175 -28 29 196 -155 -79 -8 -16 20 -36 139 52 95
6413 95 -2 139 45 -61 83 -228 -111 -81 -36 88 -135 138 55 -60 -75 17 -15 -108 97 27 19 -32 -135 87 57
6438 57 -153 153 -117 -273 63 75 -81 21 -21 -76 -159 -13 -200 -39 52 142 -110 -126 -150 -158 183 47 185 59
6462 59 292 38 -134 177 -42 192 74 143 19 -153 -13 -108 -22 50 -54 -34 47 -227 133 -73 -170 217 -35
6485 -35 -138 154 61 -5 -225 15 1 -25 -165 -5 -52 30 -113 -30 38 -18 155 71 -234 70 108 -30 -10 118
6509 118 32 283 327 161 -3 -106 -47 -79 31 114 -5 -34 -109 -106 -255 5 -12 -44 215 42 241 -107 -30 55
6533 55 79 128 169 -30 227 -151 67 -38 -51 -13 203 33 -81 56 -121 -162 -311 -87 67 -109 -275 182
6555 182 149 -158 -146 63 106 32 163 -80 -16 -1 228 -16 22 94 49 -90 97 71 164 -283 -120 -180 -145 41
6579 41 268 133 20 -28 70 89 22 -40 -5 62 -223 354 267 -41 1 -22 232 -84 -83 -127 115 8 -45 352 240
6604 240 -89 35 -73 4 -101 90 109 -124 127 1 263 57 -216 -129 -88 -75 122 342 15 -183 -239 151
6626 151 6 -130 -4 -102 457 78 137 -93 -112 -81 38 62 -152 -48 87 79 116 -19 -105 76 98 159 85 -132
6650 -132 -63 -3 -217 -21 87 196 70 -49 -18 -6 120 18 -116 -86 71 -10 -198 96 65 -207 53 69 41
6673 41 67 139 -101 421 -160 -1 -23 -77 -16 -37 -83 -55 43 -14 -189 -60 -104 205 -4 -179 -45 -100 157 35
6697 35 -22 -91 28 36 -12 -234 -20 -32 -3 -3 -39 -43 -89 -23 -65 104 43 111 -10 -5 239 -113 -65 -94 151 143 -144 1
6725 1 186 176 -15 94 -201 74 -84 -73 31 -98 -279 -114 27 -114 -94 -217 -43 -50 60 -22 3 -57 -88 265
6749 265 75 -6 -125 43 -127 157 20 -34 -157 -41 -88 231 78 -342 -33 52 24 -180 106 22 5 68 43
6772 43 377 65 -277 174 -82 174 -79 -128 29 -58 -109 87 -83 157 -105 -116 -2 297 -43 1 -155 -153 -153
6795 -153 121 11 -47 65 -167 9 162 41 -159 -106 91 192 -63 -49 -153 -19 -142 -8 25 -136 -1
6816 -1 -93 276 -123 91 -241 -16 -48 -284 -267 276 -56 -29 76 52 -121 -110 -148 -253 -60 135 -184 -147 -117 -6
6840 -6 -156 -40 5 134 134 201 47 -108 60 96 -3 274 118 -77 47 -126 81 -26 187 203 -155 -122 -59 16
6864 16 -7 -173 42 -130 -75 -208 -71 -60 210 14 8 34 -125 270 -124 18 116 -215 -205 -143 4 -49 86 105
6888 105 -64 53 41 8 -52 -77 -90 -68 -29 -32 -25 88 -306 15 -208 -311 -30 133 46 -187 216 -106 -32 -51 91
6913 91 137 -118 -135 136 17 27 34 -20 64 55 100 -209 -105 105 6 7 -107 51 194 124 50 -10 -225 -199 155 -130
6939 -130 16 -93 211 -90 -96 -189 -201 8 166 180 44 44 -48 -81 -86 -96 -105 47 -90 -34 201 -120 -16 -175 84
6964 84 -8 -58 -148 119 -50 -208 -96 -138 117 97 70 -117 189 208 -264 -1 -4 -95 -121 178 -17 -44 -249 -73
6988 -73 -66 64 -35 -153 35 -98 -26 61 -68 -35 -100 -178 -83 -170 36 9 -149 151 98 110 241 95 191 23 32 352
7014 352 -138 -26 -85 62 43 78 22 -117 45 -326 83 -79 -188 -13 -131 95 110 -15 -74 84 106 -15
7036 -15 -337 89 -275 -8 -108 -137 353 226 302 -247 0 179 79 423 16 -68 -15 99 18 -265 215 68
7058 68 165 -177 3 -289 -4 2 -11 -38 -78 53 1 -16 -223 1 -135 -131 23 83 -28 32 -13 -189 -14 -127 201
7083 201 91 48 73 89 17 -21 28 172 -127 61 34 -155 -184 112 -86 254 61 -161 -130 4 -200 56 126
7106 126 -2 23 -23 162 -264 -47 -31 -48 14 -69 -42 -136 284 31 202 -86 1 40 -287 -14 190 -73 -78 -174
7130 -174 34 73 -176 240 327 -54 31 134 -143 45 203 -121 -220 -136 101 7 -98 54 -183 141 -233 -80
7152 -80 165 -264 61 -41 -22 -231 147 1 57 -216 -32 -168 -187 -136 -211 191 97 169 95 -120 47 36 0 -11
7176 -11 -9 -120 30 -11 -45 -292 -231 -236 117 201 -62 -11 -9 -36 155 -46 126 -73 4 -18 31 223 -42 -53 -92 -71
7202 -71 -53 -179 108 67 -71 166 -10 -10 169 66 -161 42 51 0 -16 -31 -305 66 -132 51 67 -87 13 54
7226 54 -170 116 69 -222 79 74 -32 -69 -46 -250 -60 21 136 81 146 69 123 -61 50 -137 -60 -218 275 177
7250 177 -29 92 29 138 -26 88 -40 167 120 31 -14 113 -32 -148 -153 -81 50 244 129 -103 364 120
7272 120 47 -132 -8 33 260 -60 -11 -178 -87 54 -156 -5 -44 244 203 23 86 425 9 102 53 -92 -136
7295 -136 -137 18 -129 8 -60 44 59 -75 39 -155 -112 54 -68 -119 185 -3 -102 153 -120 -177 -23 149 256
7318 256 -27 -258 171 88 -72 21 50 50 -9 0 -37 -64 -88 -34 160 68 -79 -53 159 162 99 61 -45 -156 -102 -115 74
7345 74 310 -199 -83 204 -57 142 201 -135 102 159 40 56 -238 75 -67 -137 40 -116 111 -270 -118 55
7367 55 57 -9 -195 158 25 3 -156 -17 59 3 134 -78 241 -232 -88 -143 -40 286 108 37 88 -209 24
7390 24 13 61 -35 -94 143 98 158 -156 -1 244 43 -162 -191 -95 299 -205 211 -47 -248 115 -3 74 -71
7413 -71 13 161 112 73 -26 14 178 28 -242 -16 98 96 7 118 -69 -36 38 33 -118 30 271 -137 168 -54
7437 -54 163 285 95 -87 3 114 -6 -67 222 -11 -106 -64 -80 -168 -60 47 94 19 -11 20 -228 -8 66 51
7461 51 -56 -96 -32 -33 46 -82 -36 -129 320 27 163 122 -56 52 -87 -53 -92 -151 -197 -22 168 -126 -8 -75 20
7486 20 -17 -105 -70 14 131 21 88 -130 -108 88 26 106 115 -92 15 -266 -10 115 -104 -205 28 -33 -50 -136 -184
7511 -184 -22 164 -4 110 -87 -112 140 50 133 -219 191 -108 -77 81 -34 -56 -25 79 -104 78 -33 58
7533 58 -129 -54 -8 -4 200 -123 367 -109 83 192 -115 87 -93 18 73 24 -206 59 152 40 -67 148 -115
7556 -115 60 -62 -182 -2 5 165 104 164 -198 -11 -93 -134 -188 50 -46 10 -96 -192 126 81 -203 131 28 -52
7580 -52 38 -175 97 192 310 140 -35 -52 -120 -101 179 73 -73 -183 -46 -3 -418 -182 20 -25 -363 76 164
7603 164 -88 57 80 17 320 108 108 201 139 -125 143 55 177 -72 169 -39 -216 13 -194 272 21 -125
7625 -125 163 3 -222 11 280 -106 53 -93 -156 -14 16 -188 -133 -71 -223 120 48 -33 154 7 316 -356
7647 -356 -107 -88 76 -47 -113 57 129 -24 -21 -200 -51 -49 -90 151 -137 -79 -247 125 -10 103 -80 54 209
7670 209 335 61 10 -126 141 -103 -262 -3 -15 -197 168 137 -64 137 92 -119 80 -14 193 112 8 34
7692 34 -94 145 -188 159 -108 -65 -109 134 101 -120 156 -176 -75 126 -8 39 -1 -104 -55 216 -116 134
7714 134 -15 71 145 139 -17 -129 -67 121 35 -98 -204 28 -164 -30 56 -138 73 117 -132 214 7 -165 153
7737 153 -106 195 13 -109 130 -90 75 -55 145 94 205 60 75 -47 -23 -228 -224 124 -158 -170 -139 8
7759 8 -6 -128 185 -109 -23 100 116 -92 -25 114 -50 -31 -83 115 109 33 -205 -8 -202 140 189 -214 -172 169
7783 169 55 86 -88 -90 -96 46 144 -14 117 -148 -7 50 -1 -144 -153 -53 -129 -68 -121 -106 323 -58 -41 197 -4
7808 -4 181 198 279 -168 112 74 71 231 199 281 -35 37 -43 -153 -208 66 144 98 -127 -365 -17 -167 25 99 -258
7833 -258 99 -55 -133 77 -197 42 78 -167 -117 -92 -95 -68 -189 -42 47 -5 188 -65 -107 67 -16 42 -247 155
7857 155 39 305 -165 4 -42 41 217 118 -164 27 -107 72 210 123 -238 142 21 55 56 -94 -8 -184 31
7880 31 -57 -173 -76 299 -98 -8 -146 74 174 160 24 -21 66 175 120 170 -136 -128 221 -147 0 19 22 22 4 -8
7906 -8 5 34 -215 82 -247 51 45 32 -47 -83 -57 -24 -213 -69 -225 51 136 59 215 -27 -65 -1 -201 -4 222
7931 222 29 129 127 74 -208 -159 -24 -76 -143 -73 -87 -111 -49 94 -66 -112 12 213 149 59 260 -16 53 -139 148
7956 148 184 -31 75 -85 -77 -110 59 -37 -1 -163 -136 13 -5 266 141 -244 -93 -3 111 152 -82 88 79 -80
7980 -80 20 -8 35 68 50 -110 61 59 310 31 159 281 133 86 -77 111 -51 -376 81 -32 -78 119 35
8003 35 87 -6 174 -1 55 67 -107 -40 -221 -21 -85 -59 136 -231 -88 18 30 -33 140 -145 -228 89 -173 -105
8027 -105 175 207 156 154 9 14 54 -10 -276 -100 -61 -75 127 264 -118 -119 -22 206 -13 -59 -148 -48 43 -39 -7 -3 -260
8054 -260 76 -112 -11 137 -186 -294 -46 11 -19 16 -19 6 24 -116 -108 -154 -65 237 79 0 10 83 -80 -31 74
8079 74 178 -172 195 -74 216 -260 -161 78 2 -116 -319 36 -18 51 153 -105 37 69 -86 -66 -58 118 -107
8102 -107 -46 -42 -59 -38 -4 -79 -223 -85 121 19 69 83 12 104 118 147 207 -29 79 -84 -157 8 73 178 129 -180
8128 -180 166 -76 -199 234 126 82 -99 113 49 163 30 130 45 -90 31 41 166 -203 -180 -34 -79 -62
8150 -62 204 -130 -135 1 -325 -54 -74 253 139 24 -30 -269 -41 95 -91 272 94 75 -43 -80 -176 19 190
8173 190 159 -7 -112 -206 16 -49 -22 -135 -218 -234 -53 165 -73 -81 -82 21 -34 88
8191H8
$$ Imaginary data points
##PAGE= N=2
##DATA TABLE= (X++(I..I)), XYDATA
0 0 0 0 0 0 0 0 0 0 0 0 0 0 0 0 0 0 0 -7 8 -8 8 -8 8 -16 16 -16 23 -24 27 -32 35 -40 48 -53 59 -67 75 -85 94
39 94 -107 117 -131 147 -160 178 -197 216 -239 264 -290 322 -354 388 -429 474 -524 581 -646 725
59 725 -815 925 -1057 1224 -1441 1736 -2164 2846 -4111 7251 -33617 -36178 1743 -19202 -35618
74 -35618 -84610 -114838 -76284 -9556 -19513 -67095 -81034 -61022 -44520 -29721 -36063 -59436 -52442
87 -52442 -1740 19877 -15765 -50936 -35990 3617 32121 33663 11224 -15546 -8731 25612 39671
100 39671 18355 8058 24739 31028 14447 4993 6142 6563 17891 27274 3196 -25849 -12965
113 -12965 8008 -7560 -26854 -20940 -18105 -23510 -21266 -33646 -59669 -49947 -13581 -16236 -51909
126 -51909 -64863 -52387 -39512 -27418 -28071 -51181 -59989 -32734 -11328 -26733 -45074 -36718 -15578
139 -15578 -3442 -3268 -14776 -25337 -11976 16630 23012 2720 -8240 9100 25731 22773 13918
152 13918 9807 10879 22387 31996 16135 -6179 1844 23399 19023 -695 -8702 -9684 -7130 2471
166 2471 -3380 -28751 -34862 -12466 -5742 -25756 -38951 -35405 -28038 -18948 -17767 -34689 -46526 -29358
180 -29358 -8895 -14666 -30688 -31160 -19224 -7524 -3984 -10877 -20310 -13762 6499 13634 -1220 -11889
194 -11889 56 16306 17596 8918 2305 2109 13329 25568 18064 -1465 500 18904 22246 10089
208 10089 1564 -268 3920 15444 15001 -5855 -15798 444 11772 1214 -11185 -14375 -11952 -2663
222 -2663 1388 -11904 -26191 -17808 -1902 -3103 -16483 -22786 -18155 -7597 -1482 -8068 -19398 -18501
236 -18501 -3621 6048 -2174 -13681 -9711 4170 10238 5306 -1564 -3686 5169 18619 16902 949
250 949 -2589 11882 20729 14311 6421 2261 4215 15391 19905 4268 -8243 2678 14766 9950
264 9950 -530 -6029 -5876 2598 10262 1089 -14095 -11396 2947 5866 -2997 -10903 -11380 -2783 5943
279 5943 1920 -10372 -13098 -1901 7828 3259 -8410 -11060 -1635 6841 4660 -3879 -9490 -4683
293 -4683 6865 9130 -3356 -11903 -2760 8141 6539 -979 -6401 -6003 3701 12091 2806 -10319
307 -10319 -4701 8601 9720 2592 -3121 -4240 2800 13111 9209 -5386 -6805 5776 12181 6696
321 6696 -1551 -5224 120 9908 9624 -2249 -9265 -1310 8465 7169 -3234 -9314 -4445 4625 6395
336 6395 -2123 -10367 -8490 2186 6990 -1828 -12447 -8860 1686 4212 -1492 -9139 -11115 -2810
350 -2810 6479 1522 -11492 -11702 -322 5073 787 -5881 -9355 -4156 7315 7554 -4355 -8917 832
365 832 10157 8886 2058 -2928 1133 11744 15849 6622 -1496 3602 14298 16632 8717 754 2453
380 2453 11504 15697 8852 -839 -2503 5808 12365 5518 -6675 -8048 385 4817 583 -8718 -13924
395 -13924 -8243 1639 -298 -12702 -16629 -8170 -947 -1707 -7616 -13435 -9998 1836 6258 -3291 -9607
410 -9607 -2552 7666 10234 5462 -630 805 11858 18551 12564 3756 5715 15490 20706 16361 7534
425 7534 6147 14360 20742 16708 7340 3543 9832 17705 14804 3002 -1614 4843 11101 8619 330
440 330 -6677 -4194 5043 5816 -5219 -12738 -7502 -367 490 -5424 -13004 -13249 -3386 3042 -4435 -13517
456 -13517 -9893 -607 4320 1201 -5390 -6752 3214 12723 9502 1073 1676 10168 18027 17771 10734
471 10734 7267 14320 23492 22839 14629 10257 14416 22595 23428 13491 6098 10027 16870 16407 8336 226
487 226 -618 6535 9581 239 -9776 -8583 -1917 -242 -5126 -13366 -16447 -9176 -1677 -6374 -16369
502 -16369 -16239 -7956 -2299 -3242 -9312 -13000 -6027 4631 4624 -3345 -5278 1611 9352 11681 6085 740
518 740 5125 15539 17890 10803 5139 7564 15673 19387 13366 4964 6013 13871 16311 10436 2717
533 2717 318 6039 11208 5743 -4785 -6758 -1047 2080 -1440 -9355 -14947 -10685 -3481 -5978 -16098
548 -16098 -19701 -14337 -8946 -8963 -15126 -20361 -16950 -7897 -5483 -12579 -16567 -12145 -4024 124 -3340
563 -3340 -9113 -6869 3078 8398 4423 -1096 559 8051 13984 11543 4113 3372 10572 15238 12343
578 12343 5323 1647 5699 11824 9602 68 -4469 -775 3197 1789 -5364 -12025 -11264 -4151 -3968
593 -3968 -12852 -18428 -15441 -10555 -9171 -13894 -20338 -19901 -11884 -7716 -12631 -18502 -16516 -9912 -4935
608 -4935 -6671 -12864 -13320 -5263 1275 -925 -6327 -6786 -1003 5890 5931 -437 -3057 2388 8803 8672
624 8672 3192 -643 1814 9026 10652 3128 -2292 805 5694 6782 1750 -4987 -5323 618 3517
639 3517 -3300 -10183 -9613 -5486 -3285 -5740 -13039 -15938 -10237 -5301 -8710 -15419 -16630 -12011 -6839
654 -6839 -6945 -12655 -15898 -10597 -3416 -3672 -8192 -10340 -6189 443 3142 -1322 -5661 -1532 5290 7832
670 7832 3947 121 911 7329 11488 6597 269 1181 6602 9541 6193 243 -2745 2495 7140 3376
686 3376 -4013 -5471 -1895 1569 809 -5136 -10143 -6523 -37 -1273 -7671 -10677 -7484 -2707 -1210
701 -1210 -5491 -10851 -8275 -1310 204 -4287 -7866 -6409 -1227 2892 -76 -5765 -4829 1270 4798
716 4798 2568 -2296 -2973 1942 7375 5342 -497 -1776 3428 7745 6921 2197 -1231 2191 8167 7426
732 7426 1351 -1413 1202 5810 6802 1839 -3381 -1782 4303 5414 -255 -4978 -3882 565 2991
747 2991 -168 -6429 -6686 -696 2324 -1258 -5929 -6704 -2484 2328 975 -4926 -6417 -1257 3324 2064
763 2064 -2376 -4897 -1652 4452 4721 -870 -3835 -342 4193 5581 1280 -3254 -1881 4164 5734
778 5734 1002 -3390 -2109 2695 5515 2206 -3592 -3580 2384 5335 1959 -2694 -2936 1148 5570 4167
794 4167 -1965 -3832 1198 5501 4083 -1020 -3282 -596 4397 4921 -1168 -4746 -1699 3163 3376 -1305
810 -1305 -5512 -4246 942 3051 -2062 -6407 -5322 -970 1509 -1096 -6559 -6860 -1343 2288 -839
825 -839 -5251 -5358 -1299 2760 1837 -3614 -5307 57 4739 3273 -1116 -2625 154 5191 5940 647
841 647 -2576 1136 6160 5967 1705 -1388 -7 5191 7002 2469 -2233 -544 4083 5532 2232 -2658
857 -2658 -3119 1908 5111 1287 -4069 -4165 -243 2579 902 -4531 -7016 -2618 1755 -704 -5350 -7311
873 -7311 -4364 -381 71 -4597 -8047 -4512 1145 1432 -2570 -4799 -2963 1999 4574 1188 -2579 55
889 55 5632 7481 4696 1713 2005 6737 10533 7828 2735 3122 7746 10214 8110 3515 1423 5158
905 5158 8717 6190 892 -1121 2074 4256 3615 -1097 -5150 -2817 1756 1304 -4022 -6943 -5289 -1027
921 -1027 158 -3293 -7326 -5744 -215 1373 -2088 -5208 -4025 476 4106 2004 -2480 -1854 3637
936 3637 6980 5659 2237 1393 5221 9641 8987 4131 3066 7071 10741 10315 6266 3799 6048 10479
952 10479 10519 5623 2637 4488 7800 8265 4276 -114 513 4566 5233 1134 -3095 -2736 290 1950
968 1950 -946 -5973 -6402 -2135 -200 -2813 -6408 -7098 -4002 -16 -736 -5096 -6292 -1688 2289 1827
984 1827 -780 -2400 969 5978 7040 3156 1667 4392 8747 10080 7271 4173 5383 10048 11402
999 11402 7780 4297 4844 7808 9455 6511 1940 841 4408 6078 2577 -1537 -2895 -772 1456
1014 1456 -337 -5075 -6869 -3869 -1184 -2613 -6213 -8226 -6372 -2587 -2150 -5895 -8263 -5252 -1417
1029 -1417 -1090 -3364 -5751 -4361 715 2675 -515 -2823 -1255 2913 4969 3455 258 117 4728
1044 4728 7628 5257 1995 1889 4871 7553 6918 2405 731 3793 6633 4681 1043 -875 441
1059 441 2927 2669 -1644 -4753 -3321 -674 -1121 -4468 -7355 -7228 -4492 -2884 -6285 -9784 -8808 -5041
1075 -5041 -3978 -6007 -8778 -8816 -5054 -1727 -3763 -6477 -5668 -2217 689 495 -1913 -3214 125 4603
1091 4603 3623 483 -257 2233 5503 5582 2632 -122 1855 5407 4890 1768 -447 77 2442 3729
1107 3729 435 -3628 -3201 191 720 -2011 -5098 -6035 -3574 -926 -3050 -7257 -7595 -4470 -2751 -3983
1123 -3983 -6411 -8007 -5764 -2116 -2435 -6022 -6961 -4455 -1501 -1052 -3178 -5365 -3462 920 1250 -1656
1139 -1656 -3079 -998 1982 3447 1993 -1353 -296 3665 4908 2390 261 423 2844 5078 3631
1154 3631 -302 -1008 2259 4160 2264 -986 -2490 -681 1949 1173 -3052 -4802 -2550 -306 -975 -3482
1170 -3482 -6016 -5008 -1351 -635 -4074 -5917 -4311 -1500 -352 -2051 -4721 -4068 -226 1712 -397
1185 -397 -2757 -1868 759 2838 2120 -999 -1071 2189 4287 3163 446 -237 1707 4486 4036 694 -1340
1202 -1340 1259 3960 3479 529 -1556 -287 2760 3587 146 -2441 -967 1682 2355 47 -2565 -2346
1218 -2346 966 2649 -69 -3059 -2368 312 1759 589 -2569 -3346 -571 2079 297 -2331 -3080 -990
1234 -990 1535 1428 -1383 -3324 -994 2351 2066 -635 -2166 -669 2323 3385 531 -1728 -289 2784
1250 2784 3614 1536 -740 -798 2590 3781 1703 -1441 -589 1871 3177 1845 -1030 -1794 1020 3227
1266 3227 1356 -1716 -2009 89 2257 2052 -1360 -3055 -449 2537 1738 -998 -2189 -1020 1475 2321
1282 2321 -178 -2898 -1276 1939 1813 -345 -2549 -2048 536 1915 -290 -3486 -2927 153 1351 -321
1298 -321 -2695 -3333 -850 1717 396 -2635 -3051 -470 1806 1287 -776 -2568 -385 3117 2534 -202
1314 -202 -1330 587 2756 3696 1281 -867 167 3504 3518 951 -609 -375 1731 3171 1059 -1934
1330 -1934 -1975 970 1983 -36 -2588 -3038 -1017 908 -417 -3681 -4134 -1459 -51 -504 -2822 -4197
1346 -4197 -2463 373 253 -2696 -3945 -1643 616 1138 -855 -3236 -1685 1733 2349 -78 -1686 -472
1362 -472 2019 3264 1789 -672 -351 2765 4265 2287 257 654 2618 4542 3804 711 -181 2510
1378 2510 4111 2539 240 -506 660 2782 2419 -726 -2601 -673 912 605 -1478 -3717 -3037 -208
1394 -208 204 -2691 -4146 -3273 -1036 -172 -1852 -3674 -3135 -210 1224 -408 -2339 -1277 1132 2966
1410 2966 2432 484 101 3020 5230 4107 2228 1905 3426 5711 5840 3202 2002 3444 5439 4935
1426 4935 2727 1015 1625 3910 4118 1596 -807 342 1837 1937 301 -1822 -1867 55 1206 -1110
1442 -1110 -2864 -2641 -657 292 -542 -2836 -3462 -954 849 -225 -2296 -2307 -613 1465 1316 -352 -1366
1459 -1366 399 3075 2867 1484 360 1753 3991 5121 3237 1387 2527 5018 5563 4213 2621
1474 2621 2365 4624 5855 3956 1241 1671 3035 4223 2837 515 -592 750 2361 862 -1642
1489 -1642 -2390 -1127 261 -314 -2611 -4333 -2649 -516 -1271 -3018 -4020 -3153 -816 102 -1602 -3217
1505 -3217 -1901 595 1292 10 -678 -382 1745 3947 2400 525 1048 3192 4454 3642 1965 1157
1521 1157 2928 4800 3624 1635 959 2468 3619 3078 1058 -372 452 2292 2129 -507 -1920 -1218
1537 -1218 144 456 -1229 -3244 -2867 -903 -426 -2297 -3875 -3543 -1912 -850 -2142 -4240 -3895 -1752
1553 -1752 -494 -1604 -2969 -3056 -1424 522 351 -1870 -1763 84 1920 1708 265 -561 1047 3243
1569 3243 3128 1199 307 1540 3164 3452 1781 207 277 2571 2867 1003 -1070 -727 771 1268 145
1586 145 -2268 -2811 -799 -313 -1685 -3399 -3944 -2716 -1333 -1888 -3541 -4566 -2740 -781 -1842 -3073
1602 -3073 -3679 -2398 -509 40 -1966 -2817 -1133 533 785 -216 -1150 -692 1471 2267 811 -624 303
1619 303 1613 2425 1454 -218 -202 1757 2614 1254 -80 -536 838 1836 1402 -874 -1590 -58 1588
1636 1588 864 -1206 -1913 -956 218 775 -1556 -2888 -1712 108 -5 -1755 -2745 -2407 -558 307 -1521
1653 -1521 -3006 -2373 -198 610 -713 -1869 -1789 77 1635 453 -1087 -719 945 2208 1919 259
1669 259 -195 1319 2950 2271 765 80 1045 2560 2688 1098 -664 575 2361 2034 287 -698 -506
1686 -506 1113 1978 -80 -1794 -1398 597 1012 -144 -1596 -1506 -115 1142 109 -1873 -1511 347 1432
1703 1432 816 -795 -1231 218 1634 1233 -623 -1082 356 1822 1483 91 -1595 -300 1653 1489
1719 1489 141 -673 -134 1224 2124 649 -737 -320 1328 2107 849 -664 -56 1271 2192 1456 -474
1736 -474 -104 1430 2147 1455 -157 -770 535 2208 1416 -436 -1006 180 1413 1137 -526 -1602 -721
1753 -721 1087 1125 -709 -1650 -638 603 992 -100 -1977 -1270 958 1210 80 -1621 -961 396 1509
1770 1509 699 -1070 -1078 507 1690 564 -666 -989 111 1361 1056 -493 -1383 214 1536 990 -193
1787 -193 -984 -195 1400 1658 -28 -671 153 1397 1579 533 -730 -353 1372 1802 167 -886 -432
1804 -432 825 1231 446 -1197 -1516 18 828 -257 -1699 -1795 -730 114 -423 -2159 -2353 -1161 94
1821 94 -329 -1728 -2305 -1357 71 66 -636 -1775 -794 922 1085 234 -756 -440 1198 1992 739 -455 257
1840 257 1627 1964 979 254 -301 1103 2292 920 -378 -349 732 1361 1012 -432 -956 -123 1247 602
1858 602 -977 -1467 -637 311 506 -1081 -2088 -1171 84 -22 -968 -1812 -1530 -211 338 -531 -1800 -1291
1876 -1291 -76 532 -186 -1470 -1093 96 1381 577 -607 -620 813 1804 1535 496 -155 1314 2706
1893 2706 2164 849 664 1386 2308 2380 1269 278 812 2149 2097 785 125 17 1258 1308 56 -1353
1911 -1353 -881 47 434 -295 -1571 -1860 -830 309 -781 -1851 -1977 -619 277 278 -1161 -1265 -373 1134
1929 1134 747 -284 -728 467 1899 1859 990 204 980 2506 2403 1554 736 1307 2292 2899 1760 483
1947 483 851 2145 2485 1360 490 484 1154 1935 1394 38 -644 808 1528 907 -169 -1155 -536 647 689
1966 689 -884 -1755 -676 117 16 -1012 -1504 -1077 74 634 -758 -1204 -892 264 784 169 -776 -466
1984 -466 961 1773 1037 53 408 1372 2480 2232 801 660 2256 3131 2369 1051 815 1555 2425 2077
2002 2077 793 7 826 1537 1244 54 -788 -617 495 578 -561 -1794 -1368 6 -268 -881 -1833 -1674
2020 -1674 -472 130 -768 -1687 -1594 -541 99 -133 -958 -1275 21 898 518 -509 -548 183 1383 1154 156
2039 156 -433 580 1776 1289 90 -230 428 1432 1653 642 -388 148 1385 1266 345 -370 -361 582
2057 582 948 116 -827 -823 -60 503 113 -1228 -1662 -882 114 -535 -1815 -1908 -890 -186 -713 -1625 -2100 -1137
2077 -1137 -215 -80 -1166 -1568 -1218 249 424 -409 -778 -599 800 877 440 -50 266 1162 1926 1028 -34
2096 -34 -99 1104 1397 790 99 -273 630 1279 543 -477 -791 -55 636 144 -777 -1403 -606 375 94 -1045
2116 -1045 -1575 -818 -120 179 -565 -1445 -881 369 208 -527 -835 -623 -48 670 -13 -836 -601 603 981
2135 981 203 -350 -784 127 1226 942 -346 -543 649 1416 796 70 -528 248 1476 1494 259 -142 719
2154 719 1240 1210 639 -212 49 1041 1273 254 -199 -150 815 822 304 -733 -785 319 801 -129 -926 -698 -119
2175 -119 527 231 -967 -867 -39 858 347 -600 -568 13 1105 1006 67 -543 444 1167 1130 455 -209 147
2195 147 1266 1618 601 -237 302 943 1243 811 -293 -318 547 1243 471 -276 -351 474 862 861 -3 -437
2215 -437 452 1466 649 -67 -71 386 986 930 122 -322 212 1178 846 -25 -589 -320 658 898 -133 -757
2235 -757 -140 712 668 -116 -588 -578 27 633 164 -745 -737 136 1102 638 -385 -297 504 1088 1047 -51 -106 338
2257 338 893 1087 516 -313 372 1023 734 191 -182 23 769 981 -19 -429 -246 588 534 121 -552 -523
2277 -523 372 817 81 -736 -550 260 608 171 -177 -1062 -259 693 101 -738 -754 -439 262 -84 -694 -1154
2297 -1154 -786 383 -9 -517 -688 -389 348 703 137 -640 -575 186 695 33 -210 -105 730 1068 901 -70
2317 -70 145 775 913 514 88 -168 354 870 387 -228 -477 92 492 90 -604 -1238 -759 402 7 -945
2337 -945 -1233 -868 -322 -165 -690 -1282 -1077 39 160 -447 -802 -656 418 317 45 -718 -528 257 480
2356 480 419 -164 -315 287 819 770 -203 -236 371 768 710 294 -88 -29 1163 874 410 -329 -49 514 600 235
2378 235 -528 -237 308 557 -20 -515 -435 78 278 179 -734 -864 -28 394 -495 -963 -885 -513 90 15 -771
2399 -771 -914 -150 504 11 -348 -606 -222 549 997 -69 -212 43 1047 1129 516 19 522 1137 1604 952
2419 952 327 518 772 1146 906 274 55 464 947 362 -324 -431 114 408 100 -294 -1014 -393 225 67
2439 67 -753 -583 -523 133 223 -436 -689 -265 389 315 -121 -319 -191 639 880 306 -375 -41 591 908 694
2460 694 255 -14 823 1249 587 415 244 835 1365 873 240 -50 651 1226 851 352 -21 463 1093 973
2480 973 235 -291 -140 503 850 25 -567 -208 -77 268 -92 -745 -919 -267 210 -317 -614 -746 -379 240
2500 240 -11 -869 -775 210 607 185 -318 -442 467 1014 611 206 91 176 961 950 536 110 361 1102 893
2521 893 260 -177 217 498 584 74 -466 -200 327 305 106 -439 -882 -93 267 -55 -620 -681 -519 32 -8
2542 -8 -625 -626 -260 286 169 -732 -625 -335 380 182 -339 -757 -404 103 347 -45 -437 -201 109 639 273
2563 273 -251 -243 795 569 232 -197 139 377 705 632 -351 52 441 802 231 -267 -99 55 475 482 -402
2584 -402 -519 113 320 97 -350 -732 -513 -2 126 -639 -840 -458 -213 73 -131 -498 -496 -16 373 -188 -465
2605 -465 -159 426 685 386 -496 -372 390 791 477 -314 52 515 1024 530 -18 -281 281 471 668 147
2625 147 -466 -126 385 752 81 -584 -239 616 515 -106 -154 -382 335 458 5 -201 -17 41 266 123 -398
2646 -398 -141 209 707 278 -263 -293 343 574 595 -212 -581 58 707 464 -80 -14 -98 488 584 -138 -219 355
2668 355 735 682 229 -73 218 783 641 553 -121 119 723 964 554 37 -84 282 760 315 -138 -23 441
2689 441 477 550 25 -277 269 647 473 -91 -198 -90 582 432 22 -154 -32 415 383 132 61 -136 623
2710 623 594 302 -329 -225 454 508 -70 -48 33 401 549 445 -69 -219 163 612 198 75 -122 86 504
2731 504 307 275 -112 -47 707 720 402 -88 -34 642 740 213 -181 196 438 498 83 -294 26 264 289 105
2753 105 31 -150 -238 321 150 -496 -442 -209 284 144 -309 -256 -118 219 188 -183 -197 96 105 419 37 -212 -85
2776 -85 420 552 -134 -164 -84 357 512 7 -202 -104 257 469 151 -296 -287 189 223 260 -79 -400 5 353 236
2799 236 -68 -327 -240 378 347 -238 -513 -122 223 151 -398 -559 -251 -49 237 -98 -698 -398 -236 -59 -361
2820 -361 -499 -776 -353 43 -197 -145 -262 -135 305 296 -218 -473 202 565 678 -331 13 89 414 467 -53
2841 -53 -257 -9 477 382 -119 -392 -65 335 604 -141 -450 -473 242 -3 -213 -426 -314 87 251 -223 -461
2862 -461 -457 -424 125 -263 -374 -489 -77 359 -184 -411 -279 -123 134 -88 -105 -183 -87 327 274 -23 -339 42
2884 42 146 181 71 -296 58 258 693 173 128 157 175 486 363 -75 -32 385 446 497 -168 -125 103 668 48
2907 48 -274 -331 -43 210 226 -303 -289 -251 117 143 -178 -336 -226 -26 223 74 -569 -48 24 251 -25 46 -58
2930 -58 126 330 169 58 42 306 408 192 100 115 284 507 149 -225 -41 235 508 242 -19 -23 99 239
2952 239 174 -126 -443 218 190 223 -311 -462 -105 162 303 -225 -177 -172 239 140 32 -330 -379 42 -18 17 -445
2975 -445 -365 -262 242 -106 -138 -359 6 427 -21 -35 -328 11 366 153 39 -54 12 496 256 130 21 -103
2997 -103 426 569 195 -249 212 333 406 -104 -345 -110 313 347 -50 -463 -142 13 20 45 -343 -419 -325 158
3019 158 -181 -558 -318 -252 141 26 -121 -543 -260 339 352 142 -117 -88 294 361 54 -265 -228 311 214 119
3041 119 -202 -190 263 253 190 -233 -156 10 314 263 -192 -188 -184 172 214 -170 -45 -5 131 173 12 -282 109 162
3065 162 90 -15 -429 -269 -140 165 -162 -477 -324 -62 -54 -160 -280 -28 -35 -10 186 -215 -127 125 194 44 -87
3088 -87 -113 38 206 184 -22 -328 57 410 318 152 -296 70 569 291 -14 -72 -255 171 79 -114 -266 -164
3110 -164 88 61 -2 -274 3 -56 147 -117 -507 -123 30 322 96 -9 -91 75 362 258 -127 -269 299
3131 299 149 -30 192 13 -115 541 130 75 -192 151 142 350 127 -275 -70 258 384 114 -74 112 216
3152 216 181 264 -161 62 325 585 235 -35 52 282 355 183 131 37 245 308 260 156 61 -75 382 182 -89
3175 -89 25 59 79 259 110 -285 -114 408 85 -102 -261 0 173 23 194 191 174 252 191 389 110 -32 479
3198 479 298 529 131 19 369 270 -73 146 -133 -102 299 104 220 -62 142 372 323 332 -43 -40 208 347
3220 347 30 279 122 128 357 131 -72 90 190 200 -81 -50 132 -37 207 200 -59 -549 57 384 33 -233
3242 -233 -125 -100 -129 -39 8 -151 56 272 184 -24 -13 98 196 557 314 -191 -3 82 400 355 -99 33 212
3265 212 58 340 49 -150 217 225 27 -116 -374 -29 188 214 -254 -157 -179 150 145 -183 -76 -166 292 195 -130
3288 -130 -111 -13 124 233 -17 -177 23 237 -59 -94 -78 -65 356 176 158 -85 207 -87 140 121 46 -307 -163
3311 -163 246 359 -16 -145 33 204 123 93 -344 -127 357 278 -75 -291 -184 -3 -77 228 -303 -246 112 -119
3333 -119 34 -435 -382 84 90 49 -100 -245 32 5 -193 -76 -311 -222 128 54 -247 -62 -87 324 413 108 -218
3356 -218 35 55 277 -88 24 -134 -106 401 262 -66 13 103 169 20 -194 -379 224 -51 -98 12 -319 -104
3378 -104 235 196 -19 -131 117 126 -88 70 -292 -172 228 225 -145 -22 -22 -143 -86 -95 -174 -168 44 -116 -47 -194 -365
3403 -365 15 316 -152 -321 22 47 462 258 0 -71 177 460 64 77 132 343 26 -100 -218 -164 170 -2
3425 -2 279 100 -132 -256 -272 143 -218 -205 -47 -59 -47 -319 -377 5 302 55 20 -382 -111 -15 227 34 -112
3448 -112 -72 17 307 78 7 -73 -101 144 248 -204 -395 162 276 298 -281 -99 -283 -64 -85 -187 10 -164
3470 -164 28 85 -180 -398 33 -53 372 149 -224 -174 -178 184 182 -275 -146 40 285 232 -90 -160 179 99 39 -40
3494 -40 -306 -20 246 -25 -25 195 -161 -207 28 -297 -99 -153 -40 -35 -348 -37 6 20 99 159 -47 60 245 14
3518 14 310 -15 -54 61 371 118 -165 -193 106 -62 28 -129 -5 179 267 -7 -221 -442 2 -94 26 5
3540 5 -278 68 -61 52 -22 -245 -153 -30 -127 46 -35 138 48 114 9 -86 -187 -159 157 -26 -297 -253 -22 62
3564 62 28 -277 -263 14 258 -46 -198 -125 87 -61 152 -52 34 86 455 -66 15 -128 132 192 126 26 -392
3587 -392 -129 131 161 61 -223 138 -12 120 94 -92 -314 -382 43 -134 -20 -294 277 237 86 -64 -7 138
3609 138 321 76 258 -5 183 213 162 -53 10 -37 318 102 -62 -94 -25 -84 24 29 -144 -26 246 91 325
3632 325 247 -108 85 245 194 -97 -41 312 353 228 107 41 217 125 57 -48 -62 -184 -78 261 -10 -83 364
3655 364 51 119 56 -205 -191 120 154 -45 -122 -252 -24 52 73 59 11 41 -137 154 -9 -88 399 302 131 -185
3679 -185 -105 -122 197 116 102 28 -26 62 31 -232 -178 215 260 16 9 -45 39 247 174 141 -119 -395 -84 184 -70
3704 -70 -8 135 92 213 26 121 213 -5 -1 129 65 34 126 147 -114 73 -114 65 269 125 -190 -151 111 212
3728 212 -116 -91 15 -247 290 314 13 -85 -216 283 159 -227 -105 89 299 168 159 121 175 89 236 -11 -18
3751 -18 -82 103 -131 -68 -104 -147 11 202 -196 184 94 -170 172 150 -96 -70 225 145 69 292 180 -337 -30
3774 -30 246 33 79 43 145 81 183 104 -217 -59 -24 90 133 -201 22 143 349 -102 -226 -235 -112 -197 -166 -231
3798 -231 -114 109 131 -59 -78 -78 10 128 89 -231 -37 -14 164 11 204 -189 -12 -78 14 -75 -112 17 52 24
3822 24 -119 -77 101 19 161 6 -60 160 12 36 97 -84 103 86 82 -3 195 32 -10 76 19 15 -268 154 186
3847 186 -254 -226 28 136 -173 69 72 -150 65 69 89 -57 -291 -162 97 272 36 -137 -131 181 134 -45 -100
3870 -100 64 189 14 117 -201 -108 143 228 113 28 7 -93 19 -146 -91 -77 -236 189 -120 147 16 0
3892 0 44 109 -98 262 84 70 101 -217 -12 171 88 -60 -302 83 -293 -127 75 8 1 10 124 -68 123 -193
3916 -193 -99 105 -85 104 -180 -111 -68 110 -14 -69 -24 90 34 215 -115 23 170 152 91 93 23 14 84 127 -54
3941 -54 -237 -1 407 262 -210 73 -143 218 227 45 -43 -99 -267 -148 -41 -500 -121 -165 -108 90 -49 -15 -100
3964 -100 36 83 -74 103 0 -5 55 -41 -14 -213 100 290 147 -110 171 156 188 101 48 -113 108 27 -163 -111
3988 -111 -190 42 331 46 -171 -228 -3 354 -74 -74 -179 -152 35 -26 -16 -107 8 -9 -120 -189 -56 -226 -97
4011 -97 -80 -23 -55 -27 -199 -102 -131 -109 -56 -63 -58 98 166 121 339 -215 -117 -65 -66 178 114 26 26 -159 191 146 21 -40
4039 -40 64 10 42 -4 -120 12 -299 71 249 -39 -66 92 72 211 -132 -154 -208 -166 19 123 1 -128 -199
4062 -199 157 -28 -266 4 -8 -32 -235 -172 120 9 22 97 195 -104 -32 -201 -9 -126 -111 177 107 88 -148
4085 -148 78 -131 243 106 -104 12 -240 -115 -8 101 52 -55 295 152 -33 16 -129 9 90 49 94 13
4107 13 121 247 -71 -147 -206 -59 307 -39 41 -80 -23 106 176 -223 24 82 43 0 -239 91 295 -8 468
4130 468 -56 -40 -2 -150 292 -55 -80 91 8 99 29 23 108 258 124 -11 23 -206 -178 -54 215 -62 -61 -7 272
4155 272 94 243 124 -90 260 102 10 -47 -90 46 -56 459 35 11 178 99 91 -55 77 79 84 14 -378 262
4179 262 138 12 64 100 -150 -74 80 184 38 7 192 -120 53 -32 14 -85 332 10 -37 169 84 -31 -5
4202 -5 -8 -115 -77 38 97 -30 -74 75 241 -95 -20 -86 -160 194 172 36 -97 -41 102 24 92 -53 87 -149 92
4227 92 168 -144 142 -29 2 -41 -93 -102 166 138 -266 -118 -306 -123 193 132 -44 -259 -90 -100 33 -209 174
4250 174 43 87 159 -130 -168 18 308 -34 93 -1 -148 -47 20 84 -143 29 199 105 -194 86 -192 103
4272 103 68 -7 -81 -35 -85 -10 282 65 -113 53 105 -131 136 -77 -142 220 191 191 -1 -27 96 215 -39 -21
4296 -21 -25 -10 -76 150 -120 180 -10 72 64 -266 44 -134 76 -25 -86 74 -354 124 11 -202 -180 124 149 -44
4320 -44 160 -103 54 185 89 87 119 -107 18 217 40 -57 -63 -29 104 -71 139 -267 -159 354 -259 89 101
4343 101 122 42 -89 -11 -52 -102 265 206 75 -22 -14 201 -50 -118 29 12 11 211 -51 -45 -105 303 -62 -136 222 110
4369 110 105 -17 9 -101 -315 2 72 -150 -51 -175 -9 -29 -30 -45 143 -23 165 37 -73 -48 -74 10 168 113
4393 113 -28 126 -57 284 -31 -109 -133 16 -150 -97 -88 -69 -93 -94 143 -66 7 27 96 -26 -175 79 93 102 -190
4418 -190 79 156 3 -116 120 60 -7 -27 -49 29 -149 162 97 -123 59 338 86 -54 70 54 -126 -430 -18
4441 -18 -127 -97 -205 25 -255 -76 107 -126 88 -76 103 220 -66 70 -200 -14 -92 -231 105 23 133
4462 133 -5 192 34 -113 -63 -58 25 -14 -30 -126 -126 -35 -41 89 -10 -109 -80 -29 -40 -274 30 -40 74 -81 65 68 -99
4489 -99 -3 -122 21 0 106 55 -61 1 -190 -221 33 -6 104 52 14 223 -115 -131 -95 109 132 146 141 -291 14
4514 14 -90 -29 -26 36 23 64 119 -324 -37 -234 53 4 -121 -302 -140 77 -7 -185 71 244 -20 34 -45 -213
4538 -213 19 -255 -101 -144 -28 -78 257 -112 -109 -76 -83 -81 -16 16 25 150 96 96 151 103 -14 48 -162 -86 196 13 109
4565 109 189 168 28 -162 19 -195 79 63 -14 -113 144 160 13 -50 130 -113 -278 144 51 257 228 -105 -2
4588 -2 -111 79 -223 -65 34 -35 -83 -50 -114 -124 41 2 -117 -112 40 -257 126 106 29 147 -75 -13 195 68 78
4613 78 -54 -23 -90 64 123 217 159 -85 103 -42 218 -8 89 -76 -17 -67 -54 153 34 273 -79 -59 72 -17
4637 -17 -100 -19 104 -154 -110 326 55 -5 110 -226 -80 -76 304 36 -237 29 70 14 -72 -84 142 -116 -63 82
4661 82 -31 -52 -43 108 46 118 5 18 189 71 -125 250 95 15 -132 -18 -292 -138 54 97 -236 96 62
4684 62 147 221 -93 226 315 154 18 -87 122 203 -97 -44 -44 -69 228 -136 -34 32 207 -37 -221 134 -216
4707 -216 -147 143 116 219 401 -10 71 47 -11 6 0 102 132 -56 78 31 -52 99 -188 -274 -146 -74 -185 192
4731 192 -29 -15 -157 102 96 -49 -137 -93 -22 -55 127 76 -27 -33 120 137 15 -100 -69 -114 145 386 -285 -74
4755 -74 247 83 -98 8 -497 -41 82 -185 -30 -158 -195 -120 -20 72 70 -170 -4 -170 -73 286 174 -119
4777 -119 -189 133 -76 238 -34 -75 -66 -171 -353 -167 -37 142 197 134 123 -230 191 -91 -134 175 -31 104 24
4800 24 99 -27 120 -149 -22 -76 127 -220 -144 -66 55 21 -12 83 52 -122 -230 11 24 27 -147 -8 -25 237
4824 237 -97 -92 39 -52 135 -77 -39 132 75 82 297 -13 25 -39 -137 -69 -216 78 59 -40 83 151 -49 -75 6
4849 6 164 -35 -104 36 -81 111 -62 -48 -47 74 97 -87 -25 -27 133 -183 82 -119 163 72 -28 8 -44 -141 133
4874 133 53 98 -119 104 248 46 -28 12 11 100 28 62 -49 258 134 -65 -160 100 -159 -201 309 25 -55 73
4898 73 -37 -63 72 62 -153 3 143 115 -30 -65 3 146 97 17 -108 -25 -17 -65 180 92 -64 126 -3 -201
4922 -201 115 245 11 273 -245 -207 -121 -9 123 -18 -16 159 65 -65 196 0 193 -69 29 179 120 198 95
4945 95 159 179 287 -46 -278 145 45 -21 -121 -100 98 -113 -80 -189 315 -10 119 -254 217 189 -47 40 138
4968 138 71 -4 34 -307 56 -237 -173 86 328 -144 -67 34 129 -73 -70 -6 -3 -103 30 113 -96 -68 90 128 26
4993 26 -133 203 58 4 -9 -139 24 -151 -196 -74 47 -453 32 -134 18 20 37 44 -202 80 13 79 9 -127
5017 -127 -75 -16 74 78 42 208 390 197 -53 -222 162 10 70 -52 50 33 -19 -158 -74 -120 147 57 72 55 20
5042 20 -36 -147 183 -137 -167 -87 -194 472 -88 32 52 5 -220 -43 -22 -71 -144 -173 -125 123 14 -184 69 -190
5066 -190 23 56 185 -149 99 11 -179 91 86 -11 -1 -372 28 257 118 86 112 -46 81 -59 43 -306 -94
5089 -94 -147 -50 -91 69 130 137 -176 -112 -125 107 15 13 -9 -69 -186 77 -94 366 -199 -17 -139 -77 -40 -207 -18
5114 -18 40 -93 -345 90 -133 49 -136 152 -157 62 -33 -58 -143 61 -170 -85 -77 152 62 82 -271 292 240 -247
5138 -247 25 -249 -29 15 9 101 46 -69 -73 -164 -142 -183 55 -35 -51 -166 114 65 -58 10 -88 -3 -20 145 6 51
5164 51 57 -55 -23 10 -80 -181 -61 -31 126 152 -201 -114 194 21 313 125 -64 -99 99 -189 102 68 40 24
5188 24 192 163 36 -40 -170 -162 -48 -85 87 -83 21 -74 -175 55 -43 -82 171 125 95 -133 -190 -31 -1 174
5212 174 -87 0 -78 -193 156 -293 72 102 -232 -240 -46 102 235 39 -97 112 107 -9 -128 180 121 99 -52
5235 -52 -72 348 -193 -67 -239 127 324 -91 28 -28 22 -187 233 -181 29 -97 -327 60 5 -221 292 82
5257 82 -48 -10 -5 223 17 -48 165 -57 46 53 95 -135 56 91 97 89 -95 -132 128 -45 -34 98 19 -12 10 -24
5283 -24 54 -160 238 -269 183 90 191 -116 -108 28 -25 -158 170 -24 43 48 -5 -61 -61 -107 -176 56 115 21 -68 -293
5309 -293 22 67 -117 24 -98 42 4 352 19 23 11 -161 -122 -205 139 13 -33 -10 7 -115 -61 121 -174 -69
5333 -69 -31 139 35 -44 194 175 -80 64 53 -78 56 -154 -157 -106 -104 16 -243 -168 24 -108 65 -91 49 -19
5357 -19 250 -19 -253 86 39 -121 -45 -42 -123 -185 198 50 -11 -115 -39 242 -287 123 -116 9 -199 -15 -138
5380 -138 28 272 -276 257 -24 -191 145 -35 -4 237 95 -61 -120 15 272 24 -167 29 68 102 -81
5401 -81 53 98 -19 -108 15 39 21 27 37 -9 -177 54 119 25 59 -75 103 122 75 33 0 -314 82 -172 43
5426 43 110 12 0 49 -69 -14 35 38 -52 -71 -6 -23 -38 27 212 -91 -65 -196 -426 79 178 117 316 33 12 250
5452 250 81 -129 -7 48 170 -47 -145 -24 -34 -101 -2 280 -90 -3 -71 31 53 150 -72 -276 -398 -91 61
5475 61 -35 -57 58 -270 202 108 18 119 -240 -354 -57 32 304 -16 2 -74 62 200 33 -164 -25 -150 123
5498 123 40 -31 78 -159 -41 30 -229 44 55 -74 12 -101 215 65 -87 118 62 -4 -86 -84 66 -27 2 194
5522 194 -78 -56 -143 -59 -12 -314 -28 -106 -103 -82 -54 183 -127 -137 158 156 -12 -101 207 -113 -21 -21 -113 -124 131 157
5548 157 -386 -124 103 118 -54 49 162 28 70 -37 102 -140 203 -17 -164 247 -120 92 120 -142 -47
5569 -47 61 55 137 -149 -65 308 -143 224 -56 -11 33 315 11 60 -48 -184 199 271 60 106 199 179 46 -65
5593 -65 -155 -4 -13 85 -53 -64 -22 93 106 -234 118 -61 -150 53 -294 -230 8 -255 -80 -177 17 -176 235 -88
5617 -88 28 118 70 106 -12 77 216 258 244 -140 28 -97 128 -228 167 55 -36 42 3 115 61 -65 115 196
5641 196 -70 62 -87 -105 -14 -157 36 137 -6 -99 -79 -11 292 -228 -58 -24 20 220 102 -218 -34 208
5663 208 136 205 -84 139 -35 -68 53 -88 168 215 -166 76 2 -63 58 -163 -36 136 -28 -77 111 -252
5685 -252 -102 84 -101 20 -150 -25 191 40 -80 335 -99 42 26 -10 -164 -137 149 -164 56 -27 -104 -72
5707 -72 7 -27 -79 92 -1 142 101 -41 -136 233 38 224 44 74 215 90 -48 -86 17 -112 217 193 150 -184
5731 -184 128 59 44 -38 275 -104 -158 169 73 -71 -79 39 101 129 46 -151 -142 -125 -297 39 33 144 112 61 39 101
5757 101 72 -200 -29 94 -22 46 -3 182 -41 50 -89 -58 -348 81 133 101 -211 -68 -118 142 -47 0 200
5780 200 -271 32 112 67 -84 72 71 136 18 228 136 -127 -51 76 112 -97 -78 29 236 0 126 -272 26
5803 26 24 -162 165 160 -144 45 39 -107 -177 -66 142 -6 -9 -131 -127 85 108 89 7 60 230 -322 -77 -84 53 70
5829 70 -41 205 47 -144 -149 -248 8 -98 28 39 271 -87 142 0 189 39 -217 210 104 216 -16 97
5851 97 -104 -39 229 32 -126 -253 -231 7 130 -135 145 198 -240 61 150 -420 -128 -75 -127 313 -118 169
5873 169 -116 19 138 -24 -26 -181 -69 150 96 42 -13 -59 -31 -259 169 203 177 -6 -182 20 -54 -194 142
5896 142 -1 -28 -36 -23 -136 29 -158 58 196 163 31 -43 103 307 -6 -34 -199 25 -132 -107 15 -67 -54
5919 -54 59 -169 -20 -71 -145 -234 -39 -23 -79 86 -25 -83 80 83 127 87 -71 -67 69 -61 -36 101 284 -22 406
5944 406 -114 -61 91 -132 -60 92 -21 -34 -5 -139 192 -58 -288 -137 201 85 204 -192 200 -92 -72 42
5966 42 2 -67 -274 183 120 39 -76 87 48 156 -24 -14 227 -244 92 -274 -169 80 -213 45 17 86 30
5989 30 42 173 0 110 62 -308 147 67 -84 13 149 42 -130 -57 131 33 -126 -69 191 75 -158 -95 -112
6012 -112 150 -5 -262 -23 91 -345 51 16 23 -157 141 -180 -74 -88 -330 -277 -26 42 -83 204 -36 25
6034 25 -8 83 -125 -57 -33 -44 -174 90 -131 -98 99 -8 74 -57 10 -63 -52 -273 -135 -86 76 14 -4 -60 161
6059 161 -142 -48 287 169 -104 -121 -185 81 146 38 100 223 -22 -72 -52 -8 82 -18 -55 76 111 -63 -195 -236
6083 -236 -143 -16 -157 102 64 -2 -147 -137 20 -81 77 -36 -165 -18 0 190 68 190 185 -40 12 19 -96
6106 -96 -69 69 284 -101 94 -43 -227 145 50 111 -185 -279 -141 -221 -38 168 45 132 -171 -209 106 53 -39
6129 -39 109 46 -13 284 -14 52 -290 -191 27 98 -76 56 125 -59 -24 107 190 54 -50 265 122 55 189
6152 189 -194 -3 -32 -101 181 -52 -191 60 -139 -43 -90 -24 -217 -65 11 -133 -16 70 36 -175 169 91 -55
6175 -55 77 10 178 91 -60 311 135 5 87 -69 -169 -116 92 20 51 -169 228 -66 -141 -122 -76 99 -103
6198 -103 -262 166 123 -31 -45 -17 28 -92 27 -160 209 -226 9 -93 -285 -28 -193 145 -89 -100 40 186
6220 186 -85 5 -103 -452 -121 138 -102 213 -52 -279 54 -172 13 204 205 -76 -122 -147 -199 -90 -64 -71 -82
6243 -82 30 -164 117 93 -72 24 -33 76 50 -56 164 201 270 -51 1 22 -76 71 -244 19 -2 134 -33 50
6267 50 -77 -29 -161 -150 -92 -58 64 107 115 -7 35 -246 135 121 -92 18 264 156 193 -23 -89 68 -89 -188
6291 -188 -179 165 -149 -103 116 75 -17 150 177 88 -178 -114 97 250 -43 35 -181 -24 162 171 -203 132 355 -139
6315 -139 -172 -118 -51 26 -5 162 43 213 -2 -3 -85 112 94 -171 -166 -203 -197 -26 -72 198 220 104 -18 33 -33 -121
6341 -121 272 60 -150 -262 -58 8 -57 -191 47 15 1 112 321 168 73 -49 -21 33 -43 92 -204 145 -232
6364 -232 215 -283 54 129 23 -138 205 -77 -243 204 41 -164 192 68 -155 169 -202 65 52 -32 135
6385 135 -41 -86 288 -69 58 116 -3 -41 45 123 300 23 84 -268 -65 -81 -93 25 -54 -76 -7 -109 177 163
6409 163 -262 -181 97 -31 -32 112 -76 9 -222 -85 5 -44 231 -57 105 -65 -27 50 -57 -96 -49 137 -213
6432 -213 68 -20 -23 -64 46 -109 57 325 -37 -69 -55 -63 40 -18 -36 230 -72 -23 -94 -41 -39 -282 240 -115 256
6457 256 -46 20 340 71 -34 -41 142 -140 175 64 76 -158 16 105 -59 132 -102 -196 198 185 -92 -96 -80
6480 -80 -49 161 -148 12 -34 34 -50 -37 -67 141 -208 74 -31 178 -183 -70 -11 -137 -207 121 -90 -84 -33 217
6504 217 42 -48 -67 -66 81 70 -34 168 -220 116 208 128 162 168 29 -130 111 5 89 -72 -9 40 231 -100
6528 -100 82 -128 -46 84 105 -86 -107 44 110 123 133 119 -71 -30 -82 -110 -16 -136 29 -97 7 82 61 120 31
6553 31 70 -84 -166 57 -68 -160 224 -86 -57 -93 -103 92 160 62 95 44 65 -113 298 -91 -222 -35 76 -15
6577 -15 130 45 111 97 -108 78 141 18 -318 -31 97 -58 -143 263 -9 -78 12 -47 -42 -52 157 162 -20 215 -16
6602 -16 17 65 -96 243 -106 -32 -66 -72 129 22 208 126 -238 153 -143 -17 17 126 -67 78 152 -8 199
6625 199 53 -4 -158 86 7 117 -156 77 -73 -85 -74 40 -7 -63 -124 -78 46 -67 -130 -22 -63 191 -106
6648 -106 -145 -52 3 227 196 250 -48 -13 17 -115 -50 89 -143 -74 72 -5 -18 21 -15 110 36 -63 -114 53 27 -73
6674 -73 -129 108 -69 -49 -206 30 92 -51 -323 -318 150 5 -192 93 -119 -204 -126 -115 -99 162 3 120 -81
6697 -81 -58 156 31 -53 -37 192 48 170 -274 116 -42 220 6 -51 41 -98 -93 -14 158 -72 113 28 24 -15
6721 -15 76 146 50 -183 -141 -202 -102 171 233 -87 129 -402 -35 128 1 15 36 -14 -12 228 61 -7 -99 -132 110
6746 110 -66 224 -3 16 -169 72 -34 -190 268 42 -59 98 34 -33 -17 -24 184 142 -18 250 84 21 -193
6769 -193 60 -39 89 40 -2 116 -14 -135 85 -175 -189 -130 -136 54 2 302 -167 43 235 -1 -151 -143 -1
6792 -1 15 -70 261 -41 -155 134 127 -7 -181 62 -1 50 84 163 -6 70 -153 -97 57 -316 31 0 -134 -219 67
6817 67 122 140 44 -33 -43 -38 10 -232 148 143 -58 -9 -83 -113 -21 -106 -74 30 -69 -236 60 23 7 -175 -64 -66 194
6844 194 247 -420 215 -130 100 21 -140 168 175 28 216 -185 -157 -45 -171 414 19 -161 47 -170 2 -116
6866 -116 5 -230 35 95 -49 -219 -59 -91 -80 181 91 -138 -100 -253 -63 125 -47 42 72 9 54 -87 -59
6889 -59 11 58 3 -61 -90 -17 117 -208 406 214 102 249 -2 0 -66 65 -11 106 -215 -162 -63 110 -107 -219
6913 -219 22 72 91 -36 -189 -20 119 9 114 158 -90 -86 -181 -122 249 -179 -194 -131 -324 -128 -144 164 18
6936 18 -46 -95 -36 229 -76 63 -53 305 -60 231 -116 186 149 64 -315 -85 77 161 38 92 129 -196 -1
6959 -1 26 -17 171 -129 202 5 47 135 -41 4 89 179 -74 -30 80 200 69 111 53 29 0 97 89 -174 -171 37
6985 37 -91 150 -158 74 -161 -102 -46 -10 39 140 -154 12 -7 -142 66 -54 115 -51 -141 53 47 -277 -232
7008 -232 -65 25 177 99 -152 -69 -131 -98 -45 -124 -52 -22 -58 246 -21 -112 270 270 -63 -116 -32 140 169 -31 204
7033 204 51 69 36 134 -134 -53 -111 -46 -3 -8 -28 78 89 251 -222 -20 -27 -82 -185 -13 -91 143 41 91 -9
7058 -9 210 65 -251 22 146 -239 26 -131 100 33 80 58 98 85 101 75 72 -16 88 338 121 -29 -177 110
7082 110 -52 105 -194 105 224 284 186 -343 27 -38 -10 285 13 -197 79 -66 -269 70 51 -75 73 -88
7104 -88 -24 127 112 182 5 57 -242 264 273 55 37 110 146 80 85 -58 -21 151 123 -123 -26 -224 5 -157 -194 132
7130 132 -189 169 -56 273 -14 83 -53 89 -53 -1 -308 43 196 -13 -209 -32 1 76 50 -42 266 122
7152 122 136 249 -43 -234 -92 -180 76 141 198 -64 -27 -18 -156 28 59 -10 12 -50 -97 39 172 -177 17 -94
7176 -94 -167 -133 -24 -99 -45 40 -217 -149 -75 46 150 193 44 125 179 -139 -172 92 130 -143 26 19 -321 -179 59
7201 59 -28 -104 134 15 -50 -62 -103 162 108 -86 -164 -31 338 37 62 33 60 47 238 110 -29 186 16 -40
7225 -40 60 -216 -99 141 46 137 12 -74 158 -266 42 125 159 -51 -97 -71 -69 -67 143 -151 -92 120 -67 63
7249 63 153 106 100 55 206 101 -209 -14 -27 134 -163 187 61 89 -176 265 -84 -105 131 107 -272 26 70 45
7273 45 318 -151 100 -167 6 -201 168 10 -81 195 -44 -356 -182 -52 44 -73 181 149 -63 29 208 -122
7295 -122 25 -122 -18 84 2 -33 -170 127 124 -206 -30 -136 15 -105 -88 142 -57 86 -59 186 -114 22
7317 22 52 27 102 267 -37 -36 -114 -8 -38 -15 -27 68 -2 -58 -212 19 -67 182 -72 80 254 103 16 -79 259
7342 259 23 -64 -229 70 -204 -165 1 -170 3 -108 -18 -33 -107 43 108 -47 253 66 -51 35 21 -66 -263
7365 -263 117 -42 -104 19 107 212 -70 -60 -6 83 -7 -141 38 36 142 -121 127 96 8 -61 102 1 151 -124
7389 -124 111 93 56 44 -21 107 -67 37 -61 148 -68 -125 -7 157 60 -92 -77 -238 82 16 181 -152 173
7412 173 -76 -151 91 -214 6 122 85 -129 -201 -41 -80 -130 -61 -92 -143 124 -92 97 -92 9 -89 284 15
7435 15 94 89 -32 123 188 346 -219 230 -70 -20 153 51 -285 -1 88 12 -30 -15 -118 -95 -288 -162 -123 -327
7459 -327 194 -109 96 348 181 -46 388 208 40 12 -227 53 -108 115 -19 -182 119 -132 38 -139
7479 -139 -16 93 -182 -129 116 24 -100 41 37 -39 -101 94 -144 -164 -11 -45 -7 -125 -53 223 -14 -236 -149 -31
7503 -31 65 -40 129 -314 -127 -39 3 -158 74 20 -17 255 129 -73 125 43 -264 -78 102 -125 -256 195
7525 195 -8 -192 210 203 -87 7 -244 47 -291 -135 -293 -7 3 62 -31 -182 224 -49 97 56 56 -82 -44
7548 -44 224 -52 115 148 113 -154 -62 98 -40 123 269 68 126 20 125 -43 -116 56 246 -121 72 -127
7570 -127 -108 327 140 -260 -153 130 -27 -75 -26 301 -129 -141 38 -104 -220 -4 15 142 -18 85 210 -111
7592 -111 -4 363 95 125 110 -70 -68 61 -119 66 58 -106 10 79 42 -198 229 -107 83 -83 -171 -48 42
7615 42 6 40 230 -60 309 -269 15 -146 167 137 53 -144 -72 136 -115 -2 -79 84 171 -126 73 -156 248
7638 248 -104 -33 73 92 -34 119 244 64 -99 -188 -31 49 -168 -35 44 -159 213 -329 -161 -18 14 144
7660 144 96 147 -109 -64 -22 162 0 56 -188 77 76 -94 -71 61 180 -258 -120 -53 89 84 -86 39 -42 -119
7684 -119 241 123 244 -197 13 -34 -221 -201 52 -63 55 -281 92 -100 14 -199 185 -104 -48 155 99
7705 99 -113 21 -160 329 98 -42 -67 -130 -128 70 -212 -60 49 132 18 -69 -106 104 76 -29 -161 -14 -24
7728 -24 -107 145 -217 -96 -144 -50 20 16 -89 -156 -10 159 26 -107 332 222 -122 87 -95 184 74 -142 193
7751 193 -85 -200 36 -10 -16 -15 156 253 -142 159 98 -40 63 17 -6 -130 157 187 -25 -47 210 61 -164 58
7775 58 -36 13 89 27 37 175 -103 -103 -40 -21 0 -95 -118 -130 -144 -81 113 232 99 -24 -4 -25 -70 -188 3 -18 11
7802 11 258 -250 -161 -240 79 206 16 -171 -232 -200 49 -41 160 263 181 10 -40 -142 -131 53 -171 171 -70
7825 -70 49 87 160 -43 20 305 -81 92 6 78 -177 3 -344 10 -85 -49 9 -158 -256 82 -74 -114 -62 -176
7849 -176 113 -30 -120 233 -185 -254 28 -96 -42 109 183 -74 409 -197 -54 6 -129 -125 -115 14 -3 -42 -213
7872 -213 -133 -32 -160 144 274 99 83 -84 171 31 44 2 -241 -201 29 -106 -26 -364 125 -85 139 -89
7894 -89 -74 53 411 102 -48 322 -183 -296 -161 -252 66 120 24 71 -175 34 57 40 3 -66 -14 -137 18 51
7918 51 111 147 -429 285 -301 158 -49 10 50 227 -204 -10 -183 107 -48 -57 76 -224 -154 6 -65 -78 165
7941 165 -94 -77 65 112 115 -164 -22 226 -61 -91 7 48 65 134 -47 -105 56 -10 -106 -91 200 -28 -9 -34 117
7966 117 -219 -162 -134 96 -38 128 -30 10 -112 -117 -93 202 182 -21 -287 28 259 -203 -26 -255 -158 -38 1
7989 1 -111 79 -118 -219 -187 118 49 -37 -100 -17 -50 48 -149 -17 -5 328 -45 196 -32 -36 112 100 123 71 -102
8014 -102 76 -30 -87 -68 -254 10 -233 127 -100 -125 52 60 -203 -60 -70 22 32 -63 -325 -130 35 -69 426
8037 426 -214 -177 366 -194 52 26 -9 141 -99 -79 83 -29 83 89 -241 -88 -210 -150 -39 -34 2 90 110 56
8061 56 -30 59 277 364 31 43 70 -234 -27 64 -45 -117 -169 -18 -17 -40 76 138 -26 -34 94 166 38 -54 86 6
8087 6 71 71 -76 -25 74 63 162 205 152 74 -29 -82 -37 130 104 -25 -230 -129 -63 138 -183 4 -66 188 190 43
8113 43 112 13 -16 234 202 -209 -156 52 -41 -32 10 -117 144 205 66 -132 43 3 22 -12 108 4 6 49 -52 -75
8139 -75 -175 158 3 -183 104 -133 -157 189 88 -228 279 -50 -20 2 101 -77 155 127 186 16 -98 -124 -19
8162 -19 35 -31 188 215 -28 119 -88 -133 -66 358 -244 -238 -97 -73 -98 -103 -43 74 -36 -156 47 -20 -160 -42 29
8187 29 8 103 -112 6
8191F
##END NTUPLES=NMR FID
##END=
