##TITLE=1H_LR-758-R3-KA1BM
 CDCl3
 8 sc, 
 3.8.2023
##JCAMPDX= 6.0         $$ Bruker NMR JCAMP-DX V2.0
##DATA TYPE= NMR FID
##DATA CLASS= NTUPLES
##ORIGIN= UXNMR, Bruker Analytische Messtechnik GmbH
##OWNER= root
$$ XWIN-NMR		Version 3.5
$$ Thu Aug  3 15:03:48 2023 Russian Standard Time (UT+4h)  she@DPX200
##.OBSERVE FREQUENCY= 200.13135
##.OBSERVE NUCLEUS= ^1H
##.DELAY= (6, 6)
##.ACQUISITION MODE= SIMULTANEOUS
##.ACQUISITION SCHEME= undefined
##.AVERAGES= 8
##.DIGITISER RES= 18
##SPECTROMETER/DATA SYSTEM= spect
##.PULSE SEQUENCE= zg30
##.SOLVENT NAME= CDCl3
##.SHIFT REFERENCE= (INTERNAL, CDCl3, 0, 15.7039)
##AUDIT TRAIL= $$ (NUMBER, WHEN, WHO, WHERE, WHAT)
$$ ##TITLE= Audit trail, XWIN-NMR		Version 3.5
$$ ##JCAMPDX= 5.01
$$ ##ORIGIN= Bruker BioSpin GmbH
$$ ##OWNER= she
$$ F:/spectra/data/she/nmr/H-F/1/audita.txt
$$ ##AUDIT TRAIL=  $$ (NUMBER, WHEN, WHO, WHERE, WHAT)
(   1,<2023-08-03 15:02:51.23 +0400>,<she>,<DPX200>,
      <created by zg, POWCHK disabled, PULCHK disabled
       configuration hash MD5:
       00 E9 B6 7A A2 85 ED C7 34 08 36 98 17 FE 4E 26
       data hash MD5: 16K
       7B 74 6D 76 6E 64 54 7D 19 95 42 F1 3D 72 01 35>)
$$ ##END=
$$ 
$$ hash MD5
$$ 56 64 6C B4 C4 5A C5 80 10 3D D8 1C 45 E0 95 A7
##$RELAX= 
##$RELAX= 
##$RELAX= 
##$RELAX= 
##$RELAX= 
##$RELAX= 
$$ Bruker specific parameters
$$ --------------------------
##$DU= <F:/spectra>
##$EXPNO= 1
##$NAME= <H-F>
##$PROCNO= 1
##$TYPE= <nmr>
##$USER= <she>
##$AMP= (0..31)
100 100 100 100 100 100 100 100 100 100 100 100 100 100 100 100 100 100 
100 100 100 100 100 100 100 100 100 100 100 100 100 100 
##$AQSEQ= 0
##$AQ_mod= 1
##$AUNM= <au_zg>
##$AUTOPOS= <>
##$BF1= 200.13
##$BF2= 200.13
##$BF3= 200.13
##$BF4= 200.13
##$BF5= 200.13
##$BF6= 200.13
##$BF7= 200.13
##$BF8= 200.13
##$BYTORDA= 1
##$CFDGTYP= 0
##$CFRGTYP= 5
##$CHEMSTR= <none>
##$CNST= (0..31)
1 1 145 1 1 1 1 1 1 1 1 1 1 1 1 1 1 1 1 1 1 1 1 1 1 1 1 1 1 1 1 1 
##$CPDPRG= <>
##$CPDPRG1= <>
##$CPDPRG2= <>
##$CPDPRG3= <>
##$CPDPRG4= <mlev>
##$CPDPRG5= <mlev>
##$CPDPRG6= <mlev>
##$CPDPRG7= <mlev>
##$CPDPRG8= <mlev>
##$CPDPRGB= <>
##$CPDPRGT= <>
##$D= (0..31)
0 1.2 0 0 0 0 0 0 0 0.06 0 0.03 0 0 0 0 0.0002 0 0 0 0 0 0 0 0 0 0 0 0 
0 0 0 
##$DATE= 1691060570
##$DBL= (0..7)
120 120 120 120 120 120 120 120 
##$DBP= (0..7)
150 150 150 150 150 150 150 150 
##$DBP07= 0
##$DBPNAM0= <>
##$DBPNAM1= <>
##$DBPNAM2= <>
##$DBPNAM3= <>
##$DBPNAM4= <>
##$DBPNAM5= <>
##$DBPNAM6= <>
##$DBPNAM7= <>
##$DBPOAL= (0..7)
0.5 0.5 0.5 0.5 0.5 0.5 0.5 0.5 
##$DBPOFFS= (0..7)
0 0 0 0 0 0 0 0 
##$DE= 6
##$DECBNUC= <off>
##$DECIM= 32
##$DECNUC= <off>
##$DECSTAT= 4
##$DIGMOD= 1
##$DIGTYP= 9
##$DL= (0..7)
0 120 120 120 120 120 120 120 
##$DP= (0..7)
150 150 150 150 150 150 150 150 
##$DP07= 0
##$DPNAME0= <>
##$DPNAME1= <>
##$DPNAME2= <>
##$DPNAME3= <>
##$DPNAME4= <>
##$DPNAME5= <>
##$DPNAME6= <>
##$DPNAME7= <>
##$DPOAL= (0..7)
0.5 0.5 0.5 0.5 0.5 0.5 0.5 0.5 
##$DPOFFS= (0..7)
0 0 0 0 0 0 0 0 
##$DQDMODE= 0
##$DR= 18
##$DS= 0
##$DSLIST= <SSSSSSSSSSSSSSS>
$$ [...]
##$SUBNAM2= <"">
##$SUBNAM3= <"">
##$SUBNAM4= <"">
##$SUBNAM5= <"">
##$SUBNAM6= <"">
##$SUBNAM7= <"">
##$SUBNAM8= <"">
##$SUBNAM9= <"">
##$SW= 18.05172834244
##$SWIBOX= (0..15)
0 0 2 0 0 0 0 0 0 0 0 0 0 0 0 0 
##$SW_h= 3612.71676300578
##$TD= 16384
##$TD0= 1
##$TE= 0
##$TE2= 300
##$TE3= 300
##$TEG= 300
##$TL= (0..7)
0 120 120 120 120 120 120 120 
##$TP= (0..7)
150 150 150 150 150 150 150 150 
##$TP07= 0
##$TPNAME0= <>
##$TPNAME1= <>
##$TPNAME2= <>
##$TPNAME3= <>
##$TPNAME4= <>
##$TPNAME5= <>
##$TPNAME6= <>
##$TPNAME7= <>
##$TPOAL= (0..7)
0.5 0.5 0.5 0.5 0.5 0.5 0.5 0.5 
##$TPOFFS= (0..7)
0 0 0 0 0 0 0 0 
##$TUNHIN= 0
##$TUNHOUT= 0
##$TUNXOUT= 0
##$USERA1= <user>
##$USERA2= <user>
##$USERA3= <user>
##$USERA4= <user>
##$USERA5= <user>
##$V9= 5
##$VALIST= <valist>
##$VCLIST= <CCCCCCCCCCCCCCC>
##$VD= 0
##$VDLIST= <DDDDDDDDDDDDDDD>
##$VPLIST= <PPPPPPPPPPPPPPP>
##$VTLIST= <TTTTTTTTTTTTTTT>
##$WBST= 1024
##$WBSW= 4
##$XGAIN= (0..3)
0 0 0 0 
##$XL= 0
##$YL= 0
##$YMAX_a= 672219
##$YMIN_a= -829936
##$ZGOPTNS= <>
##$ZL1= 120
##$ZL2= 120
##$ZL3= 120
##$ZL4= 120
##$ABSF1= 10
##$ABSF2= 0
##$ABSG= 5
##$ABSL= 3
##$ALPHA= 0
##$AQORDER= 0
##$ASSFAC= 0
##$ASSFACI= 0
##$ASSFACX= 0
##$ASSWID= 0
##$AUNMP= <proc_1d>
##$AZFE= 0.1
##$AZFW= 0.1
##$BCFW= 1
##$BC_mod= 2
##$BYTORDP= 1
##$COROFFS= 0
##$CY= 11.3945322036743
##$DATMOD= 1
##$DC= 2
##$DFILT= <>
##$DTYPP= 0
##$F1P= 15.7292609196834
##$F2P= 12.9074282941183
##$FCOR= 0.5
##$FTSIZE= 0
##$FT_mod= 4
##$GAMMA= 1
##$GB= 0.15
##$INTBC= 1
##$INTSCL= 1
##$ISEN= 128
##$LB= 0.24
##$LEV0= 0
##$LPBIN= 0
##$MAXI= 10000
##$MC2= 0
##$MEAN= 0
##$ME_mod= 0
##$MI= 1.114404
##$NCOEF= 0
##$NC_proc= 0
##$NLEV= 6
##$NOISF1= 3.799351
##$NOISF2= 2.8
##$NSP= 1
##$NTH_PI= 0
##$NZP= 0
##$OFFSET= 15.70392
##$PC= 1
##$PHC0= -21044.91
##$PHC1= 11.85272
##$PH_mod= 1
##$PKNL= yes
##$PPARMOD= 0
##$PSCAL= 0
##$PSIGN= 0
##$REVERSE= no
##$SF= 200.130013532006
##$SI= 16384
##$SIGF1= 3
##$SIGF2= 2
##$SINO= 400
##$SIOLD= 16384
##$SREGLST= <1H.CDCl3>
##$SSB= 0
##$STSI= 0
##$STSR= 0
##$SW_p= 3612.71676300578
##$SYMM= 0
##$S_DEV= 0
##$TDeff= 0
##$TDoff= 0
##$TI= <>
##$TILT= no
##$TM1= 0
##$TM2= 0
##$TOPLEV= 0
##$USERP1= <user>
##$USERP2= <user>
##$USERP3= <user>
##$USERP4= <user>
##$USERP5= <user>
##$WDW= 1
##$XDIM= 8192
##$YMAX_p= 0
##$YMIN_p= 0
$$ End of Bruker specific parameters
$$ ---------------------------------
##NTUPLES= NMR FID
##VAR_NAME=  TIME,          FID/REAL,        FID/IMAG
##SYMBOL=    X,             R,               I
##VAR_TYPE=  INDEPENDENT,   DEPENDENT,       DEPENDENT
##VAR_FORM=  AFFN,          ASDF,            ASDF
##VAR_DIM=   8192,          8192,            8192
##UNITS=     SECONDS,       ARBITRARY UNITS, ARBITRARY UNITS
##FACTOR=    0.0002768,     1,               1
##FIRST=     0,             0,               0
##LAST=      2.2672688,     0,               0
##MIN=       0,             -829936,         0
##MAX=       2.2672688,     672219,          0
$$ Real data points
##PAGE= N=1
##DATA TABLE= (X++(R..R)), XYDATA
0@%%%%%%Qj6J6j6J6k4M0m8N6p2Q8j12J36j60J96k40K85l36L93m58N37o24P18q22
$$ 0 0 0 0 0 0 0 8 -8 8 -8 8 -16 24 -24 32 -40 48 -64 72 -88 108 -132 153 -183 210 -248 289 -335 383 -439
30d39R43j078J223j385J566j764J986k228K488k775L092l440L815m224M673n165
$$ -439 504 -574 649 -736 830 -934 1052 -1176 1312 -1463 1629 -1811 2004 -2220 2453 -2712
46b712N704o292O933p635Q411r268J0214j1266J2445j3773J5278j7001J8999k1348
$$ -2712 2992 -3300 3633 -4002 4409 -4859 5355 -5911 6534 -7239 8039 -8962 10037 -11311
60a1311K4157k7580L1864l7403M4879n5580P2243j01925J70437o03978k86751
$$ -11311 12846 -14734 17130 -20273 24606 -30974 41269 -60656 109781 -494197 -780948
71g80948J008708o10235k68907P31721Q9262n43152M95617L14032m98427J57358
$$ -780948 227760 -382475 -651382 80339 169601 -373551 122066 436098 -62329 95029
81I5029N77190n46515l21187P28160k5545p99344L74113N65925o25481k76895
$$ 95029 672219 125704 -195483 532677 507132 -292212 81901 647826 22345 -254550
91b54550O64343j69287o07414L57812K72512n09138P4546L76348m58952j69703
$$ -254550 409793 240506 -366908 -9096 263416 -245722 -171176 205172 -253780 -423483
101d23483P06803p1780o47939M21717N51508n35895j94827N96872j02433m50715
$$ -423483 283320 211540 -436399 -14682 536826 931 -193896 402976 300543 -150172
111a50172L49631J81128m64672R2334L48280m00857j65094N34849j19370n36387
$$ -150172 199459 380587 -84085 8249 356529 -44328 -209422 325427 206057 -330330
121c30330L62266L54978n59534j41953N70788j05293m49801K65927K00371l18964
$$ -330330 31936 386914 -172620 -314573 256215 150922 -298879 -32952 167419 -151545
131a51545J00195K79633l07530q2252M66155j06623m41886L04079K95621m50287
$$ -151545 -51350 228283 -79247 -161499 304656 198033 -243853 60226 355847 -94440
141i4440j12886M44479j30852l94820K41438J90235l08263O804K39275j94891
$$ -94440 -207326 237153 106301 -288519 -47081 143154 -165109 -158305 80970 -113921
151a13921q8931L09338j01774l24395K81757K47350l95447r8053M28398n0156
$$ -113921 -202852 106486 4712 -319683 -37926 209424 -186023 -284076 144322 94166
161I4166l39011J99308K11722k34610J670K36136j54603j30950K56769k7835k82396
$$ 94166 -244845 -45537 166185 -68425 -66755 169381 14778 -116172 140597 112762 -169634
172a69634J81207J96579l31086q1664L85078o8036l54612J97569K52608k51034
$$ -169634 11573 208152 -122934 -204598 180480 112444 -242168 -44599 208009 -43025
182d3025q4282K36581q4392j46331K07302m710k63585J59803K24739k86903j04872
$$ -43025 -127307 109274 24882 -121449 85853 81143 -182442 -22639 202100 -84803 -189675
193a89675L65322l1550l34349J83616K44036k68800r2842K78021p1705k10637
$$ -189675 175647 144097 -190252 -6636 237400 -31400 -124242 153779 82074 -128563
203a28563J86005O3870k34886J12831K03931k61170q9149L61667m7838l58078
$$ -128563 57442 121312 -113574 -743 203188 -57982 -147131 214536 166698 -191380
213a91380J85369K57983k84569j09571K88284p5622k26455K03109Q1293k61349
$$ -191380 -6011 251972 -32597 -142168 146116 70494 -155961 47148 128441 -132908
223a32908R3147K24755k45733j02341L35334o8044l39682K20484K36928l32688
$$ -132908 -39761 184994 -60739 -163080 172254 104210 -235472 -14988 221940 -110748
233a10748q7968L38159q7902k56571K15920R7341k59864R5216K10496k62497q7067
$$ -110748 -198716 139443 51541 -205030 10890 108231 -151633 -56417 154079 -108418 -195485
244a95485L45453q4568l33485K33876K15212l30942m0150L42736j23002k43279
$$ -195485 149968 65400 -268085 -34209 181003 -149939 -190089 152647 29645 -213634
254b13634K54523R7736k69051R5237K10217k36570o1326L11699j09180k82580
$$ -213634 40889 138625 -130426 -35189 175028 -61542 -122868 188831 79651 -202929
264b02929K60459J71048l41456r579L30994j44866k30264K42204O2932k64691
$$ -202929 57530 228578 -112878 -122457 208537 63671 -166593 75611 138543 -126148
274a26148J01003J81054k41914n2726K82676j14724k41129K50054J19748l16778
$$ -126148 -25145 155909 -86005 -138731 143945 29221 -211908 38146 157894 -158884
284a58884M4308L09778j76398k06213K59415O0657k48028R8933J63414k11731
$$ -158884 -114576 195202 18804 -187409 72006 132663 -115365 -16432 146982 -64749
294f4749k2762K49610j25786j97894K44236Q4052k95166N5116K60014j83722j67455
$$ -64749 -87511 162099 36313 -161581 82655 166707 -128459 -73343 186671 2949 -164506
305a64506K39504K0546k39342J00521J53593j88235l2443K00964r7490j38701
$$ -164506 74998 95544 -143798 -43277 110316 -77919 -110362 90602 -6888 -145589
315a45589K06214L8747k45984Q5059K29015j72886j42433K18570L3432j93724
$$ -145589 60625 99372 -146612 -61553 167462 -5424 -147857 70713 104145 -89579
325h9579Q3395J27814j51782k1507J70467p9190j24642J55386L1148j95013O3039
$$ -89579 -6184 121630 -30152 -51659 118808 39618 -85024 70362 101510 -93503 -30464
336c0464J66816j57332j09979J95969J6240j94341O5917J42863j17427n2594J30150
$$ -30464 136352 -20980 -130959 65010 81250 -113091 -47174 95689 -21738 -74332 55818
347E5818l8302q9568J23040K7053j60030N7083J58857j20552j03138J67202K8711
$$ 55818 17516 -72052 50988 78041 -81989 -24906 133951 13399 -89739 77463 106174
358A06174j69246N1864J36139j13217q0927J23162l148j09438O1342L8335j18126
$$ 106174 -63072 -11208 124931 11714 -69213 53949 50801 -58637 2705 41040 -77086
369g7086K9026J21641j06637r8372J56319M1958j71029K8109J53002q2837r5230
$$ -77086 -48060 73581 -33056 -131428 24891 66849 -104180 -76071 76931 -5906 -101136
380a01136J18065K4538j11387N1930P6241j01259j1232J16517o3704r2950J28442
$$ -101136 16929 41467 -69920 -17990 58251 -43008 -54240 62277 -1427 -94377 34065
391C4065L1591j74482L2293J70736r9533j36002J31267O2697j28003K4034R2602
$$ 34065 65656 -108826 -76533 94203 -5330 -141332 -10065 52632 -75371 -51337 41265
402D1265q6358j5104J31017n4644j08433J34899O1892j69948K4264J74242j02912
$$ 41265 -45093 -60197 70820 16176 -92257 42642 104534 -65414 -41150 133092 30180
413C0180j31422J56883N5987j73668K2570J31102r4339o1662J15014m1271j01219
$$ 30180 -101242 55641 111628 -62040 -39470 91632 -2707 -64369 50645 9374 -91845
424i1845J27769L9366j86226M1543J97532j11433j42873J70613O8446j67450L8189
$$ -91845 35924 75290 -110936 -69393 128139 16706 -126167 44446 112892 -54558 -16369
435a6369J40115j04985n9887J38316l1437j15685J11324L8445j71665M6114J65757
$$ -16369 123746 18761 -41126 97190 65753 -49932 61392 99837 -71828 -25714 140043
446A40043j45814j31845J91068M4219k03234L6726J52336j04927o3601J32261
$$ 140043 -5771 -137616 53452 97671 -105563 -68837 83499 -21428 -85029 47232
456D7232l2625r7286J30631L9572j66414O2644J69634j37369j04704J93795J5237
$$ 47232 14607 -82679 47952 87524 -78890 -16246 153388 16019 -88685 105110 120347
467A20347k03944O6202J48651j38726q5466J27988l1477j05879R3423O188j56914
$$ 120347 -83597 -17395 131256 -7470 -92936 35052 3575 -102304 -8881 -2693 -159607
478a59607P1885J39961j58354r1477J99875J5287j85860P8259J49964j14108m8808
$$ -159607 -87722 52239 -106115 -197592 2283 17570 -168290 -90031 59933 -54175 -102983
489a02983J46622j5893q7812J04212L3717j19181O5071J11977j37466n8310J80036
$$ -102983 43639 27746 -60066 44146 77863 -41318 23753 135730 -1736 -60046 119990
500A19990k1566j92088P7498J38452j30039p9877J17460j3231q6617P4529J6247
$$ 119990 98424 -93664 -16166 122286 -7753 -87630 29830 16599 -70018 4511 20758
511B0758j09192O0488J03241j17816m3903J66305j2975j53053R4468J34055j22165
$$ 20758 -88434 -27946 75295 -42521 -86424 79881 66906 -86147 8321 142376 20211
522B0211o1805J37926M178r6000N4175L4410q1876L7305O7453j12728l7256J43507
$$ 20211 -41594 96332 100510 4510 58685 93095 11219 48524 115977 3249 -34007 109500
534A09500k9112j61520P2224J21764j19139p5465J18436K971j01072M6424M8293
$$ 109500 80388 -81132 -8908 112856 -6283 -81748 36688 39659 -61413 -14989 33304
545C3304p6993J0237O8698p1094l0833J15428k4454j32822Q0070J19678j18668
$$ 33304 -43689 -33452 35246 -35848 -66681 48747 24293 -108529 -28459 91219 -27449
556b7449p9861J30264K4042j11628K7428O7091o1298n444O6127n5298l7831J05531
$$ -27449 -107310 22954 46996 -64632 -37204 29887 -31411 -36855 29272 -26026 -63857 41674
568D1674o650j24048O6225J16945j10013p4472J38765K2574j31016L2792R6961
$$ 41674 35024 -89024 -22799 94146 -15867 -90339 48426 71000 -60016 -27224 69737
579F9737o6175l6431P1063l2016m6119Q9613o269j25558O2210J19499j17554q6198
$$ 69737 3562 -32869 38194 6178 -39941 49672 43403 -82155 -19945 99554 -18000 -104198
591a04198J43027K3162j44805L5694J08196q0394n0550R1203j9440o4622Q0573
$$ -104198 38829 61991 -82814 -47120 61076 -19318 -69868 21335 1895 -62727 17846
602A7846J2589j13269N7996J14861j17356p4077J60261K0331j59662M5766J29020
$$ 17846 30435 -82834 -24838 90023 -27333 -101410 58851 79182 -80480 -34714 94306
613I4306q5280n9410J00207j5642p3790Q4049J9148j21453N0093J15095j18092
$$ 94306 9026 -50384 49823 34181 -39609 44440 63588 -57865 -7772 107323 -10769
624a0769p3574J57915J734j66961O4383J29587j14944o6907J22198j3458r1446
$$ -10769 -84343 73572 75306 -91655 -27272 102315 -12629 -79536 42662 29204 -62242
635f2242Q0179K4771j15348N7161J08804j28009n9565J74260r040j73222Q0041
$$ -62242 17937 42708 -72640 -15479 93325 -34684 -94249 80011 70971 -102251 -22210
646b2210J32012j25572n8160J31923k6816r8825Q9491K8569j22400M8718J00820
$$ -22210 109802 -15770 -73930 57993 31177 -67648 21843 50412 -71988 -23270 77550
657G7550j25120m8726J63447l0414j66078R8909J21704j41522m9664J44412k7943
$$ 77550 -47570 -96296 67151 36737 -129341 -30432 91272 -50250 -99914 44498 16555
668A6555r9673R2995L1883j12328N5927R6300j21037l4128J61678l8010j52765
$$ 16555 -83118 9877 41760 -70568 -14641 81659 -39378 -73506 88172 50162 -102603
679a02603J08123J05628j47706l2270J45492m5450j05530R7498L1629j13360M8035
$$ -102603 5520 111148 -36558 -68828 76664 31214 -74316 23182 54811 -58549 -10514
690a0514Q1760j17056j9039J51413n5696j41383J21683R5086j51019j8968J46332
$$ -10514 71246 -45810 -64849 86564 30868 -110515 11168 106254 -44765 -63733 82599
701H2599n0466r5790J03671K6722j11840N0985Q0671j09647j8053J32765n8711
$$ 82599 32133 -63657 40014 66736 -45104 5881 86552 -23095 -41148 91617 32906
712C2906j20181J17205O6896j53780l158J41654o4527j02057R8980L0611j03025
$$ 32906 -87275 29930 96826 -56954 -60112 81542 17015 -85042 13938 44549 -58476
723e8476L9736O5562r7592n491J23560n9777j07075J14444O2142j35304O472J28659
$$ -58476 -18740 46822 -50770 -56261 67299 7522 -99553 14891 77033 -58271 -51799 76860
735G6860o5375q4434J06107K6368j06124L7804P2621q4131j2896J01121n4917
$$ 76860 11485 -72949 33158 59526 -46598 -8794 63827 -20304 -33200 67921 13004
746A3004q6826J07623M0369j37131J4720J27414p0005q9826R8374K7848r8928
$$ 13004 -73822 33801 74170 -62961 -48241 79173 9168 -80658 17716 45564 -53364
757e3364L4444O6683q1714j3028J00450m3182q2038R3660L8458j15229K3417J13670
$$ -53364 -18920 47763 -33951 -46979 53471 10289 -71749 21911 60369 -54860 -31443 82227
769H2227p5006p9742J07925L0988j05819K3845P3363o7321k1011Q4051l9966p4501
$$ 82227 7221 -72521 35404 66392 -39427 -15582 57781 -9540 -30551 53500 13534 -60967
781f0967Q5861L3921j13449J5739J06116o6952p5188R7965K3701j03560L0878
$$ -60967 24894 58815 -54634 -38895 67221 269 -74919 23046 46747 -56813 -25935
792b5935Q1018p0748l4781Q7495j8509p0622O9363L0180r9765K5848J03138p5760
$$ -25935 55083 -15665 -50446 37049 18540 -52082 17281 47461 -52304 -26456 76682 922
804I22p7902J05308K9308j08453K3747Q0706p0758l5221R0832k1248q0572O8069
$$ 922 -76980 28328 57636 -50817 -27070 53636 -17122 -52343 38489 17241 -63331 4738
816D738M0599r4654J6290R4682p0246o4007J09166J7962j16543L6424R5388p5919
$$ 4738 45337 -49317 -33027 61655 -8591 -72598 36568 54530 -62013 -25589 69799 -6120
828f120m7116R1355j1130p6271O3566L4722r7034J8418R7702p0729o8768J03533
$$ -6120 -53236 38119 26989 -49282 14284 49006 -48028 -29610 68092 -2637 -71405 32128
840C2128J5865j09873M3581Q7808q7709m2649J07079r685q7901N9171M3603q5472
$$ 32128 47993 -61880 -18299 69509 -18200 -60849 46230 36545 -51356 7815 51418 -34054
852c4054J9000Q6154p6312n6142J13098N585j19619M8091R0862r1388m1331J04137
$$ -34054 -15054 71100 -5212 -61354 51744 57329 -62290 -14199 76663 -14725 -56056 48081
864D8081k0663q7425P0557M2357r6851J5858Q9614o9286m8475J04775q821j08197
$$ 48081 27418 -60007 10550 52907 -43944 -28086 61528 -7758 -56233 48542 39721 -68476
876f8476O9444Q3951j08602l5540J16313k0891r0630O5986L5858r1702K3387P9506
$$ -68476 968 84919 -23683 -59223 57090 36199 -54431 11555 47413 -44289 -20902 58604
888E8604p8908m5191J05072j4095j03707O8461O9612j06297j7935J14936l4786
$$ 58604 -20304 -65495 39577 25482 -78225 -9764 59848 -46449 -64384 50552 15766
899A5766q7407P8641M1145q8642K0806P4225o7403k7296R7692k8101r3634P9743
$$ 15766 -71641 7000 48145 -40497 -19691 54534 -12869 -40165 57527 29426 -64208 15535
911A5535O2083j10286j3787J07185m2455p9520P7983K6249r3696K4948P0937o7724
$$ 15535 77618 -32668 -46455 60730 18275 -61245 16738 42987 -50709 -25761 45176 -22548
923b2548k6888Q5463l1035p4242Q3444M3157j09432O995J11114m8236p5736Q1459
$$ -22548 -49436 36027 4992 -69250 14194 57351 -52081 -45086 66028 17792 -57944 23515
935B3515K9328q1286K6042O0111o3950j4983Q0422l5898o8852P5801L2707r8148
$$ 23515 52843 -28443 -2401 57710 -6240 -21223 59199 23301 -45551 30250 62957 -35191
947c5191J1782Q9526n8036o3392Q2944J9172q6387K0773N8934n1923j5344O0536
$$ -35191 -23409 66117 8081 -55311 27633 46805 -39582 -18809 40125 -11798 -27142 33394
959C3394l4471m9643P3721J9135r2955J9650Q4960n5660n7021P5782J5461p5669
$$ 33394 -1077 -50720 23001 42136 -50819 -31169 53791 -1869 -58890 16892 32353 -43316
971d3316K2353N2564m9764j5075N5894k6919m1917O0586J1318p5662K7274P1507
$$ -43316 -20963 31601 -18163 -33238 22656 -4263 -46180 14406 25724 -49938 -22664 48843
983D8843n9881m7212P8940J5888p4970J7376N2231l8615j5441M5875k2718l5272
$$ 48843 -11038 -58250 20690 36578 -38392 -21016 31215 -7400 -22841 23034 316 -34956
995c4956N2435R366o5910K3396O0010n4073l9456P2420J0693p3093J7238N5525
$$ -34956 17479 26845 -39065 -15669 44341 -9732 -49188 23232 33925 -39168 -21930 33595
1007C3595l5569k4325M1108r262k9851L9231P472n4190K3924N4011n0812l8524
$$ 33595 -1974 -26299 14809 5547 -24304 14927 22399 -31791 -7867 46144 -4668 -43192
1019d3192O8618J4213o9502J2559N4101l3643k7034M2077l932l5379K9342J4215
$$ -43192 25426 39639 -29863 -17304 36797 3154 -23880 18197 14265 -21114 8228 22443
1031B2443m4380J5580M4594m6984l1537O8158Q829p4042J4883O2136l5269l6188
$$ 22443 -21937 -6357 38237 -8747 -40284 27874 36703 -37339 -22456 39680 4411 -31777
1043c1777M3052M698l6274K4008J5635m1608J4604M5624m3554l2302O5810R964
$$ -31777 11275 15973 -20301 3707 19342 -22266 -7662 37962 -5592 -37894 27916 37880
1055C7880p0186J8660O0712m0435l5788N1892O971m5780J9446K3302l7153Q047
$$ 37880 -32306 -13646 47066 6631 -29157 22735 29706 -16074 3372 26674 -10479 -2432
1067b432L8028m2910k8539O4835L601p5209K0980O2585m5220l8977N3835O801
$$ -2432 35596 -7314 -35853 28982 32583 -42626 -21646 40939 -4281 -43258 10577 17378
1079A7378m8449K1638K6571l9073O770M1670l7853k5884O2595Q32o8728L0754
$$ 17378 -31071 -9433 17138 -21935 -15165 26505 -11348 -37232 25363 26195 -42533 -11779
1091a1779N9472n4408l5390O4843N012n5470K0978K8281l6798O315L6723m1782
$$ -11779 47693 -6715 -42105 22738 27750 -27720 -6742 21539 -15259 -8944 27779 -14003
1103a4003k1730O3710m753o7914L4198N4474n6171k6665O5741k771n4347K9575
$$ -14003 -35733 27977 23224 -44690 -10492 43982 -12189 -38854 26887 24116 -30231 -656
1115f56L0378m0371M448L6944l5364j5748N5131j3538n8830M2058M5396o3699
$$ -656 29722 -10649 -6201 30743 -4621 -20369 34762 21224 -37606 4452 49848 -13851
1127a3851k2548O6135o743n3141K6767K4262l8583Q077L2208l6717j3761N1004
$$ -13851 -36399 29736 22993 -30148 -3381 20881 -17702 -9625 22583 -14134 -27895 23109
1139B3109j3874m9580M1951L3406o0057q295O4219j5062n0747L2235K6380l5891
$$ 23109 9235 -40345 1606 35012 -25045 -33340 30879 15817 -34930 -2695 23685 -12206
1151a2206M735K6307k9930m761M2687k0778m1572M3537K6587n7047n185N5005
$$ -12206 -7471 18836 -11094 -15855 26832 6054 -35518 8019 34606 -22441 -27626 27379
1163B7379j7309m1043L1740J7542l5841N786K7076k3307p832L0667j5888k5431
$$ 27379 10070 -30973 767 18309 -17532 -11746 15330 -7977 -15809 14858 -1030 -26461
1175b6461L9263J3500n0910L941N2979j7168l9107K7383J9657k6203K418J9074
$$ -26461 12802 26302 -24608 -20667 32312 15144 -23963 3420 23077 -3126 -708 18366
1187A8366j8767m207K5259j3750k2624K7606J0546l8458L393L6816j8891l0897
$$ 18366 -401 -4608 20651 6901 -15723 11883 22429 -16029 -12636 24180 5289 -25608
1199b5608K6708J7172k9643m417K2628o074r038J1728p287j0680K3471P096l2605
$$ -25608 1100 18272 -11371 -15788 6840 766 -8272 3456 -3831 -14511 8960 16056 -16549
1212a6549J681L5548j0341k8525J9034J7555k3564n718K2802m608j6964R924M753
$$ -16549 -14868 20680 10339 -18186 848 18403 -5161 -10879 11923 7315 -9649 275 5028
1225E028j1439P908O929k0569O18K7761r716k9476J9152K4286k4703j4670K5346
$$ 5028 -6411 1497 8426 -12143 -11525 16236 6520 -22956 -3804 20482 -4221 -18891 6455
1238F455L683k0470P858R366j4759L355J5803j5460j1228K3611r26k6279J5622
$$ 6455 10138 -10332 -2474 6892 -7867 -4512 11291 -4169 -15397 8214 7288 -18991 -3369
1251c369K2785k8719j4099L6291L816l2691P882K2363j4951l338J8291j4014j2598
$$ -3369 19416 -9303 -23402 12889 16705 -15986 -8104 14259 -692 -4030 14261 247 -12351
1264a2351K8951P08l4357J4320K9457k9419j7493L5851j216l5824J6659K3876
$$ -12351 16600 17308 -17049 -2729 26728 -2691 -20184 15667 14451 -21373 -4714 19162
1276A9162k9679p506L0236j1498k0222K5705K085l1199K1807K8821l7941j4885
$$ 19162 -10517 -18023 12213 715 -19507 6198 8283 -22916 -1109 27712 -10229 -25114
1288b5114M7822j377m1264K0155K5364l1163l293L3167j9608k3936L2407K560
$$ -25114 22708 21331 -19933 222 25586 -5577 -8870 24297 4689 -19247 13160 15720
1300A5720l6849J7660K6062l9158r739M6027j3218m2057L0938K5377l9684j909
$$ 15720 -21129 -3469 22593 -16565 -26304 19723 6505 -35552 -4614 20763 -18921 -20830
1312b0830L7567j8297k0204L4412j230l4941K6632K6667m2008o615M6443j6427
$$ -20830 16737 -1560 -21764 12648 11418 -23523 3109 29776 -12232 -18847 27596 11169
1324A1169l6593L4280J6016m5093N368L8938k5757k4070L3477k192l1796K5785
$$ 11169 -25424 8856 24872 -20221 -14853 24085 -1672 -25742 7735 5543 -26253 -468
1336d68J7728m2100K952M5476k2533l3279L9449J5167m1441J0102L5350k6401
$$ -468 17260 -24840 -21888 23588 1055 -32224 7225 22392 -19049 -8947 26403 2
1348Bj5217L5739n296l1291K5830J6959l6612L869L4731k5331k4052L8830N045
$$ 2 -15215 20524 15228 -16063 9767 26726 -9886 -6017 28714 3383 -20669 18161 23206
1361B3206m3348J2239L4311k6372j6411K9756n531k4316K3740J0939l3207O509
$$ 23206 -20142 -7903 26408 36 -16375 13381 7850 -16466 7274 18213 -14994 -8485
1373h485L1578k3225j9319L3583K439l6188J4840K8216k6829j3963K9942l377
$$ -8485 23093 -132 -19451 14132 16571 -19617 -4777 23439 -3390 -17353 12589 9212
1385I212k4381J7282J1398k4404N097K3145k0799j4015L1595P30l3636J1668K7093
$$ 9212 -15169 2113 13511 -10893 -5796 17349 -3450 -17465 14130 14860 -18776 -7108 19985
1398A9985k1580j4613K4735j263k3259J3871J2941k1398j459J9957j2964j3295
$$ 19985 -1595 -16208 8527 7264 -15995 -2124 10817 -10581 -12040 7917 -5047 -18342
1410a8342K3628J616k8298J0500K7047j9985j7494K6893N876k4435P355J8715
$$ -18342 5286 6902 -21396 -10896 16151 -3834 -21328 5565 11441 -12994 -5639 13076
1422A3076j5804n619J9795q845j6248K1517P054k8957M192K7773j7708k0750K6804
$$ 13076 -2728 -8347 11448 2603 -13645 7872 14926 -14031 -9839 17934 226 -20524 6280
1435F280O911l0572O919K5968j7514j3829K2777j566j9272J9382J0563k9297M928
$$ 6280 13191 -17381 -10462 15506 -2008 -15837 6940 5374 -13898 5484 16047 -13250 -8322
1448h322L2687j9881k5372L2170J0926l7610N659L1393k1190j8781K7788j983
$$ -8322 24365 4484 -20888 11282 22208 -15402 -9743 21650 460 -18321 9467 7484
1460G484k7211J9833J5826l2797K201L5556k2231k5300L9494J0283m4048J1362
$$ 7484 -19727 106 15932 -16865 -14664 20892 -1339 -26639 12855 23138 -20910 -9548
1472i548L9886k5610k1163L4743j397l0704K4274J6318l9020L813L8544k8333
$$ -9548 30338 4728 -16435 18308 16911 -13793 10481 26799 -12221 -8408 30136 1803
1484A803k8914M2849N202n0005J6253L9009l6553j9992M3286o332l6192K9185
$$ 1803 -27111 15738 20940 -29065 -12812 26197 -10356 -30348 12938 6606 -29586 -401
1496d01J8185m0222J0738L9151l4496k1608N3466n99n3966K5736M0556m1901j5198
$$ -401 17784 -22438 -11700 27451 -7045 -28653 24813 24214 -29752 -4016 36540 -5361 -20559
1509b0559M5266j4334l6298L6016J2382m6886J3399L7785l9343j8666N2378j0331
$$ -20559 24707 10373 -25925 10091 22473 -24413 -11014 26771 -12572 -31238 21140 10809
1521A0809n1372L5423L4950m9970q285N1273j7866l4550L8549R492m2347K1821
$$ 10809 -40563 -5140 29810 -20160 -28445 22828 4962 -29588 8961 18453 -23894 -2073
1533b073L3259m4102j0364N4749j5437m8746L8484K8101n0832J37M7761k7068
$$ -2073 31186 -12916 -23280 31469 16032 -32714 5770 33871 -16961 -16824 30937 3869
1545C869l1228M1872M848m2352K2357K7237m3563j957N0804k4723m2421M4795
$$ 3869 -27359 14513 19361 -22991 -634 26603 -16960 -18917 31887 7164 -35257 9538
1557I538K1567n2175N245M4549k8040k4598M0749k094l8007K6344K2809m2760
$$ 9538 31105 -21070 -15825 28724 684 -23914 16835 14741 -23266 3078 25887 -16873
1569a6873J073M4824k5878l2922M3198J1516m9621J2284M1574l0975k3141L7245
$$ -16873 -15800 29024 3146 -29776 13422 24938 -24683 -12399 29175 -1800 -24941 12304
1581A2304j200l1404K3851J4828l8218O713M0249k7209k8990M0601R307m2542
$$ 12304 11104 -20300 3551 18379 -19839 -13126 27123 -86 -29076 11525 20832 -21710
1593b1710J2951L4054k9228j7311L6419l152l0493K1147J5312l1323N306L0867
$$ -21710 -8759 25295 -3933 -21244 15175 12023 -18470 2677 17989 -13334 -8028 22839
1605B2839k4898k0734L7649L614m1460J3609L3427k6553j8670L0038j237k5683
$$ 22839 -2059 -22793 14856 18470 -22990 -9381 24046 -2507 -21177 8861 7624 -18059
1617a8059J8257J3264k9373L184K9634j9117k0377L0893M995l5206J3112L1074
$$ -18059 198 13462 -15911 -12727 16907 -2210 -22587 8306 13301 -21905 -8793 22281
1629B2281k5847j9036L1718L862k7873J2897J6860k3688N46K6519j6284k0999
$$ 22281 -3566 -22602 9116 12978 -14895 -1998 14862 -8826 -8280 18239 1955 -19044
1641a9044L0065P708l5493Q077L2354k2930k0631L0307L855l1283J2588K2532
$$ -19044 11021 18729 -16764 -8687 23667 737 -19894 10413 14268 -17015 -4427 18105
1653A8105k5362p590K8220j1146k1671K7063Q121l6507J0312L6468k4614k4896
$$ 18105 -7257 -14847 13373 2227 -19444 7619 15740 -20767 -10455 26013 1399 -23497
1665b3497L5125P912l3632J3091K4878k7586p049L3428j2087k7398K8666J1353
$$ -23497 11628 19540 -14092 -1001 23877 -3709 -10758 22670 10583 -16815 11851 23204
1677B3204l8805Q740L5491k9318k4356L9599K991m1941J5835K9703l2154j0145
$$ 23204 -15601 -6861 28630 -688 -25044 14555 17546 -24395 -8560 21143 -11011 -21156
1689b1156L5495j3601k6771L3452R978m2907J3411M0215l0940k3312M3763N28
$$ -21156 14339 738 -26033 7419 17397 -25510 -12099 28116 -2824 -26136 17627 18155
1701A8155m1532K3751K9263l9027p717M0773j6746l0125L4956O828m4212J7234
$$ 18155 -23377 374 29637 -9390 -17107 23666 6920 -23205 11751 18579 -25633 -8399
1713h399L6904l9109j9834M8469n269m4663K8116K7970m1612j434M2108k2870
$$ -8399 28505 -10604 -30438 18031 12762 -31901 -3785 24185 -17427 -18861 23247 377
1725C77k6537M2092M458m5131K1654L5568m1054j2530M8679j4590m2524L5638
$$ 377 -26160 15932 20390 -24741 -3087 32481 -8573 -21103 27576 12986 -29538 6100
1737F100K2450m6519J210M0780k7534k3331M1343k693m3760K7335L0940m4244
$$ 6100 28550 -17969 -16759 24021 -3513 -26844 14499 11806 -31954 -4619 26321 -17923
1749a7923p025M8486j7812l7133L8896J6876m5328R792L8788l0698j9423M2725
$$ -17923 -24948 23538 5726 -31407 7489 24365 -20963 -11171 27617 -3081 -22504 20221
1761B0221n824l9713K8334K3185m3200k71M4107k4152l3070L9803J1551m3568
$$ 20221 14397 -25316 3018 26203 -16997 -17268 26839 2687 -30383 9420 20971 -22597
1773b2597J2367L3657l1802j2698M0814r626l4957K9736J9047l9693M639L8134
$$ -22597 -10230 23427 -8375 -21073 19741 10115 -24842 4894 23941 -15752 -11113 27021
1785B7021k5447k5591L9406M804m0405J5569K8627l1143j0207L6072j1771k9464
$$ 27021 1574 -24017 15389 20193 -20212 -4643 23984 -7159 -17366 18706 6935 -22529
1797b2529K8765J2747l6375P786L3788k4708k0499L5327K713l4162J6568K3905
$$ -22529 6236 18983 -17392 -9606 24182 -526 -21025 14302 17015 -17147 -579 23326
1809B3326k9210p239L2737j0917k6677K3621J0704l1088O251K7016k3154j7466
$$ 23326 -5884 -13123 19614 8697 -17980 5641 16345 -14743 -8492 18524 -4630 -22096
1821b2096L1169Q81l1202J4390K2325k5011o707K9249p754k1927K1563J1141k6310
$$ -22096 9073 9954 -21248 -6858 15467 -9544 -16251 12998 5244 -16683 4880 16021 -10289
1834a0289N405K5971j8503j6288K6734K148k7604J1509J9430k4137r202K6225
$$ -10289 -4884 21087 2584 -13704 13030 15178 -12426 -917 18513 -5624 -14826 11399
1846A1399n772k4292J6302J1720k3956J903K3610j5461j6009K4882N056k5956
$$ 11399 5627 -18665 -2363 9357 -14599 -12696 10914 -4547 -20556 4326 9382 -16574
1858a6574J0515K2278k0337j0117K6660k240k3876J5722J4316k3903j524K4054
$$ -16574 -6059 16219 -4118 -14235 12425 10185 -13691 2031 16347 -7556 -9080 14974
1870A4974j2992j9042K1844N051k6760Q476K2369k1566j3015K8009n20k5646J5543
$$ 14974 1982 -17060 4784 9835 -16925 -8449 13920 -7646 -20661 7348 6828 -18818 -3275
1883c275J7319k3237j324K7616j1694j9730K4203Q604k7704Q492K3660k2401j3019
$$ -3275 14044 -9193 -10517 17099 5405 -14325 9878 18482 -9222 -730 22930 529 -12490
1896a2490K9459l208k9291J5931J8547k7881m724K8060j2552k1271K4307O378
$$ -12490 16969 13761 -15530 401 18948 -8933 -13657 14403 1851 -19420 4887 11265
1908A1265k9331J0874K6360k4071j2923L2279j990k8012J9297J8312k9072j366
$$ 11265 -18066 -7192 19168 -4903 -17826 14453 12463 -15549 3748 22060 -7012 -8378
1920h378L1472j4747k2949K5893O455l0622J0659K3123k7071j1996L2474o908
$$ -8378 23094 8347 -14602 11291 17746 -12876 -2217 20906 -6165 -18161 14313 7405
1932G405l0866K0978J7395l0900r62L0206j6339k0011K8346M670l0698J4429K4623
$$ 7405 -23461 -2483 14912 -15988 -16950 13256 -3083 -23094 5252 9922 -20776 -6347 18276
1945A8276k6726q517L2131q144k6419K4165J4607l2357J953L1087j7652j9156
$$ 18276 -8450 -16967 15164 7020 -19399 4766 19373 -12984 -11031 20056 2404 -16752
1957a6752K6666J783k8064J5553K0621k8539o072L1607j0217k4799K3916J1524
$$ -16752 9914 11697 -16367 -814 19807 -8732 -14804 16803 6586 -18213 5703 17227
1969A7227l0126N305K7472j9688j6015K7537O07k6437J4678J7334k4931l016K7583
$$ 17227 -12899 -7594 19878 190 -15825 11712 12319 -14118 560 17894 -7037 -10053 17530
1982A7530j3396k1852K5048R455k9446M842K4315j6989j2755K4049k070k3723
$$ 17530 4134 -17718 7330 16785 -12661 -7819 16496 -493 -13248 10801 8731 -14992
1994a4992J5652J5820k3752l023K4303j0890j7713K1450N935k6149O300K2770
$$ -14992 660 16480 -7272 -10295 14008 3118 -14595 6855 12790 -13359 -7059 15711
2006A5711j7028j3190K1508m9k0437J2503J2428k0422o18K1309j0532j6636J9373
$$ 15711 -1317 -14507 7001 6952 -13485 -982 11446 -8976 -9594 11715 1183 -15453 3920
2019C920P333k2426M635J8806j4138j0565K0045l84k0054R926J3592j6179l926
$$ 3920 11253 -11173 -6538 12268 -1870 -12435 7610 7226 -12828 -2902 10690 -5489 -9415
2032i415J6920p917j3701J6933O056k1143K343J9304j0583j2218J6314K465j6691
$$ -9415 7505 -412 -14113 2820 8876 -12267 -9924 9380 -1203 -13421 2893 5358 -11333
2045a1333Q046J3036j4188n287J7865l808j4955J3131Q566j7593P28J7949j0039
$$ -11333 -3287 9749 -4439 -9726 8139 4331 -10624 2507 11073 -6520 -5792 12157 2118
2058B118j3515J6406N675j9144L220J4825j1119p243J5298l085j5395J2182J1192
$$ 2118 -11397 5009 10684 -8460 -5240 9585 -1534 -8777 6521 3436 -11959 223 11415
2071A1415j7874k969J9656o097j4650J5223P462j9085L429J8269j1021j1429J7174
$$ 11415 -6459 -9428 10228 4131 -10519 4704 12166 -6919 -3490 14779 3758 -7671 9503
2084I503J186j7044R468J2082j8137l454K0207p798j8313J5327R896k1604J36
$$ 9503 10689 -6355 3113 15195 -2942 -6396 13811 6013 -12300 3027 12923 -8681 -8545
2097h545J8851j1430j2394J8417J005j9956R639J5614j7824n539K1595o213j8026
$$ -8545 10306 -1124 -13518 4899 5904 -14052 -4413 11201 -6623 -12162 9433 3220 -14806
2110a4806J7696J0239k3232J146K2619j1460j4865J8606K601k0980J0030J5708
$$ -14806 2890 13129 -10103 -8957 13662 2202 -12663 5943 8544 -12436 -2406 13302
2122A3302k0414n887K3378o771k1068J7804J0981k3414J540K2913j3854j4237
$$ 13302 -7112 -12999 10379 3608 -17460 344 11325 -12089 -10549 12364 -1490 -15727
2134a5727K2342L229k3275J0993J7998j9491n226K4057q259j9652K0240J0706
$$ -15727 6615 9844 -13431 -2438 15560 -3931 -9157 14900 6641 -13011 7229 17935
2146A7935k6041J466K4540j4643j5570K1995J549k4226J1567J7207k1944n892
$$ 17935 -8106 -6640 17900 3257 -12313 9682 11231 -12995 -1428 15779 -6165 -12057
2158a2057K4438q026k0630J9701J0428k5707L928K3678j5656j4474K3721J951
$$ -12057 12381 4355 -16275 3426 13854 -11853 -7925 15753 97 -14377 9344 11295
2170A1295k4115J1299J7394k1001m939K3944r857k0218K0071R705k6529L226K3033
$$ 11295 -12820 -1521 15873 -5128 -10067 13877 4020 -16198 3873 13578 -12951 -9725 13308
2183A3308j6495j3786K3386L56k4646J2443J7452k1180m618K3712q692j8745K0962
$$ 13308 -3187 -16973 6413 6769 -17877 -5434 12018 -9162 -13780 9932 1240 -17505 3457
2196C457R123k5228M575K3107j5818j3957K3740J182k3696J1735J6246k0702m468
$$ 3457 12580 -12648 -8073 15034 -784 -14741 8999 10181 -13515 -1780 14466 -6236 -10704
2209a0704K3366r213j9553J9792R294k4533L721K1973j5690j2848K3365J458k3843
$$ -10704 12662 3449 -16104 3688 12982 -11551 -7830 14143 -1547 -14395 8970 10428 -13415
2222a3415J1419J7435j9841n125K2721p887j8632J8746R246k4206L668K2056j5345
$$ -13415 -1996 15439 -4402 -9527 13194 5307 -13325 5421 14667 -9539 -5871 16185 840
2235H40j4117K2602J908k3309J0550J6949j9359n917K3513p147j9988J7908J1015
$$ 840 -13277 9325 11233 -12076 -1526 15423 -3936 -9853 13660 6513 -13475 4433 15448
2248A5448k3357K173K2090j4726j4215K2647K656k4466R076J8695j9496p969K3088
$$ 15448 -7909 -5736 16354 1628 -12587 10060 12716 -11750 -2674 16021 -3475 -11444 11644
2261A1644o314k0763J7288J1180k3706J016K3142j4063j5718K2892L483k4380
$$ 11644 5330 -15433 1855 13035 -10671 -9655 13487 -576 -16294 6598 10081 -14299
2273a4299R489J9541j9727q591K4722m592k2291J6757J2930k3807N25K3727j4383
$$ -14299 -4810 14731 -4996 -13587 11135 6543 -15748 1009 13939 -9868 -9343 14384 1
2286Aj7275K3607N099k6351P888K0895j9429r569K5788m855k3795J7994J4777
$$ 1 -17274 6333 11432 -14919 -7031 13864 -5565 -15134 10654 5799 -17996 -2 14775
2299A4775k5032o80K5943j3478j7760K4045N271k6998Q940K2632k1649j0951K7335
$$ 14775 -10257 -10937 15006 1528 -16232 7813 13084 -13914 -4974 17658 -3991 -14942 12393
2312A2393m418k4624J7471J4766k6450K14K7133j5241j9654K6038O532k8386R359
$$ 12393 7975 -16649 822 15588 -10862 -10648 16485 1244 -18410 7628 14160 -14226 -4867
2325d867K3300k2433r903K9456n069k6723J9427J6040k7313n42K8010j6352j9903
$$ -4867 18433 -4000 -13903 15553 10484 -16239 3188 19228 -8085 -8627 19383 3031 -16872
2338a6872K6983N305l1052J0508K4140k4096j1603L0114o255k7117K1183J5063
$$ -16872 10111 15416 -15636 -5128 19012 -5084 -16687 13427 7172 -19945 1238 16301
2350A6301k9879R33K9909j7028k0675K7974N492l0649J2632K3695k6592r517L2255
$$ 16301 -13578 -12645 17264 236 -20439 7535 13027 -17622 -4990 18705 -7887 -17404 14851
2363A4851p349k8089K2186J4716l0433L176K9033j9756j9503L0639L451l1897
$$ 14851 7502 -20587 1599 16315 -14118 -10942 18091 -1665 -21168 9471 12922 -18975
2375a8975J3906K3921k7032p934L2119r323k6474K4262J4053l1540L668K9771
$$ -18975 -5069 18852 -8180 -16114 16005 6682 -19792 4470 18523 -13017 -9349 20422
2387B0422j9900j8374L0012J699l1334J6093K2301k8797p405L2142j0113k6115
$$ 20422 522 -17852 12160 13859 -17475 -1382 20919 -7878 -15283 16859 6746 -19369
2399a9369K4219J1733l1390O321K8713k1597j7686L1006Q94l0367J6786K0708
$$ -19369 4850 16583 -14807 -8486 20227 -1370 -19056 11950 12844 -17523 -737 19971
2411A9971k8256n251L1853j2024k5732K5587J0863l1414O389K6849k1932j5589
$$ 19971 -8285 -13536 18317 6293 -19439 6148 17011 -14403 -8014 18835 -3097 -18686
2423a8686K9892j185k9695J6605K0829k8309m920L0118j1893k2956K5308R295
$$ -18686 11206 10021 -19674 -3069 17760 -10549 -15469 14649 2756 -20200 5108 14403
2435A4403l0492P318K7554k0940j5506K9054r22k7456J7052J8493k8117l477K9493
$$ 14403 -16089 -8771 18783 -2157 -17663 11391 10469 -16987 65 18558 -9559 -13036 16457
2448A6457j1271k3054K3496R061k8752P510K4680k1133j4051K8525q69k7551J6366
$$ 16457 5186 -17868 5628 14689 -14063 -6553 18127 -3006 -17057 11468 10599 -16952 -586
2461e86J8358k6002l753K7871j1313k1313K3407R076k8526O120K5256j9887j3929
$$ -586 17772 -8230 -11983 15888 4575 -16738 6669 15745 -12781 -6661 18595 -1292 -15221
2474a5221K6657j469k6233J5748J7793k5721m844K7230r797k1214K1749Q660k7076
$$ -15221 11436 9967 -16266 -518 17275 -8446 -13290 13940 4143 -17071 4678 13338 -13738
2487a3738O496K4707j8941j4359K6570M13k6128J4654J8221k4390m672K7380j0054
$$ -13738 -7242 17465 -1476 -15835 10735 11148 -14980 -326 17895 -6495 -11167 16213 6159
2500F159k1797K1828R504k7264M772K4460j8421j4582K5888l65k6975J4296J9172
$$ 6159 -15638 6190 15694 -11570 -6798 17662 -759 -15341 10547 10182 -16793 -2497 16675
2513A6675k4476o272K7013r061k1741K1708R694k7362M682K5653j7844j5389K6016
$$ 16675 -7801 -14073 12940 3879 -17862 3846 13540 -13822 -9140 16513 -1331 -16720 9296
2526I296M93k6497J4602J9159k4877o466K8003r306k2788K1593J0638k7885M558
$$ 9296 9789 -16708 -2106 17053 -7824 -14290 13713 4407 -18381 3212 13850 -14035 -9477
2539i477K5200j8864j5034K7249K31k7844J5038K0063k4994n730K7954r143k2539
$$ -9477 15723 -3141 -18175 9074 9305 -18539 -3501 16562 -8432 -14162 13792 4649 -17890
2552a7890K3030J0778k8675N282K6340j8980j4850K7666n18k7327J5925J9380
$$ -17890 5140 15918 -12757 -7475 18865 -115 -14965 12701 12183 -15144 781 20161
2564B0161k6304n227K8964j1178k2629K3644R528k9236N943K5872k0590j4290
$$ 20161 -6143 -11370 17594 6416 -16213 7431 16959 -12277 -6334 19538 -1052 -15342
2576a5342K8646j976k7550J6548J8690k6623m023K8836j2266k2230K4432Q523
$$ -15342 13304 11328 -16222 326 19016 -7607 -11630 17206 4940 -17290 7142 15665
2588A5665k9517P145K4431k0962j2879K8154l663k7499J7815J7448k7318k449
$$ 15665 -13852 -6707 17724 -3238 -16117 12037 8374 -19125 -1310 16138 -11180 -13629
2600a3629K7531j3186k0347K4594O587k8067Q841K3269k1359j1135K7796l870
$$ -13629 13902 716 -19631 4963 11550 -16517 -7676 15593 -5766 -16901 10895 7025
2612G025k5153J8192J5955k6194r53K6748j3587j8951K4081N600k6338Q484K1339
$$ 7025 -18128 64 16019 -10175 -11128 15620 2033 -16918 7163 12763 -13575 -5091 16248
2625A6248k0905r313K6270n299k3535J7627J4070k5014L3K4133j3327j6682K3048
$$ 16248 -4657 -13970 12300 7001 -16534 1093 15163 -9851 -9818 14315 988 -15694 7354
2638G354M072k4682R509J9211j9572q240K4514n102k1401J6799J2393k2950O45
$$ 7354 11426 -13256 -3747 15464 -4108 -12348 12166 7064 -14337 2462 14855 -8095 -7450
2651g450K2488j3240j5437K1416M074k3149Q308J7648j8150p108K2210m975j9765
$$ -7450 15038 1798 -13639 7777 11851 -11298 -2990 14658 -3492 -10600 11610 6635 -13130
2664a3130J4877J1546k0681p7K0389j1750j3928J9319L576k1209P595J6271j6584
$$ -13130 1747 13293 -7388 -7465 12924 1174 -12754 6565 10141 -11068 -3473 12798 -3786
2677c786p054K0171l878j8317J3356J0907j9107p52J9526j0109j4090J6992M679
$$ -3786 -10840 9331 5453 -12864 492 11399 -7708 -8460 11066 957 -13133 3859 8538
2690H538j9125N709J5657j4508q197J9442k116j7911J1136J1737j7320j459J8075
$$ 8538 -10587 -4878 10779 -3729 -11926 7516 5400 -12511 -1375 10362 -6958 -8417 9658
2703I658q379j3939J5849O027j8203L776J6119j2184r254J7713o93j7417J0197
$$ 9658 1279 -12660 3189 9216 -8987 -5211 10908 -1276 -10530 7183 6490 -10927 -730
2716g30J2286j6826l497J8607o568j5033J4248O987j8027L176J6314j2023j0303
$$ -730 11556 -5270 -8767 9840 3272 -11761 2487 9474 -8553 -5377 10937 -1086 -11389
2729a1389J7860J150j7912Q509J3383j5734m303J8981n643j6358J4521Q626j8335
$$ -11389 6471 7621 -10291 -1782 11601 -4133 -8436 10545 4902 -11456 3065 11691 -6644
2742f644J510J7455j1808j1317J7984J652j9584Q571J4151j6705n209J8952n103
$$ -6644 -5134 12321 513 -10804 7180 8832 -10752 -2181 11970 -4735 -9944 9008 3905
2755C905j6805J4383Q831j9592K012J8323j1740j1833J8326K092j8696Q989J4120
$$ 3905 -12900 1483 10314 -9278 -7266 11057 -683 -12516 5810 7902 -10794 -1805 12315
2768A2315j6823m918K0578n226j7789J4472R473j9322J937J7940j2553j1868J9331
$$ 12315 -4508 -9426 11152 5926 -11863 2609 12082 -7240 -5303 12637 84 -11784 7547
2781G547J323k0096R159J4620j7351m579J9874o364j6635J5817Q115j9942K942
$$ 7547 8870 -11226 -2067 12553 -4798 -9377 10497 4133 -12502 3315 11430 -8512 -5570
2794e570J8097j2432j1130J8824O75j9068R846J3659j8216m093K0030o703j6079
$$ -5570 12527 95 -11035 7789 8464 -10604 -758 12901 -5315 -9408 10622 3919 -12160
2807a2160J4741P284j9266L686J6958j2878j0747J8718L68j7554R674J1919j6436
$$ -12160 2581 9865 -9401 -5715 11243 -1635 -12382 6336 6704 -10850 -1176 10743 -5693
2820e693k897J9289p155j4979J5051O813j7894L394J5609j2016r379J7010o00
$$ -5693 -8590 10699 3544 -11435 3616 10429 -7465 -4071 11538 -478 -9857 7153 6553
2833F553j6803R036J1531j6035l302J7022o508j3055J2947N750j6872L604J5407
$$ 6553 -10250 -1214 10317 -5718 -9020 8002 1494 -11561 1386 7136 -9736 -6132 9275
2846I275j1719q802J5423N64j4666Q437J0266j4463k181J6176n570j2490J1595
$$ 9275 -2444 -11246 4177 4741 -9925 -1488 8778 -5685 -7866 8310 2740 -9750 1845
2859A845O204j4973K436J3868j0184q195J4208M18j4313O809J0417j2340l093
$$ 1845 8049 -6924 -4488 9380 -804 -8999 5209 5627 -8686 -1877 8540 -3800 -6893
2872f893J3827l745j1678J0316O800j3767J317J3501p631q635J2330K384j2990
$$ -6893 6934 3189 -8489 1827 8627 -5140 -3823 9678 2047 -6588 5742 8126 -4864
2885d864N332J0662j1351n094J3584j931j2836Q126P458j3182o20J3206o608j0469
$$ -4864 468 11130 -221 -5315 8269 6338 -6498 1628 9086 -4096 -4716 8490 1882 -8587
2899h587J1375M035j3466L457J1247r637o221J3487j18j3223P460R640j2192k749
$$ -8587 2788 6823 -6643 -3186 8061 -1576 -7797 5690 5572 -7651 -191 9449 -2743 -5492
2913e492J4160m722j1714J0871N055j4030K004J2723r590q853J3763N15j4349
$$ -5492 8668 3946 -7768 3103 8158 -5872 -3868 8855 -735 -9588 4175 4690 -9659
2926i659O547J0154j3139l683J5293m267j3211J1497P137j4605J393J4860r598
$$ -9659 -3112 7042 -6097 -9780 5513 1246 -11965 -468 6669 -7936 -6543 8317 -1281
2939a281r025J5306J515j5508P194J2115j4199m560J6634m500j4554J2024P391
$$ -1281 -10306 5000 6515 -8993 -1799 10316 -3883 -8443 8191 3691 -10863 1161 8552
2952H552j6923J248J6239j0981j0332J5914J479j6853Q408J2465j5193l999J8066
$$ 8552 -8371 -7123 9116 -1865 -12197 3717 5196 -11657 -3249 9216 -5977 -9976 8090
2965H090m662j4571J3330Q246j7348K342J7043j1306j0304J7217J059j7670Q985
$$ 8090 3428 -11143 2187 10433 -6915 -4573 12470 1164 -9140 8077 9136 -8534 451
2978D51J2576j6615l988J8374o307j5058J4170P054j8264K924J6740j2055r980
$$ 451 13027 -3588 -7576 10798 4491 -10567 3603 10657 -7607 -4683 12057 2 -9978
2991i978J7953K6j7439J0206J2482j6994k620J8682o948j4768J4822O341j8478
$$ -9978 7975 8001 -9438 768 13250 -3744 -6364 12318 5370 -9398 5424 11765 -6713
3004f713L541J5955j3325r553J7470j440j7067J0132J0775j7024k346J7527p620
$$ -6713 -3172 12783 -542 -10095 7375 5935 -11132 -1000 9775 -7249 -9595 7932 312
3017C12j3668J4750N064j7558M441J5274j2560p626J7111j243j6436J0991J0869
$$ 312 -13356 1394 6458 -11100 -6659 8615 -3945 -11571 5540 4297 -12139 -1148 9721
3030I721j6477j697J7132p220j2582J4405L991j6455M727J4428j2312p779J6095
$$ 9721 -6756 -8453 8679 1459 -11123 3282 7273 -9182 -4455 9973 -2339 -10118 5977
3043E977j448j5343J0166J0112j5509j263J5730o404j1955J3452N200j6090M314
$$ 5977 4529 -10814 -648 9464 -6045 -7308 8422 2018 -9937 3515 8715 -7375 -3061
3056c061J3889j1114p134J5141q40j4997R425R969j4466k603J5250o051j1737
$$ -3061 10828 -286 -7420 7721 6881 -8116 1309 11278 -3188 -5791 9459 3408 -8329
3069h329J2276M679j5527L174J3699j0788p824J4521o36j4241Q283J0497j4168
$$ -8329 3947 8626 -6901 -3727 9972 -816 -8640 5881 5245 -8996 -713 9784 -4384
3082d384k840J5312n121j2108J1368O235j5090K425J3446r312q376J4208M81j4604
$$ -4384 -7224 8088 2967 -9141 2227 8462 -6628 -4203 9243 -69 -8445 5763 6244 -8360
3096h360P255J1035j3344m073J5232m647j2856J1577O738j5569J095J4534q842
$$ -8360 -1105 9930 -3414 -7487 7745 3098 -9758 1819 8557 -7012 -5917 8617 -225
3109b25r209J3934J310j5408P279J1758j3663m872J6013l766j3672J1517P811
$$ -225 -9434 4500 5810 -9598 -2319 9439 -4224 -9096 6917 3151 -10521 996 8807
3122H807j5720Q66J5190q974j0521J5402K014j6613O868J2734j3806n272J7267
$$ 8807 -6913 -6047 9143 169 -10352 5050 7064 -9549 -2681 10053 -3753 -9025 8242
3135H242m468j4849J2419Q694j7038P71J6162r521j0565J5931K204j7673P766
$$ 8242 3774 -11075 1344 10038 -7000 -6229 9933 412 -10153 5778 7982 -9691 -1925
3148a925J3561j4791n340J7733m493j5222J3394Q132j8061J625J7074j1024j0674
$$ -1925 11636 -3155 -8495 9238 4745 -10477 2917 11049 -7012 -5387 11687 663 -10011
3161a0011J6932J131j8120Q634J3455j6634m285J8753o375j5311J4221P780j8452
$$ -10011 6921 8052 -10068 -1434 12021 -4613 -8898 9855 3480 -11831 2390 10170 -8282
3174h282K282J6863j2235j0052J8340j56j8317R932J2880j6633l423J8686p364
$$ -8282 -6000 10863 -1372 -11424 6916 6760 -11557 -1625 11255 -5378 -8801 9885 2521
3187B521j4729J5883O432j9052L914J6646j2985q873J8152j449j7420J0946J1646
$$ 2521 -12208 3675 10107 -8945 -5031 11615 -1370 -10243 7909 6460 -10960 -14 11632
3200A1632j7010k234J8432p855j4099J5756N372j8272M697J5764j3975p510J7754
$$ 11632 -5378 -7612 10820 2965 -11134 4622 9994 -8278 -3581 12183 -1792 -9302 8452
3213H452j883j6719J1075J0028j6767m20J7024r124j2778J5948M129j7914N458
$$ 8452 6569 -10150 925 10953 -5814 -6234 10790 1666 -11112 4836 8965 -8949 -3491
3226c491J4112j3364o473J6963l100j5332J1314Q784j6096L40J5807q927j1229
$$ -3491 10621 -2743 -9216 7747 4647 -10685 629 9413 -6683 -6343 9464 537 -10692
3239a0692J5114K948j6480N965J2895j3058n690J5727l064j3826J0711P514j5052
$$ -10692 4422 7370 -9110 -3145 9750 -3308 -8998 6729 3665 -10161 550 8064 -6988
3252f988O60J4891r024j0166J4123L124j5471N937J2250j2523m988J5249l394
$$ -6988 -6328 8563 -461 -10627 3496 6620 -8851 -2914 9336 -3187 -8175 7074 3680
3265C680j2796R804P388j3422N33J3469q087r592J3078K457j4467M841J1217j0997
$$ 3680 -9116 688 8076 -5346 -4813 8656 569 -9023 4055 6512 -7955 -3114 8103 -2894
3279b894n279J3687k565j2282Q955P362j3366q8J3652p139r477J2458L206j3578
$$ -2894 -8173 5514 2949 -9333 -378 6984 -6382 -6470 7182 43 -9434 3024 6230 -7348
3293g348M783J1305j0759m960J3470j252j2314Q358P652j2659j75J3227p242r591
$$ -7348 -2565 8740 -2019 -6979 6491 5239 -7075 1283 8935 -3724 -3899 9328 2086 -7505
3307g505J1941L429j3900M022J1405j0226n909J3531j584j2422P819Q414j2321
$$ -7505 4436 7865 -6035 -2013 9392 -834 -6743 6788 5204 -7218 601 9015 -3306
3320c306j276J3525o036r756J1328L686j3587L746J1713j0200o898J3380j000
$$ -3306 -4582 8943 2907 -6849 4479 8165 -5422 -1676 10037 -163 -7061 6319 5319
3333E319j3005P650Q359j3058j456J3286o424j0506J1170M165j4074L911J1744
$$ 5319 -7686 -36 8323 -4735 -6191 7095 671 -9835 1335 5500 -8574 -4663 7081
3346G081j0334o415J4049o68j3139Q288Q609j2867j325J4006o039j0305J1955
$$ 7081 -3253 -9668 4381 3713 -9426 -1138 7471 -5396 -6721 7285 1246 -9059 2896
3359B896L558j4059M068J2196j1093o602J3963j562j2974Q383Q003j3432p22J4015
$$ 2896 6454 -7605 -3537 8659 -2434 -9036 4927 3365 -9609 -1226 6777 -6655 -7377 6638
3373F638o798r738J2279L273j3911N433J1503j0926n218J4579j974j2788R834
$$ 6638 -160 -9898 2381 5654 -8257 -2824 8679 -2247 -7465 7114 5140 -7648 2186
3386B186P496j3261m0J3345p241r209J2204J875j3689N264J0787j1546m902J3702
$$ 2186 9682 -3579 -3619 9726 2485 -6724 5480 7355 -6334 -1070 9717 -1829 -6731 6971
3400F971l089j1852R490O308j2955Q86J2692p670p976J2239J439j2588N868J0152
$$ 6971 3882 -7970 1520 7828 -5127 -4241 8451 781 -7195 5044 6483 -6105 -237 9915
3414I915j1428l812J3415l874j0673R142N667j2831J081J1287q106p310J1223
$$ 9915 -1513 -5325 8090 4216 -6457 2685 8352 -4479 -3398 7889 -217 -7527 3696
3427C696L47j1933N388Q854j0529l213J1766l794r655R269M687j1092J141J0652
$$ 3696 4043 -7890 -2502 6352 -4177 -7390 4376 582 -9073 196 4883 -6209 -5068 5584
3441E584o828o247J0528Q94j0977N714P577r574k499J0651l538q842Q308L970
$$ 5584 -1244 -7491 3037 3931 -7046 -1332 6245 -3329 -5828 4823 1285 -7557 751 4721
3455D721j0479J183R497o582n704R398O68r978N221P432q676j963R630k878p638
$$ 4721 -5758 -4575 4922 -1660 -7364 2034 2702 -7276 -2055 5377 -3299 -5262 4368 1490 -6148
3470f148P891M342r240J164Q810n110n224Q545O79q651L773P067p544l018Q850
$$ -6148 1743 6085 -3155 -1991 6819 1709 -3515 5030 5709 -2942 831 7898 354 -2664 6186
3485F186k359p603N932M170q601m3Q220m670n965P435J628q654K839O796o467
$$ 6186 3827 -3776 2156 6326 -2275 -2318 5902 1232 -4733 2702 4330 -4324 -1485 5311 -1156
3500a156k966Q130j541p645N732N071q163n01P695l794n746P123J988q391K050
$$ -1156 -4122 4008 2467 -5178 554 5625 -2538 -3039 4656 862 -4884 2239 4227 -4164 -2114
3515b114P090n837m151P496k49p396M511N155p785j310Q215l224o398O624L435
$$ -2114 4976 -861 -5012 2484 2235 -5161 -650 4505 -3280 -4590 3625 401 -5997 627 4062
3530D062q614J791P266n044m571P891r1p940M498N415p067j397P805l060o588
$$ 4062 -4552 -2761 4505 -539 -5110 2781 2690 -5250 -752 4663 -2404 -3801 4004 944 -5644
3545e644O732L260q917J167P763n292m653P824Q0q076M613N743p599j681Q700
$$ -5644 1088 4348 -4569 -3402 4361 -931 -5584 2240 2320 -5756 -1143 4600 -2999 -4680 4020
3560D020l231o284P157L130q931J614P964n427m720Q105L57q170M581N446p294
$$ 4020 789 -5495 1662 4792 -4139 -2525 5439 12 -4708 3397 3754 -4416 165 5611 -1683
3575a683j512Q257l387o455O861L225q785J609P732n877m521Q617n45p995M217
$$ -1683 -3195 5062 1675 -4780 2081 5306 -3479 -1870 5862 -15 -4536 4081 3536 -4459 -242
3590b42N699p291j308Q005l460o195O938K709q652J524P441n100m822P897o4p959
$$ -242 5457 -1834 -3142 4863 1403 -4792 2146 4855 -3797 -2273 5168 68 -4754 3143 3079 -4880
3606d880M140N370p284j110P467k898o107O384K684p797J569O950n116m393P497
$$ -4880 -740 4630 -2654 -3764 3703 805 -5302 1082 3766 -4031 -2462 4488 -628 -5021 2476
3621B476L12p530L874N033o228j502P326k962n455O114K318p345J092P039m856
$$ 2476 2788 -4742 -868 4165 -2063 -3565 3761 799 -4656 1458 3776 -3569 -2477 4562 -294
3636b94l944P109j07o606L158N114n946j535O522k446n359N703K407p081J298
$$ -294 -4238 2871 2764 -3842 -684 4430 -1516 -3051 3471 1025 -4334 1369 3776 -3305 -2007
3651b007O214m730l796O499N51o805L036M729n385j659O188j889n328M900K610
$$ -2007 4207 -523 -4319 2180 2731 -4074 -1038 3691 -1694 -3353 2835 946 -4382 518 3128
3666C128n901J49O437m014m029O314R84o710K288N421m577k579N996j425n051
$$ 3128 -2773 -2624 3813 -201 -4230 2084 3068 -3642 -1354 4067 -510 -3089 2907 1482 -3569
3681c569M191L329o133r2O076l458m430N837J691o899K070N383m571k885O059
$$ -3569 622 3951 -2182 -2274 3802 344 -4086 1751 3442 -3457 -1387 3996 -575 -3460 2599
3696B599m52n824L757L623n700%N829l233m532N985J691o874J335O101m464l406
$$ 2599 2147 -3677 80 3703 -1997 -1997 3832 599 -3933 2052 3743 -3131 -1796 4305 -159 -3565
3712c565O412m57o313L862L904o180k86O276k811n445O069K058p287J676O530
$$ -3565 2847 2390 -3923 -61 3843 -2337 -2623 3653 842 -4603 1466 3524 -3763 -2087 4443
3727D443m758l632O558M37o875L643M654o126p40O712k859n386O089K496p419
$$ 4443 -315 -3947 2611 3048 -3827 -184 4470 -1656 -2396 4316 1457 -3929 2160 4656 -2763
3742b763R99O786m811m270P074p0o881L586M434o345r84O870l169n474O243K428
$$ -2763 -1764 5022 211 -4059 3015 2945 -3936 -350 4084 -2261 -3245 3625 456 -5018 1225 3653
3758C653p866J670O700m893m212P174K66p068L596M980o484j097P282l298n642
$$ 3653 -4213 -2543 4157 -736 -4948 2226 2492 -4576 -980 4000 -2484 -3581 3701 403 -5239
3773e239O013K727p768J571O632n362l903P333j7p294L743N126o482o85P024l152
$$ -5239 774 3501 -4267 -2696 3936 -1426 -5329 2004 1987 -5307 -1564 3562 -2920 -3605 3419 267
3789B67n465O785K239p883K368P147n655l620P550j28p101M077N196o883r60P189
$$ 267 -5198 1587 3826 -4057 -1689 5458 -197 -3817 3733 3605 -3496 581 5777 -1106 -2066 5123
3805E123l251n924O712K035p743J809O757n736l766P530k97p376M195M860o743
$$ 5123 1872 -4052 2660 4695 -3048 -1239 5518 -218 -3984 3546 3249 -4127 68 4928 -1815
3820a815r84P676l489n456O757K013q083K454O738o013l491P689q33p406M438
$$ -1815 -2799 4877 1388 -4068 2689 4702 -3381 -927 5811 -202 -3693 3996 3163 -4243 195
3835A95M351p051p81P356l604n715O328J692p495K271O403o214l173Q007j060
$$ 195 4546 -2505 -3286 4070 466 -5249 1079 2771 -4724 -2453 3950 -2264 -5437 2570 1510
3850A510p106M885M353o757k77O943l462n245O677J595p435K476O130o164k726
$$ 1510 -5596 -711 3642 -3115 -3392 3551 89 -5156 1521 3116 -4319 -1843 4287 -1877 -4603
3865d603P644j453o865M694M294o949n92P433l692n382O742J390p280K925O015
$$ -4603 3041 1588 -5277 -583 3711 -3238 -3830 3603 -89 -5471 1271 2661 -4619 -1694 4321
3880D321o015k678P371q77o842N069L935o515j45P013l306n093O326J581o943
$$ 4321 -1694 -4372 2999 2122 -4720 349 4284 -2231 -2376 4637 1331 -3762 2564 4145 -2798
3895b798K418N606n598k677P139j083o700M609M010o687n75P008l484n036O426
$$ -2798 -380 5226 -372 -3049 4090 3007 -3693 916 4926 -1761 -2336 4672 1188 -3848 2578
3910B578J327o961K584N585n879k387O814j148o367M881L631o913j79O882l514
$$ 2578 3905 -3056 -472 5113 -766 -3153 3661 2513 -3854 1027 4658 -2255 -2434 4448 934
3925I34m915O045J071o864K464N423n592k665O976j377o335M466L850o785m0O717
$$ 934 -3981 2064 3135 -3729 -1265 4158 -1434 -4099 2877 1500 -4835 -369 3481 -3304 -3344 3373
3941C373l524n047O386J440o917K684N533n430k554O798j074o019M982L236o828
$$ 3373 -151 -5198 1188 2628 -4289 -1605 3928 -1502 -4056 2742 1668 -4351 631 3867 -2961
3956b961j5O855l314n171O232J053o619K411N491n491k646O620p36o345M806L795
$$ -2961 -2976 3879 565 -4606 1626 2679 -3940 -1529 3962 -1529 -4175 2445 1709 -4636 170 3965
3972C965o821k15P445m009m460N948J290o638K825N339n655k512P047j408o423
$$ 3965 -2856 -3071 4374 365 -4095 1853 3143 -3495 -670 4669 -986 -3498 3549 2141 -4282
3987d282M920L403o921L63O744l849m768O566J033p142K809N794n852k252O772
$$ -4282 638 4041 -2880 -2517 4227 378 -4390 2176 3209 -3933 -1124 4670 -1182 -3434 3338
4002C338j548n568M692L358o985N41P108m312m425O808O90p257L305N288o254
$$ 3338 1790 -3778 914 4272 -2713 -2172 4936 624 -3801 3007 3697 -3560 -255 5033 -1221
4017a221j986P029k031n820M787L282o923Q76O048m843l649P091J12p218L706
$$ -1221 -3207 3822 1791 -4029 758 4040 -2883 -2007 4041 -802 -4451 2640 2752 -4466 -760
4032g60M958o150j518O735k436n276N605K340o942J229O240m802l627O778k03
$$ -760 4198 -1952 -3470 3265 829 -4447 1158 3498 -3444 -2215 4025 -777 -4404 2374 2171
4047B171o907L883N059o685j206O755k317n155N344K182o723J977N529n101k572
$$ 2171 -4736 -853 4206 -2479 -3685 3070 753 -4402 942 3124 -3599 -1622 3907 -1194 -3766
4062c766O934r22o474M262M152o142p81O913l293m626N381J642o164J816N005
$$ -3766 3168 2246 -4228 34 4186 -1956 -2737 4176 883 -3743 1638 3280 -2884 -1068 3937
4077C937m685k462O344j009o193M363L818o067m01O063l096m223N181J459o012
$$ 3937 -748 -3210 3134 2125 -4068 295 4113 -1954 -2355 3708 612 -3611 1570 3029 -2983
4092b983K065M616m759j736N828j568n147L923L253n965o2N799l124l631M801
$$ -2983 -918 3698 -1061 -2797 3031 1463 -3684 239 3492 -2473 -2535 3264 140 -3491 1310
4107A310R94n328K220L587m467j458N800j663m679L906K979n509L05N253k969
$$ 1310 2304 -3024 -804 2783 -1684 -3142 2658 995 -3684 222 3201 -2308 -2003 3250 281
4122B81l581M776Q40m483J743L516m043r95M926j715m106L524K336n316Q49M529
$$ 281 -3300 1476 2316 -2167 -424 3092 -951 -1946 2980 1265 -2841 683 3019 -2297 -1448 3081
4138C081k695l426M316R86m607J759L112l599j194M614j282l965L550J983m585
$$ 3081 386 -3040 1276 2262 -2345 -586 2526 -1073 -2267 2347 1065 -2900 650 2633 -1952
4153a952N40M477k377l222L755J041m213J536K985l252j558M177q93m146L482
$$ -1952 -1412 3065 688 -2534 1221 2262 -1951 -415 2570 -682 -2240 1937 1044 -3102 380
4168C80J935m477L53M339k460k955L721J147m150J269L519l504j272M249j210
$$ 380 2315 -2162 -1809 2530 70 -2885 836 1983 -2167 -898 2621 -883 -2155 2094 884
4183H84l324L008J824m443M00M237k421l080L750Q87m210J082L501l401j416M515
$$ 884 -2440 568 2392 -2051 -1651 2586 165 -2915 835 1722 -2488 -1406 2095 -1306 -2722 1793
4199A793j347l377L352J641m395N30M384k428k974M169R89m556J793L407l466
$$ 1793 446 -2931 421 2062 -2333 -1803 2581 153 -2821 1348 2337 -2219 -426 2981 -485
4214d85j214L937j071l579L344J721m509K06M673k631l271M383P41m721J956L454
$$ -485 -1699 2238 1167 -2412 932 2653 -1856 -1650 3023 392 -2879 1504 2245 -2476 -520 2934
4230B934l735r04M178j409l166L401J532m474R91L891k891k572M601j49m038J834
$$ 2934 -801 -1705 2473 1064 -2102 1299 2831 -1643 -652 3239 348 -2224 2377 2228 -1810 24
4246B4K912l809o19L734j467k955L185J124m545J231L797l639j753M315j76m049
$$ 24 2936 -873 -1492 2242 775 -2180 1005 2129 -2416 -1185 2612 -1027 -2780 1535 1359 -2690
4262b690K392K769l817q93M333j953k515L536M34l906J433L346l278j575M257
$$ -2690 -298 2471 -1346 -2239 2094 141 -2374 1162 1596 -2310 -877 2469 -809 -2384 1873
4277A873o15m222K834K282l557m95L525k065k102L015O59l874J534K903k762j161
$$ 1873 1258 -2964 -130 2152 -1405 -1900 1625 -440 -2542 473 1132 -2742 -1208 1695 -1067 -2228
4293b228L588o88l086K394K093l413L8L388j813j842K766L57l046J691K006k754
$$ -2228 1360 672 -2414 -20 2073 -1340 -1302 2086 273 -1569 1197 1554 -1492 199 2205 -549
4309e49j053L724j240k838K416J612k994k7K808j867j770K838Q2k578J712J453
$$ -549 -1602 2122 882 -1956 460 2072 -922 -949 1859 -8 -1778 1060 1142 -1436 276 1729
4325A729k557k66K931j100k141K115J387k748M65K091j739j266K498l51k203J279
$$ 1729 -828 -1094 1837 737 -1404 711 2098 -650 -185 1906 167 -1099 1399 1048 -1155 124
4341A24J236j777q59K372q76j823J688J157k600K41J874p12j559J845J64j517
$$ 124 1360 -417 -1276 1096 220 -1603 85 1242 -1358 -1117 757 45 -1514 331 495 -1022
4357a022M86J767j758p37K011l64j791J319J098j794l38K043o74j640J667K48
$$ -1022 -536 1231 -527 -1264 747 383 -1408 -89 1009 -785 -1123 920 246 -1394 273 521
4373E21j633K16J640j247o46J701m1j912J244J153j733p25K634o37j797J566J217
$$ 521 -1112 -896 744 -503 -1149 552 511 -1401 -157 996 -737 -1462 1172 535 -1262 304 1521
4390A521k008k7J629j034j127J927J45k182R88J778j902r80K212l24j947J437
$$ 1521 -487 -514 1115 81 -1046 881 1026 -1156 -168 1610 -292 -1272 940 616 -1331 106
4406A06J161j919l46K031p04j960K315K85k160J025J878j933q61K218j78k379
$$ 106 1267 -652 -998 1033 329 -1631 684 969 -1191 -166 1712 -221 -1082 1136 958 -1421
4422a421J797J187k153r1K160j038j807K581M02k647O49K207k043j138K913o53
$$ -1421 376 1563 -590 -681 1479 441 -1366 1215 1617 -1030 -381 1826 -217 -1355 1558 905
4438I05k721J818J558k487R4K180j227j796K807J12k813J255J962k322p73K889
$$ 905 -1816 2 1560 -927 -833 1347 120 -1676 1131 1243 -1570 -315 1647 -675 -1448 1441
4454A441j141k156J826J296k595L48K377j730j539K642p1k589J351J583k178l14
$$ 1441 300 -1856 -30 1266 -1329 -981 1396 -334 -1873 769 698 -1891 -540 1043 -1135 -1449
4470a449K448q61k153K441R52k668K02K726k004j036K453K3k318J234J721k561
$$ -1449 999 138 -2015 426 1378 -1290 -1088 1638 -366 -1402 1051 1074 -1244 -10 1711 -850
4486h50j59K772j358k041K033J032k516N42K121j932j000K380R4k447J429J703
$$ -850 -1009 1763 405 -1636 397 1429 -1087 -545 1576 -356 -1356 1024 1118 -1329 100 1803
4502A803k364m14K580j194j655J937N70k224N67J739j439r84K073k67k245J334
$$ 1803 -561 -975 1605 411 -1244 693 1263 -961 -394 1345 -94 -1078 995 728 -1517 -183
4518a83J424k205R7J671p29j671J722J76j627O03J573j490r53J973J13j944P30
$$ -183 1241 -964 -867 804 75 -1596 126 302 -1325 -722 851 -639 -1592 381 494 -1450 -720
4535g20J521j347n85K078o38j795J962P92k170L28J941j195j219J768M54k103
$$ -720 801 -546 -1131 947 309 -1486 476 1268 -902 -574 1367 172 -1047 721 1175 -928
4551i28P10J784j789o30J940m91j398P18J180j768J70J869j126j450K000N45k021
$$ -928 -218 1566 -223 -853 1087 596 -802 -84 1096 -672 -502 1367 241 -1209 791 1336 -685
4568f85K78K026j618p90K062j14j861R52J211j992oJ988p90k131J887J194k526
$$ -685 -407 1619 1 -789 1273 1159 -702 250 1461 -531 -537 1451 661 -1470 417 1611 -915
4585i15P0K385k019j184K460m6k368J357J515k073p23K715j058j868K224R49k780
$$ -915 -845 1540 -479 -1663 797 751 -1617 -260 1255 -818 -1541 1174 116 -1752 472 1421 -1359
4602a359K79K766j992j623K711N04l016J306J993k286o15K964j317k505K572J265
$$ -1359 -1080 1686 -306 -1929 782 1286 -1730 -424 1569 -717 -1332 1632 315 -2190 382 1647
4618A647l060L87K979k242k055L403R1l202J597K391l202l75L097j470k318K945
$$ 1647 -1413 -1026 1953 -289 -2344 1059 1150 -2052 -455 1936 -1266 -1641 1456 -14 -2332 613
4634F13P54l369R19L158k752k140M036j48l388K407J997l139m39L282j469k423
$$ 613 1367 -2002 -1083 2075 -677 -2817 1219 1071 -2317 90 2087 -1052 -1491 1791 322 -2101
4650b101L184J030l955J462L159l060j773M040m46l591K445K129l595r0L564k109
$$ -2101 1083 2113 -1842 -380 2779 -281 -2054 1986 1540 -2051 394 2523 -1072 -1162 2402 293
4666B93k598L707M32l828J397L249l351j473M511r89l655K584J983l644L79L465
$$ 293 -2305 1402 1834 -1994 -597 2652 -699 -2172 2339 1350 -2305 279 2262 -1382 -1003 2462
4682B462k057k394L675K16l945K092K737l595q87L750r79l265K754J683m097L24
$$ 2462 405 -1989 1686 1902 -2043 49 2786 -809 -1696 2054 1075 -2190 564 2247 -1850 -1526
4698a526L451k333j889L442k68l494K197K656l766q25L819r54l488L092J563l653
$$ -1526 1925 -408 -2297 1145 877 -2617 -420 2236 -1530 -2355 1464 510 -2978 114 1677 -1976
4714a976N77L251k110j823L107M8l180K022K558l457r31L883j224l090K820J599
$$ -1976 -1399 1852 -258 -2081 1026 1074 -2106 -84 2474 -983 -1914 1969 745 -2345 475 2074
4730B074l758L05L416k298j564L286o1l234J700K385l177o81L769j269k835K901
$$ 2074 -1684 -1379 2037 -261 -1825 1461 1400 -1834 -134 2251 -926 -1607 2162 893 -1942 959
4746I59J341l651M07L456k217k153L403N2l362J817K491l356p96L967j242l602
$$ 959 2300 -1351 -944 2512 295 -1858 1545 1597 -1765 52 2543 -813 -1609 2358 1116 -2486
4762b486L394J379l486K07L163k079k195L320L14l557J699K516l192r68L808j240
$$ -2486 908 2287 -1199 -992 2171 92 -2103 1217 1531 -2026 -327 2189 -1003 -1971 1837 597
4778E97l364L193J672l934q1M186k271k474L535M36l692J893K888l773r52L941
$$ 597 -2767 426 2098 -1836 -1917 2269 -2 -2476 1059 1495 -2197 -304 2584 -1189 -2141 1800
4794A800r68l602L170J914m384M14L964k365k685L952L40m062J905L015l375j192
$$ 1800 832 -2770 400 2314 -2070 -1656 2308 -57 -2742 1210 1550 -2512 -607 2408 -967 -2159
4810b159M086j065l828L469J725m180K72M107k443k363L555J84l920J852L197
$$ -2159 1927 862 -2966 503 2228 -1952 -1680 2427 -16 -2379 1176 1360 -2560 -708 2489
4825B489l915r53M751j569l830L756J810m582L80M531k904k609M388K08m655K724
$$ 2489 -1426 -2379 2372 803 -3027 729 2539 -2043 -1663 2868 -36 -2645 1743 1951 -2704 20
4841B0K994m364n82M851j890l798L767J865m752Q73M149l267k611M697Q1m788
$$ 20 3014 -1350 -1932 2919 1029 -2769 998 2863 -1889 -1016 3133 -134 -2745 1952 2033 -2755
4857b755K723L003m088l72M079j913l738M442J385m985J124M374l647j896M496
$$ -2755 -32 2971 -1117 -1489 2590 677 -3061 1381 2766 -2219 -1095 3279 -368 -2264 2232
4872B232n16m583K821L170m870J78M825k671l808M422J201n341J695M298m026
$$ 2232 1716 -2867 -46 3124 -1746 -1568 3257 586 -3222 1200 2401 -2940 -1245 3053 -973
4887i73j881N009r94m162K838K757m679j26M875k660l336M621J054n117J892L973
$$ -973 -2854 2155 1161 -3001 -163 2594 -2085 -2211 2664 4 -3332 1289 2343 -2774 -882 3091
4903C091l891j723M571n63m315L225K150m289J43M024k404k854M582M73m765J822
$$ 3091 -800 -2523 2048 1485 -2830 395 2545 -1744 -1601 2423 19 -2835 1747 2220 -2545 -723
4919g23L565l768j516M776j081l885L103K080m338L20M285k794k612L735R00m513
$$ -723 2842 -926 -2442 2334 1253 -2632 471 2551 -1787 -1467 2818 24 -2588 1147 2047 -2466
4935b466J798L330l586j458M488r62m288L216K162m482L33M448k586k749L974
$$ -2466 -668 2662 -924 -2382 2106 1144 -3144 72 2234 -2248 -1915 2533 -53 -2802 1172
4950A172N82m285J720L491l553j364M356j279l329K828K303m196J26L994k387
$$ 1172 1754 -2531 -811 2680 -873 -2237 2119 840 -2489 339 2642 -1554 -1428 2566 179
4965A79k750M054N37m011J454L052l425j384M229p67l885L039K173m144K30L846
$$ 179 -2571 1483 2020 -1991 -537 2515 -910 -2294 1935 1168 -2717 322 2495 -1649 -1419 2427
4981B427k287k622L734P66m463J708L362k852j800M193o39l817K947J969l715
$$ 2427 140 -2482 1252 2018 -2445 -737 2625 -227 -2027 2166 1527 -2290 657 2626 -1089
4996a089j73M139k353l008L751J029m497J593L225l255j674M031n47l959K901
$$ -1089 -1262 2877 524 -2484 1267 2296 -2201 -608 2617 -638 -2312 1719 1172 -2787 114
5011A14K096m341P7M334k369k647L778R01m095J471L401l411j655M071m47l764
$$ 114 2210 -2131 -2054 2280 -89 -2736 1042 1943 -2152 -681 2720 -691 -2346 1725 1278 -2486
5027b486K944K142m138L9M408k341l038L974O82m490J343L812l688j279M207j374
$$ -2486 458 2600 -1538 -1499 2909 568 -2470 1504 2186 -2304 -961 2851 -837 -2116 2091 717
5043G17l604K900K596m504o0M297k617k888M282K90m114J884L406l336j650M408
$$ 717 -2887 13 2609 -1895 -1955 2342 -275 -3163 1119 1409 -2705 -821 2585 -751 -2401 2007
5059B007r43l712L194J864m114M31M100k608k654L970N14m382J808L486l617j433
$$ 2007 1064 -2648 546 2410 -1704 -1273 2827 219 -2435 1535 2049 -2333 -525 2961 -656 -2089
5075b089M046j008l847L258J871m311O87L657k129k914L918M76m078J961L038
$$ -2089 1957 949 -2898 360 2231 -2080 -1393 2264 135 -2779 1139 1615 -2463 -502 2536
5090B536l158j286M060j107l474L602J571l983O90L401k462k208L767K48m472
$$ 2536 -622 -1908 2152 1045 -2429 1173 2744 -1239 -549 2852 390 -1818 1949 2197 -2275
5105b275J972L103l563j062L787q25l524K920J395l800L66L781k709k097L871
$$ -2275 -303 2800 -763 -1825 1962 1137 -2387 533 1928 -1872 -1506 2275 -434 -2531 1340
5120A340J22m134K194K822l547q98L925j308k793K522J721l698O18L186k397j717
$$ 1340 1462 -2672 -478 2344 -1203 -2101 1824 516 -2277 245 1966 -1732 -1114 2072 -325 -2042
5136b042L320K23l974J570L196l141r66L509q67l364K731J572l505K43L214j887
$$ -2042 1278 1501 -2473 -903 2293 -848 -1814 1695 828 -2536 195 1767 -1738 -1495 1719 -168
5152a68j993L090M81l713J816K777k874j069L359o78k997K281J886l186q6L059
$$ -168 -2161 929 1410 -2303 -487 2290 -584 -1653 1706 1028 -1969 312 2198 -988 -1074 1985
5168A985j843k031L144O15l524J104K964k611j239L079n06k932K179J686l102
$$ 1985 142 -1889 1255 1870 -1654 -550 2414 -197 -1436 1643 1137 -1795 384 2070 -1032
5183a032J05L068k000k070L089M00l473J259K843k463j421K909k10l202K196J909
$$ -1032 -927 2141 141 -1929 1160 1560 -1913 -654 2189 -274 -1695 1214 1004 -2198 -2 1907
5199A907l078m24L485j741k286K929O66k945P21L009k573j405L108k16l292J947
$$ 1907 -1171 -1595 1890 149 -2137 792 1458 -1487 -766 2243 -330 -1735 1373 1157 -2135 -188
5215a88K071k621k68K954j747k321K920O36l004K06L140k315j678L269j2l224
$$ -188 1883 -738 -1006 1948 201 -2120 800 1436 -1568 -1362 1778 -537 -2215 1054 1042 -2182
5231b182J268K617k767o73L188j247k344K645J200l332N05L099k293j747L452
$$ -2182 -914 1703 -1064 -1737 1451 204 -2140 505 1705 -1627 -1122 1977 -316 -2063 1389
5246A389l47l171J729K445l055k40K951j204k817K788J465l544L66L510k441j938
$$ 1389 1042 -2129 -400 2045 -1010 -1250 1701 497 -2320 468 1933 -1611 -1245 2265 -176 -2114
5262b114L288N26l806J794K597k794j081L678j209k785K831J040l313N32K908
$$ -2114 1174 1700 -2106 -312 2285 -509 -1590 2088 879 -1906 925 1965 -1348 -816 2092
5277B092j901j963L392J81l866J911K299k751p57L253q19k834K182J431l344N11
$$ 2092 191 -1772 1620 1801 -2065 -154 2145 -606 -1363 1890 1071 -1763 419 1850 -1494 -983
5293i83L362k511j899L298J11l665J778K495k983o96L207q22l057K693J370l276
$$ -983 2379 -132 -2031 1267 1378 -2287 -509 1986 -997 -1693 1514 692 -2365 328 1698 -1578
5309a578M55L182k185j902K979K31l369J734K415k886p98L374r27l161K852J274
$$ -1578 -1123 2059 -126 -2028 951 1182 -2187 -453 1962 -924 -1722 1652 725 -2436 416 1690
5325A690l274M16L328k369k269L830K65l721J802K430l065q00L428q09k909K161
$$ 1690 -1584 -1168 2160 -209 -2478 1352 1617 -2104 -302 2128 -937 -1737 1691 882 -2027 134
5341A34K073l583M05L071j682k396L086O03l652J701K623k852j224L455q38k759
$$ 134 2207 -1376 -971 2100 418 -1978 1108 1711 -1941 -240 2383 -469 -1693 1762 924 -1835
5357a835K131J722l162k2L078j885k156L423L04l569J251K834k646j514L755q96
$$ -1835 296 2018 -1144 -1166 1912 27 -2129 1294 1598 -1971 -720 2114 -532 -2046 1709 813
5373H13k963K344J950l312O4L219j874k651L587M75l601J380K923l160j154L431
$$ 813 -2150 194 2144 -1168 -1104 2115 241 -2410 1177 1652 -1949 -569 2354 -806 -1960 1471
5389A471o76l219K155K281l477j66L516k094k312L376R47l707J378L038l036j592
$$ 1471 795 -2424 -269 2012 -1465 -1631 1885 -209 -2521 855 1802 -1905 -527 2511 -525 -2117
5405b117L964o74l319K227K187l254n90L896k081k558L074J196m095J147L417
$$ -2117 1847 1173 -2146 81 2268 -986 -1576 2320 239 -2319 755 1951 -2144 -997 2420
5420B420l298j165L511n22l447K071K557l666k21L773j684k848L330J368m152
$$ 2420 -878 -2043 1468 946 -2501 -430 2127 -1539 -1760 2013 329 -2519 811 2179 -1973
5435a973J453L233k951j600M074n72l754K261K418l798m96M060j911k935L540
$$ -1973 -520 2713 -238 -1838 2236 1664 -2090 171 2589 -1209 -1705 2355 444 -2491 1049
5450A049J042m252J449L309l072j546L982o86l635K221K586l838m51M255j721
$$ 1049 2091 -2161 -712 2597 -475 -2021 1961 1275 -2360 -139 2447 -1391 -1842 2413 692
5465F92l477L910Q94m033R69L708l394j535M100m38l728K284K428m045l67M322
$$ 692 -2785 1125 2019 -2014 -1045 2663 -731 -2266 1834 1396 -2332 -48 2380 -1665 -2032 2290
5481B290k068l121L873R62m436J572L764l514j930M585q10m497L264K438m215
$$ 2290 222 -2899 974 1936 -2500 -928 2836 -678 -2608 1977 1167 -3330 -66 2372 -1843
5496a843k55M509k136l351M099Q90m284J337L993l711j729M096k68l977K887K669
$$ -1843 -2098 2411 275 -3076 1023 1913 -2371 -1034 2959 -752 -2481 1615 1347 -2630 257 2926
5512B926m241m79M556j854l309L890R85m186J025L789l446j812M434q42m061K911
$$ 2926 -1315 -1794 2762 908 -2401 1489 2474 -1712 -687 3102 -344 -2156 2278 1436 -2625 286
5528B86K415m305k30M334k254k980M151O40m263J354L781l584k046M903p39m221
$$ 286 2701 -1604 -1834 2500 246 -2734 1417 2057 -2206 -852 2929 -655 -2701 2202 1463 -2758
5544b758L107K569m300m9M346k338l118M140N76m624J707L581l814j559M253n91
$$ -2758 349 2918 -1382 -1431 2915 577 -2541 1599 2175 -2449 -742 2839 -975 -2534 1719 1128
5560A128m252L101K307m448L70M039k136l220L732J041m222J747L614l902j484
$$ 1128 -3124 -23 2284 -2164 -1794 2245 109 -3111 621 1662 -2560 -813 2801 -1101 -2585
5575b585M687q17l975K969K417m415K77L904k339k669L825P19m856K209L335l822
$$ -2585 2102 1285 -2690 279 2696 -1719 -1442 2462 123 -2546 1279 1998 -2858 -649 2686 -1136
5591a136j182M187p96m204L465K308m414J84M175k461k873M003J050m818J846
$$ -1136 -2318 1869 1073 -3131 334 2642 -1772 -1588 2587 126 -2747 1256 2306 -2512 -666
5606f66L560l561j708M384o46m119L089K285m208o4M561k423l182L947Q94m456
$$ -666 2894 -667 -2375 2009 1363 -2756 333 2618 -1590 -1654 2907 484 -2698 1249 2143 -2313
5622b313J866L389l674j387M466p67m066L351K187m433q1M345k515k976M032O49
$$ -2313 -447 2942 -732 -2119 2347 1580 -2486 865 3052 -1381 -1462 2883 368 -2608 1424 2073
5638B073m525J737L482l770j756M591o67m183L045K274m284K56M329k629l249
$$ 2073 -2452 -715 2767 -1003 -2759 1832 1165 -3018 27 2301 -1983 -1727 2602 -27 -3276
5653c276M440Q69m326J341L745l621j721M791j025m054L175K383m636L08M144
$$ -3276 1164 2033 -2293 -952 2793 -828 -2549 2242 1217 -2837 338 2721 -1915 -1607 2537
5668B537k600l126M472O64m782K087L442l728j652M931p38m471L360K511m556
$$ 2537 -63 -3189 1283 1947 -2835 -748 2694 -1034 -2686 2245 1507 -2964 396 2907 -1649
5683a649j61M658k567k797M298M38n009K224L740m122j401M846r58m350L180K464
$$ -1649 -1810 2848 281 -2516 1782 2220 -2789 -565 3175 -947 -2348 2498 1540 -2810 370 2834
5699B834m887K04M632k818k920M059R41m827K300L190l598j528M811j118m077
$$ 2834 -2053 -1849 2783 -35 -2955 1104 2045 -2782 -482 2708 -890 -2418 2393 1275 -2802
5714b802L423K056m864O05M344k949k861M597K44m505K423L011l823j152M427
$$ -2802 621 2677 -2187 -1582 2762 -187 -3048 1549 1793 -2712 -289 2722 -1101 -2253 2174
5729B174j455l752L449J813m397P57M177k758k781M524L14m690K027L530m102
$$ 2174 719 -3033 416 2229 -2168 -1411 2766 8 -2773 1751 2065 -2625 -598 2932 -1170
5744a170q32M510j649l502L295J949m539O75M257l044k595M261J48m227K093L160
$$ -1170 -2002 2508 859 -2643 652 2601 -1938 -1263 2994 -50 -2645 1616 1764 -2463 -370 2790
5760B790m106o84M413j996l088L464J683m364N62L965k913k450M299J28l941K035
$$ 2790 -1316 -2000 2413 417 -2671 793 2476 -1888 -1326 2639 -274 -2724 1575 1703 -2238 -203
5776b03K847l287j190M191j369l439L348J470m225Q21L667k740k071L774j88l648
$$ -203 2644 -643 -1833 2358 989 -2450 898 2368 -1857 -1036 2631 -109 -2180 1594 1406 -2242
5792b242J684L005l613r80M034j406l095K826J874m111N68L642k790j834L782
$$ -2242 -558 2447 -1166 -2146 1888 482 -2613 213 2087 -2024 -1456 2186 -604 -2438 1344
5807A344J96m076K034K943l432q99L916j415l237L073J521l487K61L311k264k063
$$ 1344 1540 -2536 -502 2441 -991 -1890 2026 611 -2626 447 1968 -1519 -1258 2053 -211 -2274
5823b274L159O27l807J775K641l220o46L489r26l310K658J733l569M00L412k354
$$ -2274 885 1512 -2295 -520 2121 -1099 -1745 1744 818 -2492 166 1899 -1670 -1270 2142 -212
5839b12k043L337P50l706J558K649k924j091L737j048l229K792J741l559K38L179
$$ -212 -2255 1082 1832 -1874 -316 2333 -591 -1682 2055 1007 -2222 570 2311 -1248 -1010 2169
5855B169k068k089L423M59l988J567K735k973j209L555p39l318K763K112l913
$$ 2169 101 -1988 1435 1894 -2094 -527 2208 -765 -1974 1581 842 -2476 287 2399 -1514
5870a514J92L390j766k516L345P21l514J390K705k801j476L824q13l433L121J185
$$ -1514 -1322 2068 302 -2214 1131 1852 -1662 -272 2433 -368 -1844 1980 1167 -2266 855 2040
5886B040l197j4L575k657k183L298O90l876J434L032k965j031L243q44l122K699
$$ 2040 -1157 -1171 2404 -253 -2436 862 1552 -2324 -890 2142 -823 -1854 1389 545 -2577 122
5902A22J846l684R9L379k183k154L476O96l748J422K798k785j096L358r19l320
$$ 122 1968 -1716 -1617 1762 -421 -2575 901 1597 -2151 -729 2069 -716 -1812 1546 627 -2693
5918b693K741J836l484K68L476k286j987L225M07l532J767K355k784q40L443p54
$$ -2693 48 1884 -1600 -1332 2144 -142 -2129 1096 1503 -2029 -262 2093 -691 -1531 1912 1158
5934A158k974K396J596l423N33K963j935k105L538J9l335J255K677k841j134L368
$$ 1158 -1816 580 2176 -1247 -714 2249 314 -1791 1747 1766 -1569 -314 2363 -478 -1612 1756
5950A756q87k817K424J515l337K11L304j989k102L037L90k971R38K604k767p87
$$ 1756 869 -1948 476 1991 -1346 -1135 2169 180 -1922 1115 1505 -1466 -528 2076 -691 -1478
5966a478L345p42l026K482J156l286N11K518j668j566K449K86k893J121K047k465
$$ -1478 1867 1125 -1901 581 1737 -1549 -1038 1480 -188 -1754 695 981 -1912 -791 1256 -1209
5982a209j049L264m29k850K040J618k805J89K596j319j861K508O01k668Q22K280
$$ -1209 -2258 1006 577 -2273 -233 1385 -1420 -1231 1365 46 -1815 693 1294 -1374 -552 1728
5998A728k169j022K733n53k185J601J576k544k08K614j199k058K162O98k508P32
$$ 1728 -441 -1463 1270 717 -1468 133 1709 -835 -1043 1571 372 -1686 476 1174 -1334 -602
6014f02K365k205j326K922l31k223J284J681k431j68K636r74k278K369J040k787
$$ -602 1763 -442 -1768 1154 823 -1400 -116 1565 -866 -1034 1602 628 -1650 719 1759 -1028
6030a028K30K665j996j345K478J48k809J654J821k584l37K507o60k607K328R38
$$ -1028 -798 1867 -129 -1474 1004 1152 -1657 -3 1818 -766 -1103 1404 744 -1863 465 1403
6046A403k817M94K629j913j630L005J10k887J468K043k640n96K893j025k344K296
$$ 1403 -1414 -920 1709 -204 -1834 1171 1281 -1606 -138 1905 -735 -1331 1562 537 -1807 489
6062D89J290k860L35K468j507k056K695O13l491J543K287k400q21K790q21k477
$$ 489 1779 -1081 -746 1722 215 -1841 854 1467 -2024 -481 1806 -594 -1415 1375 554 -1923
6078a923K133J358k848j38L198j770j937K667K43k740J035K400k351r97L264r22
$$ -1923 210 1568 -1280 -1418 1780 10 -1927 740 983 -1757 -722 1678 -673 -1670 1594 672
6094F72k518K562Q12k722J27L211j955k191L169L71l119J298K513k837p36K947
$$ 672 -1846 716 1528 -1194 -1067 2144 189 -2002 1167 1538 -1581 -283 2230 -607 -1343 1604
6110A604p06k713K354J488l383N71K937k003j945K714K10k596J219K072k672n11
$$ 1604 898 -1815 539 2027 -1356 -785 2152 149 -1796 918 1128 -1468 -249 1823 -849 -1360
6126a360K787n97k893K379J569l261L63L022j722k324K924L18k857J224K215k673
$$ -1360 1427 830 -2063 316 1885 -1376 -1013 2009 287 -2037 887 1205 -1652 -428 1787 -886
6142h86p24K928p78k722K535J107l171M97K943j841j807K903J76k855J314K306
$$ -886 -1610 1318 540 -2182 353 1460 -1711 -1214 1729 -112 -1919 984 1160 -1695 -381 1925
6158A925k501p81K947q05k494K159J359k961J75K986k105j408K380L08l039J172
$$ 1925 -576 -1357 1590 785 -1709 450 1809 -1152 -977 2009 -96 -1504 876 1184 -1855 -683
6174f83K611k397j138K954p74k457K132J064k289l02K895j593k097K870P53l185
$$ -683 1928 -469 -1607 1347 573 -1884 248 1312 -977 -1279 1616 23 -2074 796 1549 -1636
6190a636J005K336k112r85L080p43k724K084J490k754l70L245j884k026K787N99
$$ -1636 -631 1705 -407 -1392 1688 945 -1779 305 1795 -959 -1329 1916 32 -1994 793 1392
6206A392k926P96K697k159j447K794l53k545J890J679k717o7K894j715j942K375
$$ 1392 -1534 -738 1959 -200 -1647 1147 794 -1751 139 1818 -899 -966 1928 213 -1729 646
6222F46R35l123Q95K348j987j298K411q9k506J824J646k636l98L170j709k205
$$ 646 1581 -1542 -647 1701 -286 -1584 827 738 -1768 56 1702 -934 -1332 1838 129 -2076
6238b076K715J011l525Q37K757k317j454L090l15k655J978J851k809m82K989j178
$$ -2076 639 1650 -1875 -1038 1719 -598 -2052 1038 723 -1932 46 1897 -912 -1394 1595 417
6254D17k486K716J107l243Q57K644k326j263L286o69k811K063J944l306j20L241
$$ 417 -2069 647 1754 -1489 -632 2012 -314 -1577 1709 1040 -1771 292 2236 -1070 -1190 2051
6270B051j596k535K966Q88l481J201K679k492j615L366l80l285K318J811l160
$$ 2051 455 -2080 886 1774 -1707 -506 2173 -319 -1934 1432 1052 -2233 85 1896 -1264
6285a264j27L371j672k730L351P70l456J150K637k546j299L374n73l194K381K015
$$ -1264 -1391 1980 308 -2422 929 1699 -1757 -607 2030 -516 -1815 1559 986 -2208 173 2188
6301B188l499j97L402j860k007K815K71l130J013K922k740j134L453o03k973K230
$$ 2188 -1311 -1508 1894 34 -1973 842 1113 -2017 -1004 1918 -822 -1956 1497 894 -2079 151
6317A51J884l541J01L437k271j803K955O41l507J399K634k768j228L557q52l213
$$ 151 2035 -1506 -1405 2032 -239 -2042 913 1554 -1953 -554 2080 -688 -1916 1641 789 -2424
6333b424K539J619l258M61K797j755k207L084N71l326J382K510k294j017L216
$$ -2424 115 1734 -1524 -1063 1734 -21 -2228 856 1427 -1899 -517 1993 -301 -1318 1898
6348A898q83k886K771J155l179M82L104k190j690K534M01l250J605K114k575q90
$$ 1898 1015 -1871 900 2055 -1124 -642 2462 272 -1418 1116 1517 -1733 -128 1986 -589 -1479
6364a479K979n81k751K167J386l039L27K958k100j619K975L09l232J822J899k474
$$ -1479 1500 919 -1832 335 1721 -1318 -991 1967 -133 -1752 1223 1532 -1700 122 2021 -453
6380d53q67L168q42k806K355J121k872M28K534j986k088L205J34l165J431K280
$$ -453 -1320 1848 1006 -1800 555 1676 -1196 -768 1766 -220 -2308 897 1031 -2134 -703 1577
6396A577k870o45K842q81k130J734J371k359J81K625j805j572L026R8k783J203
$$ 1577 -1293 -1938 904 23 -2107 -373 998 -1361 -1180 1445 -360 -1932 1094 1192 -1591 -388
6412c88K465k650j009L003o38k340J974J455k855J78K572j779j879K739O12l234
$$ -388 2077 -573 -1582 1421 783 -1557 417 1872 -983 -805 1767 -12 -1891 848 1460 -1774
6428a774J459J748k041j052L034m98k690K070J410k572J22K787j770j753K814
$$ -1774 -315 1433 -608 -1660 1374 876 -1814 256 1666 -906 -784 2003 233 -1520 1294
6443A294L01k640R40K350k424j137K965q00k497K079J489k865o4K705j782j851
$$ 1294 1595 -1045 -105 2245 -179 -1316 1649 849 -1648 431 1920 -945 -1009 1696 -86 -1937
6459a937K683M30l049J241K402k612p64K832n80k547K134J432k759N39K308j625
$$ -1937 746 1176 -1873 -632 1770 -842 -1606 1226 646 -1901 233 1665 -1094 -555 1753 128
6475A28j860K763K66k960J293K406k503j078L393j284k398J976J572l141K65K645
$$ 128 -1732 1031 1297 -1663 -370 2036 -467 -1545 1848 564 -1834 142 1714 -1427 -1162 1483
6491A483j623j773K717k16k465J733J838k659n76K703q37k025J975J215k622K73
$$ 1483 -140 -1913 804 588 -1877 -144 1694 -965 -1541 1162 325 -1700 275 1490 -1132 -859
6507h59K709k155j316K689j37k558J158K256k908l17K782r39k402K521Q86k966
$$ -859 1850 -305 -1621 1068 931 -1627 -469 1787 -1121 -1438 1344 405 -1997 524 1410 -1556
6523a556P25K595k156j316K919l07k318J623J801k782k35K522r91k017K275R23
$$ -1556 -831 1764 -392 -1708 1211 904 -1414 209 2010 -772 -1007 1515 524 -1493 782 1705
6539A705k534N84K150j883j283K586o40k090J561J582k462m41K922j469j783K252
$$ 1705 -829 -245 1905 22 -1261 1325 685 -1405 156 1738 -724 -1165 1757 288 -1495 757
6555G57L94k322N81K315k164q52K235j68k282J692J319k234K7K029q91k108K145
$$ 757 1151 -1171 -590 1725 -439 -1291 944 776 -1506 186 1505 -729 -702 1327 436 -1672 473
6572D73N86k003M53K047k016p51J949k29j969J430J162k090k47K010p07j474J737
$$ 473 1059 -944 -491 1556 -460 -1211 738 509 -1460 -30 1132 -958 -1205 805 98 -1376 361
6589C61N13k160P42J964j505j197K443n89k009J753J188k072m78K319j018j394
$$ 361 874 -1286 -544 1420 -85 -1282 1161 572 -1437 316 1504 -568 -1046 1273 255 -1139
6605a139J333O76k104O54J458j217j061K185r4j784R62J078j663m29K207p82j407
$$ -1139 194 870 -1234 -580 878 -339 -1400 785 691 -1093 -131 947 -716 -1145 1062 280 -1127
6622a127J505O78k131P05J520j219r08K087m36j581J181P77j726k46K006r91j357
$$ -1127 378 1056 -1075 -370 1150 -69 -977 1110 674 -907 274 1051 -675 -921 1085 94 -1263
6639a263J567O17j831N94J475j199q48J697l0j983J297J314j694m43J704p67j337
$$ -1263 304 921 -910 -316 1159 -40 -888 809 779 -1204 93 1407 -287 -730 974 207 -1130
6656a130J379O07j504n1J828j106j081J653L36k027J134J128j940j48J950j134
$$ -1130 249 856 -648 -699 1129 23 -1058 595 931 -1096 38 1166 -774 -922 1028 -106
6672a06j083J610M35j938N46J070n90q04J688k42j518J285R97j925K2J784q62
$$ -106 -1189 421 856 -1082 -536 534 -56 -860 828 586 -932 353 1350 -575 -553 1231 369
6689C69j057J400M84k012P85J231j159q10J496j6j515Q16J259j761lJ467m75j364
$$ 369 -688 712 1196 -816 -31 1200 41 -769 727 711 -804 12 1271 -490 -493 974 499 -865
6707h65J409K29j114k20J512j076p76J836l58j608Q88J033j333m37J500l84j115
$$ -865 544 773 -341 -561 951 -125 -901 935 577 -1031 -143 890 -443 -880 620 236 -879
6724h79Q98O27j423L47J184j215q91J503M8j245P60J158j633O7J292m72j453J535
$$ -879 19 646 -777 -430 754 -461 -1352 151 199 -1046 -286 872 -761 -694 598 126 -1327 208
6742B08N34j314q0J597r39q18J651k04j336O43R81j211k36J216m02j165J345L68
$$ 208 742 -572 -652 945 6 -812 839 635 -701 -58 923 -288 -524 692 290 -875 470 838
6760H38j469J15J483j133n13J082J77j265J110M52j064J05P98k09j231J233L94
$$ 838 -631 -516 967 -166 -679 403 580 -685 425 877 -187 -82 716 507 -724 509 903
6777I03j050K75J021j205m98J259j94q39M81Q76j136k31R67k58p81O86M98j324
$$ 903 -147 128 1149 -56 -554 705 511 -328 153 1029 -107 -338 629 371 -410 276 774 -550
6795e50K16R35n25n89J238j12j293O11Q34r29m15J293p17o80Q31L04j267K34J141
$$ -550 -334 601 76 -513 725 613 -680 -69 765 -164 -579 714 -3 -683 148 452 -815 -581 560
6814E60r42p76J439q0r31K54P61r69p2J190n29p20O57O28j012M9J103o10q64J356
$$ 560 -382 -1158 281 201 -730 -476 285 -684 -756 434 -95 -815 -158 470 -542 -493 610 0 -864 492
6834D92J18j158K51Q64o09p03J182m11q55O76R51j278l06J627r72n37R92K86j106
$$ 492 610 -548 -297 567 -42 -745 437 26 -829 -153 798 -480 -786 841 -131 -668 324 610 -496
6853d96L05J183r70k76Q22j04o90P12O52j105r1J215o53j068J161K14j114L66
$$ -496 -191 992 22 -254 568 464 -226 486 1138 33 -58 1157 504 -564 597 811 -303 63
6871F3R76j221n67J340j51j329R71Q17j303j69J393o88q57J067O75j508K25J190
$$ 63 1039 -182 -749 591 440 -889 82 899 -404 -573 820 132 -725 342 1017 -491 -266 924
6889I24r87o12J205l42j005Q43O35j111k33J166m01j134R76M92j164K30J203j113
$$ 924 -63 -675 530 188 -817 26 661 -450 -683 483 82 -1052 -76 416 -748 -518 685 -428
6907d28m22J164j80j246R51P43j069k11J506r10q31J057P84j639M30Q82o87m85
$$ -428 -850 314 134 -1112 -161 582 -487 -698 808 -102 -933 124 908 -731 -301 581 -106 -591
6925e91R50m3j416J059O24j292M9J184o17j144J078N27j336P65Q18j062k74J174
$$ -591 359 316 -1100 -41 583 -709 -660 524 -93 -1237 -159 368 -968 -203 615 -447 -721 453
6943D53L4j348R04P92j507L17R81k89j201J200O13j452M36J000r11o63J341r3
$$ 453 487 -861 43 835 -672 -355 626 337 -864 336 949 -503 -67 933 22 -641 700 607
6961F07j252Q24R08j583J78J459r57j068J553J61j296N62R35r43p21J543k52j359
$$ 607 -645 179 1087 -496 -318 1141 184 -884 669 830 -466 96 1031 88 -633 910 658 -701
6979g01J039Q44j585j63J536p58j205J520K57j887Q22J053j205k84J219l89j013
$$ -701 338 1182 -403 -566 970 212 -993 527 784 -1103 -281 772 -433 -717 502 113 -900
6996i00Q75N05j167N8J325n85j223J118M08j225N09J256j424l34J383n32p74Q08
$$ -900 -25 480 -687 -629 696 111 -1112 6 414 -811 -302 954 -470 -804 579 47 -727 81
7014H1O03j731N43J263o21r89J074J96j158K94J411j389l66J240k47j028Q36R21
$$ 81 684 -1047 -504 759 138 -851 223 419 -739 -445 966 -423 -789 451 204 -824 12 933
7032I33j608K44J317q63r37J343J32j263P59J107j472k92J564o00j035J088O03
$$ 933 -675 -431 886 23 -914 429 561 -702 57 1164 -308 -600 964 364 -671 417 1020
7049A020j669L7J505q96r77J441Q7j649Q71J040j343MJ015m03p02O29O51j213
$$ 1020 -649 -612 893 -3 -980 461 548 -1101 -230 810 -533 -529 486 83 -619 10 661 -552
7067e52j74J933j150q59J322Q9j346O46J269j622l56J569o46j185J142O07j632
$$ -552 -726 1207 57 -802 520 609 -737 -91 1178 -444 -800 769 123 -1062 80 687 -945
7084i45K39J646j132q46J486m1j352O57R57j304j15J419m58j258J196Q11j549
$$ -945 -706 940 -192 -1038 448 407 -945 -288 669 -635 -750 669 211 -1047 149 960 -589
7101e89M52J115r34q15K067p22j065P46J081j552m91J589m52j403J572L36k114
$$ -589 -137 978 44 -771 1296 574 -491 255 1336 -216 -707 882 430 -973 599 935 -1179
7118a179O11J399j120q12J810l24j339J078R79j516j03J512j025o85J506j5j598
$$ -1179 -568 831 -289 -1101 709 385 -954 124 1103 -413 -516 996 -29 -714 792 777 -821
7135h21L48J548j306q24J963n30j438Q86P42j249l43J768q04j110J387L12j590
$$ -821 -473 1075 -231 -1055 908 378 -1060 -174 568 -681 -1024 744 -60 -1170 217 529 -1061
7152a061M22J315j210o81K131m75j725J622N69j504J01J464o57j213J530J12j443
$$ -1061 -639 676 -534 -1215 916 441 -1284 338 907 -597 -496 968 311 -902 628 740 -703
7169g03M93J332j512o61J951l71j700J477Q13j493k51J558r28p42J435N7j534
$$ -703 -210 1122 -390 -1051 900 529 -1171 306 1119 -374 -625 933 5 -737 698 755 -779
7186g79J068J051j554l24J619n44j436J768L72k069N74J604j042j196J677Pj782
$$ -779 289 1340 -214 -538 1081 537 -899 869 1241 -828 -254 1350 308 -888 789 796 -986
7203i86R99J272j801m15J614m60j636J627P84j858M16J278j006r29K148m48j305
$$ -986 13 1285 -516 -931 683 223 -1413 214 998 -860 -444 834 -172 -1101 1047 599 -706
7220g06O94J062j582k30J684q37j210J172O80j823O38J473j324o98J606j73j815
$$ -706 -12 1050 -532 -762 922 85 -1125 47 727 -1096 -458 1015 -309 -1007 599 426 -1389
7237a389R85J150j364l19J394n41j276J616M22j486M33J543j292o35J473j88j352
$$ -1389 -404 746 -618 -937 457 -84 -1360 256 678 -808 -375 1168 -124 -759 714 526 -826
7254h26R54O37j402l36J834q60j093J357M40j578K74J469j597j06J428J9j487
$$ -826 128 765 -637 -973 861 1 -1092 265 705 -873 -599 870 -727 -833 595 614 -873
7271h73J234N57j382N2J961j372r26J432M78j931O65J047j050n00J720l89j365
$$ -873 361 918 -464 -412 1549 177 -749 683 1161 -770 -105 942 -108 -608 1112 723 -642
7288f42Q48O86j649R9J553p24j235J348M61j435N92J082j300l46J616l43j445
$$ -642 206 892 -757 -658 895 171 -1064 284 745 -690 -98 984 -316 -662 954 611 -834
7305h34R92Q09j441j38J660r11j061J413J46j804Q20J192j118p15J630n69j296
$$ -834 158 967 -474 -612 1048 137 -924 489 635 -1169 -349 843 -275 -990 640 71 -1225
7322a225J110P53j477J51J466p62j456J858K80j618N07J407j259m14J580n52j591
$$ -1225 -115 638 -839 -688 778 16 -1440 418 698 -920 -413 994 -265 -679 901 349 -1242
7339a242J454O73j548r9J683r83j158J760J98j652Q03R95j320m40J492m14j390
$$ -1242 212 885 -663 -762 921 -62 -1220 540 738 -914 -111 884 -436 -876 616 202 -1188
7356a188J435P45j691K97J452j060q29J723r9j684R25J257j720l68J835p03j543
$$ -1188 247 992 -699 -402 1050 -10 -839 884 785 -899 26 1283 -437 -805 1030 327 -1216
7373a216J513N59j552L13J494j516p46J891P0j798Q25J229j472m24J728o26j177
$$ -1216 297 856 -696 -383 1111 -405 -1151 740 810 -988 -163 1066 -406 -830 898 272 -905
7390i05J422L61j702O84J152j029p68J710j83j805J233J136j833n9J491q71j065
$$ -905 517 878 -824 -140 1012 -17 -785 925 742 -1063 170 1306 -527 -586 905 34 -1031
7407a031J170O21j490L21J550j496o96J667j89j447J181P52j281k34J496o62j346
$$ -1031 139 760 -730 -409 1141 -355 -1051 616 427 -1020 161 913 -368 -602 894 232 -1114
7424a114J640J68j588P64J299j633k48J197k62j120R29O49j257N6J264p90r27
$$ -1114 526 694 -894 -130 1169 -464 -712 485 223 -897 32 681 -576 -520 744 -46 -973
7441i73J396K4j404N31J365j647J34J495n99j143J105M90j213J81J036l60r10
$$ -973 423 447 -957 -426 939 -708 -574 921 322 -821 284 774 -439 -258 778 418 -492
7458d92R46K56j401N91P08r43j41J321k86j622J137M44j212K77J175p32r36J338
$$ -492 454 710 -691 -100 608 -335 -476 845 559 -1063 74 518 -694 -417 758 26 -910 428
7476D28k11j077N48J255j411l06J540n22q92N86Q41j380M42R40o15j342J583L51
$$ 428 217 -860 -312 943 -468 -774 766 244 -648 -62 779 -601 -159 781 166 -1176 407 758
7494G58j434N66P46j166r2J185m30j080Q63O72j320N48Q35p63p52J237K71j346
$$ 758 -676 -110 636 -530 -622 563 133 -947 -84 588 -732 -184 651 -112 -864 373 644 -702
7512g02L78J148q24o97J324l35j033R64N68j107L0J046m66q67Q53K50j121M50
$$ -702 -324 824 0 -697 627 292 -741 223 791 -316 -286 760 294 -573 280 530 -591 -141
7530a41P60n44o56J010j71j050N83J244j476j44J271o97q09J044M82j461M13J113
$$ -141 619 75 -581 429 258 -792 -209 1035 -441 -585 686 -11 -820 224 706 -755 -342 771
7548G71p69o43J053j38r72R57M79j093o3J227m79j235J078L45j318M50R65r15
$$ 771 2 -641 412 274 -698 259 738 -355 -418 809 330 -905 173 518 -800 -350 615 -300
7566c00l68J044j12j208Q69P31j350K01J203q54o83J462L46j491K49J189r69n32
$$ -300 -668 376 264 -944 -75 656 -694 -493 710 -144 -827 635 981 -510 -261 928 -41 -573
7584e73J190p3j365J068N72j518L26J129n98r72J273K78j412N47R41j010k71J069
$$ -573 617 544 -821 247 819 -699 -373 756 158 -814 459 737 -675 -128 813 -197 -468 601
7602F01k70r71R62N66j320J50J053l41j224J109M20j163M62R05j143m79J404n28
$$ 601 331 -640 322 888 -432 -282 771 430 -794 315 735 -428 34 939 -204 -683 721 193
7620A93r75N76Q03j201J82J105m65r63O91P71j638O67Q56j079p6J050k84r81Q66
$$ 193 -782 -206 597 -604 -422 683 218 -745 -54 717 -921 -254 602 -477 -553 497 213 -768 98
7639I8N99j284j4J019l90q12J030J04j076L96Q41p70m78J047k08r68Q55N12j082
$$ 98 697 -587 -601 418 28 -784 246 350 -726 -330 511 -259 -737 310 102 -866 -11 501 -581
7658e81Q8J242o58q10P35K34q58L34Q49o05n07R81j31j062R63M28p84l16R81l33
$$ -581 -493 749 91 -719 16 250 -608 -274 575 -30 -537 444 313 -749 214 642 -142 -458 523 190
7678A90r37P38M52r77j26J434r69l69J024j27r70M47P10q58N5R70m56p54P43M56
$$ 190 -747 -9 443 -534 -660 774 -195 -564 460 333 -637 -190 520 -338 -283 687 231 -523 220 676
7698F76j034K52Q63o23q62J246k73q82M88P56q74m25J271l97j020Q45O81j050
$$ 676 -358 -106 757 134 -728 518 245 -637 -149 607 -267 -692 579 182 -838 7 688 -362
7716c62J15J142r91n87J158j68q09K56J083r94n46J223m41q18O63Q23r23n35J462
$$ -362 -247 895 -96 -683 475 307 -502 -246 837 -157 -703 520 79 -739 -76 747 -176 -711 751
7735G51o91p89R78M95j309M06Q45j240k42J408n14q69J015N95j448J82J207p64
$$ 751 60 -729 249 744 -565 -159 686 -554 -796 612 98 -771 244 839 -609 -427 780 16
7753A6p59J360l20j174P18J141j262m24J325m57r94J031L58j235K2J546o65j104
$$ 16 -743 617 297 -877 -159 982 -280 -704 621 164 -830 201 559 -676 -654 892 227 -877
7771h77J450n8j214M68J302j310m81J706m97j328J328M38j474K09J267j088q13
$$ -877 573 515 -699 -231 1071 -239 -720 986 489 -839 489 927 -547 -338 929 -159 -972
7788i72J658J30j770O92J243j163m13J119o1j503J014P86j553J45J468p53j010
$$ -972 686 816 -954 -262 981 -182 -595 524 463 -1040 -26 760 -793 -648 820 67 -943
7805i43J398L3j252Q46R20j306k60J385n05j131J053N92j472J77J241j077n88
$$ -943 455 488 -764 82 1002 -304 -564 821 316 -815 238 830 -642 -465 776 -301 -889
7822h89J261Jj558R18J128j654k19J716m90j173J075P22j677L97J444j155o18
$$ -889 372 373 -1185 -267 861 -793 -1012 704 214 -959 116 838 -839 -442 1002 -153 -771
7839g71J509K33j761O46J020j106j78J071k43j327J055N66j405J48J391r04j064
$$ -771 738 971 -790 -144 876 -230 -408 663 420 -907 148 714 -691 -543 848 -56 -1120
7856a120J528P7j384Q30J057j130n52J386l98j305R45J000j456Q9J361r42q39
$$ -1120 408 485 -899 -69 988 -142 -694 692 294 -1011 -66 934 -522 -433 928 -14 -853
7873h53J358K14j417O40J470j802k90J540n54j160R17J064j807q8J601o35j192
$$ -853 505 719 -698 -58 1412 -390 -680 860 306 -854 63 1127 -680 -768 833 198 -994
7890i94J532K21j688P88J235j483m93J540m98j547J475R50j702J95J494r69j194
$$ -994 538 759 -929 -141 1094 -389 -882 658 160 -1387 88 1038 -664 -469 1025 56 -1138
7907a138J563O10j729N35J202j448n97J686l17j273Q63Q15j615L05J815j126j327
$$ -1138 425 1035 -694 -159 1043 -405 -1002 684 367 -906 -43 772 -843 -538 1277 151 -1176
7924a176J517K44j523O44J214j459l53J738m85j767J410J154j881L54J644j330
$$ -1176 341 585 -938 -294 920 -539 -892 846 361 -1406 4 1158 -723 -369 1275 -55
7940e5j308K231n0j867R29J278j346o00J987q55j781J833N79j668O9J887j351
$$ -55 -1363 868 818 -1049 -120 1158 -188 -788 1199 344 -1437 396 975 -693 -624 1263 -88
7957h8q99J620J97k011J056J292j796m48K025n82j462J341P04j711J61K078j487
$$ -88 -987 633 830 -1181 -125 1167 -629 -1077 948 366 -1096 245 949 -762 -601 1477 -10
7974a0j210J839J63j937J000J184j269j040K446j022j440J753K81j726L10J719
$$ -10 -1220 619 782 -1155 -155 1029 -240 -1280 1166 144 -1296 457 738 -988 -678 1041
7990A041j264j242K183J20k079J214J370j911l59K146q64j672J987M03j980M39
$$ 1041 -223 -1465 718 838 -1241 -27 1343 -568 -927 1219 355 -1317 670 1073 -907 -468
8006d68J715j409j016J851M3j749P10J175j425l63K131j084j468J782O75k210
$$ -468 1247 -162 -1178 673 716 -1033 -323 852 -573 -936 1195 111 -1357 425 1100 -1110
8022a110O02J733j353q95K042l24j875J261J342k089J46J586p00j431J614L44
$$ -1110 -508 1225 -128 -1023 1019 695 -1180 81 1423 -666 -520 1066 366 -1065 549 893
8038H93j936P59J444j311j022J878M8j835J262J241k248L1J918j057j568J868
$$ 893 -1043 -284 1160 -151 -1173 705 753 -1082 180 1421 -827 -796 1122 65 -1503 365
8054C65O58j913M12J533j125r67J955q6j956J202R88j682k56K045r14j507J510
$$ 365 1023 -890 -478 1055 -70 -1037 918 832 -1124 78 1066 -616 -872 1173 259 -1248 262
8071B62M71j768L42J701j161r51J995k94j637R72J301k079n1J876q80j362J863
$$ 262 733 -1035 -693 1008 -153 -1104 891 597 -1040 -68 1233 -846 -897 979 99 -1263 600
8088F00L53j854O59J599j884n12K014k52j948J309Q58j449j50J636q22j103J541
$$ 600 953 -901 -242 1357 -527 -1039 975 723 -1225 84 942 -507 -657 979 157 -946 595
8105E95K97j574K96J780j700q32J832j18j915J707P65j749k57J838q34j103J260
$$ 595 892 -682 -386 1394 -306 -1138 694 576 -1339 368 1133 -616 -873 965 131 -972 288
8122B88N07j814R71J238j546q53K019k48j897J193J415k167K52J795j039j352
$$ 288 795 -1019 -48 1190 -356 -1209 810 562 -1335 -142 1273 -894 -642 1153 114 -1238
8138a238J686M11j741M24J726j684m85J487j8j701J206J105j872j72K003j052
$$ -1238 448 859 -882 -458 1268 -416 -901 586 568 -1133 73 1178 -694 -866 1137 85
8154H5j506J996K79k031Q78J674j546r09J663J28j847J199J036j761J2J930r93
$$ 85 -1421 575 854 -1177 -299 1375 -171 -1080 583 711 -1136 63 1099 -662 -650 1280 287
8171B87j367J419P75k119M82J664j568r58K093k60j551J252J041k026N0J855j046
$$ 287 -1080 339 1114 -1005 -523 1141 -427 -1385 708 448 -1103 149 1190 -836 -786 1069 23
8188B3j434J955K88
$$ 23 -1411 544 832
8191H32
$$ Imaginary data points
##PAGE= N=2
##DATA TABLE= (X++(I..I)), XYDATA
0@%%%%%%%%QqQj6J6j7K5l2M0n3O9q3R5j14J38j66J94k26K64l09L58m12M73n41
$$ 0 0 0 0 0 0 0 0 0 8 0 8 -8 8 -9 16 -16 24 -29 40 -43 52 -62 76 -90 104 -122 142 -167 191 -221 252 -289
32b89O19p04P96q97J011j139J277j426J589j769J969k185K417k672K953l262L599
$$ -289 330 -374 422 -475 536 -603 674 -752 837 -932 1037 -1148 1269 -1403 1550 -1712 1887
49A887l964M364m807N297n841O445p118P879q745R736j0887J2245j3873J5865
$$ 1887 -2077 2287 -2520 2777 -3064 3381 -3737 4142 -4603 5133 -5754 6491 -7382 8483
63H483j8368K1626k6072L2549m2990O3545j78221L60973l82491o68970O76698
$$ 8483 -9885 11741 -14331 18218 -24772 38773 -139448 221525 -160966 -829936 -153238
74a53238N9762o93699K51198N39919n17871j01063N71357k50416l54224P30050
$$ -153238 -93476 -787175 -535977 3942 -513929 -614992 -43635 -294051 -648275 81775
84H1775J59545p39277L14344Q19367n00672m71654O47078R3844o26737K43084
$$ 81775 241320 -497957 -183613 635754 135082 -336572 310506 404350 -222387 20697
94B0697L62023n11379r4859M79197l27772l68137N69388Q8717o68037K28984N59717
$$ 20697 382720 -128659 -223518 255679 -72093 -440230 129158 217875 -450162 -221178 338539
105C38539n08542l30857O41234L9464n74357K53806M00629l61346l7905M02700
$$ 338539 -170003 -500860 140374 179838 -394519 -140713 259916 -101430 -139335 263365
115B63365k40403k02721N37852Q685o09356K28397M89006m60642k95907N17299
$$ 263365 22962 -179759 358093 366778 -242578 -14181 474825 14183 -281724 235575
125B35575j1869n02919K15865L04625l55290n1853L60847j77297k04804L70002
$$ 235575 223706 -279213 -63348 241277 -114013 -165866 194981 17684 -187120 182882
135A82882l142m22597K46766L67959m19649k01102N08838J7777m50593J63342
$$ 182882 179740 -242857 3909 371868 -47781 -248883 259955 277732 -172861 -9519
145i519L03242k51791p5276K54663j55911j87682K80491l775l71780J45258K83631
$$ -9519 293723 41932 -33344 221319 65408 -122274 158217 154442 -217338 -72080 211551
156B11551l26233j67962L97353r282l88928J69435L05164k42668j29357K55405
$$ 211551 -114682 -282644 114709 105427 -283501 -114066 191098 -51570 -180927 74478
166G4478m7827j74412J96812L1402k72038J39519K65471k80777j65287L78619
$$ 74478 26651 -147761 49051 80453 -191585 -52066 213405 -67372 -232659 145960
176A45960L7954l68852J16255K85526k31292j50715K56872k9702k27029J57273
$$ 145960 183914 -184938 -68683 216843 -14449 -165164 91708 62006 -165023 -7750
186g750R8986k38816O3772K37242k17238j43837L45177K0380l79022J19917L20170
$$ -7750 91236 -147580 -83808 153434 -63804 -207641 137536 157916 -221106 -101189 218981
197B18981k31541j94293K66409J7505k31213J42619J28147k30896L8380K55515
$$ 218981 -12560 -206853 59556 77061 -154152 -11533 116614 -114282 -75902 179613
207A79613j85468j69308L10486L4689l52238J21890L00023k54387j76466L17832
$$ 179613 -5855 -175163 135323 170012 -182226 -60336 239687 -14700 -191166 126666
217A26666J8526k82229J39519J75387k23611N426K37422j85479j62666L14451
$$ 126666 145192 -137037 2482 177869 -45742 -40316 197106 11627 -151039 163412
227A63412J4661l69497J38366L09396k71718j69800L32507p208k95399J74664
$$ 163412 178073 -191424 -53058 256338 -15380 -185180 147327 140119 -155280 19384
237A9384J80289k67109r411K55712j77171j66359K95386o542l44998J71441K74925
$$ 19384 199673 -67436 -76847 178865 1694 -164665 130721 124179 -220819 -49378 225547
248B25547l10670j37797L58954l7291l12936J80980J71489k63996P648K43066
$$ 225547 -85123 -222920 136034 98743 -214193 -33213 138276 -125720 -118072 124994
258A24994j86798j42092L02028j0246l11656J83670K41989k91518p8460L45436
$$ 124994 -61804 -203896 98132 87886 -223770 -40100 201889 -89629 -168089 177347
268A77347p9866k86782K18526J59398k73857Q041K33338j67618j18590K62524
$$ 177347 97481 -189301 29225 188623 -85234 -77193 156145 -11473 -130063 132461
278A32461m5956k73489J99053J90558l06691n4116L24297j05765k64979K14541
$$ 132461 86505 -186984 12069 202627 -104064 -158180 166117 60352 -204627 9914
$$ [...]
8191h75
##END NTUPLES=NMR FID
##END=
