##TITLE=1H_LR-758-R3-K6-RC4
 CDCl3
 8 sc, 
 28.11.2023
##JCAMPDX= 6.0         $$ Bruker NMR JCAMP-DX V2.0
##DATA TYPE= NMR FID
##DATA CLASS= NTUPLES
##ORIGIN= UXNMR, Bruker Analytische Messtechnik GmbH
##OWNER= root
$$ XWIN-NMR		Version 3.5
$$ Tue Nov 28 16:24:37 2023 Russian Standard Time (UT+4h)  she@DPX200
##.OBSERVE FREQUENCY= 200.1313
##.OBSERVE NUCLEUS= ^1H
##.DELAY= (6, 6)
##.ACQUISITION MODE= SIMULTANEOUS
##.ACQUISITION SCHEME= undefined
##.AVERAGES= 8
##.DIGITISER RES= 18
##SPECTROMETER/DATA SYSTEM= spect
##.PULSE SEQUENCE= zg30
##.SOLVENT NAME= CDCl3
##.SHIFT REFERENCE= (INTERNAL, CDCl3, 0, 15.7039)
##AUDIT TRAIL= $$ (NUMBER, WHEN, WHO, WHERE, WHAT)
$$ ##TITLE= Audit trail, XWIN-NMR		Version 3.5
$$ ##JCAMPDX= 5.01
$$ ##ORIGIN= Bruker BioSpin GmbH
$$ ##OWNER= she
$$ F:/spectra/data/she/nmr/H-F/1/audita.txt
$$ ##AUDIT TRAIL=  $$ (NUMBER, WHEN, WHO, WHERE, WHAT)
(   1,<2023-11-28 16:23:36.20 +0400>,<she>,<DPX200>,
      <created by zg, POWCHK disabled, PULCHK disabled
       configuration hash MD5:
       00 E9 B6 7A A2 85 ED C7 34 08 36 98 17 FE 4E 26
       data hash MD5: 16K
       A2 BC D1 CC 40 48 49 23 69 92 B7 72 24 FC D8 5D>)
$$ ##END=
$$ 
$$ hash MD5
$$ 85 10 12 FD EE 36 94 92 18 80 B6 B6 1F DF 2A 16
##$RELAX= 
##$RELAX= 
##$RELAX= 
##$RELAX= 
##$RELAX= 
##$RELAX= 
$$ Bruker specific parameters
$$ --------------------------
##$DU= <F:/spectra>
##$EXPNO= 1
##$NAME= <H-F>
##$PROCNO= 1
##$TYPE= <nmr>
##$USER= <she>
##$AMP= (0..31)
100 100 100 100 100 100 100 100 100 100 100 100 100 100 100 100 100 100 
100 100 100 100 100 100 100 100 100 100 100 100 100 100 
##$AQSEQ= 0
##$AQ_mod= 1
##$AUNM= <au_zg>
##$AUTOPOS= <>
##$BF1= 200.13
##$BF2= 200.13
##$BF3= 200.13
##$BF4= 200.13
##$BF5= 200.13
##$BF6= 200.13
##$BF7= 200.13
##$BF8= 200.13
##$BYTORDA= 1
##$CFDGTYP= 0
##$CFRGTYP= 5
##$CHEMSTR= <none>
##$CNST= (0..31)
1 1 145 1 1 1 1 1 1 1 1 1 1 1 1 1 1 1 1 1 1 1 1 1 1 1 1 1 1 1 1 1 
##$CPDPRG= <>
##$CPDPRG1= <>
##$CPDPRG2= <>
##$CPDPRG3= <>
##$CPDPRG4= <mlev>
##$CPDPRG5= <mlev>
##$CPDPRG6= <mlev>
##$CPDPRG7= <mlev>
##$CPDPRG8= <mlev>
##$CPDPRGB= <>
##$CPDPRGT= <>
##$D= (0..31)
0 1.2 0 0 0 0 0 0 0 0.06 0 0.03 0 0 0 0 0.0002 0 0 0 0 0 0 0 0 0 0 0 0 
0 0 0 
##$DATE= 1701174215
##$DBL= (0..7)
120 120 120 120 120 120 120 120 
##$DBP= (0..7)
150 150 150 150 150 150 150 150 
##$DBP07= 0
##$DBPNAM0= <>
##$DBPNAM1= <>
##$DBPNAM2= <>
##$DBPNAM3= <>
##$DBPNAM4= <>
##$DBPNAM5= <>
##$DBPNAM6= <>
##$DBPNAM7= <>
##$DBPOAL= (0..7)
0.5 0.5 0.5 0.5 0.5 0.5 0.5 0.5 
##$DBPOFFS= (0..7)
0 0 0 0 0 0 0 0 
##$DE= 6
##$DECBNUC= <off>
##$DECIM= 32
##$DECNUC= <off>
##$DECSTAT= 4
##$DIGMOD= 1
##$DIGTYP= 9
##$DL= (0..7)
0 120 120 120 120 120 120 120 
##$DP= (0..7)
150 150 150 150 150 150 150 150 
##$DP07= 0
##$DPNAME0= <>
##$DPNAME1= <>
##$DPNAME2= <>
##$DPNAME3= <>
##$DPNAME4= <>
##$DPNAME5= <>
##$DPNAME6= <>
##$DPNAME7= <>
##$DPOAL= (0..7)
0.5 0.5 0.5 0.5 0.5 0.5 0.5 0.5 
##$DPOFFS= (0..7)
0 0 0 0 0 0 0 0 
##$DQDMODE= 0
##$DR= 18
##$DS= 0
##$DSLIST= <SSSSSSSSSSSSSSS>
$$ [...]
##$SUBNAM2= <"">
##$SUBNAM3= <"">
##$SUBNAM4= <"">
##$SUBNAM5= <"">
##$SUBNAM6= <"">
##$SUBNAM7= <"">
##$SUBNAM8= <"">
##$SUBNAM9= <"">
##$SW= 18.0517328524113
##$SWIBOX= (0..15)
0 0 2 0 0 0 0 0 0 0 0 0 0 0 0 0 
##$SW_h= 3612.71676300578
##$TD= 16384
##$TD0= 1
##$TE= 0
##$TE2= 300
##$TE3= 300
##$TEG= 300
##$TL= (0..7)
0 120 120 120 120 120 120 120 
##$TP= (0..7)
150 150 150 150 150 150 150 150 
##$TP07= 0
##$TPNAME0= <>
##$TPNAME1= <>
##$TPNAME2= <>
##$TPNAME3= <>
##$TPNAME4= <>
##$TPNAME5= <>
##$TPNAME6= <>
##$TPNAME7= <>
##$TPOAL= (0..7)
0.5 0.5 0.5 0.5 0.5 0.5 0.5 0.5 
##$TPOFFS= (0..7)
0 0 0 0 0 0 0 0 
##$TUNHIN= 0
##$TUNHOUT= 0
##$TUNXOUT= 0
##$USERA1= <user>
##$USERA2= <user>
##$USERA3= <user>
##$USERA4= <user>
##$USERA5= <user>
##$V9= 5
##$VALIST= <valist>
##$VCLIST= <CCCCCCCCCCCCCCC>
##$VD= 0
##$VDLIST= <DDDDDDDDDDDDDDD>
##$VPLIST= <PPPPPPPPPPPPPPP>
##$VTLIST= <TTTTTTTTTTTTTTT>
##$WBST= 1024
##$WBSW= 4
##$XGAIN= (0..3)
0 0 0 0 
##$XL= 0
##$YL= 0
##$YMAX_a= 92133
##$YMIN_a= -111970
##$ZGOPTNS= <>
##$ZL1= 120
##$ZL2= 120
##$ZL3= 120
##$ZL4= 120
##$ABSF1= 10
##$ABSF2= 0
##$ABSG= 5
##$ABSL= 3
##$ALPHA= 0
##$AQORDER= 0
##$ASSFAC= 0
##$ASSFACI= 0
##$ASSFACX= 0
##$ASSWID= 0
##$AUNMP= <proc_1d>
##$AZFE= 0.1
##$AZFW= 0.1
##$BCFW= 1
##$BC_mod= 2
##$BYTORDP= 1
##$COROFFS= 0
##$CY= 11.3945322036743
##$DATMOD= 1
##$DC= 2
##$DFILT= <>
##$DTYPP= 0
##$F1P= 15.7292609196834
##$F2P= 12.9074282941183
##$FCOR= 0.5
##$FTSIZE= 0
##$FT_mod= 4
##$GAMMA= 1
##$GB= 0.15
##$INTBC= 1
##$INTSCL= 1
##$ISEN= 128
##$LB= 0.24
##$LEV0= 0
##$LPBIN= 0
##$MAXI= 10000
##$MC2= 0
##$MEAN= 0
##$ME_mod= 0
##$MI= 1.114404
##$NCOEF= 0
##$NC_proc= 0
##$NLEV= 6
##$NOISF1= 3.799351
##$NOISF2= 2.8
##$NSP= 1
##$NTH_PI= 0
##$NZP= 0
##$OFFSET= 15.70392
##$PC= 1
##$PHC0= -24588.23
##$PHC1= 10.0527
##$PH_mod= 1
##$PKNL= yes
##$PPARMOD= 0
##$PSCAL= 0
##$PSIGN= 0
##$REVERSE= no
##$SF= 200.130013532006
##$SI= 16384
##$SIGF1= 3
##$SIGF2= 2
##$SINO= 400
##$SIOLD= 16384
##$SREGLST= <1H.CDCl3>
##$SSB= 0
##$STSI= 0
##$STSR= 0
##$SW_p= 3612.71676300578
##$SYMM= 0
##$S_DEV= 0
##$TDeff= 0
##$TDoff= 0
##$TI= <>
##$TILT= no
##$TM1= 0
##$TM2= 0
##$TOPLEV= 0
##$USERP1= <user>
##$USERP2= <user>
##$USERP3= <user>
##$USERP4= <user>
##$USERP5= <user>
##$WDW= 1
##$XDIM= 8192
##$YMAX_p= 0
##$YMIN_p= 0
$$ End of Bruker specific parameters
$$ ---------------------------------
##NTUPLES= NMR FID
##VAR_NAME=  TIME,          FID/REAL,        FID/IMAG
##SYMBOL=    X,             R,               I
##VAR_TYPE=  INDEPENDENT,   DEPENDENT,       DEPENDENT
##VAR_FORM=  AFFN,          ASDF,            ASDF
##VAR_DIM=   8192,          8192,            8192
##UNITS=     SECONDS,       ARBITRARY UNITS, ARBITRARY UNITS
##FACTOR=    0.0002768,     1,               1
##FIRST=     0,             0,               0
##LAST=      2.2672688,     0,               0
##MIN=       0,             -111970,         0
##MAX=       2.2672688,     92133,           0
$$ Real data points
##PAGE= N=1
##DATA TABLE= (X++(R..R)), XYDATA
$$ [...]
1837C16k81Mj2P3M7k52L66j58M8l79J51k0Q5N6r6j0J94jk07J79k83K29j07J72
1861A14j75J75p1o6L91l73r8J19k2Ll37N26O2l68J79J57K26k13l81M99l40J48
1883A55l60M97k76k12J15J33J52q7nq7%P9j92Q5K59k68n5K31p2P6j89J21l14K27
1907A3q8k7J41j55P3J01j63J84J47m9j70j55K19p4J99k71K56j86K84l63R9q5K70
1930B00k21j7J62k37J06Q3J2j51Q5k26K07k11J30K84k96K69l33J20j60K52N6L2
1952A46j33p1M1J11K7l19Q1L3J73l3J59m94L71j43J4m5OJ82q4K0J57k36M3K52
1976B58m22K01J18k9k4k1J07j54j5J61j93J75j23kl4j99J35k2J11p8R2l29J30
1999a57o6L19m4j2k05J88l14M35j98K64k20n1K63N4n0pk26R3Q8k38O8p2P5k1J31
$$ plain form
1837 316 35 39 27 100 147 -105 261 103 151 -228 -77 -97 -12 44 -52 -62 132 131 -76 103 -180 49 -58 114
1861 114 -61 114 43 -23 368 -5 -103 16 -6 -3 -340 186 248 -120 59 216 442 229 -152 347 7 155
1883 155 -205 292 16 -196 -81 52 204 117 112 25 25 104 -88 -3 256 -12 -67 164 92 168 -21 100 -214 13
1907 13 -75 -102 39 -116 -43 58 -105 79 226 177 7 -148 71 -3 196 -75 181 -5 279 -84 15 -70 200
1930 200 -21 -38 124 -113 -7 76 88 -63 22 -204 3 -208 -78 206 -90 179 -154 -34 -194 58 114 146
1952 146 13 -58 -17 94 121 -198 -117 -84 89 56 215 -279 92 -51 -37 -82 -76 106 22 42 199 -37 6 258
1976 258 -164 37 155 126 102 81 188 34 19 180 -13 162 39 37 3 -196 -61 -83 28 -50 42 -287 -157
1999 -157 -223 96 52 40 -165 23 -291 144 -54 210 -10 -61 202 256 206 199 -27 66 154 -84 -16 -88 -13 -34 97
2024I7m3p6J14Qj69R2k5N1j70K97k90J2l9L40k96J33l0k6j24K49k5p4M5O6m7k55
2050a85L00k00J92o0o3J63k64n1J87Q2r0K1j00k8j02K04k61K00K00k05J06j59
2072a13J71j45J60K74j75l37J09L3K28k75J79j03n9P8R8k47K48k04K05P2l99N13
2094C11k35Q8j88l7P0j15L27k67J67k54M79o10J13J69j56J37j21j35J00Q5M0j39
2116a71J26o0J57l4k09M26L7j11m62L10O6j01n3j17L73k22K38k40J55M4k05K21
2138A68l18L78l42J99k26pJ71K7j22j64L22o9J04k61J84M8k12J99J13L6l46q1
2160a99J73N1j60J5K74j44M8k2k6p0j19J69k46K53j33K61O7l17J45qQ5k42O2p2
2184a55J65j22J87m25L16J98q5l27L18j00J42K1q5j69O5k35J70K83k19N2j71L38
$$ plain form
2024 97 54 -22 92 100 -69 23 -2 49 -121 176 -114 -102 -141 199 -97 36 6 -20 -144 105 80 6 51 117 70 -185
2050 -185 115 -85 107 47 -16 147 -117 -168 19 101 11 32 -68 -96 -198 6 -255 -55 145 -60 46 -113
2072 -113 58 -87 73 347 172 -165 -56 -23 205 -70 109 6 -53 25 123 -124 124 -80 125 197 -202 311
2094 311 76 164 -24 -61 9 -106 221 -46 121 -133 346 -264 -151 18 -138 -1 -122 -257 -157 -72 -32 -171
2116 -171 -45 -105 52 18 -191 235 272 161 -301 9 75 -26 -79 -196 177 -45 193 -47 108 152 -53 168
2138 168 -150 228 -114 85 -141 -148 23 50 -72 -236 86 17 121 -140 44 92 -120 79 192 228 -118 -199
2160 -199 -26 25 -135 -120 154 10 58 36 10 -60 -179 -10 -256 -3 -136 125 192 -125 20 12 97 -145 -83 -155
2184 -155 10 -112 75 -350 -34 164 79 -248 70 -30 112 133 48 -121 -56 -291 -121 162 -57 -5 -176 162
2206A62k64K74j82J72j87o1j63K12J02j77l1J25j36J25q4J03j43m8M84k34k44
2227a95K70j21P5K31j91M3j18Q9m4j33P9l07K21P2K9L9k73J06m4J96N0l62L58
2250G0J66m66M79l91Q4K24%o5m7K63l32L00j46l09M14k26j68K19k41j6L18l66
2272b36P7L25Q7k41N4j4j31J33n4j50J42j63K38p7j99L84l20L14L7J26n1m37J60
2295Dj5O9j6Q5j58J45J05j62l5l4M2j77K17J28l74L23N0n5l58L71m19R7K16l37
2319b88L60J29l21K34k44K96j00k08K07j10K23l00m4O9M20l52j72M7L21j74J24
2340A17j80Q6MJ61k17K29pl42P9poK13K3m12J27j03R4L36k92k50M34j67r5J33
2364d2R4l54L85k1j76Q7J54j43k02L23j56j7l7J92k21K21l7j39K19K8k29r4K32
$$ plain form
2206 162 -102 172 -10 162 -25 -86 -249 -37 65 -112 -143 -18 -154 -29 -113 -10 -153 -201 283 49 -195
2227 -195 75 -46 29 260 69 112 -6 83 39 -94 -15 -322 -101 -29 0 39 -234 -128 -172 24 74 -288 70
2250 70 236 -230 249 -142 -58 166 166 101 54 317 -15 285 139 -170 244 18 -150 69 -172 -188 130 -236
2272 -236 -159 166 253 12 66 52 -79 54 0 -150 -8 -171 67 -10 -209 175 -145 169 206 332 281 -156 4
2295 4 -11 58 42 127 -31 114 219 57 22 -12 30 -147 70 198 -176 147 197 142 -216 155 -264 -167 49 -288
2319 -288 72 201 -120 114 -130 166 66 -142 65 -45 178 -122 -166 -97 323 -29 -201 -154 167 -7 117
2340 117 -63 23 27 188 -29 200 193 -149 -70 -77 -83 130 153 -259 -132 -235 -141 195 -97 -347 87 -80 -175 -42
2364 -42 52 -302 83 62 -114 -27 127 -16 -218 105 -51 -68 -105 87 -134 87 50 -89 130 158 -71 -165 67
2387F7k51O4K00j99J38r0n2m9K79j64J47N1o0l27K19M5j87L22j58L7o1n3J90M4
2411A52k74J73k68J63K10j21J59l08L70j63k45K04J43o9J60k52O8o0m7K5K30k70
2433b0j97L21j87j37K67j30k0J82L4o1J38k26O5j45R0R3j03J9j14p8M45j27p1
2456C8j95J23L3j38K16j55O6O3K4j4j80L9o1L4j90K24J10j3K0l91K98j09K48j26
2480c6j73K20K3K03j74m16L16j90K71M1M3p0k28r9K82Q5k21K39k02J84k30J76
2502D4j60K76j78j37J48j19L15o6k40K92n7k41J84J21j34L3O8J34j56l07J92n2
2524d0Q1lL1k72J53j67J11L03J4j70l0j38J40l3o5L4k04J33l14L76P4j14O3J65
2548A28j00J06k20l1J32j09j3J53l8j94L95j16j20o3r8L94j87R0j26q5K20L6k47
$$ plain form
2387 67 -184 -120 80 -119 19 -71 -123 -172 107 -57 90 141 81 -246 -27 18 -169 153 -5 32 -29 -82 108 152
2411 152 -122 51 -217 -54 156 35 194 -114 256 93 -152 52 195 126 286 34 102 42 -5 20 250 -20
2433 -20 -217 104 -83 -220 47 -83 -103 79 113 52 190 -36 29 -116 -26 67 -36 -17 -131 -209 236 109 38
2456 38 -157 -34 -1 -139 77 -78 -12 51 75 61 -119 -80 -141 -107 -297 -73 37 24 44 -347 -49 -158 90 -36
2480 -36 -209 11 34 237 63 -353 -37 -227 44 85 128 58 -170 -269 13 98 -123 116 -86 98 -132 44
2502 44 -116 160 -18 -155 -7 -126 189 123 -117 175 118 -123 61 182 48 81 149 283 127 -180 12 -40
2524 -40 41 38 69 -203 -50 -217 -106 197 211 41 11 -127 13 -20 -85 -51 -255 -122 -436 -60 14 -100 -37 128
2548 128 28 134 -86 -117 15 -94 -107 46 8 -186 209 93 -27 -90 -188 206 19 109 -17 -102 118 154 -93
2571i3l2O9J01o6r8K83k22j62M00k25N0j12J08m2j42L99l49J48q4l5J56K80k21
2594A11k59R5j16J37J2j68p2K70n9M56k36k74P8J76J03k41l1j09L62l93J2O6M0
2617d0Kj5K0K50j75M4j17n4M9MK25J21j36K06m14J28q7pj09J63J2j96N61m14j25
2642a04K5O8J11L4k64J14q0J67k07J07l0P1O5k50K48J49k03K8j25P7p2J32r6k1
2666e6L5K6j40L54j38j55L3N2j22K44l60M28j76l2K81k68k06J33r3J14J46J4k04
2689i0j87J81M80k68Pn3L5m6J51j33n1j71jL5n8q9K57r5K01n3j12L28j20j55L41
2714C34m50j59L68j90k39K70p7K43j6j56N3J8k90M33K53m34r7j23K53K2j0j65
2736a59J89l91L65k3K12k79J21o5l7L46rl50o9L14l53K08K0O6o8j7k30J81n1k9
$$ plain form
2571 -93 -125 -56 45 -21 -119 164 -58 -220 180 -45 5 -107 1 -41 -183 216 -133 15 -69 -104 52 332 111
2594 111 -148 -53 -169 -32 -20 -188 -260 10 -49 407 171 -103 -25 151 254 13 -18 -127 235 -158 -146 -80 -40
2617 -40 -38 -53 -33 217 42 86 -31 -85 -36 -32 193 314 178 384 -30 98 11 4 -105 58 70 -126 435 21 -104
2642 -104 -79 -11 100 134 -130 -16 -96 71 -136 -29 -59 12 77 -173 75 224 21 49 -76 1 -71 61 -35 -56
2666 -56 -21 5 -135 219 81 -74 -41 11 -111 133 -227 201 25 -7 274 6 -200 -67 -160 -46 100 114 -90
2689 -90 -277 -96 384 116 123 70 105 59 210 77 26 -145 -146 -111 -169 -258 -1 -96 105 52 -60 268 148 -7 334
2714 334 -116 -275 93 -97 -336 -66 -143 100 84 -72 -19 -1 -291 142 395 -39 -136 -259 -6 16 6 -159
2736 -159 30 -361 4 -19 193 -86 35 -30 -67 279 270 -80 -149 165 -188 20 40 106 38 21 -209 -28 -79 -108
2760a08J60j41K18n6l32L49k1j66j5J73p6Q3K05l56K39l92M20m6Lk02l2K85l44
2783a52J54J38j65J40j14J18p3j12Q5K49l05n7K3J0K23j2k18J39q4K98k26j0j01
2806e2K47j36p5o4l05L93j69J47J49l21M8k4O7N5j31K27NJ37n23M44j59OP4j17
2830g7M8r6K51j54r9L22j19Q3k41L33j03j12n2q1k3J74j55K04j98K78k82J50j54
2853a03J93j79J23J79l24l0mJ41r8Q6j58K57k35L18q5j87K9M2N15l82p0k4K53
2876B57k86P0j73K33k34J79k49J31K6J85r5j72J74j18J06M9ll12m6L22J06j88
2898c8N5n5K2J41n8Ql3K23l78k7m0L26qj94n7J23J74k9k07j85M76n73M19k13J34
2923FJ68k87J6J03p2K4Q7o0K59j66M5k23O7l3L24m24Q6L45j64j60j23O3m5K92
$$ plain form
2760 -108 52 -89 129 73 -259 90 69 -97 -112 61 -15 68 273 -83 156 -236 184 138 141 -61 -93 192 -152
2783 -152 2 140 -25 115 1 119 46 -66 19 268 -37 -94 -71 -61 162 150 -68 71 -13 285 59 49 -52
2806 -52 195 59 -16 -80 -385 8 -161 -14 135 -186 -138 -162 -95 -40 -171 56 61 198 -325 119 -40 -34 40 -77
2830 -77 -29 -125 126 -28 -127 195 76 159 -82 251 148 36 -16 -97 -120 54 -101 103 -95 183 -99 51 -103
2853 -103 90 -89 34 213 -111 -141 -145 -4 -102 -16 -174 83 -152 166 81 -106 -77 -35 480 98 28 4 257
2876 257 -29 41 -132 101 -133 46 -203 -72 -46 139 44 -128 46 -72 34 83 80 -232 -278 44 150 -38
2898 -38 17 -38 -16 125 67 75 42 265 -113 -140 -180 146 138 -56 -113 10 184 155 -52 -237 239 -334 85 -128 6
2923 6 174 -113 -97 6 -66 -42 45 -15 244 78 123 -100 -33 -66 258 -166 -80 265 101 -59 -182 -119 -164 128
2947A28k77J31J21J36l18K92l29N8q1J61j6Q5m5k1j23K79N2k13J1k30J59M1r9
2970i8J85k52L35k91J01l3k71K03N0R5R4j68K2p6l0M3J12K10j14j71j73J4J77
2993c6J17m1P0N9m18M87n6l2p6r3j70L54K7l21J1Q3K27j08K31k03m39K55K3j13
3017a62L64m21J76j0Jj2M1Ok31M46k02k46K74k77N75m04RJpN0N0J28r6k57N9J19
3043b6J5J04k23L79k40l42M61l59oK34J40j06K00m06J66O2j72O4N4l5j9N1K20
3066B16j22kl81L25J55j60k9p4l7q9K61k16m8M09q8p4J72k61K2P2J80k53p7K94
3090A95k00PPM3J76p9q9j36M1N1N8%J53l18j18L58k67J88j55P8k53M40m00M79
3114B59n48J78K86j26j58L06k55n4q3J36J34P0%O6M9N0n1l01J53j92N19m91m4
$$ plain form
2947 128 -149 -18 103 239 -79 213 -116 -58 -139 22 6 91 46 25 -98 181 233 20 31 -199 -40 1 -98
2970 -98 87 -165 170 -121 -20 -53 -324 -121 -71 24 118 -50 -28 -104 -134 -91 21 231 117 -54 -227 -213 -36
2993 -36 81 40 110 169 -249 238 182 150 74 -19 -189 165 192 -129 -118 -35 192 84 315 112 -327 -72 -49 -162
3017 -162 202 -219 -43 -53 -52 -64 -23 -17 -248 198 -4 -250 24 -253 322 -82 -73 -72 -79 -29 21 149 53 -204 -145 -26
3043 -26 -11 93 -130 249 9 -333 128 -231 -237 -3 137 31 231 -175 -9 53 -119 -55 -1 -36 -55 -4 216
3066 216 94 92 -289 36 191 31 2 -72 -109 -198 63 -153 -201 208 120 46 218 -43 -21 51 231 -22 -99 195
3090 195 -5 2 9 52 228 149 60 -76 -35 16 74 74 227 -91 -209 149 -118 70 -85 -7 -260 180 -220 259
3114 259 -289 -111 175 49 -109 197 -58 -112 -195 -59 75 145 145 211 260 310 259 -42 111 -81 438 -53 -97
3137i7J0K97k24j59N06j6k85K31k26O2o2R0j98k9Q4J36N0j1l16J0j55L19j64Q7
3161f0p1L28J0l7k48j80L21l0Q%j18J72j40J2K06m70M42k31L27j12j68J41j74
3184g2J6k66L41J86j57pj7N6nm9l0j86N05n74K73j92J30K93p40N73n4J14j07p2
3208d1j01J13m0J23J27n7j11m6J43j17k00O7n2K91k76j61N45No0k46J32qLP3l7
3233F9m5k3K4k23L0j06L13J47p9j24j31K32j06j32J63l0J33k41Q5K40m69L44j08
3256c7P4j4j82N7J39l4O1K3j00K07k64r5J2j1J90m0K50k50o7J11P5q8J59r1q0
3281ER5k93M10l63J16k71J72P4o8K24K8J06k47Q4Q5j72j80L6K51mN3l00j22J35
3305a46O4rJ83l6J38l39M3Qj35K53J79p7M9k47J50J19k11O3l48L27L4j1k16J24
$$ plain form
3137 -97 -87 210 -14 -173 333 317 32 263 37 99 37 127 -71 -100 -16 120 170 159 -157 -147 -302 17 -147 -60
3161 -60 -131 197 207 170 -78 -258 63 33 41 41 -77 95 -45 -33 173 -297 145 -86 241 129 -39 102 -72
3184 -72 -56 -322 19 205 48 41 24 80 75 26 -4 -190 315 -259 14 -178 -48 245 -495 78 24 138 31 -41
3208 -41 -142 -29 -69 54 181 124 13 -33 110 -7 -207 -140 -192 99 -177 -338 207 212 152 -94 38 30 33 106 69
3233 69 24 1 25 -198 -168 -274 39 186 107 -17 -148 84 -22 -154 9 -21 112 -129 -44 196 -273 71 -37
3256 -37 37 23 -159 -102 37 3 64 87 -13 194 -70 -165 -153 -164 26 -14 236 -14 -81 30 105 17 176 85 5
3281 5 100 -193 217 -146 -30 -301 -129 -55 -123 101 129 235 -12 72 157 -15 -195 -159 92 88 141 -159 -281 -146
3305 -146 -82 -91 92 56 194 -145 -102 -94 -229 24 203 126 175 -72 78 197 -14 49 -299 28 62 51 -165 -41
3329d1k13M44l03N2J9R3k56K47j38k63O58l97p9O8J41J4J99k00k19J83O4l15K68
3352B6n1L2J86l06R4N8J17j78K25k80K62k30j15KK59K3j20k09K16J56j81J54J
3375A41k9M1j56k67J52J24k83JJ85J16j14n0r7J29J76k23J19J14o4O5p9J7k70
3398b52K78n4r0l2N0J30J84j82J76l09j7J86k23M23l37j0n1J71j33J53O8m86L97
3421D0l5j53J49q3J18j10n9K03j28P2j84J1K04RK11m06j4j2J88p6j96R9R2J92
3445A32k25OJ01k7J77j26j2j1j39j16K67m1M4l17M46P6j43k87m7J11K68l13K73
3468I7K84n01J8L15j80K4j26n3P7j25n3J57J25J04l42j11K50jJ98k95K29k2O8
3491A37j36j57Q5P2K46Q2l25j00O5j20J21K97l05j86p1M43Mr9J02k66J64J4rp4
$$ plain form
3329 -41 -254 190 -113 -61 -42 51 -205 42 -96 -359 299 -98 -177 -109 32 46 245 45 -174 9 73 -242 26
3352 26 -25 7 193 -113 -19 39 156 -22 203 -77 185 -45 -160 -158 101 124 4 -205 11 167 -14 140 141
3375 141 112 153 -3 -270 -118 6 -277 -276 -91 25 -89 -139 -236 -107 69 -154 -35 79 15 80 1 18 -252
3398 -252 26 -28 -118 -150 -100 30 214 32 208 -101 -118 68 -155 268 -69 -79 -130 41 -92 61 129 -357 40
3421 40 5 -148 1 -82 36 -74 -133 70 -58 14 -170 -159 45 54 265 -141 -155 -167 21 -55 -251 -152 -60 132
3445 132 -93 -87 14 -13 164 38 26 15 -124 -240 27 -14 30 -287 159 235 92 -195 -242 -131 137 -176 97
3468 97 381 -120 -102 213 33 57 -69 -122 -45 -170 -223 -66 59 163 -179 -290 -40 -41 157 -138 91 69 137
3491 137 1 -156 -71 1 247 329 4 -96 -31 -151 -30 267 -38 -224 -295 148 152 53 155 -111 53 67 58 -16
3515a6l1j83L20j64J28J01k91R6o4j5p6Q2J22L3J76l45J01Jn9L64k74r7l3K02
3539G8p1J71j14L3k26j56J53P9k1PK32l06L28j06l0j81P7j90K25k29K89j57L9
3562g6j27J69j81K60L6j40j46K53J14k97K61m46L19K8l8M9Q9j62rj03J09j33J45
3585b6k54K04K85j00n5j83R1j25L44l34K43k31J15p1J11m2J41k39j97L45m1L4
3607A5J04j5k42Q9j70K09j34KK09L2k31N9J88k07L16l89L34l1k51N7k40K73J22
3630I9j75j6J25j74J82k03J83j66J30R8j81J70r5j24L45l6j52j38l1J87j99J77
3652Fj84n6p7L36r8K81j49m17K33Q9N9Q8j85R4q8L87l21J52j13r9J87l64M30l1
3676A60j67J40o7j51J3k75L85o6o3K85j09k41O6K0K02N7k13j54J40K08m70J77
$$ plain form
3515 -16 -47 -230 90 -74 54 155 -136 -40 -104 -119 -195 -113 9 42 218 -127 -26 -25 -84 280 6 -91 -124 78
3539 78 7 178 64 97 -129 -285 -132 -53 -74 -67 165 -141 187 81 51 -130 -53 -243 -18 -247 42 -115 -76
3562 -76 -203 -34 -215 45 81 -59 -205 48 162 -135 126 -320 -1 27 -11 38 127 -35 -44 -147 -38 -171 -26
3585 -26 -280 -76 209 109 54 -129 -38 -163 181 -153 90 -141 -26 -97 14 -28 113 -126 -323 22 -19 15
3607 15 119 104 -138 -49 -219 -10 -144 -142 67 99 -132 -73 115 -92 224 -165 169 138 -113 -56 -296 -23 99
3630 99 -76 -92 33 -141 41 -162 21 -145 -15 83 -98 72 -23 -147 198 162 10 -128 -159 28 -171 6
3652 6 -178 -234 -311 25 -73 208 59 -358 -125 -36 23 111 -74 20 -68 319 -2 150 37 -62 125 -239 191 160
3676 160 -7 133 66 -85 -72 -347 38 -28 -91 194 85 -156 -90 -70 132 189 -24 -178 -38 170 -300 -123
3698a23m5P2J56M8O6l6k85R6L12k67o2j32M01k19L08l93J93j31o0M7J32J27k38
3721c3n4LJ32k5j77N3o3K71q6k94L57j03J29j06J19k45l7L69l55m7J44k2j00P4
3745i6Q9K53l32N12n84j1P8m2L55k29J22j83k01N17l84L29m27M86m88K72p6p5
3767a15J03K23l89M20j09j26l7j39K61j2j4Q3N3j38k8K9m7J41l21L05k4l46M15
3790A88q6k62O6Q2p4J27j56K88m12L01K54l72J87j55K55j07k73K48k90J10J35
3811E4k4R7k94L9L29N9q9k41K1K12m4m0l8j23Q2o4j06J04N1J41k77j03L06Q2J55
3836B89j07m91M07J03l37J67M1j2J37j30j3J1m5q1m3J61m23M21n7n3j06k0L1m
3860a54J07J46k88L56j79P6l05N38j09N6j53j52L44m3k90J03P7l06J44m9K46k98
$$ plain form
3698 -123 -168 -96 60 108 174 138 -147 -51 261 -6 -68 -200 201 -18 290 -103 90 -41 -101 -54 78 205 -33
3721 -33 -87 -84 48 23 -154 -101 -164 107 21 -273 84 -19 110 4 123 -122 -159 210 -145 -192 -48 -70 -170 -96
3745 -96 -7 246 -86 426 -158 -169 -91 -133 222 -7 115 -68 -269 248 -136 193 -234 252 -236 36 -40 -115
3767 -115 -12 211 -178 242 133 7 -30 -169 92 80 66 149 202 64 36 65 18 159 -162 143 119 -227 188
3790 188 102 -160 -94 -12 -86 41 -115 173 -239 62 316 -56 131 -24 231 124 -149 99 -191 -81 54
3811 54 30 127 -167 -128 201 260 171 -70 -49 163 119 79 41 -82 0 -64 -170 -66 -15 126 -151 -254 52 134 289
3836 289 182 -309 98 201 -136 31 72 60 197 67 54 65 20 -61 -104 57 -366 55 -2 -55 -161 -181 -150 -154
3860 -154 -47 99 -189 167 -12 64 -241 297 188 244 91 -61 283 240 -50 53 130 -176 -32 -81 165 -133
3882a33L94k09j25M0L9q7J9L8J37l05R4j6J88n2K06l63J8K91J9n37M50N7n5J70
3906B78k38J73m09O1R1j53J26lJ14Q6j61J69k22J11n5J85j60j2oQ3Q8l58J59L02
3930B49l06J00o2N5K24k3l48l15L61Q1M9j00J11k9j82J66j77M23l42r8K44j74
3952i3j21K44K14l43o4L84j77j19M1j56J26k8L3K24n6j45O4q6J33Mn2j96o4M08
3976A75j41O1j75N19p76M09M3j43j13K81l01n9J16JJ36K9l47L41O9l20m9N9J45
3999d0N5j07q8L61n36M13j88L12l59K21k46M7K95m41M63j07J08n32L49N9O2j58
4021e7J33p2j97K46j11K42k55q7R2K59m20R3j65M12P2k46K18k01J26M5j23M3k02
4044a55K10jln3L30n41K60JJ40j78j36J79P3j87j48lL40k74J80L4k14N7J81m62
$$ plain form
3882 -133 261 52 -73 -33 6 -81 -62 -24 113 -192 -98 -114 74 22 228 -135 -117 174 193 -344 106 163 108 278
3906 278 40 213 -196 -135 -44 -197 -71 -74 40 126 -35 134 -88 23 -32 153 -7 -19 -25 58 146 -212 -53 249
3930 249 -57 43 -19 36 260 237 -111 -426 -65 16 65 -35 76 47 -135 31 -146 277 -65 -163 81 -93
3952 -93 -214 30 244 -99 -163 221 44 -75 -34 -190 -64 -92 -59 165 109 -36 28 -58 75 79 27 -169 -233 175
3976 175 34 95 -80 439 -337 72 115 -28 -141 140 -161 -220 -104 -103 33 62 -285 56 125 -195 -244 -185 -40
3999 -40 15 -92 -180 181 -355 58 -130 182 -177 44 -202 -155 140 -301 162 55 163 -369 -20 39 101 -57
4021 -57 76 4 -193 53 -58 184 -71 -158 -66 193 -227 -134 -299 113 185 -61 157 -44 82 127 4 47 -155
4044 -155 55 54 51 -2 328 -213 47 48 188 10 -126 53 126 -61 -209 -212 128 -146 34 68 -146 -89 92 -370
4068c70K35J27r9j73L81l7J4L9O6j48r8M1kL17n24K41j68K7j19qK87J80m74J32
4092a33J65J46k49j2P7J30m78K85NJ31j72J71q4K5o4J26Rk35M2J59L0j17K4r6
4116a15L09j81M1Nk3j19J2K31O0l62J00P5mk69o9M29J50l97j0P9j23J9J23J5P1
4141D7k34Q9K76j13R8j56j19m0J46k0J25J02M7k03N3J6j4j33n1J30L1K04k14J79
4165B46j74k08J68l1j83M9j50L97l10K76n5n1m9J22kk1L6k02P7J08J38j97M25
4188D09l63n3L00k43J75j84k56N88m76J15K4o3j03J33J39j10J57k00k8J43m7K8
4210H5j64K66k25j31L60k53K3J60k60L10k41J95r6K5q9K6j8l4j26j29L64j35P2
4233a5O9k49L13k43j6M66l26J86j30j31j5J53j9j69j23L3K54j04J80l12K75k8
$$ plain form
4068 -370 -135 -8 -107 -280 101 64 78 117 183 35 -63 -22 -24 293 -231 10 -158 -131 -250 -258 29 209 -265 -133
4092 -133 32 178 -71 -83 -6 124 -354 -69 -64 67 -105 66 -18 7 -57 69 78 -157 -115 44 74 -43 -19 -115
4116 -115 194 13 54 59 36 -83 -71 160 220 -142 -42 33 29 -240 -309 120 270 -127 -137 -58 -181 -162 -39 -24 47
4141 47 -187 -98 178 65 163 7 -112 -152 -6 -26 99 201 248 45 98 114 100 -33 -84 46 77 281 67 246
4165 246 72 -136 32 1 -182 -133 -283 114 -196 80 25 -26 -75 47 45 24 60 -142 -65 43 181 -16 409
4188 409 46 -7 293 50 225 41 -215 373 -103 12 36 -27 -130 3 142 32 189 -11 -39 104 57 85
4210 85 -79 187 -38 -169 191 -62 -39 121 -139 171 -70 125 29 54 -35 -9 -27 -61 -187 -316 48 -87 -15
4233 -15 54 -195 118 -125 -141 325 -1 185 55 -76 -91 62 43 -126 -249 -216 38 -66 114 -198 77 49
4255D9r2K16l03J79k73K27k06L84j66J02j18j92L35l51K35M4Q5j50r4J16N7q3
4277AQ2o1L04m91K59j12k29K55O5n0j28j3k3O2J62J73l10J31m9J60k84J57n9j83
4301a81R3m0K13j69jn1K82q5r0J01N2j98m7J37J44l66K56m4j5m61M07J10p2J7
4325hO0N4q2O8Q6m2j51k44J49J73l6l7J06l9PJ56l95J6L37k93J82j82K47p2l5
4350B5J60r8r3l86K42O1J81j72O1jO0j22J2J09j91K04LJ62l10K94j73l69K21L49
4374B29m1k35j95K60k1NR9j27k0j07J27j66L97k63J06j33P8r7K46n7J55l49L76
4397B67l09l34L45L3K1j57Q9k77L81K16l74K82j59j32J25l83L89j19l8L42k12
4418dM1j40K55j21k19M3j9L19m1j49N1j15L10k26q4J03q8J85r9K2K2k2o2J48k75
$$ plain form
4255 49 -43 173 -130 49 -224 3 -203 181 15 117 -1 -193 142 -209 26 70 155 5 -89 27 84 1
4277 1 83 22 326 -165 94 -18 -247 8 73 23 -105 -118 -141 -79 83 256 -54 77 28 188 -96 61 2 -181
4301 -181 -88 -128 85 -84 -85 -136 146 61 -29 72 124 -74 -121 16 160 -206 50 6 -9 -470 -63 47 -25 -8
4325 -8 52 106 24 92 178 136 -15 -259 -110 63 27 -10 96 57 64 220 -175 -159 178 -115 67 -115 132 60 25
4350 25 185 87 -6 -392 -150 -89 92 -80 -19 -20 40 -82 -70 39 -152 52 55 217 -93 201 28 -341 -120 229
4374 229 188 -47 -242 18 -3 2 101 -26 -46 -153 -26 -192 205 -58 48 -85 -7 -104 142 85 240 -109 267
4397 267 -42 -376 -31 2 23 -134 -45 -322 59 275 -99 183 24 -108 17 -366 23 -96 -134 208 -4
4418 -4 37 -103 152 31 -188 -145 -164 155 114 -35 16 -99 211 -15 -99 4 -84 101 2 24 46 24 -38 110 -165
4443a65L08j16Nj82n5M08k86r8O7K69l44M31j58Q5p2j2P4k08J68j21k19K45p9
4466e5j13J55J68l00q3J53r1J25J30k7J79l05K48j27j7k4J32k12K8J91n47N20
4488A28k92K06J00J3m9K1ml49K87k47J36j19K99j00l39L75J06j42m35K41J1J62
4510IJ7j63r2K70k41J84N4l68L86j23l75N10r1J9j68J33K35k70J62k97J44J10
4532D5p5k37Q3L59j64J41k94J08k9R3j49K21M8m7K50n58K43k03J78R1l43L53l44
4555b30M7M57k73J03J32k76J5J52j71LO4j36J69N18m95k66L45O7k05j77K67%q0
4578C0j44j9k55K53K79l36L20l24K51O3q9j3Q8O6q6J11j94j8j63K63l55K61K61
4601B50L7k20M2L7n4M1l4p8j4j29Q1J22j23K45m1k68r9L01k4m7J87N5j80j18o
$$ plain form
4443 -165 143 27 32 -150 -205 203 -83 -181 -114 155 -189 242 84 169 97 85 159 -49 119 -2 -221 24 -55
4466 -55 -168 -13 155 -145 -228 -75 -166 -41 89 62 241 -64 184 57 40 16 148 -64 -36 155 -392 128
4488 128 -164 42 142 155 106 127 123 -226 61 -186 -50 -169 130 30 -309 66 172 30 -405 -164 -153 9
4510 9 26 -137 -229 41 -200 -16 38 -330 56 -67 -442 68 -23 -4 -172 -39 196 -74 88 -209 -65 45
4532 45 -30 -267 -184 175 11 152 -142 -34 -63 30 -119 102 150 103 353 -205 38 -165 13 104 -239 114 -230
4555 -230 -183 274 1 104 236 -40 -25 127 -44 -41 23 -113 56 574 79 -187 158 225 20 -157 110 110 30
4578 30 -114 -133 -388 -135 144 -192 128 -196 55 118 29 16 104 170 84 195 1 -17 -180 83 -272 -11 250
4601 250 287 67 109 146 92 133 99 21 7 -122 -41 81 -42 203 162 -106 -205 96 72 25 212 267 87 -31 -37
4626c7K05j07J56k00L3p0K27k94J08r5o1Q8R8l1k33M7K39J2k21L18m39L31K39
4649C13o5j90q9j05o4K43p4J29r5j17J88l36L54p1J03j37P4j41Q9J24j85q8o1
4672b01L82k88j04M4K71o2r9l8k36L57n3R7J25j59j20P2J98j74o5j14J51N6K5
4695F5l07L68j82J4n4J35j76O8J73k3o1j40L15j19K62l24J75j51Mj23L06j45j73
4718i3L6k8p0J64P3l46K69l50M20Q1k08K06n8k16L32l17k5k1Q1M3l4o9J54j10
4742h6J84k04oR7pM8J45j34J1j08L16k37r8j74J81L15m50P6K18j63J9k47L21L8
4766E5j70K25j39L66l95q8L61l51J58l9M8k3p2J66j41l0K51j85j14Q2k25R9K73
4789A12n4j6l4j68J11LK9J03r2l01L35j12K22k51j12M30k70K96q0k41J20n0Q9
$$ plain form
4626 -37 168 61 217 17 50 -20 207 -87 21 -74 -135 -47 51 20 -213 -166 73 85 -136 182 -257 74 313
4649 313 248 58 -31 -136 -200 43 -31 98 3 -114 74 -262 92 21 124 -13 61 -80 9 133 -52 -140 -201
4672 -201 181 -107 -211 -167 104 42 -57 -95 -331 26 -27 70 195 36 -84 -12 186 12 -53 -167 -16 40 65
4695 65 -242 126 -56 -42 -96 39 -137 -69 104 81 20 -120 195 76 338 14 189 38 42 -81 225 80 -93
4718 -93 -57 -85 -155 9 82 -264 5 -345 75 156 -52 154 96 -120 212 -105 -130 -151 -70 -27 -61 -130 24 -86
4742 -86 98 -106 -112 -15 -22 26 171 37 48 -60 256 19 -79 -253 -72 243 -207 -131 87 -76 -57 -304 17 55
4766 55 -115 110 -29 337 -58 -146 215 -136 22 -17 31 8 -64 102 -39 -69 182 -3 -117 -35 -260 -161 112
4789 112 58 42 8 -160 -49 -46 -17 86 -6 -307 28 -84 138 -113 -225 205 -65 231 151 -90 30 -20 69
4812F9J19kk8k8j91L73k85j59J22J41k05o0l1O1K43j87m9J50J6jk66O4k42M52
4836G6j57K03J36j95J14k08l31L56O6l58L38J0j79K45J9n0J25l79J6K79o7o9Q1
4859G1k12K24j63J51j18n1J11j46m4K05j1l01K00J7O3k2k20K31J42m4J48l63N8
4882g4j20K09K9j24J1J2L4M1L62j81n43L05J03k31J73J13Pj91m2K36j99J27j92
4905a35J9Jm6P2J91M4j10j72Q7J98k87M52m11K32j26N2k99l9N13j29l9q5o5K18
4929A36j07J7J4k31M17j71l08K38r8J82q0O2n6J5K4j12j4P8R0Kl2m6N6j41J41
4954G6J85k29n7k8O1k78L77pk27R1K6K4j29j39K97l4N9J01j96pJ02L0l1j30K5
4979c8Q5Kj93K67j54J04j30R8Q4Nq8p0j61J84J05j51j62K12q2J2Np7%J89o4j33
$$ plain form
4812 69 188 186 158 130 -61 312 27 -132 -10 131 -74 -134 -165 -104 139 -48 -97 53 69 68 -198 -134 -376 76
4836 76 -81 122 258 63 177 -31 -362 -6 60 -298 40 50 -129 116 135 85 210 -169 -153 126 59 -10 71
4859 71 -141 83 -80 71 -47 -98 13 -133 -177 28 17 -284 -84 -67 -4 -26 -246 -15 127 83 231 -132 -74
4882 -74 -194 15 44 -80 -69 -57 -23 18 380 199 -344 -39 64 -167 6 119 126 -65 -107 129 -70 57 -135
4905 -135 -116 -115 -161 -89 102 146 36 -136 -49 149 -138 314 -97 135 9 61 -238 -277 236 107 68 -17 -82 136
4929 136 29 46 60 -171 246 75 -233 5 -93 89 9 71 15 30 54 -58 -72 6 96 98 66 20 76 -65 76
4954 76 261 32 -25 -53 8 -270 107 100 -127 -36 -10 14 -115 -254 43 9 68 169 -27 -34 68 98 67 -63 -38
4979 -38 47 49 -144 123 -31 73 -57 41 125 130 42 -28 -189 -5 100 -51 -213 -1 -83 -71 -66 -143 -143 46 -18 -151
5005a51J78n3r5J70l22K1K54K84l94L78j12j88l4J54J04r2k41K2J10p1q5K58l55
5028b60L46j98k3J74Q7k10M69l56N6j21K83J65k96P6l24K85j16J2m5J5j20J89
5050H8j34Q1o5jkk5J63n6Q0j89K61l02J12p3L3J05k12K3J95p6K81l06OJ49k08
5075g2J45lk28K77j34NK75q3j75j11J57p2k5L0P5r4k4Q3j70J9p1J79M2oJ34k26
5101g3Q0J06j23OJ54k41J75R5j87J08l2j17J49j45K55j31k43K38j43k0p1J29P2
5124D1j83N16m88j10K14JQ0l56J30K48K8j64K50j50q9J38k68K63m05p9M10O3j66
5147g6K98R0k62j00J95L6k06j96J23K59p2l46J48M25m07J31j45m3J80j55j18J97
5169d4J97k38J00KP1p6k65L57k18J9P5j83J60R6j27kK31k66j51L3L69j39R2J9
$$ plain form
5005 -151 27 -26 -121 49 -273 -252 2 286 -108 270 158 -30 -64 90 194 102 -139 -117 -7 -78 -163 95 -260
5028 -260 86 -112 -135 39 126 -84 385 29 85 -36 247 412 116 192 -132 153 37 49 4 19 -101 88
5050 88 -46 35 -30 -31 -33 -58 105 49 129 -60 201 -101 11 -62 -29 76 -136 -113 82 6 287 -19 -13 136 -72
5075 -72 73 70 -158 119 -15 -10 265 182 7 -104 53 -19 -44 -14 61 -33 -57 26 -144 -125 -196 -17 25 19 153 -73
5101 -73 7 113 -10 -4 150 -91 84 179 -8 100 68 -49 100 -45 210 79 -164 74 -69 -89 -160 -31 41
5124 41 -142 374 -114 -224 -10 -9 71 -285 -155 93 121 -43 207 57 -32 106 -162 101 -304 -383 27 90 -76
5147 -76 222 312 50 -50 145 181 -25 -221 -98 161 89 -257 -109 316 -91 40 -105 -148 32 -123 -241 -44
5169 -44 153 -85 15 17 88 12 -253 104 -114 -95 -20 -203 -43 53 -74 -76 155 -111 -262 -229 140 1 93 112
5193A12k83%J55m0J11m7k82K33k10J03L86l29K5j91L18K9N3K9l10k7L1K56m3l9
5217D0m3R2j05Q8KR6M8o6j00j85R7r5L48n10N67k22j30k7j6n7J30P1N8o6m5J17
5243H7R6O9l15J24p0P2l34J67K18J8j51O6J81n16M39k74J05j9Q3M1k90K28J03
5266A28j52o4j6J80j73J06p1J46Rj67j12J49lL8l00K96j0m6K72k35K25k02J5k1
5290hno5o7L20j56L0j29K18j18J52R3j93j51J27q0j70J70Kj39K51K4j74J15l6
5314A1j02o3k8K00K7j09Q7k48K34K19k76j05Q5P5j27J56r3n0M7l5J1J08j8r3K83
5339A96k45O1j8j37L08n7k19n7m2K55R6l71J79J60l89K61k8K59k72N1K2K07k26
5362fJ11j70q9Q3rJ14L9k26J08L75n78J77J55k36Q3K44o3l11J44K10r2j21J81
$$ plain form
5193 112 -171 -171 -16 -56 55 8 -274 -41 -251 -148 238 -91 -66 -257 61 90 143 172 -138 -165 -134 122 79 40
5217 40 -3 89 -16 72 74 170 218 152 52 -133 -36 -131 217 -293 274 52 -78 -105 -121 -178 -48 23 81 15 -30 87
5243 87 183 252 -63 61 -9 63 -271 -104 114 132 -19 47 228 -288 151 -123 -18 -37 46 87 -203 25 128
5266 128 -24 -88 -104 76 -97 9 -62 84 93 -74 -186 -37 -40 -2 -302 -6 -16 -62 210 -25 200 -2 13 -8
5290 -8 -13 -78 -145 175 19 49 -80 138 20 172 265 72 -79 48 -32 -202 -32 -30 -169 82 106 -68 47 11
5314 11 -91 -154 -182 18 45 -64 23 -225 9 228 -48 -153 -68 7 -120 36 -57 -107 -60 -95 -84 24 6 -87 196
5339 196 -49 12 -6 -143 165 108 -111 -168 -210 45 141 -230 -51 109 -280 -19 -47 212 -60 -9 13 220 -6
5362 -6 105 -65 -154 -71 -80 34 73 -153 -45 330 -248 -71 84 -152 -69 175 112 -199 -55 155 63 -58 123
5385A23Mp1k0K3k92O9K29j92J28r5L00o3J02l31j8R7O3k59K30J18j20O9K2k76
5409a60K8J13k21K33j20L03l03m8K54Nj73K94k94K30k36R6q8m6L24l26J49m8L
5432c1l8Q6l9R7l2q5j16J01N6q9J5L3j63Q3J75q5p9L11k41K5l2l9J02K28j92P8
5458A29j65J87k25j84M44k22K52j75j0p7R7k41K91n3o7j80k3K58K21l78K59l05
5480a67J02j0R0K17k81Nk02L24j29k53L5O8J19j14l5L96o2j30k78K12K71k01L05
5503B82l91j68J14K52j81j16K61k54J89M6l32L45O1n0n3j58K87k82N3J99j16r9
5525a11J18J17k5o8j09J17n9j22r2O10l95j29O7J38k79K60MJ64l76j20J95J51
5547E6J9J07l54qJ90j65J55p9L69k06j53M3R7q4R9o3J04J32j76ll0K2k27qM75
$$ plain form
5385 123 127 56 36 59 -233 -164 65 -127 1 -94 206 143 245 -86 -104 -7 56 -203 27 145 25 94 116 -160
5409 -160 -132 -19 -240 -7 -127 176 -127 -175 79 84 -89 205 -89 141 -95 1 -87 -133 191 -135 14 -34 -31
5432 -31 -69 17 -22 75 43 -42 -158 -57 -1 -90 -75 -42 -205 -122 53 -32 -111 200 -41 -16 -48 -87 15 243 51 129
5458 129 -36 151 -74 -258 186 -36 216 41 31 -46 51 -190 101 48 -19 -199 -222 36 257 -121 138 -167
5480 -167 -65 -75 15 232 -49 -44 -246 78 -51 -304 -269 -201 -82 -196 -231 165 103 -27 -305 -93 178 -23 282
5503 282 -109 -277 -163 89 -92 -208 53 -201 -12 34 -298 47 108 58 5 -153 134 -148 -95 104 -12 -111
5525 -111 7 124 99 31 -78 39 -20 -142 -234 376 -19 -148 -81 57 -222 38 42 206 -170 -290 -95 56
5547 56 75 182 -172 -180 10 -155 0 -79 290 84 -69 -26 71 -13 86 23 127 259 83 80 50 72 -155 -163 312
5572C12m82K71j64p8R7j25J75Q7J53j3j82j15k35K0K21K67j60l0N4O0k32O0J08
5595F9o6j10K74K1n69L77j99K35j09l3j36m5L2M10r4k54M94j92k72J43P8p9J10
5618H5m47N35j05o8j0J94j54O5l57Q4L09l59L23J9j93K68k55K4J0m8K28K6jk66
5642i3R2r1J90j0j48Q6o2j68L05j59K61l4R4l76j03L73O0R6l77L8m1J02j50o3
5666a78J79J54k69J48J22M9j24no9j51J10J28l15L51n6j03j11M45l77J46l81L88
5688H1j49P0k15K45L8j42K77j49K8p9l19K67J06jj93O5K96k37n1q4J38l5j8M6
5712a5k67J85N3J95m2p8m6K9J20k37L7J76k31k44L88K8J19j67J21J16k71j45p3
5735b49K48M5J04k95J41J00l27J34K67l53L78j12j48K49n6j15Q7P8l0j54KJ35
$$ plain form
5572 312 -170 101 -63 -141 -44 -169 6 93 246 233 51 -64 -299 -279 -58 209 49 19 73 133 -99 -39 69
5595 69 3 -107 167 188 -381 -4 -203 32 -77 -110 -246 -291 -259 151 57 -197 297 105 -167 -24 54 -25 85
5618 85 -362 173 68 0 -10 184 30 95 -262 -178 131 -228 95 114 -79 189 -66 -42 -32 -80 148 174 173 -93
5642 -93 -1 -92 98 88 -60 26 -36 -204 101 -58 203 169 263 -113 -216 157 217 313 -64 -26 -67 35 -115 -178
5666 -178 1 155 -114 34 156 205 81 76 7 -144 -34 94 -221 130 74 -29 -140 305 -72 74 -307 81
5688 81 -68 2 -213 32 70 -72 205 56 84 5 -314 -47 59 58 -135 -70 226 -11 -62 -146 -8 -43 -61 -15
5712 -15 -282 -97 -44 151 109 31 -15 14 134 -103 -66 110 -121 -365 23 51 170 3 124 240 -31 -176 -249
5735 -249 -1 44 148 -147 -6 94 -233 -99 168 -185 193 81 -67 182 126 11 98 176 146 -8 -6 129
5757A29k83K81j40j80R1n7J07M26k19k70j7J21j53K95l21K24qj7J5j02J49j0j60
5780i9K77J45m96K66k39J01L9J64l04K04j20k38J73K95qk21j91K12Q2j6q1k31
5802b86L95k13o4J37j34J14j70N16l21k1J26k72J51K4K74j37m4q1K40j05k73O5
5824g9K58j44k7O7j25M2J25j86j50M59m31K49O0l18l1K63J30r2J9n0j81M16j83
5847I1m9l31M71k34J05j56J0J89j61J8K3j46K34k85J40K09l45J84M7J62J3nk3
5870A61q1l28J68J12m0j82J88K15j09M7k56P1J58l39P0K62k90J14L39l48K18l57
5892b07L30l06K85n2j37M1j50J88lJ26ok29J01N4j21L22j96k4j54J32p5r4L40
5915A65k94M9J30k08J89j38pJ57m9j10J31m4O8K42lj38J00k07j65P1J25J16j61
$$ plain form
5757 129 -154 127 -13 -193 -102 -159 -52 374 155 -115 -132 -11 -164 131 -190 34 26 9 24 -78 71 61 -99
5780 -99 178 323 -173 93 -146 -45 -6 158 -146 58 -62 -300 -127 168 160 -61 -252 -40 42 26 -55 -286
5802 -286 109 -104 -168 -31 -165 -51 -221 295 -26 -47 79 -193 -42 -18 256 119 75 -6 234 129 -144 -79
5824 -79 179 35 8 75 -50 -8 117 -69 -219 240 -191 58 118 -200 -231 32 162 70 89 39 -142 274 91
5847 91 42 -289 182 -52 53 -103 -93 96 -65 -47 -24 -170 64 -221 -81 128 -217 -33 14 176 189 184 161
5870 161 80 -248 -80 32 -8 -190 -2 213 104 151 -105 -34 124 -215 -145 117 -173 -59 280 -68 150 -207
5892 -207 123 -183 102 50 -87 -46 -196 -8 -11 115 109 -120 -19 35 -86 236 40 16 -138 -6 -81 -175 165
5915 165 -129 -80 50 -158 31 -107 -114 43 -6 -116 15 -29 39 281 278 140 240 33 -132 -61 64 180 19
5938A9R9o9r8p1P7j61K63K5j01k76L09j47J24Q8J54l2%l75o4K66J73l06J75j02
5962c0Q0j69k57M02j22K25l63J56K52j10k05L9J90j77j86J82R6r6J62j04N2q4
5984f7J59k17R5j97M48k78J20j87K26j08r7M15m06N0j25L09j16Rk1Q9j46K14L5
6007B04j59M6j09j32Q7J15k76K24o5O3P4j66j36K63j34J66j27J58j70j70M01p0
6029H7r3J2L7J06o1j63j23K6n6L14O2k68q6K60J52k17J08J21j54j20j9L3j49K19
6053B8k12J83j39kJ98n3j01M5j3J17k04mJ91k32J72j74L51l51J35L01k03j93K10
6076E0P9j35k02K85j05j9j30L05L4j97J10m39L54J15p6J70l85Q7k79K28L58o3
6098A45l78J42O6MJ12Q1k35o8K07j84J08M08m00l3j8k33K72Mj32L9jK68k5n1j21
$$ plain form
5938 19 118 49 -49 -120 -43 -204 59 84 -17 -293 16 -131 -7 81 235 203 203 -172 -236 30 203 -103 72 -30
5962 -30 50 -119 -376 26 -96 129 -234 -78 174 64 -141 -102 88 -89 -275 -93 3 -93 69 -35 17 -67
5984 -67 92 -125 -30 -227 221 -57 63 -124 102 -6 -103 312 -94 -44 -169 140 24 33 12 101 -45 169 204
6007 204 45 91 -18 -150 -63 52 -224 0 -65 -2 72 -94 -230 33 -101 65 -62 96 -74 -244 157 87
6029 87 -6 6 43 149 88 -75 -198 -172 -228 86 148 -120 -206 54 206 -11 97 218 64 -56 -75 -42 -191 28
6053 28 -184 -1 -140 -142 56 3 -98 -53 -66 51 -153 -157 34 -198 -26 -200 151 -200 -65 236 33 -160 50
6076 50 129 -6 -208 77 -28 -47 -177 128 162 -35 75 -364 -10 105 29 199 -186 -99 -378 -150 208 145
6098 145 -233 -91 -25 -21 91 172 -63 -131 76 -108 0 408 8 -25 -43 -276 -4 0 -132 -93 -94 174 149 98 -23
6123b3j0K86k46j27K60j48M1j76k32L34R5J33m09K00J65jNj36k77L51M1n8j06
6146c8J23P9j07j9pJ59l32J40J2o2q3R5k55M20l64L87P5k02k0j62j67L96j52j6
6170a00L24k37j27J94J22l30m2J10J49J2m3J25l51L95n4r8R4k74N0L7J83j01K1
6193E9j73M3N8K88l90J68N9j12j40K08k28j05M33k80k4j32K44l14K57k5J72j68
6215a02J53j57m7K56L6j47j24J12j26K01n7N5k70K97O3r1J70m43N9J33J39k73
6237a63J62l24J70l8J16K35J61l20J08j7k82K04n2K78n6k17J33J13l04K53k87
6258a27J36m8L0M7j00J8L5j90j0K60j0j35pO2m7J42l9l7j17L14q8r1p5q8J76K1
6284C2M9J60n87K70O1N6j57J97j55J38l4m2J22k59J96J03k11j1K22k18J37k03
$$ plain form
6123 -23 -33 253 7 -120 140 -8 33 -143 -375 -41 54 187 -222 -22 143 142 147 11 -266 85 126 68 -38
6146 -38 85 164 57 38 31 190 -142 -2 10 -52 -135 -40 -295 125 -239 148 223 21 1 -161 -328 68 -84 -100
6170 -100 224 -13 -140 54 176 -154 -196 -86 63 75 32 157 -194 201 147 49 143 -131 -81 -44 139 38 59
6193 59 -114 -71 -13 275 -115 53 112 0 -140 68 -160 -265 168 -112 -136 -268 -24 -338 -81 -106 66 -102
6215 -102 51 -106 -153 103 139 -8 -132 -20 -146 55 -2 53 -217 80 143 52 222 -221 -162 -29 110 -163
6237 -163 -1 -325 -155 -193 -77 158 319 -1 107 90 -192 12 -40 238 182 -35 98 211 -93 160 -127
6258 -127 9 -39 -9 38 -62 -44 -9 -199 -209 51 41 -94 -101 -39 -86 56 17 -20 -137 177 89 -2 -77 -165 11 32
6284 32 81 241 -346 -76 -15 41 -116 81 -74 64 30 -12 110 -149 47 150 -61 -72 150 -68 69 -134
6306a34K05l4l44K38k12L01k01L11j60N1k28K53J57j81l7J94m07P4M41k90J57
6327A54L8l06L60l60p7J11L8K44k27O3Pk47J64K64k44j74Q1J47j14o6K92j18J8
6350D8j7j7j4j79q9m9M3K48M1P6j43q6RJ98rj67M0J28J5j71m6J59j47K41k62r2
6376b42J85K08p0k1j94K59j19k88K50J49K55m21R1N4QJ88l04j16J94j32Q3l68
6398c51K39N1J1k47L43K4k79K93q0J16j68p0N6pl8o8J66j21R9k20J1K00J02j6
6422D6q5J65j43k06L17l23J77Ok9K39k24J72j65J45l2N3j22j35L8K96l17M9o9
6445a47J85NJ20k06J96j86M4l33k2L29R9J34k91K3J68r2r4j9J56K95n96L10j38
6468f0J10j13K58k16j31K11k04J40j7P8K8j58R3j21P1M7K51l90J29o3j16J78M
$$ plain form
6306 -134 71 37 -307 -69 -281 20 -181 130 -30 21 -207 46 203 22 -15 179 -228 -154 287 -3 154
6327 154 192 -114 246 -114 -191 -80 -42 202 -25 38 45 -202 -38 226 -18 -192 -111 36 -78 -144 148 30 48
6350 48 31 14 0 -179 -268 -317 -274 -26 15 91 -52 -138 -129 69 60 -107 -67 61 76 -95 -141 18 -129 112 -150 -242
6376 -242 -57 151 81 60 -134 125 6 -282 -32 117 372 -49 42 96 104 292 -12 -128 66 -66 17 -351
6398 -351 -112 -61 -50 -297 46 70 -209 84 4 120 -48 -118 -62 -69 -107 -175 -9 -130 -31 -251 -240 -40 62 46
6422 46 -39 126 -17 -223 94 -229 -52 -46 -75 164 -60 112 -53 92 60 113 -9 -144 -106 190 -127 -78 -147
6445 -147 38 43 163 -43 153 -33 11 -322 -344 -15 84 218 -73 -50 118 26 -68 -87 69 364 -232 78 -60
6468 -60 50 -63 195 -21 -152 59 -145 -5 -22 56 84 -74 19 -102 -31 16 267 -123 6 -57 -173 5 9
6491IP5k82K64Ok14J75k38K05L67m26K52j68r2L42l58j81L49p2j71k5K33M2p9
6514A3K04K0j15k77M9Q4K34l2j05l0k14P2k34J90J79m33M03L4J55j29q4J46j24
6537Fj68K70k7j13R8p1J02j25j02R8J38j67J85l98Q8K21k04Q1L2k41L46r7O9M1
6561F2k00K16r8J22jO1k6KM6m8n5k17P2J59n8q0j0mJ42k23J50m8M3M5J6j52K40
6588A56k45K35k10J50k21M0J7m8Q1K45p7l9k1k30Q6o9K47l65L34J01r5K24m45
6611a49J98o1n9RM5J89j52j2J78j22r3%K4L5J0j08j11L36o1J35l54l4P9m8q9M40
6637B25j13n3j01J28k67M22k04P1k87K63J27j84m5J03N1j5J27k85p2O6L91j74
6659A74j38r1p7J30P3o5p3j04l54K80L72j99K19l13J68O0m4k50K18p5K79l6j00
$$ plain form
6491 9 84 -198 66 72 -142 33 -205 0 367 -59 193 25 -67 275 -83 -264 85 13 -158 -183 50 92 13
6514 13 217 237 122 -155 -106 -22 212 180 75 45 -169 -97 -331 -141 38 -395 8 42 197 68 -16 130 6
6537 6 -162 108 81 -32 66 -5 97 -28 -130 -32 106 -61 124 -274 -186 35 -169 -88 -56 -297 49 -48 21 62
6561 62 -138 78 -20 102 101 162 136 138 184 136 81 -136 -64 95 37 -43 -53 -57 85 -138 12 -36 7 52 68 -84 156
6588 156 -89 146 -64 86 -135 -95 -78 -126 -45 200 123 84 63 -167 -81 -150 97 -268 66 167 72 296 -149
6611 -149 49 -12 -71 -62 -17 172 20 8 186 64 -29 -29 -5 30 40 -68 -179 157 96 231 -123 -157 -78 -126 -215 225
6637 225 112 59 -42 86 -181 241 37 108 -179 84 211 27 -18 85 136 121 248 -37 -109 -43 348 174
6659 174 36 -55 -132 -2 71 6 -67 -171 -525 -245 127 -72 147 -166 2 62 18 -232 -14 -89 190 154 54
6682E4k22J77p8J31o0J64O8k63J58q9j74L0J80J2k05M48l73k0m2K50j47m4J50
6705A05j92K5l9j9J30J43k30j33j22M33j71j11M91k99J49j51o6K62J9j2l63j19
6727b70Q4M83n29K38j70M40k25j99Q3K00J41j3k21J15j44J2NO8m0j5k95K64q0
6750f8n4O3r6J46K4M9K0Q9j84j05j46K95p0K10k53M67n13J03j6K58k02p8K29J42
6774C10k68K4q7Q2J88l72J96qk09K32k28L44m34K52O9r9n8K3n3j00K96m7J23l45
6798a69pQ5K33j02O5l51L16kj05M2J87k21J1J94j89j90M34m22J98j5j36K37L4
6821A27o4l45K26j13J91N8l04J74K05n8j71J87k14K80L8j76M6j56o4N6O0J62j74
6844b9K22j06l03K94Q0k43J96o2P3k38J23J50k63J48k25K15j09l9j23K79J61n6
$$ plain form
6682 54 -168 9 -69 62 2 166 234 -29 129 40 -134 -104 76 88 -117 331 -42 -62 -104 146 -1 -45 105
6705 105 -87 -62 -101 -120 10 153 -77 -210 -332 101 -70 -181 310 11 160 9 -57 205 224 212 -151 -270
6727 -270 -186 297 -232 6 -164 276 51 -148 -65 135 276 263 42 157 13 25 30 98 58 43 -252 12 -68
6750 -68 -122 -59 -155 -9 15 64 84 173 -11 -116 -262 33 -37 173 -80 387 -126 -23 -39 219 17 -61 168 310
6774 310 42 66 -21 61 249 -123 73 65 -144 88 -140 204 -230 22 91 -8 -66 -43 -96 -196 100 53 176 -169
6798 -169 -176 -91 142 40 105 -246 70 68 -37 5 192 -29 -18 176 -13 -203 231 -191 7 -8 -144 93 127
6821 127 63 -282 -56 -169 22 80 -224 -50 155 97 -74 113 -101 179 217 41 87 -69 -133 -77 -17 145 -29
6844 -29 193 87 -216 78 158 -85 111 49 122 -116 7 157 -106 42 -183 32 -77 -116 -239 40 201 145
6866A45k39J39j19J39p4j52J20j26K31M7J2r0j66O8P4j54K66j63J08L53j47j62
6888A10j74N4k09J85J01P1j0J0k41J97k05k1K31k18Qq4J80NJ98j26J38j66k2m
6912HM0ll09K47O0KJ48k61J07K7j64J21k54L77R1q3m5o6k65K07mJ4J2L3J2p1J02
6939H3k10p2L05j65q7J32K28m40M54k70Q7j37M1J91j19P3Ol45K41L55o46M61j88
6962b2M7K59k34p9K12j06j6k5q2j90L39k32J99l8j04P5j76K45l7m9l2m11N59L9
6986A41j79l8J72o7j55K44k38K03J49m35L2Q0l14M03L7j72L48j07K0O5j60n2K11
7009A88j07O4K2q6J0l84J66L55J9j09m1m9j8K90k30J75l55j65M67m50N13l27j23
7032a75QK76j18r4j17Q8J63j54K41l6J32m87K51j44M30j90k39N7OK2o0J55J47
$$ plain form
6866 145 -94 45 -74 65 -9 -161 -41 -167 64 111 123 33 -133 -65 9 -145 121 -42 66 419 272 110
6888 110 -64 -10 -219 -34 67 138 128 138 -103 94 -111 -132 99 -119 -111 -195 -15 -10 188 62 200 34 12 8
6912 8 48 45 -264 -17 43 45 193 -68 39 66 -98 23 -231 146 237 154 109 43 -222 -15 -19 -5 7 40 52 -19 83
6939 83 -127 -199 106 -59 -146 -14 214 -226 228 -42 45 -92 -51 140 21 94 100 -245 -4 351 -295 166 -22
6962 -22 25 284 50 -29 183 77 61 36 -46 -236 103 -129 70 32 -72 3 -173 72 35 -14 -46 -457 102 141
6986 141 -38 -76 96 29 -126 118 -120 83 232 -203 -171 -91 -405 -2 35 -137 211 104 124 189 29 -23 188
7009 188 81 145 167 81 91 -293 -127 228 247 138 97 48 30 320 90 265 -90 -255 212 -238 275 -52 -175
7032 -175 -167 109 -9 -103 -220 -132 31 -123 118 82 214 -273 -22 -166 264 74 -165 -108 -102 -80 -140 15 162
7055A62k49J5j00M85n10J09j25K42j80K04r2j14L03j09j30J29k18Q1J80k14J92
7076F1J30k18O6J58j04Ml06J85m9M36o2l91O7K84k43J62n45L45R5M8l59P2M1K41
7100A18k51j28K68p9P3N0P0m14J47J89NK30J02n62O33n81M07m03R6L35n54J82
7122f7J09K42m35L83k37J48k81J52p0j14n5r3K96J18MQ6l83K62k6j05P4O1O4R4
7146B27j40j23l25K37N5R1q1J07lJ18k90L8K88k86M2J69k49N9n1L17k19k35K71
7169A7K25k14k59M9L32k3j72J7K84j96o1j42K76j18k79K63K34j22J2J44j98j52
7191h3j34K79O4k2k72K09k21M1K37M6K1l56j21K03O3R3n7J0Q5K8k55J10j29J36
7215b5l5N2j03Q5m7N2K3oj52J56l5P7J19k07J59j15O1k01Q8l6M8j21J17J07j93
$$ plain form
7055 162 -87 -72 -172 313 -197 -88 -213 29 -151 53 -39 -153 150 41 -89 40 -178 -97 83 -131 61
7076 61 191 -27 39 197 93 97 -209 -24 -73 363 301 -90 -23 261 18 180 -365 -20 75 123 -236 -164 -123 118
7100 118 -133 -261 7 -72 1 51 121 -293 -146 43 48 278 380 -182 451 -130 277 -126 -30 305 -249 -67
7122 -67 42 284 -151 232 -5 143 -138 14 -56 -170 -225 -318 -22 96 100 186 -197 65 39 -66 8 69 133 227
7146 227 87 -36 -361 -124 -69 22 -59 48 45 163 -127 -89 199 -87 -45 124 -125 -66 -117 200 -19 -254 17
7169 17 242 28 -231 -182 150 127 -45 -28 256 60 -1 -143 133 15 -264 -1 233 111 123 267 69 -83
7191 -83 -217 62 126 104 -168 41 -180 -139 98 144 165 -191 -312 -109 -46 47 -10 0 85 113 -142 -32 -161 -25
7215 -25 -60 -8 -111 -26 -73 -21 2 -4 -156 0 -35 42 161 -46 113 -2 59 -142 -54 -90 -42 -163 -46 61 -132
7240a32L4J46j84O7J2n4j56K32J47n0m0M3j30J04LJ06r0L7M3j93J56l16R4o0K48
7265F7k00j4K62j5r9Q2k3j42m0J03K2J31k82j6L47j85j69R0J06k01Q2LJ81Q4R9
7290B73j82k33J78J96j53k54K06k8k27M96j4n61L69r2j44K52k29J33j02K51p5
7311F0M1n1j27J99m8k0R2l06l6J49K08r8N2K4j8P1l72L81j85J13L7q5j18n0J05
7336A8O9R1o9j83Q5Np2J42r2j37M2K7J50j8J51mk95O5j23L86m74J82j40K11N0
7361F7j17K82m0k61l9k5L35q7j1j58L1K3n9J09k36K76k46K84q8Q6j21K8j23J34
7385D4K7m5R1j79K59j05R6m27Q7mJ49L6J56k79j60K28J12L0p7m33K36K05J27l0
7409A44q3j34J1P1p8K44l24J76j80L8J31j13j38K17KR3k52L6J1J50K2r6l6J8j09
$$ plain form
7240 -132 -98 48 -136 -69 -57 -111 -267 -35 112 62 22 65 -65 39 42 148 58 95 138 -55 101 -215 -121 -181 67
7265 67 -133 -147 115 100 1 83 60 -82 -122 -19 3 134 -148 -164 183 -2 -171 -81 25 -176 -94 -91 90 174 273
7290 273 91 -142 36 232 79 -175 31 3 -224 272 258 -303 66 -26 -170 82 -147 -14 -116 135 60
7311 60 101 50 -77 122 74 54 146 -160 -196 -47 161 63 115 139 121 192 -180 201 16 129 166 81 -37 -87 18
7336 18 87 178 109 -74 11 16 -56 86 -6 -143 -101 -74 76 58 209 205 -90 -25 -148 238 -236 -54 -194 17 67
7361 67 -50 232 192 -69 -108 -133 202 115 104 -54 -23 0 -59 50 -186 90 -156 128 40 126 5 33 -90 44
7385 44 71 26 117 -62 197 92 188 -239 -152 -156 -7 29 185 -94 -254 -26 86 116 39 -394 -158 47 174 144
7409 144 61 -73 -62 9 -69 175 -149 27 -153 -115 16 -97 -235 -18 -16 77 -175 -139 -128 22 44 -52 -88 -70 -179
7434a79l0L68m5O6j40o9L1J50j80p5j69J41K63k31K98k31J0q6Q5k9N1j25K60n4
7458H0l67K47j41L5K15j78K40k73n0J06K6J40j03R2r4J39K18m13K96k58J24k78
7480a97K42j93J01qL04r8k43J17M5k56p3L85j1m5l24K21r1m6J17o2O2j6J81J0
7504A22l04L4l23M03j63L61j98J02L17k50j78R5J4J82l63J84j48n8J85o7J55j80
7526g8K32q1r3j09J72j57K82j22o3R4J03l47P9J71K41m60O5L52k47q1j02K08j18
7549e9R4L2n8j51J39K6O9M5l9j91RK43l45K28k68M32j47J01j29P2r6jj08J60J58
7574B16j43k67L06k08M3N8ko9k2K80n2j73O7j04q5N9J12N2J31j20j00J10p8N7
7598F8q0O4k01L40j35m20M59j65j4K29j89J35j42j98L29o6k47O9o3K34L8j06L04
$$ plain form
7434 -179 -209 159 114 180 40 -29 2 152 -28 -103 -272 -131 132 -99 199 -32 -22 -108 -23 -52 -1 -126 134 80
7458 80 -287 -40 -181 -146 69 -109 131 -142 -192 -86 -60 80 -23 69 -25 114 332 -81 215 -43 81 -197
7480 -197 45 -148 -47 -55 249 151 -92 25 70 -186 -259 126 115 70 -254 -33 -124 -170 -53 -115 -53 -69 112 122
7504 122 -182 -148 -471 -68 -231 130 -68 34 351 101 -77 18 32 214 -149 35 -113 -171 14 -53 102 -78
7526 -78 154 73 -20 -129 43 -114 168 46 -17 77 180 -167 -88 83 324 -136 -71 281 34 -47 -149 59 -59
7549 -59 35 67 9 -142 -3 23 92 137 98 -93 -84 159 -186 42 -226 206 59 160 31 103 7 6 -102 58 216
7574 216 73 -194 112 -96 -53 5 3 -66 -88 192 140 -33 34 -70 -155 -96 16 68 199 79 -21 89 11 68
7598 68 -12 52 -149 191 56 -364 95 -70 -84 145 -44 91 -51 -249 80 14 -233 -164 -227 7 45 -61 243
7621B43j79k39K46L7rk47O2J14n3K45k71o5O8J25M19p06J84o2L16k86M2j66K03
7644B1j13N8L8j13J38J48j47J95k30j87K91k67L7pJ27j94L40m0k50J98L50n08
7666a15J20J62r1k7l81K49J21k12K93o1m6L55k16j73J6k27L26q6L58n70J69K49
7688B13N9j26j68J15L6l21R0K24J04p0j08K19j83l74N41k97P2j07kL16k37L1J09
7711A36l41J80K62r4k1k11J70j52L83l13l4N2k96M17m16J92J27r2k11r7L16K54
7733B11k94K98k24q4K4m2K50j74r1L05j93l35K75O5k24K49q0J03j35K18jk26j03
7756b08J42J67j86J34q4J95l27K6r1j3K00K8J12K8l7k37L93p6j49K5j08K46L7
7779B17j05J35l64K14K5Qk4q5l80K75O0K43k40NK59n28K85p3R1p5L04j18j09j26
$$ plain form
7621 243 64 -175 71 108 99 -148 -86 28 -25 220 -51 -116 -48 77 496 -210 -26 -88 228 -58 -16 -182 21
7644 21 -92 -34 4 -109 29 177 30 225 -5 -192 99 -168 -131 -138 -11 -205 135 95 -155 43 393 -115
7666 -115 5 167 76 49 -332 -83 38 -174 119 58 12 367 151 -22 -6 -233 93 7 365 -205 -36 213
7688 213 272 146 -22 93 129 -192 -102 122 226 156 48 267 84 -290 251 -46 26 -81 -83 233 -4 27 136
7711 136 -205 -25 237 143 122 -89 81 -71 312 -1 -35 17 -279 138 -278 -86 41 -51 -262 -359 -43 211
7733 211 -83 215 -9 -93 -69 -111 139 -35 -126 179 -14 -349 -74 -9 -233 16 -64 39 -96 122 121 -105 -208
7756 -208 -66 101 -85 49 -35 160 -167 -141 -232 -245 -45 -17 95 123 86 -151 242 166 17 42 -66 180 217
7779 217 112 247 -117 97 122 130 106 21 -359 -84 -24 219 -21 -16 243 -285 0 -73 18 -57 247 129 20 -106
7803a06J57m79J08L68k1n5j56L59j88j26m2qL47J09o6j64Oj01L75m45l4L48J4
7826B00j51J29j35J37k88L76r7O6m19K05j34L5J60k37K30K9k8m4m10M16P0j85
7848g5J95m8j95%J21j36K00k04J16l23M25j50J7m2Q8n2M1J53k24j74Q2L09j14
7871A0P4k10QJ99j3k62L68k29O2N4ko1Po9n5J31j36J12J29L2m39K71m4J53l39
7896b49K51j80J17n1m10O62j09j05J20J81K7l40J65J30k40q2O9J56k44J75j14
7917g1J63k92J32L53l27Q3j98J96K56l96K15m5r0J64Nk64R8j6M9J15j18j04P9
7940a3L0j08K43j02R5k85P2Q0q4K34p5j63L6j57J91L6N6j79Qj42J04J02K1L3J49
7965A82q2Kr8k8P6k0l08M72j89j7k67K27k9K0P5J36j8j06q0J4q5L73j8j4j47j77
$$ plain form
7803 -106 51 -428 -320 48 27 -28 -184 175 -13 -139 -181 -189 158 267 201 37 43 -58 317 -128 -162 186 200
7826 200 49 178 43 180 -108 268 171 237 -182 23 -111 -76 84 -153 77 106 78 34 -376 40 110 -75
7848 -75 120 72 -123 -123 -2 -138 62 -142 -26 -349 76 -74 -57 -99 -11 -63 -22 131 -93 -267 -185 124 10
7871 10 84 -126 -118 81 68 -194 174 -55 7 61 59 -2 5 -64 -119 12 -124 -12 117 149 -290 -19 -63 90 -249
7896 -249 2 -178 -61 -112 -522 140 31 -74 46 227 254 -86 79 209 -31 -113 -44 112 -132 43 -71
7917 -71 92 -200 -68 285 -42 41 -157 39 295 -101 114 69 -21 143 148 -116 -18 -34 15 130 12 -92 -13
7940 -13 17 -91 152 50 145 -140 -68 12 -72 162 87 -76 -40 -197 -6 30 86 -93 -85 -227 -123 -21 0 33 182
7965 182 100 102 4 -24 52 32 -276 196 7 -10 -277 -50 -79 -59 16 152 134 28 -52 -38 -123 250 232 218 71 -106
7991a06J36j37k48L43l5n8L8K52j59N8o2J91R0l60L67o37K25no1K10p5k9K12j98
8015d8L13l44J02J35J5k10L77k51Qp7o0k9J0p4O8J18M8J09k35J37l20K63j82L38
8039B11l00Q7R6j35j53K54J0k84R6j3J49L78m30J14K1p8j41J63j20r3J42lk59
8062b88j7L39p5k9ro4R9K80r3l08K13L91m95J8J00j40J33Q0k29L64k34l9K5k54
8086b32j12J52M89k84q0K67k06l2O9k14K13o7j5O7Jj50M7P7P3j75L4R6J69j85
8110BJ71j41j51J03O5o0j54J84k31L71j63O9kP7k2k00L0j67K52O9l3p6K54k78
8134c1O0N5M2j94L06l80J58j41J59M6j02P9j69o4L71P4k51l64K14qK11r0j12O0
8158g1J85j57p8R6J17j15J12n0j33M29m68J0J61j25J42j16K31j94o3j75J90L0
$$ plain form
7991 -106 30 -107 -355 -12 -47 -105 -67 185 26 84 22 213 303 -57 310 -327 -102 -107 -168 42 -33 -62 150 -48
8015 -48 265 -79 23 158 173 -37 340 89 97 20 -40 -69 -59 -133 -65 53 101 210 -25 112 -208 55 -127 211
8039 211 -89 -2 94 -41 -194 60 70 -214 -118 -131 18 396 -34 80 101 23 -118 45 -75 -168 -26 -29 -288
8062 -288 -305 34 -41 -70 -79 -143 -44 236 143 -165 48 439 -56 -38 62 -78 55 135 -94 270 36 -3 22 -232
8086 -232 -344 -192 297 13 -67 200 -6 -38 31 -183 30 -37 -52 15 16 -134 -87 -10 63 -112 -78 18 187 2
8110 2 173 32 -119 -16 49 -11 -165 19 -212 159 -4 65 63 140 118 -82 -52 -219 33 102 69 -7 247 -31
8134 -31 29 84 126 -68 238 -142 16 -125 34 80 -22 57 -112 -176 195 269 18 -346 -132 -140 71 -19 -131 -71
8158 -71 114 -43 -121 -25 92 -23 89 39 -94 335 -133 -123 38 -87 55 -61 170 -24 -87 -262 -72 -42
8180d2k79P5K10r1L21k32m2k8L31l34J75
$$ plain form
8180 -42 -321 -246 -36 -127 194 -38 -80 -108 223 -111 64
8191F4
$$ Imaginary data points
##PAGE= N=2
##DATA TABLE= (X++(I..I)), XYDATA
0@%%%%%%%%%%%%%%Qj6J6j6J6k2L0l2L9m7N5o3P2q7R7j08J24j44J66j86K11k39
36a26K68l01L37l76M17m62N14n70O29o98P71q50R37j031J137j253J380j522J681
55H82j859K062k294K563k878L251l706M275n007N993p400R580j3460K2509q8690
70g4179l7791R7013Q817j5588m0141k527J9465L5989N187N871J5946J8273r114
83B7221p055P610J7260m319k3247j7582K2047L1392n797m6458l6576q3K9461K0914
97A4788j0528k4924k848J1344o10q207J0275K1180R271q466q045R530K2688O770
111D2218j9145j6578J2516K6039P485k2811k9524m753J5173K972j6393j1008J886
124a1923j414j2279j2689r90J1481R014r194j5194P346K3499Q575j3041r286J2217
$$ plain form
0 0 0 0 0 0 0 0 0 0 0 0 0 0 0 0 8 -8 8 -8 8 -14 16 -16 23 -24 31 -32 40 -47 50 -58 66 -78 88 -98 113 -126
36 -126 142 -159 178 -198 219 -243 271 -299 330 -368 403 -447 490 -541 596 -657 723 -799 882
55 882 -977 1085 -1209 1354 -1524 1727 -1979 2296 -2711 3282 -4118 5462 -7998 14511 -74179
70 -74179 -111970 -14957 -6140 -21728 -61869 -64396 -44931 -8942 -3755 2116 18062 36335 27221
83 27221 20166 27776 45036 40717 17470 -112 21935 53327 47530 1072 -35504 -35587 -6126 14788
97 14788 4260 -20664 -23512 -12168 -12778 -20985 -10710 10470 19741 11275 3230 12760 35448 42218
111 42218 23073 6495 19011 45050 52535 29724 200 -4553 10620 13592 -2801 -13809 -11923
124 -11923 -13337 -25616 -38305 -39295 -27814 -18800 -27994 -43188 -35842 -12343 -3768 -16809 -26095 -13878
138a3878K3129J2099q321j1100N130J3900K490q988m466N698M451q796j5243l041
152f936J0386L263j3991j3501L060J3462M519j0458j0969N688J7714Q780p618
165C399o193P534J1865K585o112j640P707N886o940j1107k6P825J455j1552j3228
180h542r91J0424K342j3065j2636L019J0395K758p242n171M072Q170K037m893
194i323N6R285O361l903o513L359J0750N101p851r621K210R864L941q574r120
209c978q7P560J144o749n872K359M732k256n936M44P141L981m710o774L007J0352
225D358N179n168p198J631R749M726n071p078J160N590J289o007l406K540J831
240D125l899o395q01N540L198n599p959Q75Q700M295m546n789J198P736M055k939
$$ plain form
138 -13878 9251 21350 13029 1929 7059 20959 23449 14461 9995 15693 20144 11348 -3895 -6936
152 -6936 3450 6713 -7278 -20779 -17719 -4257 262 -10196 -21165 -15477 2237 11017 3399
165 3399 -2794 4740 16605 19190 13078 11438 19145 25031 18091 6984 6958 14783 16238 4686 -8542
180 -8542 -9533 891 3233 -9832 -22468 -19449 -9054 -6296 -13538 -18709 -14637 -6467 -4430 -9323
194 -9323 -9267 18 6379 2476 -4037 -678 10072 15173 7322 -2299 -89 9775 13716 5142 -3978
209 -3978 -4065 3495 4639 -2110 -7982 -5623 -891 -3147 -9083 -8639 -1498 2483 -2227 -9001 -5994 4358
225 4358 9537 4369 -2829 -1198 8551 13277 8206 1128 2288 7878 9167 3160 -246 2294 4125
240 4125 226 -6169 -6970 -1430 1768 -3831 -11790 -10915 -2215 2080 -2466 -8255 -7057 679 4734 1795
256A795m097J984N029O33l618j386L874K691l541o008j76O161L114n008p232R6
272e689O080L483l530n788L34M830K676l257k526K094L270n74l769k81M297K762
288D412l007n022M6N694L621l197n879l00N062L552k776m399N74L241J175k943
304a46j708J418K627j383l901o03L880K846k694n104N5M690L400j980m879j46
320c628M129K794j916k615M28L170J75k273j463K408K678k108l822j76L568K955
336D304k687m523r17L749K911k043l615o21L063J313j421k159P91K603P7k827
352b002n58K886K500j144l355j0L402L227j645l960n84L239K097j106l097m44
368e54J541Q80j873k432J244J414p92k941q15K357K431j353l049m49L086L243
$$ plain form
256 1795 -2302 -318 4711 5344 1726 340 4214 6905 3364 -2644 -2820 3341 6455 1447 -5785 -5689
272 -5689 391 3874 344 -5444 -5110 -280 2396 -861 -3387 -1293 1977 1403 -2366 -2647 1650 4412
288 4412 1405 -3617 -3571 2123 5744 2547 -3332 -3632 1430 4982 2206 -2193 -1619 1622 2797 -146
304 -146 -1854 -436 2191 808 -3093 -3696 184 3030 336 -4768 -4713 -23 3377 1397 -3482 -3628
320 -3628 501 3295 1379 -1236 -808 2362 2537 264 -1199 1209 3887 1779 -2043 -2219 1349 4304
336 4304 1617 -2906 -3823 -74 2837 794 -2821 -3442 -379 934 -487 -2646 -1855 748 825 -2002
352 -2002 -2560 326 2826 1682 -1673 -1683 1719 4946 3301 -659 -1243 1996 4093 2987 -110 -554
368 -554 987 1867 -6 -2438 -1194 220 -572 -3513 -4328 -1971 460 -893 -3942 -4391 -1305 1938
384A938o39k867k99K868K560j088j876O9J740N42k107j224J053J643j469k958
400b114j302J978K429j526l226n84K186K812r09k073l49K725J704k42j120O95
416A084K013J84j464m14J276K260j071k707j491K058J779j437l000j803J529J598
432C94j056k224p07J743N43j256r06Q50J915J55j790l69K305K252j49k113n35
449i48K178K044m35k072j243J204J449j039j538q90R01J00j285j165O56J380l50
466a053j820o11K061K146K9j505l95J922K507J53j138n56J622J014m68j080k65
483B563O45j8j780j726N93J029r73k522j223P94J729m41j860o16J214J911K48
500d33j267o9J354J149m29n51Q78J204J19j503p23Q18J223l76k103j091Q58J230
$$ plain form
384 1938 1299 -1568 -1867 1001 3561 2473 597 666 2406 2948 841 -383 670 2313 844 -2114
400 -2114 -3416 -1438 991 -535 -3761 -4345 -2159 653 -256 -2329 -2678 47 1751 1509 389 1084
416 1084 3097 3281 1817 1403 2679 4939 3868 1161 -330 1728 3507 2070 -930 -2733 -1204 394
432 394 -662 -2886 -3593 -1850 -1307 -2563 -3469 -2619 -704 -549 -2339 -2708 -403 1849 1700 -413 -948
449 -948 1230 3274 2839 767 -476 728 2177 1138 -400 -1290 -389 -289 -1574 -2739 -2083 -703 -1053
466 -1053 -2873 -3484 -1423 723 752 -753 -1148 774 3281 3434 2296 1740 3362 4376 3908 2828 2563
483 2563 3208 3190 1410 -316 277 1306 333 -2189 -3412 -2618 -889 -1330 -3190 -3806 -2592 -681 -433
500 -433 -1700 -1769 -415 734 305 -246 632 1836 1955 452 -271 547 1770 1394 -709 -1800 -942 288
518B88l37j917j073J017R67j50p55l61J067P04l62k64P59J632M19o31k53R87J552
537C289L52j552p57R61J164k03j365j181J44P49p12j097p44L66P5r32j089N69
555a963J238j33j071m92R80J452N51r31q52J044J611J77p60n76L36Q28l64j021
573E4k90M57l06j013q93L75Q27m7j339n78N07J130N83q79l92J041J107O30m08
592E66k26J077M16n02j12L90P09J44o39j100K20R06N8j570j155J80J044J79j133
611e48r69K25Q17n2m33j37M78O46m35m15M89J016M15q77k40J9J066J86p28p29
631b06q8J061k7r39o72J33K09J51q81N1L76J9j90l99K8Q22M42m68m42O32R85M90
653A087m22l67J99J032M7p37j61M5L50j44o00j95L06n1o73m46q0N40L20o83n68
$$ plain form
518 288 -49 -1966 -3039 -2022 -1055 -1205 -1960 -2321 -1254 -550 -912 -1176 -417 1215 1634 1003 750 1737 3289
537 3289 3641 2089 1332 2293 3457 3254 1889 708 852 1601 889 -208 -952 -586 -511 -1443 -2532 -1963
555 -1963 -725 -858 -1929 -2421 -1441 11 562 -369 -1221 -177 1434 1611 851 275 611 1439 1075 54
573 54 -236 221 -85 -1098 -1991 -1616 -789 -836 -2175 -2753 -2246 -1116 -533 -1412 -1804 -763 344 974 566
592 566 340 1417 1833 1331 1219 1609 2318 2462 1823 723 943 1849 1907 337 -818 -638 406 585 -548
611 -548 -1517 -1292 -475 -527 -960 -1097 -619 27 -408 -823 -334 682 1097 220 -20 -1 1065 1251 523 -206
631 -206 -294 767 740 -199 -871 -738 -529 -378 -1259 -1208 -832 -813 -1003 -1402 -1374 -552 -110 -578 -1020 -388 597 1087
653 1087 665 298 497 1529 1576 839 678 723 1073 929 329 134 440 389 -284 -730 -810 -270 50 -633 -1201
674a201M9Q03Q49l54r33L23R15J66j86q3l1M27k55l83l20P25L60p74p63J03O19
695E6N14p45o82j12O37J31k02n97L37N79r8J6l12L45L12K18m92j62R24M6j54n44
717A5j41P30K99n32n89j08O27j22k43l63K94K77l81k81J62J98Q2j77m72J35N56
738c4P05m82o76L01N56J78j38n94K08K46J61j65m46L49K10k25k72j23K40L51n56
759b06m54K6N56L70m09k43k10L40N04k55J2k29J59K41l20K9K71J70j62l02j05
780b17L75L99o83l07l4N37L72m48k48k7L73J89k93p6j41M49m18J09l74L04K75
801A16j81m62m1N03O40l97n31Q2M63M73k46o85J28J81L10j27k26J18J63k96j81
822a96J09N0K74K2p99J66L30K15l1n15l18O81M7k80q6K1L55K37j16j71L51J03
$$ plain form
674 -1201 -1152 -349 500 146 -787 -464 451 617 431 348 317 744 489 106 -214 511 871 97 -666 -563 56
695 56 570 -175 -857 -969 -332 -201 -403 -1000 -663 -84 -182 -166 -478 -133 179 397 -95 -257 667 713 559 15
717 15 -126 604 903 371 -218 -326 301 179 -64 -427 -133 144 -237 -518 -356 -158 -76 -253 -725 -590 -34
738 -34 671 189 -487 -186 370 548 410 -184 24 270 431 266 -180 169 379 154 -118 -241 -1 350 -206
759 -206 -660 -634 -78 292 -117 -360 -570 -230 274 19 31 -198 -39 202 -118 -89 182 352 190 -112 -217
780 -217 158 557 -126 -433 -467 70 442 -6 -254 -281 92 281 -12 -88 -229 220 -198 -89 -463 -159 116
801 116 -65 -527 -568 -65 575 178 -353 -271 192 665 419 -266 -138 43 353 226 0 118 281 -15 -196
822 -196 -87 -37 237 259 -540 -374 -44 171 140 -375 -693 -12 35 -245 -331 -310 45 282 166 -5 346 449
844D49j15l62k75M78M46k94n94j53O47L42k25l46n64M87J03k86o2K18K19j59k55
865c01k02L11M61l08l6K98K30n2Mm68J01K11M1L8m32k2L54J73l21k78J4K65l58
888b77R6k03J83K20l28k28l7L88K11R4m16J62J98J06J07l9j53K79M07k70m47R5
910A48M20l12m34N2J7J68Q3m84k68M20K13J7l15mJ34M35j92k07J88j04M36j58
932B53m8j34N43k23l58l17L08J29j48o47M90j44M29j89l30j84K37K59j82m1j31
953d28N10j21l39L6K90M47j25l09M7j66P48K1l73k82L56j10J07l13rKO6q0k40
976b65j2K7Q1j37LK01K89No02K90p6N18J63k39j48J45K98j26m92N9N31l55Pm99
1000c34K46K16k51k2l67L6j9L55m09j22L01L68k57k89K47J86L7J34K00j70L08
$$ plain form
844 449 334 -28 -303 175 621 327 -267 -420 227 569 344 -2 -566 -79 24 -262 -324 -106 113 -46 -301
865 -301 -503 -192 269 -39 -75 223 453 401 405 -63 38 249 290 328 -104 -126 228 401 80 -198 -184 81 -277
888 -277 -181 -384 -201 19 -309 -537 -574 -186 25 119 -297 -135 63 169 276 237 84 363 770 500 53 148
910 148 568 256 -178 -126 -109 59 142 -342 -610 -190 23 40 -275 -279 -145 290 98 -109 79 -25 411 253
932 253 205 71 614 391 33 -284 24 153 5 -642 -152 -296 133 -56 -386 -570 -333 -74 -256 -297 -428
953 -428 82 -39 -378 -342 -52 395 270 -39 8 -158 590 611 238 -44 312 202 309 -4 -13 -11 55 -25 -265
976 -265 -277 -250 -169 -306 -303 -102 187 192 -410 -120 -196 322 485 246 98 243 541 415 -77 -18 513 158 165 -334
1000 -334 -88 128 -123 -145 -512 -476 -495 -140 -549 -671 -370 -2 -259 -548 -301 -115 -78 56 256 86 394
1021C94k15m13K46K03L12k30n7l41K56N3po8k07Q2j5J24n14r4K81J21j53J88j25
1044a79M31j26R1j50j9N47k61k27J65%k98L38l90j16J62K58k46m1k4l9Qk94Q3
1067c27q0K76r0J01j23j61K57K11M1n4k93L76J35R6l62J68n0Q3j14J61n2k64K86
1090B21o35J33K25q1n7j60K95k18J99JN5p8K23j08p8K22j53J78j7j95P9K98J38
1113D87k2m85J76L6j9o76K91K25N6l31n4J6J27k10J95J11k59M23j52K6k38J69
1135a08mK80m0O5m32L40J77l30N2oJ92j7m37L99l68L46l29J29l7K75k58J33p0
1158d8j16N00m54L04o03L97K60J51m15K29l5j07M2JL04n12J16J86j24l65O7L80
1180A58l03m4K77j4J4r2l43J14K90K47l31l4k18K88m8K59j49PJ62l41N9j43K95
$$ plain form
1021 394 179 -234 12 215 527 297 240 -101 155 208 201 133 -74 8 -7 117 -397 -491 -210 -89 -242 -54 -179
1044 -179 252 126 217 67 48 595 334 107 272 272 -26 312 -78 -194 -32 226 -20 -61 -85 -124 -116 -410 -327
1067 -327 -407 -131 -221 -120 -243 -404 -147 64 105 51 -242 134 269 365 3 171 121 204 90 251 199 -65 221
1090 221 -414 -281 -56 -137 -194 -354 -59 -277 -78 -77 -22 -100 123 15 -63 159 6 184 167 -28 51 349 487
1113 487 465 -20 156 192 173 -503 -212 13 69 -262 -316 -300 -173 -383 -188 -77 -336 87 -65 -39 -277 -108
1135 -108 -112 168 128 193 -239 101 278 -52 0 -6 186 169 -268 131 -237 109 -220 -91 -128 147 -111 22 -48
1158 -48 -164 336 -118 186 -417 -20 240 391 -24 205 170 63 105 106 410 -102 14 200 76 -289 -222 158
1180 158 -145 -189 88 74 88 -4 -347 -233 57 304 -27 -61 -279 9 -39 220 71 78 240 -101 -42 -185 110
1203A10r7Q2m62J44Q2J46J7j15l9nJ57j16k07J07J32K22k89L37j78l52J94P5L0
1226b5R5K5r0j38p1N20l36J32m7oj83L20j05j56K32k76L70j54o6p9J75K4l04J99
1250E6j18J94l6Jl0l42N60k67K0j93J99R7p0j0j23M50k79q7j9K18k15m8LK96n49
1275b92O17j40l5j04Q2Q6k23o9L1J53j90rj06L10J97k47P6m28J54K69j35ql4L5
1299a0K96k49J21j97O5K12k9k43R0k7m2k37J50J59K35m00l0l3Q9J55J2j59m9K86
1323A65J20j03k45J79l71L59k20K14n6K1N9k17r9J90J17l03J21j01P8J94j53N6
1345EQ3O0l01Q2M3n2M9J59r1J9K1j91J8k9J47J13j20qP7j15k1N1j98L96k70J09
1371C6k74J25L7j33L04j1rK7K3O6j53K2l54M19k18J54j62J60J4P9j87K3J40k45
$$ plain form
1203 110 13 95 -367 -223 -141 5 22 -93 -132 -137 20 -96 -303 -196 -64 158 -131 206 28 -324 -130 -55 -25
1226 -25 70 95 5 -133 -204 316 -20 112 65 59 -124 196 91 -65 167 -109 261 107 41 -38 137 161 -143 56
1250 56 -62 132 96 97 67 -275 285 18 38 -155 44 141 71 61 -62 388 109 22 3 221 6 -42 -39 257 -292
1275 -292 325 185 150 46 128 214 -9 -78 -47 106 -84 -93 -199 111 308 61 137 -291 -137 132 -3 -11 -45 -10
1299 -10 286 37 158 -39 26 238 209 -34 56 29 -13 -250 -100 59 294 -106 -136 -169 -80 75 87 -72 -121 165
1323 165 285 182 -63 116 -255 104 -116 98 42 63 122 -95 -194 -4 113 -190 -69 -170 -92 102 -51 5
1345 5 88 148 -153 -71 -28 -80 -31 128 37 56 77 -114 -96 -125 22 135 15 7 84 -31 -52 -1 -199 197 -73 36
1371 36 -238 -113 -76 -209 95 84 75 102 125 191 38 60 -294 125 -93 61 -101 59 73 152 -35 -12 128 -117
1395a17K71j85k8P1j9j53J91k35O2N7M8J2O9K6J29r5j94J45j21J48qm7K2P1j43
1420b3n1L75m04J38jM5j23L67j82j09l26K65k98J09K87K21j91j85K43l08J32j48
1442a67M30k83L14j68l8m8KJ57m15L79m02M07k30k56K38L97p3j94O0k06L52j94
1464F2N9j37K40j2m79J38K5L47j86O7k85K12j32J35j16j28K66k55O7j87R7q6M81
1487A93k76j03K78K6k24K53j21k15K49j07Q5p4j56K44O7j79Q7N2K31j56o3l22
1509b31L42m2j25P1J32k11R8r6L1k14K58r0N6n8J7o2j4N6J97K2l72J10L3J13j2
1534IK98l93j43L12n3k8M4j46K55k57K31q1l2o1j74J48K64r4J65k88k11K19J97
1557A81j76P4j22J39m0k00K77k82J53J41k42J38k93L46k5J08k24k7J35m2j06p
$$ plain form
1395 -117 154 -31 -59 12 -7 -160 31 -204 -142 -85 -37 -25 44 70 199 104 -90 55 -66 82 74 27 49 120 -23
1420 -23 -74 301 -103 35 34 79 -44 323 141 32 -294 -29 -327 -218 69 290 99 -86 157 -151 -19 -167
1442 -167 263 -20 294 126 88 40 42 199 -216 163 -239 168 -62 -318 -80 317 244 50 110 -96 256 62
1464 62 121 -16 224 212 -267 -129 -104 243 57 124 -161 51 -81 54 -62 -190 76 -179 -112 -299 -202 -288 193
1487 193 -83 -186 92 118 -106 147 26 -189 60 -47 38 -36 -192 52 119 -60 27 79 310 154 91 -231
1509 -231 111 69 -56 15 147 -64 34 -62 -31 -245 13 -77 -21 -79 -62 -124 -138 -82 115 137 -235 -125 -92 21 9
1534 9 307 -86 -229 83 30 2 46 -100 155 -102 129 48 16 -45 -219 -71 193 99 264 -24 -235 -16 181
1557 181 5 79 -43 96 56 -144 133 -149 4 145 -97 41 -252 94 69 177 -47 -74 61 19 -87 -94
1579i4M3Q4k9P6j58l75O81k11J29K08k79m03K26K49q9o2l2m7K8j50K71R7k20k46
1603c03K64j05M1K88o00L77M1l7m7P4j42J1J39R9P6k88P8R3p3P9K35q2j55k10
1627a47M89q3k47J05J0l35J41J65J35m72M21k12j24M00k65q0P3l1j76J76n5J32
1649B0J40j05m30M07K27k25Q6o4J10k95K85l18K05J99k99K35m47L12k86L09J35
1670B01q5Kj09J04r3o1J00P1j11k31J2J46o8K46l54L64M5ml08J60Q6o5M0q1j39
1695a32k7P0q0O3J72rp6K15k89Q8J85j17J71m34r0N78k73p8j42J88j5L9r7J35
1719D5P0k6nk9p8k67L28m4l61K49M9K91J26l06Q5j30j06L5K33l80K73M6m1k75
1743b18N76k78p0M8LJ33j94p0N1M5q3Q6n2l43L72o9R8n3k86M36P3j76q8o2M5j59
$$ plain form
1579 -94 -51 33 4 80 -78 -453 228 17 146 354 75 -328 -102 147 58 -4 -36 -83 -55 -205 66 163 -57 -303
1603 -303 -39 -144 -103 185 -415 -38 3 -34 -81 -7 -149 -138 1 100 176 -112 -34 59 -14 65 300 218 63 -147
1627 -147 342 259 12 117 127 -208 -67 98 233 -239 182 -30 -154 246 -19 -99 -26 -57 -233 -57 -112 20
1649 20 160 55 -375 32 259 34 120 56 166 -129 156 -162 43 242 -57 178 -269 43 -243 66 201
1670 201 116 118 9 113 20 -41 59 130 19 -212 -200 -54 -122 124 -230 134 179 175 -133 27 113 48 88 7 -132
1695 -132 -159 -89 -169 -106 66 57 -19 196 -93 -5 180 63 234 -200 -290 288 15 -63 -205 -17 -32 7 -90 45
1719 45 115 89 84 55 -23 -290 38 -6 -367 -118 -69 222 348 42 127 -3 -109 -74 159 -221 52 98 57 -218
1743 -218 358 80 10 58 61 194 0 -70 -19 26 -57 29 -23 -366 6 -63 35 -18 -304 132 205 29 -59 -121 -76 -235
1769b35R9K02Q2j3j63m9K88l29j3O7o4J80Ol28M27j97K26k94K20Oj28o0M8Q0k58
1794b00J36M0J40k31J02Q6Lm00L30Q4k19K12k5J32l39J34j69J05J33j68m5o0L58
1817A39m8k05K06j24k8L02l35J39J34Kq2j46j50M09k53P6l01K83J4l1J45p8j49
1840h1N1K03j46J81j22j56J9j31J71K7j5J21j43n1j82M22q8l7J13l42L72p3j24
1863a1P3o9m5K85m3k54J91K19k54l3l33J51L24j24j92rK46k25K78l75L74j74J29
1886A29r5R2j61K01l23K61r2j7j27K30K8Nr4J12n2j48qj2K7K20o2K7M8q5j61l
1912f0n7M87o92rK34j31K98l35K81J21j11o6k05L26l93J76j4R9K9j84J25L2K8
1935b1j06k4K74k65J82K72r8k12l00L20q6Qr7L75k21j86J33Rk9J45q4J26j77J29
$$ plain form
1769 -235 -136 66 148 135 -28 -77 211 -118 -131 -64 -128 52 58 -270 157 -40 186 -108 112 118 -10 -70 -22 58 -200
1794 -200 -64 -24 116 -115 -13 73 76 -324 6 90 -129 83 58 190 -149 -15 -184 -79 54 -114 -159 -219 139
1817 139 91 -114 92 -32 -60 242 -93 46 180 182 100 -46 -196 213 -40 36 -265 18 32 1 146 68 -81
1840 -81 -30 173 27 208 86 -70 -51 -182 -11 16 1 122 -21 -72 -254 168 80 43 156 -186 186 113 -11
1863 -11 62 -7 -52 233 190 -64 127 346 92 59 -274 -123 201 77 -115 -124 122 -103 175 -200 174 0 129
1886 129 34 126 -35 166 -157 104 12 -5 -132 98 126 131 37 149 97 -51 -59 -71 -44 176 114 141 189 104 -57 -60
1912 -60 -117 370 -322 -331 -97 -228 70 -265 16 137 26 -40 -245 81 -312 -136 -150 -51 -22 -206 -81 -49 -21
1935 -21 -127 -151 123 -142 40 312 214 2 -298 22 -64 -56 -153 222 1 -185 -52 -43 -72 73 -11 115 -62 67
1959F7Nn4L3r7R7k80M15jm01K89L4kk32O8M9r4J65P5l16R6M3J11o3j8j38N4m7
1986a42N0j38K71J07k14NJ58j71K27j43J53L8l51K66l91K16Q4R1k12J06K01K60
2008D71r6l33nr2j36K01j30L04J76k01J25r6p7J67j89n0K70k72p4j72N03j32j92
2031c0K6J46m02M29j26j47Q2Q3j13j24J39O0m7k98J75J06q0rJ20L12l29L7l03
2054b93K80K97j34p5J17j32q9J92l51K10K6J21l9k17Q7J4J1Q8j58P0j09M43k19
2077A40P5k07j42M77l55o5j26O45l20j42k6l7M62l72M8j76J17Q9P3l56K67k96
2099b27P2M10n25M3K90K38m72K73Lk27M83l70N6J64j95L1mJ68k74j5K01j61j9
2122e7KK6l5K25k18K8N1j52pO8o4N9k32J95N8%K95j19j22j53K12k35J46n2O4J57
$$ plain form
1959 67 72 18 51 -46 51 -229 186 185 -216 73 107 105 -127 -59 -10 -104 61 136 -180 -84 -41 70 7 -11 -149 -95 -142
1986 -142 -92 -230 41 148 -66 -61 97 -74 153 10 163 201 -150 116 -275 -59 25 116 -96 10 211 471
2008 471 375 42 37 -55 -191 10 -120 184 360 159 284 188 111 278 89 39 309 37 -37 -209 294 162 -30
2031 -30 -4 142 -260 169 43 -104 -22 61 -52 -176 -37 23 -24 -322 -147 -41 -121 -130 -10 302 -27 10 -293
2054 -293 -13 284 150 75 192 60 -29 163 -188 22 48 169 130 -87 0 14 25 113 -45 25 -84 359 140
2077 140 215 8 -134 343 -12 -77 -203 442 122 -20 -46 -83 379 7 55 -121 -4 85 158 -198 69 -227
2099 -227 -155 255 -270 -227 63 301 -171 102 105 -122 361 -9 47 211 16 47 43 211 -63 -78 123 -38 -57
2122 -57 -55 -29 -64 161 -57 -29 22 -130 -137 -69 -133 -74 -306 -111 -53 -53 242 123 1 -152 60 -175 -29 -81 -17 140
2148A40j83M8J52r8k14L31j15J28j96K2l3k72L00k35J90j7K50k52J83P3j15j71
2170h4J51j01k67L98J78k74L07l79l5O7j9mN0q6k4L6r0k0K22j44J88K5j61K57
2194A91q5Qp6j29K13j74J97K4k53K01r9J11j7l58K73p8j03P1R4k4K6j02J6j99
2218b72K12J27j64l9K43l05K06j75q0L72j39L03n52M31m01Q7M6Lo1M30k23k6q5
2241f2j9J00j42K50j6k03j99K85K9O8l64J41K20k18J63l2j07M42k14j30%j62L37
2264A67m18P5N7K55L6j43l5O3J42k52j5m9P0p1j09K80n4mQ7J00k89K45j28J1J65
2289A86j60K41k87J44j08l10M75m7q3L0J65k69N9j38L0j61K43L5o9R1r7J70K48
2312C88n01o2J29N6J01k77K93n6J4J05p5k38J14J78q8k21N0j23L31j01k5l6P3
$$ plain form
2148 140 -43 5 157 59 -155 176 61 189 -7 15 -18 -290 10 -225 -35 -52 198 -54 129 202 87 -84
2170 -84 67 -34 -301 97 275 1 308 -71 -106 -39 -58 -62 -12 -98 -122 -86 -176 -196 26 -118 70 95 -66 191
2194 191 106 114 38 -91 122 -52 145 169 -84 117 18 129 112 -246 27 -51 -154 -83 11 -13 13 -89 -73 -272
2218 -272 -60 67 -97 -136 107 -198 8 -167 -247 125 -14 289 -263 168 -233 -146 -100 -97 -158 272 49 23 -62
2241 -62 -81 19 -123 127 111 -92 -291 -6 23 91 -273 -132 88 -130 33 1 -106 336 122 -8 -8 -170 167
2264 167 -251 -176 -119 136 172 29 -6 57 199 -53 -68 -117 -47 -118 -227 53 -1 -5 82 182 -107 138 10 21 186
2289 186 26 267 -20 124 16 -294 181 134 51 81 246 -23 36 -102 -72 -233 10 45 -24 67 -30 140 388
2312 388 -113 -175 -46 10 111 -166 127 71 85 190 115 -123 -9 169 81 -140 -90 -213 118 17 -8 -44 29
2335B9Mj68R1j05N2K9o3J04J48k79J93k51J86QP4%j10L3M5N4pj74J18o2p2L0J02
2362Iq2j06J89j26n6k7K38j94K13j91K29J60m35K08q6K27k58K18j16k16K90q1
2384Gm3j26L30j38N4J6j24J80j35j80%O0L09kk62L00m29pK30k81r1M16J12m24
2408b28K6L59l57M60j75j06j27K16j93J34j14K1OL96l11K8K20m13J37J1J02r3
2430aM4j85K73k43R5j0Q7q4o3K21l35L39Ol30o9O1L02k08j07L16l20R4l0K00o9
2455a6j23J32J87k71J94j41Q5j55N1K7k12L06Q7m3p2J8K37k40n9P9K20n53M95
2478B33K79m31j83j45L90j17j38j1L14k82L8K7P9J71k02j73O1J69l04K61k20Q
2500a76M11m6l22jj51L03M27l86j91L92ll29P6m6r7K71j52j4M0k12J66J40r0j64
$$ plain form
2335 29 33 -135 -44 -149 -97 -68 -131 -27 121 -158 35 -216 -30 -22 52 52 -58 -25 20 74 67 -107 11 -51 -123 -93 9
2362 9 -73 -179 10 -116 -172 -199 39 -155 58 -133 96 256 -179 29 -57 170 -88 130 14 -202 88 7
2384 7 -36 -162 168 30 84 100 -24 156 21 -159 -159 -99 210 208 -54 246 -183 -190 40 -241 -332 84 196 -228
2408 -228 -202 157 -200 260 85 -21 -148 68 -125 9 -105 -84 -78 318 7 35 255 -158 -21 -10 92 -1
2430 -1 43 -142 131 -112 -17 -27 60 -24 -87 134 -201 138 144 -186 -255 -194 108 -100 -207 109 -211 -117 -147 53 -16
2455 -16 -139 -7 180 -91 103 -38 47 -108 -57 -30 -242 64 151 108 36 54 291 51 -8 71 291 -262 233
2478 233 512 81 -102 -247 143 26 -112 -123 191 -91 -53 -26 53 224 22 -151 -90 79 -225 36 -184 -176
2500 -176 235 189 -133 -134 -285 18 445 59 -132 260 257 -72 4 -42 -139 132 -20 -34 6 -206 -40 100 10 -154
2524a54K35l87O44k57N4j91j00J54j2K54j38j96J76j08J45k48J55K01k64M8j02
2545i1jK63k43j5m3K65k34J24J07k29N0J85M6j92j39P3j83L54q6j35L2p7M6J06
2569a7q4O0k51K46m2J31j42R3j38Q9K12j37J25j95J31J3J6j71k22R6J24r0R0k14
2593b77L37K46l37K5j15p0N9J59o8o9K18m39K90RJ34j98K93n31J71K06m7l6K8
2616a2N0J09k25J96o6N6o6K16k31r5J21j03J13j91N8q1p8M47l96J19K02Kj46j54
2640a55j74M39j74m6K1Q0R9o4o0j53P1J52k15L63k97M1j12K09k35L5L79j81P3
2663I6q4q9J71R3j7M1l07k4J08J7J1k75J02J44j61J17%n5O2p3K86l00L40OJ5l8
2689A86m50J56P3pp6Q3K35j87J5r2K59k66N3j11L00j36q0K03K35j46j12j59J66
$$ plain form
2524 -154 81 -306 338 81 135 -56 -156 -2 -14 240 102 -94 82 -26 119 -129 26 227 -37 11 -91
2545 -91 -92 171 -72 -87 -130 135 -99 25 132 -97 -47 138 184 -8 -147 -74 -257 97 11 -124 -92 -169 -123 -17
2569 -17 -101 -41 -292 -46 -88 43 -99 -6 -144 -55 157 20 145 -50 81 94 110 -61 -283 -187 -63 -153 -63 -277
2593 -277 60 306 -31 -6 -121 -191 -132 27 -41 -110 108 -331 -41 -32 102 -96 197 -334 -163 43 -4 -40 -12
2616 -12 38 147 -78 118 52 108 42 258 27 -68 53 -50 63 -128 -70 -151 -229 218 -178 -59 143 145 -1 -155
2640 -155 -329 110 -64 -110 -89 -9 90 26 -34 -187 -116 36 -179 184 -113 -72 -184 25 -210 -175 204 23 96
2663 96 12 -77 94 187 170 211 -96 -120 -12 5 16 -259 -157 -13 -174 -57 -57 -112 -50 -123 163 -137 203 209 224 186
2689 186 -264 -108 -35 -42 -118 -35 200 13 28 -64 195 -71 -18 -129 171 35 -45 158 393 247 135 -24 142
2712A42m4j49o3K7j01J40K43k52r7l7M7J61J60n08L61M0n9J08l58k33N68k15o0
2735a79K93l31R5K62r9J38o1k00L02j20r7q4J37r7J06l76N62j34n2k14O3j37J33
2758i0K59m3j19K66l25L7P8j04K64k26p9K07K8l29p9J57L07k51J05k58M6o3J81
2781c1K25k08J72j16k0L12o84L74j17J27q4K0O2k72K12k29J64o4J26M24l24K5
2803I4k49J79o8o5J47k39j00L13m0M1j13K26k76J25O4l39L60k27L1J93q6R4%r6
2827c1L7M7J01k94NK7j26K58Q8r6j03L08J35n01L58j53j48J45k2j1N3J1j77J32
2851D3j04k0m9L0L9O8Nk00K65j80L09l28M02l33J5J17m2O0l3J43j0l19k9J95k67
2876b23K78m7j17O7j66J3L08p4Qj24rk6J69J14rl93L37l91K90j78n0J54J9K29
$$ plain form
2712 142 98 -51 -114 -87 -188 -48 195 -57 -154 -191 -144 17 177 -331 30 70 11 119 -239 -472 96 -119 -179
2735 -179 114 -217 -122 140 41 179 118 -82 220 100 3 -81 56 -41 65 -311 251 117 65 -149 -86 -223 -90
2758 -90 169 126 7 273 -52 -15 63 -41 223 -3 -82 125 153 -176 -255 -98 209 -42 63 -195 -149 -212 -31
2781 -31 194 -14 158 42 22 334 -350 24 -93 34 -50 -30 32 -240 -28 -257 -93 -157 -31 393 69 94
2803 94 -155 24 -44 -109 38 -201 -301 12 -28 13 -100 126 -150 -25 39 -300 60 -167 -136 57 -29 65 65 -31
2827 -31 6 53 154 -140 -135 -108 -234 24 112 16 -87 221 356 -145 213 60 -88 57 35 24 77 88 -89 43
2851 43 -61 -81 -130 -100 -61 7 12 -188 77 -103 206 -122 280 -53 -38 79 37 97 64 207 197 -122 -151 44 -223
2876 -223 55 8 -109 -42 -208 -195 113 39 47 -77 -86 -112 57 171 162 -231 106 -285 5 -173 -223 -69 -50 179
2900A79j06om3J02j35m7j27K09j30L68k81L0J51o8p8j3j76K77j68j10K76j0j00
2923fk09K25k62M12J2mk29K93l24M9j51J40K29m43K19o3Q4K2k30L35q6J46l65
2946b06J17K11L8l21L00l42Q0N6j1J38J17j07o5J87k38J02Q9pk7K9k18K76k29
2969c1N4k2j0J42k89K08r3r3J61R6k74R7o4J72k50M2j13M40l10J72J28j85J9j16
2993a19L39j47N5j30k89L62k88K72Q7l64P6P6l4M38l19j18J72j25K03o1K09l03
3015hoM8k9j25J52Nj60M9q6J31k6K10o1m5l49J43j63J65j03J75J0L76k75k64L97
3040A61k86J57K19l51J4Q9j22J27j9pJ15l20J82r6J91P6j2j95pN5J10k29K4M0
3064h4j95J41J85q1K09k91J32J6K6J47j48j0R2k26K24l44q9K82J02J21k79p3K04
$$ plain form
2900 179 73 67 24 126 -9 -56 -183 26 -104 264 -17 13 164 96 18 5 -171 106 -62 -172 104 94 -6
2923 -6 -215 10 -252 160 172 168 -61 232 -92 -43 -194 -54 175 -268 -49 -112 -28 -6 -236 99 13 159 -206
2946 -206 -89 122 160 -161 139 -203 -123 -67 -78 60 177 70 5 192 -46 56 145 138 111 140 -78 198 -31
2969 -31 23 1 -9 133 -156 52 -41 -134 27 123 -151 -54 -118 54 -196 -154 -267 173 -137 35 163 -22 -3 -119
2993 -119 220 73 128 -2 -291 71 -217 55 142 -222 -146 -70 -104 334 15 -103 69 -56 147 86 295 -8
3015 -8 -14 34 5 -120 32 37 -123 -74 -160 -29 -55 155 94 49 -300 -157 -320 -155 -258 -83 -73 303 28 -236 161
3040 161 -125 32 251 -100 -86 3 -119 8 -11 -18 97 -223 -41 -137 54 130 118 -77 -84 -29 81 -148 -124 -84
3064 -84 -279 -138 47 -34 175 -116 16 32 58 205 57 47 139 -87 137 -207 -296 -14 88 209 -70 -143 61
3087F1q8J93j78K4j10K65q3N5k09Ml0M67m43J30p7L6J17j40Q4k67O6Q2J0k7q6
3112a44J75K1k20K37O9l9L1n4r7P1O6k9j44k42L63K03l88M5l2j1pQ6j57J45Q0
3137B8m4J39l14J84N2Q9n7o9p7j31J99k72J69lN3J45k53L76J34l25K49k4j20j06
3161B2J17j45L0q8J22J0m7J08j31j57L0Q9J72J8k83Q3J84j22j88j16P9J50J52
3184H9k62L37j10j02m3J25Q5J48J42m44o8J48l3J15j76P6Jn3P4K2j60M1j57J6
3208a89K05J30J60k02o4n2K09m9pj41j32M2k8J9L4L0m6J91l4K00j54k83J21O3
3232B3J87k19R4j88LJ59n1J78q6J3j59J71k28q0l6J87P3o5J65k16J9J55j39o8
3256a08K95k69J02j88J26q8k8k11M69J6P3k6k86j86L38jm1Q7j4l4J10j30j38K15
$$ plain form
3087 61 -27 166 -12 12 -98 167 84 139 -70 -66 -96 371 -72 58 -19 17 134 -6 78 -189 -123 -41 -31 -58 -144
3112 -144 31 52 -168 69 138 99 130 76 -21 50 116 87 -57 -299 64 267 -121 -76 -108 -119 -126 -40 -197 -52 28
3137 28 -16 123 -191 -7 45 134 77 8 -69 -200 -1 -273 -104 -107 -54 91 -162 214 348 23 272 248 128 22
3161 22 139 -6 24 -64 58 68 21 129 -2 -159 -129 -40 132 150 -133 -50 134 12 -176 -292 -213 -63 89
3184 89 -173 164 54 -48 -91 34 119 267 409 -35 -103 45 12 127 -49 27 28 -25 49 71 -89 -48 -205 -189
3208 -189 16 146 306 104 40 -12 197 148 141 0 -132 -90 -118 -99 -65 -35 -81 110 76 276 122 -161 -40 23
3232 23 210 -9 85 -103 -100 59 8 186 100 113 -46 125 -103 -183 -219 -32 41 -24 141 -75 -56 99 -40 -108
3256 -108 187 -82 20 -168 -42 -130 -158 -369 100 116 189 163 -123 -309 29 28 -13 74 60 26 136 6 -132 83
3280H3j79O1j55J11J01m7P7j09j36J08J59k08j6J31k67K48K2o2j2J5K05J06j88
3303D8j66J65k58L26k69nJ28R7M6m0j26J84K0k64K11k20P9n4J30r3J38r3K09k70
3327g7rR0k60K11m1J61l12M3K57n7J20K84j93k94M3Q2J6R0j08j74K03j99Q8nR4
3352E3j75J4K19j19k5j79M21k84P5o6J43r2q2J33j97L83l77J90j0j31m2n9N8K66
3376A17j07k15L63k45P7J04J35j87J25k78K03J3r8j70R2j03K79j32K14k28k22
3397b63O16j26j63K08m64J62K17l97J54J54P1j90l09L09j8m1K43j40j94R8K48
3418A75j18q0J71n28K99K21q4N1k30R9m9Q6l83K37RP7k05J59J04r0O5Q3MJ25j74
3443B4K60k96Q6P9k96L3J20q9J1n7k6Q9L5k07N6J72jo9J85j1j02J85k10J9J91
$$ plain form
3280 83 -96 -35 -190 -79 22 -25 52 -57 -193 -85 74 -134 -150 -19 -286 -38 -16 -78 -90 -75 130 236 48
3303 48 -118 47 -211 115 -154 -159 -31 66 112 72 -54 130 150 -114 97 -123 -44 -98 32 -61 77 -16 193 -77
3327 -77 -86 4 -256 -45 -86 75 -237 -194 63 6 126 410 217 -77 -34 48 64 154 46 -128 75 -124 -36 -41 53
3352 53 -122 -108 111 -8 -33 -212 209 -75 0 -66 77 -15 -97 36 -161 222 -155 35 25 -106 -148 -207 -149 117
3376 117 10 -205 158 -87 -10 94 229 42 167 -111 92 105 7 -163 -71 -174 105 -27 187 -41 -263
3397 -263 353 227 64 272 -192 -30 187 -210 -56 98 169 -21 -330 -21 -39 -80 163 23 -171 -73 175
3418 175 57 -23 148 -380 -81 140 56 107 -123 -24 -73 13 -370 -133 -124 -47 -252 -93 11 -79 -14 69 73 198 24
3443 24 284 -12 74 153 -143 -110 10 -79 -68 -125 -151 -62 -27 -234 -178 -6 -7 -76 109 98 -4 181 -29 -10 181
3468A81n9l74L57j60L27l4j41o8j72J94J23l38J52k19N0J59o6L63l10k38M18n3
3490I2j45j0J57J64j62k26L37j00k67m7K65n6r4N7NJ0K5l8l08J99O9r2K72J01
3514B08k82N4l1R0k5Pl3q2K65k37j74J07J33m7L5j19K84k43J11j75J65qJ3j00
3538h4J24l9m8L07l61n8P4L01Q9j21l00j36K23J02j41J20Q6j44p2J30n6k41M15
3561A70k40j81J33K10p1L7J14k00k52J08K00l38K37oJ07j5j6M3j06Q0k8j89J23
3584h0J61p1j5l37J03O23k10l0l79R6K39m9O7j40P5l43J99K22j6p3jJ77l10j83
3608b75K1K66K81n2l29L07j54J4m9J22M6l51M5L97m77J91R5o2j47L8j40L29J68
3631B84l31j06o2L56l89L73L8l19k9J15j42K28j52J2L0k42K38L75l46n5J52k14
$$ plain form
3468 181 122 -252 105 -55 272 238 97 29 -143 51 174 -164 -12 -231 -181 -22 -88 275 -35 -273 145 92
3490 92 -53 -63 94 258 96 -130 207 107 -160 -207 58 2 -92 -35 -30 -20 5 -33 -341 -142 -73 -165 107 208
3514 208 -74 -20 -51 39 14 21 -12 -94 171 -66 -240 -133 0 -47 -12 -131 153 -90 21 -154 11 3 16 -84
3538 -84 40 1 -47 260 -101 -159 -85 216 305 184 -116 -252 -29 73 -68 52 138 -6 -78 52 -4 -245 170
3561 170 -70 -251 -118 92 21 58 172 -28 -280 -172 28 -310 -73 -79 28 13 -3 40 -66 14 -14 -203 -80
3584 -80 81 10 -5 -342 -239 384 174 144 -235 -139 100 51 118 -22 53 -290 -91 131 115 42 41 218 -92 -275
3608 -275 -254 12 293 241 -88 219 65 79 30 152 198 -153 -108 289 -188 3 98 36 -111 -73 -213 116 284
3631 284 -47 -153 -215 141 -248 125 163 -156 -185 -70 -212 16 -136 -124 -94 -336 -98 277 -69 -124 28 -186
3653a86J30k99K50K97j43l01M24k50K6J47l7K14o31K56J80j37Q0l0j98J38L69
3674B99l73K21r7k42O0L0K46l50J25o3L12k08J11J82j17k46K33K4n7p0J4j62j
3697a29K90k44K01JP9m15K76J62l14J02J36j84J13mj49O8Q6j85K13m35J85J56
3719Ij44O3K03M1l92o0L24J8j94J98P6J03k72M4K04k14k55K61lQ7j63j45P9N0
3743h2j06K74k08K77J0j69j27o1K51r5J17J5q9k2k4r3K47l02M32j74P2j79Jj31
3767a66L14k15lK37j0R6o74M09J01o3j75j20L60K5J19k76j31j26M08j5k48J40
3789a3r4J95o1r3l1K31j20k56j6L05J44p2J56l27n9R2N2J52k17j63L48j79P7j07
3813e6J32m1j52M8j35J61J44j52j37J74q5R1Q2j96J19k80L53l08L34L1N1m48L58
$$ plain form
3653 -186 -56 -355 -105 192 49 -252 172 -78 -52 95 58 272 -359 -103 77 -60 20 -10 -208 -70 299
3674 299 -74 147 50 -192 -132 -102 144 -206 -81 -144 168 -40 71 253 136 -110 123 147 90 20 34 -128 -129
3697 -129 161 -83 118 119 198 -217 59 221 -93 9 145 -39 74 70 -79 -11 75 -110 103 -332 -147 9
3719 9 -135 -72 131 172 -220 -280 44 62 -132 66 142 245 -27 17 221 7 -248 13 10 97 -66 -211 -132 -82
3743 -82 -188 86 -122 155 165 -4 -131 -192 59 -36 81 96 7 -15 -39 -132 115 -187 245 71 143 -36 -35 -166
3767 -166 148 -67 -70 167 157 253 -421 -12 89 26 -149 -269 91 116 235 -41 -172 -298 110 95 -153 -13
3789 -13 -107 88 27 -66 -97 134 14 -242 -258 47 191 119 275 -52 -111 -19 33 185 -32 -195 153 -26 51 -56
3813 -56 76 35 -117 -69 -204 -43 101 -51 -188 -14 -99 -8 74 -122 -3 -283 70 -238 96 127 178 -270 88
3836H8k26R7o9J85p2K15Kl05L9rJ26J78m04NJ32O7q0k21K78P9M17p76J33J16j86
3861a91J62J65k71j0J97k48K19j81j5P7K01k50J12K2J71M8k53J12K5L3k75J22
3883b8l4j48k2J64R8J32k63Q7j06N39m73J3K10q8M2k49J36K52j95j2k52J50l9
3906h6J01j68K36O3k21J66j01J45l88L13J69j58m4j74J42Pk26J25M0P8L6j76L2
3929h9L98k0m53J37n2J37R9R8m28k2L99j11K57n49p1M97l38J63j31k28K53N89
3951E35l69j55J78K1j46J24l52K34p9L6r4j4J12k16O6O5J41k95J91l32L53j06
3973a02K36Q2l39MJ80Lm06L23L2K35l59P0K04j73Q3j62m4K94j80Q7k22J39k4O1
3997B2K30k61J7J69k33J70nk40O1K2K5J45j14J95j88K1J02j10K90l07j84P5L7
$$ plain form
3836 88 -138 -41 -110 75 3 218 220 -85 -46 -55 71 249 -155 -150 -18 49 -31 -252 26 105 522 -254 -121 -5 -191
3861 -191 -29 136 -135 -145 52 -196 23 -158 -173 -96 105 -145 -33 -11 160 208 -45 67 92 125 -150 -28
3883 -28 -62 -210 -232 -68 30 162 -101 -14 -120 419 -54 -41 169 81 123 -126 10 262 67 55 -197 -47 -86
3906 -86 15 -153 83 146 -75 91 -10 135 -253 60 229 71 27 -147 -5 2 -224 -99 -59 19 55 -121 -89
3929 -89 309 289 -164 -27 -79 58 157 255 -173 -195 204 93 350 -199 -270 227 -111 52 -79 -307 -54 535
3951 535 166 11 189 210 64 188 -164 70 -9 27 -67 -81 31 -185 -119 -54 87 -208 -17 -349 4 -102
3973 -102 134 216 -123 -119 61 64 -342 -19 13 248 -111 -41 163 -10 73 -89 -133 161 -19 68 -154 -15 -39 22
3997 22 252 -9 8 177 -56 114 109 -131 -70 -48 -23 122 8 203 15 36 138 28 318 11 -173 -98 -61
4020f1q6J01J57j17p6p5L77k36L03l77L7N4nJ6lj1j39L6K73J01n06K61k73M05
4044A56L6M7k95l18Q5M84k44R1P2k57P8j48M34j71j5PO2k46j12L39m1j26O6K37
4068B21l55J30k56N78n0j00n8r8K38l05R6J49j62K39p2j71J94j38o8j91K74j00
4090eP6J9L8j94J38k25L12o3K1l5j43M71n36J14L3M5r5L15k69P2k81n6M42k95
4114a01j06K67k82K70J19j44j25P5K5JJ21k54K3K43rO6j72P1J6Pp6j76K05jJ1
4139G4Q0r5j7m6K12n5k27l0K31Mk39L0K70N9m40L64n7R9o5l51L01R4k97p6J66
4164a1J36l53K80k88N7M09l41R9J26o4l06J05L63k55r5K49j70OJ79k49J21K75
4186B73k34m0l9J3J98l44K96l8J53j75K3J9k67K70J6k62L21l92J67j67J12rj67
$$ plain form
4020 -61 -147 -46 111 -6 -82 -157 220 -16 287 -90 -53 1 -4 12 9 -2 -141 -105 168 269 -237 24 -249 156
4044 156 192 239 -56 -374 -289 195 -49 42 114 -143 -65 -213 221 50 35 42 104 -142 -254 85 44 -82 -16 221
4068 221 -134 -4 -260 318 268 168 110 12 250 -55 41 190 28 267 195 24 218 80 12 -179 95 -5
4090 -5 71 90 128 -66 72 -153 159 96 117 82 -61 410 -126 -12 21 66 -29 286 17 89 -192 -248 194 -101
4114 -101 -207 60 -222 48 167 23 -102 -27 -2 -1 120 -134 -111 132 123 189 17 88 104 111 35 -141 64 63 74
4139 74 154 59 42 -4 208 153 -74 -104 127 131 -108 -78 192 251 -189 175 118 217 152 -199 102 196 -101 -177 -11
4164 -11 125 -228 52 -236 -179 230 -111 -12 114 50 -256 -151 212 -43 -138 111 -59 -53 126 -123 -2 273
4186 273 39 -1 -40 -27 171 -173 123 85 238 63 86 105 -162 108 124 -138 183 -209 -42 -209 -97 -106 -273
4209b73P4J30L3K63k78k8L05l13L28l22M4k5R0k42L05k16j65K64o5J61pM6k07
4232i8PJK3l8K40OK6j87p5L28l9Q8m85J29J78rJ0N5m5l49K13O2j38M2J74j57J16
4259G8J55l25R3l00M00K10k91q0J26j62O0q7K08j24M9j9M1J77j87M1J0l08M71
4282B36k44J84j19J09j93j86L06n4k01K54k1Q4j04R3k90L7J32j62K36j39L09j51
4304A16J15l9j17o9Q5j23j13J37p4pJ6p2J69mL43m69R9j14L5j73K50o1J68o7k39
4329b08L43m9NM4k56L36l60L58k09q2J51k1k09J27j08K09k08k3M77n00L35nl32
4352a85K11l17J43K34j4R0j25n3K75n12J45R6J70j41j73L64l81P9p3K26j11L9
4374a3k1j12J53n3l2K98p4k03l1M7j63J52J15j81J68R8k33k01K01J32j86k3L09
$$ plain form
4209 -273 -199 -69 -36 227 -51 -79 226 -87 241 -81 -37 -62 28 -214 91 -125 -290 -26 -91 70 63 109 -98
4232 -98 -91 -90 -67 -105 135 141 167 -20 -95 233 194 282 -203 -74 104 95 105 160 115 -234 -21 41 -97 -55 119 -38 78
4259 78 233 -92 1 -299 101 311 20 -60 66 -96 -36 -123 85 -39 10 -9 32 209 22 63 73 -235 236
4282 236 -8 176 57 166 -27 -213 93 39 -162 92 71 155 51 144 -146 -109 23 -139 97 -42 267 116
4304 116 231 192 75 6 91 -32 -145 -8 -82 -89 -73 -145 24 20 363 -106 -7 -121 -86 -259 -9 -70 98 31 -208
4329 -208 135 86 91 135 -121 215 -145 213 4 -78 73 52 -157 -30 -138 71 -137 -160 317 -183 152 147 -185
4352 -185 26 -291 -148 86 72 162 37 -16 259 -253 -108 -12 158 17 -156 208 -173 -94 -167 59 -52 -13
4374 -13 -34 -146 7 -46 -78 220 146 -57 -88 -41 -204 -52 63 -118 50 148 -85 -286 -85 47 -139 -162 147
4397A47J3m5k22O1n8J12k3J45q5j52K96m30J64K2m7J50m00N61J26n77L71l18n3
4420b42J08J25L1K13l36J79k93J36j08J72J97j57j1r2P6J41k48j36L18k47O9K65
4442A60j41j41J1M7K27k87K07j20j15M11k19K12k7k45o7K97k11k4o8j41o4J09
4464a89p3J18J02J82j31M5j75K20l61K22o4k52L81k54J79k4m7M8K95k10R5l3k33
4487a59K4L47m36O6L71k43N2N8K02k97K8j45J30N5k05K62j45L23p7k90J49j5K7
4510H2o6r4J15j07M2Q5k65J08j1k8K57J09l40L7j4J73j10O6m1n5J45p2N2j00j10
4535a42J65J90l32M9K63j07K10l64nJ79k61J38o0P4K3k57K13K08r7k40M5L80p3
4558A99k26l1Q0R9j32j8J31j32j15K15j03K98j20Q3l12q7J57M2r6J86m9n8K19
$$ plain form
4397 147 160 115 -107 -46 -104 8 -15 130 45 -107 189 -241 -77 -55 -102 48 -352 209 335 -242 129 -189 -242
4420 -242 -134 -9 22 235 -101 78 -215 -79 -187 -15 182 25 14 -78 -2 139 -109 -245 73 -174 -105 160
4442 160 19 -122 -111 -64 163 -124 83 -37 -152 259 40 252 225 -20 -87 210 -1 -25 -93 -234 -298 -189
4464 -189 -262 -144 -42 140 9 54 -121 99 -262 -40 -104 -356 25 -229 -50 -74 -121 -73 222 12 107 74 -159
4487 -159 -135 212 -224 -158 213 -30 22 80 282 -15 13 -132 -2 53 -152 110 -35 288 211 -79 70 55 82
4510 82 16 -78 37 -70 -28 57 -208 -100 -111 -139 118 227 -113 -76 -90 83 -27 39 -2 -57 88 16 68 -32 -142
4535 -142 23 213 -119 -70 193 86 296 -68 -73 106 -155 -17 -77 -3 20 -237 -24 184 87 -153 -108 272 199
4558 199 -27 -58 22 121 -11 -29 102 -30 -145 70 -33 265 145 228 -84 -171 -14 28 -68 118 69 11 230
4581B30l34J75q5k81M97k75k7Q3P7m9N3l3L4k29J74m1J01j07j07j29L06N8po7
4605A7j05J37l6po7O9j8r6K06j78k7oJ26K54n17M76l88jJ54J14j68nJ29l8P4q4
4631A5J06k20j10Q9L58j90k62K80p4j76K51Q7l87L66q5K07k05l31M32m20N26l49
4653i2J6pj0L1J3K38k99l2m4J43j26J29O1k4J16Jq6K2P6k13J76K65l73k16M41
4678B06n0l15M48l52J35L3j94N3L3Q7j01j55J8J26Q8K54n47k7L28J20J50l22k83
4701b67M54l83K09k08L9PK35j57J22j15m3L4q4K16J35j68m2p6K10j85o9OJ97q5
4725a8J6o8K33k07J56j10M0J87l53N0j67K67K62j97j77J55q6O3l1j41o7K52l24
4748b65M53k17RK6r1J67M2k43M1K13l18K94l34J43J10j7P2m9j20k87L44J91j45
$$ plain form
4581 230 -104 71 -14 -295 202 -73 -100 -17 60 11 64 31 65 -164 10 -31 70 -37 -144 -273 33 91 84 17
4605 17 -88 49 13 6 -61 8 -10 -106 100 -78 -105 -111 15 269 -248 228 -160 -161 -7 107 -61 -66 63 25 99 15
4631 15 121 -99 -209 -120 238 48 -214 66 -8 -184 67 154 -233 133 48 255 50 -281 151 -269 257 -92
4653 -92 -76 -83 -93 -62 -49 189 -110 -142 -186 -43 -169 -40 21 -3 113 114 28 50 126 -87 89 354 -19 -235 206
4678 206 156 -159 289 -63 72 105 -89 -36 -3 84 -17 -172 -154 -28 60 314 -233 -260 68 188 338 16 -267
4701 -267 187 -196 13 -195 -156 -149 86 -71 51 -64 -107 -73 -157 59 194 26 -16 -92 118 -67 -136 -130 67 -18
4725 -18 -2 -70 163 -44 112 2 42 229 -124 -74 -241 26 288 91 -86 69 -17 46 15 -126 -193 59 -265
4748 -265 188 -29 -20 6 -85 82 124 -119 -78 135 -183 111 -223 -80 30 13 85 36 -84 -371 -27 164 19
4771A9j06N4RK76k42k01J78k3P8K18j72l20L06K71o25K39J60k33J52l2J67k28
4793e5j53R7K21Q7k40o3M35k45k67m4o8J4M29o3k58J26J61j22o7j00J29M7p2M2
4817b9l5K46l66J20K28k12o8lO2KJ41N6m36O27m85L21l18K31rk87K68k15L26o6
4841I9j19J47j6j48L52m66J27J6J80j40M6l8L8j97K21q6J75p2j12o4M9J63j89
4864c4J33n2o2r1K32n21L86RJ31O4J5k02P1k18M79j4m49K63Jm16J65j5J88j50
4888h7J49J88k58k42J14J11p1K35l0l68K41M5j03PJ05K34J79m60P6j53j42J79
4910e1L9J26k22K47j4Q8l26K07m33L70j53J76j81J44j75M13j45%j08J28L3q3j07
4933b7j23J97M3j25L1L4K09j89N3J71j64Q7j36L6q8J01k32J37J30j91J59k30l5
$$ plain form
4771 19 -87 -33 -24 252 10 -191 -13 -36 42 260 88 -232 74 345 -280 -41 119 -114 38 6 173 -55
4793 -55 -208 -111 110 197 -43 -106 329 84 -183 -227 -295 -281 148 85 -173 -47 114 -8 -75 -175 -46 1 -71 -29
4817 -29 -64 182 -184 -64 164 -48 -116 -119 -57 -55 86 142 -294 333 -152 169 -149 82 73 -214 54 -161 165 99
4841 99 -20 127 111 -37 315 -151 -24 -8 172 32 78 40 78 -119 102 16 191 119 7 -57 -8 155 -34
4864 -34 99 47 -15 -106 126 -395 -9 0 131 195 210 8 79 -139 340 326 -123 140 141 -275 -110 -125 63 -87
4888 -87 62 250 -8 -250 -136 -25 -96 139 109 -259 -18 27 -76 -69 36 270 449 -11 65 -88 -230 -51
4910 -51 -12 114 -108 139 125 213 -113 94 -339 31 -122 54 -127 17 -158 255 110 110 2 130 163 80 -27
4933 -27 -150 47 90 -35 -4 30 239 50 103 274 110 197 61 97 9 110 -122 15 145 -46 113 -117 -152
4956a52K40J39j63p0l0L14k99k3J41pJ07l01j41L22P1m16L88k47j12K53j49M20
4978B85k92O3no4m7P5J96j07j93K3mp5M8J12j36K29j42J93j90O9J3r2J1j29J75
5003A6j66J61o9J29j1J02j63Q8l6k83M21Q0m55J82L7R0n2j63J42J06j41q1K10
5026A44k56L6k83L79k90K26J7J35l03l5J87j10K82J36j69N4L0k40J95p6pK5K26
5049C03l14k4k10K67k2k19K04L8L0k56L54l70N75n50J13o8K35p5l19M69j43jj0
5072Gj54M15j05j03k17L27l00J63O3j62L44m80JK32R0n4L04l66J78k1p3j66R4
5095A7m1O7J31P7j25k2j15J88k55r4K76J67j55l08K47Q7r3O7j95o0L27j82O0K6
5119I2k46P5J43k59J69J48L2P4k08M7K4L6oK5j76k39P5o3L46p3K0j81J14K35k67
$$ plain form
4956 -152 88 227 64 -6 -36 278 -21 -44 97 90 197 -104 -245 77 148 -268 120 -127 -239 14 -135 285
4978 285 -7 56 51 -13 -60 15 211 104 -89 -66 -70 -145 -97 15 -121 108 -34 159 -31 38 51 -41 -30 -159 16
5003 16 -150 11 -58 71 60 162 -1 87 51 -232 189 269 -186 -4 33 123 71 -92 50 156 15 -66 144
5026 144 -112 -76 -359 20 -270 -44 -27 108 -195 -230 -43 -153 129 265 96 150 180 -60 135 59 52 77 303
5049 303 -11 -35 -245 22 0 -219 -15 23 53 -203 151 -219 356 -194 -81 -149 86 11 -308 161 18 17 7
5072 7 -147 268 163 60 -157 170 -130 33 96 -66 278 -202 -201 31 121 67 371 5 183 162 89 -77 17
5095 17 -24 43 174 251 126 104 -11 177 -78 -172 104 271 116 -192 55 142 49 116 -79 -139 188 6 66 92
5119 92 -154 -79 64 -195 -26 122 154 228 20 67 91 127 121 146 -30 -269 -194 -257 89 16 36 -145 -31 204 -63
5144f3M3R5k60L1J27J63j90M7r4N6l5K85j23k08M58l86K47j23k0N8K8j35L31m26
5168i4r3J75l4K22j21j79L11p0p1m6j11O2Rk8j08J04L05k68L9K7l47K45j37L55
5192A47j92J83j64J95l04J40J81o4k0j54J03n8m3M1N0j06Q5J11j88n0Q8j88K57
5215E0k56K70n5k98J96J49J86K2k68J05k81n1L43K14j9k40J10k2J14k77P9j09
5237c8J21j49Qm8K98j38J24l10J88k24R7N5O6J54l08r4M27q2k00K13k50k1J33
5260B2l8j4R7Q2r5K0J11P3l8r7m2nm83N83j4k52m8M7p2J95r1j07r6M08J18m21
5286a57L7L42k24j00L57m01L77l53J27M6oN0Q4j96L09n74L45j71K79k94K65j62
5308b0J24n5J28KJ11k47m7q0P9o5L16L1l66l5K1J89j41k3K92k98%J61j36J76r7
$$ plain form
5144 -63 -20 75 -185 -154 -27 136 -54 -7 -101 -45 -80 205 82 -126 332 -54 193 70 50 108 136 1 332 -94
5168 -94 -187 -12 -46 176 55 -124 187 117 46 0 -111 -49 -40 -68 -176 -72 233 -35 4 31 -316 -71 -208 147
5192 147 -45 138 -26 169 -135 5 186 122 102 -52 51 -7 -50 -9 41 -65 20 131 -57 -107 -19 -207 50
5215 50 -206 64 9 -289 -93 56 242 264 -4 101 -180 -231 112 326 307 67 177 155 269 -8 71 -38
5237 -38 83 -66 -58 -106 192 54 178 -132 56 -168 -71 -16 50 204 -104 -198 229 147 -53 160 -90 -111 22
5260 22 -16 -30 67 149 54 74 185 258 220 123 81 76 -407 176 162 -90 -138 -91 -163 32 -59 -166 -262 146 264 -157
5286 -157 -120 222 -2 -102 255 -146 231 -122 5 51 45 95 179 -17 292 -282 63 -108 171 -123 142 -20
5308 -20 104 49 177 179 290 43 -4 -84 -5 -70 246 277 -89 -124 -103 86 -55 -78 214 -84 -84 77 -59 117 20
5333B0J57l26j64K84J62k03K90l48R6j40J59p6R5O9j52K9O1n5k03K71O3j74K26
5356A41k63K97l4k71J18j43L27l68Q7L24j27N6P3l00M65n71K92k89J93J47k73
5377a19K22r9Q4k59J39k41M70j69o4j42j19J74J57M4n2j07Q1R7k92MK4j26M23
5400A30J29j67j46J98K00l81j03J70J24q6j13J75p1j0P0J57o1j74q9l0L5L9K34
5423B30l28J93n0l01L79j3l76J31O4j7J85OJ38j72k46k8M06l70L62k69M05l70
5445d1L9k35K88L10m78L05j11j07m5k8mJ37k4k8j31M7J64q9Q8j08R9O7m24K19
5469i0j20J40L38j56k42J46l12N7J23M6Q1J20k28N9O2l6J3K1NK88j49M0j23R1
5493A74j96K57n22L42j94K38L7k37J16M0j3J91j35l79K78j0K9m17L71n2M0J58
$$ plain form
5333 20 177 -149 -313 -29 133 -70 220 -128 -32 -172 -13 -89 6 75 -77 -48 13 -42 -245 26 89 -85 141
5356 141 -122 175 141 -130 -12 -155 172 -196 -109 215 88 144 217 -83 382 -189 103 -186 7 154 -119
5377 -119 103 4 88 -171 -32 -273 197 28 -36 -178 -297 -123 34 78 26 -81 0 97 -195 -191 -167 -293 130
5400 130 259 92 -54 144 344 -37 -140 30 154 68 -45 130 59 49 119 276 215 41 -48 -78 -43 -4 230
5423 230 -98 95 45 -256 123 110 -266 -135 -71 -88 97 103 241 69 -177 -205 201 -169 193 -76 329 -41
5445 -41 -2 -237 51 361 -117 188 77 -30 -75 -103 -107 30 6 -22 -153 -106 58 -31 57 -51 48 115 -309 -90
5469 -90 -210 -70 268 112 -130 16 -296 -239 -116 -70 11 131 -97 -38 24 -12 1 22 27 315 166 206 83 174
5493 174 -22 235 -287 55 -139 99 136 -101 15 55 42 233 98 -281 -3 -13 16 -401 -30 -82 -42 116
5515A16l23K94n3j39K51k68J97K4k21J45j89N7Q8Q4m7J64k37m5K54m8J45k06r5
5538e2K97k77j18K82k02J00J60l68J53L8J8N9n5L0j5j45L2L67j88lnJ2k8m9p6
5563c3Ll6P0k54L41p9l97K43J73O3l16L63j16J45J29l25L83m04K41m4j26N2q2
5586fk16J64r1L27j9j02j51j79M51k89k4K5j94L33j42R2l02M95p4k15J37K03l14
5609i1P2j03N3j06K68p0R6l8j15k39J88K90k70J24J40j68k8q6Q5K8r8q0L06k10
5633e2J56L2m16M66k43L76j73n9k4k26L87j89K0m4R4j02j20K18m38L66N1k52P9
5656i3M2J43j22K4j74K83p0J06j15o7j42J43J09j15J16l9K27m40J73j57K44Oj61
5679g9J17j23M0M7O0p4P6NLk41J53J17j44M1k34M12l41J65q0R2r7J98l08L46j9
$$ plain form
5515 116 -207 87 34 -105 146 -122 75 99 -122 23 -166 -109 -21 63 16 180 -57 -102 152 104 249 43 -52
5538 -52 245 -32 -150 132 -70 30 190 -178 -25 13 31 90 35 65 50 -95 -63 304 116 113 108 120 92 43 -33
5563 -33 -30 -66 4 -250 91 12 -385 -142 31 94 -222 141 25 170 299 -26 357 -47 194 150 24 76 -6
5586 -6 -222 -58 -149 178 159 57 -94 -273 178 -111 -135 -110 -304 29 -113 -21 -323 172 98 -117 20 223 -91
5609 -91 -19 -122 -69 -175 93 23 119 81 -34 -273 -85 205 -65 59 199 31 3 -83 2 30 -68 -148 158 -52
5633 -52 104 136 -280 186 -57 319 146 87 63 -163 224 35 55 11 105 3 -117 101 -337 29 80 -172 -93
5656 -93 -51 92 -30 -6 -180 103 33 139 24 -43 -185 -42 67 -48 68 29 256 -184 -11 -168 76 82 -79
5679 -79 38 -85 -45 2 62 -12 64 69 72 -169 -16 101 -43 -2 -236 176 -165 0 -80 12 -85 113 -195 151 132
5704A32jq4j59J94o7JJ17l13J97J39j38J75rO1k88j57J37O2P1k3j38M2j10J43
5728a6q7k5N6J13j84M33j3q2mo2l34M29l15L78k1l47K60l27j03M14k02J15r7j50
5752a71K98k68j5O1K59j94k22K96M5Jk41K91J11j48K6k81M2Q1j11K95J37j21j15
5775E6L9j89j50K67j54J91j1j47Q5m6K26j83L9M2L1n6O7j44j6MK60q8j97r2K7
5800a39J12n4J26N7J48k20k47K84j84K14n8j30K3J08j4j55L0K65j25qkk61J96
5823c4R9j01K34j58m8M5k15M1J65J25k71K75l10O8N1j7p5P7K2m17O81m38J42J
5847e8J76%m12L04j4j85L28r6k53K35J38k43L7J36NL3r7j56O4q7J79J8K1J97j12
5872A58l87J00J28j22K22l67K28J57k3j48K57j85j3J9K68m30LQ5pJ57k90L87j0
$$ plain form
5704 132 131 47 -112 82 15 16 133 -180 17 156 18 193 184 245 -43 -200 -63 -1 70 47 -91 -49 -159 -16
5728 -16 -103 -128 -72 41 -143 290 277 195 191 129 -205 224 -91 287 266 -81 179 -148 -251 163 -39 76 -21 -171
5752 -171 127 -141 -156 -95 164 -30 -252 44 89 90 -151 140 251 103 129 -152 -110 -29 -140 155 292 171 56
5775 56 95 -94 -244 23 -131 60 49 -98 -13 -59 167 -16 23 65 96 40 107 -37 -53 -49 211 123 -74 -166 -139
5800 -139 -27 -81 45 102 250 30 -217 67 -117 97 39 -91 -68 40 26 -129 -99 166 41 33 31 -230 -34
5823 -34 65 -36 198 40 -8 37 -178 -137 28 153 -118 157 -153 -85 -34 -51 -126 -49 -27 -444 237 -201 -59 -58
5847 -58 118 118 -294 10 -4 -189 139 43 -210 25 163 -80 -43 93 98 131 34 -122 -58 -145 34 52 73 270 158
5872 158 -229 -129 -1 -123 99 -268 -40 117 94 -54 203 18 5 24 292 -138 -135 -50 -57 100 -190 197 187
5895A87j72J7O8J51l15j0j5O7J19k9J01l59K27r4m9J01n6J49p9J34m5q7p1L92
5919C32m54l00L19Q5j57Q9K47m4K03l74J31j18J48p1J63j28k60L04j14pJ08k54
5941a52J18NJ8k00J36J8K76l77J95j04o1J02j32J86j42O5O6J88l49L1J3J26q8
5964f2K20k62J14J49l85L10N2k76L88j68j7j35l47M58j82r8l8L43P3m67N23j93
5986@R9p9J44j13q2j80m5J09O3K29J30k96KJ22q1J64j18L3j16nn0j26K94j50m
6011e6M3l66M87j2j14o4j8J68J90l85L44j40j40J46Ll10K80J0j02N9P5J27n27
6034c02N52n33J94R7J21k81K32J04k95k3Q4j14P4N3J77k34q5R0J10k41K12j9R0
6057F3j75Pj01R4Q6p2RJ82k54J01K43k88K86J43l39j73M63k14p7L27l20l8K78
$$ plain form
5895 187 15 32 100 251 -64 -74 -89 -22 97 68 169 -190 37 -57 -106 -5 -61 88 9 143 98 11 -60 332
5919 332 -122 -422 -103 -18 -175 -86 161 117 320 -54 77 -41 107 36 199 71 -189 115 1 -6 102 -152
5941 -152 -34 -29 -11 -211 -75 -57 219 -158 37 -67 -128 -26 -158 28 -114 -49 17 205 -144 -113 -100 26 -62
5964 -62 158 -104 10 159 -226 84 136 -140 248 80 63 -72 -419 39 -143 -241 -279 64 137 -330 193 0
5986 0 99 20 164 51 -31 -211 -256 -147 -84 145 275 -21 -19 103 22 186 68 101 -15 -20 -70 -196 98 -52 -56
6011 -56 -13 -379 108 96 -18 -82 -100 68 258 -127 217 77 -63 83 86 -224 56 66 -36 23 98 225 -302
6034 -302 250 -283 -89 8 129 -152 80 184 -111 -134 -50 -164 -90 -37 140 -94 -179 -89 21 -220 -8 -27 63
6057 63 -112 -105 -206 -112 -26 -98 -89 93 -161 -60 183 -105 181 324 -15 -188 275 61 -16 311 -9 -47 231
6080B31j27l18K73n2l60N05m22oM09j56M9j79K9N3M8P1l73J50L3J24J36L1j59
6103a0n9K15j53J19N7k09J94j93M36r2j72K05k62o8j67J53k6NJ68K1j11Ol10K22
6127c1N2J3oj28K79k23J35L9j60K12l31J59l01M60l34K37n1P8j25o2jj41M48m04
6151a86o1J13K99l99M8j01L72q4k52L21k42K04P2J82j58j83K2R7r1J05k03J02
6173b3J0J59q4J38j04l81L39q7n7o0J23K40j30K6J1j38J55k31J7K71k11K8R7k76
6197a68j1K54q5J39k26K3R8j10r2OK79N6l82J49k36L40N3J40k44r5j71K13J0J01
6221D1L7j89M3O0J04L2j01j52O6M2j38L3M31l27j00M7r8J36m0K32l15K26j79J44
6245C5l28M64j21k20r8N7K70q4k7p1K30l20jK20J69l29K76r4j98PJ84J37J77j16
$$ plain form
6080 231 104 -214 59 7 -353 152 -270 -276 133 -23 26 -153 -124 -71 -23 48 -325 -175 -142 -18 118 149 -10
6103 -10 -69 146 -7 112 169 -40 154 -39 397 305 133 338 76 8 -159 -6 -32 -27 141 162 51 57 -253 -31
6127 -31 21 34 28 -100 179 -44 91 130 -30 182 -149 10 -291 169 -165 72 21 99 -26 -88 -89 -230 218 -186
6151 -186 -247 -134 165 -234 -186 -287 85 1 -251 70 -172 32 104 286 128 -55 -33 64 -27 78 -125 -23
6173 -23 -13 146 62 200 96 -285 54 -33 -90 -150 -27 213 83 109 120 -18 137 -94 -77 194 -17 11 108 -168
6197 -168 -179 75 -10 129 -97 -74 24 -86 -178 -172 107 163 -219 -70 -306 34 87 227 -17 -112 -283 -70 -60 41
6221 41 78 -111 -68 -8 96 128 27 -125 -59 -17 -155 -122 309 -18 -118 -71 -169 -33 -73 159 -156 70 -109 35
6245 35 -293 171 50 -170 -268 -211 59 -25 -52 -123 107 -213 -214 6 175 -154 122 28 -170 -163 21 158 335 219
6269B19k79J9J8J33j50J07o4N1k9m1M5J00j51N2Q1j81K46l76QJ68j48M86k33p1
6293A0j14K24k64m3J12OJ99j32j56K3J44J91l51P1J63Q9l20M90l05N1n4q0N6n9
6317d9j40K11J53k95J22r6N0Q5L4k14j48J29o5J2L63J21j09j05j98p9L51r6j9
6340A8j44J7o9K41J47j20k99L00j66P3Lj23K33k65M58l2k57p0J06j06J0M06l31
6363C0kJ59q7l28j9L24k03N2R2k1j05J68J6j22N9k26J81p9J78k07K19p2k18K07
$$ plain form
6269 219 -60 -41 -23 110 -40 67 3 54 25 -16 29 129 -22 30 111 -70 176 -200 -192 -24 -172 314 81 10
6293 10 -104 120 -144 -187 -75 -69 130 -2 -158 -135 9 200 -151 -80 83 172 -148 342 37 88 34 -46 10 -49
6317 -49 -189 22 175 -120 2 -94 -44 41 75 -139 -287 -158 -223 -211 152 273 164 59 -139 -218 133 37 18
6340 18 -126 -109 -178 63 210 90 -209 91 -75 -2 1 -122 111 -154 304 272 15 -55 51 -55 -45 361 30
6363 30 28 187 100 -228 -247 77 -126 -74 18 -3 -108 60 76 -46 13 -213 -32 -111 67 -140 79 7 -211 -4
$$ [...]
8191D9
##END NTUPLES=NMR FID
##END=
