##TITLE=1H_LR-758-R3-K6RC3
 CDCl3
 8 sc, 
 28.11.2023
##JCAMPDX= 6.0         $$ Bruker NMR JCAMP-DX V2.0
##DATA TYPE= NMR FID
##DATA CLASS= NTUPLES
##ORIGIN= UXNMR, Bruker Analytische Messtechnik GmbH
##OWNER= root
$$ XWIN-NMR		Version 3.5
$$ Tue Nov 28 16:18:29 2023 Russian Standard Time (UT+4h)  she@DPX200
##.OBSERVE FREQUENCY= 200.1313
##.OBSERVE NUCLEUS= ^1H
##.DELAY= (6, 6)
##.ACQUISITION MODE= SIMULTANEOUS
##.ACQUISITION SCHEME= undefined
##.AVERAGES= 8
##.DIGITISER RES= 18
##SPECTROMETER/DATA SYSTEM= spect
##.PULSE SEQUENCE= zg30
##.SOLVENT NAME= CDCl3
##.SHIFT REFERENCE= (INTERNAL, CDCl3, 0, 15.7039)
##AUDIT TRAIL= $$ (NUMBER, WHEN, WHO, WHERE, WHAT)
$$ ##TITLE= Audit trail, XWIN-NMR		Version 3.5
$$ ##JCAMPDX= 5.01
$$ ##ORIGIN= Bruker BioSpin GmbH
$$ ##OWNER= she
$$ F:/spectra/data/she/nmr/H-F/1/audita.txt
$$ ##AUDIT TRAIL=  $$ (NUMBER, WHEN, WHO, WHERE, WHAT)
(   1,<2023-11-28 16:17:08.46 +0400>,<she>,<DPX200>,
      <created by zg, POWCHK disabled, PULCHK disabled
       configuration hash MD5:
       00 E9 B6 7A A2 85 ED C7 34 08 36 98 17 FE 4E 26
       data hash MD5: 16K
       2E 4A 93 C4 B1 EA D3 8E 1D 99 5E E1 2A 00 4F C1>)
$$ ##END=
$$ 
$$ hash MD5
$$ 9A 56 B5 5C 91 7A C2 25 57 51 70 5A 18 38 30 B4
##$RELAX= 
##$RELAX= 
##$RELAX= 
##$RELAX= 
##$RELAX= 
##$RELAX= 
$$ Bruker specific parameters
$$ --------------------------
##$DU= <F:/spectra>
##$EXPNO= 1
##$NAME= <H-F>
##$PROCNO= 1
##$TYPE= <nmr>
##$USER= <she>
##$AMP= (0..31)
100 100 100 100 100 100 100 100 100 100 100 100 100 100 100 100 100 100 
100 100 100 100 100 100 100 100 100 100 100 100 100 100 
##$AQSEQ= 0
##$AQ_mod= 1
##$AUNM= <au_zg>
##$AUTOPOS= <>
##$BF1= 200.13
##$BF2= 200.13
##$BF3= 200.13
##$BF4= 200.13
##$BF5= 200.13
##$BF6= 200.13
##$BF7= 200.13
##$BF8= 200.13
##$BYTORDA= 1
##$CFDGTYP= 0
##$CFRGTYP= 5
##$CHEMSTR= <none>
##$CNST= (0..31)
1 1 145 1 1 1 1 1 1 1 1 1 1 1 1 1 1 1 1 1 1 1 1 1 1 1 1 1 1 1 1 1 
##$CPDPRG= <>
##$CPDPRG1= <>
##$CPDPRG2= <>
##$CPDPRG3= <>
##$CPDPRG4= <mlev>
##$CPDPRG5= <mlev>
##$CPDPRG6= <mlev>
##$CPDPRG7= <mlev>
##$CPDPRG8= <mlev>
##$CPDPRGB= <>
##$CPDPRGT= <>
##$D= (0..31)
0 1.2 0 0 0 0 0 0 0 0.06 0 0.03 0 0 0 0 0.0002 0 0 0 0 0 0 0 0 0 0 0 0 
0 0 0 
##$DATE= 1701173827
##$DBL= (0..7)
120 120 120 120 120 120 120 120 
##$DBP= (0..7)
150 150 150 150 150 150 150 150 
##$DBP07= 0
##$DBPNAM0= <>
##$DBPNAM1= <>
##$DBPNAM2= <>
##$DBPNAM3= <>
##$DBPNAM4= <>
##$DBPNAM5= <>
##$DBPNAM6= <>
##$DBPNAM7= <>
##$DBPOAL= (0..7)
0.5 0.5 0.5 0.5 0.5 0.5 0.5 0.5 
##$DBPOFFS= (0..7)
0 0 0 0 0 0 0 0 
##$DE= 6
##$DECBNUC= <off>
##$DECIM= 32
##$DECNUC= <off>
##$DECSTAT= 4
##$DIGMOD= 1
##$DIGTYP= 9
##$DL= (0..7)
0 120 120 120 120 120 120 120 
##$DP= (0..7)
150 150 150 150 150 150 150 150 
##$DP07= 0
##$DPNAME0= <>
##$DPNAME1= <>
##$DPNAME2= <>
##$DPNAME3= <>
##$DPNAME4= <>
##$DPNAME5= <>
##$DPNAME6= <>
##$DPNAME7= <>
##$DPOAL= (0..7)
0.5 0.5 0.5 0.5 0.5 0.5 0.5 0.5 
##$DPOFFS= (0..7)
0 0 0 0 0 0 0 0 
##$DQDMODE= 0
##$DR= 18
##$DS= 0
##$DSLIST= <SSSSSSSSSSSSSSS>
$$ [...]
##$SUBNAM2= <"">
##$SUBNAM3= <"">
##$SUBNAM4= <"">
##$SUBNAM5= <"">
##$SUBNAM6= <"">
##$SUBNAM7= <"">
##$SUBNAM8= <"">
##$SUBNAM9= <"">
##$SW= 18.0517328524113
##$SWIBOX= (0..15)
0 0 2 0 0 0 0 0 0 0 0 0 0 0 0 0 
##$SW_h= 3612.71676300578
##$TD= 16384
##$TD0= 1
##$TE= 0
##$TE2= 300
##$TE3= 300
##$TEG= 300
##$TL= (0..7)
0 120 120 120 120 120 120 120 
##$TP= (0..7)
150 150 150 150 150 150 150 150 
##$TP07= 0
##$TPNAME0= <>
##$TPNAME1= <>
##$TPNAME2= <>
##$TPNAME3= <>
##$TPNAME4= <>
##$TPNAME5= <>
##$TPNAME6= <>
##$TPNAME7= <>
##$TPOAL= (0..7)
0.5 0.5 0.5 0.5 0.5 0.5 0.5 0.5 
##$TPOFFS= (0..7)
0 0 0 0 0 0 0 0 
##$TUNHIN= 0
##$TUNHOUT= 0
##$TUNXOUT= 0
##$USERA1= <user>
##$USERA2= <user>
##$USERA3= <user>
##$USERA4= <user>
##$USERA5= <user>
##$V9= 5
##$VALIST= <valist>
##$VCLIST= <CCCCCCCCCCCCCCC>
##$VD= 0
##$VDLIST= <DDDDDDDDDDDDDDD>
##$VPLIST= <PPPPPPPPPPPPPPP>
##$VTLIST= <TTTTTTTTTTTTTTT>
##$WBST= 1024
##$WBSW= 4
##$XGAIN= (0..3)
0 0 0 0 
##$XL= 0
##$YL= 0
##$YMAX_a= 102011
##$YMIN_a= -118676
##$ZGOPTNS= <>
##$ZL1= 120
##$ZL2= 120
##$ZL3= 120
##$ZL4= 120
##$ABSF1= 10
##$ABSF2= 0
##$ABSG= 5
##$ABSL= 3
##$ALPHA= 0
##$AQORDER= 0
##$ASSFAC= 0
##$ASSFACI= 0
##$ASSFACX= 0
##$ASSWID= 0
##$AUNMP= <proc_1d>
##$AZFE= 0.1
##$AZFW= 0.1
##$BCFW= 1
##$BC_mod= 2
##$BYTORDP= 1
##$COROFFS= 0
##$CY= 11.3945322036743
##$DATMOD= 1
##$DC= 2
##$DFILT= <>
##$DTYPP= 0
##$F1P= 15.7292609196834
##$F2P= 12.9074282941183
##$FCOR= 0.5
##$FTSIZE= 0
##$FT_mod= 4
##$GAMMA= 1
##$GB= 0.15
##$INTBC= 1
##$INTSCL= 1
##$ISEN= 128
##$LB= 0.24
##$LEV0= 0
##$LPBIN= 0
##$MAXI= 10000
##$MC2= 0
##$MEAN= 0
##$ME_mod= 0
##$MI= 1.114404
##$NCOEF= 0
##$NC_proc= 0
##$NLEV= 6
##$NOISF1= 3.799351
##$NOISF2= 2.8
##$NSP= 1
##$NTH_PI= 0
##$NZP= 0
##$OFFSET= 15.70392
##$PC= 1
##$PHC0= -24589.66
##$PHC1= 10.6527
##$PH_mod= 1
##$PKNL= yes
##$PPARMOD= 0
##$PSCAL= 0
##$PSIGN= 0
##$REVERSE= no
##$SF= 200.130013532006
##$SI= 16384
##$SIGF1= 3
##$SIGF2= 2
##$SINO= 400
##$SIOLD= 16384
##$SREGLST= <1H.CDCl3>
##$SSB= 0
##$STSI= 0
##$STSR= 0
##$SW_p= 3612.71676300578
##$SYMM= 0
##$S_DEV= 0
##$TDeff= 0
##$TDoff= 0
##$TI= <>
##$TILT= no
##$TM1= 0
##$TM2= 0
##$TOPLEV= 0
##$USERP1= <user>
##$USERP2= <user>
##$USERP3= <user>
##$USERP4= <user>
##$USERP5= <user>
##$WDW= 1
##$XDIM= 8192
##$YMAX_p= 0
##$YMIN_p= 0
$$ End of Bruker specific parameters
$$ ---------------------------------
##NTUPLES= NMR FID
##VAR_NAME=  TIME,          FID/REAL,        FID/IMAG
##SYMBOL=    X,             R,               I
##VAR_TYPE=  INDEPENDENT,   DEPENDENT,       DEPENDENT
##VAR_FORM=  AFFN,          ASDF,            ASDF
##VAR_DIM=   8192,          8192,            8192
##UNITS=     SECONDS,       ARBITRARY UNITS, ARBITRARY UNITS
##FACTOR=    0.0002768,     1,               1
##FIRST=     0,             0,               0
##LAST=      2.2672688,     0,               0
##MIN=       0,             -118676,         0
##MAX=       2.2672688,     102011,          0
$$ Real data points
##PAGE= N=1
##DATA TABLE= (X++(R..R)), XYDATA
$$ [...]
1771A60Qm8j24K39j63j21k4J32k80K41L12p1l00J88l93K02J42j53l79N06Q4k90
1793a32L56l35j49J87J60j55Q2K99l96J21j87J76M0Q0J38J57k52q7j88L7k2j00
1815a70L24j25j42J44P4j69K08k2k31J15k20L90k96o9J34P3Q2Q8j46j10k7J88
1837I3j00l57K85K00J07k49j89J60J4J56r1N8P3k40k5J50o4k67k1N05n18M41k6
1860I5q2j90L9J10J47k12K9k98M01j09l0L90k28l7K17l66K74l92M48r8k94K93
1882A07j50j38n1J53N2K37j31M0l4j42J38PMj13K53l95M70l06j01L21o6L3k46
1905e8N46m32J15m7j65k53L11p4N1N2J0qkl16L06Pn4j37J15j13J41l2L3Q8q5L1
1931C0M7j66J13J09k48J12k58J39PP5j85J22J51j25P6r3j37J60K6K53j55j97J31
$$ plain form
1771 160 168 120 -4 235 72 -49 -73 59 -221 20 332 261 -39 149 -244 -42 100 -53 -432 74 158 -132
1793 -132 224 -111 -260 -73 87 -68 14 313 -83 38 -149 27 67 147 285 442 190 103 -85 -48 -70 -170
1815 -170 154 29 -113 31 105 -64 144 122 -109 6 -214 176 -120 -189 -55 18 100 188 42 -68 -95 93
1837 93 -7 -364 -79 121 228 -21 -210 -50 -36 120 29 87 160 -80 -105 45 -19 -286 -307 198 -320 121 95
1860 95 13 -177 -138 -28 119 -93 -64 -362 39 -70 -100 290 62 25 242 -124 150 -242 206 108 -186 107
1882 107 -43 -181 -232 -79 -27 210 79 119 85 -57 81 88 92 -21 232 -163 307 1 -100 221 155 188 -58
1905 -58 488 56 171 124 -41 -294 17 -57 -6 46 56 48 46 -270 36 43 -11 -148 -33 -146 -5 -37 -4 84 -1 30
1931 30 77 -89 24 133 -115 -3 -261 -122 -115 -40 -225 -103 48 -77 -1 -94 -231 -71 -45 208 53 -144 -13
1954a3l0J39p1J33l98M28k38l6K70j73J66k85J56k4j3K59J39n67J07R7l38J28
1976a64RK95l0K3j50J43J40J01m49L69l62K43Q4k11l01J12L39j23q6Q2j33o5J31
1999cP5l71L10J09j67J23r3j53mJ3%J16j13L08j85N3N7k70K11L42m42n5M15j75
2023A01j54J40k5k51K13K03l00j51L00j25j70N8J78K25k58J11L1k02k9R0%o4J07
2046B8j75J76o6R5k37L03j74J79nj4j1l74L63j32m8P6O5K56n91K91j10J3l4j1
2070a37J22j2j59J51j75M14p0K55n58J82j7J26k72K36L74m12m6j18LK67k07j71
2092b24j34J40K94K5j10J21q8O3ko1l7O9l5j66J76j78K89o2k8PJ91m85K37j39
2116a37J53r4J16j06p8K27l8LJ7q0M2J97j58j51n0j13K1P1J43l5J86K6k85J73
$$ plain form
1954 -13 -43 96 25 158 -240 188 -50 -86 184 11 177 -108 48 24 11 270 409 -158 -51 46 -292 -164
1976 -164 -155 140 110 133 -17 126 266 367 -82 287 -75 168 252 41 -260 -148 191 68 -18 64 -69 -134 -3
1999 -3 72 -299 11 120 -47 76 -17 -170 -174 -161 -161 -45 -158 150 -35 18 75 -195 16 358 -84 -139 276 101
2023 101 -53 87 62 -189 24 227 -73 -224 76 -49 -219 -161 17 242 -16 95 126 -76 -105 -15 -15 -79 28
2046 28 -147 29 -37 58 -179 124 -50 129 124 110 99 -275 88 -44 -92 -16 49 305 -286 5 -105 -92 -126 -137
2070 -137 -15 -27 -186 -35 -210 204 134 389 -169 13 -4 122 -150 86 460 48 2 -116 -113 154 -53 -224
2092 -224 -358 -218 76 101 -9 112 24 87 85 24 -13 56 21 -145 31 -147 142 80 52 59 250 -235 2 -137
2116 -137 16 -78 38 -68 -146 81 43 46 63 -17 25 222 64 -87 -137 -250 -229 -158 -15 -50 136 162 -123 50
2140E0o3J99p7j54J29k17K93j60L8O6k77L99j94J01l68J27n8L37l75R8J14N0J
2163E9%j52N9N3j67k0K22j28l3J35N7o6P4j69J7P4J09k71J26O0p8N4J66o1P6k69
2189g3L57j69M8l91K44Q2J07q7m6j20K76k35K24j25j33K29k53J11j64K11q6J27
2211A34r9M1J03J58k88j25l12K20L53l97O7j8J86l24L36J40l56J28L01l80J43
2232A1j25M9K93j37m4J11k49J77k4N0n4k42R8K56q9r2J15O4j87J99N7l47K49k54
2256a15K57J39j83K38o60K02j5K0J67k3J71P3k71k2Q4j83N9k14L76k12NK9l6J61
2280D7J83k77J86l05J00Q0L9M8j15k9M9l9j51J86j05J79l73K81n5k38L82m4J02
2303A31K17l98Q4j54J23m2j0p4j3J25j07L21k61M5k7j32P2J04J46j74J58k29k8
$$ plain form
2140 50 -13 186 109 -45 84 -133 160 0 38 104 -173 226 32 133 -235 -108 -166 171 -204 -106 8 58 59
2163 59 59 -93 -34 19 -148 -168 54 -74 -107 28 85 19 93 -76 -59 15 124 -147 -21 39 -39 15 181 120 196 -73
2189 -73 284 115 163 -228 16 98 205 118 72 -48 228 -7 217 92 -41 188 -65 46 -118 93 7 134
2211 134 35 76 179 337 49 -76 -388 -168 185 -212 -145 -163 23 -301 35 175 -181 -53 248 -132 11
2232 11 -114 -65 228 91 47 158 -91 86 62 112 58 -184 -86 170 81 -11 104 168 -19 180 237 -110 139 -115
2256 -115 142 281 98 336 -324 -122 -137 -117 50 27 198 271 0 -22 62 -121 -62 -276 100 -112 -107 -78 -114 47
2280 47 230 -47 139 -166 -66 14 53 101 -14 -43 6 -33 -184 2 -103 76 -297 -16 -71 -309 73 29 131
2303 131 348 -50 34 -120 3 -39 -49 -123 -136 -11 -118 203 -58 -13 -40 -172 -100 4 150 -24 134 -95 -123
2326a23PJ38%L49o04o4L14P2k36J37K19k61R9q3q2L20q5j79K1j13QM59l72j8L88
2351C11l36K68l9J5k96O1j54L1k6K8J10L3n39L62Q5j6J8K10j56j76K56J22j08
2374F4m6j04K43M4l10K02k41P2K04o4j92Q8rL10l44K40j67l46L59R7j99j33M63
2397B31k22k27kM31j78j68K34K08k23l82L70K8K5L0k83R2N9j8j67K28m8j82q0
2420b44M93l94P4R0K15j96j47J41k34J99jp0j6J47k10J45M8j85J28j53J79N0j28
2443f9J16N1K3j93j56K05J22Pj09j82J58k3m3k9J52j92L24q8q1J42j40j60%K24
2467E9l24K28Q1j42J55K87k65O9k87K35j0j58L9j13r9K77J78l60L05k99J8P9P4
2490B7j13LJ02j00O2M0p7L6j81J50R6R5j73J07r8j4L5R6j96k32L18j03K02K46
$$ plain form
2326 -123 -116 22 22 371 -233 -297 17 89 -147 -10 209 -52 47 -36 -118 202 117 -62 -41 -154 -146 313 -59 -77 311
2351 311 -25 243 204 219 -77 -16 -170 -139 -165 -137 -27 6 -533 -171 -86 -102 -84 126 -30 -206 50 172 64
2374 64 18 -86 157 201 -109 93 -148 -76 128 64 -128 -40 -49 261 -83 157 -10 -356 3 100 -99 -232 231
2397 231 9 -218 -220 211 33 -135 99 307 84 -298 72 100 125 155 -128 -36 23 5 -162 66 18 -164 -244
2420 -244 249 -145 -71 19 234 38 -109 32 -202 -3 -4 -74 -90 57 -153 -8 40 -145 -17 -170 9 59 -69
2443 -69 47 98 121 -72 -228 -23 99 106 -3 -185 -27 -50 -93 -122 30 -162 162 74 -7 135 -5 -165 -165 59
2467 59 -265 -37 44 -98 57 344 79 148 -139 96 86 -72 -33 -146 -245 32 210 -150 155 -144 -126 -47 27
2490 27 -86 -83 19 -81 -19 21 -56 -20 -201 -51 45 140 -33 74 -24 -38 -3 93 -103 -335 -17 -120 82 328
2514C28n25J53R2r6K88k01J31kk58lj36L00j72K32J05j69m8J21l8p7j51K45R6
2537B15k49Q5j05K56j73j37k6K03j19M33l56r4J15l2J7j38R4r7k92O37m18k8O1
2560a48K05k40L1K83k92P8J42M0R2M5k96J70k19R5O9J58k44M6j54J71p2J12k56
2583a84K52J17k54mJ02m9j37J96j50J91n9J9P5Ok53K11l90K74k6J41j94J37l27
2606c06K73Lk12K55l5l3J73M0j47J4l36M00j77J74j76K96k23K86m31q2K55J73
2628A84Kml21J36l7k8j25J26N3R8o4j5n4L6j42J24j02J78j68L3P1Q2j95n2L17
2653A33k90K57K12m56K12P8l4q2k57p1K46l4J46o3L0j65K27J30j60l5o6lJ99j34
2677B0J97k42J52j07J5m56J9M18k51J81M7Lj59mJ72m8j53J32M25n06j01R4j9J92
$$ plain form
2514 328 -197 -44 48 -48 240 39 170 168 -90 -93 -229 71 -101 131 236 67 19 140 102 25 -126 119 215
2537 215 -34 51 -54 202 29 -108 -134 69 -50 383 27 -67 48 16 33 -105 -11 -108 -400 237 -181 -209 -148
2560 -148 57 -183 -152 131 -161 -83 59 99 191 236 -60 110 -109 -14 55 213 -31 15 -139 32 -40 72 -184
2583 -184 68 185 -69 -73 29 -20 -157 39 -111 80 21 40 115 121 -132 79 -311 -37 -63 78 -116 21 -306
2606 -306 -33 -30 -242 13 -22 -55 118 158 11 25 -311 89 -88 86 -90 206 -17 269 -162 -244 11 184
2628 184 186 182 -139 -3 -40 -68 -193 -67 -14 84 20 5 -49 -13 -155 -31 -133 45 -123 -90 -19 63 -132 -184 133
2653 133 -157 100 312 -144 68 146 112 30 -227 -298 -52 -86 60 -3 27 -138 89 219 59 24 -42 -45 154 20
2677 20 217 -25 127 20 35 -421 -402 16 -235 -54 -7 -4 -163 -167 5 -43 -196 -64 361 -145 -246 -152 -171 21
2701B1n02M09n8M7k50L21N1p3O2j83pR7P0N8p7L5J27j38r4J43k8j26m4j49lK45
2727d6J95k04R4j60l0N9K67j07j79Q2J26k03K53q4p8L68m44K9j19J88j78m1J97
2750a5J09K09m21K86p2N8q4J18q2k8j54R5j54K01j77J9K07m5K3j48p5M2J87m15
2774c16M67p5k4m22N05k21N7pJ43j13J32L6k2pJ9op0q5P9mj81L16l30M6J48m94
2800d29K81J92K0k02J99q7J27J2k37J90J30r4j09K09k80j02L02n6L5j41k54J55
2822a39J98mj99P1j61l3L61k98J83j4K47j39j33J89m5j17J07r1r5k26M08k09Q2
2845e7r8j38K33K05J42j62K2k52L15l13j73K02L31k63M9j32j9OK73j42j34L29
2867B24m33J91pJ11n3q2K42q9Nr6q0L23j01l29J24J74j39l12M59j20q7%J94j95
$$ plain form
2701 21 -481 -72 -130 -83 -333 -12 39 -34 28 -155 -162 -65 5 63 -14 21 148 10 -84 59 31 -95 -139 -288 -291 -46
2727 -46 149 -55 39 -121 -151 -92 175 68 -111 -29 97 -106 147 63 -15 353 -91 -62 -181 7 -171 -212 -15
2750 -15 94 303 -118 168 96 154 70 188 106 78 -76 19 -135 66 -111 -92 115 70 93 -55 -130 -88 99 -316
2774 -316 151 76 52 -370 135 -86 -29 -36 107 -6 126 162 140 133 152 146 76 -9 70 66 -115 201 -129 -83 65 -429
2800 -429 -148 44 64 -138 61 -26 101 113 -124 66 196 102 -7 202 -78 -180 122 66 101 -40 -294 -139
2822 -139 59 55 -144 -73 -234 -267 94 -204 -21 -35 212 73 -60 129 84 -33 74 -17 -112 -338 70 -139 -57
2845 -57 -155 -293 -60 145 287 125 147 -105 210 -103 -276 -74 257 -6 43 -89 -108 -102 171 29 -105 224
2867 224 -209 -18 -25 86 33 -49 193 104 109 13 -67 256 155 -174 -50 124 -15 -327 132 12 -75 -75 119 -76
2891g6kk7K2J00j0J72m28J73L79k59R1l19L29p8N4j52J52k8L0L91q06M03M9k84
2915a24J06J87j88j20K48N3j04p3K93l03J45Rj02j39M1J54J51k46k0J87k28K31
2937A58l1R0m50L74j07P0K7k7j14r2J37O2l69L62j68R0k90L97k81L77q0j19k72
2960b56K69l2jj82Q7J29j43J58l26N51l72J31n0j56M7N9J76j85J64j61J16l2K66
2983B57j69k85J56j62J41k2K65j82J82K04pm99K46j31M9kK8Q2k32J93l08J42J2
3006d2k10L09j91N5J13k11Q5K67j76L0j17L7N7nN9j24NJ4j37M73l81np6r4L77
3031A12k7q1n8q9J80R8j69o2L33k71k24M14j66J04j84J91K33m05L9l06J49K35
3053D6Q0j91n9L20J7k60k16K88l00M76p9O6p36K69L22k80J55M76m31Q9J42j37
$$ plain form
2891 -76 -78 -105 -83 17 7 179 -249 -76 303 44 135 -184 145 67 121 -31 121 93 123 514 -292 111 160 -124
2915 -124 -18 169 -19 -139 109 162 58 -15 278 -25 120 129 27 -112 -71 83 234 -12 -32 155 -73 158
2937 158 127 217 -233 141 34 104 131 104 -10 -102 35 97 -272 90 -78 12 -278 119 -162 215 135 16 -256
2960 -256 13 -19 -20 -202 -115 14 -129 29 -297 254 -118 13 -37 -193 -146 -87 89 -96 68 -93 23 -9 257
2983 257 88 -197 -41 -203 -62 -84 181 -1 181 385 378 -121 125 -6 43 41 69 151 -81 112 -196 -54 -42
3006 -42 -252 57 -134 -79 34 -177 -92 175 -1 29 -88 -51 6 1 60 -64 -59 -45 -182 291 -90 -95 -171 -265 112
3031 112 85 4 -54 -143 37 135 -34 -96 237 -34 -258 156 -10 94 -90 101 334 -71 -32 -338 -189 46
3053 46 126 -65 -124 196 213 -47 -263 25 -275 201 122 188 -548 -279 43 -237 -82 394 -37 52 194 57
3075E7j6j95J55j56J6K72k40K59r6q1j43J17J7m0k29L76k94j19R1K74Lj95M69
3098C02l24J23o6q3L1L6R2k32J06KJ15k63K3L1J58j04N0Q5L8o3j02k33K64J11
3122I7J14j39j49J02J28k4M5j59j54j16K47n5rN4j74r3L41k22K00l7j26J15J12
3145I8k30J49q8o3N6j90J0K25Q2q5k1J39ml6K9l43J88k40K70Q1K05k22N3j48J93
3170A08kk74L0J83Q2k73K57k49K63J25l54j9R1k23L7L56J91m13J29J71j12k66
3192a62L22k48o5N23l36J62l38L74k38R7l2j20p5K83l20j78K79K19k96K85k82
3213a46Nj12O7L31k27K06j59J39j10l4P9l72M39j5n14L52Nj09J88J64K4n4K0N6
3237B23k31p6O7j64N63j91k45J73p1r7j2j6J83K22n18K12P9j64j66L01O3k37J36
$$ plain form
3075 57 41 -154 1 -155 -139 133 -107 152 56 -25 -168 -51 -34 -74 -303 73 -221 -340 -249 25 28 -167 302
3098 302 -22 101 35 -48 -17 19 111 -121 -15 -13 102 -161 -138 -107 51 -53 -3 82 120 57 -45 -278 -14 97
3122 97 211 72 -77 25 153 129 174 15 -139 -255 -8 -63 -72 -18 -192 -285 56 -166 34 -3 -129 -14 98
3145 98 -132 17 -71 -134 -78 -268 -258 -33 49 -36 -57 82 78 42 71 -272 -84 -324 -54 27 232 10 63 -85 108
3170 108 106 -168 -138 45 127 -146 111 -138 125 250 -104 -123 -32 -255 -218 138 329 -84 45 216 104 -162
3192 -162 160 -88 -153 370 34 196 -142 232 -6 91 59 -61 -136 147 -173 -351 -72 147 -149 136 -146
3213 -146 -141 -253 -186 145 -82 124 -35 104 -6 -40 39 -333 106 91 -423 -71 -66 -175 13 177 201 147 167 223
3237 223 -8 -84 -17 -181 382 191 -54 119 48 -49 -61 -77 106 328 -190 22 101 -63 -229 72 135 -102 34
3260C4j00j02K49m0Jk66K81r0r8J0P4J74O9k10j98M00r8j13K09n00L31r2k04L59
3284H0J42j41j5k58K55j5R5k11L7o0J4J1K11p3M7j04j46K97j72L7J62r4M7%j47
3309aJ07j61K57k6n84Q78n37q3K80J16j49R1j31k06K33k82K74J1Pk25K82o2Q5
3332A74M3q8p2k7M3j24k9J62j68J07l7k19J66r6p6K36K53j94j6k05K38j49Kq4
3356a60J42J14J0J3J1j79j6J88J30l26j41J82J09j82N8J51R4k91o9M38k05j19
3378d8q7n2O1j2M2K47k89j24K74p2P8l7Q6j43K14k46J7l9P5J10J63j65L7j35Q5
3403D0j07K86l63J1J29q4J64R1l61Q7J77k03jN0L26k18k8j34N3J2rn8R1J61j97
3428h5L45l19K36j07j92n3K13p8K8J22j82J20J09k55l8L8m8O6O8k2K4j07N5mr0
$$ plain form
3260 34 -66 -168 81 41 42 -224 57 -33 -131 -121 -47 127 196 -14 -212 188 90 -23 186 -314 17 -75 -279 80
3284 80 222 81 66 -192 63 48 143 -68 -31 -91 -77 -66 145 72 119 15 -131 166 -6 31 193 99 146 146 -1
3309 -1 106 -55 202 176 -408 470 -67 -150 130 246 97 188 57 -149 84 -198 76 87 94 -131 151 89 174
3332 174 217 129 57 30 73 -51 -80 82 -86 21 -16 -235 -69 -165 -241 -5 248 54 38 -167 71 -78 -76 -160
3356 -160 -18 96 106 119 130 -49 -65 123 253 -73 -214 -32 77 -105 -47 104 198 -93 -162 276 71 -48
3378 -48 -135 -187 -126 -138 -96 151 -138 -262 12 -60 18 -19 67 -76 138 -108 -91 -130 -55 55 218 53 90 -45 40
3403 40 -67 219 -144 -133 -4 -88 76 167 -194 -107 70 -133 -134 -84 242 24 -4 -138 -85 -73 -82 -140 -49 112 -85
3428 -85 260 -59 177 70 -122 -175 38 -40 -12 110 -72 48 157 -98 -136 -98 -146 -80 -12 -34 -10 -117 -62 -66 -156
3453a56O9j97M2J75j31lJ53J36j51M09k06J14l38p3J43J3rj20K75j33j46P0K10
3476A46j25l7J03J8k61P3l46L59n9K30m8O4m9Q3j17J31j77p4J47k32J68q3O5K21
3500B00j07J50N2l31j86L95l53J24o0M02k46J89j74l99J39Q6K07J5o1L63n23K97
3522A79l9l47M65l41j78L25k41n1L55m0j85j00j33L82q7K48k42Q9J14j9k8Q9k16
3545ar1o6K24j6j38k2J68j76M4K94k38K55j75o3k6Ql42M89l6j12J23j59J17J32
3569A93l63p9K07N7n8K08l22J77R3k13J50L35k87J63m43J93o0J71L7n23L11j19
3591a72K76q8j1j93m6L31P6Qp5j15J12n0K49l72J71o5k54J48O4j41J80K50k31
3614E2j9K10M7o9l16K43k86K78k09j67J98jk0L3J15r2J43L2j02j97K02P5M5J34
$$ plain form
3453 -156 -87 -284 -242 -67 -198 -201 -48 88 -63 346 140 254 -84 -157 -14 -1 -10 -130 145 12 -134 -64 146
3476 146 21 -16 87 105 -156 -83 -429 -70 -129 101 53 117 68 151 34 165 -12 -86 61 -171 -3 -86 -21 200
3500 200 93 243 295 -36 -222 173 -180 -56 -116 286 40 229 55 -344 -205 -119 88 103 42 405 -118 179
3522 179 140 -207 258 -83 -261 64 -177 -228 127 87 -98 -198 -331 51 -36 212 -30 59 173 154 126 215 -1
3545 -1 -92 -158 66 50 -88 -110 58 -118 -74 220 -18 237 62 -1 -27 -19 -361 128 92 -20 103 -56 61 193
3569 193 -170 -249 -42 15 -43 165 -157 20 113 -100 50 385 98 261 -182 11 -49 122 159 -364 -53 -172
3591 -172 104 16 5 -188 -234 97 173 181 106 -9 103 53 302 -70 101 36 -218 -70 -6 -147 33 283 52
3614 52 33 243 290 221 -95 148 -138 140 -69 -236 -38 -39 -59 -26 89 -3 140 172 70 -127 75 150 195 329
3638C29m72N29j74l29j6K76j03n6j92L42j70J85J25j79m3r8j11J8j9J43p0J53
3660F8J44j95O9l6J90m15Q1L06k9k61M0j10n9J48j15J16J38N8j76j53M0K36j08
3683b3n3OJ28k05O3J85p0l6k98L79j68m4J46K51j72p3J98Nj66l3k14J09NK66n9
3708A27o8Q1l19mJ45k58M33p1R1o9j7l15L60l6jl4p6K03o3J83j66j77o6J26jq4
3734g6O3N4p2j19N8J8q9M95l48J46J13l83J81Mj01k4J53k17R6l3J99k29J61J84
3758B34q3j45m7J37o2k18n8N2J94K80k63l13K60J58N3l64L42j23j87L40P7l44
3780h0j03P7K9K49l52L01k77L02m02J74K16j50J93j29n8o8Q0j97M14lj86k4lK4
3804B7k26K17j3Q5l24L54L5j6j48R0O2l27K19r6q9J33j48O4J14j12P5J92P6j81
$$ plain form
3638 329 -143 386 212 -117 -133 143 40 -16 -208 134 -36 149 274 95 52 -46 -157 -139 -158 -15 -85 68
3660 68 212 17 86 50 240 -175 -94 212 183 -78 -38 -148 -207 -59 -174 -58 80 138 -38 -191 -151 85 -23
3683 -23 -76 -70 58 -147 -84 101 31 -5 -303 76 -92 -136 10 261 89 16 214 219 53 20 -194 -85 -80 186 127
3708 127 59 140 -179 -183 -38 -296 137 66 157 88 71 -244 116 80 79 45 -31 172 109 292 126 -51 -117 9 8 -76
3734 -76 -13 41 -31 -150 -92 -74 -163 332 -16 130 243 -140 41 45 -56 -80 73 -144 -48 -81 118 -111 50 234
3758 234 151 6 -41 96 34 -184 -242 -190 4 284 21 -292 -32 126 179 -185 157 34 -153 187 264 -80
3780 -80 -183 -106 -77 172 -180 121 -156 146 -256 -82 134 -16 177 48 -10 -78 2 -195 219 216 30 6 3 27
3804 27 -199 18 5 90 -234 120 155 139 -9 81 143 -184 35 -61 -150 -17 -165 -101 13 -99 -24 168 244 63
3828F3j48n8J64J11m11R5L81k43N2nJ47o1j42J16n1j12j56L39O4k3j78j76J69
3851f3N3q2N0j16L65k35r3J46o2J29o8K65l06K72k88j29J65n7P6J42k57m5P4J01
3875C7l7K72j13j78O6j04J71j71J60k27n1L05N1MO6j87rJ6q8J6R0l9l57L05K70
3900B68m35K34J3P3l9p6RN7j50P5M0O7r1L4j14O8p3N2l9M0J23l77J82J19j45L81
3926B96n0j18R2L9k99l9L9M6j45J36J16m3l7J04k89P7K83l17L16l89M02M4l39
3949g5J48j05J96j05Pj65j31r4J93K4K46K07p34M55K06l84j98L50J64k16K23j07
3971A05k7r5J30N2l21J44k92K57K8m5j52L82m80M36K53k41l53J94J31j32Oj80
3993b00L67J05l95N7K12j01j81L11j86R6J27p4k63K39J8m9k53QJ49m5L37k35K27
$$ plain form
3828 63 -85 -143 21 132 -279 -184 197 -46 6 1 148 87 -55 61 10 -102 -258 81 145 122 -56 -232 -63
3851 -63 -10 -92 -42 -158 207 -28 -121 25 -37 92 24 289 -17 255 -33 -162 3 -54 22 164 -93 -138 -64 37
3875 37 0 272 159 -19 47 -57 114 -57 103 -124 -175 130 181 185 251 64 55 71 -17 -1 89 50 -307 -2 268
3900 268 -167 67 80 153 114 38 47 104 -46 29 69 136 45 79 -35 33 -40 12 -27 13 136 -241 -59 60 -85 296
3926 296 246 128 220 259 -40 -79 -40 6 -139 -3 113 70 33 137 -152 -75 208 -109 207 -182 220 264 -75
3949 -75 73 -32 164 59 66 -99 -230 -324 -131 -107 139 346 -388 67 273 -111 -309 41 205 -11 212 105
3971 105 78 -17 113 165 -156 -12 -304 -47 -19 -64 -216 166 -314 122 375 134 -219 -25 106 -26 -20 -200
3993 -200 167 272 -123 -66 146 45 -136 175 -11 85 212 138 -125 114 132 83 -170 -162 -13 -58 279 44 271
4016B71l96K15p0lm6R2L1j32Q6j22J51j33J8K27q1N6N7l05K1J83N6j28KL1J13
4041A94n29M50p3j57M33k75j66Q6L7J36j5j37J49k91J54K4o4k6J27j59J70K2k56
4064a66J5M94n39J39j24n1n5L22K9M0j79l2jJ89rq9K52l09L78m12p2L72j69l4
4088a1J08LJ33m90J55O2M6j36L58k04Kl2p6K31j26j36k4J63j30J33J35j92j43
4111a71J28j26J30lK48k78O6J04L8J02l72o4O3J13K4mj04N8j02M6K07mp0j32L7
4136f6M2J52k29K5J47j39J00M1j12K9O0M4j52P8R7K62k61m23M67j32M2k47NK82
4160A12j98O8J73j66m3R8j02j56l5j41N33j13j03L8M7o9K25j27J31k98R9P9k58
4183b06K89j88O3M21l62k8K2j32J1R1k00K12PMl6J35o5j04j78K98j34K51j39l
$$ plain form
4016 271 -125 90 20 17 -29 63 94 -38 48 -74 77 -56 -38 189 108 164 221 -84 -63 120 176 48 50 81 194
4041 194 -335 115 42 -115 318 43 -123 -37 0 136 121 -16 133 -158 -4 20 -44 -70 57 -102 68 90 -166
4064 -166 -151 343 -196 -57 -181 -232 -287 35 64 104 -75 -107 -108 81 72 -17 235 -74 304 -108 -180 192 23 -11
4088 -11 97 100 233 -257 -102 -40 6 -130 228 24 26 -6 -82 149 23 -113 -137 26 -104 29 164 -28 -171
4111 -171 -43 -169 -39 -42 206 -72 -6 98 136 238 -134 -198 -135 -22 2 -2 -106 -48 -150 -104 103 99 29 -103 -66
4136 -66 -24 128 -101 -76 71 -68 32 73 -39 -10 50 94 -58 20 117 379 118 -305 162 30 72 -175 -170 112
4160 112 -86 -18 155 -11 -54 44 -58 -214 -249 -390 143 30 -73 -35 12 -57 168 41 172 -126 -27 52 -206
4183 -206 83 -105 -42 379 17 -11 11 -121 -110 -19 -219 -7 0 4 -32 103 38 -66 -244 54 -80 171 32 29
4207B9j60N3k18K68K25k89K9J23N4k37Q5l3P7n1J14k61K71k59N2L28j91l7q6K84
4231A70k2k47mp7K13l07L84k81Q5J33J21j7m8o8j32O1L99j90j09l20K16k83L01
4254b2K22q1k48K60j69K45l93K40j40q1J92r9j0P3K7J21m1o6K52n94N09k47Q4
4277C4l70M19K01l08Q4j73j99K02K2k9K60j30n8K65k00j69M77j08k88J34p5Ok
4300ej12R6k0K31k59l8Q5J95j50p2J42J1j28J36K6k61J04J38Mm4J69m97j11J06
4324b54J75k6J66N9j01O5MR0j40j5j85J14J14RR3k78J55r9P8p1J58j58K10r2p8
4349gR2K15k90j79K97j35O4l2J9K27l76J05j24Q5L19k82n9kq9j10K90K97o6n38
4373b79K86nJ01Q4k76J08N5J9k04JM33l28J04m7k7j6j34l0J45j24K07j72o5L18
$$ plain form
4207 29 -131 -78 -296 -28 197 -92 -63 60 114 -123 -38 -71 6 -45 69 -192 79 -180 -128 200 9 -28 -114 170
4231 170 148 -99 -103 -180 33 -274 110 -171 -86 47 168 151 103 35 -97 -36 363 173 64 -256 -40 -323 -22
4254 -22 200 119 -129 131 -38 207 -186 54 -86 -167 25 -74 -84 -11 16 137 96 30 282 -312 197 -50 34
4277 34 -336 83 284 -24 60 -113 -312 -110 -88 -117 143 13 -45 220 20 -149 328 220 -68 66 -9 -3 -5
4300 -5 -117 -21 -41 190 -69 -107 -22 173 23 -49 93 104 -24 112 138 -123 -19 119 123 79 248 -249 -360 -254
4324 -254 -79 -105 61 120 19 84 88 178 38 23 -162 -48 66 75 168 -110 45 -54 24 -47 111 -47 163 71 -7
4349 -7 85 300 10 -169 128 -7 57 25 44 271 -105 0 -124 -39 280 -2 -61 -63 -152 -262 28 325 259 -279
4373 -279 7 2 103 187 -89 19 74 93 -111 -110 323 -5 99 52 25 9 -125 -155 -10 -134 73 -99 -164 154
4397A54K7j31J15j38j95K99Kj27P6J89j57j16J11j07j07j21L48k07N3l8J88N4
4419A72q4j56k0j18M40j1l85K64j58O8m4j22J71k69K90j01K00O9n0m24M01j87
4441e4J50k09M4P1K57r2l11Q5k7K53j23N5j40K25k28J38m8k24m8M6L08k50K8J44
4465E0J51m40M21o6j11K85j73j34m80L35J54K8J69l1R4l56Q4p5O0J54l31P9M6
4488h7L4K1l6p2J98p3j25J91L9O7o1K19m48K22o8N8jP4l06J20K15j31l4J43j37
4513B2J8o4j78J31L84m68P5M7P7j23J8l1Q7r1O0J84k37L59k44k31J47j82R0J71
4537B1mJ22j6m0R0Mj09K2j14J53r8Pj23K50o5j64K00k12J98r8P2l43L16j19l47
4562c97L96M7J35q4p6QJ59j66J58J13j80Qk8o5j5l78O33k56M1p9L6J34k36J02
$$ plain form
4397 154 181 50 165 27 -168 131 133 6 82 271 114 -2 109 2 -105 -226 122 -85 -32 -70 118 172
4419 172 88 -68 -88 -206 234 223 -162 102 -56 12 -32 -154 17 -252 38 -63 137 206 156 -268 133 -54
4441 -54 96 -113 -69 2 259 167 -144 -59 -86 167 44 99 -41 184 -44 94 46 -178 -226 -180 128 -122 -94 50
4465 50 201 -239 182 116 5 290 117 -17 -497 -162 -8 20 189 158 252 -104 -20 -95 -35 119 -212 -133 -87
4488 -87 -53 -32 -68 -140 58 -15 -140 51 90 157 96 315 -133 89 21 79 78 152 -154 -34 181 50 16 159 22
4513 22 40 -24 -202 -71 313 -155 -80 -33 44 -79 -61 -92 -5 -96 -36 148 -89 270 26 -205 -58 -240 -150 21
4537 21 17 139 123 83 173 177 68 90 -24 129 31 38 -85 165 100 -64 136 -76 122 24 96 -247 69 -50 -397
4562 -397 -1 46 181 97 21 29 188 22 180 293 113 121 93 28 13 -365 268 12 53 -26 10 144 -92 10
4586A0j33oJ43kOk02O9K3j5N90l61j58l3K59k46q2j24L05J93k93L1P4J58j69j28
4611i1M24m72Q0Q4R2j71L36k05l84Q8L93j31l05J06K77Q2k09R6j33K00m57L70
4633G0j99L17l15J07j09K16l9k73M24l74J98j89K3K03k31P3L34j22N5j03mJ2j
4656G3q6M3p6pj32J80j88l0L46K2k97J26K2k20M83l50O5Nm7J13J67j89j19j83
4680b79L26L1j22k2K08j15j22j47O4M12k14J7K3l22P3K55o8j9r8J31K93m68Q7
4703g6L20k93j09K70m46M32k97K37m6j95K06j26L21l56L02j80k47M42kk05N7L6
4725D5J65n7q1J55l92M87j14m01L52j45j83J98J73l8j32j17J94k19K33m73L81
4746C1r6J21k84J16J19N1m8r7J38J58n11K06J19j08K17J32m21L05o7p8j03K04
$$ plain form
4586 10 -123 -129 14 12 18 -184 -115 -92 -107 483 122 -36 -69 190 -56 -138 -262 43 236 -57 -26 48 206 37 -91
4611 -91 333 -139 -59 25 117 -54 282 77 -307 -219 174 43 -262 -156 121 203 -6 90 -43 157 -300 70
4633 70 -129 188 -127 -20 -129 87 48 -225 199 -175 23 -166 -143 60 -171 -98 236 114 169 66 62 74 73
4656 73 -13 30 -46 -53 -185 -5 -193 -223 123 145 -152 -26 -4 -224 259 -91 -26 -21 -68 45 212 23 -96 -279
4680 -279 47 78 -44 -66 142 27 -95 -242 -178 234 20 37 60 -262 -189 66 -2 -21 -119 12 305 -163 -76
4703 -76 244 -49 -158 112 -334 98 -199 38 -8 -203 3 -123 198 -158 144 -36 -283 159 157 -48 9 45
4725 45 210 153 72 227 -165 322 208 -193 159 14 -169 29 202 164 32 -85 109 -110 123 -350 31
4746 31 -65 56 -228 -112 7 58 10 -87 51 209 -302 -96 23 -85 132 264 -157 148 81 3 -100 104
4768A04k23J97j07R1P9j46J07J7Pm03L17l1j98O8K35j5l6j33L42k33k24J16J8
4791e1q8J1K10J57k93J23j58j2L27j60r1Q9j7L0m8n3J67j53J59j63j0j9M2K25
4815B24k48k48K53J39J26k77Lj5q1M2K39k4Kr2k59K01j30J71k0R6k44Q8pq4L7
4840a08J4j3J52Q1k09K38P0j44j78J34K8l12J13j00K40o2R2K57l44P0J54k24K7
4863b4j38K12k2R3j6m31L69j81K19O7M8l36K36J0q5J2j29J03l47M40l79J59O6
4886e4P4m52J52K30M17n24O6J92j90j21J66k5o4J11j56K92l03K23R0n0n0K68j71
4909A21o5%K4j85J49j02K54j39j17j84Q0L4M2J38O5p8N3j43l06M93OR6k33q5Q7
4934Ek5l8L2l69N27J1n1j84K32j75K69j83k89J53nK59k32M4J7K05k40n0k20K51
$$ plain form
4768 104 -119 78 -29 62 141 -5 102 119 126 -277 40 9 -189 -121 114 99 63 -70 272 39 -185 -69 -51
4791 -51 -139 -128 82 239 -54 69 -89 -101 226 66 -25 64 47 77 29 -24 143 -10 149 -14 -24 -43 -1 224
4815 224 -24 -272 -19 120 246 -31 -28 -43 -124 -82 157 133 135 43 -216 -15 -145 26 6 102 -142 -54 -61 -145 -108
4840 -108 -94 -107 45 126 -83 155 225 81 -97 37 65 -247 -134 -234 6 -56 36 293 -51 19 173 -51 -24
4863 -24 -162 50 28 121 105 -326 43 -138 81 148 196 -140 96 106 21 33 -96 7 -340 100 -279 -120 -54
4886 -54 20 -432 -280 -50 367 -157 -91 101 -89 -210 -44 -69 -133 -22 -178 114 -189 34 124 74 24 292 121
4909 121 56 56 80 -105 44 -58 196 57 -60 -244 -164 -130 -88 50 115 37 90 -53 -359 134 140 236 3 -82 5
4934 5 -20 -58 -26 -395 132 143 92 -92 140 -35 234 51 -238 -85 -90 169 -63 -19 -2 203 -37 -87 -307 -56
4958e6K13q1R0j73J90k31J18J0j66J20n7j64J94LK60j38k4Q9m27L03p8j03j7K84
4982A59l12L18k09K18j22l7J89l43P4K77j99p9J3K47j89j28j2J70l12K06Lj94
5004b62J70j5M3j6J36k10L10k20j0r8Qn9J31K32k93L37j66l33J13K26j6J24k32
5027a00J50k50L78%k57o4j03M47j95q9J74k21P2j6J70P9l20R7o7n6K75m6O7qm1
5052G6Mj43K34j42J12P9k71O7j2j89J51k5J67k15Q7j6p9L18l83J74l0J60k84J54
5076fj55L85k54lK3J17K8k48L00j39q0J5j3k7j41p5L60k37J15J09l6R0J10k50
5100a2j66J80J05M1k53J25m0J51k12J37q3n0l9O9LL4J46N9N1l83K65m4J14l85
5124a87K50k9K5J12j79K2j39R5J52k05J08j67L7J87L4J60q6p9j56J98m4j7kj55
$$ plain form
4958 -56 157 76 166 -7 183 -48 70 80 -86 34 -23 -187 7 10 270 132 108 197 -230 73 -5 -108 -125 159
4982 159 -153 165 -44 174 52 15 204 -139 -65 212 13 -66 -53 194 5 -123 -135 35 -277 -71 -68 -262
5004 -262 -92 -107 -64 -80 56 -154 156 -64 -74 -172 -164 -223 -92 140 -153 184 18 -315 -202 24 8 132 -100
5027 -100 50 -200 178 178 -79 -143 -246 201 6 -83 91 -130 -58 -74 96 175 -145 -48 -115 -171 104 58 125 117 76
5052 76 80 -63 171 29 141 220 -51 16 4 -185 -34 -59 108 -107 -20 -36 -115 203 -180 -6 -36 124 -160 -6
5076 -6 -161 224 -30 -33 -10 107 135 -113 187 48 -32 -17 -30 -57 -198 -273 87 -150 -35 74 38 128 238 -12
5100 -12 -178 2 107 148 -105 20 -20 131 -81 56 -27 -77 -116 -47 -44 -10 136 195 246 -137 128 84 198 -187
5124 -187 63 34 59 171 -8 14 -125 -30 122 -83 25 -142 -105 82 116 276 190 111 -45 153 109 92 90 -65
5148f5J75j46p5L43m41M45k45O0j51O7K97l80pr2L38j89J10j50J11j46K38j03
5170fj41K81K65j95l26P2L5K91m74p5l9L96L29n81K65k4j98L76j81J07k75p1j99
5193c68L47J97k32p7K36l8J03l01NlRJ29m1J71m1l00K05r1m7L23q5k85Q7J21n1
5218b7Q2J3j53l4J11O7n5M9j1j33j24K64l3pm2n0j9j97K27J6P2j01k38K47J8L06
5244B48j39j58j13M29Ll59l34N57j12j45R8J59k06L00j18L1k4k13N4J59J29m94
5266b48M74j36k02Q9j51K33j96K47j63K95o7k83M40n51M1J25k16J60K83m66L08
5287A6k98J52N2N0K33m82L34p9K26L6m24M70k82J32J06M5l47K3K97l34p8m1J15
5310g8K95k75m3J87j53m6K73k68J57J13l31J15J16j03p3K26n6K2K38m96R6J52
$$ plain form
5148 -65 110 -36 -111 232 -209 236 -9 51 -100 -33 264 -116 -123 -215 123 -66 44 -106 5 -141 97 -6
5170 -6 -147 134 399 204 -122 -50 -15 276 -198 -273 -312 84 413 -168 97 73 -125 251 70 177 -98 -169 -368
5193 -368 -21 176 -56 -133 103 65 168 -133 -128 -131 -122 7 -34 137 96 -204 1 -90 -137 186 101 -184 -97 24 -27
5218 -27 55 68 -85 -119 -8 59 4 53 42 -91 -215 49 16 9 -33 -83 -102 -299 -72 -56 16 -85 -323 -76 -58 248
5244 248 109 -49 -162 267 270 -89 -423 134 22 -123 -25 134 -72 228 110 141 117 -96 -42 117 246 -248
5266 -248 226 90 -112 -23 -174 59 -137 110 -53 242 175 -108 332 -219 -178 -53 -269 -109 174 -292 16
5287 16 -282 -130 -78 -28 205 -277 57 -22 204 240 -184 286 4 136 242 287 -60 -37 260 -74 -152 -193 -78
5310 -78 217 -58 -101 86 -67 -113 160 -108 49 162 -169 -54 62 -41 -114 112 56 78 316 -180 -84 68
5332F8n9J74o5k05J14j24L7oK2O1J7J89m7k39J99j91R7j72n1O8n2J35l60J97K47
5357E4Nm6K68k56OJ5rj09pmrk3K45k6j19o8R9K06j60m5O9Q4m4n9k60R9J8j32J51
5386e7qJ4R9L4o3J06k38L9j9J69K16l41K40j35K6L4p2O2j77M3K37q3l6k50K18
5411E8o8j46M6J80p7j17K75j25N5j41K43j4k85L04m94M35QO5n75N60j45R4j52
5434a6p7j30J31K23m4L5j47K5m4pM9qk34L93q6k70K8J71OL07j76k97n8J77j16
5459a65J01l7O5K3J0M5j90j6O0k6L25k12l31M07p4J12O2q2L7k32M80l83j46L03
5483A36L5l36r9J31K36nJ02r5j64L0m5K59k45J41k47L61k18J64O7l38lJ81j16
5506f8NK43R1k99l8o0R5P4o2k94K70p2J21K24k47n8j79J21O7J53p1pj27N4Q4K58
$$ plain form
5332 68 9 183 118 -87 27 -97 -60 -66 -44 17 34 223 176 -63 136 -55 42 -130 -181 -113 -165 -30 -390 -193 54
5357 54 59 13 281 25 31 46 37 -72 -79 -83 -92 -115 130 104 -15 -83 16 222 62 17 86 170 126 67 -193 -94 -76 -208 -57
5386 -57 -65 -51 48 82 19 125 -113 -74 -93 76 292 -49 191 56 82 116 44 106 -71 -28 209 126 90 -160 58
5411 58 -10 -156 -110 70 -7 -124 151 26 81 -60 183 169 -116 188 -306 129 137 202 -373 187 42 136 -16
5434 -16 -93 -223 -92 131 87 122 -25 0 -44 -51 -2 -10 -244 149 63 -207 -179 -8 -2 305 129 -168 -226 -49 -165
5459 -165 -64 -101 -36 -13 -3 42 -148 -164 -104 -130 195 -17 -348 59 -15 97 159 77 114 -118 362 -21 -167 136
5483 136 171 -165 -264 -133 103 98 200 105 -59 -29 -74 185 -60 81 -166 195 -23 141 208 -130 -133 48 -68
5506 -68 -63 180 271 -28 -66 -126 -31 43 -19 -313 -43 -115 6 230 -17 -75 -254 -133 -66 87 16 9 -118 -64 20 278
5532B78k78l4r3Q2J49J7j53J80j52K9j63M7P3J09m8j61k60N25k86L25r9p1J31
5555A47j56j41P8ML89m34J44Rj82K07j54K3J02p0J70k68R2K84k06N1j81P0K07
5578A85O3k23q5p5K06PJ24k16J81j41R0jl45J77K20l64J49k67K46J64j65N3j83
5601b00K20r2L38m9k38k9j57J84J48j16Pj76J88k39L5K56J06j45jj12J47q0J03
5624I8k2j45K33N8k37%j02K44j30p7rJ89r3Jj23PJ92k11L2J89J47o40J40mo3J57
5650a69L27k58J95j51L9K74J9l22j33L07K02k28j35j78J50j2J43j51M3r6Jr6J53
5673g6j18P9J27L2L8O7j80J01j37k7K11l4o8M5k02M2o6m8%K42O9k26J71j03l5
5698i6J50j01j68K36p5j19J99j27K37j94K5Q0K75m44K6L26l18k1K63l53P1J20
$$ plain form
5532 278 0 -34 -127 -45 104 121 -32 148 -4 25 -138 -91 -18 91 43 -118 -378 147 -139 186 87 16 147
5555 147 -9 -150 -72 -68 321 -113 31 40 -142 65 -89 -66 36 -34 136 -132 -40 244 38 89 -92 -22 185
5578 185 248 25 -60 -135 71 78 202 -14 167 26 116 115 -230 -53 167 -197 -48 -315 -69 95 -70 -17 -200
5601 -200 20 -72 266 217 -21 -50 -207 -23 125 9 16 -160 28 -211 -176 80 186 41 40 -72 75 -5 98
5624 98 76 -69 164 222 -15 -15 -117 127 -3 -80 -89 100 7 8 -115 -108 84 -127 -95 94 241 -399 -259 -263 -326 -169
5650 -169 158 -100 95 -56 -17 257 276 -46 -179 128 330 102 -33 -211 -61 -73 70 -81 -38 -134 -133 -229 -76
5673 -76 -194 -115 12 44 82 149 -31 70 -67 -94 117 83 15 60 -142 -100 -166 -214 -214 28 97 -129 42 -61 -96
5698 -96 54 -47 -215 21 -54 -173 26 -101 136 -58 -33 47 322 -122 -96 230 -88 -109 154 -199 -128 -8
5720hj20J49j19P6k5K71k6l12K01J24j09j92J45j30L51r4j49kj9j10L8K86m22
5743a96J0K19o8K60L9m15K95k0L0l78Q8L91l06J01j75J54J9j66J67K37k57k22
5765a93R6J40j30k40M50l24K26l2M6j44p3J38j09j11L64r6q3j9r8L19q8P5j12
5788Bj44R8j20J47j92L41o7k25J59Q2j15k34J80J08l44L43J29m3j15N2o6P9j61
5811a06j4m5j45M57j45p9Q0m8J83j60k03J55J87j06k68L89j48j17J63Q0k57L2
5833a15Q4m2J10J08p9J92l45J84j94RLJ56k1o0R6j75Q0M3J83j8m18J11Q7j4K77
5858B42n6n74O02Lk19mj72J72L38n51J38J39q9PJ04l25K3K30L32k52j0J99k32
5881D5j25L28l86J09J71p7Lj00K67l94k0o1K79j08Q2ql7r3J18q7J73j44J07j79
$$ plain form
5720 -8 -128 21 -98 -22 -47 224 198 -114 87 211 102 -90 55 -75 276 182 33 31 12 -98 -60 226 -196
5743 -196 -186 33 -35 225 264 -151 144 124 154 -224 -136 255 -51 50 -125 29 48 -118 49 286 29 -193
5765 -193 -97 43 -87 -327 123 -201 25 -7 39 -105 -178 -40 -149 -260 104 8 -75 -94 -192 127 39 114 2
5788 2 -142 -44 -164 -17 -209 132 65 -160 -1 81 -34 -268 -88 20 -324 19 148 105 -10 42 -24 55 -106
5811 -106 -120 -165 -310 147 2 -77 3 -45 138 -22 -225 -70 117 11 -257 132 -16 -133 30 110 -147 -115
5833 -115 -31 -73 37 145 66 258 -87 97 -97 -88 -85 71 50 -10 86 -89 -9 34 217 199 -219 -108 -21 -35 242
5858 242 186 -388 214 217 -2 -6 -178 -6 332 -219 -81 58 -31 -24 80 -245 -222 8 340 88 78 277 45
5881 45 -80 248 -138 -29 142 65 68 -32 235 -159 -179 -240 39 -69 13 5 -32 -125 -7 -94 79 -65 42 -137
5905a37J33J61j76J46j7k36K47P1Ml17L04k16K0r2k10M46j61L51n14K75j67K54
5927A69Q2j09j34k5J14j71j2MK26k41K03j92J24LJ03k87K68k01J44k47L86j84
5949B3O4p5k65M07kj10j41J28j91J14l2K2K22j4Kj43K66j77j79J12K10pj6l14
5973i6J45n6L58k65m8J29j59L00k96L0J07j23m04M93j6j22P8J80k16K0l00K53
5995hk89M30k20%J01l3j36J12N6j26J67m4p5J47k46J19k45K79j14J81j82n9K46
6018F1k1L2j29R5R5J51l40J50l15M92o30N18p8m5L8l5P8P6J31l04k69K51j34K16
6042H4K72k40j59J69j73k33J08M75m82J93J47k51j09L36k08N2k04J29J95j33M9
6063A7J58k27pK02l94L68j58J56k31o4J54j35L08k62o2J41j86L22m1k6J0l0l9
$$ plain form
5905 -137 -4 157 -19 127 110 -126 121 192 196 -121 183 -33 -13 -105 -315 131 -30 321 -193 82 -85 169
5927 169 251 142 8 -17 97 -74 -86 -82 144 -97 106 -86 38 41 144 -143 125 -76 68 -179 207 23
5949 23 87 12 -253 154 152 42 -99 29 -162 -48 -80 -58 164 150 152 9 275 98 -81 31 241 234 218 -96
5973 -96 49 -7 351 86 38 167 8 308 12 42 149 26 -378 115 99 -23 55 235 19 39 -261 -8
5995 -8 -297 133 -87 -87 14 -19 -155 -43 13 -113 54 10 -65 82 -164 -45 -290 -11 -125 56 -126 -185 61
6018 61 40 72 -57 38 133 284 -56 94 -221 271 -359 159 81 36 74 39 117 193 324 20 -249 2 -132 84
6042 84 356 116 -43 126 -47 -280 -172 303 -179 14 161 -90 -199 137 -71 -19 -223 -94 101 -32 17
6063 17 175 -52 -59 143 -251 117 -41 115 -116 -180 -26 -161 147 -115 -177 -36 -222 100 59 33 43 13 -26
6086b6l6k0J32Nq3j86K50l5l03L55p5RP1j00P8J20J05m19j5J32k7J69q1OL8j70
6112a06Q3o3j86L1J74k7m7M1J40J84k77o1j57N8K73J27l17o0Q7M6K43k45r3L61
6136B09j20k95L91j22J99k40o2J05j91j88K51K53k81q8p9K79p3q7q1L2K09J69
6158A90j93J71M0O1j20l01J34O8k47L34k15J29q4O1K11l92N0O0P7m4p1L92k94
6181A7q1L48l27J72k13l5J68j23J58m5N4j57j80N5k17M20J44j27k53N58k27P2
6203A81k21p7J0R4K51n18M24k44j6M14m57K65p3j95K08o7J04j2J43j80l3%o6p9
6227a44K31j26O7j59j21M60k70J84k45J09Jj31L33j35j25K78j52N5k14J41lk99
6249b65J73K4J9L6m2M3j58L9K90m3r9M5L1o3p3k4P2n2j8J22J81n8k60J10j01L30
$$ plain form
6086 -26 -62 -82 50 55 -28 -214 36 1 -302 53 -22 -13 58 -42 36 156 261 -158 -173 -41 -68 101 20 26 64 -106
6112 -106 -23 -86 -272 -241 -67 -94 -141 -100 40 224 -53 -114 -271 -213 60 187 -130 -190 -103 -57 186 -59 -152 209
6136 209 89 -206 185 63 262 22 -40 65 -126 -314 -63 190 -91 -179 -258 21 -52 -139 -220 -188 21 190
6158 190 -3 168 208 269 149 -152 -18 50 -197 137 -78 51 -33 28 239 -153 -103 -43 34 -10 -81 311 17
6181 17 -64 284 -43 129 -84 -119 49 -74 84 39 93 -64 -244 -189 -406 14 158 31 -222 336 109 181
6203 181 -40 -117 -107 -13 238 -280 144 -100 -116 298 -159 106 33 -162 46 -21 83 71 214 34 1 1 -65 -144
6227 -144 87 -39 28 -131 -252 208 -62 122 -123 -14 -13 -144 189 54 -71 207 55 110 -104 37 34 -265
6249 -265 -92 -68 -49 -13 -55 -12 -170 -131 159 116 17 62 93 30 -43 -67 5 -47 -65 57 238 180 -80 30 -71 259
6275B59m73l9L46K6j67K4j67K37l04K68Ll27L81K17l10mJ5n5N8N7P1k0k55K65
6299A06o4k32L34K0M4l76K25j79L93l81J99Nj15K88l09Q8q6K14o8j60J03K78k42
6322H5N1p0r3R8k44J98l08O61m75O0p9K28K54m25k18Q5L53o5l1j21L20j34O9l0
6346A69o3k38K18k6oQ3rl38L17j77J28r1J55k01J29J86j72l07L52j18J25j70k98
6369c52K99lj99J77J69j74q3j74K47%l41M80p8N3j67n8K5J26J15k51K79k32J59
6392A7l7o5n8J66L47l92K19k62j03J88k61J50J35j05j37K14j77J49o3J35k11J0
6414a41RQ3n5rK5J18k77M64j74oK12j07j25J6o6N8J23j90K00k84J03J1j3J68j29
6439A4j24K39k16R3O8p5R3o3j23Q7N3j93K64M5k28K51K0j15m44M61l48O73k93
$$ plain form
6275 259 -214 -253 93 119 -48 -24 -191 46 -258 10 13 -314 67 284 -26 -30 -15 -70 -12 45 116 96 -159 106
6299 106 42 -190 144 164 208 -168 57 -122 271 -110 89 94 -21 267 -42 46 -40 174 106 -54 49 327 85
6322 85 136 66 -27 71 -173 25 -283 378 -97 -37 -116 112 366 -59 -277 -192 161 96 65 -56 264 130 199 169
6346 169 106 -132 86 60 54 137 128 -210 107 -70 58 -33 122 -79 50 236 64 -243 109 -9 116 -54 -352
6369 -352 -53 -56 -255 -78 91 -83 -166 -340 -93 -93 -434 46 -32 21 -146 -204 -179 -53 62 -189 90 -142 17
6392 17 -20 -85 -143 23 370 -22 197 -65 -168 20 -241 -91 44 -61 -198 16 -161 -12 -75 60 -151 -141
6414 -141 -132 -49 -104 -113 -88 30 -247 217 43 37 249 142 17 33 -33 25 148 -42 158 -126 -23 -12 -25 143 14
6439 14 -110 129 -87 6 74 -1 92 29 -94 -7 46 -147 117 162 -66 185 205 90 -354 107 -241 432 139
6462A39M1k91J19J06K38l39j90J25p0J29j45J92k21J44R6J9j36Jj8K29l71L96
6484A93m22K23N8q3L3n9j4k6J60k63L77k39J65q1m3P5l03J55P5O9n9K9j74j09
6508b63L14Q0l18L23j34k71J75j44N26l28J4J5N5K58k01O7m20K52j09K47k34L24
6530B28l94J66J30k08J07m7k27n8J39J39k7J39k59J63Q8R4k29J79R1k75J81k54
6552a34L9K0J48q1j83R9l5p1L42k37K42j58j41K59k07J64j83J4p4K47j11K38k30
6575c3k06K26j58R2J68R4m9j59L17k48J9j8n1K22j13l3K8J36k93j07Q7J61ro6
6599GQ2j75L3Jm8L23j73Pq7M8K3P2j95R5L6N2j10k55N62k88r0Q6o8J57j26L1j96
6626a96L67j4j32K73k49j00R8oj11M7q1L7J75j36L20m34J66j91l5J69k32J11K21
$$ plain form
6462 139 180 -111 8 114 352 13 -177 -52 -122 7 -138 54 -167 -23 73 92 -44 -43 -61 168 -203 193
6484 193 -229 -6 52 -31 2 -57 -71 -97 63 -200 177 -62 103 22 -21 54 -249 -94 -19 50 -9 20 -154 -263
6508 -263 51 131 -187 136 2 -269 -94 -238 288 -40 -26 -11 44 302 101 168 -252 0 -109 138 -96 228
6530 228 -166 0 130 -78 29 -18 -245 -303 -164 -25 -52 87 -172 -9 79 173 -56 123 214 -61 120 -134
6552 -134 -95 -75 73 -8 -191 -92 -127 -198 144 -93 149 -9 -150 109 -98 66 -117 -103 -177 70 -41 197 -33
6575 -33 -239 -13 -171 -79 89 183 134 -25 292 44 63 45 -6 216 103 70 98 234 -59 -166 -79 82 73 7
6599 7 89 -86 -53 -52 -100 223 50 57 -30 18 41 113 -82 13 49 101 -9 -264 298 10 -80 6 -62 95 -31 0 -196
6626 -196 171 157 25 298 49 -51 47 41 -70 -23 -104 -67 108 -28 292 -142 24 -167 -202 -33 -265 -154 67
6649F7O2l78J19L67j01q2j50J23j58j13K50j99K98j19n9o2L31m1p9J00m36K57
6671cj04l6M5O8n3J75j62MQ4j77L4K8M13l02o6K75j79p9Q4J02j10k98j7J68J89
6696H3j34qJ70l05J8l8K34Lk91L70o1K5k64p3L40J41n2j28K5j05P9j74L03l82
6720b24L00k50K15K43k36p4%J08N3P0m42O8K35R1J70l18K25O0o50L50K14j01r0
6743A7J88k77J82j70J90p9j39k7J29o8o6j42M01j38o2p8J64l8l08K84j54J77J08
6766I4oN6k14k01M0K07M1N1kj00J30P4k17Pl20L27J21Jq3J39o9k53N7K04j60m0
6792a16J14J42j66K3J43o8j26N3j08j36M42Jj58R3l00J85m3j97K87k4K47m50J12
6815e0J19j07j41K08j26L5Jn1K8k89M43K07k77J9k93J81J70o0m27L74J71j92L48
$$ plain form
6649 67 129 -249 -130 237 136 54 -96 27 -131 -244 6 -193 105 -14 -73 -135 196 155 76 176 -260 -3
6671 -3 -107 -143 -98 -30 -83 92 -70 -66 18 -159 -125 -97 316 14 -52 223 44 -35 49 151 41 -257 -274 -106 83
6696 83 -51 -59 111 -194 -176 -214 20 23 -268 102 41 66 -198 -271 69 210 158 30 55 -50 29 -145 158 -224
6720 -224 76 -174 41 284 48 -26 -26 82 135 205 -237 -169 66 157 327 9 234 294 -356 -6 208 107 17
6743 17 205 -72 110 -60 130 51 -88 -115 14 -54 -120 -262 139 1 -61 -139 25 -13 -321 -37 -191 -14 94
6766 94 88 144 -70 -271 -231 -24 17 68 66 -34 96 170 -47 -40 -360 -33 88 89 6 145 76 -177 -120 84 -76 -116
6792 -116 -2 140 -26 -3 140 72 -54 -1 -109 -245 197 198 40 133 -167 18 -25 -222 65 41 288 -162 -50
6815 -50 69 -38 -179 29 -97 -62 -61 -112 -84 -373 70 277 0 19 -274 -93 77 17 -410 -36 135 -57 291
6838B91m66J85k0J13j55n3K67m1m41L61j05j50K14n3K3K30k85jk10L93j10K66
6860B53m53Q5K34j28J97k13j7Oq8K01J03J2k26lK96l15K6m6j0J63M4j23O3j40
6884g9J62Jp1j31P9%qj94M52k53J16L2J58k71n4K49N5k19R5l17L95l40K93j05
6908D5O4l3J63j38k9q5mR9j8j27j30K57N7j47J22j3%k9K2j41l4N3r2J58Q7l77
6934b70J8J21K42j01M9J1q0J40M4k77R2J0N3J61M0l25j93L71l9O7K59l24K78m07
6958f0OQ4l88L10J24k05J78J43j07j92k5j78R4M02j9M7l02n3R2k9m2J18OJ70k24
6983e0J76K2j37j07m2m1J28P3J14k96J92J3j67J46K42j74%P3J82k02j89K39j66
7006B9K09k34n5J22r7k04L94k72p6K10l3J94j62j58Nn9M63j26Ql02O3K50k31K5
$$ plain form
6838 291 -175 10 -10 103 -52 -105 162 121 -320 41 -64 -214 0 -53 -30 200 -85 -86 -296 97 -13 253
6860 253 -200 -115 119 -9 188 -25 -42 -36 -124 77 180 192 -34 -37 259 -56 -30 -76 -86 77 121 -2 61 -79
6884 -79 83 84 13 -118 -39 -39 -47 -241 211 -42 74 106 264 -7 -61 188 243 24 119 -198 197 -143 150 45
6908 45 109 76 239 101 72 -13 -17 82 64 -63 -193 64 121 -26 96 83 83 54 76 -65 -99 -46 -138 20 107 -270
6934 -270 -252 -131 111 10 59 70 -10 130 174 -103 -11 -1 52 213 253 -72 -265 106 67 134 393 69 347 -60
6958 -60 -54 30 -358 -48 76 -129 49 192 85 -107 -132 -310 -216 186 167 214 -88 -141 -49 -78 -120 -2 4 174 -50
6983 -50 126 148 11 -96 -138 -179 -51 22 136 -160 32 45 -122 24 266 92 92 165 347 145 -44 195 29
7006 29 238 4 -51 71 -26 -230 164 -108 -184 26 -7 187 25 -133 -128 -187 276 150 158 -144 -81 169 -62 -37
7030c7%lm2M4P5m8j08J55j92K47j09l22M35n1l08J88J50P2m72L23j63m2J95pJ83
7055A63m13J45o1J34j71L2L18j99K91j25L4j22L04l39L0P4m7Q2k86L2M06j21r8
7078F3M6k54N9J43j1M2qM9m4M5OR9l08J86j73K07j34rm0L22j87R6n5l14J23N6
7104EJ0q8L85l08J27j88J34n9p1j08J97J18j92j83K34q1k7J1J14k1j50J99k44
7127a86K40L8j93J86j13P7Pj3k62K17j4n7K05k06J60q2O1O8r3J33j29r2p7k8m5
7152a98J38N6lR6m42M28j32J48l8N1j0k23R6L1J72n0M4k60J17M1r4q7l5n8L14
7177A02j35J29l5l51L56p6J75j7k34n7J22R5j08o7J27J90k6J11k94MQk78L93l26
7201a92L64j47o2O0J06M5o6j9j35J42j83J87n10K78R5K1j3J88k26J75k78p5J90
$$ plain form
7030 -37 -37 -40 -82 -38 37 -11 -119 36 -156 91 -18 -340 95 44 -264 -76 74 146 -326 -3 -166 -208 -13 -20 163
7055 163 -250 -105 -166 -32 -203 -171 147 -52 239 114 148 26 330 -9 21 95 48 130 -156 -124 282 161 63
7078 63 109 -145 -86 57 46 88 80 129 85 130 136 235 -73 113 -60 147 13 4 -36 286 99 195 140 -174 -51 5
7104 5 15 -73 312 4 131 -57 77 18 -53 -161 36 154 -38 -221 13 -68 -95 -84 30 9 -141 58 -186
7127 -186 54 92 -101 85 -28 49 56 43 -219 -2 -16 -73 132 -74 86 4 65 133 40 173 44 -48 -125 -153 -198
7152 -198 -60 -4 -7 89 -353 75 -57 91 53 104 94 -129 -33 -2 170 120 164 -96 21 62 -32 -119 -154 -212 102
7177 102 -33 96 61 -290 66 -10 165 148 -86 -143 -21 74 -34 -101 26 216 190 301 7 11 19 -259 134 -192
7201 -192 172 25 -37 23 129 174 108 89 -46 96 -87 100 -410 -132 -37 -16 -29 159 -67 108 -170 -245 -55
7224e5NJ37k03L29j92l39K94L6j29j88L05J16q3K48k58P5O6j32j84m2N4J63k14
7247a91Q5J89r8m1J25j06K2k9L65m01N6K30n1q5l1J72l76K1K23k70R4M05m44K7
7271a09P8j19M1L4J91n4l70J94lJo2J0J73j55L45j59R0ll37m1K40r6J64PR5j97
7297d2m7o0P7L7J74Km77O81m58J93j20K58k45k6k56K83j05r4j9j26L75j06J75
7320G4K4m12J94p9L43k39l22L88l04L87o2K01k22l19L36k00J23K77j45j45O8J55
7342A21j03M7m9J52j17n7J09j27Q1JQJ00K5p9k0j40J11j50N9R4R5k44J63l45L02
7367C7l0J0j93J76J0O9j11j52J15j17M20l02M39j12m83j0M44n6p0k33K14k65j35
7390c35N85m20L52j59j60K77K1k88j02L12J02P8j69P3j71l53M31L7k14J23k37
$$ plain form
7224 -55 -50 87 -116 213 21 -318 -24 12 -117 -305 0 116 33 281 23 98 164 32 -152 -194 -140 23 -191
7247 -191 -106 83 -15 -56 69 -37 -15 -44 321 -80 -24 206 155 70 39 211 -165 -144 79 -191 -97 308 -136 -109
7271 -109 -31 -150 -109 -75 116 62 -308 -114 -117 -116 -178 -168 5 -150 195 36 126 123 -214 -255 -15 -111 53 60 155 -42
7297 -42 -89 -149 -72 -35 139 141 -336 345 -113 80 -40 218 -27 -53 -309 -26 -131 -225 -244 -370 5 -101 74
7320 74 98 -314 -120 -199 144 -95 -417 -29 -333 54 -8 193 -29 -348 -12 -212 -89 188 43 -102 -34 121
7342 121 18 65 16 168 51 -6 103 -24 57 58 66 166 191 112 92 -48 63 -87 -28 66 161 -83 80 -265 37
7367 37 7 17 -176 0 10 79 -32 -184 -69 -186 234 -68 371 259 -224 -234 210 154 84 -149 65 -200 -335
7390 -335 250 -170 182 23 -137 140 161 -127 -229 83 185 263 94 167 -4 -357 74 111 -103 20 -217
7411b17P3N0R6J95o4r4J21o7l79N55m29J54j65J6jP8m3l3j5m0K65J04k30J9M0
7436a1m7L73k39JJ15j16j41M3K35j00L2j68N1j92J86j37K98k70k8j22J05K8J13
7459Ij33J28J10j57mL5J4m1j37K21j64n6J87j14L4pj47K38J3J37Jj15j45k4K00
7484H3N7r4l7O2N3m2k22K95l38J15p5J79j91K70J56q6r3J26l58k10M26qL1lr7
7509ak53K45n6O8l2Q7m4RQ6M4j45j37j24K17j92J00J24k02J10j46K70k7j46K64
7533A19K36m09O6k6M8L2nqL6J41n9k69K24j68nK84k89J89l07K7J26J14j84j07
7557a94L09M2r7J22m46K23lK4j99M63j93J64j70r6j86K64Q1j06J40j53p3P4L3
7580B3K15n7m1k53M48j20j39o5J3J9j70K14m6o5L3l0j00j77M07l03J27j77Q3N2
$$ plain form
7411 -217 -144 -94 2 197 133 39 160 93 -286 269 -160 -6 -171 -155 -156 -78 -121 -154 -169 -209 56 160 -70 -51 -11
7436 -11 -58 315 76 77 192 76 -65 -22 213 113 145 -23 28 -164 22 -115 183 -87 -115 -237 -132 -104 9
7459 9 -124 4 114 -43 -47 -12 2 -39 -176 45 -119 -175 12 -102 -68 -75 -222 16 29 166 167 52 -93 -117 83
7484 83 140 46 9 71 124 82 -140 155 -183 -68 -143 36 -155 115 271 185 92 218 -140 -350 76 68 99 96 -1
7509 -1 -254 -9 -65 3 -29 58 14 23 109 153 8 -129 -253 -36 -228 -128 -4 -206 -96 -242 28 1 -145 119
7533 119 355 -54 12 -14 34 66 61 53 89 230 171 -98 126 -42 -47 237 -52 137 -170 -143 -17 97 -87 -194
7557 -194 115 157 60 182 -264 -41 -44 -20 -219 244 51 215 45 -51 -237 27 108 2 142 -11 -84 -10 23
7580 23 238 181 140 -113 335 215 76 11 24 43 -127 87 41 -24 9 -21 -121 -298 109 -194 -67 -244 -161 -109
7604a09J96j55j7p9O3J56j14P8kN9k25J17k2Q9L2P6l43K44l1J41q3r6J26j11n6
7629f6k5J37q3kJ92j29Q3O9n0l89J96J25j0j64PM2J87m72M94L8l35K7J79p8K37
7654B10m80O1L48j67p3O6L2M4j47L78n97K83j8M5J51O8j90j48K74r5j45P0L12
7677B82j74n7q6K5k22K30m52N11R9j70k19K84n7j60N56k54j91J37J67j77J0J31
7699B13%j2j03lP4m10K85k4j14K97k62J06L51n24O8M1L1p6k70N25k34j29K36j07
7723d1j1J20j49K23o5r9n2r3M7j9j18M61j40J3O8l04O6K16q5N6j78P7N8j51J09
7748IO5k10K18j56Q3K21j09n7k07J64R8j19P1N7j0j54J4J50r2k11J82L7j16L44
7772B72k36k09J04J6j91L45nk42j01L3L50j81L14l73NJ56J7n6o6J13k59J59j23
$$ plain form
7604 -109 87 -68 -85 -164 -101 55 -59 19 17 76 -149 -32 -54 35 67 143 -200 44 13 154 71 -25 101 -10 -66
7629 -66 -91 46 -37 -39 153 24 107 176 126 -263 -67 58 48 -116 -109 -67 120 -352 142 180 -155 -128 51 -27 210
7654 210 -270 -209 139 -28 -101 -35 -3 41 -106 272 -325 -42 -60 -15 136 204 14 -134 140 45 -100 -30 282
7677 282 108 51 -35 -10 -232 -2 -454 57 156 -14 -233 51 -6 -166 390 136 -55 82 249 72 82 213
7699 213 213 201 98 95 169 -241 44 20 -94 203 -59 47 398 -126 -58 -17 14 -62 -332 193 -41 -170 66 -41
7723 -41 -52 68 -81 142 77 -22 -74 -167 -120 -139 -257 204 64 77 145 -159 -93 123 38 94 -84 -7 51 -100 9
7748 9 74 -136 82 -74 9 230 121 64 -143 21 119 0 71 128 118 -36 -22 128 36 -175 7 44 -72 272
7772 272 36 -173 -69 -53 -244 101 96 -146 -247 -214 136 -45 269 -104 -99 57 74 18 -48 65 -194 -35 -158
7795a58L46k18jK20m18K80k54K61mk55Q1J3M25q0l79M97o58K79o8K87k31QJ14
7818H7L3O5m5o3mJ2M7m4p4Q9J06k33j48K93j34J16j28R8J2k07J61r0P2o3j25L06
7844A39k73K16L3k91L4K55j80j06J15J45k93L4m6r4P3N53l59P1M2p9J5j05r0J35
7868e6j21j32N43j62%p0j8J71k89L40k14J49L5j44m3j35N4K80n3k12n4J22J85
7891A76j83J06q7L5j00J04N5l6o1Q6k62M5R6J48j87M03l13J6M3r8o6m2K35K29
7915C42k80j02l0p0J77J04k21M5K4J8J71j00Nr8R0j76K66l27K67k51K67j32J38
7938A27j29J37P2j72P2p3J47m4r0j00J81l03qK95L0m34J59k3K15nj36J00J09r2
7962C5o1p7J87k58L53p1j77L2j26J51p8K9J19k53K09j74L33k04j41o2L42j14j06
$$ plain form
7795 -158 188 -30 -31 189 -229 51 -203 58 54 -201 -120 -107 318 238 -141 356 -302 -23 -91 196 -35 -27 87
7818 87 120 185 140 77 73 85 132 88 14 103 209 -24 -172 121 -13 103 -25 73 85 -122 39 -51 21 -42 -167 139
7844 139 -134 82 115 -176 -142 113 -67 -173 -58 87 -206 -172 -218 -312 -239 314 -45 26 68 -11 4 -101 -191 -56
7868 -56 -177 -309 234 72 72 2 -16 155 -134 206 -8 141 176 32 -11 -146 -92 188 135 -77 -131 -9 176
7891 176 -7 99 12 47 -53 51 106 70 9 95 -167 -122 -26 122 -65 338 25 41 84 -14 -80 -122 113 342
7915 342 62 -40 -70 -140 37 141 -80 -35 -11 7 178 78 83 -15 75 -101 165 -162 105 -146 121 -11 127
7938 127 -2 135 207 35 107 34 181 137 47 -53 128 -175 -183 112 142 -292 -133 -156 59 54 -82 18 127 35
7962 35 -26 -103 84 -174 179 108 -69 -37 -163 -12 -90 -61 58 -195 14 -160 173 -31 -172 -234 108 -6 -112
7985a12J58l6J30l07R6K32l58J02O0r2j0j3J52j75m6K17K81m04Q5J87K1m80M11
8008I9l8J2mp6J6L32k57j2j39J74n6j83K00n9O9p2m08O29j79k44L55l26K18j05
8032e4L08o4j17J04l46Q2j82K57m7L75j43l66L27k21K44J74k36p4MK92l51j59
8054a93P3J68J75n33L99j52L07k23l19M12m0k77J7L33o5j73P7q4J75k32K51j5
8076H1p2m3R7p6Lj3m0J7K82n07J54K70j57J71j9j55J45p3p8K25j98M4P2j07J21
8101A44j78J8R8j20p2M1P7M8l6k26L85j06k45M21l46J42k40K16m2N6R3j65J2K1
8125dJ77k54K14m61M64l1j63J65k83m0O8J70q1J27l2M7L6n1k06o9K63M8k89K81
8149I6j05P7m1j13p9P8J60j23R7k9p9J8k25M94j48Mk39K56j76Q5K33m43K98k02
$$ plain form
7985 -112 46 10 140 -167 -71 161 -197 -95 -35 -127 -137 -150 2 -173 -219 -2 279 -125 -40 147 168 -312 99
8008 99 61 73 69 -7 9 341 84 72 -67 107 51 -132 68 9 78 6 -402 227 48 -196 159 -167 51 -54
8032 -54 254 190 73 177 -169 -87 -269 -12 -59 316 173 -193 134 -87 157 331 95 21 25 317 -34 -193
8054 -193 -120 48 223 -310 89 -63 244 21 -298 114 74 -203 -186 147 82 -91 -14 -98 77 -155 96 81
8076 81 9 -34 63 -13 -10 -23 -63 -46 236 -271 -117 153 -4 167 148 -7 138 65 -13 212 14 58 130 23 144
8101 144 -34 -16 82 -38 -110 -69 8 56 20 -206 179 73 -172 249 -97 45 -195 21 -21 35 128 -37 -25 -4
8125 -4 173 -81 133 -328 136 105 -58 107 -176 -216 -148 22 -59 68 36 83 119 68 -138 -207 56 104 -185 96
8149 96 -9 68 27 -86 -165 -87 73 -50 47 18 -61 -43 -268 226 78 82 -157 99 -77 8 241 -202 96 -106
8173a06L8o6K98m34jK38K42j16l29J36K57p5j51L97k08k7j92j2
$$ plain form
8173 -106 -68 -134 164 -270 -271 -33 209 93 -236 -100 157 82 -69 328 120 93 -99 -111
8191a11
$$ Imaginary data points
##PAGE= N=2
##DATA TABLE= (X++(I..I)), XYDATA
0@%%%%%%%%%%%%%%Qj6J6j6J6k3L1l2M0m8N6o4P2q8J01j13J29j47J66j89K14k40
36a27K69l02L40l79M21m68N20n77O39p06P80q62R49j045J152j269J398j541J701
55H93j883K089k323K595k914L291l753M330n071O070p495R706j3644K2839q8640
70g3910m4766R5674Q163j4943l4856K329J5882L1105N422Q461K2521K7936j0792
83C8226j9900M422K5530o38k3727j6247J7049K5531k112m3198m1219j009L1991
96e301J6305j3511j9186J154R192l518j2263P653K9846J9960j1628j6997R232
109A0938K5623Q786j3927j5789N975K6208J2002k4137l2952j769J6972m210k0396
122f676p335N975k206j6020j9766o466J5189J8226q717k3780J671K7178J3236
$$ plain form
0 0 0 0 0 0 0 0 0 0 0 0 0 0 0 0 8 -8 8 -8 8 -15 16 -16 24 -24 32 -32 40 -48 53 -60 69 -78 88 -101 113 -127
36 -127 142 -160 180 -199 222 -246 274 -303 336 -370 410 -452 497 -548 604 -665 733 -808 893
55 893 -990 1099 -1224 1371 -1543 1748 -2005 2325 -2746 3324 -4171 5535 -8109 14730 -73910
70 -73910 -118676 -23002 -14839 -29782 -64638 -62309 -46427 -15322 -9900 -1439 21082 49018 38226
83 38226 18326 22748 48278 47640 23913 7666 24715 50246 48134 4936 -36283 -37292 -5301
96 -5301 11004 -2507 -21693 -20539 -11347 -14865 -27128 -19475 10371 30331 18703 1706 10938
109 10938 36561 45347 31420 15631 21606 47814 59816 35679 2727 958 17930 13720 -6676
122 -6676 -14011 -8036 -10242 -26262 -46028 -52494 -37305 -19079 -27796 -51576 -49905 -22727 -9491
135i491j2281q468J4008K3196J0578o235p650P227J7042K315j5087o329J3424
148B2249J0986j3533k3628o669J2132P606j2690j8900j622J3494O026j0524j0124
161b5197O769J7979Q672q004o724J2909J9905L12j4151p79J5832R386p604j4454
175A4851n947O404P238r147j9713m888J1897J449j7102j3042O543J1209j487j0418
189b2153n424P252J3375K892j0070m224J3889J4587l949j1057J936J3395O891
202A7340o978r539J769J0514L242j0496j1164K559J0369O39j2798r375N978J0305
216B365k763j2580k943J0055Q323m585q160J192J0334Q069l544q496K055J3732
230A3054N657r929q369O351R972j487j0356n481L222N317k457j1031o627O824
$$ plain form
135 -9491 -21772 -30240 -16232 6964 17542 11307 3657 10884 27926 30241 15154 8825 22249
148 22249 33235 19702 -3926 -10595 1537 9143 -3547 -22447 -24069 -10575 -4549 -15073 -25197
161 -25197 -18428 -449 8223 219 -6505 6404 26309 26621 12470 11691 27523 36909 29305 14851
175 14851 8904 15308 22546 13399 -6314 -11202 695 2144 -14958 -28000 -21457 -10248 -11735 -22153
189 -22153 -27577 -20325 -6950 -4058 -14128 -18352 -4463 10124 6175 -4882 -2946 10449 17340
202 17340 10362 823 2592 13106 16348 5852 -5312 -2753 7616 8255 -4543 -13918 -7940 2365
216 2365 -398 -12978 -15921 -5866 2457 -2128 -10288 -9096 1238 9307 5763 -2733 -678 13054
230 13054 18711 8782 413 6764 16736 15249 4893 -588 2634 7951 5494 -5537 -12164 -5340
244e340P634o423j2251K19J0666M940o366o199L853R557M982n249n754M585J0741
259I595J884q415m935O162P569l087j0117k737P329M685n577q840o17O741M283
274C923n198p747J402R053L719p661o191N371Q715q02p543k362N407O034j482
289D638p174l433O652P118l758r063K34Q728L452o096n547K337O747J358n752
304D41n615L022O880M33p992m801N395O593l118p670j297O656M759l512o056P18
320e164O423M210l693o056J829P472K898o773n034M735O630j882o958k295M590
335I32M105j975o049k660N026N011l583p336M17P135K531n917m362K547O011J166
351B999n052l597L437O211L53n893k326N411N862k198o119JN767L385l620n544
$$ plain form
244 -5340 2294 -4129 -16380 -16161 -5495 -555 -6921 -13120 -9267 290 5272 23 -5731 -1146 9595
259 9595 11479 3064 -1871 4291 11860 8773 -1344 -4081 3248 7933 2356 -6484 -7101 -360 3923
274 3923 -1275 -9022 -7620 1433 5152 -2509 -8700 -3329 5386 4584 -2959 -5321 86 6120 4638
289 4638 -2536 -5969 683 7801 4043 -5020 -4786 3942 7394 1298 -4249 -1912 4835 6193 441
304 441 -5174 -2152 4728 5161 -2831 -7632 -2237 4356 1238 -6432 -7729 -1073 3686 174 -5882 -5164
320 -5164 1259 5469 1776 -4280 -2451 5021 7919 1146 -3888 847 7477 5595 -1363 -3658 932
335 932 5037 3062 -2987 -5647 -621 4390 807 -6529 -6112 1023 3554 -2363 -6725 -4178 1833 2999
351 2999 -2053 -5650 -2213 3998 4351 -1542 -3868 1543 7405 5207 -912 -911 4856 8241 4621 -923
367i23L02N139J467m918n447P51M897M60o428m651L728N388j398n648r90M909
383c362M481j117l796l19N819N067k246n206J364O027K084n525m166J988L588
398D681n79n584l684J414L845j000n785k652M820M185j911m558J038N715L697
413C642k046l300K428N461K551l295l204K633M661J42n071l563K787L482k291
428E017o458k055L239K216l561m652r76L472K470k873m636J008O028J271l875
443d365j723L434M911L81l143j035L149M204l25m992j682M159K971l234n031m77
459b798L547M89m027l830K76L861M69l592l085L257M838O99k716n53M245N066
475F146q9l043N32M699L278k621k875Q9K599Q13l691m731m78K508o39n410l894
$$ plain form
367 -923 -621 4518 5985 1067 -4380 -3629 1268 1728 -4700 -9351 -5623 -235 -1633 -7281 -8271 -3362
383 -3362 1119 2 -3794 -4113 1706 6773 4527 -679 685 6712 8796 3271 -895 1093 4681
398 4681 4102 -1482 -5166 -3752 93 -907 -6692 -9344 -4524 -339 -2250 -6808 -5770 -55 3642
413 3642 1596 -1704 724 6185 8736 5441 2237 4870 9531 9673 4602 1039 3826 7308 5017
428 5017 -1441 -3496 -257 1959 -1602 -6254 -7230 -3758 -1288 -4161 -8797 -7789 -1761 -490 -4365
443 -4365 -6088 -2654 2257 2638 -505 -1540 1609 5813 5488 496 -1186 2973 5944 2710 -2321 -2798
459 -2798 749 1238 -2789 -6619 -6343 -2482 -2013 -5605 -8690 -5433 -595 104 -2612 -3165 1080 6146
475 6146 6057 3014 3546 8245 11523 8902 6027 6116 8715 9528 5837 1106 628 3136 2497 -2913 -6807
492f807K065K480j661l863j039K804L195J45k790j58M538L432j333l052J817M308
508D081R11k979k311J381K693j77l787k965J483K371j678m214j863K836K199j583
524c602l419M00L605K770j464k237J730M485J889j658j411K516M005P61k854j676
540C840K545K935j800l635j204J562Q12k504l674j384J802Q57k904l919J076L219
556b376J26k542j488K602K607Q50j710n48K835L291k42k734n04L119J570k392
572B464l125j55J774N7k679l131Q4K110k16k725j753J853K645K59j710n07L089
589a666L421j68j652R50L352J884j065j678L82K156J257k275k867N50J991p52
605C820k958k359J291J456j411k852q19J545J747o44k797o4K835K091j615j467
$$ plain form
492 -6807 -4742 -2262 -3923 -7786 -8825 -6021 -2826 -2681 -5471 -5629 -1091 2341 1008 -2044 -227 4081
508 4081 4992 2013 -298 1083 3776 3599 -188 -3153 -1670 701 -977 -5191 -7054 -4218 -2019 -3602
524 -3602 -7021 -6621 -3016 -246 -1710 -3947 -2217 2268 4157 2499 1088 3604 7609 8370 5516 3840
540 3840 6385 9320 7520 3885 2681 4243 5055 2551 -1123 -2507 -705 152 -2752 -6671 -5595 -2376
556 -2376 -2250 -4792 -6280 -3678 -1071 -221 -1931 -2479 356 3647 3405 671 167 3286 4856 2464
572 2464 -661 -816 958 1015 -1664 -4795 -4711 -2601 -2817 -5542 -7295 -5442 -2797 -2538 -4248 -4755 -1666
589 -1666 1755 1587 -65 885 4237 6121 5056 3378 3760 5916 7173 4898 2031 2581 4572 3820
605 3820 862 -1497 -206 1250 -161 -3013 -3832 -2287 -540 -1184 -3981 -4045 -1210 881 -734 -2201
621b201J054K441J251j654j102P71K309K64k224j858J589J562j092k667j059J357
637a259J110j398k523j96J721J165j519j560P71K497J255j288q18J737K606Q80
653C181j731o19K114J905m49j849o14J345Q15j146k555o88J277P09k295k424N72
670b452J772j76j566q22P40J884Q02j257j148J904K539m08j554j33J518J273r45
687A971j952j30J514O59j940j685J23J594L87j998j392P16J758j09j503r02J603
704a286J790p19j431l2J841J481p82j275L49J572J233j494j514P60J645L44j762
721G20j375J053J156l60j590q05Q81J037n02j985n68J803R63r97j541P23J413
738B6O02p89j197Q55J662L98j223p79Q61J488k81j589m66J183P46q25j475l42
$$ plain form
621 -2201 -1147 1294 2545 891 -211 560 2869 3133 909 -949 640 2202 1110 -1557 -2616 -1259
637 -1259 -149 -1547 -4070 -4266 -2545 -1380 -2899 -4459 -3688 -1191 64 -1224 -2042 -305 2301 3181
653 3181 1450 831 2945 4850 4401 2552 1938 3283 4098 2952 397 -291 986 1695 -600 -3024 -2452
670 -2452 -680 -856 -2422 -3244 -2504 -620 182 -1075 -2223 -319 2220 1812 258 125 1643 2916 1971
687 1971 19 -111 1403 2062 122 -1563 -1440 154 541 -1457 -2849 -2133 -375 -484 -1987 -2889 -1286
704 -1286 504 -215 -1646 -1678 163 1644 862 -413 -64 1508 2741 1247 -267 493 2138 2482 720
721 720 -655 398 1554 1194 -396 -1201 -320 717 215 -1770 -2338 -535 428 -569 -2110 -1387 26
738 26 628 -161 -1358 -503 1159 1557 334 -445 416 1904 1623 34 -432 751 1497 672 -803 -1145
756a145J395K55n55j736J90J352Q38j198q87P82J601J63j537l37P77J065J28j209
774e8q12J167J166n12j702k00J441Q16j509r96O18J228L63j118j020P17J321P3
792I83j328q31J226R53m72j279n18J077N42k94j342L24J052L47n12q50K76J394
810G48N40r70p96P56J083n1j026p69J145M93l22j159l68M68R34l90j584k71J348
829a91M60p50j137O09J243J27q71m62P46Q43K63j088j05P31J083n74p96l07R06
848G30O64q42j005m6J022P4p16o51K31P98K15j000p52N00J119j56p76o81J053
867b19R71k47q45l6P24R21l36p65l38J364N59j223o73J80R82l10r78r47K82O36
887b98P6j156o05P94P37l76j146K99J438O64m68q39N80J024N33o01l17L51J106
$$ plain form
756 -1145 250 505 -50 -1786 -1596 -244 594 -604 -1491 -709 892 1055 -482 -819 -42 1023 1151 -58
774 -58 -870 297 1463 951 -751 -951 490 1306 -203 -1199 -581 647 1010 -108 -1128 -411 910 983
792 983 -345 -1176 50 1003 531 -748 -1266 -189 353 59 -1283 -959 93 440 -72 -922 -646 748
810 748 1288 318 -478 278 1361 1310 284 -485 660 1153 831 -328 -696 -228 706 316 -1268 -1539 -191
829 -191 269 -481 -1618 -1009 234 361 -510 -972 -226 617 880 -208 -313 418 1501 927 131 -176 730
848 730 1394 552 -453 -499 523 597 -119 -770 -539 259 474 -526 -1278 -778 341 185 -591 -1272 -219
867 -219 752 505 -340 -376 348 1269 933 168 -170 1194 1753 530 -143 37 1019 709 -269 -1216 -934 -298
887 -298 -222 -1378 -1983 -1189 -452 -828 -1974 -1675 -237 427 -41 -880 -300 724 1257 656 339 690 1796
906A796mp18r44P01M08m23j122n75Q02N56p78p48m3N41N38l50m55l17J331N21
926G17n87o08O84R90J58r07k13K64J067k70j006l90P48L00q71j058k73Q26K47
945a82m16q88R2R65k86o15l56L09Q35K93m94k25N88Q04L9k66l57R76P80n12n20
966E64P1O60L62n51o99j04N58Q2j099n35J87N67q3q04k30O86K49J62l44m3N68
987B24Q08j99m31M4J047J48n20m65P9K97k11n36o95N0M97m08q85k98K31L12k25
1008a136n68j68P03M19j34o5l6J067L19j34o92N71N04K77l45m67L87N51k56n19
1028B78k55L47K68k54o61l72N45N10m96o50j11P59J84n08j48K94O98L16j96m89
1048E9K97Q18K51q91P9J70O19m30p07j11L19j0l83o58J06J30J6l31q21O0O28j45
$$ plain form
906 1796 1792 1074 130 831 1239 816 -306 -881 -79 477 -301 -1049 -1092 -551 -13 -363 -818 -1135 196 717
926 717 130 -478 206 1196 1354 447 234 498 1565 1295 289 -101 647 947 76 -982 -1255 -429 -182
945 -182 -598 -1486 -1394 -429 -715 -1330 -1686 -1377 -542 -249 -743 -968 -380 424 463 197 -160 816 1596 1084 564
966 564 635 1295 1657 1106 407 303 861 943 -156 -691 -504 63 -20 -824 -1054 -368 -119 43 -301 -344 224
987 224 1032 833 402 446 1493 1641 1121 656 735 1032 821 285 -410 -360 137 -271 -1156 -1454 -1223 -911 -1136
1008 -1136 -1704 -1872 -1169 -750 -884 -949 -985 82 401 267 -425 146 650 927 582 115 502 1053 797 278
1028 278 23 370 638 384 -277 -649 -104 406 -90 -740 -851 -92 92 -416 -564 -270 428 744 548 59
1048 59 356 1174 1425 534 613 783 1402 972 265 154 473 463 80 -578 -472 -342 -326 -657 -1478 -1418 -790 -935
1070i35j57k08O24M20O2o3k26N71M38P1n37L55K83M44m64k80k94N48j35l19o23
1091d25J81M45n16n6m99M17L42K2m51k89Q45O0P5O6k43N79L15k23k78K45J52J12
1113H76j40p74K58L26n8o25l95K76K66j34o12M4J96N09l75l64q9N88M49m80k00
1134d58j3N07K87Kp10O19K59j94k03j80O9O81j64l45j81K49K01l36n86J74K59
1155f3J59k86n05L73M14q1j78j65j0M76N18l87l59L98M25l93k74k1O6N45m58j23
1177G1k55K89J47k44m92j19M50R9o3l02L3L89l97J91m2L0K75m0J00m44M56M7M
1200A83j40l25O61K93m82m17K18K02l4j67l50K09K84K23o99Q7K15J70K11o83j38
1221d79N93J93j4l70l94M14L47l0n98NN97l21K09l50j01Q09k62k67l64L98J80
$$ plain form
1070 -935 -1092 -1300 -676 -256 -194 -257 -483 88 526 597 60 415 698 1142 678 398 104 652 517 198 -425
1091 -425 -244 201 -315 -371 -870 -453 -111 -89 -540 -829 16 76 151 217 -26 553 868 645 367 612 764 876
1113 876 736 -38 220 546 488 -137 -532 -256 10 -124 -736 -692 -496 13 -362 -726 -815 -227 222 -258 -458
1134 -458 -471 36 323 325 -385 234 493 299 96 -84 -15 666 502 157 -24 225 426 90 -496 -322 -63
1155 -63 96 -190 -695 -322 92 11 -167 -332 -342 134 652 265 -94 304 729 336 62 41 107 652 194 71
1177 71 -184 105 252 8 -484 -603 -153 -54 -117 -419 -386 3 -394 -203 -245 -215 60 20 120 -324 132 179 183
1200 183 43 -282 379 672 190 -227 -9 193 159 -8 -358 -149 135 358 -341 -254 -39 131 342 -341 -479
1221 -479 114 307 293 -77 -471 -57 290 260 -338 -333 264 -57 152 -198 -299 510 248 -19 -383 15 195
1242A95m6l39j31N50j2m01p6k63M67nP8q0j10K67L5o7m88Q39j68j43O7m00K71
1265D0L49mm03j83L66J47l45O9m09M08O8Pn03K26L29K8k53j69L96k68k3m7j54
1288c28L50K7j00j57k16O10j63J22k69j75K04R9J77k56pN34q2m47Q6j44K48J52
1310B65l69k88L79L33n19j17Q1MJ87J54o3p9n9M02k30k44J60K46K6j66j70K30
1332A63K40k53ml17K95J11j60j49l88L36k32K51k02j67J36N35j72l18l3N71k53
1353a0l1r5J65n5K95j76k26J27J84K32m80L8N30k14k14k00l4L34j93o1l57J62
1375b79J18J48k21k39L28K18j0n41J25K73N55k89m13Q8J67L50J5l08j56K16R2
1396B37j51j17j53L85k56j13j4j33J27j1m4Q4p8J69p5j30k9M04j7j31Q7L9J7K26
$$ plain form
1242 195 149 -190 -321 229 217 -184 -260 -523 -56 -61 17 -63 -173 94 129 62 -426 413 245 102 169 -231 40
1265 40 389 385 -18 -201 165 312 -33 36 -373 35 103 110 -393 -167 162 190 -63 -232 164 -104 -127 -174 -328
1288 -328 22 49 -51 -208 -424 186 23 145 -124 -299 -95 4 181 -75 -82 452 370 -77 9 -135 113 265
1310 265 -104 -392 -13 320 -199 -316 -235 -231 -44 110 47 -32 -91 311 81 -163 -3 243 269 103 -67 163
1332 163 403 150 146 -171 124 235 75 -74 -462 -126 -358 -107 -309 -476 -340 195 23 -295 -328 243 -10
1353 -10 -41 -136 29 -26 269 93 -133 -6 178 410 -70 -32 498 284 70 -130 -164 170 -23 -84 -441 -279
1375 -279 -161 -13 -234 -473 -145 73 63 -478 -353 -80 475 186 -227 -139 28 378 393 85 -71 145 237
1396 237 86 -31 -184 201 -55 -168 -182 -315 -188 -199 -243 -159 -237 -68 -143 -273 -302 102 85 -46 41 80 97 323
1420C23j0k03RJ39j27N8k37J71j91k4r7K12j6j31M3n2m8L18k1m00N0j28M19M4
1444A01j83J90k60K30j3l8n1k8K30j8l7j13J26n3j9k75j8L8K77j24j87K7P8R3
1468b7kj97K40k4K59j01k07K38l4J50Q3p9k04J85o6n9M5K32M0l05k36L6N7L38
1492C62l08l05N4R4k41J08j58K26L06j89l5R6J84J3Lj55O5K65k32J07j24p3m5
1515A8P5q5l16r7N9M42l40j18K40Q6k07k57N58p8K25j46r6M0o8J12K81m97K47
1538G8J13PJ02l2l29K39J91k69l33L76J90k37k96J36n3K19j84k76L07j89L35k90
1560a95J80p2j05J22j23J39J06J56nj89k79M34M0k94M9Q1k52K97l19j58lL77o2
1583g5j22k31J87K09j04J30k01P0O9R0K21j66o0R2J28l40k8K29J17j11m5j20J28
$$ plain form
1420 323 313 110 119 258 131 189 -48 123 -68 -92 -189 23 7 -124 -81 -133 -181 137 116 -284 -234 -362 57 101
1444 101 -82 108 -152 78 65 27 -24 -52 178 160 123 10 136 83 64 -211 -229 -191 86 -38 -225 -198 -120 -27
1468 -27 -29 -226 14 -10 249 148 -59 179 145 295 378 299 95 280 214 155 200 432 472 167 -69 -33 24 362
1492 362 54 -251 -197 -103 -344 -236 -394 -168 138 -51 -86 10 194 207 210 55 120 385 153 260 136 63 18
1515 18 93 8 -308 -405 -346 96 -244 -362 -122 -36 -243 -500 58 -20 205 59 -37 3 -65 47 328 -169 78
1538 78 191 198 300 268 -61 178 369 100 -233 143 333 96 -200 -64 -117 102 -82 -358 -51 -240 95 -195
1560 -195 -15 -87 -192 -70 -193 -54 52 208 203 14 -265 169 209 -85 -36 45 -207 90 -229 -387 -390 -13 -75
1583 -75 -197 -428 -241 -32 -136 -6 -207 -137 -68 22 243 77 17 109 237 -103 -131 98 215 104 59 -61 67
1606F7M7n49R8J94J72P8j63l4m9J05J04j80j06o7L48K6p5n8J30o5j5j3j99M87
1630B83j56%j61k97J73L13j81O1J17j04k1M6p6J1K44m32J6j53K85P9j74k96O26
1653B03k45K00J14l02J00j32N6J40o0l53K43K69k57J75N4o9n3P5m81L3J38J0m2
1676a84M9J40O2l4J93l63K2J34Jj26nM49l17R5j85J64J17l06J14L0k3J74m08N5
1700a52oJ43J42j6l21L00R4k98j33L47k28L39m67K48l27N59j46o5m4q9J92J9j70
1723g9J29m5j13J98K8k09j61K95k73M44l22L5n1l1K26Rl3j88J30j78O4L2r5m7
1747b35L13j23Q0j76o5J30O6pM2K37k00j09n6J5o9J40pJ11q7J61l45P0L52l79
1771a41ml9J52P5O2j2p7k40J16K50k65n9J34J85k35O2J66k47K32m8p8j36M10R0
$$ plain form
1606 67 114 -435 -337 -143 29 107 -56 -90 -139 -34 70 -110 -216 -283 65 91 16 -42 88 23 8 -5 -204 283
1630 283 127 127 -34 -331 -158 155 -26 35 152 48 27 73 -3 8 252 -180 -164 -317 -32 47 -127 -423 203
1653 203 -42 158 272 -30 70 -62 -6 134 74 -279 -36 233 -24 151 205 136 83 158 -323 -290 -152 -142 -184
1676 -184 -135 5 67 33 226 -137 -115 19 20 -106 -111 338 21 116 -69 95 212 -94 20 50 27 201 -207 -152
1700 -152 -158 -15 127 111 -210 90 184 -114 -247 100 -128 211 -256 -8 -335 224 78 13 -31 -120 72 91 -79
1723 -79 50 5 -108 90 118 -91 -252 43 -230 214 -108 -73 -124 -155 71 80 47 -141 -11 -189 -125 -93 -188 -235
1747 -235 78 -45 35 -141 -206 -76 -10 -17 25 262 62 -47 -103 -88 -157 -17 -24 87 0 161 -184 -114 238 -141
1771 -141 -145 -184 -32 43 105 93 16 -224 -108 142 -123 -182 -48 137 -98 -36 130 -117 115 67 -11 -147 263 353
1795C53l07n4j5K73l83Q6j10M49l43k32J7L56o1jr2k38K37R3K52j79n5PL5J33
1819B21k76M53m77P0P0j39k1L4K64L4l86k34L68j97J74o2J57J6j91R9j66K63m4
1842C0J38n2r0J60k29q0j10K37k9K30k56n5k9K43m8k24L31j87j01J71p0J51j26
1865Em0K50m11M6K91n1j33Q6j2p8J89qj16j72L26L0l96K61j09J66l39P2k72K78
1889a37P6J60j8l76J10K69m6l1k82l1K89O0JL6j47k01L85n5j18L47l31K63j87
1912C6M2j2r5J0j35L2J06J25l56K1J52J8r1q8M71l25J57L5p2J8j29N46n37J60
1936H9K11Jj89j80N7J26k07k8J51Q5l68K97J60m97J26L67k77k02K05o2j4K09k62
1959b02K61J13j97J65j97J05n1l7K34j76j50L72o1l32o9k9K82j04LNj39L10r9
$$ plain form
1795 353 46 -8 -23 250 -133 -47 -157 292 -51 -283 -266 90 29 28 -64 -302 -65 28 280 101 46 53 88 221
1819 221 -55 398 -79 -9 61 -78 -99 -65 199 233 -153 -387 -19 -216 -42 -104 53 69 -122 -23 -189 74 30
1842 30 168 116 26 186 -43 -123 -233 4 -25 205 -51 -106 -135 108 60 -164 167 -20 -121 50 -20 131 5
1865 5 -35 215 -196 -150 141 90 -43 43 31 -47 142 134 18 -154 172 202 -194 67 -42 124 -215 -143 -415 -137
1889 -137 -61 99 81 -295 -185 84 38 7 -275 -306 -17 43 44 80 -67 -268 117 62 -56 291 -40 223 36
1912 36 78 66 -29 -19 -154 -122 -16 109 -247 -226 -74 -56 -147 -235 236 -89 68 103 31 49 -80 466 -71 89
1936 89 300 301 112 -68 -11 115 -92 -120 31 116 -252 45 205 -292 -166 201 -76 -278 -73 -135 -149 60 -202
1959 -202 59 172 -25 140 -57 48 -3 -40 194 18 -132 240 179 -153 -222 -251 31 -73 -70 -65 -204 106 7
1982Gj4J02j24Q3J36L6j11q4l33M41j13j27J42J44j63M8K95n53J01K68j06j13
2004c8L07k38k6OQo3j98J18J07m7L16k01Q0j46J03l40rL15j19M8J76j21Pk72K07
2029b0N6M17n09j23j57K36Kl3J68J03m8J30J31k40o0l67L01K2L7J17k1p0o7J35
2053A40l07K62jL8j21J02J84k20k21J84l1K12k24J55q9N7k12O6L3k7J7j09O4J7
2077c1J52l96q4M22J79l36p4K64M43o17k24L28J89k68J85j40k50K60J34o8j90
2098a22M8kJ32J2J4k40j01M6J78M6q0O8R9j31l9K98l64J28n5j98M26n79J81L56
2122A21j15J11k68J87n3j04J88M5l88M17k54K23J68k1k81Q5L17k73j44J17r3J14
2144I9j60J88r5O1j36J05o3Np9P8qj19j0J00k1n2L20l66L55n4P7k49o1R1K43j31
$$ plain form
1982 7 -7 95 -29 54 190 226 115 31 -302 139 26 -101 41 185 22 70 365 -188 -87 181 75 -38
2004 -38 269 31 5 11 19 -44 -242 -124 -17 -64 252 51 131 -15 88 -252 -261 54 -65 -17 159 38 45 -227 -20
2029 -20 36 453 -56 -179 -336 -100 -98 -131 37 140 92 222 353 113 53 -314 -13 9 46 163 142 72 5 140
2053 140 -167 95 94 132 11 113 297 77 -144 40 9 221 -3 152 63 120 -92 -26 7 -20 -3 -112 -48 -31
2077 -31 121 -275 -359 63 242 -94 -168 96 539 -78 -302 26 215 -53 132 -8 -258 2 136 68 -122
2098 -122 -74 -76 56 68 82 -158 -259 -213 -35 11 -69 -1 98 -33 -72 226 -138 -10 -65 -263 163 -416 -235 121
2122 121 6 117 -151 36 -17 -121 67 112 -276 141 -113 110 278 257 -24 61 378 105 -39 78 -15 99
2144 99 -61 127 32 93 -43 62 -1 4 -75 3 -5 -124 -134 -34 -55 -107 213 -153 202 148 225 -24 -85 6 249 118
2170A18j49J00L5j43j09K41J46l21k2K43k8j21j2J74k67K0m3J7j19K90%j3o4n8
2194h5mJ5J16p1J54ll64M14k57J2q3M5j54K41j12J57n8J83k54m7Q5j73L76l81
2218b48J21R9j13l1M39m49L16j12p2Q7O7j1pk45q1K52j48K00M3o4j23O8l8N8K30
2243B38l44O4m4L23l29RM7J34j47L69k95p4O6J3j52o0J55Q3o3K03j71k84J17P4
2267f8n7L3L2R6k50L72q3j41J31o7M4M1k55K79Lo0M7j13J07q4M1j93r5Q6O7k5
2293a12o2NN2M00l18l5p3L08j00k84N4L25q5k43L02j56R1M0r9j05j09J36K85j29
2317H8l8k01n5K79j59J33l27K92M4m7j61J87k7l6MJ45m7nJ75k61L8%L1K9j1j67
2343i7Q2K52l51oQ1M28m18n9j04R8L54k79n6J3o6M6J25o4K25k59K3o4J04q6j44
$$ plain form
2170 118 -31 69 104 -39 -148 93 239 -82 -104 139 111 -10 -22 152 -115 -95 -138 -121 -240 50 50 37 -27 -85
2194 -85 -89 -74 42 -29 125 122 -242 172 -85 -73 -156 -111 -265 -24 -136 21 -37 146 -108 -155 -70 -243 133 -248
2218 -248 -127 -28 -141 -172 267 -182 134 22 -50 37 104 93 86 -159 -240 12 -136 64 107 43 -80 -12 -50 8 238
2243 238 -106 -42 -86 237 -92 -83 -36 98 -49 320 25 -49 17 30 -122 -182 -27 56 -7 196 25 -259 -142 -68
2267 -68 -125 -92 -60 36 -214 158 75 -66 65 -2 42 83 -172 107 110 50 97 -16 91 7 48 -145 -240 -154 -87 -112
2293 -112 -174 -169 -117 283 -35 -70 -143 165 65 -219 -165 160 75 -168 134 -22 69 109 10 -95 -204 -68 217 88
2317 88 50 -151 -206 73 -86 47 -280 12 56 9 -152 35 8 -28 -24 121 74 69 244 -17 21 21 52 81 70 -97
2343 -97 -15 237 -114 -120 -39 389 -29 -88 -192 -94 260 -19 -75 -62 -128 -82 43 -21 204 -55 -32 -96 8 -78 -222
2368b22J36J2K05j18o1J3o6L3O5J10Q9o4l4n6J73j55j99J27n1L03j69n1l40K97
2392b3L37n28K48j78M6L3N8q6L21j20kK7l69J95J32K12m10K45k64J57p4m2j0J21
2416B6L3j82K18J56l00Q8p4k63M34l9L3Rj66K52m76M18j51J27l2qK21j17k53j4
2440f0J17j3Q7m79L62j23n4J03J12o2J94J68l05j62K0J04J55k85N3l66L40K52
2462A58l90J06K10J21m6k9m1Ro8P4j60J30j38Q0j35j8K58J69l15q2K57j7K8k90
2486a29K87j60J37k37Q4m1K34j53l00J60J21k09J80P7k40J75n0J10j94p7J8J83
2508b4J74k54J24n1K19k43l7pK53k22m8J43k82L1J54J22j84J6Q4J06k65J77J46
2531A32j60K57j94n2Q7j45L01r5j46L09k44P2P2j79J5j0J79O7k61j44J94M0l58
$$ plain form
2368 -222 -86 -74 131 13 -48 -35 -101 -68 -3 107 196 132 98 42 215 60 -139 -12 -63 240 71 20 -320 -23
2392 -23 314 -214 34 -144 -98 -65 -7 -93 228 108 106 133 -236 -41 91 303 -107 138 -126 31 -43 -85 -95 26
2416 26 59 -123 95 251 -49 39 -35 -298 136 97 130 139 -27 225 -251 167 16 143 111 103 324 207 -46 -60
2440 -60 57 44 131 -348 14 -109 -163 -60 52 -10 184 352 47 -115 -95 9 164 -121 -68 -434 -94 158
2462 158 -232 -126 84 205 159 130 89 98 30 104 -56 74 -64 16 -119 -137 121 290 -25 -107 150 133 161 -129
2486 -129 158 -2 135 -102 -18 -59 175 22 -278 -118 3 -206 -26 51 -189 -14 -64 46 -148 -225 -207 -24
2508 -24 150 -104 20 -31 188 -55 -92 -99 154 -68 -116 27 -255 -224 -70 52 -132 -116 -32 74 -191 -14 132
2531 132 -28 229 35 -17 70 -75 226 131 -15 294 50 122 194 15 30 20 199 266 5 -139 55 95 -263
2554b63K74k00L19L4n9K3J0J32k53k3q9J10rk9K15j19l7Kl22L26J43k45J15J43
2578A98j92k99L76j84k8j27M59j74R2p6j29J94k35q3J37P7j0J51j4pk88J8K7K19
2602A02K3j22M6j03p7K43k07l0K51O9j08k24K11N6m74N40l65P6K4j12J46m4J54
2625G5r0J59j02J04l34N2K65K0j2p6j13K21j07j58k4K94k9r1l2m7j4O8n1j02L49
2650B25k85J18J21j67q3J92j04J96k70J8o8KJ27k36M36l01J75j39K58m51M26k04
2672a4k30K91J8j44R3n7N2j60J73k34K65J45j43m3j64K65j04L8M6k05K01J58j92
2695E5j49K17k21m9L65k00r5r4J67r7J04K33k88K19l10J89K22k06j6J07l62L61
2717A52l7J91m68o1K45PM89m90po9j58M34o3J19l81J3K03L0L3k47n1K71k2m34
$$ plain form
2554 -263 11 -189 130 164 105 128 138 270 17 -6 -95 15 6 -23 192 73 36 38 -284 42 185 -60 55 198
2578 198 6 -293 83 -101 -129 -256 203 29 121 45 -84 110 -125 -208 -71 6 -4 147 133 126 -162 -144 -117 102
2602 102 125 3 49 -54 -131 112 -95 -125 126 195 87 -137 74 130 -344 196 -169 -93 -69 -181 -35 -79 75
2625 75 -15 144 42 146 -188 -136 129 149 137 61 -52 169 62 -96 -120 174 145 54 22 -25 -39 29 -22 -124 225
2650 225 -60 58 179 12 -71 121 17 213 -57 -39 -107 -105 22 -214 222 -79 96 -43 215 -236 190 -14
2672 -14 -244 47 65 -79 14 -43 9 -151 22 -212 53 198 55 12 -152 113 9 47 93 -112 89 247 55
2695 55 -94 123 -98 -147 218 18 -77 -171 -4 -101 3 236 -52 167 -143 46 268 62 46 153 -209 152
2717 152 115 306 -162 -223 22 29 518 28 21 -48 -206 228 165 284 -97 -84 119 149 182 -65 -116 155 133 -301
2741c01N36l84k3M0O5m1K78k04q9N9m6K49j93n2K98m53K98j09O5k25J14o8K58
2764G2o4M2k29J17O4R2r0K71j59l90L97J60j67l46L78j3j56J43O7q3k56J85J55
2787A90l49L0J55j32J08R4j23j37K5K02mJ9J27k63J3K34k75j66N28k94P5k04K41
2810I4r3L29k36l23M20J28k62q2J1j60L50l39L49j1j33L1r2j43J50j69J50J63
2832A32j84j21O8O6mm5J53K2m4k5J46j01l4J87l97J02JM2J01j13J40q6K08n04
2856b90L79k14J90k27M54k80Oj37K09j4j10J48k63m6L28K8j53Q4Jj27k79L75k60
2879a98K54k46J55J21k01m2j9J52R6P8l35K19l3r9K07M8k05m5L74l09j05J30j77
2902a80Q9O2lJ58j55L6K44l28J13m8L54k01O7l1k9m3q6j19J83O0k28P4K4O7j77
$$ plain form
2741 -301 235 -149 -172 -132 -67 -108 170 -34 -123 -64 -110 139 -54 -106 192 -261 37 -72 -7 -232 -118 -186 72
2764 72 8 50 -179 -62 2 94 4 275 116 -274 123 283 116 -230 148 135 -21 122 189 106 -150 35 190
2787 190 -159 -129 26 -106 2 96 -27 -164 -139 63 59 78 205 -58 -45 189 -86 -252 276 -18 57 -147 94
2810 94 1 330 94 -229 191 319 57 -25 -14 -174 176 -163 186 175 42 73 -19 -162 -12 -181 -31 132
2832 132 -52 -173 -105 -39 -43 -88 65 87 43 18 164 63 29 216 -181 -79 -78 -36 65 -48 92 6 214 -290
2856 -290 89 -125 65 -162 292 12 18 -119 90 76 -34 114 -149 -195 133 161 8 92 93 -34 -313 62 -198
2879 -198 56 -190 -35 86 -115 -157 -176 -24 72 150 -185 34 1 -98 109 157 -48 -93 281 -28 -133 -3 -180
2902 -180 -91 -29 -32 126 -29 7 251 -77 36 -12 342 141 208 177 148 105 19 -100 83 143 -85 -11 13 80 -97
2927i7L9L78k48p5M4J89k78N53n22l4K12k60P1Q4K22j26k44J20O0k19j22K08K0
2950b5M5q8k18J28K54p8J81r2k02o3J72q5J53r2m0K26m09K76j28J70r2j71J22
2973e6j58R5J41L2N1k11L36l05k7J00Q3J18j84j28Q1J85J1k42J32K8J28j17N7
2996A50n8q6j10J26N2m6N6k9k8k8K18l16J87j93J42nJ67j5k46K53k16j73J35j38
3020b01J76J55r5m5J94k3m56L94k08R4Kq2m6J45J31j12j55J50J03j66j18J26o0
3043i7L6J25O8K33k25k08n1%O9j72J10j18L7K76k48J70K45l67J01j79Q3J98l38
3066b52K64L1r9P7l48L70J07j61j97r5K32J35oq9q8n0NJ65J12j73p0L16J51l19
3090A8n3o4K63M2k24J70p2O4O7j91k24J79j43L6J18n5J07j42L66l23p5N9K1K15
$$ plain form
2927 -97 -58 320 72 -3 41 230 -48 505 -17 -51 161 -99 -28 56 278 152 -92 28 88 -131 -253 -45 -25
2950 -25 20 -68 -286 -158 96 18 199 107 -95 -158 14 -71 82 -10 -50 176 -233 43 -85 85 -7 -178 -56
2973 -56 -214 -119 22 54 105 -106 230 -75 -102 -2 81 199 15 -113 -32 153 164 -78 54 82 210 93 150
2996 150 92 6 -104 22 74 28 84 55 27 -1 217 -99 88 -105 37 32 199 184 -62 191 -25 -198 -63 -201
3020 -201 -25 130 35 -10 184 161 -295 99 -109 -15 -13 -95 -141 4 135 23 -132 18 121 -45 -163 -37 -97
3043 -97 -61 64 132 365 140 -68 -119 -119 -50 -222 -112 -230 -193 83 -165 5 250 -117 -16 -195 -112 86 -252
3066 -252 12 43 -56 21 -327 43 150 -11 -208 -303 -71 64 58 -31 -119 -169 -164 1 113 -60 -130 186 337 18
3090 18 -35 -99 164 206 -18 152 80 144 211 20 -204 -25 -168 -132 -14 -69 38 -104 262 -61 -136 -77 -56 159
3114A59k45J58q6j08k7K13k45J01Nj95K53j56K23K57m71k3J47M56p19L80j29k17
3136b69J61K71J0J67l00J41p4P8m4j86Q9j35N9o7k6K15j22R1j17m5L99j62j46
3159a2q4q3J19Q8l7j84J26P5o0P5k02J00K36k43J84m66J77J93J43J03l87K51l09
3182a97L46j15q1J63j3k68J92M7l57J89q1M30Ll69K09K6k47J68n6J41n2l8o5j06
3206a31J87m3J51q0J18j59k45M22j71m3k4j42M28l99J78l65L05K8J18j51j1k5
3228e4L6j90K49j57J5Q8q4L61m69K85k18K24k5l6J29N4j00o3lj20J87k61J67J5
3252C0J15r8o3j06J94k21P9K69k17m9j47K73K9l19K52J02j5l2K98k64J11j09j62
3275e0k3q2J58o2P1K34j73o5K51n9q3j33J92n3m97L75J1j24j5L03k20O4J42j86
$$ plain form
3114 159 -86 72 -14 -122 -149 64 -181 -80 -75 -270 -17 -173 50 307 -164 -187 -40 416 -303 77 -52 -269
3136 -269 -108 163 173 340 40 181 107 185 141 -45 44 -91 -32 -99 -125 90 -32 59 -58 -103 296 134 -12
3159 -12 -96 -179 -60 28 -9 -193 -67 8 -52 23 -179 -79 157 -86 98 -368 -191 2 145 248 -139 112 -197
3182 -197 149 34 -47 116 103 -165 27 74 -283 -94 -175 255 258 -111 98 124 -123 45 -11 130 78 40 -25 -131
3206 -131 56 13 164 84 202 43 -202 220 49 6 -18 -160 268 -131 47 -318 -13 15 133 -18 -29 -54
3228 -54 -18 -208 41 -116 -101 -13 -97 264 -205 80 -138 86 61 25 154 208 108 45 42 -78 109 -152 15 30
3252 30 145 47 -16 -122 72 -149 -70 199 -18 -67 -214 59 88 -231 21 123 108 76 374 110 221 112 -50
3275 -50 -73 -155 3 -59 12 246 73 8 259 200 117 -16 176 123 -374 1 12 -112 -127 176 -44 20 162 -24
3299b4j43n7K41K36l42L71k73j57J94j96J46K67k41J77l57J18K83k85K00j88L79
3320C49m39J84k67K20m69M51M1j68L04j16j00r4M0K37l40J39J0J12Pj07k2l7l7
3343a02J10l6K80j62j06o4K38k22Q2q7o3L47j30M6j26J21j93m5K10k69L89l70
3365a52J17J03l1j89N2K10K1l05L80Ll94j5J08k6R0J03o3jj27K72j69l2%J28l8
3390D5j39R8N7m0k7Q7LK1M4j94L21r4r0r5J74k6k55j18J77k0R0O8k95j18M48k1
3416A01j81N1l3L1J96k17N4o0J36l6p2j68L10l41J29J69r3o4L50k14J42m80J57
3439a33L40j5k41R3Q8j89p9K27j77J48K10k31p3J46l2k14mJ28K03n05J18K95j34
3462c1l6N8L23l07M6j0J69m55K94R8l22L27n7j82k1J7J65q8k0N1O3M8j37M6n2
$$ plain form
3299 -24 -167 -224 17 253 -89 282 9 -148 46 -150 -4 263 22 199 -158 -40 243 -42 158 -30 349
3320 349 -90 94 -173 47 -422 29 70 -98 206 90 -10 -104 -64 173 -167 -28 -18 94 101 -6 -28 -65 -102
3343 -102 8 -28 252 90 -16 -80 158 -64 18 -69 -132 215 85 131 5 126 -67 -112 98 -171 218 -152
3365 -152 -35 68 37 -152 -100 110 131 -174 206 209 -185 -200 -92 -118 -28 75 12 11 -116 156 -13 -45 -45 83 45
3390 45 -94 4 61 21 -6 81 84 105 149 -45 276 182 92 -3 171 145 -110 -228 -51 -71 19 87 -208 -326 122 101
3416 101 -80 -29 -62 -31 165 -52 2 -58 78 42 -30 -198 112 -229 -100 69 -24 -88 262 48 190 -290 -133
3439 -133 207 192 -49 44 132 -57 -136 91 -86 62 272 41 -32 114 82 -132 -136 -8 195 -310 -192 103 -31
3462 -31 -67 -9 314 7 53 43 212 -243 51 149 -173 154 97 -85 -106 -89 76 -12 -32 19 82 130 -7 39 -13
3487a3J49j27J11K87l75N0l38J8K04j40J49%RNj29K42l26J16P6J74n2j49L25k09
3511E7m05K36J10j4K7j8n2J82k51L84k43n9o7n2K02P8k86q0R7K66q0j54j0K65
3535A33k92K90l9r1N0o7J10j50K11j77L35m12j69K07K9j28K10j64K1J95k73M3
3557a28Q7P6p2N9j00J4J70q6J18N6k66K35m58L08K37k15J23l15J63J84l36J17
3579b9K04j0j14N7j65K10k86N6J21j85L1L17k38k4r8J06p1J2L57m22K03J44j50
3602B6K85k69Lk02L14j75j29M29l57K06j94K10q1p5l9J82lp5j95K12j69K95p7
3625A22J24k45KJ29m13M02q0j56j20L78j90K31o8k13RK75P0k46k4L3J37m02L74
3648A29k02j41J75O7k86M72k49M7j62J46J2K7j81J27J73l4j37k00J43K28j96K75
$$ plain form
3487 -13 136 9 120 407 32 82 -256 -238 -34 -174 -25 -25 -16 -11 -140 102 -224 -108 -32 142 90 -59 266 57
3511 57 -348 -112 -2 -16 11 -7 -59 123 -128 256 13 -46 -113 -165 37 115 -171 -251 -154 112 32 -122 -132 133
3535 133 -159 131 92 1 51 -16 94 -56 155 -22 313 -99 -268 -61 -32 -160 50 -114 -93 102 -171 -128
3557 -128 -41 35 -37 22 -78 -64 106 20 138 194 -72 163 -295 13 250 35 158 -157 6 190 -146 -29
3579 -29 175 165 51 108 -57 153 -133 -77 44 -141 -110 207 -31 -55 -153 -47 -118 -106 251 -171 32 176 26
3602 26 311 42 45 -157 157 -18 -147 282 -75 131 -63 147 66 -9 -48 134 131 56 -139 73 -96 199 122
3625 122 246 1 3 132 -281 121 41 -115 -235 143 -47 184 116 -97 -88 187 257 11 -13 20 157 -245 129
3648 129 -73 -214 -39 28 -258 214 -35 12 -150 -4 8 35 -146 -19 154 120 -17 -217 -74 154 -42 233
3670B33k03nk4J27k53L49j13j86N5N6J3j55J82k6j35N4j0l6j4k8K13l46K45p4
3694h1O7P9J9j7L3l12J12K6J38M7M9k10J40P8o0l22K93k6k6k17N6R5J1M2Q0j35
3720d1l4K62k91L53j43N8j07j94J58K2N5m21L29O0R1q3Rp2o9j71J48J97j07k23
3744b14R6L29l2k54O6j36K68l04L00k37J44qO4q1J76O6m37N8L96k85k6J23p6J02
3768I8o7m1k86N94j90j61L63l00k23J09J37l28L19n2M7O8N6n02M08P0J78j20j67
3791A0Q9J13p1l36JRR1k5Q6J33l22K57k69M5J51l8K69k4j92l1J7K5m9O0m9PJ53
3818A10k83j51L43Q8k32j57L23QJ80l48K44L5j66k1m7m2N49o12K78Q7k30K92k65
3841a7J2M3pn3j81M8j2N2K68j56M1k68J59L10l31K06j18m00M18Q5J54p7o5p9J20
$$ plain form
3670 233 30 25 1 128 -125 224 111 -75 -20 36 49 -106 76 50 -85 -31 -41 -77 -91 -119 94 -252 -7 -81
3694 -81 -14 65 84 67 100 -212 -100 -74 64 111 160 -50 90 168 108 -214 79 53 27 -190 -134 -39 -28 14 94 -41
3720 -41 -75 187 -104 249 106 164 57 -137 21 43 98 -323 6 66 157 74 83 11 -58 -229 -81 116 9 -214
3744 -214 -118 211 179 -75 -9 -145 123 -181 119 -118 26 18 82 1 177 243 -194 -136 260 -25 -51 72 -4 98
3768 98 31 -10 -296 298 108 -53 310 10 -213 -104 33 -295 24 -28 19 87 143 -359 49 119 297 177 10
3791 10 99 212 141 -195 -194 -185 -94 -119 -33 100 -222 35 -234 -189 -38 -76 193 169 -23 -54 -37 -12 -61 -1 -50 -43 110
3818 110 -173 -324 19 107 -125 -282 41 49 229 -119 125 160 -6 -27 -74 -116 433 -179 99 186 -44 248 -17
3841 -17 -5 38 31 -22 -203 -155 -167 -115 153 -3 38 -230 -71 239 -92 114 -4 -404 14 99 253 176 111 32 152
3866A52l35L29m8j29K60k73N0k34L11j60j6l8NK51j27q0jJ14N8m39K86j34K74
3889G6J06j91p3J41n3n8J73Ml06O7n2J90k09K27mLN7j41J06j62L79m48L68l34
3913a34L04k68P7j31L27p5k2L9P8j95q3J39O4mo4J65k42j88P8K08j72R6j62K73
3937A08m02L44k67M7J94j34K20j46J38k67K80q7Kj6J5q4N1k54J44M58m82Q8NK7
3961a8L6j8L35j71j51mM8m1j18M4K12p4j1j40J09j45J37L40m93J43m44N33k29
3984a20PM29k53k78M04l34L34j52r4M3j9J93rj32o3j18K18M5j00M7j18RJ58j40
4008d3M8n5k93M03j90K69j20k4J57K7k36l6Rok08M74n8l67M03k22P1J83j95J21
4032A12P2k80K21jK9j74q9L5j1mn3j76J93J26r5K35l48j8K40j79O2J29J54j39
$$ plain form
3866 152 -183 146 98 -31 229 -44 6 -228 83 -77 -93 -131 -126 125 -2 -82 -83 31 89 -350 -64 -198 76
3889 76 182 -9 -82 59 6 -52 121 125 -181 -114 -166 24 -185 42 38 41 98 -43 63 -99 280 -168 200 -134
3913 -134 170 -98 -21 -152 175 100 78 117 195 0 -83 56 120 116 52 217 -25 -213 -135 73 -99 -3 -165 108
3937 108 -294 50 -217 -170 24 -110 110 -36 102 -165 115 28 30 14 29 -55 -4 -258 -114 344 -138 -50 -45 -18
3961 -18 18 0 335 164 13 9 57 16 -102 -58 154 80 69 -71 38 -107 30 370 -123 20 -424 109 -120
3984 -120 -113 316 63 -215 189 -145 189 37 -57 -14 -33 160 151 19 -44 -162 56 101 1 48 -70 -61 97 -43
4008 -43 5 -50 -343 60 -130 139 19 -5 152 179 -57 -93 -84 -90 -298 176 118 -249 154 -68 3 186 -9 112
4032 112 184 -96 125 124 153 -21 -110 -75 -86 -90 -143 -319 -126 0 -95 140 -208 -226 14 -165 -103 26 180 41
4056D1p7N1k2o5m8M5M7j00R9J94m65J53j01M9J99L86m97R7J57j52r2P9OQ1J41
4081B06k08j9J49k65K45R4k55O0K5j85J45J39j38j77L5K7l78L44K50J71m81L16
4103A00j53K23k55OJ08L69l81%n1J37m4Q8j99J74k84J23NK5J08l16J04l7K77K6
4127A53k06J59l3J81n02L63Mk2Rr5k36K30j00J15R0j9j17J21k86O3p4K94k0k42
4151a70K89k19J32j67M2P2j26L72j99o6J70l60J25J51j86O5K17k45m1m0K86O0
4173A62k3N6J2k77N9j20L01l63M74m46J50L21j21l11k0J26k3M6L8j25J08j40j29
4196b45J46N3J01J37n18K63J62m1j30q4J95q7K71j20n9K78k95j91J07J67o9k94
4218b53J17K27Q6J8q4J98k73R2k28jj2K16r6J4k1k83J06J73K23j60k52L02L31
$$ plain form
4056 41 -36 15 -7 -72 -120 -75 -28 -128 -29 165 -300 -147 -248 -199 0 386 -111 -14 143 -9 -101 -22 -16 65 206
4081 206 -2 -21 128 -137 108 202 -53 7 32 -153 -8 131 -7 -184 -149 -122 -500 -156 94 265 -216 100
4103 100 -53 170 -85 -79 29 398 17 17 -34 103 59 147 -52 122 -162 -39 -34 -9 99 -217 -113 -150 127 153
4127 153 -53 106 73 254 -248 115 119 97 106 11 -225 5 -95 20 110 91 -26 95 -191 -128 -202 92 72 -170
4151 -170 119 -100 32 -135 -93 -21 -147 225 26 -40 130 -230 -105 46 -140 -75 142 -103 -144 -184 102 162
4173 162 139 195 207 -70 -11 -131 170 -193 281 -165 -15 306 185 -126 -146 -20 -43 3 41 -84 24 -116 -245
4196 -245 -99 -46 55 192 -326 -63 99 58 -72 -156 39 -48 223 103 44 322 27 -164 -57 110 41 -253
4218 -253 -136 91 177 195 111 309 36 128 -100 -101 -113 103 7 21 0 -283 -177 -4 219 59 -193 109 440
4241D40m69J13k64L7j16J84L0J36Roj38l6r7K95j08J15L5j16j13j5J3J21j6N2
4265H6n1j56N9R6k28J90L8j75K03P0l97J24R6j28M60k13l71L12k33K41k6k7O7
4288C7j33l7K72k89N6L74k79O3j01O7j57K4k1J32j87J30R2l41L86k36K07O5O5
4311A89k6J6k71j65M31l5M4k75j4L88k75j97M51k63J9l03L41l30N5K27k35K08
4333b0PJ31j18j11Qj4J00J7j41K46j47k0j40J65R7R1m9j5j6lj30J02q3J87j81
4358c7J39j12J1J27k08J39N5l7k31J96k91O11j21m01K80J04m6j18P8j67L40m41
4380a30L70k32k61M15l38M38l10nL07q7j81K8J89j43J34j89J2j09Q0J13j94m8
4402a41J34m3j60L70p3J74k32j85KJ34O4q7K68m65K9K13K97l42j09O3L23j17m
$$ plain form
4241 440 -29 84 -180 -143 -259 -75 -45 91 100 94 -44 -80 -177 118 10 125 160 44 -69 -84 -71 50 34 86
4265 86 35 -121 -62 34 -194 -4 34 -141 62 132 -265 -141 -45 -173 287 74 -297 15 -218 23 -3 -30 37
4288 37 -96 -133 139 -150 -94 280 1 64 -37 30 -127 -103 -124 8 -179 -49 43 -298 88 -148 59 124 189
4311 189 163 179 -92 -257 174 139 183 -92 -106 282 7 -190 261 -2 17 -286 55 -275 -220 7 -228 -20
4333 -20 -13 118 0 -111 -103 -117 -17 0 -141 105 -42 -62 -202 -37 60 151 102 87 71 68 -62 40 -43 144 -37
4358 -37 102 -10 1 128 -80 59 114 77 -154 42 -249 362 241 -160 120 224 178 60 138 -29 311 -130
4380 -130 240 8 -253 162 -176 262 -48 -53 254 167 -14 14 203 60 194 5 17 -92 -12 101 -93 -141
4402 -141 -7 -50 -210 160 87 261 29 -156 -154 -20 44 -43 225 -240 -211 2 299 -43 -152 -89 234 117 113
4425A13P1k29J94k39r8L05k28Q4O2rp5j44k2L68j45j33L19k82j06L72o4j69K63
4448B08r4Q6m21K93j43KN7j15L28j39kpJ97m5m47M42l70O8J33J71k73j28L45m55
4472c09L15K66o22M45KJ90r2j75J06j14o0J07j20R4J04k55L05J6l05J85p4L4J35
4495A78p5p6J33p1k69M10j71Kj31R6k21J47P5J25l60J49P2J7N2j39j55J77K9j21
4519a27J3k3K5K13j35j14J57j08o9J06k5J49p0k0O3j76K5Rj58J51Q3J53k6J01
4543A97l01N5Q8Q0k69o8K55J8r2Q1m5O9R2l11K4R8j48K29k5J20k58K44o7j53K09
4568A22l16M06k96OJ24j70n7L25l27K08R2j12k52J29K45k40K24j08P2j5j87n6
4590a83J81J03M1j06J10j51m0J14N5k75L57k53N2q8j81K55J3J43j29KK12l85L43
$$ plain form
4425 113 184 -45 149 -90 -188 117 -111 -27 35 26 -49 -193 -215 153 8 -125 194 -88 -194 178 114 -55 208
4448 208 114 200 -221 72 -71 -69 -12 -127 201 62 60 53 250 205 -242 200 -170 -102 31 202 -71 -199 146 -309
4472 -309 6 272 -350 95 97 287 195 20 126 12 -48 59 -61 33 137 -118 187 203 -102 83 9 43 178
4495 178 103 27 160 89 -180 230 59 61 -70 26 -195 -48 27 152 -208 -59 13 30 82 -57 -212 -35 -6 -127
4519 -127 -114 -137 -112 101 -34 -148 9 -99 -168 -62 -87 62 -8 -28 35 -141 -116 -107 -265 -114 -31 122 96 197
4543 197 -104 -49 39 119 -150 -218 37 55 -37 44 -1 68 160 -151 -127 -29 -177 52 27 147 -111 133 66 -87 122
4568 122 -194 212 -84 -78 46 -124 -181 144 -183 25 117 5 -247 -118 127 -113 111 3 75 60 -127 -183
4590 -183 -2 101 142 36 146 -5 -45 69 124 -151 206 -47 5 -83 -264 -9 4 147 18 20 232 -153 190
4613A90K8k73J25p1k25J98o6J05lK14j65J77J12p55L50Kj31K17R9J52j45k37O9
4636c3J25o7k01L77j15R0k68L0J22j44M2j49M24k12l5j9J03j98O1J73q9j14K58
4659A61k32J55j16Q7m9m4j6K5K24k53J27J24k02L31k71j30J95k27n8L46k92L27
4681B12k22p6J3R7p8L5J21m42L26k56J66P4J15n7o5Q4Rj84K7l6j66J34K60j72
4705h1N9j04J63N2j87K50k93j8J41R1p4l06L84j63K02K8m68L13j14K14k3N9r9
4728B6j94J74J73k88J14Q2Q6k21O1P6j03p2l4j14J82J71l8j1J10j16J20P3l06
4751d9N4J54l70N01j63q6L7L1J1m02L30L0J35j22%n2j71n0L40k60p1k3J24N8N4
4776D0j98L19J96j29k26N9k19L5L07k15J98j68p8j49L58J26j74k73N7o4J88R2
$$ plain form
4613 190 218 -55 70 -1 -226 -28 -94 11 8 222 57 234 346 -409 -59 -57 -188 29 128 280 135 -102 -33
4636 -33 92 25 -176 201 86 176 -92 -62 60 -84 -42 -191 233 21 -14 -33 70 -128 -67 106 17 -97 161
4659 161 -71 84 -32 55 6 -38 -54 -29 195 -58 69 193 -9 322 51 -79 116 -111 -169 177 -115 212
4681 212 -10 -86 -73 24 -54 -19 102 -340 -14 -270 -104 -30 85 28 -37 47 56 -128 -101 -137 -303 -169 91 -81
4705 -81 -22 -126 37 89 -98 152 -141 -159 -18 73 -1 -307 77 -86 116 144 -324 -11 -125 89 66 125 26
4728 26 -168 6 179 -109 5 87 173 -48 13 89 -14 -86 -120 -234 -52 119 81 70 180 64 184 257 -49
4751 -49 5 159 -211 290 127 41 78 109 120 -282 48 78 213 91 91 39 -132 -182 158 -102 -173 -196 -72 -14 40
4776 40 -158 161 357 228 2 61 -158 -123 184 -31 167 -1 -79 -228 130 256 82 -191 -134 -198 -10 82
4798H2l2j31K73n2j11J2J11q2Q0l77L79j39q0L17k08L7MJ6Q3R3l36Ok45L06Q4
4823I0l04J2J27J31o1L41m98J63l32M13j4Jl37J86J87j86L63n57M14k31K34q8
4845E4j9jR4k24M24k00k29j24K25K9M5j88J41p1l9L26l27L6j42K33J03k4j30n7
4869f5J78k19K72m04Q6J00J43j16O2K0m1O1k85n1K02J49n0j62M63l53J5j26K47
4892A26kk6k67J38j25qM72m10q6J17KJ8K23k00p0J00K54n4k72J36l66L86j09l39
4916c62L16K04k17r9K59j12p1j6M22k65p3L8p8J32j45P5m8j71K67j11J44p8j64
4939a53J74j16L36n10K72r1J04J49L3K3p9oj56k1K41j64k7j4J78j97L2p3J31J87
4963B53j40n9L00k26o5Q1l97L61o7l01K62K75q8j65J71m09K30j77J69K1j6K62
$$ plain form
4798 82 50 -81 192 140 29 41 152 70 150 -227 152 13 -67 250 42 79 83 99 182 275 -61 -55 -300 6 90
4823 90 -214 -202 -75 56 -5 336 -162 1 -331 82 68 69 -268 -82 105 -81 282 -275 139 -92 142 54
4845 54 35 34 128 -96 328 128 -101 -225 0 29 74 -114 27 -44 -83 243 -84 -48 -190 43 146 122 -8 -65
4869 -65 113 -106 166 -238 -152 -52 91 -25 37 57 16 77 -208 -259 -57 92 42 -120 343 -10 5 -121 126
4892 126 124 98 -169 -31 -156 -164 308 -102 -188 -71 -69 -51 172 -28 -98 2 256 202 -70 66 -300 86 -23 -362
4916 -362 -46 158 -59 -158 101 -11 -82 -98 324 59 -14 24 -54 78 -67 8 -40 -211 56 -55 89 11 -153
4939 -153 21 -95 241 -269 3 -88 16 165 198 221 142 136 -20 -41 200 36 9 -5 173 -24 8 -65 66 253
4963 253 113 54 354 128 63 144 -253 108 41 -260 2 277 189 24 195 -214 16 -161 8 29 13 275
4985B75l41J94j09j22J2Qjj4l9q7M30K03l34k39k7K12J88k01p0K7P8j88K99J15
5009B69k70N9o4O9j40J91J35m23L57j57K0p5k3K22Pj36j80K65k04k64K61R2J15
5032A26r8j70N57l21j93J20Q0M3k21k3kJ1j33P8J10P2k63J69o3J86J39j56j10
5055f2K43k84J0J48j00Q9J12l93K31p9K45l08MM92n25K25R4m59M77j10j04J48
5077I4m8q5qQ4MO9P3l66K01Q8j11j51K06o8N8m5ok14J76o5LJ43N5N9k20K5j01
5104a50J10J7P7j7k04K12j83L65J48m10J85k52pK81j12kk51K78j01P3Q8P0l12
5127i7L27k12J99j97j56Q2J01l84L74P7j03J56j42J49l82J12R5L3J4j83K27J79
5149B69k61K32j57j89J27m46N69l47K28j36Q1J48j6p2l2Q9k34L87k42P8l2P7j77
$$ plain form
4985 275 -66 128 19 -103 -91 -83 -84 -98 -137 -224 206 409 75 -164 -191 21 209 8 -62 -35 43 -145 154 269
5009 269 -1 58 -6 63 -77 114 249 -174 183 26 46 -29 -52 170 177 41 -139 126 -78 -342 -81 11 126
5032 126 28 -142 415 94 -99 21 101 144 -77 -100 -102 -91 -224 -146 -36 36 -227 -58 -121 65 204 48 -62
5055 -62 181 -103 -93 55 -45 44 156 -237 -6 -85 160 -148 -144 348 -177 48 142 -317 160 50 -54 94
5077 94 46 -39 -47 37 41 110 183 -183 18 106 -5 -156 50 -18 40 -5 -11 -225 -49 -114 -111 32 87 146 -74 -49 -150
5104 -150 -40 -23 54 37 -167 45 -138 227 375 -35 150 -102 -109 172 60 58 -193 85 -16 57 145 215 -97
5127 -97 230 18 217 20 -136 -54 47 -337 37 114 11 167 25 174 -208 -96 -1 32 46 -137 90 269
5149 269 8 240 83 -106 21 -425 144 -203 25 -111 -30 118 102 30 -2 87 -147 240 -2 76 44 121 -56
5172e6j54j14L96j60M3K22m63J68K61j29l02J72J51J9J73p8j52K03j39r5M9JJ05
5195A21l75K93j7p0K01k01R1p0K68k83R3k09J12J25Kj22P0Q7J89m42K02k6M0J2
5219I1j46J01j82J8J33j1p8K6J95J00k84k3l0O8L00k52jK25k88K35k49J84k90
5242a58Q7r6K1N26k24k80J55j80J19o3J18L6K48l62n8O2p3K61k51k7m2J25J25
5265F9KJ37j94r6J65q9O5k11J96j72K91j86J14J38l28j00K27j13m5JJ59o2J67
5288A35jp8k0j71rM79n44J47n8L5K03j94r4O8J17k48J51L46k13J10LP7j00J03
5312B44j28j36m3o7K90Kl95L60j84K00j35m2R3m66M99P6j68J09K0L6j98P2r4J0
5336d5j3Q8J43q3k49K59j55l0J58j09L50k24l30L29Q0m75N32j00k68O1j28M43
$$ plain form
5172 -56 -210 -324 72 -88 -45 177 -286 -118 143 14 -288 -116 35 54 227 149 -3 200 61 -34 15 16 121
5195 121 -254 39 22 -48 153 -48 43 -27 241 -42 51 -158 -46 79 81 -41 29 116 305 -137 65 39 79 91
5219 91 -55 46 -136 -118 15 4 -74 -48 147 247 -37 -60 -90 -22 278 26 25 250 -38 197 -52 132 -158
5242 -158 -71 -167 -146 380 156 -124 31 -149 -30 -93 25 61 309 -53 -111 -49 -122 139 -112 -139 -181 -56 69
5265 69 71 208 14 -82 83 -6 59 -152 44 -128 163 -23 91 229 -99 -199 28 -85 -130 -129 30 -32 135
5288 135 134 56 36 -135 -144 335 -209 -62 -120 -85 118 -76 -170 -102 15 -233 -82 264 51 161 164 241 141 244
5312 244 116 -20 -63 -130 160 162 -233 127 -57 143 8 -34 59 -407 92 168 0 109 129 165 -33 39 -55 -45
5336 -45 -58 30 173 90 -159 100 -55 -85 73 -36 314 90 -240 89 169 -306 226 126 -142 -81 -209 234
5358B34k81K41m28K54P2q7R6j95r6P1m2J08M32o46L40J15l02K74k48K48l5k06
5380h1M49o13L62J21k36Jk8j6k79K66l8KJ70l38L39k58J28J9p0q4J96o6N10l99
5404E7N3J28J9R3l89J59k13J74J0l71L75o2k80K40Nk5o0J65l49J26J47P0K7K3
5428A22k07J41R0k18M0J5J20j20k22K40J52j17p5k59L55j56J84J24j89q6l4m1
5450a41j06K37m1J04k6J71j03k70J69j63K02l7J81j64N1M2o6K2j94J10J25j46
5472d3n1L41k50J27k85N5j59L32R2j02Mrj76L05l11j30L31k10M12k58J50j52k89
5495b76O0J22m4L43j05k3O0k20K26j05j74j9nL97k93P4J77j65K0p2R6M5k12J24
5519C1K23k09r4O4O7l83M51j78K27j69l9J12j89J77k55M38j78P2j47j48K85Q0
$$ plain form
5358 234 -47 194 -234 20 92 5 101 -94 -190 -119 -161 -53 379 -267 73 188 -114 160 -88 160 125 -81
5380 -81 368 -245 117 238 2 3 -25 -41 -320 -54 -92 -90 80 -258 81 -177 -49 -30 -100 -184 12 -54 456 57
5404 57 110 238 257 350 -39 120 -93 81 91 -280 95 33 -247 -7 -2 -27 -87 78 -271 -145 2 72 99 122
5428 122 -85 56 146 -72 -32 -17 103 -17 -239 1 153 36 -39 -298 57 -99 85 209 20 -66 -100 -141
5450 -141 -247 -10 -51 53 27 198 95 -175 -6 -169 33 -4 177 13 64 106 40 62 -132 -22 103 -43
5472 -43 -94 247 -3 124 -161 -106 -265 67 159 57 61 52 -124 181 -130 -260 71 -139 273 15 165 13 -276
5495 -276 -216 -94 -138 205 100 77 137 -83 143 38 -136 -155 -160 237 -56 18 195 30 50 -22 74 119 -93 31
5519 31 254 45 -49 15 82 -301 150 -28 199 30 -9 103 -86 91 -164 274 96 168 21 -127 158 238
5541B38N9k72J01k73N15j03k64j55J21Nm6J82l74M51l08K02k13J13J53k27PK99
5563B11o4j38J00k17L36m6j18l2k77J19J71k26K42j96J08k19J86J30j57O3J07
5584H3j44Q8j17Q3m8K13l90K79o2J08k54L83k50k01K84M1K4o1k11P7r9K80N8Q1
5608B45n0k36l5K64k44m7LL48j60J7k82L4M44k53j97K14K51l01J62m2j39l9l6
5631g9J05K2M8k81p9M22l05J04k68M46j91J57J11j07k39k0RL4K46q5j58J74j80
5654a14L95j56O1k98J71k0J0j26J62PJ12l61K44m5J00k19j64L09R3j86j20J9o4
5677a90K6R0M7r0K78j70K81l66o0J31q9M76o05J18J41k6J96o2m8k1l4k31P5K90
5701A57j75Q5l3J09k32j15J31J73k3l37K86P7j93J19l32L55k01L88j10q8J95l94
$$ plain form
5541 238 297 25 126 -147 368 265 1 -154 -33 -28 -74 108 -266 185 -123 79 -134 -21 132 -95 -88 211
5563 211 147 9 109 -108 228 182 64 32 -245 -126 45 -181 61 -135 -27 -246 -60 70 -87 -24 83
5584 83 -61 27 -90 -7 -55 158 -232 47 -15 93 -161 222 -28 -229 55 96 120 59 -152 -75 -174 106 164 245
5608 245 195 -41 -76 188 -56 -103 -100 248 88 105 -177 -143 301 48 -149 65 316 15 177 135 -4 -43 -79
5631 -79 26 48 96 -185 -264 158 -147 -43 -311 135 -56 101 212 105 -134 -154 -145 -111 135 50 -108 66 -114
5654 -114 281 125 186 -112 59 39 49 -77 85 92 204 -157 87 42 142 -77 -241 68 161 -25 -145 -126 -190
5677 -190 -164 -74 -27 -117 161 -9 272 -94 -154 -23 -112 364 -241 -123 18 -8 188 126 78 57 23 -208 -133 157
5701 157 -18 67 34 143 -89 -204 -73 100 77 -260 26 103 -90 29 -303 52 -149 239 129 41 236 -158
5723a58J90K2j93M26j32n34M90j46K8K19m4k52J11r3R1m2k5K23j39J31k07k1J24
5746F9l08K87l43K79Q3k5j39J78J29j81q8R2J01j20j65p1K93Oj78M1J32j19j1
5769e8j5j51M17R8l83K8J72k22J97j2K1l09K60J22k93L29k12k04L58j49P1j86
5791a21O8M7k22N9K19J78k4j29o3j18J03p6NJ42N0j22p9j64R8J53p4j0K74j20
5815G4q8K26l95J44q5O9M9J54l39M4K54k60J14K36L2k20k41J95J88J24n25K14
5837c6Q9j04Q3p9L28l86j36K09m8K8O3l1J24L3j11k90K61J01j3l99K97L00l89
5860a06R5j94J54J76K5j90k23M37j40m1K1J47k63j1O5j18K5J8R3l13L03k8l78
5883d46M90l7K03k49l38L46j06J93o8L8q6L10k45r3K99k80K43k55J11j62L04l13
$$ plain form
5723 -158 32 54 -139 287 155 -379 111 -35 -7 212 168 -84 27 -66 25 -17 -42 181 42 173 -34 -55 69
5746 69 -239 48 -295 -16 67 42 -97 81 210 29 -59 33 134 14 -151 -222 71 77 -101 -60 72 -47 -58
5769 -58 -73 -224 193 291 -92 -64 108 -114 83 71 92 -217 43 165 -128 201 -11 -215 143 -6 65 -121
5791 -121 -53 -6 -228 -169 50 228 204 75 12 -106 -3 -79 -74 68 118 -4 -83 -247 -149 4 -70 -80 194 74
5815 74 -14 212 -183 -39 -124 -55 -6 148 -191 -147 107 -153 -39 197 229 9 -232 -37 151 275 -250 -36
5837 -36 53 -51 32 -47 281 -105 -241 -32 -80 -52 11 -20 104 137 26 -264 -3 98 85 -314 -17 283 -106
5860 -106 -11 -205 -51 125 150 -40 -263 174 34 -7 14 161 -102 -113 -48 -166 -141 -123 -30 -343 -40 -68 -446
5883 -446 44 7 210 -39 -377 -31 -137 56 -12 26 -60 250 5 -88 211 -69 174 -81 30 -132 172 -141
5905a41K91j56j19J03q0j43K95l86M63M7j5j54k39J62J05jj35kj14N0l7J41J39
5928G4m8q7L5p4K36m17J96M00l68J19J25k4P5l31K46j39R3k98O00m26r6J49Q0
5951A20k14l09L95p8J7L0J54k83J84j60J63j67j9r2N86l2l45K21j62O8k85P0k39
5974c77L62Nj20Q5J70j45L09m19j7K22k08L36j31k00M67j86k22K35j51M1q8MP2
5997D4o7O9k01J86K40j32k13M09l41J41l0m9r0j27J78lJ42j49J24j51J56j01n5
6020b0k16M13k89K91r7p8j82L2R6J02k67K01R4j21J63m3L1m47K60K0J16R7j64
6043hj30J47O3k25J78K36m07J54Mr5O8p1ro4j10K79P8R2j32K18k83n1L7R6j76
6068a11l32L12J91N1N4J12m51K22j29J08k14L50j12k00L57l48K56j44o4J61m3
$$ plain form
5905 -141 150 -6 -125 -22 -102 -245 50 -336 127 174 159 5 -234 -72 33 32 -103 -105 -219 -169 -206 -65 74
5928 74 26 -61 -26 -100 136 -281 -85 315 -53 66 191 167 242 -89 157 18 111 -187 413 -13 -109 40 120
5951 120 -94 -403 -8 -86 -69 -39 115 -168 16 -144 19 -148 -167 -259 327 295 -50 171 9 77 -208 -138 -377
5974 -377 -15 -10 -130 -45 125 -20 289 -130 -147 75 -133 203 72 -128 339 153 -69 166 15 56 -32 -28 44
5997 44 -23 46 -155 31 271 139 -74 335 -6 135 105 56 -34 -161 17 14 156 7 131 -20 136 35 -20
6020 -20 -236 177 -112 179 82 4 -178 -146 -50 52 -215 -14 80 -41 122 79 110 -337 -77 -57 59 156 -8
6043 -8 -138 9 72 -153 25 261 -146 8 12 -83 -15 -86 -95 -159 -269 10 88 180 48 266 -17 -68 -31 65 -111
6068 -111 -443 -131 60 111 165 277 -174 48 -81 27 -187 163 51 -149 208 -140 116 -28 -92 69 26
6089B6j50M3J95k89K06R5M2p9l32J97l3K78l4j12l4j83J46k0R0l93K51k0j23J34
6113i9K21P2j97J83k55NJ77q5Q5j57l9L7O4P2J17m40M24k93M6J26q7K55R1j36
6137A87j45q1J72j91j00J49K8k36K41l23L73kj18j3J17j22J60k8j90q8M64j91
6159F3r4r9j16L3K19k1P2j86K51ol82K51LO0j31j83L28j53j23J84P01o69J99n02
6183c01Q1K22k75J81O1O1k51J23L56j73k31N7P4N1K6J57j57q8J99j53J33J43l37
$$ plain form
6089 26 -124 -81 114 -175 31 126 168 89 -243 -46 -79 199 165 53 19 -164 -18 -38 52 -341 -90 -110 -233 -99
6113 -99 122 194 -3 180 -75 -70 107 22 107 -50 -89 -52 12 84 201 -239 185 -108 -62 64 -23 232 323 187
6137 187 42 -39 133 -58 -158 -9 19 -217 24 -299 74 72 -46 -59 58 -64 96 68 -122 -210 254 63
6159 63 -31 -130 -246 -213 6 -15 57 -129 122 116 -266 -15 -12 48 -83 -266 62 -91 -214 -30 671 2 201 -301
6183 -301 -220 2 -273 -92 -31 30 -221 -98 258 85 -146 -89 -15 36 62 219 62 -26 173 20 153 296 -41
$$ [...]
8191b92
##END NTUPLES=NMR FID
##END=
