##TITLE=1H_LR-758-R3-K6-RC2
 CDCl3
 8 sc, 
 24.11.2023
##JCAMPDX= 6.0         $$ Bruker NMR JCAMP-DX V2.0
##DATA TYPE= NMR FID
##DATA CLASS= NTUPLES
##ORIGIN= UXNMR, Bruker Analytische Messtechnik GmbH
##OWNER= root
$$ XWIN-NMR		Version 3.5
$$ Fri Nov 24 14:00:18 2023 Russian Standard Time (UT+4h)  she@DPX200
##.OBSERVE FREQUENCY= 200.1313
##.OBSERVE NUCLEUS= ^1H
##.DELAY= (6, 6)
##.ACQUISITION MODE= SIMULTANEOUS
##.ACQUISITION SCHEME= undefined
##.AVERAGES= 8
##.DIGITISER RES= 18
##SPECTROMETER/DATA SYSTEM= spect
##.PULSE SEQUENCE= zg30
##.SOLVENT NAME= D2O
##.SHIFT REFERENCE= (INTERNAL, D2O, 0, 15.7039)
##AUDIT TRAIL= $$ (NUMBER, WHEN, WHO, WHERE, WHAT)
$$ ##TITLE= Audit trail, XWIN-NMR		Version 3.5
$$ ##JCAMPDX= 5.01
$$ ##ORIGIN= Bruker BioSpin GmbH
$$ ##OWNER= she
$$ F:/spectra/data/she/nmr/H-F/1/audita.txt
$$ ##AUDIT TRAIL=  $$ (NUMBER, WHEN, WHO, WHERE, WHAT)
(   1,<2023-11-24 13:59:12.68 +0400>,<she>,<DPX200>,
      <created by zg, POWCHK disabled, PULCHK disabled
       configuration hash MD5:
       00 E9 B6 7A A2 85 ED C7 34 08 36 98 17 FE 4E 26
       data hash MD5: 16K
       62 33 18 B1 4F 6C DE 95 E1 D6 81 A9 0D 9E E8 3F>)
$$ ##END=
$$ 
$$ hash MD5
$$ CD C7 F5 9D 7F 56 36 4E 6C 5E A4 66 EA 32 79 11
##$RELAX= 
##$RELAX= 
##$RELAX= 
##$RELAX= 
##$RELAX= 
##$RELAX= 
$$ Bruker specific parameters
$$ --------------------------
##$DU= <F:/spectra>
##$EXPNO= 1
##$NAME= <H-F>
##$PROCNO= 1
##$TYPE= <nmr>
##$USER= <she>
##$AMP= (0..31)
100 100 100 100 100 100 100 100 100 100 100 100 100 100 100 100 100 100 
100 100 100 100 100 100 100 100 100 100 100 100 100 100 
##$AQSEQ= 0
##$AQ_mod= 1
##$AUNM= <au_zg>
##$AUTOPOS= <>
##$BF1= 200.13
##$BF2= 200.13
##$BF3= 200.13
##$BF4= 200.13
##$BF5= 200.13
##$BF6= 200.13
##$BF7= 200.13
##$BF8= 200.13
##$BYTORDA= 1
##$CFDGTYP= 0
##$CFRGTYP= 5
##$CHEMSTR= <none>
##$CNST= (0..31)
1 1 145 1 1 1 1 1 1 1 1 1 1 1 1 1 1 1 1 1 1 1 1 1 1 1 1 1 1 1 1 1 
##$CPDPRG= <>
##$CPDPRG1= <>
##$CPDPRG2= <>
##$CPDPRG3= <>
##$CPDPRG4= <mlev>
##$CPDPRG5= <mlev>
##$CPDPRG6= <mlev>
##$CPDPRG7= <mlev>
##$CPDPRG8= <mlev>
##$CPDPRGB= <>
##$CPDPRGT= <>
##$D= (0..31)
0 1.2 0 0 0 0 0 0 0 0.06 0 0.03 0 0 0 0 0.0002 0 0 0 0 0 0 0 0 0 0 0 0 
0 0 0 
##$DATE= 1700819952
##$DBL= (0..7)
120 120 120 120 120 120 120 120 
##$DBP= (0..7)
150 150 150 150 150 150 150 150 
##$DBP07= 0
##$DBPNAM0= <>
##$DBPNAM1= <>
##$DBPNAM2= <>
##$DBPNAM3= <>
##$DBPNAM4= <>
##$DBPNAM5= <>
##$DBPNAM6= <>
##$DBPNAM7= <>
##$DBPOAL= (0..7)
0.5 0.5 0.5 0.5 0.5 0.5 0.5 0.5 
##$DBPOFFS= (0..7)
0 0 0 0 0 0 0 0 
##$DE= 6
##$DECBNUC= <off>
##$DECIM= 32
##$DECNUC= <off>
##$DECSTAT= 4
##$DIGMOD= 1
##$DIGTYP= 9
##$DL= (0..7)
0 120 120 120 120 120 120 120 
##$DP= (0..7)
150 150 150 150 150 150 150 150 
##$DP07= 0
##$DPNAME0= <>
##$DPNAME1= <>
##$DPNAME2= <>
##$DPNAME3= <>
##$DPNAME4= <>
##$DPNAME5= <>
##$DPNAME6= <>
##$DPNAME7= <>
##$DPOAL= (0..7)
0.5 0.5 0.5 0.5 0.5 0.5 0.5 0.5 
##$DPOFFS= (0..7)
0 0 0 0 0 0 0 0 
##$DQDMODE= 0
##$DR= 18
##$DS= 0
##$DSLIST= <SSSSSSSSSSSSSSS>
$$ [...]
##$SUBNAM2= <"">
##$SUBNAM3= <"">
##$SUBNAM4= <"">
##$SUBNAM5= <"">
##$SUBNAM6= <"">
##$SUBNAM7= <"">
##$SUBNAM8= <"">
##$SUBNAM9= <"">
##$SW= 18.0517328524113
##$SWIBOX= (0..15)
0 0 2 0 0 0 0 0 0 0 0 0 0 0 0 0 
##$SW_h= 3612.71676300578
##$TD= 16384
##$TD0= 1
##$TE= 0
##$TE2= 300
##$TE3= 300
##$TEG= 300
##$TL= (0..7)
0 120 120 120 120 120 120 120 
##$TP= (0..7)
150 150 150 150 150 150 150 150 
##$TP07= 0
##$TPNAME0= <>
##$TPNAME1= <>
##$TPNAME2= <>
##$TPNAME3= <>
##$TPNAME4= <>
##$TPNAME5= <>
##$TPNAME6= <>
##$TPNAME7= <>
##$TPOAL= (0..7)
0.5 0.5 0.5 0.5 0.5 0.5 0.5 0.5 
##$TPOFFS= (0..7)
0 0 0 0 0 0 0 0 
##$TUNHIN= 0
##$TUNHOUT= 0
##$TUNXOUT= 0
##$USERA1= <user>
##$USERA2= <user>
##$USERA3= <user>
##$USERA4= <user>
##$USERA5= <user>
##$V9= 5
##$VALIST= <valist>
##$VCLIST= <CCCCCCCCCCCCCCC>
##$VD= 0
##$VDLIST= <DDDDDDDDDDDDDDD>
##$VPLIST= <PPPPPPPPPPPPPPP>
##$VTLIST= <TTTTTTTTTTTTTTT>
##$WBST= 1024
##$WBSW= 4
##$XGAIN= (0..3)
0 0 0 0 
##$XL= 0
##$YL= 0
##$YMAX_a= 96767
##$YMIN_a= -112922
##$ZGOPTNS= <>
##$ZL1= 120
##$ZL2= 120
##$ZL3= 120
##$ZL4= 120
##$ABSF1= 10
##$ABSF2= 0
##$ABSG= 5
##$ABSL= 3
##$ALPHA= 0
##$AQORDER= 0
##$ASSFAC= 0
##$ASSFACI= 0
##$ASSFACX= 0
##$ASSWID= 0
##$AUNMP= <proc_1d>
##$AZFE= 0.1
##$AZFW= 0.1
##$BCFW= 1
##$BC_mod= 2
##$BYTORDP= 1
##$COROFFS= 0
##$CY= 11.3945322036743
##$DATMOD= 1
##$DC= 2
##$DFILT= <>
##$DTYPP= 0
##$F1P= 15.7292609196834
##$F2P= 12.9074282941183
##$FCOR= 0.5
##$FTSIZE= 0
##$FT_mod= 4
##$GAMMA= 1
##$GB= 0.15
##$INTBC= 1
##$INTSCL= 1
##$ISEN= 128
##$LB= 0.24
##$LEV0= 0
##$LPBIN= 0
##$MAXI= 10000
##$MC2= 0
##$MEAN= 0
##$ME_mod= 0
##$MI= 1.114404
##$NCOEF= 0
##$NC_proc= 0
##$NLEV= 6
##$NOISF1= 3.799351
##$NOISF2= 2.8
##$NSP= 1
##$NTH_PI= 0
##$NZP= 0
##$OFFSET= 15.70392
##$PC= 1
##$PHC0= -24229
##$PHC1= 10.85269
##$PH_mod= 1
##$PKNL= yes
##$PPARMOD= 0
##$PSCAL= 0
##$PSIGN= 0
##$REVERSE= no
##$SF= 200.130013532006
##$SI= 16384
##$SIGF1= 3
##$SIGF2= 2
##$SINO= 400
##$SIOLD= 16384
##$SREGLST= <1H.CDCl3>
##$SSB= 0
##$STSI= 0
##$STSR= 0
##$SW_p= 3612.71676300578
##$SYMM= 0
##$S_DEV= 0
##$TDeff= 0
##$TDoff= 0
##$TI= <>
##$TILT= no
##$TM1= 0
##$TM2= 0
##$TOPLEV= 0
##$USERP1= <user>
##$USERP2= <user>
##$USERP3= <user>
##$USERP4= <user>
##$USERP5= <user>
##$WDW= 1
##$XDIM= 8192
##$YMAX_p= 0
##$YMIN_p= 0
$$ End of Bruker specific parameters
$$ ---------------------------------
##NTUPLES= NMR FID
##VAR_NAME=  TIME,          FID/REAL,        FID/IMAG
##SYMBOL=    X,             R,               I
##VAR_TYPE=  INDEPENDENT,   DEPENDENT,       DEPENDENT
##VAR_FORM=  AFFN,          ASDF,            ASDF
##VAR_DIM=   8192,          8192,            8192
##UNITS=     SECONDS,       ARBITRARY UNITS, ARBITRARY UNITS
##FACTOR=    0.0002768,     1,               1
##FIRST=     0,             0,               0
##LAST=      2.2672688,     0,               0
##MIN=       0,             -112922,         0
##MAX=       2.2672688,     96767,           0
$$ Real data points
##PAGE= N=1
##DATA TABLE= (X++(R..R)), XYDATA
$$ [...]
$$ plain form
1760 112 -154 -256 108 -145 51 63 22 -213 -239 -247 -230 4 -112 -113 -91 111 -92 -225 -18 101 -5 -16 -115 15
1784 15 29 64 -91 -64 198 -164 231 -90 125 58 202 127 94 182 -52 121 120 174 67 -230 4 -175 232 -68
1808 -68 -54 -53 -21 214 -70 -83 55 115 52 213 -41 134 -149 -12 -208 -39 -55 -143 -32 -150 86 111 169 0
1832 0 -44 -66 361 -86 -200 -2 100 -8 -304 231 -170 -32 251 -141 -22 235 -36 -26 3 55 163 -74
1854 -74 4 71 251 -60 107 116 -94 241 -95 -76 -7 -278 131 144 84 216 22 -88 -106 -49 -112 62 154 96 118
1879 118 -101 -124 290 60 -73 -39 93 74 -120 276 -106 -235 93 33 143 -123 316 184 -86 18 161
1900 161 -21 98 -199 -74 -45 133 -41 35 114 -12 18 108 71 4 -11 -96 140 73 17 61 39 270 -37 121
1924 121 -2 191 -131 45 366 -212 262 -49 -23 31 -77 58 276 -152 265 -26 91 -224 -68 26 -294
$$ packed form
1760A12k66j02L64k53J96J2m1k35k6qJ7K34j16jK2K02k03j33K07J19j06j1r9J30
1784A5J4L5j55K7K62l62L95l21K15o7J44p5l3Q8k34J73jN4j07k97K34j79M07l00
1808f8J4JL2K35k84j3J38O0o3J61k54J75k83J37j96J69j6q8J11j18K36K5N8j69
1832@m4k2M27m47j14J98J02j08k96N35m01J38K83l92J19K57k71J0K9N2J08k37
1854g4P8O7J80l11J67Rk10L35l36J9O9k71M09J3o0J32j94j10j8N7o3J74R2n8K2
1879A18k19k3M14k30j33L4J32j9j94L96l82j29L28o0J10k66M39j32k70J04J43
1900A61j82J19k97J25K9J78j74P6P9j26L0R0l7o7j5q5K36o7n6M4k2K31l07J58
1924A21j23J93l22J76L21n78M74l11K6N4j08J35K18m28M17k91J17l15J56R4l20
$$ plain form
1945 -294 37 -209 91 11 -30 115 285 56 130 -40 241 -53 37 243 149 233 -193 64 48 15 -92 98 -341
1968 -341 -116 3 -10 198 -162 -22 91 147 70 -31 32 222 58 -7 76 -23 307 205 -93 94 -133 -135 -74
1991 -74 -32 97 341 -187 52 103 -35 102 -11 -159 32 -105 137 -215 -134 164 -107 -3 52 -133 -43 7
2013 7 -230 -11 12 -164 20 -83 -210 -281 274 289 89 199 209 -25 124 -27 -110 116 103 -42 111 -72 -91
2036 -91 24 89 -213 -157 -8 -41 312 -63 -214 108 123 -380 39 260 -51 24 168 -138 323 197 -7 -3 90
2059 90 28 -31 -12 40 117 23 51 -375 -81 53 214 186 12 120 39 -111 91 124 2 48 -111 416 -72 83
2083 83 -393 6 -56 60 96 100 -204 97 -71 -38 13 36 -188 67 101 126 163 210 49 55 -122 55 88 28 -27 49
2109 49 -283 151 -4 -233 47 109 -195 21 231 -86 -126 -111 -196 -173 263 131 205 113 -41 -20 -119 -166 -25 171
$$ packed form
1945b94L31k46L00q0m1J45J70k29P4j70K81k94R0K06r4Q4m26K57j6l3j07J90m39
1968c41K25J19j3K08l60J40J13N6p7j01O3J90j64o5Q3r9L30j02k98J87k27kO1
1991g4M2J29K44n28K39N1j38J37j13j48J91j37K42l52Q1K98k71J04N5j85R0N0
2013Gk37K19K3j76J84j03j27p1N55J5k00J10J0k34J49j51q3K26j3j45J53j83j9
2036i1J15O5l02N6J49l3L53l75j51L22J5n03M19K21l11P5J44l06M61j26k04MR3
2059I0o2n9J9N2P7r4K8m26K94J34J61k8j74J08q1j50K02L3j22M6j59N27m88J55
2083H3m76L99o2J16L6Ml04L01j68L3N1K3k24K55L4K5L7M7j61Oj77J77L3o0n5P6
2109D9l32M34j55k29K80O2l04K16K10l17m0J5q5K3M36j32P4r2j54K1r9m7J41J96
$$ plain form
2133 171 78 11 173 -40 -68 -219 45 96 -3 -3 180 -152 -11 -155 -68 86 173 70 8 97 178 37 -317 -11
2157 -11 -177 73 -234 57 79 118 -96 -250 68 -78 -175 0 -125 25 -59 -20 -228 -25 -108 198 -250 -255 198
2180 198 -164 105 -223 9 -252 66 -279 94 30 251 -103 278 140 24 -132 119 136 -169 80 -124 -16
2201 -16 241 -173 24 -191 43 -56 124 168 56 55 -29 -106 119 -194 -182 -21 -76 -24 -83 -8 106 76 -71 -38 -52
2226 -52 -365 187 -68 -86 104 -215 -227 -116 -146 -118 -113 296 -81 -223 191 -168 -285 -123 -18 -19 2 -31 -154 67
2250 67 347 131 -37 132 -2 -107 -142 -134 4 63 -26 -64 55 189 -274 102 55 -285 139 33 -118 -208 -137
2273 -137 -105 324 74 -340 174 9 132 75 -122 36 330 -245 -53 47 211 65 200 -28 42 121 363
2294 363 -60 141 106 -141 -51 149 71 46 105 -27 -215 -296 -185 -56 -80 165 -41 223 -85 -42 -99 -49 -166
$$ packed form
2133A71r3o7J62k13k8j51K64N1r9%J83l32J41j44Q7J54Q7j03o2Q9Q1j41l54L06
2157a1j66K50l07K91K2L9k14j54L18j46r7J75j25J50q4L9k08K03q3L06m48nM53
2180A98l62K69l28K32k61L18l45L73o4K21l54L81j38j16j56K51J7l05K49k04J08
2201a6K57m14J97k15K34r9J80M4j12jq4p7K25l13J2J61n5N2n9P5J14l0j47L3j4
2226e2l13N52k55j8J90l19j2J11l0K8NM09l77j42M14l59j17J62J05jK1l3j23K21
2250F7K80k16j68J69j34j05l5QJ38N9q9l8J19J34m63L76m7l40M24j06j51r0P1
2273a37L2M29k50m14N14j65J23n7j97J58K94n75J92J00J64j46J35k28P0P9K42
2294C63m23K01l5k47R0K00p8k5N9j32j88q1J11J29k4K45k06K64l08M3n7N0j17
$$ plain form
2317 -166 -158 -261 -115 76 -103 -242 -127 36 17 -146 -85 -34 47 -137 17 59 26 -115 120 10 2 -166 -11
2340 -11 -129 -312 138 292 5 48 103 -152 134 162 21 -257 -136 -22 -61 -403 -103 -24 -77 -134 50 102 171
2363 171 146 220 -257 -124 -36 68 51 -77 20 205 16 -21 -212 83 294 44 174 -78 1 124 -11 324
2385 324 -228 143 90 35 14 150 220 106 -55 -141 150 -231 51 -79 -300 -69 -299 176 37 -104 56 185
2407 185 -2 176 -27 -45 323 200 -171 100 148 105 -9 -58 113 93 -90 20 -72 -55 -112 -121 223 29 -253
2430 -253 88 32 55 32 -107 -59 0 379 161 -15 127 64 229 -140 66 142 -78 52 -172 -124 -151 -174 -236 156
2454 156 -125 138 24 124 -32 157 129 -81 10 4 29 102 -13 216 16 19 -46 103 99 265 -61 -103 32 -153
2478 -153 163 -138 -8 182 144 69 27 -124 213 -202 187 6 -212 -69 106 -115 99 256 36 167 -138
$$ packed form
2317a66Qj03J46J91j79j39J15J63j9j63O1N1Q1j84J54M2l3j41K35j10qj68J55
2340a1j18j83M50J54k87M3N5k55K86K8j41k78J21J14l9l42L00P9n3n7J84N2O9
2363A71k5P4m77J33Q8J04j7j28R7J85j89l7j91K95K11k50J30k52P9J23j35L35
2385C24n52L71n3n5k1J36P0j14j61q6K91l81K82j30k21K31k30M75j39j41J60J29
2407A85j87J78k03j8L68j23l71K71M8m3j14m9J71k0j83J10r2J7n7rL44j94k82
2430b53L41n6K3k3j39M8N9L79k18j76J42o3J65l69K06P6k20J30k24M8k7k3o2L92
2454A56k81K63j14J00j56J89k8k10R1oK5P3j15K29k00Lo5J49mJ66l26m2J35j85
2478a53L16l01J30J90l8p5m2j51L37m15L89j81k18J43J75k21K14J57k20J31l05
$$ plain form
2499 -138 -255 -117 -91 45 -135 96 -297 46 133 -4 89 -127 -30 66 -253 -119 -55 -106 -268 -150 -62 73 80
2522 80 250 -54 -227 177 -45 -182 -109 200 118 -203 -54 161 -186 260 7 108 -106 63 -214 -196 -81
2543 -81 -112 -39 49 40 30 -169 52 -102 6 70 -35 -159 -29 -288 82 -102 234 35 252 -114 -124 197 -86
2566 -86 107 -84 99 -70 -208 -248 184 -139 -35 -74 170 25 76 26 171 55 77 -78 191 284 250 -119 -34
2589 -34 101 -92 31 119 -35 -5 11 -215 151 -151 79 -31 -1 -9 -71 133 -30 -20 74 -172 24 -157 182
2612 182 156 -156 142 25 9 -59 77 -131 -114 -26 -92 0 256 -109 25 -107 -80 48 -91 150 -184 10 162
2635 162 373 -170 -119 -111 -107 -9 61 24 -32 -22 -144 -69 101 -101 30 112 222 56 66 187 -134 -71 207 -465 -145
2660 -145 48 -141 104 28 269 113 30 41 68 -6 128 46 110 -210 -67 69 -17 -9 -358 62 -32 204 158 -148
$$ packed form
2499a38j17J38K6J36j80K31l93L43Q7j37R3k16R7R6l19J34O4n1j62J18Q8J35P
2522H0J70l04j73M04k22j37P3L09q2l21J49K15l47M46k53J01k14J69k77J8J15
2543h1l1P3Q8rj0j99K21j54J08O4j05j24J30k59L70j84L36j99K17l66j0L21k83
2566h6J93j91J83j69j38m0M32l23J04l9K44j45N1n0J45j16K2j55K69R3l4l69Q5
2589c4J35j93J23Q8j54L0J6k26L66l02K30j10L0qo2K04j63J0R4k46J96j81L39
2612A82k6l12K98j17j6o8J36k08J7Q8o6R2K56l65J34j32K7J28j39K41l34J94J52
2635A62K11n43N1QMR8P0l7n6J0j22P5J70k02J31Q2J10j66J0J21l21O3K78o72L20
2660a45J93j89K45p6K41j56q3J1K7p4J34q2O4l20J43J36q6Ql49M20r4K36m6l06
$$ plain form
2684 -148 2 -115 191 144 -150 -4 -209 24 186 148 -72 -80 -85 102 209 24 -259 -242 45 -125 123 13
2706 13 -190 29 -109 -133 -161 47 76 143 -276 17 -34 -72 -42 202 -139 -181 232 8 112 69 74 -16 69 66 -192
2731 -192 291 -14 200 26 -42 88 -176 34 -155 -170 -4 -133 90 77 129 220 195 124 109 -148 89 67 -81
2754 -81 -277 153 -144 -213 14 119 28 -148 -47 -104 20 -126 -78 85 154 2 104 33 -49 -250 -111 -67 24
2777 24 -3 -110 40 -224 -71 7 61 -169 7 -94 21 -47 -223 12 -75 -119 -85 -61 -19 -41 34 120 -78 -39 -136
2802 -136 287 -78 219 120 85 -22 -233 18 -211 9 16 94 26 62 4 84 27 -243 -91 181 69 139 -103 15
2826 15 177 96 19 -22 3 246 -62 96 78 -123 -77 -168 37 -357 -9 -60 124 -171 225 62 80 -67 -23 -281
2850 -281 124 -68 -30 160 90 -24 -96 98 -61 -5 8 -150 -168 145 2 -104 -121 354 52 -79 -40 -172 10
$$ packed form
2684a48J50j17L06m7k94J46k05K33J62l8k20qnJ87J07j85k83J7K87j70K48j10
2706A3k03K19j38k4k8K08K9O7m19K93n1l8L0K44l41m2M13k24J04m3Nr0Q5lk58
2731a92M83l05K14j74o8J30k64K10j89j5J66j29K23j3N2R1k5p1j5k57K37k2j48
2754h1j96M30k97o9K27J05r1j76J01n7J24j46M8J63O9j52J02p1q2k01J39M4R1
2777B4k7j07J50k64J53P8N4k30J76j01J15o8j76K35q7m4L4K4M2k2P5Q6j98L9r7
2802a36M23l65K97r9l5j07k11K51k29K20PP8o8L6n8Q0n7k70J52K72j12P0k42J18
2826A5J62q1p7m1K5K43l08J58j8k01M6r1K05l94L48n1J84k95L96j63J8j47M4k58
2850b81M05j92L8J90p0j14p2J94j59N6J3j58j8L13j43j06j7M75l02j31L9j32J82
$$ plain form
2873 10 -39 -110 -6 -26 139 -82 547 -59 60 -29 -69 -16 242 -83 -56 26 179 -94 -165 -32 -22 -127 -132 -30
2897 -30 -36 9 -93 -159 -145 -18 277 176 -302 -188 -102 -163 -302 -39 65 -190 25 -98 66 39 147 -349 98
2920 98 -214 117 170 162 98 181 434 -30 34 79 193 -96 63 6 -258 213 171 1 4 -41 92 -146 -132 22 -200
2945 -200 77 64 72 80 -60 -7 71 -84 -188 65 -46 -124 -321 -157 13 70 138 -263 92 -3 133 -7 -161 96
2969 96 79 69 174 85 41 -136 -103 -93 110 22 21 -43 28 -61 3 4 -184 53 -152 -7 -77 -75 -136 -223 64 233 -23
2996 -23 44 -37 -108 84 5 19 1 -104 151 -167 187 243 201 76 54 159 6 84 96 182 203 201 -15 -90 -53 -18
3022 -18 168 -124 -189 11 35 -175 -8 60 -8 70 209 -48 -165 -235 -43 310 -153 1 -48 -34 -33 0 152 71
3046 71 145 81 234 116 200 -30 92 -29 8 129 211 233 318 -43 -37 -8 52 -55 -89 28 116 -45 -80 169 380
$$ packed form
2873A0m9p1J04k0J65k21O29o06J19q9m0N3K58l25K7Q2J53k73p1J33J0j05nJ02
2897c0oM5j02o6J4J27K95j01m78J14Q6o1j39K63J04k55K15j23J64k7J08m96M47
2920I8l12L31N3qo4Q3K53m64O4M5J14k89J59n7k64M71m2j70Lm5J33k38J4J54k22
2945b00K77j3QQj40N3P8j55j04K53j11p8j97J64J70N7O8m01L55r5J36j40j54K57
2969I6j7j0J05q9m4j77L3J0K03q8jo4P1q9O4Jj88K37k05J45p0Ko1q7K87J69k56
2996b3O7q1p1J92p9J4j8j05K55l18L54N6m2j25k2J05j53P8J2Q6K1kk16p5L7L5
3022a8J86k92o5K00K4k10J67O8o8P8J39k57j17p0J92L53m63J54m9J4JL3J52q1
3046G1P4o4J53j18Q4k30J22j21L7J21Q2K2Q5l61OK9O0j07l4J17Q8j61l5K49K11
$$ plain form
3071 380 62 38 6 -51 -21 -123 191 -237 38 100 -52 -89 -121 38 138 -232 65 -187 -101 22 -9 -155 329
3094 329 -137 157 29 29 100 12 -142 -187 70 28 -132 -272 80 -10 79 142 3 34 -137 -118 126 -6 -31 18
3118 18 20 -11 65 -104 -57 -94 -256 33 47 -99 46 -56 97 -4 -1 84 -32 156 133 -122 -78 106 -15 134
3142 134 108 -149 92 2 -35 -2 176 -198 155 -97 -88 -4 -347 -53 78 -158 92 70 -29 238 -213 -297 48
3165 48 138 -93 -20 -89 -213 33 32 -96 -37 -58 -119 67 86 264 -45 184 145 -288 -41 65 -39 -138 53 -178
3189 -178 -6 48 -57 -275 15 -60 13 21 64 81 7 -167 32 -126 10 46 -167 27 0 55 55 70 -269 191 25
3214 25 109 73 46 103 -256 -55 189 -181 276 -395 -36 -48 121 -48 -13 225 -137 -81 45 7 -124 61 -222
3237 -222 -238 -48 -12 29 -5 -226 63 -76 194 237 -88 107 25 -114 81 122 63 149 160 14 111 257 -42 -58
$$ packed form
3071C80l18k4l2n7L0j02L14m28K75O2j52l7l2J59J00l70K97k52Q6J23l1j46M84
3094C29m66K94j28%P1q8j54m5K57m2j60j40L52r0Q9O3j39L1j71J9K44j32k5M9
3118A8Kl1P6j69M7l7j62K89J4j46J45j02J53j01LQ5j16J88k3k55M4J84j21J49
3142A34k6k57K41r0l7L3J78l74L53k52RQ4l43K94J31k36K50k2r9K67m51q4L45
3165D8R0k31P3o9j24K46jj28N9k1o1J86J9J78l09K29l9m33K47J06j04r9J91k31
3189a78J72N4j05k18K90p5P3QM3J7p4j74J99j58J36L6k13J94k7N5%J5l39M60j66
3214B5Q4l6k7N7l59K01K44l70M57o71L59j2J69j69L5K38l62N6J26l8j31J85k83
3237b22j6J90L6M1l4k21K89j39K70M3l25J95q2j39J95M1n9Q6J1j46R7J46k99j6
$$ plain form
3261 -58 -32 157 -19 -148 6 255 -77 124 157 108 147 56 24 33 42 45 -177 -204 219 -203 88 -312 -165 64 291
3286 291 110 -1 55 87 -19 100 -39 54 95 154 96 78 336 114 -347 -145 41 81 73 72 114 83 168 72 228
3311 228 14 -110 -106 236 91 76 46 46 67 -73 -64 43 45 -31 16 13 23 92 -180 191 -6 68 200 -8 -13 -325 251
3338 251 53 66 -14 -13 77 80 170 -168 112 142 94 27 325 77 -259 -29 -25 -61 50 214 -69 4 114 47 102 -45
3364 -45 134 -138 -75 -214 18 -72 12 -247 79 18 82 -156 -27 -71 146 168 7 52 49 -39 -22 42 -76 -383 117
3389 117 -26 16 -384 -137 37 -210 -107 -111 -190 24 500 -44 -47 -53 -19 218 -241 8 -113 -193 -90 -179 231 56
3413 56 -81 -60 -102 9 -122 206 57 -47 188 164 251 -167 -230 76 -29 -216 134 135 -50 24 46 -65 138
3436 138 77 111 30 -2 46 -78 130 -59 309 206 -73 -133 -29 -33 -101 -119 133 10 -43 54 -63 229 75 -294
$$ packed form
3261e8K6J89j76j29J54K49l32K01L3m9L9r1l2RRLk22k7M23m22K91m00J47K29K27
3286B91j81j11N6L2j06J19j39R3M1N9n8j8K58k22m61K02J86M0qjM2l1Q5r6J56
3311B28k14j24ML42j45j5l0%K1j40RJ07Kp6M7lJ0O9k72L71j97P4J32k08nl12N76
3338B51j98J3q0JR0LR0l38K80L0m8o7K98k48l36K30Ml6J11J64k83P3J10o7N5j47
3364d5J79k72O3j39K32r0Q4k59L26o1O4k38J29m4K17K2j61M5lq8J7O4j18l07N00
3389A17j43M2m00K47J74k47J03mp9K14M76n44loL4K37m59K49j21q0J03q9M10j75
3413E6j37K1m2J11j31L28j49j04K35k4Q7m18o3L06j05j87L50Jj85P4K2j11K03
3436A38o1L4q1l2M8j24K08j89L68j03k79o0J04mo8j8K52j23n3R7j17K92j54l69
$$ plain form
3460 -294 188 52 128 -97 142 28 -7 -61 72 168 -337 256 301 10 152 18 114 -10 146 36 -132 23
3482 23 3 -171 45 -209 -60 -58 162 160 -122 -36 -14 -14 244 148 -9 -81 -183 7 -45 84 113 120 -149 -180 130 41
3508 41 -125 90 -19 -425 15 107 119 33 148 33 -15 154 63 225 77 152 76 45 -255 -308 111 -218 -146 -76
3532 -76 215 -79 -56 165 14 -80 56 200 144 55 -20 275 -187 -257 39 -8 43 -12 -54 -115 -118 -50 46 -28 -168 27
3558 27 4 114 -49 -48 78 244 -84 196 -63 -60 -70 -124 222 78 -211 8 -160 -197 179 144 -182 -319 -142
3581 -142 57 -197 1 -113 90 118 -314 -80 192 -71 235 186 -157 77 146 165 -94 253 227 -29 87 182
3603 182 -48 29 47 -49 180 -27 -26 -189 -74 -70 153 75 -39 37 287 99 -257 -90 149 59 124 -140 -45 -14
3627 -14 -46 -134 -3 -35 -59 -38 -71 -91 -228 59 -204 -59 -33 104 -168 29 -89 -33 16 -74 205 172 34 -54 170
$$ packed form
3460b94M82j36P6k25K39j14l5n4J33R6n05N93M5k91J42j34R6j24J56j10j68J55
3482B3k0j74K16k54J49KK20kk82Q6K2%K58r6j57p2j02J90n2J29K9Pk69l1L10q9
3508D1j66K15j09m06M40R2J2q6J15j15m8J69r1J62j48P5p6l1l00n3M19l29P2P0
3532g6K91k94K3K21j51r4J36J44n6q9p5K95m62p0K96m7N1n5m2o1lO8R6p4j40J95
3558B7k3J10j63JJ26J66l28K80k59Lj0n4L46j44k89K19j68l7L76l5l26j37J77
3581a42J99k54J98j14K03K8m32K34K72k63L06m9l43K34O9J9k59L47k6k56J16R5
3603A82k30P7J8r6K29k07Jj63J15MK23p8j14P6K50j88l56J67K39r0O5k64R5L1
3627a4l2q8J31l2k4K1l3k0j37K87k63J45K6J37k72J97j18N6M9r0K79l3j38q8K24
$$ plain form
3652 170 -37 -105 97 74 199 104 74 -17 -153 57 -47 -127 44 33 -12 121 -33 69 -4 94 133 216 -78 -227
3676 -227 108 -223 -21 182 -247 -49 -142 -4 -196 -29 -175 -112 -5 -53 -17 -181 136 -224 90 142 151 -438
3698 -438 105 117 194 68 -33 85 -19 -42 124 -62 -232 22 2 -39 16 26 171 219 290 208 -3 83 -38 23
3722 23 68 95 -118 -63 217 -4 132 -68 -119 110 211 -256 -126 -140 12 49 148 96 -74 -51 -248 243 63
3745 63 -277 15 -62 -135 141 257 176 -60 11 -71 50 -8 87 111 106 123 -17 43 -12 351 -180 -40 386 -10 135
3770 135 -101 154 -94 -144 -154 -32 -59 30 -131 61 -41 -12 -41 -6 90 -14 -162 -13 -76 -207 238 -108 -183
3793 -183 9 44 120 -71 -203 65 8 71 -49 123 -164 79 144 -14 -172 32 0 45 151 -149 -124 -139 -28
3816 -28 -113 -112 -73 351 -46 18 -157 -27 -161 201 -50 -108 125 -17 34 -122 -70 -77 -44 215 199 55 -254 -49
$$ packed form
3652A70k07o8K02k3J25r5l0r1j36K10j04q0J71j1m5J33j54J02p3R8L9Q3k94j49
3676b27L35l31K02K03m29J98r3J38j92J67j46O3J07m8L6j64L17l60L14N2Rn89
3698d38N43J2P7j26j01J18j04k3J66j86j70K54k0m1N5J0J45M8P1q2k11Q6j21O1
3722B3M5K7k13N5K80k21J36k00n1K29J01m67J30j4J52L7R9n2j70K3j97M91j80
3745F3l40K92p7p3K76J16q1k36P1q2J21n8R5K4nJ7j40O0n5L63n31J40M26l96J45
3770A35k36K55k48n0j0J22k7Q9j61J92j02K9k9L5R6j04j48J49o3j31M45l46p5
3793a83J92L5P6j91j32K68n7O3j20J72k87K43O5j58j58K04l2M5J06l00K5j5J11
3816b8q5JL9M24l97O4j75J30j34L62k51n8K33j42N1j56N2pL3K59j6j44l09K05
$$ plain form
3840 -49 22 -187 -132 205 238 163 317 -62 -71 -135 414 55 96 214 -48 -7 -259 -38 148 -193 -295 -126 70
3863 70 -64 -200 -96 172 -224 -327 -151 -104 242 -121 52 41 10 17 57 -109 -261 91 292 260 -8 49 94
3886 94 60 60 -336 54 91 -237 35 -148 4 279 -12 164 -35 374 114 -129 -12 72 -44 -111 26 -179
3908 -179 -279 -81 -32 -17 -180 -47 44 272 116 314 50 -178 -65 -120 76 -203 -7 -149 -327 141 30
3929 30 -19 53 -163 268 -104 -38 -75 63 119 -167 133 72 110 198 -94 73 -29 146 47 76 9 117 -71 232
3953 232 -35 26 253 -10 -60 -198 224 -110 76 308 -17 133 -78 127 -79 -50 222 55 -10 -107 235 34
3975 34 -258 -127 135 197 147 -198 -98 -59 -1 -16 61 93 -139 -279 -20 154 -27 -49 -244 -136 -12 134 95
3998 95 -55 -110 141 6 -120 -123 34 84 -221 37 -70 352 -323 -80 156 -54 -40 -4 122 5 -16 224 45
$$ packed form
3840d9P1k09N5L37L3p5J54l79ro4N49l59M1J18k62M1k52K21J86l41j02J69J96
3863G0j34j36J04K68l96j03J76M7L46l63J73j1l1PM0j66j52L52K01l2k68N7M5
3886I4l4%l96L90L7l28K72j83J52K75k91J76j99M09k60k43J17Q4j16o7J37k05
3908a79j00J98M9J5j63J33R1K28j56J98k64k28J13n5J96k79J96j42j78M68j11
3929C0m9P2k16M31l72O6l7J38N6k86L00o1L8Q8k92J67j02J75r9K9o7J08j88L03
3953B32k67O1K27k63n0j38M22l34J86K32l25J50k11K05k06K9K72j67o5r7L42k01
3975C4k92J31K62O2n0l45J00L9N8j5P7L2k32j40K59J74j81k2j95J08J24J46l9
3998I5j50n5K51j35j26lJ57N0l05K58j07M22o75K43K36k10J4L6J26j17k1K40j79
$$ plain form
4021 45 202 182 -27 -37 -206 -9 -26 -180 -134 43 -39 310 303 -102 -245 78 195 75 109 151 246 -114 -85 -150
4045 -150 172 33 0 30 42 -154 -106 -41 5 144 159 18 -120 -104 -197 -175 -101 62 194 -54 -32 -237 -50 60
4069 60 143 143 56 -176 -149 -70 -257 123 55 -41 -104 -70 63 83 -192 275 61 96 158 43 -33 -205 99 -81 -160
4094 -160 2 -202 -51 347 -113 1 168 -284 182 122 200 -50 82 -150 9 66 -74 331 -143 -5 20
4115 20 -111 176 53 -54 143 37 -155 205 -101 192 -71 -272 -44 -249 -64 58 -199 -196 257 -221 -52
4136 -52 -73 212 -43 139 45 -267 51 157 49 -59 -16 -112 111 -70 -54 59 -124 -85 143 28 -134 161
4158 161 -126 -42 -30 -3 -226 -200 -57 98 -184 170 48 -5 153 151 -60 -14 -98 281 33 80 -11 -33 -136 -342
4182 -342 118 -129 98 174 -4 -73 -153 -26 52 -98 139 -217 26 169 -178 -53 -99 8 -291 175 90 -29
$$ packed form
4021D5J57k0k09j0j69J97j7j54M6J77q2L49pm05j43L23J17j20L4M2R5l60K9o5
4045a50L22j39l3L0J2j96M8O5M6J39J5j41j38J6r3K2P4J63J32k48K2k05J87J10
4069F0Q3%q7k32K7P9j87L80o8r6o3L4J33K0k75M67k14L5O2j15p6j72L04j80p9
4094a60J62k04J51L98m60J14J67m52M66o0P8k50J32k32J59N7j40M05m74J38K5
4115B0j31K87j23j07J97j06j92L60l06K93k63k01K28k05J85J22k57LM53m78J69
4136e2k1K85k55J82r4l12L18J06j08j08M3r6K23j81J6J13j83L9K28j15j62K95
4158A61k87Q4J2K7k23K6J43J55k82L54j22n3J58kk11M6q4L79k48M7r1k2j03k06
4182c42M60k47K27P6j78o9q0J27P8j50K37l56K43J43l47J25m6J07k99M66q5j19
$$ plain form
4204 -29 152 6 -18 -22 107 204 -4 -136 -76 -40 84 -84 -112 -110 -48 -96 329 -127 -59 -56 100 129 -122 144 -14
4229 -14 -86 10 169 -202 -23 -105 85 131 20 -56 102 160 231 76 -169 85 135 175 32 -29 262 51 -97 192
4253 192 -20 151 40 -10 116 -75 -19 -85 -63 -89 -170 -47 82 -5 -178 367 32 -6 144 68 186 67 -200
4276 -200 -203 -27 70 39 -143 -4 -5 78 299 -217 -59 13 -18 4 11 75 15 -171 -167 227 -175 80 278 -228 -289 88
4302 88 151 307 -55 -51 22 -81 -227 2 -124 75 39 -6 114 -170 -27 81 -103 -72 187 188 103 35 -287 90
4326 90 107 -199 -66 -55 -236 48 -17 149 100 -234 -176 25 27 57 -326 131 197 -130 96 268 -28 71 -44 -204
4350 -204 7 -47 111 2 242 -77 -307 300 86 -76 -6 -124 31 7 134 22 -7 212 -177 -76 -49 -39
4372 -39 124 -113 -154 94 4 163 225 -54 86 -80 96 73 59 190 -23 -61 -105 89 -162 16 75 -120 -85
$$ packed form
4204b9J81j46k4mJ29R7k08j32O0L6J24j68k8KO2m8M25m56O8LJ56K9k51K66j58
4229a4p2R6J59l71J79q2J90M6j11p6J58N8P1j55k45K54N0M0j43o1K91k11j48K89
4253A92k12J71j11n0J26j91N6o6K2k6q1J23J29q7j73N45l35l8J50p6J18j19k67
4276b00lJ76R7l1j82J39jQ3K21n16J58P2l1K2PO4o0j86ML94m02K55J98n06o1L77
4302H8O3J56l62MP3j03j46K29j26J99l6m5J20k84J43J08j84L1K59Jq5o8l22L77
4326I0J7l06J33J1j81K84o5J66m9l34N8K01KL0l83M57O6l27K26J72k96R9j15j60
4350b04K11n4J58j09K40l19k30O07k14j62P0j18J55k4J27j12k9K19l89J01K7J0
4372c9J63k37m1K48r0J59O2k79J40j66J76k3j4J31k13l8m4J94k51J78N9j95L5
$$ plain form
4395 -85 233 -35 -109 -227 -117 133 11 245 214 98 -61 351 123 -228 -43 -6 117 22 192 -162 -114 -229
4417 -229 -23 97 25 141 24 76 170 -55 -183 -61 -123 76 7 77 111 151 -142 -61 -92 91 57 -152 42 219
4441 219 -87 -153 96 -32 29 15 253 102 40 44 -58 -168 183 271 100 211 -173 185 179 13 338 153 179
4464 179 -7 176 83 84 243 0 -253 -72 210 -109 67 -77 175 115 -263 11 30 -6 47 -317 -141 95
4486 95 15 -138 167 -119 -118 28 -21 -281 -123 140 -197 -309 64 71 293 -216 17 67 -72 17 -28 -147 120
4509 120 213 54 -145 160 -100 92 150 179 -19 -71 258 -317 -122 -152 -9 -257 -223 -155 101 160 61 203 -174
4532 -174 128 -98 -41 -38 221 -60 -172 208 183 -3 123 -134 143 -315 -96 -222 69 163 -113 -86 -309 -59
4554 -59 -66 19 59 108 -101 -76 192 -85 91 147 -9 -39 83 -195 -74 -27 -226 -33 -272 140 -136 31 -259
$$ packed form
4395h5L18k68p4j18J10K50j22K34l1j16j59M12k28l51J85L7J23r5J70l54M8j15
4417b29K06J20p2J16j17N2R4k25j28J22o2J99o9P0L4M0k93Q1l1J83l4k09J94J77
4441B19l06o6K49j28O1j4K38j51o2Mj02j10L51Q8j71J11l84L58oj66L25j85K6
4464A79j86J83r3JJ59k43k53J81K82l19J76j44K52o0l78K74J9l6N3l64J76K36
4486I5q0j53L05k86JJ46m9k60J58K63l37j12L73PK22n09K33N0j39Q9m5j19K67
4509A20R3j59j99L05k60J92N8K9j98n2L29n75J95l0J43k48L4O8K56N9r9J42l77
4532a74L02k26N7LK59k81j12L80k5j86J26k57K77m58K19j26K91R4k76K7k23K50
4554e9pQ5M0M9k09K5K68k77J76N6j56l0J22k78J21M7j99J93k39M12k76J67k90
$$ plain form
4577 -259 -199 88 49 137 -201 84 148 3 -109 -104 -5 -282 176 -146 7 144 -15 -47 12 -63 23 40 -81 -32
4601 -32 -53 16 -59 -73 -29 57 42 52 -8 167 -169 -239 165 -193 84 -9 -83 129 -115 -471 -205 -290 -65 -35 -122
4626 -122 34 -91 104 -50 117 -196 -17 -65 -236 -286 216 208 -75 63 9 181 31 -67 -75 -65 15 -95 -145 -203
4650 -203 324 -46 62 -100 100 77 -38 -149 89 -43 139 -237 271 -306 -174 227 21 97 -67 164 18
4671 18 296 -146 -134 53 -49 -163 -75 18 67 -88 169 65 71 137 -239 157 178 122 115 -56 77 246 85 30
4695 30 -31 -200 193 -30 119 -198 83 150 273 176 -144 -43 80 -103 -41 -329 119 -180 -169 255 24 180
4717 180 28 37 -129 -139 -30 262 -30 -171 -60 -63 51 -9 -109 -43 -54 12 9 113 145 10 -135 169 -151 -125
4741 -125 -195 -216 119 -85 192 247 144 100 328 -120 117 -189 -206 118 -263 -4 -76 -70 146 -34 44 -241 -325
$$ packed form
4577b59O0K87l9Q8l38K85O4j45j12NR9k77M58l22J53J37j59l2N9p5Q6J7j21M9
4601c2k1O9p5j4M4Q6j5J0o0J75l36p0M04l58K77r3p4K12k44l56K66q5K25L0q7
4626a22J56j25J95j54J67l13J79m8j71n0N02qk83J38n4J72j50r8qJ0Q0j10n0n8
4650b03N27l70J08j62K00k3j15j11K38j32J82l76N08n77J32M01k06P6j64K31j46
4671A8K78m42J2J87j02j14Q8R3M9j55K57j04OO6l76L96K1n6pj71J33J69j61n5
4695C0o1j69L93k23J49l17K81O7J23r7l20J01J23j83O2k88M48k99J1M24k31J56
4717A80j52Rj66j0J09K92k92j41J11lJ14o0j00O6j1O6lJ04L2j35j45L04l20K6
4741a25p0k1L35k04K77N5j03m4K28m48K37l06j7L24l81K59p2OK16j80P8k85q4
$$ plain form
4764 -325 23 -3 -125 38 186 -367 25 -78 63 -51 23 -87 -170 -77 32 106 129 387 -4 292 0 -4 2
4787 2 98 141 221 -99 70 121 -14 228 -97 30 115 145 -1 -122 -45 127 19 37 -114 -60 -76 21 226 -44
4811 -44 -41 -102 -197 -78 148 -211 -218 -73 69 30 111 440 -200 13 16 64 145 -91 72 218 59 -230 -68 -122 234
4836 234 -73 101 113 79 -80 29 98 -4 7 -42 217 -4 -45 -80 -138 -88 143 189 222 3 40 74 92 -316 -227
4861 -227 68 94 -46 -44 63 11 25 -60 37 76 -113 -320 -32 11 26 -47 341 73 71 406 -47 128 -69 -15 -156
4886 -156 198 -92 190 -110 -9 31 156 287 -141 -161 -26 -52 -83 71 109 -92 13 -12 -279 114 32 -184
4908 -184 -68 111 -60 -20 16 -441 -19 -71 -128 -207 28 218 -89 17 -29 123 -154 -313 71 -55 72 45
4930 45 16 -98 72 -30 -167 18 108 -51 -236 12 -85 117 -18 263 -71 -86 -65 -7 100 -107 11 220
$$ packed form
4764c25L48k6j22J63J48n53L92j03J41j14P4j10q3R3J09P4K3K58l91K96k92mO
4787BR6M3Q0l20J69N1j35K42l25J27Q5L0j46j21P7J72j08J8j51N4j6R7K05k70
4811d4Lo1r5J19K26l59pJ45J42l9Q1L29o40K13LM8Q1k36J63J46j59k89J62n4L56
4836B34l07J74J2l4j59J09O9j02J1m9K59k21m1l5n8N0K31M6L3k19L7L4J8m08Q9
4861b27K95K6j40KJ07n2J4q5R7L9j89k07K88M3J5p3L88k68kL35m53J75j97N4j41
4886a56L54k90K82l00J01M0J25J31m28k0J35k6l1J54L8k01J05k5k67L93q2k16
4908a84J16J79j71M0L6m57M22n2n7p9K35J90l07J06m6J52k77j59L84j26J27k7
4930D5k9j14J70j02j37J85R0j59j85K48r7K02j35K81l34j5K1N8J07k07J18K09
$$ plain form
4952 220 -36 -34 155 -91 -115 14 -159 -78 -41 -24 105 57 214 240 -72 -50 89 -74 -147 -9 -75 -51 180 306
4976 306 -73 -283 62 -336 141 76 53 49 11 -183 -60 210 251 12 -179 150 -36 -23 28 -17 21 -115 -142 55
5000 55 67 -288 263 244 -145 52 8 89 132 129 -22 43 141 26 129 -44 -15 118 29 -50 56 -6 -1 0 151 -104
5026 -104 153 -201 -186 -363 -159 252 -27 177 -8 -79 226 168 -42 22 -138 144 331 16 -183 74 199
5047 199 41 49 185 92 -133 -22 -5 173 217 -136 172 216 -31 25 69 -276 -14 132 -88 -53 121 51 -39 68
5071 68 -308 163 -61 -81 -107 -200 -124 -308 -250 -197 37 -109 88 49 -4 -108 -117 -84 -315 39 19 105 -12 122 3
5096 3 23 11 -59 -91 -335 145 232 -44 73 221 -268 -157 21 102 2 258 -56 -185 -297 -28 -131 -146 -191
5119 -191 -77 -158 -95 347 -48 56 209 85 -76 97 279 94 183 179 7 11 -101 8 50 252 31 60 134
$$ packed form
4952B20k56KJ89k46k4J29j73Q1L7J7J29m8J57K6l12K2J39j63p3J38o6K4K31J26
4976C06l79k10L45l98M77o5k3ml8j94J23K70M1k39j91L29j86J3N1m5L8j36k7J97
5000E5J2l55N51j9l89J97m4Q1M3lj51O5R8j15J03j73K9J33q9p9J06o2NJJ51k55
5026a04K57l54J5j77K04M11k79K04j85p1L05n8k10O4j60K82J87l15j99K57J25
5047A99j58QJ36r3k25J11J7J78M4l53L08M4k47N6M4l45K62J46k20L5J74p0r0J07
5071F8l76M71k24k0k6r3P6j84N8N3K34j46J97l9n3j04rL3k31L54k0Q6j17J34j19
5096CK0j2p0l2k44M80Q7k76J17J48m89J11J78Q1j00K56l14j29j12K69j03j5m5
5119a91J14q1O3M42l95J04J53j24j61J73J82j85Q9mj72Mj12J09M2K02k21K9P4
$$ plain form
5142 134 35 46 20 -208 -198 -63 -132 6 -79 96 136 36 30 -80 178 8 -98 133 -170 -119 -145 -258 -77 -39
5166 -39 -134 -62 70 -68 -89 -134 -193 216 -48 110 -37 121 59 43 162 -94 -205 -106 130 -77 -243 -73 -61
5189 -61 -44 -214 -23 -142 40 -99 179 -156 -26 125 12 -115 -105 -117 -167 214 55 -27 9 -205 -155 35 21
5212 21 63 323 131 205 70 53 130 4 -225 25 36 -41 -61 39 20 -76 169 -94 128 -39 -40 52 -96 129
5236 129 -77 54 202 -6 80 -6 76 8 42 64 -88 -288 -5 -121 29 -113 -40 108 38 113 176 29 50 91
5260 91 145 -233 -4 -130 88 -39 188 -157 238 100 65 -165 13 -56 -79 -38 99 170 17 84 -95 101 36
5283 36 -163 104 126 -141 434 138 43 52 -75 -110 77 20 14 88 34 -282 -242 -276 179 -51 67 84 -198 -104 10
5308 10 108 80 -62 -120 -46 -111 -279 331 307 171 277 7 38 -54 257 -43 213 -342 -216 137 147 69 1 208
$$ packed form
5142A34r9J1k6k28J0J35o9J38q5J75M0j00oj10K58j70j06K31l03N1k6j13J81L8
5166c9r5P2J32j38k1m5n9M09k64J58j47J58o2j6J19k56j11R9K36k07j66J70J2
5189f1J7j70J91j19J82j39K78l35J30J51j13j27J0j2n0L81j59q2L6k14N0J90j4
5212B1M2K60j92P4j35j7P7j26k29K50J1p7k0J00j9r6K45k63K22j67jR2j48K25
5236A29k06J31J48k08Q6q6Q2o8L4K2j52k00K83j16J50j42P3J48p0P5O3j47K1M1
5260I1N4l78K29j26K18j27K27l45L95j38l5k30J78o9k3M1J37P1j53O7j79J96o5
5283C6j99K67K2k67N75k96r5Rj27l5J87n7oP4n4l16M0l4M55k30J18J7k82R4J14
5308A0R8k8j42n8P4o5j68O10k4j36J06k70L1r2L11l00K56n55J26L53J0p8o8K07
$$ plain form
5332 208 -125 193 353 -102 57 26 56 -139 -70 52 118 130 -54 67 54 189 -121 168 15 -171 52 53 47
5355 47 -156 -218 102 -144 -116 74 88 -300 -15 231 -27 1 88 38 167 78 139 -254 -177 -22 155 73 -4 19
5379 19 28 4 184 -45 92 113 -238 68 -27 -51 83 175 196 -116 88 32 193 246 -50 -4 36 25 12 130 84
5404 84 205 -94 95 337 -9 -138 -59 198 18 -58 45 208 281 20 18 -67 -171 -116 -30 -148 9 147 -15
5427 -15 -90 191 114 20 23 -253 -75 134 -1 -254 93 178 -31 -44 20 -116 24 -184 -37 146 -53 76 109
5450 109 -129 -44 33 -58 -14 9 -59 -139 -111 -161 -1 -83 -157 -29 -126 56 37 122 -103 47 -118 -16 11 39 202
5475 202 26 12 -2 -133 50 6 -38 23 -7 -255 32 110 -124 -166 11 -165 46 138 58 72 -79 140 202 -124
5499 -124 -110 -44 24 -51 181 57 78 205 73 156 -354 -108 -65 -50 -71 154 243 301 116 -132 144 -149 -223 -102
$$ packed form
5332B08l33L18J60m55J59l1L0j95O9J22O6J2j84J21j3J35l10K89j53j86K23Jo
5355D7k03o2L20k46K8J90J4l88K85K46k58K8Q7n0J29q9O1l93P7J55J77q2p7K3
5379A9Rk4J80k29J37K1l51L06r5k4J34R2K1l12K04n6J61N3k96M6M0j1j3J18m6
5404H4J21k99J89K42l46j29P9K57j80p6J03J63P3k61kq5j04N5Q6j18J57J38j62
5427a5p5K81p7r4Lk76J78K09j35k53L47Q5k09j3O4j36J40k08J47J83j99J29L3
5450A09k38Q5P7r1M4K3o8q0K8n0J60q2p4J28r7J82j9Q5k25J50j65J02K7K8J63
5475B02j76j4j4j31J83m4m4O1l0k48K87P8k34m2J77j76K11R2q0J4j51K19O2l26
5499a24J4O6O8p5K32j24K1J27j32Q3n10K46M3J5k1K25Q9N8j85k48K76k93p4J21
$$ plain form
5523 -102 -60 4 237 -12 -168 -47 -214 -203 150 -66 236 35 -97 14 119 -28 -41 153 -9 34 -14 -21 -14
5546 -14 -87 -14 99 -20 -14 -39 -87 -142 120 -240 -22 133 50 -98 136 -31 -122 12 18 -53 -132 -112 158 77 -37
5571 -37 173 -63 53 -27 81 20 -200 -28 95 138 -77 -170 53 103 248 -22 47 25 138 -137 22 107 178
5594 178 14 91 -42 -321 -55 106 -127 -29 -270 108 -16 -184 -112 125 137 89 29 -127 -50 65 147 156 324
5617 324 -85 14 201 -30 173 121 57 124 41 -73 186 85 -26 -77 190 35 120 -66 265 164 -108 -39 -50
5640 -50 82 106 -123 -85 94 247 -186 -1 -197 -182 7 -102 197 -201 120 1 -208 -104 -192 197 54 21
5662 21 75 -18 53 -85 220 -14 -72 31 13 200 -215 269 73 125 -19 215 62 -131 156 60 -34 -90 26
5685 26 -11 27 -109 226 -35 142 -168 193 -11 -126 -41 -41 -93 22 -90 -131 152 -174 -188 -183 256 27 -49 -24
$$ packed form
5523a02M2O4K33k49j56J21j67J1L53k16L02k01j32J11J05j47j3J94j62M3m8pP
5546a4p3P3J13j19Ok5m8n5K62l60K18J55q3j48K34j67r1J34Op1p9K0K70q1j14
5571c7K10k36J16q0J08o1k20J72J23M3k15r3K23N0J45k70O9k2J13k75J59Q5P1
5594A78j64P7j33k79K66J61k33R8k41L78j24j68P2K37J2m8o0j56P7J15Q2RJ68
5617C24m09R9J87k31K03n2o4O7q3j14K59j01j11n1K67j55Q5j86L31j01k72O9j1
5640e0J32K4k29L8J79J53m33J85j96J5J89j09K99l98L21j19k09J04q8L89j43l3
5662B1N4r3P1j38L05k34n8J03j8J87m15M84j96N2j44K34j53j93K87r6r4n6J16
5685B6l7L8j36L35k61J77l10L61k04j15Q5%n2J15j12m1K83l26j4NM39k29p6K5
$$ plain form
5709 -24 48 257 -133 319 39 20 -42 31 98 -147 23 -123 267 -71 -218 72 435 93 -104 72 -146 -30
5731 -30 -204 110 -207 47 13 43 -261 -170 -40 227 -102 -38 -162 40 19 -21 -22 -29 65 -244 118 199 106 92 247
5756 247 11 -113 4 -138 6 -115 126 157 -83 -44 -282 139 -234 -216 -109 -152 -20 -23 150 -180 -46 -12
5778 -12 -89 -328 -36 8 52 -11 -77 -85 158 -138 137 -81 -63 -224 -126 -109 1 148 59 -14 -73 264 -77 74 -211
5803 -211 69 56 41 1 -70 -115 165 -89 -57 99 -342 -8 -151 53 81 31 163 -127 67 162 -70 149 -128
5826 -128 -234 -130 257 150 143 -150 297 -12 -508 -43 -101 -91 -38 187 224 8 348 147 49 -61 183 -28
5848 -28 -67 78 -185 -109 -106 67 -145 -33 -215 139 32 137 -14 -37 21 91 79 -5 80 -61 46 -26 286 -135
5872 -135 -55 -123 117 251 -212 -96 458 -18 81 53 -116 3 -99 -100 -134 9 109 -61 -94 -52 -32 7 41 -230
$$ packed form
5709b4P2K09l90M52k80j9o2P3O7k45J70j46L90l38j47K90L63l42j97J76k18J16
5731c0j74L14l17K54l4L0l04R1J30K67l29O4j24K02k1m0jpR4l09L62Q1r3j4J55
5756B47k36j24J17j42J44j21K41L1k40L9k38M21l73J8J07m3J32lJ73l30J34L4
5778a2p7k39K92M4M4o3o6qK43k96K75k18J8j61R8J7J10J47q9p3n9L37l41J51k85
5803b11K80j3j5m0p1m5K80k54L2J56m41L34j43K04K8n0J32k90J94R5k32K19k77
5826a28j06J04L87j07pk93M47l09m96M65n8J0N3K25L7k16L40k01r8j10K44k11
5848b8l9J45k63P6LJ73k12J12j82L54j07J05j51k3N8P0j2q4Q5j41J07p2L12m21
5872a35Q0o8K40J34m63J16N54m76R9k8j69J19j02jl4J43J00j70l3M2K0L9L4k71
$$ plain form
5896 -230 -213 137 245 154 -247 147 149 -102 -322 85 31 174 -330 179 -76 -97 -25 107 -38 -150 15 -20 -216
5919 -216 -68 -101 -57 14 124 130 65 -11 -156 -212 11 -340 72 174 -56 -122 -175 1 111 411 165 -108 225
5942 225 218 -133 -117 243 21 73 50 -46 289 68 200 -95 -113 231 113 -48 -18 159 -30 240 -51 6 42
5965 42 105 -4 -160 -6 -103 195 132 -285 -83 -210 -142 -148 15 153 -96 162 196 198 151 -74 -4 13 155 227 -42
5990 -42 281 -80 12 -13 25 32 5 -25 1 138 -122 3 -64 157 -105 28 -74 -173 87 4 -217 138 -59 19
6014 19 0 -163 286 -95 -73 22 192 23 -143 -297 24 -227 20 37 -110 61 -222 98 -278 -215 95 106
6036 106 52 55 351 -90 -235 -118 -318 -36 -130 132 24 -163 129 -16 -131 130 209 -23 78 -135 117 -293
6058 -293 -18 -120 -26 346 -270 -66 -79 -44 -15 122 -48 -72 241 96 52 -103 -98 46 -3 -138 -226 -57 -79 -82
$$ packed form
5896b30J7L50J08r1m01L94Kk51k20M07n4J43n04N09k55k1P2J32j45j12J65l5j96
5919b16J48l3M4P1J10Oo5p6j45n6K23l51M12J02k30o6n3J76J10L00k46k73L33
5942B25pl51J6L60k22N2k3r6L35k21J32k95j8L44j18j61L0J77j89K70k91N7L6
5965D2O3j09j56J54r7K98o3m17K02j27O8oJ63J38k49K58L4Km7k25P0J7J42P2k69
5990d2L23l61R2k5L8Pk7l0K6J37k60J25o7K21k62J33j02r9K60q3k21L55j97P8
6014A9j9j63M49l81K2R5J70j69j66j54L21k51K47J7j47J71k83L20l76O3L10J1
6036A06n4LK96m41j45J17k00K82r4K62j08j87K92j45j15K61P9k32J01k13K52m10
6058b93K75j02R4L72o16K04j3L5K9J37j70k4L13j45m4j55NJ44m9j35q8J69k2l
$$ plain form
6082 -82 27 61 -183 26 -11 -77 75 -74 170 6 171 -16 -209 -114 187 182 -23 -148 64 -24 -31 -55 -303 -38
6106 -38 145 -145 131 122 119 46 -207 21 119 7 65 29 -36 -61 -246 -115 -242 341 188 86 -176 -173 219 -111
6130 -111 -22 -36 -71 -159 -307 -29 117 -95 -1 -197 111 -141 -11 259 45 15 -185 -10 80 -37 181 -54
6152 -54 186 -94 69 -47 -92 68 195 -69 -192 -76 -74 180 -45 29 62 20 94 61 17 -52 -113 -162 -77 -46 46
6177 46 177 -7 75 303 -54 7 208 70 275 64 112 -199 -286 124 -7 83 -75 -128 54 190 62 130 -8
6200 -8 -149 32 132 48 80 188 -181 112 243 -164 -211 -330 111 86 114 52 -172 -44 -49 -9 17 -41 70 -93
6224 -93 -62 195 -32 201 142 -99 -222 -64 103 74 -152 -200 -73 1 -10 143 283 75 -223 109 -106 -77 -1
6247 -1 3 9 133 51 -106 123 93 164 -131 375 -171 -125 76 35 -50 -100 100 -90 2 -36 -94 235 105 93 134 -45
$$ packed form
6082h2J09L4k44K09l7o6J52j49K44j64J65j87j93R5L01nk05j25K12q8pk4k48K65
6106c8J83k90K76rlp3k53K28R8j12N8l6o5k5j85J31j27N83j53j02k62LL92l30
6130a11Q9j4l5q8j48K78J46k12R4j96L08k52J30K70k14l0k00J75R0j17K18k35
6152e4K40k80J63j16m5J60J27k64j23J16KK54k25P4L3m2P4l3m4o9o1m9Q5L1R2
6177D6J31j84Q2K28l57O1K01j38K05k11M8l11q7M10j31R0j58n3J82J36j28O8j38
6200hj41J81J00q4L2J08l69K93J31m07m7j19M41k5K8o2k24J28nM0K6n8J11j63
6224i3L1K57k27K33n9k41j23J58J67k9k26m8J27P4j1J53J40k08k98L32k15K9P6
6247aMOJ24q2j57K29l0P1k95N06n46M6K01m1q5n0K00j90R2l8n8L29j30j2M1j79
$$ plain form
6273 -45 61 -11 -201 -281 31 11 -38 87 -104 61 -208 60 -283 -14 123 370 -187 7 108 -29 -135 -156
6295 -156 -88 -237 33 -86 -39 -77 -82 1 15 99 -38 77 17 233 179 -106 104 -142 -121 -262 -243 -50 140 0
6319 0 -271 49 36 138 -153 -77 -149 197 54 33 -200 122 236 13 -23 -5 63 -11 40 55 -7 -107 158 111 -236
6344 -236 -66 154 116 163 8 152 73 122 -173 -39 68 123 -46 -49 -42 -161 144 -202 -59 307 68 161 -69
6367 -69 -53 -165 150 -162 -111 -314 41 -208 -4 -37 22 32 135 147 -61 60 -310 -1 -82 -18 67 -29 -177 -13
6391 -13 199 116 311 -16 -34 -37 248 56 -80 244 178 9 -52 54 -19 -91 -108 64 -217 72 72 116 -30 191
6415 191 -59 26 302 -206 73 84 -94 45 -384 48 -31 264 -57 -255 -324 -28 28 -152 -36 179 2 1
6437 1 -103 -195 78 -82 56 17 -338 -153 228 21 -143 -97 -197 113 220 60 45 -369 -142 109 -15 336
$$ packed form
6273d5J06p2j90q0L12k0m9J25j91J65k69K68l43K69J37K47n57J94J01j37j06k1
6295a56O8j49K70j19M7l8nQ3J4Q4j37J15o0K16n4k85K10k46K1j41J9J93J90j40
6319@k71L20j3J02k91P6p2L46j43k1k33L22J14k23l6J8O8p4N1J5o2j00K65m7l47
6344b36J70K20l8M7j55J44p9M9k95J34J07N5j69lPj19L05l46J43L66k39R3k30
6367f9J6j12L15l12N1k03L55k49K04l3N9J0J03J2k08J21l70L09q1O4Q5r6j48J64
6391a3K12q3J95l27j8lK85j92j36L24o6j69o1J06p3p2j7J72k81K89%M4j46K21
6415A91k50Q5K76n08K79J1j78J39m29M32p9K95l21j98o9K96N6j80J16K15j77j
6437Aj04r2K73j60J38l9l55J85L81k07j64M6j00L10J07j60j5m14K27K51j24L51
$$ plain form
6459 336 117 -73 6 -207 -100 -164 -25 -140 148 134 -155 67 -139 298 -278 -126 -236 95 28 -55 -12 16
6481 16 -51 -103 69 19 97 -25 -73 212 -49 53 72 -103 203 -11 -279 27 -28 112 133 83 -233 54 162
6504 162 140 -189 -50 -19 89 -81 41 99 47 139 -171 -31 110 189 -176 0 46 -127 -314 -6 -173 92
6526 92 -10 49 64 58 24 175 303 276 -30 70 -16 -13 -37 -308 -107 -117 -28 -52 51 -199 -158 117 93 -155 -61 238
6552 238 -9 -92 -208 -64 157 -121 231 426 -122 211 -243 41 242 -44 244 -71 -233 -125 -15 71 -37
6573 -37 33 -281 -240 183 -60 50 96 342 -87 117 163 124 156 109 -226 -248 -71 -105 76 22 73 127 -82 88
6597 88 374 -287 119 -201 19 393 137 -85 165 383 -5 -8 -38 122 64 33 82 184 68 125 112 -77 -53
6620 -53 -50 -213 -388 130 99 -39 10 45 -204 19 90 -232 163 81 -344 -87 -184 2 -253 102 201 -97 -246
$$ packed form
6459C36k19j90P9k13J07o4J39j15K88j4k89K22k06M37n76J52j10L31o7q3M3K8
6481A6o7n2J72n0P8j22m8K85k61J02J9j75L06k14k68L06n5J40K1n0l16K87J08
6504A62k2l29J39L1J08j70J22N8n2R2l10J40J41P9l65J76M6j73j87L08j67K65
6526I2j02N9J5ol4J51J28k7l06J00q6Lk4k71K01j0Q9k4J03k50M1K75k4k48R4K99
6552B38k47q3j16J44K21k78L52J95n48L33m54K84K01k86K88l15j62J08J10Q6j08
6573c7P0l14M1M23k43J10M6K46m29K04M6l9L2m7l35k2J77l4J81n4N1N4k09J70
6597H8K86o61M06l20K20L74k56k22K50K18l88ll0J60n8l1M9J02j16N7j3j89K4
6620e3Lj63j75N18l1j38M9L5k49K23P1l22L95q2m25K57r7J86k55L55R9k98j49
$$ plain form
6643 -246 146 -93 145 98 -244 222 198 57 -72 -14 -165 -234 75 -88 -112 -74 241 95 122 -133 -265 30
6665 30 -59 161 131 -4 -11 -9 78 -115 222 -157 21 18 -230 210 -1 -120 83 -12 -109 2 -271 -157 297 -185
6689 -185 -71 84 -143 -234 -94 -139 -169 2 -178 -130 -118 20 18 172 133 -60 61 -54 87 32 17 21 79 302
6713 302 220 0 -32 -172 -33 -1 -83 -11 86 -195 -16 72 -14 -16 -83 43 -9 -149 43 -46 242 219 159 -387 -94
6738 -94 -156 77 -210 103 -96 128 -202 -135 -142 400 265 397 -18 -33 -168 -133 -137 9 -103 -39 122 -105 -4
6761 -4 -12 182 111 58 -128 287 -44 369 21 143 -121 92 39 90 19 -53 24 -4 -361 -321 170 123 52 3 -4 -30
6787 -30 -72 -73 9 -132 122 -44 3 194 -126 -53 -197 155 42 -95 -116 57 -222 78 -97 -20 -243 -140 -217
6810 -217 -244 -251 289 27 -138 -56 -27 208 -103 -16 118 -273 109 -88 299 -168 -13 39 -101 122 -208 -174 -116
$$ packed form
6643b46L92k39K38m7l42M66k4j41j29N8j51o9L09j63k4L8L15j46K7k55j32K95
6665C0q9K20l0j35pKQ7j93L37l79J78lk48M40k11j19K03r5r7J11k73J14M54m82
6689a85J14J55k27r1J40m5l0J71j80M8J2J38kJ54l9j93J21j15J41n5j5MN8K23
6713C02q2k20l2j40J39L2q2P2R7k81J79Q8q6ko7J26n2j40J92q9K88k3o0n46K93
6738i4o2K33k87L13j99K24l30O7pN42j35J32m15j5j35L5mJ46j12O4J61k27J01
6761dqJ94p1n3j86M15l31M13l48J22k64K13n3N1p1p2P7k8l57M0M91m7p1m9pk6
6787c0m2jQ2j41K54j66M7J91l20P3j44L52j13j37k1J73k79L00j75P7k23J03p7
6810b17k7pN40k62j65Q2K9K35l11Q7J34l91L82j97L87m67J55N2j40K23l30L4N8
$$ plain form
6833 -116 63 60 136 -134 13 19 14 130 -143 -88 -131 132 -102 93 31 -129 -61 -74 -64 -89 266 140 -196 68 -296
6858 -296 255 137 88 67 192 223 223 91 -191 -34 -131 -168 -94 -193 -118 80 -209 -71 119 -230 -22 -148 60
6881 60 7 284 -34 -38 43 -222 -92 -225 -106 -121 -72 103 8 -8 46 229 111 -205 -125 -32 39 -62 -81 162 110
6906 110 21 132 -72 -26 -14 -178 -60 131 151 -133 70 215 198 40 -66 5 -185 -242 76 -53 135 45 -191
6929 -191 128 81 63 -119 197 -91 153 163 134 22 103 -341 -163 329 157 197 134 -39 -245 -34 -61 -114 -31
6952 -31 -93 42 98 82 71 -300 -18 47 172 37 -120 -6 -120 -60 3 312 -54 -26 175 82 -59 76 111 -17
6976 -17 161 87 -72 124 -105 -26 -17 -209 54 -150 -78 -58 -129 -170 68 -205 121 -60 115 -124 139 -58 53
6999 53 -231 42 -93 -159 246 39 -72 330 -280 183 -195 84 51 78 -62 67 -253 64 -100 -278 -54
$$ packed form
6833a16J79lP6k70J47OnJ16k73N5m3K63k34J95o2j60O8j3J0k5L55j26l36K64l64
6858b96N51j18m9k1J25L1%j32k82J57r7l7P4r9P5J98k89J38J90l49K08j26K08
6881F0n3K77l18mQ1k65J30j33J19j5M9J75r5j6N4J83j18l16Q0R3P1j01j9K43n2
6906A10q9J11k04M6J2j64J18J91K0k84K03J45j7j58j06P1j90n7L18j29J88r0k36
6929a91L19m7j8j82L16k88K44J0k9j12Q1m44J78M92j72M0o3j73k06K11k7n3Q3
6952c1o2J35N6j6j1l71K82O5J25j35j57J14j14O0O3L09l66K8K01r3j41J35L5j28
6976a7J78p4j59J96k29P9Rj92K63k04P2K0p1m1K38k73L26j81J75k39K63j97J11
6999E3k84K73j35o6M05k07j11M02o10M63l78K79l3K7j40J29l20L17j64j78K24
$$ plain form
7020 -54 61 2 -36 90 179 130 -71 -135 227 34 7 -166 292 104 -113 402 35 8 123 -101 -232 -30 -39
7043 -39 23 42 -111 41 57 17 -75 -195 -18 90 -97 139 -118 203 82 -184 -47 28 -236 -61 -155 -107 -45
7066 -45 -123 181 -44 -52 -71 -72 110 79 -10 13 -5 -104 -115 164 99 -14 -84 36 -136 207 150 -41 90 -188 48
7091 48 11 244 16 -3 -57 -118 83 -105 -71 -182 101 38 34 60 30 -71 77 36 243 -104 -22 46 96 156 52
7116 52 -182 37 -95 127 -194 113 -25 -101 -43 86 69 9 108 151 -64 -213 -80 30 222 -67 -7 -43 -57
7139 -57 -177 -78 -215 -147 9 -71 15 -154 -30 147 -233 -22 56 -300 -134 33 -173 263 195 47 27 -110 -63
7162 -63 1 -49 184 12 21 -49 -190 25 -54 -157 -142 222 -64 188 -149 -191 -171 -161 -28 10 34 -204 26 -115
7186 -115 49 -70 3 227 97 23 -269 -64 -346 -36 -45 -12 311 -152 76 -161 -35 155 33 339 -90 58
$$ packed form
7020e4J15n9l8J26Q9m9k01o4L62j93k7j73M58j88k17N15l67k7J15k24j31K02r
7043c9O2J9j53J52J6m0r2j20J77J08j87K36k57L21j21k66J37P5k64J75r4M8O2
7066d5p8L04k25qj9jJ82l1q9K3j8r9j1K79o5j13p0J20j72L43n7j91J31k78K36
7091D8l7K33k28j9n4o1K01j88L4j11K83o3mK6l0j01J48m1K07l47Q2O8N0O0j04
7116E2k34K19j32K22l21L07j38p6N8J29j7o0R9M3k15j49J33J10J92k89O0l6j4
7139e7j20R9j37O8J56q0Q6j69J24J77l80K11P8l56J66J67k06M36o8j48k0j37M7
7162f3O4n0K33j72Rp0j41K15p9j03J5L64k86K52l37m2K0J0J33L8K4k38K30j41
7186a15J64j19P3K24j30p4k92K05k82L10rL3L23m63K28k37J26J90j22L06m29J48
$$ plain form
7208 58 76 -60 67 206 -408 83 -185 -146 38 -103 -76 46 -152 -184 200 270 -90 191 87 144 115 -11 133
7231 133 -22 -87 59 29 143 -383 -284 83 101 -273 -37 -17 -42 90 -128 -26 -79 -119 24 -68 98 -113 -319
7254 -319 42 -68 173 -7 139 63 -209 82 -141 33 -29 -157 -30 -25 31 -25 -311 -102 -218 -182 79 62 98
7277 98 -5 6 -57 42 16 -19 -56 246 -55 -165 -93 94 55 139 -320 -100 -12 -54 165 118 -179 -141 -77 55 52 52
7303 52 -110 -121 -53 -39 155 -271 -79 -115 -125 -244 -113 -82 109 108 -50 126 200 -159 -16 -152 -26 11 -61 9
7327 9 57 149 20 -39 -120 47 -37 86 190 -221 -200 253 153 3 31 -147 -21 18 52 -124 1 -107 142 -25
7351 -25 -4 -47 31 121 40 106 130 -215 55 -229 121 61 60 -201 52 343 -117 -94 -5 -231 -5 -65 30 -209 -87
7376 -87 62 176 143 -127 -16 300 -150 6 -36 -55 195 196 -42 -84 -196 -242 103 -6 -56 127 120 -109 55 -32
$$ packed form
7208E8J8j36J27J39o14M91k68L9J84j41K7J22j98l2L84P0l60K81j04N7k9j26J44
7231A33j55o5J46l0J14n26R9L67J8l74K36K0k5J32k18J02n3m0J43r2J66k11k06
7254c19L61j10K41j80J46p6k72K91k23J74o2j28J27NN6n6k86K09j16L6K61j7L6
7277I8j03J1o3R9k6l5l7L02l01j10P2J87l9Q4m59K20Q8m2K19m7k97L8O4J32l%
7303E2j62j1O8J4J94m26J92l6j0j19J31L1J91jj58J76P4l59J43j36J26L7p2P0
7327IM8R2j29n9q1J67q4J23J04m11K1M53j00j50K8j78J26L9L4j76J25j08K49j67
7351b5K1m3P8R0q1O6K4l45K70k84L50o0jk61K53K91m60K3Q9k26K26o0R5k39J22
7376h7J49J14l3k70J11L16m50J56m2j9K50Jk38m2j12m6L45j09n0J83pk29J64q7
$$ plain form
7400 -32 -150 164 -1 155 14 212 -26 -137 -25 194 353 23 443 -80 35 -93 -178 -18 150 -81 140
7421 140 192 59 -88 138 -110 -126 -64 -203 -210 46 -67 31 153 204 151 33 136 -226 -265 -283 116 28 -177 -62
7445 -62 -61 148 -331 -38 -22 61 95 -20 -198 -50 291 -117 -49 125 -168 9 13 125 -197 -39 244 -32 -138
7468 -138 43 -111 -210 29 -6 250 -209 127 17 198 -16 177 -2 174 -52 -41 -144 -110 87 151 -217 -149
7490 -149 -191 -31 -16 101 124 -159 -230 -275 190 100 -1 129 240 139 96 50 288 -56 2 -69 -199 15 -203
7513 -203 40 48 81 -182 61 -85 29 143 -60 101 -249 117 118 -146 297 -243 -384 -40 -53 23 -46 122 -174
7536 -174 -260 152 57 -240 5 -29 -4 207 -97 -34 -12 -117 99 -44 217 -64 225 72 137 -2 -148 28
7558 28 -28 -13 24 52 27 235 84 -88 179 -117 52 19 -20 -238 93 -102 81 -79 -362 47 -23 45 75 52
$$ packed form
7400c2j18L14j65J56j41J98k38j11J12K19J59l30M20n23J15j28q5J60J68k31K21
7421A40N2j33j47K26k48j6O2j39pK56j13R8J22N1n3j18J03l62l9j8L99q8k05J15
7445f2JK09m79K93J6Q3L4j15j78J48L41m08O8J74k93J77MJ12l22J58K83k76j06
7468a38J81j54r9K39l5K56m59L36j10J81k14J93j79J76k26J1j03L4J97O4l68O8
7490a49m2J60J5J17K3k83p1m5M65r0j01J30J11j01m3m6K38l44N8p1j30K14k18
7513b03K43QL3k63K43j46J14J14k03J61l50L66Jk64M43n40j41L44j3P6o9J68k96
7536a74q6M12r5k97K45l4K5K11l04O3K2j05K16j43K61k81K89j53O5j39j46J76
7558B8n6J5L7K8k5K08j51j72K67k96J69l3l9k18L31j95J83j60k83M09p0O8L0k3
$$ plain form
7582 52 -60 137 -11 88 114 7 -41 -197 115 8 13 304 167 -131 38 100 -62 56 -329 287 338 40 71
7605 71 215 -22 143 282 -72 265 -60 104 110 -167 101 70 105 54 -41 -10 -21 245 -144 -50 12 -171 172 244
7629 244 245 -3 85 86 -114 -131 -68 -99 83 -105 0 12 -58 181 -166 -181 -30 175 92 41 122 119 374 126 53 -8
7655 -8 -65 -100 -4 66 -18 -251 292 73 -148 -156 82 -47 -219 71 69 -33 -91 39 -117 -96 -182 -8 50 32 -351
7680 -351 -21 -155 -47 8 -26 -150 -207 -203 161 131 59 60 18 108 -157 -22 190 -134 91 -222 81 -219 198 -280
7704 -280 -108 -30 -82 146 -26 241 133 3 141 -194 -244 -126 -52 217 109 -121 -148 110 -113 34 -154 -11
7726 -11 108 176 70 192 83 -115 -299 -32 -110 -153 -220 -87 70 -55 172 -155 -302 -31 144 23 -59 149
7748 149 106 127 23 -69 49 400 19 -79 31 14 101 -183 101 -196 -8 -276 2 -98 -27 51 -88 38 104
$$ packed form
7582E2j12J97j48R9K6j07m8j56L12j07NK91j37k98J69O2j62J18l85O16N1k98L1
7605G1J44k37J65J39l54L37l25J64Ok77K68l1L5n1r5L1j1K66l89R4O2j83L43P2
7629B44Jk48Q8Jk00j7O3l1J82j88J05J2p0K39l47j5J51K05q3n1Q1lK55k48p3o1
7655hn7l5R6P0q4k33N43k19k21qK38j29j72K90kj02n8J30j56K1q6J74N8j8l83
7680c51L30j34J08N5l4j24n7ML64l0p2Jm2R0k65J35K12l24K25l13L03l00M17m78
7704b80J72P8n2K28j72K67j08j30J38l35n0J18P4K69j08k30k7K58k23J47j88J43
7726a1J19O8j06J22j09j98j84K67p8m3o7J33J57j25K27l27j47K71J75j21q2K08
7748A49m3K1j04r2J18L51l81r8J10j7Q7k84K84k97J88k68K78j00P1P8j39J26O6
$$ plain form
7771 104 115 241 -75 -203 -204 -104 -99 9 -90 37 67 251 63 -111 148 -84 171 -190 -66 -61 29 -41 -30 -7
7795 -7 -13 13 142 -78 49 6 64 -265 1 155 138 41 -158 26 59 128 0 53 -119 -127 32 153 -164 19 -21
7820 -21 93 42 -122 121 -58 43 121 -10 -169 -119 -73 33 -64 -108 56 55 181 228 216 -101 -2 262 42 52
7844 52 -207 14 -199 62 -6 -125 -102 247 172 64 70 285 7 -71 -74 111 127 152 40 19 -111 71 -129 -27
7868 -27 149 -174 -133 -119 105 -175 54 26 -130 158 -45 8 -37 -109 118 64 -315 -51 -94 135 67 -65 -9 -172
7892 -172 62 209 78 -21 84 -95 301 -106 -90 40 31 -119 -103 53 -50 96 92 64 -11 -113 -134 -47 -55 160
7916 160 81 -33 -134 -38 220 235 -92 33 276 95 76 118 95 -275 72 -44 -144 15 15 -191 -171 -1 22
7939 22 178 210 15 57 -81 123 26 -172 12 -158 -91 56 304 16 -327 -213 124 -182 -94 4 -127 41
$$ packed form
7771A04J1J26l16j28jJ00NJ08r9J27L0J84j88j74K59k32K55l61J24NR0p0J1K3
7795goK6J29k20J27m3N8l29K66J54j7r7j99J84L3O9j28N3j72qJ59J21l17J83m0
7820b1J14n1j64K43j79J01P8j31j59N0M6J06r7m4J64jJ26M7j2l17R9K64k20J0
7844E2k59K21k13K61o8j19K3L49p5j08OK15k78p8lJ85J6K5j12k1j30J82k00J02
7868b7J76l23M1J4K24k80K29k8j56K88k03N3m5p2K27n4l79K64m3K29o8j32N6j63
7892a72K34J47j31r9J05j79L96m07J6J30rj50J6J56j03J46mk8p5j02k1Q7qK15
7916A60p9j14j01R6K58J5l27J25K43j81j9M2k3l70L47j16j00J59%k06K0J70K3
7939B2J56L2j95M2j38K04r7j98J84j70O7J47K48k88l43J14L37l06Q8R8j31J68
$$ plain form
7961 41 -325 89 43 136 -210 -48 -99 93 127 -228 -186 -69 54 7 -32 -63 -21 19 -108 -19 -95 -163 -267 5 -118
7986 -118 -29 192 69 -26 -208 -99 212 -107 -60 -7 116 -17 -83 115 113 64 -59 -121 -223 -221 63 -104 -120 -182
8010 -182 -46 -76 -271 -116 -77 -248 303 -10 34 152 -219 -4 45 9 1 20 -15 113 -52 -167 -145 160 -47
8033 -47 -94 -82 -8 -17 44 23 38 63 164 -111 -219 -35 13 -161 -112 -2 -13 28 -107 -98 -121 100 -63 72 -172 -92
8059 -92 -94 40 -50 -89 64 -12 -100 -53 344 -185 -57 -97 -87 -36 -60 -66 66 86 12 -164 29 30 -117 -35 -124 45 13
8086 13 161 -125 98 39 -68 49 -18 11 -27 119 11 200 -53 -145 8 -88 -42 -88 0 -50 136 37 -68 -150
8110 -150 53 -50 -5 86 -133 -82 -131 171 -211 -11 52 183 -18 -83 18 265 166 -203 -87 -24 -270 118 98
8133 98 -62 -105 247 -62 -109 132 -157 -16 -35 -197 -97 125 -262 55 91 -73 204 -184 228 45 -29 32
$$ packed form
7961D1l66M14m6R3l46J62n1J92L4l55M2J17J23m7l9l1M2M0j27Q9p6o8j04K72j23
7986a18Q9K21j23r5j82J09L11l19M7N3J23j33o6J98km9j23o2j02KK84j67j6o2
8010a82J36l0j95J55L9j71N51l13M4J18l71K15M9l6qJ9l5J28j65j15K2L05k07
8033d7m7J2P4rO1k1J5K5J01k75j08J84M8j74M9J10j1M1j35Rk3K21j63J35k44Q0
8059i2kJ34r0l9J53p6q8M7L97n29J28m0J0N1k4oJ32K0p4j76J93Jj47Q2q9J69l2
8086A3J48k86K23n9j07J17o7K9l8J46j08J89k53r2J53r6M6m6Q8n0J86r9j05q2
8110a50K03j03M5R1k19N1m9L02l82K00O3J31k01o5J01K47r9l69J16O3k46L88k0
8133I8j60m3L52l09m7K41k89J41j9j62J00K22l87L17L6j64K77l88M12j83p4O1
$$ plain form
8155 32 138 141 114 -273 165 -80 61 154 -77 -66 -87 -149 149 -120 33 120 15 283 -144 -211 -193 -129 233 94
8179 94 -109 -119 -49 -132 -31 269 265 177 -18 199 83 66
$$ packed form
8155C2J06Lk7l87M38k45J41R3k31J1k1o2K98k69J53Q7j05K68m27o7J8O4L62j39
8179I4k03j0P0q3J01L00mq8j95K17j16j7
8191F6
$$ Imaginary data points
##PAGE= N=2
##DATA TABLE= (X++(I..I)), XYDATA
$$ plain form
0 0 0 0 0 0 0 0 0 0 0 0 0 0 0 0 8 -8 8 -8 8 -16 16 -16 24 -24 32 -32 40 -48 51 -58 69 -80 88 -101 112 -128
36 -128 143 -161 178 -199 222 -247 273 -303 335 -369 408 -450 497 -546 601 -664 733 -807 893
55 893 -989 1097 -1223 1367 -1540 1747 -1998 2320 -2740 3315 -4157 5515 -8072 14631 -73327
70 -73327 -112922 -15162 -9915 -25950 -61092 -62542 -47551 -11729 -2415 903 15387 41786 32965
83 32965 16799 24808 49290 41776 15981 4818 25483 48948 46886 6299 -37309 -40299 -3252
96 -3252 17408 -138 -22354 -20240 -12851 -16584 -21339 -11979 7429 21326 15508 3437 9347 34979
110 34979 45858 26343 7684 21058 50036 56770 31788 3469 -380 12665 16285 2712 -12310
123 -12310 -13534 -10289 -22034 -42296 -46032 -29482 -19652 -31764 -47520 -41357 -20004 -9609 -19042
$$ packed form
0@%%%%%%%%%%%%%%Qj6J6j6J6k4L2l2M0m8N6o4P2q8R9j09J27j49J68j89K13k40
36a28K71l04L39l77M21m69N20n76O38p04P77q58R47j043J147j265J397j540J700
55H93j882K086k320K590k907L287l745M318n060O055p472R672j3587K2703q7958
70g3327l9595R7760N247j6035l5142j450J4991L5822R314L318J4484K6399q821
83C2965j6166Q009K4482p514k5795j1163K0665K3465k062m0587m3608k990L7047
96c252K0660j7546k2216K114P389l733m755R360J9408J3897n818j2071N910K5632
110C4979J0879j9515j8659J3374K8978O734k4982k8319l849J3045L620j3573j5022
123a2310j224L245j1745k0262l736J6550R830j2112j5756O163K1353J0395r433
$$ plain form
136 -19042 -30275 -20357 6568 21766 11616 -687 6378 23738 27462 16646 11283 19004 25184
149 25184 16215 -1080 -7156 2261 9100 -3933 -22371 -22589 -6805 -467 -14124 -26682 -18988 -320
163 -320 9115 2432 -5898 2144 19146 24199 15186 11801 22383 32225 25555 12599 9834 18432 22421
178 22421 10397 -6438 -8782 2073 4823 -10209 -25754 -23668 -10830 -6995 -17195 -25963 -20396
191 -20396 -8938 -5543 -12755 -14604 -3773 6450 3488 -4964 -3079 9959 17740 10142 -1809 79
205 79 12807 18055 7003 -5518 -4251 5848 8531 -1347 -10547 -8264 -501 -1634 -10582 -13337 -4857
220 -4857 2262 -2895 -12076 -9926 2799 10754 5169 -4552 -2267 11196 18370 11115 1503 3482 12837
235 12837 14911 7327 281 2769 7146 3778 -6211 -9456 -2211 2149 -4958 -15821 -15674 -5236 1634
$$ packed form
136a9042j1233R918K6925J5198j0150j2303P065J7360L724j0816n363P721O180
149B5184q969j7295o076R417O839j3033j8438k18J5784O338j3657j2558P694J8668
163c20R435o683q330Q042J7002N053r013l385J0582R842o670j2956k765Q598L989
178B2421j2024j6835k344J0855K750j5032j5545K086J2838L835j0200q768N567
191b0396J1458L395p212j849J0831J0223k962q452J885J3038P781p598j1951J888
205G9J2728N248j1052j2521J267J0099K683r878r200K283P763j133q948k755Q480
220d857P119n157r181K150J2725P955n585r721K285J3463P174p255r612J979R355
235A2837K074p584p046K488M377l368r989l245P245M360p107j0863J47J0438O870
$$ plain form
250 1634 -3891 -13267 -11469 -453 6518 1668 -5325 -2043 6646 8785 3400 282 4315 10020 7159
265 7159 -1770 -3626 3759 9363 3091 -7784 -8444 304 5874 444 -8035 -8523 -103 4191 -383
280 -383 -6320 -4171 2725 3733 -2140 -4575 886 6272 3171 -4505 -5691 2257 8560 3881 -5211
295 -5211 -5689 2324 7865 3951 -3334 -3356 3035 5994 1605 -3677 -1347 3794 2926 -3527 -5796 -601
311 -601 4091 1169 -7081 -8513 -1019 5327 1588 -6206 -6822 502 5718 2661 -3135 -2387 3381 5879
327 5879 1667 -1709 759 6239 5006 -2064 -3843 1659 6439 3736 -4173 -6370 -131 5314 1794
342 1794 -5576 -6426 -1014 3131 -133 -5296 -4520 336 1877 -1973 -4860 -1348 4168 3027 -2683 -4165
358 -4165 1644 7531 5875 -487 -2418 3352 8933 6443 45 -1271 3228 5778 1951 -2803 -2904
$$ packed form
250A634n525r376J798J1016O971m850o993L282Q689K139n385l118M033N705k861
265G159q929j856P385N604o272j0875o60Q748N570n430q479m88Q420M294m574
280c83n937K149O896J008n873k435N461N386l101p676j186P948O303m679r092
295e211m78Q013N541l914p285k2O391K959m389n282K330N141q68o453k269N195
311f01M692k922q250j432P494O346l739p794o16P324N216l057n796P48N768K498
327E879m212l376K468N480j233p070j779N502M780k703p909k197O239N445l520
342A794p370q50N412M145l264n163P76M856J541l850k887L512N516j141n710j482
358d165N809N887j656o362j931N770N581k490o398j316M499K550l827m754j01
$$ plain form
373 -2904 759 806 -4291 -7917 -4621 -184 -1592 -7284 -9405 -3731 2399 1214 -4239 -4972 815 6350
389 6350 4995 590 549 4901 7003 3782 82 1408 4369 3574 -1616 -5035 -2594 1695 -299 -6808
405 -6808 -9503 -5147 76 -1259 -5962 -6780 -1858 2694 2468 -863 -6 4721 7015 4751 2594 4992
421 4992 9022 8587 3629 1194 4056 7841 6101 -630 -3724 -689 2766 270 -4761 -6967 -4577
436 -4577 -1837 -3718 -7399 -6736 -2916 -1535 -4240 -5732 -2578 2192 2345 -1329 -2903 1041 6264 5957
452 5957 838 -1173 2063 5621 3777 -862 -2849 -462 665 -1995 -5586 -5576 -2378 -2519 -6023 -8176
468 -8176 -5202 -745 -217 -3603 -4646 -166 5388 6250 3360 2342 6256 10017 9464 6400 5859 7919
484 7919 9002 5757 1945 1969 4086 2691 -1929 -5609 -4426 -1055 -2211 -6705 -9120 -6270 -2363 -1930
$$ packed form
373b904L663M7n097l626L296M437j408n692k121N674O130j185n453p33N787N535
389F350j355m405m1M352K102l221l700J326K961p95n190l419K441M289j994o509
405f808k695M356N223j335m703q18M922M552k26l331Q57M727K294k264k157K398
421D992M030m35m958k435K862L785j740o731l094L035L455k496n031k206K390
436d577K740j881l681O63L820J381k705j492L154M770J53l674j574L944N223l07
452E957n119k011L236L558j844m639j987K387J127k660l591J0L198j41l504k153
468h176K974M457N28l386j043M480N554Q62k890j018L914L761n53l064n41K060
484G919J083l245l812K4K117j395m620l680J183L371j156m494k415K850L907M33
$$ plain form
500 -1930 -4867 -5809 -2499 762 968 -1272 -483 2880 4050 1961 107 1357 4045 4100 89 -3185
516 -3185 -1759 1390 359 -3909 -6583 -4993 -2163 -2567 -5616 -6905 -4451 -1891 -2547 -3994 -2606 816
532 816 2534 1037 301 2535 7069 7984 5184 3082 5510 8790 8636 5207 2643 3817 5606 4188
548 4188 712 -1304 -355 -73 -1913 -4993 -4964 -2493 -2044 -4699 -6515 -4526 -855 643 -1918 -3383
564 -3383 -1105 2784 3810 1419 366 1902 4073 3183 938 69 757 1200 -1106 -4004 -4190 -2179
580 -2179 -2107 -5102 -7217 -5942 -3167 -1924 -4237 -5620 -3660 249 1289 -218 -297 2092 4477 4248
596 4248 3388 3284 5537 6478 4618 2599 2888 5032 5105 2005 -906 -466 1723 1458 -1189 -3731 -2953
613 -2953 -884 -1008 -2774 -3678 -2045 -262 -526 -2023 -1194 770 2307 943 -745 273 2950 3735
$$ packed form
500a930k937r42L310L261K06k240P89L363J170k089j854J250K688N5m011l274
516c185J426L149j031m268k674J590K830m04l049j289K454K560o56j447J388L422
532H16J718j497p36K234M534R15k800k102K428L280j54l429k564J174J789j418
548D188l476k016R49K82j840l080K9K471M49k655j816J989L671J498k561j465
564c383K278L889J026k391j053J536K171q90k245q69O88M43k306k898j86K011
580b179P2k995k115J275K775J243k313j383J960L909J040j507p9K389K385k29
596D248q60j04K253R41j860k019K89K144P3l100k911M40K189k65k647k542P78
613b953K069j24j766r04J633J783k64j497Q29J964J537j364j688J018K677P85
$$ plain form
629 3735 1487 -689 334 2246 2425 -33 -1943 -1713 -357 -935 -3298 -3990 -2798 -2052 -3133 -4436
645 -4436 -3766 -1400 -457 -1626 -2791 -1540 1509 3087 1584 -24 1465 3965 4422 2918 1843 2583
661 2583 3704 3101 1230 394 1242 1839 -165 -2452 -2357 -383 15 -1536 -3417 -2837 -405 518 -786
678 -786 -2294 -1036 1186 1767 711 187 1059 2307 1704 453 346 1609 1873 877 -1265 -1182 612 904
696 904 -543 -2890 -2504 -715 234 -1382 -2523 -1997 -294 -122 -1278 -1497 -278 1016 436 -823 -550
713 -550 1374 2024 1098 -407 141 2096 2410 1358 -695 -228 1128 1550 340 -815 -898 259 338 -1086
731 -1086 -1576 -768 119 -569 -2001 -1945 5 1085 131 -1390 -1182 730 1563 887 -395 -270 1443 1778
749 1778 780 -48 499 1121 742 -707 -935 243 937 -43 -1558 -1398 -120 985 128 -1338 -1192 77
$$ packed form
629C735k248k176J023J912J79k458j910K30J356n78k363o92J192P46j081j303
645d436O70K366R43j169j165J251L049J578j503j608J489K500M57j504j075P40
661B583J121o03j871q36Q48N97k004k287R5J974L98j551j881N80K432R23j304
678g86j508J258K222N81j056n24Q72J248o03j251j07J263K64r96k142Q3J794K92
696I04j447k347L86J789R49j616j141N26J703J72j156k19J219J294n80j259K73
713e50J924O50r26j505N48J955L14j052k053M67J356M22j210j155q3J157P9j424
731a086m90Q08Q87o88j432N6J950J080r54j521K08J912Q33o76j282J25J713L35
749A778r98q28N47O22l79j449k28J178O94r80j515J60J278J105q57j466J46J269
$$ plain form
767 77 1099 357 -1117 -414 830 800 127 -587 244 1167 556 -481 -621 326 1082 263 -1081 -1119 638
786 638 1145 415 -852 -1020 360 1056 237 -812 -527 400 520 -505 -915 -258 207 -88 -1044 -1306 -150
805 -150 671 240 -875 -1119 485 1097 438 -278 -154 1404 1275 773 30 255 803 989 22 -462 45
824 45 882 623 -998 -1347 -258 675 36 -1220 -1425 -302 532 32 -912 -656 151 591 184 -330 369
843 369 792 1030 45 -256 385 1022 1020 -226 -518 334 1221 687 -474 -910 -118 277 -51 -979 -753 -16
863 -16 154 -438 -1177 -581 273 168 -622 -453 164 1299 823 -54 -89 749 1732 1264 -18 -101 272 916 212
884 212 -204 -364 -263 -258 -1014 -1566 -1358 -515 -824 -1490 -1410 -921 57 101 -723 -621 124 877 909 264 356 979
906 979 1465 1211 547 680 1095 696 -55 -512 19 618 94 -1015 -1321 -490 257 141 -824 -1199 -509 355
$$ packed form
767G7J022p42j474P03J244l0o73p14Q31R23o11j037j40R47P56q19j344l8J757
786F38N07p30j267j68J380O96q19j049K85R27J20j025m10O57M65k95r56k62J156
805a50Q21m31j115k44J604O12o59p16J24J558j29n02p43K25N48J86r67m84N07
824D5Q37k59j621l49J089R33o39j256k05J123Q34n00r44K56Q07M40m07n14O99
843C69M23K38r85l01O41O37kj246k92Q52Q87n34j161m36P92L95l28r28K26P37
863a6J70n92p39N96Q54j05p90J69O17J135m76q77l5Q38R83m68j282q3L73O44p04
884B12m16j60J01Np56n52K08Q43l09o66Q0M89R78M4q24J02P45P53L2o45R2O23
906I79M86k54o64J33M15l99p51m57N31N99n24j109l06Q31P47j16r65l75O90Q64
$$ plain form
926 355 158 -268 -18 397 588 502 250 1057 1427 1275 595 10 439 1265 934 -293 -826 -259 212 -116
946 -116 -957 -1457 -678 -455 -777 -1355 -1157 -701 -649 -1050 -1149 -577 442 365 -306 -293 319 1325 1237 463 151
967 151 879 1222 1020 521 -64 504 871 59 -267 -281 -60 15 -947 -1145 -686 86 -80 -562 -882 -3 608
988 608 927 459 48 893 1194 1021 671 485 1108 1136 316 -6 -296 44 32 -494 -966 -880 -296 -848 -1259
1009 -1259 -1534 -957 -631 -520 -1017 -1039 -567 -385 32 -156 -70 539 677 256 242 340 935 804 308 -130 206
1030 206 640 682 5 -521 -245 358 136 -245 -592 -92 26 -199 -429 -91 236 398 69 -65 154 830
1050 830 921 559 289 421 1227 1045 383 229 122 274 -25 -265 -592 -557 -186 -523 -898 -843 -700 -667 -1078
1071 -1078 -1328 -800 -93 -295 -593 -530 -213 432 730 130 -98 97 582 421 555 177 426 360 91 -99
$$ packed form
926C55j97m26K50M15J91q6k52Q07L70j52o80n85M29Q26l31j227n33N67M71l28
946a16q41n00P79K23l22n78J98M56N2m01r9N72J019p7o71J3O12J006q8p74l12
967A51P28L43k02m99n85N68L67q12l26j4K21P5r62j98M59P72j66m82l20Q79O11
988F08L19m68m11Q45L01j73l50j86O23K8q20l22k90L40j2n26m72Q6N84n52m11
1009a259k75N77L26J11m97k2M72J82M17j88Q6O09J38m21j4R8N95j31m96m38L36
1030B06M34M2o77n26K76O03k22l81l47N00J18k25k30L38L27J62l29j34K19O76
1050H30R1l62k70J32Q06j82o62j54j07J52k99k40l27L5L71l37l75N5J43L3m11
1071a078k50N28P07k02k98O3L17O45K98o00k28J95M85j61J34l78K49o6k69j90
$$ plain form
1091 -99 -356 198 153 -334 -525 -373 -282 -68 -175 -488 -571 172 226 316 -148 185 567 764 541 184 833 636
1113 636 475 195 132 384 419 90 -265 -216 93 258 -143 -364 -413 -198 -142 -454 -717 -340 -161 -305 -423 -304
1135 -304 111 263 -171 -243 -241 260 468 451 -138 268 562 518 370 -252 -8 -118 100 -85 -494 -199 37 -211
1157 -211 -456 -416 -232 -169 -253 -177 -172 399 456 118 -82 135 417 613 366 264 187 89 123 -145 186 -77 272
1180 272 -37 -384 -322 5 -11 -213 -495 -584 40 65 11 -533 -432 158 90 -216 -86 133 394 378 -19 -89 264
1203 264 296 -67 -3 -311 115 365 -104 -61 -226 23 281 -42 -420 -253 23 157 -133 -43 -189 96 -1 33
1225 33 40 77 -136 -19 -301 16 -9 214 -55 -308 -26 104 233 109 -8 198 94 152 99 -188 -41 198
1247 198 -37 -283 -111 -102 285 -181 -347 -180 235 192 394 70 106 59 45 -22 -103 -26 198 290 -176 -35 -42 106
$$ packed form
1091i9k57N54m5m87j91J52R1K14j07l13q3P43N4R0m64L33L82J97k23l57O49j97
1113F36j61k80o3K52L5l29l55M9L09J65m01k21m9K15N6l12k63L77J79j44j18J19
1135c04M15J52m34p2KN01K08j7n89M06K94m4j48o22K44j10K18j85m09K95K36k48
1157b11k45M0J84O3q4P6NN71N7l38k00K17K82J96k47j02p7r8L4k68L31k63L49
1180B72l09l47O2L27j6k02k82q9O24K5n4n44J01N90o8l06J30K19K61j6l97p0L53
1203B64L2l63O4l08M26K50m69M3j65K49K58l23l78J67K76J34k90R0j46K85r7L4
1225C3PL7k13J17k82L17k5K23k69k53K82J30J29j24j17K06j04N8n3k87J47K39
1247A98k35k46J72RL87m66j66J67M15m3K02l24L6m7j4o7q1P7K24R2m66J41pJ48
$$ plain form
1271 106 53 -71 -226 228 453 411 -379 33 -174 12 -85 -182 -131 -13 -287 3 -312 -327 183 -71 -165 -94 29
1294 29 68 20 -214 204 -80 58 70 -12 -108 421 335 -73 42 89 133 41 -1 -173 14 244 -188 -355 -145 -49
1318 -49 98 46 -114 -150 55 297 285 -45 -109 321 277 217 38 295 178 311 -20 -210 -9 140 -31 -252
1340 -252 -6 -29 176 -47 -180 -146 -39 11 -158 -381 -282 -100 154 -23 -112 38 124 -106 -202 -27 59 57 68 -61
1364 -61 151 78 77 71 -188 101 55 -123 -99 -200 -40 0 -1 -26 -230 -192 -49 -9 -228 -244 -6 29 192 -245 -18
1389 -18 -8 244 204 -1 -86 155 373 -10 -245 133 -240 31 -23 -150 153 -57 -153 -173 -119 -336 91 29 160
1412 160 -59 170 202 222 -131 10 252 131 -92 -43 31 194 184 188 -1 -68 188 -68 -175 -70 -355 129 9
1435 9 -57 -319 -7 -140 107 -247 32 92 40 171 -92 65 4 -52 334 53 -163 80 44 -324 27 -50 38
$$ packed form
1271A06n3j24j55M54K25m2p90M12k07J86r7r7N1J18k74K90l15j5N10k54r4P1J23
1294B9L9m8k34M18k84J38J2q2r6N29q6m08J15M7M4r2m2j72J87K30m32j67K10R6
1318d9J47n2j60l6K05K42j2l30o4M30m4o0j79K57j17J33l31j90K01J49j71k21
1340b52K46k3K05k23j33L4J07N0j69k23R9J82K54j77q9J50Q6k30r6J75Q6kJ1j29
1364f1K12p3jok59K89m6j78K4j01J60M0jk5k04L8J43M0k19j6K38L5J63m37K27
1389a8J0K52m0k05q5K41K18l83k35L78l73K71n4j27L03k10r6k0N4k17M27o2J31
1412A60k19K29L2K0l53J41K42j21k23M9P4J63j0Mj89o7K56k56j07J05k85M84j20
1435Io6k62L12j33K47l54K79O0n2J31k63J57o1n6L86k81k16K43l6l68L51p7Q8
$$ plain form
1458 38 -82 -10 120 -45 373 -93 -129 -180 -214 -17 51 -364 142 111 192 17 111 169 280 66 456 103 -102
1481 -102 319 230 55 66 232 -66 -54 124 178 21 -31 -165 -80 -84 -36 -160 90 -165 29 66 173 101 -212 14
1505 14 -261 111 -165 -154 48 203 22 -44 -1 -64 -222 -402 -211 -181 -223 -40 -252 -120 -247 55 -275 -92
1527 -92 -63 -140 -6 186 139 -57 -102 80 41 -105 283 114 140 -146 73 259 36 -17 -93 43 24 15 -114 33
1551 33 -185 90 28 -19 -123 238 86 33 -29 18 26 -169 165 50 137 9 68 122 10 -21 -33 90 -120 -201 -54
1576 -54 89 5 -348 -151 -75 -13 -61 -340 -249 -89 -176 18 -93 -274 -4 -18 201 27 11 351 -14 -15 68 -34
1600 -34 -59 -50 220 -93 27 -50 -266 195 -208 -247 -330 -75 70 -236 -57 -99 -163 170 29 -257 119 -268 137
1623 137 -29 9 279 -117 -116 -300 155 332 93 -167 -223 -138 -284 -108 50 -304 -28 151 -149 -186 -149 -50 109
$$ packed form
1458C8j20P2J30j65M18m66l6n1l4J97O8m15N06l1Q1j75R4N8J11k14L90l53k05
1481a02M21q9j75J1J66k98J2J78N4j57n2j34Q5mM8j24K50k55J94L7J07p2l13K26
1505A4k75L72k76J1K02J55j81o6M3o3j58j80J91L0m2J83k12J32j27L02l30J83
1527i2K9p7J34J92m7j96m5J82l9j46L88j69K6k86K19J86k23n3p6J36j9rj29J47
1551C3k18K75o2m7j04L61j52n3o2M7Qj95L34j15Q7j28N9N4j12l1j2J23k10q1J47
1576e4J43q4l53J97P6O2m8k79R1J60q7J94j11j81K70j4K19j74j6L40l65jQ3j02
1600c4k5RK70l13J20p7k16M61m03l9q3K55J45l06J79m2o4L33j41k86L76l87M05
1623A37j66L8K70l96Jj84M55J77k39k60n6Q5j46J76J58l54K76J79l00l7L7R9J59
$$ plain form
1646 109 -177 -134 41 123 -236 59 -32 232 103 -207 116 22 136 -161 193 31 29 73 128 -4 38 -135 -216
1669 -216 -86 -124 -169 35 -170 94 -86 305 -111 -66 88 -41 78 -33 67 73 -200 114 -158 43 30 -401
1691 -401 102 -13 -58 -207 92 -7 205 70 178 72 308 146 28 2 214 -90 -6 -330 171 50 39 -22
1713 -22 -31 100 -277 -70 -47 -193 107 -1 -179 -92 -111 126 -160 16 214 239 -71 202 149 -20 29 -54 219
1736 219 -197 182 -34 197 -25 -179 -93 -177 132 92 -199 -94 -2 179 28 120 -128 -187 -337 29 196 203 166
1759 166 -224 -150 -99 -139 232 -62 -108 -67 19 22 165 85 29 -7 -217 21 231 -297 -332 -15 -70 -112 44 -115 -90
1784 -90 -123 37 -39 -99 -168 24 339 -62 234 -15 187 -37 -303 151 -96 32 35 -161 147 79 -20 -80 20
1807 20 211 -3 107 -136 156 -153 72 152 -130 -85 -137 214 97 -166 58 -89 284 -80 51 55 -32 -175
$$ packed form
1646A09k86M3J75Q2l59K95r1K64j29l10L23r4J14k97L54j62kM4N5j32M2j73q1
1669b16J30l8m5K04k05K64j80L91m16M5J54j29J19j11J00Ok73L14k72K01j3m31
1691d01N03j15m5j49K99r9K12j35J08j06K36j62j18k6K12l04Q4l24N01j21j1o1
1713b2rJ31l77K07K3j46L00j08j78Q7j9K37k86J76J98K5l10K73n3j69M9q3K73
1736B19m16L79k16K31k22j54Q6q4L09m0k91J05R2J81j51R2k48n9j50L66J67Pl7
1759A66l90P4N1m0L71k94m6M1Q6LJ43q0n6l6k10K38K10n28l5L17n5m2J56j59K5
1784i0l3J60p6o0o9J92L15m01K96k49K02k24k66M54k47J28Lj96L08o8r9o0J00
1807B0J91k14J10k43K92l09K25Q0k82M5n2L51j17k63K24j47L73l64J31Mq7j43
$$ plain form
1829 -175 -203 -8 -43 7 24 94 -1 -105 -42 81 -226 153 67 -11 304 -100 -72 55 -223 74 -201 158 9
1852 9 10 -136 -47 -86 77 -340 -149 14 153 413 -34 92 -4 78 6 87 -56 12 294 44 -234 32 -53 -136
1876 -136 15 103 -61 -34 -94 129 147 -152 -134 178 78 145 54 76 22 115 11 80 -142 -113 288 -18 249 218
1900 218 -23 -127 -29 193 -95 54 -92 166 -270 318 144 65 3 -172 124 -24 -7 163 28 -43 -96 126
1922 126 4 223 91 -29 6 -208 -45 113 239 -64 -63 -39 225 -211 -143 -230 160 97 124 105 -28 -157 -3
1945 -3 -175 1 -199 89 0 359 222 -12 26 191 268 -234 7 -41 15 -297 152 91 -42 243 38 52 -215
1968 -215 -104 -146 -314 95 224 208 240 127 -87 151 -27 -163 187 111 -141 15 92 123 304 -146 404 -23
1990 -23 -99 92 -326 215 69 -61 -147 248 183 242 -114 -208 21 52 -3 -116 -126 -181 -105 -339 104 34 -56 107
$$ packed form
1829a75k8J95l5N0J7P0r5j04O3J23l07L79q6p8L15m04K8J27k78K97k75L59j49
1852IJj46Q9l9J63m17J91J63J39K60m47J26r6Q2p2Q1j43O8K82k50k78K66q5q3
1876a36J51Q8j64K7o0K23J8k99J8L12j00O7r1K2n4R3j04O9k22K9M01l06K67l1
1900B18k41j04R8K22k88J49j46K58m36N88j74p9o2j75K96j48J7J70j35p1n3K22
1922A26j22K19j32j20L5k14J63J58J26l03JK4K64m36O8q7L90o3K7j9j33j29J54
1945cj72J76k00K88q9L59j37k34L8J65P7n02K41m8N6l12M49o1j33K85k05J4k67
1968b15J11m2j68M09J29j6L2j13k14K38j78j36L50p6k52J56P7L1J81m50N50m27
1990b3p6J91m18N41j46j30q6L95o5N9l56r4K29L1n5j13j0n5P6k34M43p0r0J63
$$ plain form
2014 107 -6 -199 79 -83 -42 178 -280 0 13 -72 -147 -410 73 -22 -95 25 56 -32 3 -174 120 -280 -129
2037 -129 -129 -245 60 94 -29 -70 -126 -135 -164 209 10 -97 -42 -133 -75 32 119 25 138 -369 -40 -98 -192 -55 -144
2062 -144 -403 -233 32 160 -85 -74 -124 60 -129 105 -96 76 16 -72 -2 87 121 -250 -396 -1 -90 -58 -96
2085 -96 -27 -129 -183 105 170 -154 -37 -237 88 171 -12 -55 190 91 -18 -102 30 69 102 -17 -171 -82 -67 211
2109 211 -8 72 -93 -78 114 -14 118 100 33 -159 -130 256 -108 -299 85 46 -59 138 231 2 -1 -40 -86 43
2133 43 327 -233 -171 124 52 170 165 -18 -247 -16 -25 0 -219 -34 167 -38 -80 20 -80 185 46 223 184
2156 184 50 -18 54 60 6 332 -42 231 -29 331 -64 -70 -125 25 20 -43 -82 14 179 -213 -166 204 195 -186 -128 72
2182 72 -102 117 -8 -110 90 -14 68 15 -5 244 1 92 -83 171 -211 70 69 88 -40 15 -27 -93 147 -167
$$ packed form
2014A07j13j93K78j62M1K20m58K80J3q5p5k63M83r5p3J20L1q8L5j77K94m00J51
2037a29%j16L05L4j23m1n6rk9L73j99j07N5r1N8J07Q7r4J13n07L29n8r4J37q9
2062a44k59J70K65J28k45J1n0J84j89K34k01J72o0q8P0Q9L4l71j46L95q9L2l8
2085i6O9j02n4K88O5l24J17k00L25Q3j83m3K45r9j09q4J32L9L3j19j54Q9J5K78
2109B11k19Q0j65J5J92j28J32j8o7j92K9L86l64j91L84l9j05J97R3k29ll9m6J29
2133D3K84n60O2K95p2J18nj83k29K31rK5k19J85K01k05m2J00j00K65j39J77l9
2156A84j34o8P2On4L26l74K73k60L60l95on5J50no3l9R6J65l92M7L70rl81N8K00
2182G2j74K19j25j02K00j04Q2n3k0K49k43R1j75K54l82K81jJ9j28N5m2o6K40l14
$$ plain form
2206 -167 -225 146 108 77 -211 58 209 0 -110 165 201 113 57 -155 -185 -70 -200 -41 -101 107 -65 61 -64
2229 -64 -86 -85 86 -20 -8 -83 116 163 -80 104 43 219 -57 -132 125 -40 27 213 146 -88 134 1 -145 220
2253 220 54 -33 -178 -34 -133 12 5 124 51 -12 -83 -202 38 -235 -188 49 41 -149 171 -187 63 -64 -133 -118
2277 -118 -64 291 82 -26 261 220 32 210 -353 -11 -183 -25 -211 -40 204 -89 -483 -199 -75 205 -143
2298 -143 30 -47 -281 -47 271 -87 -37 71 -99 54 38 233 -103 -129 17 163 145 -61 239 -82 -96 -101 -178
2321 -178 74 -53 -176 -207 210 63 -62 -41 -153 71 305 -3 165 -68 159 204 29 -186 -46 183 -30
2342 -30 14 -59 -288 -20 -107 344 -192 -191 93 -104 34 -103 -10 4 -11 44 21 -108 48 -69 168 -177 226 107
2366 107 -44 154 -137 -163 -159 15 46 -7 -100 9 203 -75 -55 113 203 -24 120 -148 -122 -94 -72 -116 9 111
$$ packed form
2206a67n8L71l8l1k88K69J51k09j10K75L6q8n6k12l0J15j30J59o0K08j72J26j25
2229f4k2JJ71j06J2p5J99M7k43J84o1J76k76p5K57j65O7J86o7k34K22j33j46L65
2253B20j66q7j45J44r9J45pJ19p3o3p1j19K40k73M7K37qj90L20l58K50j27o9J5
2277a18N4L55k09j08K87m1j88J78n63L42j72J58j86J71K44k93l94K84J24K80l48
2298a43J73p7k34K34L18l58N0J08j70J53j6J95l36k6J46J46j8k06L00l21j4np7
2321a78K52j27j23l1M17j47j25K1j12K24K34l08J68k33K27M5j75k15J40K29k13
2342c0M4p3k29K68q7M51n36JK84j97J38j37R3J4j5N5k3j29J56j17K37l45M03j19
2366A07j51J98k91k6MJ74L1n3r3J09J94k78K0J68R0k27J44k68K6K8K2m4J25J02
$$ plain form
2390 111 -95 -70 80 -163 -103 169 -213 4 -163 -70 -128 225 -21 -219 21 86 111 15 -265 166 150 -161 -152
2413 -152 -34 -44 77 -279 174 171 -178 -39 50 -39 -155 64 90 245 76 35 24 -243 -210 -105 121 219 -184
2436 -184 -325 -12 -220 331 89 -104 164 267 5 37 -86 131 185 159 -118 22 44 227 -68 178 127 -103
2458 -103 24 -230 2 -14 -127 -124 -192 -316 -204 180 235 85 165 -185 212 179 72 403 27 -6 -38 -214 126
2481 126 -31 -75 105 -42 -62 199 -184 120 123 386 111 44 -123 -77 -248 -36 91 54 18 50 52 -8 -138 45
2505 45 -56 -121 139 -32 -143 -86 -85 -232 160 31 152 98 -70 239 -122 -132 -21 -73 222 192 -53 208 137
2528 137 -103 -115 179 -4 70 -158 74 -37 -237 13 -10 -266 194 111 148 -94 -41 33 208 -25 -226 -78
2550 -78 -144 -77 -220 -177 304 -4 -70 169 200 -125 57 -249 -236 -9 52 121 -149 -81 196 83 -41 -170 -4
$$ packed form
2390A11k06K5J50k43O0K72l82K17j67R3n8L53k46j98K40O5K5r6k80M31j6l11R
2413a52J18j0J21l56M53ll49J39Q9q9j16K19K6J55j69m1j1k67L3J05K26R8m03
2436a84j41L13k08N51k42j93K68J03k62L2j23K17N4k6k77J40K2J83k95K46n1k30
2458a03J27k54K32j6j13Lo8j24J12L84N5j50Q0l50L97l3j07L31l76l3l2j76L40
2481A26j57m4J80j47k0K61l83L04LK63k75o7j67M6j71K12J27l7l6L2Ko0j30J83
2505D5j01o5K60j71j11N7Jj47L92j29J21n4j68L09l61j0J11n2K95l0k45K61p1
2528A37k40j2K94j83P4k28K32j11k00K50k3k56M60q3L7k42N3P4J75k33k01J48
2550g8o6O7j43M3M81l08o6K39L1l25J82l06J3K27O1O9k70O8K77j13j24j29J66
$$ plain form
2573 -4 -10 -114 169 -141 -202 -70 -90 0 -9 -183 245 -16 181 -246 -117 146 81 -29 -11 -45 184 -56 86 -54
2597 -54 -23 7 -21 -127 33 -60 176 -95 -36 35 -152 -96 -112 -161 -150 -78 -50 9 -14 -13 54 30 106 84 -283 102 -21
2624 -21 22 54 -102 -105 268 -36 58 -111 -7 151 -263 -216 72 -86 -142 -436 117 10 88 248 85 -6 -48 209
2648 209 -163 -158 -179 -17 -67 -213 73 47 -110 35 -67 -107 -137 -46 252 125 241 -146 -79 -5 -9 129 179 206 -71
2673 -71 -37 125 -201 -363 -17 -39 174 -228 -30 -246 99 -42 -118 -163 328 49 67 -72 90 27 41 7 -187
2696 -187 -27 -110 -45 -261 231 115 58 26 -49 46 145 129 -214 110 176 228 23 113 -74 69 -83 68 28 109
2720 109 69 -213 124 118 70 0 2 156 -144 -217 -56 59 197 114 -163 -134 67 -73 220 -85 -12 -34 -52 226
2744 226 32 262 28 8 66 -296 109 22 -31 -15 30 32 181 94 -63 83 -33 104 20 -78 188 -281 46 187
$$ packed form
2573doj04K83l10o1J32k0R0rj74M28k61J97m27J29K63o5j10J8l4K29k40J42j40
2597e4L1L0k8j06J60r3K36k71N9P1j87N6j6m9J1P2K8N9k3JO7k4P6k2l67L85j23
2624b1M3L2j56lL73l04R4j69J04J58m14M7K88j58n6k94N53j07P8J60j63r1m2K57
2648B09l72Nk1J62n0j46K86k6j57J45j02m0l0R1K98j27J16l87O7P4mJ38N0K7k77
2673g1L4J62l26j62L46k2K13m02J98k16L45j41p6m5M91k79J8j39J62o3J4l4j94
2696a87J60q3O5k16M92j16n7l2p5R5R9j6l43L24O6N2k05R0j87J43j52J51m0Q1
2720A09m0k82L37om8p0KJ54l00p3J61J15J38q3k77K9K01j40K93l05P3k2j8K78
2744B26j94K30k34k0N8l62M05q7n3J6M5KJ49q7j57J46j16J37q4r8K66m69L27J41
$$ plain form
2768 187 95 31 143 168 70 36 -109 -107 -307 23 108 -4 -108 -61 -77 -103 44 46 -168 -231 35 3 250 -206 -165
2793 -165 -11 133 -141 68 71 18 122 321 -175 -157 198 82 174 78 -5 132 118 -74 374 -66 -9 -128 -132 -170
2817 -170 15 127 159 -181 -119 -61 80 -116 47 -18 -273 -41 -203 -51 58 -252 131 -5 -78 -151 -70 -1 -219
2840 -219 35 65 -205 -54 160 25 -58 -154 -123 43 73 -92 -220 -40 -8 126 73 -51 -87 -123 320 109 -278
2863 -278 139 10 44 127 -66 -176 90 -21 -59 -169 -88 -12 -198 57 -135 -294 89 189 64 -32 -68 51
2885 51 96 -195 42 56 10 -40 -54 -85 -135 191 208 57 7 15 144 125 168 165 -46 163 100 89 50 172 81 -77 138
2912 138 69 34 28 125 -60 -101 232 6 164 154 -33 -135 20 218 153 41 48 170 230 -9 -172 -206 -170 -112 40
2937 40 -186 33 -280 -142 72 18 24 259 25 15 -18 -65 53 -156 -39 -3 -2 -89 -97 113 -56 -21 197 394 39
$$ packed form
2768A87r2o4J12K5r8l4j45Kk00L30Q5j12j04M7j6k6J47Kk14o3K66l2K47m56M1
2793a65J54J44k74K09Ln3J04J99m96J8L55j16R2r6q3J37j4j92M48m40N7j19ml8
2817a70J85J12L2l40O2N8J41j96J63o5k55K32j62J52J09l10L83j36p3p3Q1O9k18
2840b19K54L0k70J51K14j35q3r6L1J66L0j65j28J80L2J34n3j24l6l6M43k11l87
2863b78M17j29L4Q3j93j10K66j11l8j10Q1P6j86K55j92j59L83J00j25r6l6J19
2885E1M5k91K37J4m6n0j4l1n0L26J7j51n0QJ29j9M3lk11K09o3j1l9J22r1j58K15
2912A38o9l5oR7j85m1L33k26J58j0j87j02J55J98o5j12PJ22O0k39j63l4L6N8J52
2937D0k26K19l13J38K14n4OK35k34j0l3m7J18k09J17L6Jq7qK10j69L5K18J97l55
$$ plain form
2962 39 10 86 32 82 71 -91 -27 -53 198 99 145 -172 129 58 69 -180 154 -10 -145 -41 -116 -64 -86 232 83
2987 83 -211 -48 -187 -72 135 70 -89 81 -1 -97 23 184 240 27 -38 147 51 207 -17 56 131 -159 -100
3010 -100 18 -295 -111 82 29 102 55 162 -190 83 108 -129 5 -259 -291 159 39 -370 -163 149 299 118
3032 118 -32 77 182 -104 -108 73 117 201 103 -66 -48 68 -209 -231 -208 38 15 135 -140 -148 81 -6 78 46 -2
3057 -2 266 162 -171 233 31 -17 3 -54 149 -55 52 -45 91 -84 -204 281 -59 -162 42 -135 132 94
3079 94 104 -26 -2 64 -71 311 -220 -123 130 -78 48 81 -220 -92 -119 156 91 -160 232 70 -44 198 -104
3102 -104 290 -24 -128 -183 20 1 -63 258 72 -78 165 -192 -84 -163 -247 8 -125 209 91 100 -126 -171 52
3125 52 46 137 -245 206 -11 11 -12 51 -276 -157 -101 203 101 -20 -146 -177 -52 -141 126 -49 208 1 56 149
$$ packed form
2962C9k9P6n4N0j1j62O4k6K51r9M6l17L01p1J1k49L34j64j35J04p5N2k2L18j49
2987H3k94J63j39J15K07o5j59J70q2r6J20J61N6k13o5J85r6J56k24P3P5k90N9
3010a00J18l13J84J93n3P3m7J07l52K73K5k37J34k64l2M50j20m09K07L12J50j81
3032A18j50J09J05k86mJ81M4Q4r8j69J8J16k77k2K3K46k3J20k75qK29q7Q4l2m8
3057bK68j04l33M04k02m8K0n7K03k04J07r7J36j75j20M85l40j03K04j77K67l8
3079I4J0j30K4O6j35L82n31R7K53k08J26L3l01J28k7K75o5k51L92j62j14K42l02
3102a04L94l14j04n5K03j9o4L21j86j50K43l57J08p9q4K55j33L34j18Rk26m5K23
3125E2oR1l82M51k17K2k3O3l27J19N6L04j02j21j26l1J25q9K67j75K57k07N5R3
$$ plain form
3149 149 -43 117 204 292 -79 -114 62 87 90 62 -104 -53 -101 -84 333 167 199 -33 40 291 -65 137 157 85 89
3174 89 26 -166 67 156 -33 -98 -127 42 40 111 -133 37 44 141 143 -1 55 -33 -93 -48 28 -220 -61 102 -32 -62
3200 -62 11 -27 -223 -156 20 123 97 13 -195 5 -206 -55 -79 -100 -37 125 54 -64 229 -250 -130 86 -118
3223 -118 -10 54 -166 -75 12 174 32 -343 -229 -97 -68 -137 184 -10 70 -156 -56 -116 -179 -30 95 152 67
3246 67 87 -160 -32 -15 41 -161 -95 1 108 -276 95 -62 -93 -92 -108 -5 253 -150 -73 -222 268 3 -41 -35 114
3271 114 -51 -62 -110 91 154 45 9 -85 80 -34 -36 -208 97 36 -48 -81 152 -257 -123 26 -140 -399 1
3294 1 132 44 -128 23 -243 44 -204 123 -276 141 188 -337 78 102 -86 125 -28 -5 -166 132 47 -60
3316 -60 94 94 228 37 25 -31 56 -212 -346 155 -142 -70 46 105 146 -16 26 -11 -51 181 -338 -66 -54 126
$$ packed form
3149A49j92J60Q7Q8l71l5J76K5Lk8j66N1m8J7M17j66L2k32P3K51l56K02K0p2M
3174H9o3j92K33Q9j89o5k9J69kP1k44J70PR7Kj44N6q8o0M5P6k48J59J63j34l0
3200f2P3l8j96O7J76J03k6q4k08K00k11J51k4k1O3J62p1j18K93m79J20K16k04
3223a18J08O4k20R1Q7J62j42l75J14J32K9o9L21j94Q0k26J00o0o3J49J25N7q5
3246F7K0k47J28J7N6k02O6R6J07l84L71j57l1Jj6J03K58m03P7j49M90k65m4OJ49
3271A14j65j1m8K01O3j09l6r4J65j14kj72L05o1q4l3K33m09J34J49j66k59M00
3294AJ31q8j72J51k66K87k48L27l99M17M7n25M15K4j88K11j53K3j61K98q5j07
3316f0J54%J34j91j2n6Q7k68j34N01k97P2J16N9M1j62M2l7m0K32n19K72J2J80
$$ plain form
3340 126 40 -18 -53 -68 -62 169 57 96 142 32 30 -88 192 -40 -81 83 218 215 -50 -211 110 2 -67 -187 69
3365 69 301 159 116 255 81 77 -183 -3 89 -227 -105 136 -32 -154 9 119 -186 -166 -131 -210 108 94 320
3388 320 211 -16 190 91 191 37 226 -84 -35 -356 184 -109 8 -12 88 -113 -198 21 -11 -105 35 -156
3410 -156 -19 207 20 226 -146 50 210 70 70 -16 99 -203 -286 -5 150 16 22 -149 -151 48 56 148 -183 -43
3434 -43 224 -50 115 -160 106 32 -107 185 -78 -58 157 178 17 154 21 -117 -4 56 22 391 -139 214
3456 214 -46 228 61 85 -23 -73 1 199 -39 -67 270 15 102 -258 46 -267 142 -156 -5 -76 152 293
3478 293 -54 212 10 -164 -342 -20 -108 5 -205 9 -81 -284 7 -83 61 -40 28 -161 -130 -162 125 -217
3500 -217 -255 226 -435 111 61 -179 149 32 -10 55 -256 -198 118 -126 -207 20 180 -57 -10 25 180 91 123
$$ packed form
3340A26q6n8l5j5OK31j12L9M6j10kj18K80k32m1J64J35lk65j61L21j08o9j20K56
3365F9K32j42m3J39j74mk60J80R2l16J22K41j68j22J63J10l05K0L5p9L18j4K26
3388C20j09k27K06r9J00j54J89l10M9l21N40k93J17k0J00k01q5K19l2r4J40j91
3410a56J37K26j87K06l72J96J60j40%q6J15l02q3K81J55j34Oj71kJ99QR2l31J40
3434d3K67k74J65k75K66p4j39K92k63K0K15K1j61J37j33j38J13O0l4L69n30L53
3456B14k60K74j67K4j08n0P4J98k38k8L37k55Q7l60L04l13M09k98J51p1K28J41
3478B93l47K66k02j74j78L22q8J13k10K14r0k03K91r0J44j01O8j89L1l2K87l42
3500b17l8M81o61N46n0k40L28j17m2O5l11N8L16k44q1K27J60k37M7L5J55q9L2
$$ plain form
3523 123 123 66 222 -93 25 -50 166 -108 -132 52 -168 -65 -132 -18 27 -190 -77 148 112 168 -418 -172 -55
3546 -55 -174 -70 -121 -193 -16 137 46 -131 -236 38 -58 136 -46 -342 1 -93 -11 141 -9 -39 29 -232 94
3569 94 -362 26 150 144 -105 19 -150 -142 -43 -60 75 33 188 -234 101 -173 25 16 -242 29 -150 74 -124
3592 -124 133 66 -51 -15 124 -45 -49 -85 -163 41 -157 -238 -223 173 -5 147 14 102 37 -69 120 -98 156
3615 156 -16 -79 -113 126 135 -158 54 29 12 -90 72 64 164 -94 -75 8 -37 120 110 -95 -287 47 83 -83
3639 -83 -135 18 92 72 66 13 81 86 -106 -109 -134 2 48 2 1 31 -263 -18 -228 -127 157 -98 264 12 172 180 17
3666 17 134 68 88 247 -19 85 68 -42 70 65 205 151 61 31 59 -194 89 30 -163 -134 -8 -144 -47 39 63
3691 63 207 -132 -119 1 20 -198 -228 -109 11 -127 -249 22 -166 51 106 -158 -62 166 -58 -6 -87 59 84
$$ packed form
3523A23%n7J56l15J18p5K16k74k4J84k20J03o7J14M5k17J13K25l6N6n86K46J17
3546e5j19J04n1p2J77J53r1j77j05K74r6J94j82k96L43r4Q2J52j50l0O8k61L26
3569I4m56L88J24ok49J24j69QR9j7J35m2J55m22L35k74J98rk58K71j79K24j98
3592a24K57o7j17L6J39j69ml6p8K04j98q1J5L96j78J52j33Q8o5j06J89k18K54
3615A56j72o3l4K39Rk93K12k5j7j02J62qJ00k58J9Q3m5J57j0k05j92L34L6j66
3639h3n2J53P4k0on3O8Nj92lk5J36M6m6jL0k94K45k10J01K84k55L62k52J60Qj63
3666A7J17o6K0J59k66J04j7j10J12nJ40n4r0l0K8k53K83n9j93K9J26j36R7Q6K4
3691F3J44l39J3J20J9k18l0J19J20j38j22K71j88K17N5k64R6K28k24N2q1J46K5
$$ plain form
3714 84 -113 -10 76 93 27 -92 51 7 -138 -228 281 258 7 -161 85 -153 -22 183 82 64 -99 6 46
3737 46 -271 -68 -147 -46 28 110 71 -280 166 12 59 -39 -32 -150 -106 74 270 -98 -225 288 -287 3 136
3760 136 171 26 -92 6 -157 -186 -84 -77 215 -19 -42 -181 -8 187 103 132 -50 -43 -15 -73 421 -8 -242 203
3784 203 13 -341 -115 212 13 -165 -213 -66 177 -123 171 131 139 130 29 121 -116 -4 257 -51 57 -34 78
3807 78 76 43 66 -327 -97 -66 29 -47 -155 164 -61 -82 -53 -81 17 1 -14 107 246 121 -204 -6 -161 -33 18
3832 18 2 -141 -44 -32 34 -18 -32 -21 -150 -198 -129 -206 13 70 -34 120 -230 -9 164 80 -78 144 151 -177 177
3857 177 -60 165 -28 24 -70 -206 -144 8 114 -91 130 -136 -179 -3 -77 -1 60 5 312 28 170 -62 -301
3880 -301 -9 173 -59 -54 -97 95 15 36 23 -81 53 -128 127 -55 -10 -418 -179 -126 49 -28 -78 65 -128
$$ packed form
3714H4j97J03Q6J7o6j19J43m4j45r0N09k3k51j68K46k38J31K05j01j8j63J05M0
3737D6l17K03p9J01P4Q2l9l51M46j54M7r8Pj18M4J80J96l68j27N13n75K90J33
3760A36L5j45j18R8j63k9J02PK92k34k3j39J73J95q4K9j82PK8n8M94m29k34M45
3784B03j90l54K26L27j99j78m8J47K43l00K94m0Qrj01R2k37J12K61l08J08r1J12
3807G8kl3K3l93K30L1R5p6j08L19k25k1K9k8R8j6j5J21J39j25l25J98j55J28N1
3832A8j6j43R7J2O6n2j4J1j29m8O9p7K19N7j04J54l50K21J73q4j58K22Pl28L54
3857A77k37K25j93N2r4j36O2J52J06k05K21k66m3J76p4P6O1n5L07k84J42k32k39
3880c01K92J82k32Nm3J92q0K1j3j04J34j81K55j82M5m08K39N3J75p7n0J43j93
$$ plain form
3903 -128 -269 -62 31 418 115 35 -245 -102 127 -28 -197 -160 287 276 130 179 176 70 146 -241 -171 93 99 113
3927 113 161 186 -154 -225 42 -10 -12 -3 -89 34 -150 -38 -214 -150 62 101 51 94 121 176 74 112 -103 -201 135 244
3953 244 71 -217 24 102 194 -353 208 -36 187 18 136 -155 9 188 344 -5 -177 133 34 -88 165
3974 165 -177 138 189 105 146 187 -160 77 66 -145 -48 33 164 -91 -63 89 62 62 7 -27 -52 -131 229 30 164
3999 164 -175 -118 -150 48 48 3 165 -205 -116 -359 42 -25 139 -127 143 73 -72 -194 77 15 -127 29 54
4022 54 84 55 -141 -358 282 -3 67 -167 -164 107 31 -38 -49 -116 2 -72 79 -74 -23 -83 159 -423 -141 210
4046 210 -121 -39 107 0 18 349 -157 -105 -172 62 34 -16 -122 102 99 -165 102 220 161 201 67 -107 464
4069 464 24 -162 -125 144 155 41 -158 -241 -129 -200 107 6 -34 -31 -46 30 17 -46 26 -131 -40 -177 -206 117 -43
$$ packed form
3903a28j41K07R3L87l03q0k80J43K29j55j69L7M47j1j46M9lj06P6l87P0K64OJ4
3927A13M8K5l40p1K67n2kRq6J23j84J12j76O4K12L9n0M3K7N5j02L8k15r8L36J09
3953B44j73k88K41P8R2n47N61k44K23j69J18k91J64J79J56l49j72L10r9j22K53
3974A65l42L15N1q4M1M1l47K37j1k11R7Q1J31k55K8J52k7%n5l4k5p9L60j99J34
3999A64l39N7l2J98%m5J62l70Q9k43M01o7J64k66K70p0j45j22K71o2j42J56K5
4022E4L0k9j96k17O40k85P0k34LK71p6o9j1o7J18p4J51j53N1o0K42n82K82L51
4046B10l31Q2J46j07J8L31n06N2o7K34k8n0j06K24lk64K67J18n9M0j34j74N71
4069D64m40j86L7K69J1j14j99q3J12p1L07j01m0Lj5P6j3o3P2j57R1j37k9L23j60
$$ plain form
4094 -43 -99 -91 80 229 -33 -40 266 -60 115 -16 4 -142 -34 -150 -112 -16 -114 -292 -69 114 121 263 18 -8
4118 -8 9 193 119 51 -134 119 -4 198 -67 9 -92 -49 -207 -26 -56 -166 -134 -97 -149 -7 -175 -190 -42 219
4142 219 -237 -181 22 -127 -104 30 -233 -33 -40 47 -75 196 35 32 23 37 -48 100 77 -283 -131 -100 -88 80 14
4167 14 90 268 -26 -69 -45 -30 147 105 110 -27 240 -159 -271 36 128 217 202 78 -219 -338 -4 -51 36 39 -34
4192 -34 -116 151 213 115 -198 -371 -218 105 77 300 -301 106 76 -10 60 41 -211 -158 -224 -127 38 67 11 82 411
4217 411 92 -204 43 -188 155 -138 -107 115 -266 -51 75 333 -26 -43 204 -155 -23 182 -36 -5 -142
4238 -142 132 -145 297 -51 47 169 56 69 461 16 -199 -17 104 243 123 123 -27 41 7 322 49 -118
4260 -118 -50 8 -259 76 -215 -18 155 -261 -147 -82 305 -139 116 -99 -88 46 -22 33 -161 38 231 27
$$ packed form
4094d3n6QJ71J49k62pL06l26J75j31K0j46J08j16L8R6r8j78K23J83PJ42k45k6
4118hJ7J84p4o8j85K53j23K02k65P6j01M3j58J81l0j10L2L7n2J42j68j5J48K61
4142B19m56N6K03j49K3J34k63K00pQ7j22K71j61lrJ4q5J48k3l60J52L1J2J68o6
4167A4P6J78k94m3K4J5J77m2Nj37K67l99j12L07R2Q9j5j24k97j19L34m7Q7Lp3
4192c4q2K67O2r8l13j73J53L23k8K23o01M07l0q6P0j9k52N3o6R7J65K9n6P1L29
4217D11l19k96K47k31L43k93L1K22l81K15J26K58l59j7K47l59J32K05k18L1j37
4238a42K74k77M42l48R8J22j13J3L92m45k15J82J21J39j20%j50O8l4L15k73j67
4260a18O8N8k67L35k91J97J73m16J14O5L87m44K55k15J1J34o8N5j94J99J93k04
$$ plain form
4282 27 -90 -52 -50 -27 35 67 308 21 73 65 -187 143 -153 -98 -36 278 -115 -43 300 332 -126 8 -113 -72 267
4307 267 -51 -78 -62 -141 -117 21 -155 -89 18 226 82 -68 19 -90 235 61 -201 169 18 -130 -126 -21 -317
4330 -317 18 60 -156 -89 285 94 -303 119 -75 154 90 48 -145 128 66 17 -210 19 64 56 223 -99 -156
4353 -156 33 -55 -156 -267 -148 162 72 27 -52 313 155 -38 20 -175 201 326 -14 13 -176 167 79 -66
4375 -66 70 63 -58 121 -81 19 -163 -24 136 79 129 -108 173 -230 97 -193 -215 -60 37 -45 -55 44 -109
4398 -109 57 8 -216 -127 48 -47 -27 180 157 -131 101 -56 -26 -118 9 -88 -11 111 -50 -13 104 -55 22 -69
4422 -69 -192 53 -248 83 57 -126 44 163 -123 69 -95 -53 71 4 259 -50 -251 57 -83 -98 294 116
4444 116 -199 50 -113 -173 130 127 123 119 -180 -30 110 65 96 -34 -307 -149 -49 -230 330 -146 21 138 -187
$$ packed form
4282B7j17L8KK3O2L2K41k87N2qk52L30k96N5O2L14l93P2L43L2m58J34j21M1L39
4307B67l18k7J6p9K4J38j76O6J07K08j44j50Q7j09L25j74k62L70j51j48MJ05k96
4330c17L35M2k16O7L74j91l97M22j94K29o4m2j93K73o2m9k27K29M5qJ67l22n7
4353a56J89q8j01j11J19L10r0m5p9L65j58j93N8j95L76J25l40K7j89L43q8j45
4375f6J36pj21J79k02J00j82J39J60n7N0k37K81m03L27k90k2J55R7q2j0R9j53
4398a09J66m9k24Q9J75r5K0K07k3k88K32j57L0r2J27r7P7J22j61L7J17j59P7r1
4422f9j23K45l01L31k6j83J70J19k86J92j64M2J24o7K55l09k01L08j40j5L92j78
4444A16l15K49j63o0L03lmmk99J50J40m5L1j30k73J58J00j81N60m76J67J17l25
$$ plain form
4467 -187 17 119 9 -88 -8 -170 170 -228 -13 188 57 61 55 16 -66 -22 -32 205 40 -105 -110 108 237 25
4491 25 -188 -108 0 -27 168 126 56 131 125 -365 -155 -114 52 -195 -16 -24 182 -97 -67 162 100 36 -71 -129 -16
4516 -16 125 225 180 42 69 -101 -120 244 21 7 -45 53 -106 -114 29 -90 -46 106 -50 221 -61 -72 114 225
4540 225 -22 -94 -187 -5 -110 -154 -39 9 -11 63 174 -224 191 109 91 -74 136 68 -85 -114 -198 23 -138 69
4564 69 -109 55 -135 -26 -256 24 52 -104 -31 -43 -31 -162 292 -50 -24 -93 -134 -10 206 -79 -42 -127 -207 136
4588 136 125 -8 -3 -201 119 -59 -28 -109 111 209 208 39 -200 -60 -112 102 13 155 -24 205 35 147 -35
4611 -35 -19 62 13 85 -5 -271 280 88 169 4 -270 -77 50 -173 -41 -9 9 109 -65 15 -153 -268 325
4634 325 98 208 -50 6 -12 -104 39 -101 65 143 18 127 73 -96 209 -22 65 -46 -11 55 -245 127 87
$$ packed form
4467a87K04J02j10r7Q0j62L40l98K15K01j31Mol9q2M4j0K37j65j45nK18J29k12
4491B5k13Q0J08k7J95m2p0P5om90K10M1J66k47J79qK06k79L0K29o2o4j07n8J13
4516a6J41J00m5j38K7j70j9L64k23j4n2R8j59qJ43j19M4J52j56K71k82j1J86J11
4540B25k47p2r3J82j05m4J15M8k0P4J11l98M15q2j8j65K10o8j53k9q4K21j61K07
4564F9j78J64j90J09k30K80K8j56P3j2J2j31M54l42K6o9m1J24K16k85L7q5q0L43
4588A36j1j33Nj98L20j78L1q1K20R8jj69k39J40n2K14q9J42j79K29j70J12j82
4611c5J6Q1m9P2r0k66N51j92Q1j65k74J93J27k23J32L2J8J00j74Q0j68j15N93
4634C25k27J10k58N6j8r2J43j40J66P8j25J09n4j69L05k31Q7j11L5O6l00L72m0
$$ plain form
4657 87 64 128 120 31 128 -19 -94 110 -79 200 33 186 213 121 -12 54 -75 181 68 50 -187 173 44 -30
4681 -30 -131 -49 223 50 -18 -54 -16 20 76 96 -29 -187 -95 -96 25 -303 -34 25 258 -54 249 131 -43 -120
4705 -120 -122 -76 -113 -18 -23 -111 -34 212 -42 -312 -209 98 -52 3 152 -76 77 -132 34 -29 -37 8 142 59 60 65
4731 65 -208 76 51 -129 -280 -369 -153 -63 33 96 -515 35 222 88 24 -51 64 -115 -140 16 77 -72 206
4754 206 -186 158 157 -9 32 150 -206 57 351 107 98 -59 -1 -73 -10 30 101 -259 -104 -142 -127 -123 -424 108 11
4779 11 63 197 292 -6 -4 74 195 -41 74 -130 -135 83 -247 -74 -32 -168 -24 110 -148 166 16 -81 311
4802 311 124 52 -35 178 112 188 -89 200 81 11 156 102 111 1 -21 -92 448 -118 -58 49 -156 2 -20 -24 24
4827 24 -63 -74 -12 40 -91 92 95 193 41 -59 177 19 3 -231 -56 207 -92 -49 313 154 39 -29 20 106
$$ packed form
4657H7k3O4qq9R7j47p5K04j89K79j67J53K7r2j33O6j29K56j13j8k37L60j29p4
4681c0j01Q2K72j73o8l6L8L6N6K0j25j58R2jJ21l28K69N9K33l12L03j18j74p7
4705a20kM6l7R5nq8P7K46k54k70J03L07j50N5J49k28J53k09J66o3qM5J34q3JN
4731F5k73K84k5j80j51q9K16R0R6O3o11N50J87j34o4p5J15j79k5J56O1j49K78
4754B06l92L44jj66M1J18l56K63K94k44rj57N8p2O3M0P1l60J55l8J5Ml01N32r7
4779A1N2J34R5k98KP8J21k36J15k04nK18l30J73M2j36J44J34k58L14j50r7L92
4802C11j87p2q7K13o6P6k77K89j19p0J45n4Rj10k2p1N40n66O0J07k05J58k2mM8
4827B4q7j1O2N2j31J83LR8j52j00K36j58j6k34J75K63k99M3L62j59j15o8M9Q6
$$ plain form
4851 106 91 -227 8 -123 -24 119 89 299 310 221 29 -63 20 -57 -5 -100 -87 -46 -213 -65 -208 -98 -267 63
4875 63 144 76 226 59 -52 7 -106 281 -98 -130 18 98 95 21 34 -68 -35 115 -40 35 -85 3 229 -59
4899 -59 261 -243 90 -66 4 43 -103 40 95 49 141 -75 51 84 -62 58 -96 -75 10 -100 -23 34 27 32 -114
4924 -114 76 48 140 308 -198 86 -251 -5 -151 148 94 -83 -206 -88 -97 -98 119 34 134 84 -25 -128 -130 129
4948 129 -45 -12 -88 209 -57 267 -108 247 -49 1 -41 -168 -251 -199 21 53 -184 -168 -257 -7 92 -143 -100 -26
4972 -26 105 -108 54 -211 -179 16 252 -75 74 -129 -170 -8 -99 -44 6 -198 3 -66 83 100 -130 86 -15
4995 -15 127 126 -30 -94 36 -80 99 284 277 -137 301 128 23 15 -54 -77 120 110 -21 74 -6 20 131 231 -147
5020 -147 -45 144 113 238 -128 -137 -100 78 101 103 129 91 14 16 -8 129 129 180 170 -160 9 -5 -233 191 48 70
$$ packed form
4851A06j5l18K35j31R9J43l0K10J1q9j92r2Q3p7N2r5J3M1j67J48j43J10j69L30
4875F3Q1o8J50j67j11N9j13L87l79l2J48Q0lp4J3j02L3J50j55P5j20Q8K26k88
4899e9L20n04L33j56P0L9j46J43N5m6R2k16J26L3j46J20j54K1Q5j10P7N7pNj46
4924a14J90k8R2J68n06K84l37K46j46K99n4j77j23J18rjK17q5J00n0j09j03kK59
4948A29j74L3p6K97k66L24l75L55k96N0m2j27q3N2K20L2k37J6q9K50R9k35M3P4
4972b6J31k13J62k65L2J95K36l27J49k03m1J62r1N5N0k04K01o9J49J7k30K16j01
4995a5J42jj56o4J30j16J79J85pm14M38j73j05qo9k3J97j0j31R5q0K6J11J00l78
5020a47J02J89l1J25l66rL7J78K3KK6l8p7Kk4J37%N1j0l30J69j4k28M24j43K2
$$ plain form
5046 70 -128 -225 -140 -65 -60 145 -31 -66 -195 -193 -129 226 16 -202 162 -22 52 197 61 144 22 263 -137 54
5070 54 194 -54 235 9 -74 -11 0 -99 -187 117 150 19 -372 56 -18 68 76 159 -75 135 498 83 87 -170 44
5095 44 34 -58 -125 119 50 -11 102 -79 77 87 49 106 49 -263 -145 17 -130 90 -39 83 246 83 67 -82
5119 -82 -106 27 -85 -29 -91 32 -20 -72 -66 -57 -75 -394 40 117 -33 -19 10 74 129 43 18 -96 -2 54 -2 -230 75
5146 75 78 -55 43 26 -64 -99 -99 -183 278 -3 -17 154 -74 14 23 32 -100 -180 -281 -160 -64 125 173 76 212 156 211
5173 211 -5 -214 99 -4 -20 -121 0 140 -105 -124 9 20 -123 -59 283 -140 332 -107 -41 -116 -224 125
5195 125 -29 -51 161 -22 -243 148 17 20 -11 -141 80 59 127 109 53 26 6 156 47 320 -167 29 107 -103
5219 -103 -34 -26 -8 75 -17 -10 13 175 226 3 -101 2 17 171 44 -17 -78 -49 10 -74 -188 426 -133 -151 166 312
$$ packed form
5046G0j98r7Q5P5NK05j76l5j29KO4L55k10k18L64j84P4J45j36Q3j22K41m00J91
5070E4J40k48K89k26q3O3J1r9q8L04L3j31l91M28p4Q6QQ3k34K10L63m15Mk57K14
5095D4j0r2o7K44o9o1J13j81J56J0l8N7n7l12J18J62j47K20j29J22J63j63j6j49
5119h2k4J33j12N6o2J23n2n2ORj8l19M34P7j50J4K9O4N5q6k5j14R4N6n6k28L05
5146G5Lj33R8j7r0l5%q4M61k81j4J71k28Q8RRj32q0j01J21R6J89M8r7J36n6N5
5173B11k16k09L13j03j6j01J21J40k45j9J33J1j43O4L42m23M72m39O6p5j08L49
5195A25j54k2K12j83k21L91j31Ll1j30K21k1O8j8n6k7k0J50j09K73m87J96P8k10
5219a03O9QJ8Q3r2PK3J62N1k23j04J03J5J54j27o1o1K9N9q4j14O14n59j8L17J46
$$ plain form
5245 312 186 -22 182 -5 -265 140 -60 -53 211 161 -14 78 -267 -98 -40 -100 -131 -160 -145 -96 -68 -221 153 -102
5269 -102 120 164 -216 -245 332 92 -352 78 41 -72 45 -76 -132 -101 64 86 272 202 -131 -91 -33 -65 -84 2
5293 2 -109 -49 88 29 -60 101 -264 71 51 65 -105 103 -41 -56 75 127 272 118 157 59 -170 17 -46 164
5317 164 164 295 -123 94 54 29 255 138 22 -66 80 96 72 89 -71 200 64 -170 160 86 -151 39 -60
5340 -60 65 -108 -50 22 -35 238 -9 312 -301 -15 188 70 -125 112 171 114 -149 -123 -147 293 81 -121 336
5363 336 149 -167 -106 91 89 -44 -189 -170 -53 -129 -17 -82 71 41 -15 -253 8 319 143 -70 214 382 119
5386 119 101 -240 -119 -109 -91 85 -19 -54 -159 -73 -87 -93 77 -122 -329 84 275 -184 212 -81 64 -88 114
5409 114 -88 -38 -65 227 46 81 -84 -186 -84 -76 -38 73 65 -111 22 74 57 18 52 19 192 79 226 -129
$$ packed form
5245C12j26k08K04j87k60M05k00PK64n0j75R2l45J69N8o0l1k9J5M9K8j53L74k55
5269a02K22M4l80k9N77k40m44M30l7j13J17j21n6L1J65K2J86p0l33M0N8l2j9Q6
5293Bj11O0J37n9q9J61l65L35k0J4j70K08j44j5J31N2J45j54L9r8k29J87o3K10
5317A64%J31m18K17m0k5K26j17j16q8J46J6k4J7j60K71j36k34L30p4k37J90r9
5340f0J25j73N8P2n7K73k47L21o13K86K03j18j95K37N9n7k63K6k4M40k12k02M57
5363C36j87l16O1J97kj33j45J9J17p6J12o5J53l0n6k38K61L11j76k13K84J68k63
5386A19j8l41J21J0J8J76j04l5j05Q6j4oJ70j99k07M13J91m59L96k93J45j52K02
5409A14k02N0k7K92j81L5j65j02J02QL8J11qj76J33N2j7l9L4l3J73j13J47l55
$$ plain form
5433 -129 -83 -4 109 129 -218 -268 67 -237 105 22 -27 -133 -117 50 78 -15 -80 81 122 118 199 91 223 -101 -23
5458 -23 277 -9 -96 0 121 89 -84 186 168 -51 203 45 -39 -58 71 7 3 -272 -40 321 191 137 -99 45
5482 45 -167 46 42 -245 2 22 -275 2 19 286 58 -77 -200 -10 103 -66 76 -40 80 -104 -114 -102
5504 -102 -104 -128 -198 -232 -53 -91 381 47 118 7 207 -181 -96 -83 95 102 38 33 -241 86 59 -131 180 -75 118
5529 118 24 -179 -41 -256 -316 214 -40 -89 -115 -77 -202 -101 142 56 -151 -225 -195 129 230 22 -99 120 -115
5552 -115 65 146 -90 -129 -169 -87 -59 -66 -40 106 239 -89 96 85 -31 28 177 23 -12 86 226 -69 -44 290
5576 290 -81 -50 -60 -28 36 17 -1 -188 80 -63 -91 57 44 128 -108 -268 8 -194 6 -145 112 43 -155
5599 -155 -3 -162 -220 60 -101 -200 -4 65 -299 -73 56 200 3 -191 -93 -164 5 -43 29 0 290 61 -75
$$ packed form
5433a29M6P9J13K0l47n0L35l04L42q3m9j06J6J67K8r3o5J61M1mQ1j08J32l24P8
5458b3L00k86q7R6J21l2j73K70j8k19K54j58q4j9J29o4mk75K32L61j30n4k36J44
5482D5k12K13mk87K47K0k97K77J7K67k28j35j23J90J13j69J42j16J20j84j0J2
5504a02kk4p0l4J79l8M72l34P1j11K00l88Q5J3J78Po4nk74L27k7j90L11k55J93
5529A18r4k03J38k15o0N30k54m9k6L8j25J01K43q6k07p4L0L24J01k08j21K19k35
5552a15J80Q1k36l9m0Q2K8pK6J46J33l28J85j1j16N9J49j54l5R8J40k95K5L34
5576B90l71L1j0L2O4j9j8j87K68j43k8J48j3Q4k36j60K76k02K00j51K57o9j98
5599a55J52j59n8K80j61r9J96O9l64K26J29J44j97j94R8p1J69m8P2k9K90k29j36
$$ plain form
5622 -75 255 265 50 65 238 146 -16 101 -159 -252 25 -82 -94 58 -22 -141 29 -239 -5 161 85 74 117
5645 117 71 223 -105 -170 168 -56 115 173 55 -239 -86 -18 101 -124 72 102 82 -19 101 58 71 -98 203
5668 203 -33 56 92 2 36 208 36 296 237 -61 189 -34 21 -13 -52 -134 18 60 -2 116 -18 -53 -47 -90 -11
5693 -11 -41 115 -59 -27 -6 119 15 -11 290 211 -46 241 -25 -23 -13 -66 -155 -174 -161 103 228 -32 144 -98
5717 -98 -33 80 -126 55 13 -54 -29 -157 131 147 77 117 27 -189 10 -33 16 -242 -171 160 -128 110 -45 -308
5741 -308 -122 -243 -17 132 -9 -25 -8 302 38 222 227 76 11 130 -184 33 46 125 -93 129 -64 84
5763 84 -78 50 -60 -66 -64 78 -23 -121 -204 -114 224 -415 -133 -65 41 -27 103 152 95 132 -137 2 -195 89
5787 89 -73 -116 -87 157 84 94 -162 -70 82 -53 -72 19 71 -61 178 -182 58 -169 98 -325 71 -187 76
$$ packed form
5622g5L30J0k15J5J73r2j62J17k60r3K77j07j2J52q0j19J70k68K34J66p6j1M3
5645A17m6J52l28o5L38k24J71N8j18k94J53O8J19k25J96L0k0j01J20m3J3j69L01
5668B03k36Q9L6r0L4J72j72K60n9k98K50k23N5l4l9q2J52M2o2J18j34l5Om3P9
5693a1l0J56j74L2K1J25j04k6L01p9k57K87k66KJ0n3q9j9J3K64J25k60J76k42
5717i8O5J13k06J81m2o7K5j28K88J6p0M0r0k16J99m3M9k58P1L31k88K38j55k63
5741c08J86j21K26J49j41j6J7L10k64J84Nj51o5J19l14K17J3P9k18K22j93J48
5763H4j62J28j10oKJ42j01r8q3R0L38o39K82O8J06o8J30M9n7L7k69J39j97K84
5787H9j62m3K9K44p3J0k56R2J52j35j9R1N2j32K39l60K40k27K67m23L96k58K63
$$ plain form
5810 76 49 79 -72 -160 34 -39 13 -47 82 182 129 -101 49 -116 -24 52 152 -29 156 -140 4 -119 181
5833 181 187 154 -81 -204 82 104 298 -238 279 -78 -237 92 119 169 69 -20 40 -141 42 -36 192 -112 38
5856 38 186 -82 -55 -27 -90 78 -111 -164 -77 7 47 45 30 -239 -65 -218 22 54 -172 14 -48 2 59 50 64 121
5882 121 129 102 10 196 -98 -98 -35 103 -161 -183 -50 -92 125 277 -174 179 214 -143 -30 19 -18 -68 124 -152
5906 -152 79 -27 -1 -11 -170 82 295 -115 -60 70 95 64 -126 -184 -158 86 -187 -155 97 -173 124 -25 -247
5929 -247 -102 94 29 169 -137 75 -52 -120 -71 69 170 -24 137 21 -38 -10 231 -157 65 185 84 319
5951 319 -167 -197 102 79 -20 -73 -209 3 135 -9 66 40 -163 -99 -128 19 -15 -198 -90 267 -63 -182 -100
5974 -100 -50 21 1 98 241 85 -17 106 68 58 71 4 -89 -71 257 -34 -122 -170 25 -135 226 -24 2 48 -37
$$ packed form
5810G6k7L0j51q8J94p3N2o0J29J00n3k30J50j65R2P6J00j81J85k96J44j23L00
5833A81Ol3k35j23K86K2J94n36N17l57j59L29K7N0j00q9O0j81J83p8K28l04J50
5856C8J48k68K7K8o3J68j89n3Q7Q4M0kj5k69J74j53K40L2k26J86o2N0N7rJ4N7
5882A21Qk7r2J86k94%O3J38k64k2J33m2K17J52m51L53L5l57J13M9l7n0J92k76
5906a52K31j06K6j0j59K52K13m10N5J30K5l1j90n8K6K44k73L2K52k70K97j49k22
5929b47J45J96o5J40l06K12j27o8M9J40J01j94J61j16n9K8K41l88K22J20j01K35
5951C19m86l0K99k3r9n3j36K12J32j44P5k6k03O4k9J47l4j83J08L57l30j19Q2
5974a00N0P1k0R7J43j56j02J23l8j0J3o7r3J8L28k91q8m8J95j60L61k50K6M6q5
$$ plain form
5999 -37 273 -45 65 -81 -140 -240 45 -149 -57 -3 95 -7 -246 264 -28 -107 130 9 -239 -24 -86 25
6021 25 48 -138 -64 -37 51 -3 52 -83 -157 49 100 -254 24 70 197 141 93 -133 30 -87 -2 21 -193 -90 38
6046 38 -27 76 22 -55 -30 273 79 175 -255 177 -13 51 -198 -1 -65 -47 44 57 95 120 -3 -160 -182 -322 27
6071 27 -196 10 -44 45 66 -106 -64 -77 -97 -305 285 -17 -99 62 -157 -209 230 62 175 283 -12 100 48
6094 48 -237 -18 -64 -211 35 17 36 105 268 77 -144 -108 -186 -88 -219 63 153 42 40 51 -75 143 50 -145
6118 -145 -19 71 83 -60 -42 -231 43 161 2 132 -233 29 -144 -52 -236 -274 -49 -98 33 309 -195 -64
6140 -64 -25 161 -304 31 -146 133 -21 -159 86 -146 -50 151 108 32 50 11 148 5 -191 -116 51 -108 33
6163 33 94 114 104 -223 283 -5 -92 161 325 32 -7 244 165 -99 204 54 7 -108 -46 -129 151 350 -173
$$ packed form
5999c7L10l18J10j46n9j00K85j94R2N4R8j02k39N10k92p9K37j21k48K15o2J11
6021B5K3j86P4K7Q8n4N5j35p4K06N1l54K78M6J27n6m8k26J63j17Q5K3k14J03J28
6046C8o5J03n4p7K5L03j94R6m30M32j90O4k49J97o4J8R1J3L8K5j23j57k2j40L49
6071B7k23K06n4Q9K1j72M2j3k0k08N90l02q2J61k19n2M39j68J13J08k95J12n2
6094D8k85K19m6j47K46j8J9O9J63j91k21L6p8R8j31K82R0j11kJ1j26K18r3j95
6118a45J26R0J2j43J8j89K74J18j59J30l65K62j73R2j84l8K25m9J31K76n04J31
6140f4L9J86m65L35j77K79j54j38K45k32R6K01m3p6J8l9J37j43j96P5J67j59J41
6163C3O1K0j0l27N06k88q7K53J64k93l9K51p9k64L03j50m7j15O2q3K80J99n23
$$ plain form
6186 -173 56 172 16 -283 -72 20 232 -40 -345 -164 -217 99 -237 38 -8 -6 41 -93 7 -9 115 -263
6208 -263 -196 110 -78 135 -166 6 88 88 -13 -187 161 -92 -126 -55 103 -119 -45 136 64 -117 32 41 -42 -250
6232 -250 330 -93 99 -273 61 39 -50 -20 -60 20 -21 287 39 -319 -165 15 -151 -13 153 164 -137 171
6254 171 34 359 289 -220 108 36 -268 -57 155 188 -84 -156 309 -39 21 74 207 143 4 27 158 232 -21
6277 -21 101 -18 170 -168 90 -203 -41 -235 18 -58 -35 -12 160 -218 150 123 -178 -32 32 163 -153 -68
$$ packed form
6186a73K29J16j56k99K11R2K12k72l05J81n3L16l36K75m6KM7j34J00j6J24l78
6208b63O7L06j88K13l01J72Q2%j01j74L48k53l4P1J58k22P4J81p2j81J49Rq3k08
6232b50N80m23J92l72L34k2q9L0m0Q0m1L08k48l58J54J80j66J38J66J1l01L08
6254A71j37L25p0n09L28p2l04K11K12L3k72p2M65l48O0N3J33o4j39K3J31P4k53
6277b1J22j19J88l38K58k93J62j94K53p6K3K3J72l78L68k7l01J46O4J31l16Q5
$$ [...]
8191A11
##END NTUPLES=NMR FID
##END=
