##TITLE=1H_LR-758-R3-K6-RC1
 CDCl3
 8 sc, 
 24.11.2023
##JCAMPDX= 6.0         $$ Bruker NMR JCAMP-DX V2.0
##DATA TYPE= NMR FID
##DATA CLASS= NTUPLES
##ORIGIN= UXNMR, Bruker Analytische Messtechnik GmbH
##OWNER= root
$$ XWIN-NMR		Version 3.5
$$ Fri Nov 24 13:55:47 2023 Russian Standard Time (UT+4h)  she@DPX200
##.OBSERVE FREQUENCY= 200.1313
##.OBSERVE NUCLEUS= ^1H
##.DELAY= (6, 6)
##.ACQUISITION MODE= SIMULTANEOUS
##.ACQUISITION SCHEME= undefined
##.AVERAGES= 8
##.DIGITISER RES= 18
##SPECTROMETER/DATA SYSTEM= spect
##.PULSE SEQUENCE= zg30
##.SOLVENT NAME= D2O
##.SHIFT REFERENCE= (INTERNAL, D2O, 0, 15.7039)
##AUDIT TRAIL= $$ (NUMBER, WHEN, WHO, WHERE, WHAT)
$$ ##TITLE= Audit trail, XWIN-NMR		Version 3.5
$$ ##JCAMPDX= 5.01
$$ ##ORIGIN= Bruker BioSpin GmbH
$$ ##OWNER= she
$$ F:/spectra/data/she/nmr/H-F/1/audita.txt
$$ ##AUDIT TRAIL=  $$ (NUMBER, WHEN, WHO, WHERE, WHAT)
(   1,<2023-11-24 13:54:27.50 +0400>,<she>,<DPX200>,
      <created by zg, POWCHK disabled, PULCHK disabled
       configuration hash MD5:
       00 E9 B6 7A A2 85 ED C7 34 08 36 98 17 FE 4E 26
       data hash MD5: 16K
       19 32 B2 BD 71 54 15 00 13 A6 04 27 EC 7A CD 3A>)
$$ ##END=
$$ 
$$ hash MD5
$$ 9A 73 58 EE A7 B8 B6 9F 7D E2 B8 97 6E 00 C0 FD
##$RELAX= 
##$RELAX= 
##$RELAX= 
##$RELAX= 
##$RELAX= 
##$RELAX= 
$$ Bruker specific parameters
$$ --------------------------
##$DU= <F:/spectra>
##$EXPNO= 1
##$NAME= <H-F>
##$PROCNO= 1
##$TYPE= <nmr>
##$USER= <she>
##$AMP= (0..31)
100 100 100 100 100 100 100 100 100 100 100 100 100 100 100 100 100 100 
100 100 100 100 100 100 100 100 100 100 100 100 100 100 
##$AQSEQ= 0
##$AQ_mod= 1
##$AUNM= <au_zg>
##$AUTOPOS= <>
##$BF1= 200.13
##$BF2= 200.13
##$BF3= 200.13
##$BF4= 200.13
##$BF5= 200.13
##$BF6= 200.13
##$BF7= 200.13
##$BF8= 200.13
##$BYTORDA= 1
##$CFDGTYP= 0
##$CFRGTYP= 5
##$CHEMSTR= <none>
##$CNST= (0..31)
1 1 145 1 1 1 1 1 1 1 1 1 1 1 1 1 1 1 1 1 1 1 1 1 1 1 1 1 1 1 1 1 
##$CPDPRG= <>
##$CPDPRG1= <>
##$CPDPRG2= <>
##$CPDPRG3= <>
##$CPDPRG4= <mlev>
##$CPDPRG5= <mlev>
##$CPDPRG6= <mlev>
##$CPDPRG7= <mlev>
##$CPDPRG8= <mlev>
##$CPDPRGB= <>
##$CPDPRGT= <>
##$D= (0..31)
0 1.2 0 0 0 0 0 0 0 0.06 0 0.03 0 0 0 0 0.0002 0 0 0 0 0 0 0 0 0 0 0 0 
0 0 0 
##$DATE= 1700819666
##$DBL= (0..7)
120 120 120 120 120 120 120 120 
##$DBP= (0..7)
150 150 150 150 150 150 150 150 
##$DBP07= 0
##$DBPNAM0= <>
##$DBPNAM1= <>
##$DBPNAM2= <>
##$DBPNAM3= <>
##$DBPNAM4= <>
##$DBPNAM5= <>
##$DBPNAM6= <>
##$DBPNAM7= <>
##$DBPOAL= (0..7)
0.5 0.5 0.5 0.5 0.5 0.5 0.5 0.5 
##$DBPOFFS= (0..7)
0 0 0 0 0 0 0 0 
##$DE= 6
##$DECBNUC= <off>
##$DECIM= 32
##$DECNUC= <off>
##$DECSTAT= 4
##$DIGMOD= 1
##$DIGTYP= 9
##$DL= (0..7)
0 120 120 120 120 120 120 120 
##$DP= (0..7)
150 150 150 150 150 150 150 150 
##$DP07= 0
##$DPNAME0= <>
##$DPNAME1= <>
##$DPNAME2= <>
##$DPNAME3= <>
##$DPNAME4= <>
##$DPNAME5= <>
##$DPNAME6= <>
##$DPNAME7= <>
##$DPOAL= (0..7)
0.5 0.5 0.5 0.5 0.5 0.5 0.5 0.5 
##$DPOFFS= (0..7)
0 0 0 0 0 0 0 0 
##$DQDMODE= 0
##$DR= 18
##$DS= 0
##$DSLIST= <SSSSSSSSSSSSSSS>
$$ [...]
##$SUBNAM2= <"">
##$SUBNAM3= <"">
##$SUBNAM4= <"">
##$SUBNAM5= <"">
##$SUBNAM6= <"">
##$SUBNAM7= <"">
##$SUBNAM8= <"">
##$SUBNAM9= <"">
##$SW= 18.0517328524113
##$SWIBOX= (0..15)
0 0 2 0 0 0 0 0 0 0 0 0 0 0 0 0 
##$SW_h= 3612.71676300578
##$TD= 16384
##$TD0= 1
##$TE= 0
##$TE2= 300
##$TE3= 300
##$TEG= 300
##$TL= (0..7)
0 120 120 120 120 120 120 120 
##$TP= (0..7)
150 150 150 150 150 150 150 150 
##$TP07= 0
##$TPNAME0= <>
##$TPNAME1= <>
##$TPNAME2= <>
##$TPNAME3= <>
##$TPNAME4= <>
##$TPNAME5= <>
##$TPNAME6= <>
##$TPNAME7= <>
##$TPOAL= (0..7)
0.5 0.5 0.5 0.5 0.5 0.5 0.5 0.5 
##$TPOFFS= (0..7)
0 0 0 0 0 0 0 0 
##$TUNHIN= 0
##$TUNHOUT= 0
##$TUNXOUT= 0
##$USERA1= <user>
##$USERA2= <user>
##$USERA3= <user>
##$USERA4= <user>
##$USERA5= <user>
##$V9= 5
##$VALIST= <valist>
##$VCLIST= <CCCCCCCCCCCCCCC>
##$VD= 0
##$VDLIST= <DDDDDDDDDDDDDDD>
##$VPLIST= <PPPPPPPPPPPPPPP>
##$VTLIST= <TTTTTTTTTTTTTTT>
##$WBST= 1024
##$WBSW= 4
##$XGAIN= (0..3)
0 0 0 0 
##$XL= 0
##$YL= 0
##$YMAX_a= 122168
##$YMIN_a= -134580
##$ZGOPTNS= <>
##$ZL1= 120
##$ZL2= 120
##$ZL3= 120
##$ZL4= 120
##$ABSF1= 10
##$ABSF2= 0
##$ABSG= 5
##$ABSL= 3
##$ALPHA= 0
##$AQORDER= 0
##$ASSFAC= 0
##$ASSFACI= 0
##$ASSFACX= 0
##$ASSWID= 0
##$AUNMP= <proc_1d>
##$AZFE= 0.1
##$AZFW= 0.1
##$BCFW= 1
##$BC_mod= 2
##$BYTORDP= 1
##$COROFFS= 0
##$CY= 11.3945322036743
##$DATMOD= 1
##$DC= 2
##$DFILT= <>
##$DTYPP= 0
##$F1P= 15.7292609196834
##$F2P= 12.9074282941183
##$FCOR= 0.5
##$FTSIZE= 0
##$FT_mod= 4
##$GAMMA= 1
##$GB= 0.15
##$INTBC= 1
##$INTSCL= 1
##$ISEN= 128
##$LB= 0.24
##$LEV0= 0
##$LPBIN= 0
##$MAXI= 10000
##$MC2= 0
##$MEAN= 0
##$ME_mod= 0
##$MI= 1.114404
##$NCOEF= 0
##$NC_proc= 0
##$NLEV= 6
##$NOISF1= 3.799351
##$NOISF2= 2.8
##$NSP= 1
##$NTH_PI= 0
##$NZP= 0
##$OFFSET= 15.70392
##$PC= 1
##$PHC0= -24228.72
##$PHC1= 10.65269
##$PH_mod= 1
##$PKNL= yes
##$PPARMOD= 0
##$PSCAL= 0
##$PSIGN= 0
##$REVERSE= no
##$SF= 200.130013532006
##$SI= 16384
##$SIGF1= 3
##$SIGF2= 2
##$SINO= 400
##$SIOLD= 16384
##$SREGLST= <1H.CDCl3>
##$SSB= 0
##$STSI= 0
##$STSR= 0
##$SW_p= 3612.71676300578
##$SYMM= 0
##$S_DEV= 0
##$TDeff= 0
##$TDoff= 0
##$TI= <>
##$TILT= no
##$TM1= 0
##$TM2= 0
##$TOPLEV= 0
##$USERP1= <user>
##$USERP2= <user>
##$USERP3= <user>
##$USERP4= <user>
##$USERP5= <user>
##$WDW= 1
##$XDIM= 8192
##$YMAX_p= 0
##$YMIN_p= 0
$$ End of Bruker specific parameters
$$ ---------------------------------
##NTUPLES= NMR FID
##VAR_NAME=  TIME,          FID/REAL,        FID/IMAG
##SYMBOL=    X,             R,               I
##VAR_TYPE=  INDEPENDENT,   DEPENDENT,       DEPENDENT
##VAR_FORM=  AFFN,          ASDF,            ASDF
##VAR_DIM=   8192,          8192,            8192
##UNITS=     SECONDS,       ARBITRARY UNITS, ARBITRARY UNITS
##FACTOR=    0.0002768,     1,               1
##FIRST=     0,             0,               0
##LAST=      2.2672688,     0,               0
##MIN=       0,             -134580,         0
##MAX=       2.2672688,     122168,          0
$$ Real data points
##PAGE= N=1
##DATA TABLE= (X++(R..R)), XYDATA
$$ [...]
1816A19l28K44M15o13L3oL43j53n3J82j45J60n5j94N0M6l4M4p8L9M8J54m90K40
$$ 119 -209 35 450 -163 -130 -136 207 54 1 183 38 198 143 -51 -1 45 11 55 -23 16 64 218 -272 -32
1840c2m4J44l1p5J9M8K68l58J32l90L67m6J19Kk05N0J03p5j36L73l05M9Pp2r6
$$ -32 -76 68 37 -38 -19 29 297 -61 71 -319 48 2 121 123 -82 -32 71 -4 -140 233 -72 -23 -16 -88 -184
1865a84mL06j97J99j00N2l8j53r5K84J17j10Q5j69j80J63K1O2J36R5k87N8p4J95
$$ -184 -188 118 -79 120 20 72 34 -119 -214 70 187 77 162 -7 -187 -24 -3 59 195 290 3 61 -13 182
1889A82l5m78R4J43J28q9n7L33k80n5M59k67k38O4M1J52j56J42P6J43j89j05j55
$$ 182 147 -331 -237 -94 34 -55 -112 221 -59 -114 345 78 -160 -96 -55 97 -59 83 159 302 113 8 -147
1912a47J07L80k59L8L7j20J68j87k16K13j53r2J04p7L8K77q2LK9K8K9l7k49O0
$$ -147 -40 340 81 119 156 36 204 17 -199 14 -139 -231 -127 -204 -166 111 29 32 61 89 118 81 -168 -108
1936a08J96K3J36k72J44jm0nJ5P4j07j67J84j28P1nj7j82L50k95J42j52p8J76
$$ -108 88 111 247 -25 119 118 78 73 88 162 55 -112 72 -56 15 10 -7 -189 161 -134 8 -144 -222 -46
1960d6K39m38J79J7k3K41K27k44m1k06J50k89L35l31L37O2o5j49k58L06P6ol01
$$ -46 193 -245 -66 -49 -72 169 396 152 111 -95 55 -234 101 -230 107 169 104 -45 -303 3 79 73 -228
1983b28K34J22j95L66k40J57j96J37J04k68Q0j10j46K24k7L09n82J65J99j08o1
$$ -228 6 128 -67 299 59 216 20 157 261 -7 73 -37 -183 41 14 323 -259 -94 105 -3 -64
2004f4K10L9L4j81l69Q4J38L25k24j56k06L09k06K37Q2j23j05K03q5J24j4mJ76
$$ -64 146 185 219 38 -331 -247 -109 216 -8 -164 -370 -61 -267 -30 52 -71 -176 27 -58 66 52 48 224
2027B24m6n8j85P8l2J9J72%m83L05P0l6k59K41L9o7j04J7k83N18J02k71o3j61
$$ 224 178 120 -65 13 -19 0 172 172 -311 -6 64 28 -231 10 49 -18 -122 -105 -388 130 232 -39 -102 -263
2051b63K72j20k6K06J24j10k04K72j18j5R3m35L35o8Q0n0j77L8R4J12o1l30J51
$$ -263 9 -111 -137 69 193 83 -121 151 33 18 111 -324 11 -57 23 -27 -204 -166 -72 40 -21 -351 -200
2074b00L70j88p0Q1n1n2Q2k0J1J82p5N3Q1j61p9MQ0j49p3K71j99J94m61M55j53
$$ -200 170 -18 -88 -7 -58 -110 -28 -48 -37 145 70 123 204 43 -36 -32 48 -101 -174 97 -102 92 -369 86 -67
2099f7J82k76J58LL6L0j16K04l06L09o3O5M7l16Q6Q6n9M5j10n5K10j06j90M85
$$ -67 115 -161 -3 0 36 66 -50 154 -152 157 94 159 206 -110 -24 62 3 48 -62 -117 93 -13 -203 282
2123B82k41K9j31j10J86J15j59K24k76J73R8k42L31l53K01j00k8J26q4L3R1l34
$$ 282 41 70 -61 -171 15 130 -29 195 -81 92 190 -52 279 -74 127 27 -1 125 41 74 165 -169
2145a69L25q8j04Q5J6M6p3q8j05L35j75M2k06K72k35O1K32pj01m7Q9n1K04m18
$$ -169 156 68 -36 49 65 111 38 -50 -155 180 5 47 -159 113 -122 -61 171 164 63 16 105 54 258 -160
2169a60j10JM52k32L48m47j07J17K75k30J93k99J49Q4j02o9L5LL7K47j48o0m8
$$ -160 -270 -269 183 -49 299 -148 -255 -138 137 -93 100 -199 -50 34 -68 -137 -102 -99 -62 185 37 -23 -71
2192g1J70j32j23L38o4k65K28K04k52R3o6k9k12J82j9J52p4J19L7Lp7k30L4m0
$$ -71 99 -33 -156 182 118 -147 81 285 33 126 60 31 -181 1 -18 134 60 179 216 219 142 -88 -54 -94
2216i4M05k88J61J02j39j72N3j93J59j2j34J07J47N6k69J51q1l3j8N0m6R0j61
$$ -94 311 23 184 286 147 -25 28 -165 -6 -18 -152 -45 102 158 -111 40 -41 -74 -92 -42 -88 2 -159
2239a59K39O3j97J38J58j44k0k0n1j87J24j8L90o31L29k11J55K57n1L0j97j91
$$ -159 80 143 -54 84 242 98 78 58 7 -180 -56 -74 316 -315 14 -197 -42 215 164 194 -3 -194
2261a94O9J53r7j6k52K59K18j52n5n0K40l4Pk37J12M5P8k55LR0J07q3K3j75L39
$$ -194 -125 28 -69 -85 -337 -78 140 -12 -67 -117 123 89 96 -141 -29 16 94 -161 -158 -68 39 -44 -21 -196 143
2286A43k96J23k21L8M28k63P0l8Oo0NRl7m3J11j24J9L11l03J35j6k70N41j75j69
$$ 143 -153 -30 -251 -213 215 -48 22 -16 -10 -70 -65 -56 -93 -136 -25 -149 -130 181 -122 13 -3 -273 268 93 -76
2311g6q1J44k27L85J9o3J5j00oJ49R9l67j13M00j94k62K11K2K5k42L44n2P1L1
$$ -76 -157 -13 -240 145 164 101 116 16 10 159 258 -109 -222 178 -16 -278 -67 -45 -20 -262 82 30 101 132
2335A32l01K1K13j3O1Qj21K55j05l5k50M7J06k45J52J93j9M2l5N5k64M83l42j07
$$ 132 -169 -148 65 52 113 121 0 255 150 115 -135 -88 18 -227 -75 118 99 141 106 161 -103 380 38 -69
2359f9L19j43J28K9k58L55m74j16L29j96J07j82Q6O2Q3j03k5P2q3J28J3l2K2J3
$$ -69 250 107 235 264 6 361 -113 -229 100 -96 11 -171 -85 -23 60 -43 -68 4 -79 49 62 30 52 65
2383F5R1p4r9l0J6q7J86J14on14L19M6k2Jj07K32k35K58m39J57K74j24J91j35
$$ 65 156 82 -17 -47 -31 -118 68 182 176 -338 -19 27 5 6 -101 131 -104 154 -285 -128 146 22 213 78
2407G8p8L88k10l74L81r9j35J38M2J58l65O4L8k28L87P1k16P9j18J03J41k89n8
$$ 78 0 388 178 -196 185 86 -49 89 131 289 -76 -12 26 -202 185 256 40 119 1 104 245 -44 -102
2430a02J78j43L6J9l4k32L14q6K19m70P1L73k78K83l5k65K69J7l15l9J41K17m09
$$ -102 76 -67 -31 -12 -46 -278 36 -50 169 -301 -230 143 -135 148 113 -152 117 134 -181 -220 -79 138 -271
2453b71K48j40K13k06L84Kl49L19j38J06m2j8rl15J24K18j77K7M4l4K5l1l19N83
$$ -271 -23 -163 50 -156 228 230 -119 200 62 168 126 108 99 -216 -92 126 -51 -24 20 -14 11 -20 -339 244
2477B44om66K89n3K91j15rl22K69j80Q8j4k25J71j90K90k0q5j3R4k15K59k43K04
$$ 244 238 -228 61 8 299 184 175 -147 122 -58 30 16 -209 -38 -228 62 42 -43 -56 38 -177 82 -161 43
2501D3P0k75M7J47J86j16k03R5O8l75M33j2j52k19L27m8l1J50j23J13j20j85L10
$$ 43 113 -162 -115 32 218 102 -101 -6 62 -313 120 108 -44 -263 64 16 -15 135 12 125 5 -180 130
2524A30qJ00k63p9K41J6j7k67Q0J49j06L5K0k60M71l67L04m2Jk00p9L96l05K16
$$ 130 122 222 -41 -120 121 137 120 -147 -67 82 -24 11 31 -229 242 -125 179 137 138 -62 -141 255 -50 166
2548A66oO4o2k39j09J74L3J40j76J19j56J48m87K58j69K87O4J13l7l4q2j54K60
$$ 166 160 224 162 -77 -186 -12 21 161 -15 104 -52 96 -391 -133 -302 -15 49 162 125 91 9 -145 115
2571A15j22r6M6J61k33M2k14K22m9L15j50j82K08j20K20K18l10j84o6J02k9N2
$$ 115 -7 -103 -57 104 -129 -87 -301 -79 -128 187 37 -145 63 -57 163 381 71 -113 -179 -77 -106 -54
2593e4J67l18K50r7M4rP0k66K64j3P6N5j97K35o8k23L29j15j23j42K9J18j06Q8
$$ -54 113 -205 45 -52 -8 -17 53 -213 51 38 114 169 -28 207 139 -84 245 130 7 -135 -106 12 -94 -6
2617fj80K27rl2j62J70j9J91k16RK36K6k81K28k30K17k04O0k07o3J29Q4J13M8
$$ -6 -186 41 32 0 -162 8 -11 180 -36 -27 209 235 -46 182 -48 169 -35 25 -182 -245 -116 -32 81 129
2641A29Jk12L1P1p9j10J50k0K12K9k68J87k90K40r9q7K91q0j57J79n02L58R4j48
$$ 129 130 -82 -51 20 -59 -169 -19 -39 173 202 -66 121 -169 71 -28 -115 176 96 -61 118 -384 -26 68 -80
2665h0L03l31J06K8m6j93L21K0j89QJ92k25J76j58J54l28J36K01k26Q4Q9j71J49
$$ -80 223 -108 -2 26 -20 -213 108 128 -61 -53 139 -86 90 -68 86 -242 -106 95 -131 -47 42 -129 20
2688B0l08L43j3k70jM59k10j9k37L59l46J84J34o4j13q4J39j65K92J3k26K79k6
$$ 20 -288 55 42 -228 -229 230 20 1 -236 123 -223 -39 95 31 -82 -166 -27 -192 100 113 -113 166 140
2711A40J69k96J37k80K40j15l6M1J68q1p0K41j58m50mK18J54K8j52R2R1Q7k26
$$ 140 309 13 150 -130 110 -5 -41 0 168 87 17 258 100 -350 -354 -136 18 46 -106 -14 77 164 -62
2734f2J44j4n0r6K51j60K9QJ72k02l9k69Q7M38l33pJ63P6j09p5k7O4j44K60p8
$$ -62 82 68 18 -78 173 13 42 50 222 20 -19 -288 -201 237 -96 -103 60 136 27 -48 -75 -11 -155 105 27
2759B7k9J37Ok69k26M78j91p5K04k81J47o8K48j59k5j0k82L37N0j88K11J9j48
$$ 27 -2 135 141 -128 -354 124 -67 -142 62 -219 -72 -140 108 -51 -76 -86 -368 -31 19 -169 42 61 -87
2782h7J9R2p0J27j09k4L4N1o0M6J53L7k29L8J8M4P4K0j44O7J6k24L06k21R2J16
$$ -87 -68 24 -46 81 -28 -52 -18 33 -27 19 172 209 -20 18 36 80 154 174 30 97 113 -111 195 -26 66 182
2808A82k14j22L4J69m5PL8r7K21j80K31k27RJ43j56j88R0O4K1j81Q0K05K8J05
$$ 182 -32 -154 -120 49 4 11 49 -48 173 -7 224 -3 6 149 -7 -195 -105 -41 -20 -201 -121 84 112 217
2832B17j90j50J07J27Rr1M1RJ38n31R8K43l34J90M21r5m8l7P7k84J14o2K07l7
$$ 217 27 -123 -16 111 120 29 70 79 217 -314 -216 27 -307 -117 304 209 161 124 201 -83 31 -31 176 139
2856A39o8j10j02K99J20k69K09l13L29m03l5K18o5M3j56K83m0j77O3J39j74k6
$$ 139 71 -39 -141 158 278 9 218 -95 234 -169 -204 14 -51 -8 -164 119 79 -98 -35 104 -70 -96
2878i6J48l4J1o0J32o7n1J36n6j67nnK41k16O1K34j53Lk39K67q5RJ01j00j12J71
$$ -96 52 18 29 -31 101 34 -17 119 63 -104 -109 -114 127 -89 -28 206 53 56 -183 84 -1 8 109 9 -103 68
2904F8k00Q8K07l26Q6J40J19j71j59K55K6l9R5k22p6O4j16J24J77k47j13J49K13
$$ 68 -132 -44 163 -163 -77 63 182 11 -148 107 133 94 189 -33 -109 -45 -161 -37 140 -107 -220 -71 142
2927A42N7p4j67j37K82n3J59J30l94p9J27p8K37j20j91M36l79J63l1L4N6L3j19
$$ 142 199 125 -42 -179 103 50 209 339 -55 -134 -7 -85 152 32 -159 277 -102 61 30 64 120 153 34
2950C4k79L85j19K85l65j57J0J5L49Mk21r6M0O5O3%k5J08r9l2j56M04l94N4l8
$$ 34 -245 140 21 306 -59 -216 -206 -191 158 162 -59 -155 -115 -50 13 13 -12 96 -3 -35 -191 213 -181 -127 -165
2975a65l9K51P9j47k04M34k25M7P0k29o5L03J9j96J74j96K61l84R3K48n3j36L0
$$ -165 -204 47 126 -21 -225 209 -16 31 101 -128 -193 110 129 -67 107 -89 172 -212 -119 129 76 -60 -30
2998c0Q6N9k03L73m17J49q3N8M0o3j35J34M7N1K61j33l21K34Ml0M0j00J26l52
$$ -30 56 115 -88 285 -132 17 -66 -8 32 -31 -166 -32 15 66 327 194 -127 107 111 81 121 21 147 -205
3022b05K73k51L9J99J12j36L0J96m84L44r7l8p4K38k58L08j40j36j08Q2P5j4L3
$$ -205 68 -183 -144 55 167 31 61 257 -227 117 20 -18 -92 146 -112 196 56 -80 -188 -106 -31 -45 -12
3045a2J32l5m0j50n9K61l0p1k1P8K06l45j25J89l46M51j85j0J09j94J49%K00j26
$$ -12 120 85 45 -105 -164 97 67 -4 -25 53 259 -86 -211 -22 -368 83 -102 -112 -3 -197 -48 -48 152 26
3069B6N7j14n7M1j16J5q0K07J64Kk31k06M14l01L9J86pJ70l35L05p9j66m2O0J06
$$ 26 83 -31 -88 -47 -163 -148 -228 -21 143 145 -86 -292 122 -179 -140 46 39 209 -126 179 100 -66 -108 -48 58
3094E8L0K6Q2q1j61M1J00L5K7o6p4n1p8K07j14k46L48J95l79K74j28L14l18p8
$$ 58 88 114 196 115 -46 -5 95 130 157 91 17 -34 -112 95 -19 -265 83 278 -101 173 45 359 41 -37
3118c7J35o7j77P1J60K22l41j71Q4M4J67k15J10K05l80J37m3P0j16K42k26J60
$$ -37 98 31 -146 -75 85 307 -34 -205 -121 -77 90 -125 -15 190 -190 -53 -96 -26 -142 100 -126 34
3140C4J38j11r8p0R8k59L73j71R7j32l7K43J55k84P8P0j47Q8qp7J93k67L75l11
$$ 34 172 61 -37 -107 -9 -268 105 -66 31 -101 -138 105 260 -24 54 124 -23 65 57 -20 173 -94 281 -30
3164c0l5O1M9r5l9j0L44k90R3Lp0J1l10L22k42N47j84k6j65K51j26J4j83L2pK80
$$ -30 -65 -4 45 -50 -89 -99 245 -45 48 51 -19 -8 -318 4 -238 309 125 99 -66 185 59 73 -110 -78 -85 195
3190A95n17K62j64J42Q6j77J71o7J69M1q2j07J66k01K72m3j67j22J04O4j25J97
$$ 195 -322 -60 -224 -82 4 -173 -2 -69 100 141 59 -48 118 -83 189 146 -21 -143 -39 25 -100 97
3212I7k46l1Q4j26J98l4J7M2p8k5J73q4J9j02J04K9L32n56K73j41L64l56J4N7
$$ 97 -149 -180 -96 -222 -24 -58 -41 1 -77 -102 71 -13 6 -96 8 37 369 -187 86 -55 309 -47 -33 24
3236B4k11J39mo3J6k4L08L6j21r9m5J64j03j32J6q1K38p2k40r8N91j90r9K9l2
$$ 24 -187 -48 -52 -115 -99 -123 185 221 100 1 -44 120 17 -115 -99 -180 58 -14 -254 -352 239 49 -50 -21 -53
3261e3J53J1p9j64O6Q2k06K27O2j17j86J64J61j6m15J91P0q8J86j77O6K30K1q8
$$ -53 100 111 32 -132 -66 16 -190 37 99 -18 -204 -40 121 105 -310 -119 -49 -137 49 -128 -62 168 189 101
3285A01k33Q5K15m35L13j3n6J24n1n9Oj31K55m23M20k53J67q1M42l83k17L07k3
$$ 101 -132 -47 168 -267 46 33 -23 101 50 -9 -3 -134 121 -302 118 -135 32 -49 393 10 -207 100 77
3308G7M8k55J74k00K45o6k5Pk19J74k19K42k94L04%K4P3m74L53N5j91K87k17K23
$$ 77 125 -130 44 -156 89 23 -2 5 -214 -40 -259 -17 -311 -7 -7 17 90 -384 -31 24 -167 120 -97 126
3332A26jk52R4J22k32O6M5K8J89j04J68p9l61L95q8j89n6j18K18R7q3O8j84J57
$$ 126 125 -127 -33 89 -143 -77 -32 -4 185 81 249 170 -191 204 116 -73 -129 -247 -29 68 -15 53 -131 26
3356B6k51L8j14L58j07M9K4q5j92J82Q1M7j17K83j61j26L29l54J34j02J49l29
$$ 26 -225 -187 -301 57 -50 -1 23 -62 -254 -72 9 56 -61 222 61 -65 264 -90 44 -58 91 -238
3378b38J01M0K30j62J31M6J1J44k73l7j10M00j69k20RnJ66Q2o7k61J98L09j81
$$ -238 -137 -97 133 -29 102 148 159 303 30 -7 -117 283 114 -106 -97 -102 64 146 79 -182 16 325 144
3401A44l89J58j11oL45l4j02Pr6J61Q5q8j23rK27k58rP7l5%j12K55j98J21J1J21
$$ 144 -245 -87 -198 -204 141 107 5 12 -84 77 162 74 -49 -58 169 -89 -98 -21 -56 -56 -168 87 -111 10 21 142
3427A42j79K60j78q7J23n0mk4R2k70j38O00j62k93J52k21K15N8m4j06q7P5J77
$$ 142 -37 223 45 -42 81 31 27 3 95 -175 -313 287 125 -168 -16 -237 -22 36 -8 -114 -201 -126 51
3450E1K2j46k5j0J82j36L80j79k1j06p9p4k48K77K5P5Q9m27M02O1r4K26m65K35
$$ 51 73 -73 -98 -108 74 -62 318 139 118 12 -67 -141 -389 -112 -87 -12 77 -350 52 113 19 245 -220 15
3474A5k80j8L65J35m03j91M29r1K87l54Q9M2k12J59q4J86n5j39L62j40p5k7K41
$$ 15 -265 -283 82 217 -186 -377 52 -39 248 -106 -17 25 -187 -28 -112 74 19 -120 242 102 27 0 241
3497B41k23K3l84R4N8L5K65k62L6k18J40O6J49l28K13J17J26k8Q3l26Q0L1M9J32
$$ 241 18 41 -343 -249 -191 -156 109 -153 -117 -335 -195 -129 20 -308 -95 22 148 120 203 -123 -43 -12 37 169
3521A69j91K16k45j18K30j47R0K3k67P2J38J8m2O2n8J20J12j13P2l72K46k01Q3
$$ 169 -22 194 -51 -169 61 -86 4 27 -240 -168 -30 -12 -54 8 -50 70 182 69 141 -231 15 -186 -103
3544a03j54M73lm18J92mj06Rj01J91L8J75l24j9J08k0q3J92K9l2k22M78l46O2
$$ -103 -257 216 213 -205 -13 -17 -123 -114 -215 -24 14 189 -135 -154 -46 -66 -149 43 72 40 -182 296 -50 12
3568A2j68J65J55j29k2k4j03QJ21o2K30l63N14m11J23j55J93O2j27k86L5M03N5
$$ 12 -156 9 164 35 13 -11 -114 -106 15 -47 183 -180 334 -77 46 -109 84 146 19 -267 -232 171 226
3591B26l78l6J24L15K6l30k2M6J58j21J38l33L86l73M67l67p7J76n8J7K80m19
$$ 226 -152 -188 -64 251 277 -53 -75 -29 129 8 146 -187 199 -174 293 -74 -151 25 -33 -16 264 -155
3613a55J79J25k00oL1O0L2N4n4k77M9K57k21R9Q1k7o7J22k55K41j78l4J45R1k5
$$ -155 24 149 -51 -57 -26 34 66 120 66 -211 -162 95 -126 -27 54 27 -40 82 -173 68 -110 -144 1 92 67
3638F7J15k13Rj09K37J51l61K57J76n36q5RP1M7OJ85PN5k14J52J6K08r6k03J2
$$ 67 182 -31 -22 -131 106 257 -104 153 329 -207 -292 -283 -212 -165 -159 26 33 88 -126 26 42 250 154 -49 -37
3663c7j33L7J15j05J36nK1j21J89l03L3J47j16L48j13Q0Q4m09L09l42l7K68J05
$$ -37 -170 -133 -18 -123 13 8 29 -92 97 -206 -173 -26 -142 206 93 173 257 -152 157 -185 -222 46 151
3686A51Qj84pj09J17k4K32k63j84L23J62j98J78j66P6l48K7J14Q4J98m75J81J41
$$ 151 159 -25 -32 -141 -24 -48 184 -79 -263 60 222 24 202 36 112 -236 -209 -95 -11 187 -288 -107 34
3709C4J01l1O7q3j39P9J51l41l5K00P0P5j92J06j2p8j20J13o1J10J74L3j81J7
$$ 34 135 104 171 88 -51 28 179 -162 -197 3 73 148 -44 62 50 -28 -148 -35 -96 14 188 221 40 57
3733E7j29N7K0J52j22n0K1l6P3kK5j50J17q6r2K38k45kK94k26J40j36K41k05K6
$$ 57 -72 -15 5 157 35 -15 6 -30 43 41 66 -84 33 -53 -145 93 -152 -154 140 -86 54 -82 159 -46 -20
3758b0K9K14l40K64k45k01J85J31k2m9J30Mp5j56M94l97K9j20P2l8K25j43j75
$$ -20 9 223 -117 147 -98 -299 -114 17 -5 -54 76 80 5 -151 343 -54 -25 -145 -73 -111 114 -29 -204
3781b04K5K27j84J54n5L19l43K21l98K21L9k99K36p9J42P4j81j6n2P9K92k15N6
$$ -204 -179 48 -136 18 -37 282 -61 160 -238 -17 22 -277 -41 -120 22 96 -85 -101 -153 -74 218 3 59
3804E9J22r0l18K56j32K09k00P4L2k1J9O9J57k87j0N9j69J65k13l4J94j2q3J93
$$ 59 181 91 -227 29 -103 106 -94 -20 12 -9 10 79 236 -51 -61 -2 -171 -6 -219 -253 -59 -71 -154 39
3828C9L5l40M98j24j36j19M0Q3j71Q1o9L14k67K60k23l8J0l3K86l07K37j31l28
$$ 39 74 -266 232 108 -28 -147 -107 -24 -195 -114 -183 131 -136 124 -99 -137 -127 -160 126 -181 56 -75 -403
3851d03K16K15J37j98j58M3M15k29k18K78l77K61m0K52k73j7Q2k01J98RK11k52
$$ -403 -187 28 165 -33 -191 -148 267 38 -180 98 -279 -18 -58 194 -79 -96 -14 -215 -17 -8 203 -49
3873d9k70L90j73j5j97M15oPj40J04Q4k37K9j69K45K79k67j23L20k15J4l51M09
$$ -49 -319 71 -102 -117 -314 101 95 102 -38 66 150 -87 -58 -227 18 297 30 -93 227 12 26 -325 84
3896H4j15o1K66j94j23O3J70L2J8j96J79J4m95M65pm5k07n7j15K61J55j83j8J89
$$ 84 -31 -92 174 -20 -143 -80 90 122 140 -56 123 137 -358 107 100 55 -152 -209 -324 -63 92 -91 -109 80
3920H0l39M62k80k31J48l5M48l44Q2j00L39l21J92k12M0k01K31j78n2L26k79L01
$$ 80 -259 203 -77 -308 -160 -195 253 -91 -9 -109 230 -91 101 -111 -71 -272 -41 -219 -271 55 -224 77
3942G7J04l54K53m14L02j34K24K86k07l1k13K40j44J95k76J58j41j28K85j26L3
$$ 77 181 -173 80 -334 -32 -166 58 344 137 106 -107 133 -11 184 -92 66 -75 -203 82 -44 -11
3963a1o0L55k10Q6k25J65l6k9j32J42J1j62k5L34p8r9j29P4k1j12K94p7j30L2
$$ -11 -71 284 74 160 -65 100 64 35 -97 45 56 -106 -131 203 125 26 -103 -29 -50 -162 132 55 -75 -43
3987d3L07m0j78Q6J76j02k32j29K52p7J03l2o2j86n1Q8J84J39k80K2o9K67R6K4
$$ -43 264 224 46 132 308 206 -26 -155 97 20 123 91 29 -157 -208 -120 64 203 -77 -55 -124 143 239 263
4011B63q8j61m1J81j23J7l9J65q2o9J47j34J36k71J93ql22K15j42N0J05o8l4j09
$$ 263 175 14 -27 154 31 48 9 174 92 23 170 36 172 -99 94 86 -236 -21 -163 -113 -8 -76 -110 -219
4035b19M43l45J13j69J17l78N46o2n9M8p3J09j78J51j72J45O6j19l2n2K48m87
$$ -219 224 -121 -8 -177 -60 -438 108 46 -13 35 -38 71 -107 44 -128 17 83 -36 -68 -120 128 -359
4057c59M98K26l98K6k1J58j53k2J64j06K31l53J61L16n31j18K08LJ7Q2Q4j52j88
$$ -359 139 365 -33 -7 -28 130 -23 -45 119 13 244 -109 52 368 -163 -281 -73 -70 -53 29 113 -39 -227
4080b27J66N0M7J10n7j81j03R0J19q4L68l60M22k62Or1k27M83n64M07P8k06J43
$$ -227 -61 -11 36 146 89 -92 -195 -105 14 -70 298 -62 360 98 104 13 -214 269 -295 112 190 -16 127
4103A27j90k05L30k27J25k90M63jl78J70J8J13L3m03J19Q3K66j74P8j76O6%j55
$$ 127 -63 -268 62 -165 -40 -330 133 132 -246 -76 -58 55 88 -315 -196 -113 153 -21 57 -119 -53 -53 -208
4126b08L61J04j93j58K60k27J46l48K21J69r9L0k72J49m0L55k59J23j95J94k48
$$ -208 153 257 64 -94 166 -61 85 -263 -42 127 28 58 -214 -65 -105 250 -9 114 -81 113 -135
4147a35J19J41k17J97j56K72k61J87k82P0j98K74K10m53Q6m0K67k77L97m99M01
$$ -135 -16 125 -92 105 -51 221 -40 147 -135 -65 -263 11 221 -232 -146 -186 81 -196 201 -298 103
4168A03K03n87J08M53k57j28nK32k87jL06r9K9J55j98j00k38R0K07j14K21j16
$$ 103 306 -281 -173 280 23 -105 -110 122 -165 -166 140 41 70 225 27 -73 -311 -221 -14 -128 93 -23
4190b3J58r0j20j00K71m8r1K71j96J77j8j75J7n6O2l97L20O6j57J03k22K58M8
$$ -23 135 45 -75 -175 96 48 -43 228 32 209 191 16 33 -23 39 -358 -38 28 -129 -26 -248 10 58
4213E8o9R8k80N68k27l35K08J41k16m1K27j21M5l26L49K1j10p2N8M2K7K7k03J51
$$ 58 -11 87 -193 375 148 -187 21 162 -54 -95 132 11 56 -270 79 100 -10 -82 -24 18 45 72 -131 20
4237B0L35m05K89j17n8k0P8j64k17J33J09N8L3m3l6Rj78J48J60k05RR9M4k83P7
$$ 20 355 -50 239 122 64 44 122 -42 -259 -126 -17 41 74 31 -5 4 -174 -26 134 -71 -62 37 81 -202 -125
4262a25J17P2L6j17k1M2L65m93J26M7j75L06l14L0L06j1k61J43J81l84j62M37
$$ -125 -8 64 100 -17 -38 4 369 -124 2 49 -126 180 -134 -104 202 191 -70 73 254 -130 -292 145
4284A45n0J45k53K10n35K15J45L6O6Q6l48K11j48M2k2J89j60n8j51K75p5J51k51
$$ 145 95 240 -13 197 -338 -123 22 58 124 210 -138 73 -75 -33 -55 134 -26 -84 -235 40 -35 116 -135
4307a35O6l4K21J36j03k59J02K33l02J25p3kK45k70qOn1K05kP1l18K63k41K13
$$ -135 -69 -103 118 254 151 -108 -6 227 -75 50 -23 -25 220 -50 -58 -52 -103 102 100 171 -147 116 -125 88
4331H8k43J45q3J50p0O8l55K82R6k48K84r4M18m72K6K06j97O9P0l76K84p7J18
$$ 88 -155 -10 -93 57 -13 55 -300 -18 78 -170 114 20 438 -34 -8 198 1 70 140 -236 48 -29 89
4354H9j1k31O1M2nN6K73M6k93jr5l3j03L54p7q8l4J70k10K54j29J78k47J68r7
$$ 89 78 -153 -92 -50 -55 1 274 320 27 26 -69 -102 -205 149 72 -16 -50 120 -90 164 35 213 -34 134 37
4379C7O5K04j69j19L3l8Q9L8l44L96k31L04l45l18M33k23K70j66Q6j48K00k10
$$ 37 102 306 137 18 51 13 102 140 -204 192 -39 265 -80 -398 35 -188 82 -84 2 -146 54 -156
4401a56K13k51J10L75m18L01J3j88Q9j48R1N4l27N13j72j66R4j91L58M9j53l5
$$ -156 57 -194 -84 291 -127 174 187 -1 88 -60 31 85 -242 271 99 -67 27 -164 194 243 90 55
4423E5k56J34K19k83J45R3k42J53j29J58K52j51R5k35q5J73j14K12k57P7N3k8
$$ 55 -201 -67 152 -131 14 107 -135 18 -111 47 299 148 243 8 -77 96 -18 194 -63 14 67 39
4445C9q9J10K3j74J07k01l3L87m70K40L0J69j96N1q7q3J02L19k04M1j26K46m56
$$ 39 -50 60 83 -91 16 -185 -218 169 -301 -61 -31 138 -58 -7 -94 -177 -75 244 40 81 -45 201 -255
4468b55K27l0k17K10R3r0r1L32l16L38l2r4q8n6mJ58M0j72J64K8j5q0k97J23L37
$$ -255 -28 -58 -275 -65 28 -62 -153 179 -137 201 169 75 -13 -69 -73 85 125 -47 117 145 130 50 -247 -124 213
4493B13l09K4J12j95K94j36p6j31K74j58J66PK39l72J67M5J5j03j31L24r0l33
$$ 213 -96 -72 40 -155 139 3 -73 -204 70 -88 78 85 324 -48 119 164 179 76 -55 269 179 -154
4515a54J75j01j26L2K69k53J85N7l1rJ05k31j20M42m46Q5O5J5j43K78l15l6K12
$$ -154 21 -80 -206 -174 95 -158 27 84 53 44 149 -82 -202 240 -206 -121 -56 -41 -184 94 -221 -257 -45
4538d5J22j19J73j54Q0j8k02J41k54K77o5M3m6K97k26j12J30j3P6k69L98k24K6
$$ -45 77 -42 131 -23 57 39 -163 -22 -276 1 -64 -21 -67 230 4 -108 22 9 85 -184 214 -10 16
4561A6L0j18j63M33l33K36j02K60j78l46L70k09J68J86l79N2J47J0%j43M8n1m5
$$ 16 46 -72 -235 198 -135 101 -1 259 81 -265 105 -104 64 250 -129 -77 70 80 80 -63 -15 -66 -111
4584a11K74q5j68J17K93j86m1k14K22LJ8j34j52J83L2PM3k30%L13m21o1J56M08
$$ -111 163 78 -90 27 320 134 93 -121 101 104 122 -12 -164 19 51 58 101 -129 -129 184 -237 -298 -142 266
4608B66k20m9j9J06j82n6K37j34K28k25m3L02j22j00l6J65j05M2N7N3l69J31j3
$$ 266 46 -3 -22 84 -98 -154 83 -51 177 -48 -91 211 89 -11 -47 118 13 55 112 165 -204 -73 -86
4631h6j47K60j93m5J48M05j17l76M8JJ36j42K14p9o9K11k57J47p4j1j80J18J29
$$ -86 -233 27 -166 -211 -63 342 225 -151 -103 -102 34 -108 106 27 -42 169 -88 59 -15 -26 -206 -88 41
4654D1l14J28K62l4l15J60Q8mR1j7o8O0j07O7l11K25J54k4J21l63J75k53K33k64
$$ 41 -273 -145 117 83 -232 -72 16 12 103 86 18 78 -29 38 -273 -48 106 82 203 -160 15 -238 -5 -269
4678b69K90J80j53l8N2k42N12l09j40K29J8j7P0r1k2k93L79l6j43j7J81j63K88
$$ -269 21 201 48 10 62 -180 332 23 -117 112 130 113 183 92 70 -223 156 120 -23 -40 141 -22 266
4701B66k02k3Q5n0o7l45K14K01j31L01q0n12M17J7P1j62p0J63m6j24oL84k67K11
$$ 266 64 41 126 76 9 -336 -122 79 -52 249 169 -343 74 91 162 0 -70 93 47 -77 -83 301 34 245
4725B45l58L2J33j55N2N9k45K46j32M0l1oJ78J07mk30J14k1K46k67J44j85k16
$$ 245 -113 -81 52 -103 -51 8 -237 9 -123 -83 -114 -120 58 165 161 -69 45 24 270 3 147 -38 -254
4748b54K09k25K9N51k5k33Oj11j06J57n9J12k70p8L01k90J29J38J88j47J1J14
$$ -254 -45 -270 -241 310 285 52 58 -53 -159 -2 -61 51 -219 -297 4 -286 -157 -19 169 22 33 147
4770A47n1J1k03J96j44M1mj64L58k39J59R9k60L8j46m0O2K51j79K9r7R1M6k36
$$ 147 96 107 -96 100 -44 -3 -7 -171 187 -52 107 206 -54 -16 -162 -202 -140 111 -68 -39 -136 -45 1 -235
4794b35K28j26J22J74l51R1J25j1Q9j07QK4k9k5J1J62m72J35L15l28L16J83n96
$$ -235 -7 -133 -11 163 -188 -97 28 17 106 -1 7 31 2 -23 -12 150 -322 -187 128 -200 116 299 -297
4817b97L73o1j18J64k41p7L03o9OJ25k08J85k79l4K13j38m1o4K86l53L38R3j22
$$ -297 76 15 -103 61 -180 -257 46 -23 -17 108 -100 85 -194 -228 -15 -153 -194 -258 28 -325 13 106 -16
4840a6J26j89L4j54K13lj14n6K73j46P1j34R0j89L57j71j26J22k2k74O5j00K89
$$ -16 110 -79 -45 -199 14 11 -103 -159 114 -32 39 -95 -5 -194 163 -8 -134 -12 -34 -308 -243 -343 -54
4863e4Q3m3qJ1j72L4K08k29M00k71q0q8L5K70k78J31J23L1O5k91J09J53j68Ro1
$$ -54 29 -14 -22 -11 -183 -149 59 -170 230 -41 -121 -209 -174 96 -182 -51 72 103 168 -123 -14 139 -29 -20 -81
4888h1Q4n8J00k28N1K55L7m4k08l0K95jk95k0l0K45k06L12j48O7k09K33l11K10
$$ -81 3 -55 45 -183 -132 123 160 116 -92 -122 173 172 -123 -143 -173 72 -134 178 30 97 -112 121 -190 20
4912B0m9l5J32k84L76k24o3p8J70j32J22J55k71K95j29m10M01K10p6K47l11m1
$$ 20 -29 -64 68 -216 160 -64 -127 -205 -35 -167 -45 110 -161 134 5 -405 -4 206 130 377 66 25
4934B5j43J25K75m18K56l92K29k2J1J21l04L54m7k56O6L9J85k90J63p2M13o29
$$ 25 -118 7 282 -136 120 -272 -43 -65 -54 67 -237 117 70 -186 -120 -81 104 -186 -23 -95 318 -311
4956c11M94l00K6K87l89J23K3J64j14P3j79j41Q7j25L14J86r2m26L69J3j8k68
$$ -311 183 -117 -91 196 -193 -70 -47 117 3 76 -103 -244 -157 -282 32 218 126 -300 69 82 64 -204
4978b04J97j04JK04k29P3q4K13k58R1m5L05n3o0J19k88K42j1k12K20k82L43m09
$$ -204 -7 -111 -110 94 -135 -62 -146 67 -191 -100 -145 160 107 47 166 -122 120 109 -103 117 -165 178 -231
5001b31J88K3j11O1K2l2K46j30p6k08K06P4o7M0pP7K5j32K53l96J41nk68K72j51
$$ -231 -43 -20 -131 -70 -48 -80 166 36 -40 -248 -42 32 -35 5 -2 75 100 -32 221 -175 -34 -39 -307 -35 -186
5026a86L4J23o9K20n6M9l82J30k03K50n2J04o7J60L3Q8k9Pj29q1l04L82K07j18
$$ -186 -152 -29 -98 122 66 115 -267 -137 -340 -90 -142 -38 -105 55 88 176 147 154 25 -56 -360 22 229 111
5050A11l27O55k72o6j49J65O7k72J03PJ6N7k48L04j41R5nj88K32l7q3l3K37P5
$$ 111 -216 439 167 101 -48 117 184 -88 15 22 38 95 -153 151 10 105 100 -88 144 107 24 -9 228 303
5074C03k40j16J90n6q3q9J46k92R8K31k05J74k36J56L9j98K64J02k08lQ1m7Nj7
$$ 303 63 -53 137 81 -2 -91 55 -237 -139 92 -113 61 -175 -19 20 -178 86 188 -20 -23 58 11 16 -1
5098aP1k01j23L78J32k56j2R0q1J70k22L0L6M1m7l2j12j7P2M7J84j55m4K35k38
$$ -1 70 -131 -254 124 256 0 -12 78 -3 167 -55 -25 11 52 5 -27 -139 -156 -84 -37 147 -8 -52 183 -55
5123e5kK58j76j37J32j01J18J72l07j44L65j05L15l28j50L17l40J59j39o7L32
$$ -55 -57 201 25 -112 20 -81 37 209 -98 -242 123 18 333 5 -145 172 -168 -9 -148 -215 117
5144A17k2j24j71K37j99L47J3k61K3Q7k8O1n4K15l14n6L00O5k69L8J26OJ88o94
$$ 117 95 -29 -200 37 -162 185 198 -63 -40 47 19 80 26 241 -73 -129 171 236 -33 5 131 137 325 -369
5168c69K38J9m0p3K16n7P9j27L12q5n19J71L48j01j6L5k51J09R3j1K6k08K02M5
$$ -369 -131 -112 -152 -225 -9 -66 13 -114 198 113 -406 -235 113 12 -4 31 -220 -111 -18 -29 -3 -211 -9 36
5192C6k1j18m0L37j92K80m26K84j87P1o3K46j96%j28J22K67l83J00j23K81P0j32
$$ 36 15 -103 -143 194 2 282 -144 140 -47 24 -39 207 11 11 -117 5 272 -111 -11 -134 147 217 85
5215H5j82j41J69L0J52l73J52J55j83n3o9L73O4J00p12N11J56l89K12n8O4k74
$$ 85 -97 -238 -69 -39 113 -260 -108 47 -136 -189 -258 115 179 279 -433 78 234 -155 57 -1 63 -211
5237b11J85j08K11j35P7K21m01p9J80O5n9J38k91J34J54j7k8Q5j43K23j64J91
$$ -211 -26 -134 77 -58 19 240 -161 -240 -60 5 -54 84 -207 -73 81 64 36 121 -22 201 37 228
5259B28o4l46K44k2k38K31K0o1lK93n14O21l19j94K01k85Kj25L33j03K11K74l31
$$ 228 164 -182 62 40 -198 33 53 -8 -11 282 -232 389 70 -124 77 -208 -206 -331 2 -101 110 384 53
5282E3J42l31n1J70J98l87J69J66l73K24J26N5j48j56K27k6p3J46q3r5J82m5l
$$ 53 195 -136 -187 -17 181 -206 -37 129 -244 -20 106 161 13 -143 84 58 -15 131 48 -47 135 90 87
5305H7j74k3J00M5Q1k60J37L6k32K60oN0k54p2L50k72J83k8n4%n1P6L9o4J08n0
$$ 87 -87 -110 -10 35 116 -144 -7 29 -203 57 51 101 -153 -225 125 -147 36 8 -46 -46 -97 -21 18 -46 62 12
5331A2l0n2p1J25J33l44K5K46J24k56J04q8k32L21%k6j30J67M4K23k44p9m8J49
$$ 12 -18 -70 -141 -16 117 -227 -202 44 168 -88 16 -72 -304 17 17 -9 -139 28 72 295 51 -28 -76 73
5355G3k50N27k01J56k52q9J58p5n0J03j06J90p4j21K83k90m0K06l43J86L0n3K14
$$ 73 -177 350 149 305 53 -36 122 47 -3 100 -6 184 110 -11 272 -18 -58 148 -195 -9 21 -32 182
5378A82k01mK05r1j97K11J28j16k86J48R4o2l6Q6m24J02L33j6K3k04J90j01K6
$$ 182 -19 -23 182 91 -106 105 233 117 -169 -21 73 11 -25 61 -363 -261 72 56 79 -125 65 -36 -10
5401a0o7K03j76J88q2l73K03j69J14J80K7j15j7J09n6K64P3m39J75%q1L09k59
$$ -10 -77 126 -50 138 56 -317 -114 -283 -169 11 38 -77 -94 15 -41 223 296 -143 32 32 -49 260 1
5424Aj45K05j94K43l1j67j43K18O5m0j36N11l72m9J87j82l9J28j44k7J53J13K6
$$ 1 -144 61 -133 110 79 -88 -231 -13 52 12 -124 387 15 -34 153 -29 -68 60 -84 -111 42 155 181
5447A81l58J71K42j84r4n1j0n8M0K90j80j65J62J06J30k62j08J28P4j16j04Q6
$$ 181 -177 -6 236 52 -42 -93 -103 -161 -121 169 -11 -176 -14 92 222 -40 -148 -20 54 -62 -166 -80
5469h0K67l08K01Q7m71J97J25L3K09k21j79n2O2K17m04K63R6J08m9J19l67L12
$$ -80 187 -121 80 167 -304 -107 18 51 260 39 -140 -192 -130 87 -317 -54 42 150 101 220 -147 165
5491A65q4Q1q6k53M16k80J76M9k49m2r9L07o7n7r4J91L7Kk06L24k34k0o8o7p6
$$ 165 81 162 76 -177 239 -41 135 184 -65 -107 -206 101 34 -23 -117 74 111 113 -93 231 -3 -23 -91 -158 -234
5516b34J55K36j91K08k12K4J16j95J02K72n20K81Q2L6k33O8j79J65J7n5J17j13
$$ -234 -79 157 -34 174 -38 -14 102 -93 9 281 -239 42 124 160 -73 -5 -184 -19 -2 -57 60 -53
5538e3J10j06n9J5n5O5J59k7K3J40j78j72K27n5j71oQ5L16l17K7K52l71L32O1
$$ -53 57 -49 -108 -93 -148 -83 76 49 72 212 34 -138 89 34 -137 -143 -58 258 -59 -32 220 -151 181 242
5562B42l17j0Q5m4j27R2k17L76J72m11M46j74q9m9j29k9K38j32O0k34K85j73K30
$$ 242 -75 -85 0 -44 -171 -79 -296 80 252 -159 287 113 24 -25 -154 -183 55 -77 -17 -251 34 -139 91
5585I1r3Q1K62n53N5L48k64K17p4k1m4K34j77j90L77k7k50j94J40J01J47k20K02
$$ 91 -2 79 341 -212 -157 191 -73 144 70 49 5 239 62 -128 249 222 -28 -222 -82 19 166 -54 148
5608A48j47J55j52j73J22R5J39J69m17q2J27J29k11j18K44J40j79K31J21k42K13
$$ 148 1 156 4 -169 -47 48 187 356 -61 -143 -16 113 -98 -216 28 168 -11 220 341 99 312
5629C12k29j12L0k08J43j0j77M91l24P3k31N04k11m00L70Rk72L62j41J53k51K56
$$ 312 83 -29 1 -207 -64 -74 -251 240 -84 -11 -242 262 51 -349 21 30 -242 120 -21 132 -119 137
5651A37L8k74N7j25J09j18J29Kj14L52j48l00L92k71O7K88j02j89k1l21O60j03
$$ 137 175 -99 -42 -167 -58 -176 -47 -45 -159 193 45 -255 137 -134 -67 221 119 -70 -91 -412 248 145
5673A45k49Q8L2J37j59P0j17L7r3K96j89p6j85R8N45n03q6J93K83l34J00k31K74
$$ 145 -104 -16 16 153 -6 64 -53 -16 -109 187 -2 -78 -263 -165 380 -123 -209 -16 267 -67 33 -198 76
5696G6j0ql20K48J87j12P5k36K06j68n7L1PJ30k37K90J83l26N9q5K10m25L31N0
$$ 76 66 58 -262 -14 173 61 136 -100 106 -62 -119 -88 -81 49 -188 102 285 -41 18 -67 143 -282 49 99
5720I9p1K2K0M8o3J86k39o0J61m6l28L23j87J33k87Q7O3Q2K44l07K35l50L26L2
$$ 99 28 50 70 118 55 241 2 -58 103 57 -271 52 -135 -2 -289 -202 -139 -57 187 -120 115 -235 91 123
5744A23ml49J48JK78j24o4j2l09K80j20NL84k83j4L24r0r6l27L06j50J66n2l6
$$ 123 119 -230 -82 -81 197 73 9 -3 -312 -32 -152 -147 237 -46 -60 264 174 78 -249 57 -93 73 21 -15
5768a5m5J60J11k36Q4j76KK82j26j28n2L08k66J8K06l11J47J74k39l0K31Qjj7
$$ -15 -60 100 211 -25 59 -117 -115 167 41 -87 -139 169 -97 -79 127 -184 -37 137 -102 -132 99 107 106 89
5792H9l51M07l2L6j49K2k23J05J10Q0j15J82L6k76M9K17k94J26J0K89l62K62j24
$$ 89 -262 145 113 149 0 22 -201 -96 14 94 -21 161 197 -79 -30 187 -107 19 29 318 -44 218 94
5815I4r6j6J02k9O3k06Q6n6L15k79P8p7J86k65L9J41k25J37j71O5O1L5J23k7o9
$$ 94 -2 -18 84 55 118 -88 -2 -58 257 -22 56 -21 165 -100 -61 80 -145 -8 -179 -114 -53 -18 105 78 9
5840Ir5p3Q1K3j4L12k57j75L46k26R6J2q5L29k17P5j60p2m7J23q2P3J08J40l44
$$ 9 -86 -159 -78 -55 -69 243 -14 -189 157 -69 27 39 -46 283 66 141 -19 -91 -138 -15 -97 -24 84 224 -120
5865a20J02J79j83j8j08O4j1P9j25M6M3J94n1j88J13K9k02J48J57j83j18J24K31
$$ -120 -18 161 -22 -40 -148 -84 -95 -16 -141 -95 -52 142 91 -97 16 45 -157 -9 148 -35 -153 -29 202
5888B02N3j8l92k8k2J72q9Q1J17k10J54M0j92L19j45J05j81j92K08k1P9j60p7
$$ 202 255 237 -155 -183 -205 -33 -122 -41 76 -134 20 60 -132 187 42 147 -34 -226 -18 -39 40 -120 -197
5911a97L59n5n7K1k03r3L66j31J70O9k26L34j93n3j00r5R1oK2J38p25L51J54L5
$$ -197 162 107 50 71 -132 -225 141 10 180 249 23 357 164 111 11 -84 7 1 23 161 -564 -213 -59 -24
5935b4L08m38j1m9J49k27L03j49L83m28K01j48J12M9n5K49k72K9M9k02l3J70N9
$$ -24 284 -154 -165 -214 -65 -292 11 -138 245 -183 18 -130 -18 31 -24 225 -47 -18 31 -171 -204 -34 25
5958B5J3r9M4J89R3k93j72Q9K77k23l6L44M9l78L6O4j20K77k26NQ9J14k30O1L53
$$ 25 38 -61 -17 172 265 -28 -200 -111 166 -57 -93 251 300 -78 -42 22 -98 179 -47 -42 47 161 -69 -8 345
5983C45k08j28J64m0r2r9L7K77k69R6qP4j58K74l76L9L34l54L16o9q9l10M11j56
$$ 345 137 9 173 133 41 -58 -21 256 -13 83 75 149 -9 265 -111 -72 262 -92 224 155 66 -244 167 11
6007A1j24L97l50Q7K9o4K1J70m1k66m6Q1M8P0r6M7L43m17J28J40k05J0K05j22
$$ 11 -113 284 -66 21 50 -14 7 177 136 -130 -176 -95 -47 23 -73 -26 317 -100 28 168 -37 -27 178 56
6031E6j57j59K30nQ6o6j39K49N2o0k1j61QJ8L1K67M6l35O7j7k26L92l37k9K88
$$ 56 -101 -260 -30 -35 51 -15 -154 95 147 87 66 -95 -87 -69 -38 229 275 -60 7 -10 -236 156 -181 -210 78
6056G8k00k17K48J5M1l4k7K19o8K10l75K38k07PK8J84r7p4M6l9j38J2m6K88k23
$$ 78 -122 -339 -91 -76 -35 -69 -96 123 55 265 -110 128 -79 -72 -44 140 43 -31 15 -24 -162 -150 -196 92 -131
6081a31R5m8J98J7n3k4o7k08K39J24j12q9m2J29K7j9L6ML2r3j2j51m4K38K48m38
$$ -131 -36 -84 114 131 78 54 -13 -221 18 142 30 -59 -101 28 55 36 72 76 108 15 3 -148 -192 46 294 -144
6107a44M19j63k81J7K70l76J82L32k02n7J89j38j79J02o3J83j80J79l16L92k49
$$ -144 275 112 -169 -152 118 -258 -76 256 54 -3 186 48 -131 -29 -92 91 -89 90 -226 166 -83
6128h3J85o2%J63k87K14M8k08J80j87p4K09q0k8J5j08J16o3K44J43k47l99K80
$$ -83 102 40 40 203 -84 130 178 -30 150 -37 -111 98 18 -10 5 -103 13 -50 194 337 90 -309 -29
6151b9J77m12L71l27J4J29j54J55J48k14K06J8j48J53k44r3L23p8J06k84J40J69
$$ -29 148 -264 107 -220 -206 -77 -231 -76 72 -142 64 82 -66 87 -157 -250 73 -5 101 -183 -43 126
6173A26j17L4m14J23K32j5K53k20J2k81L00R8q9Qj40Q2k5j04Q1K10j0l5J5k23
$$ 126 9 43 -371 -248 -16 -31 222 2 14 -267 33 131 42 50 -90 -8 -33 -137 -56 154 144 109 124 -99
6197i9M6q3Rr3O8J21J36j24K6k30K2P1pK10j89J30k0o7k17K27P4k15R4J51q4R8
$$ -99 -53 -136 -127 -220 -152 -31 105 -19 7 -223 -201 -130 -137 73 -116 14 -6 -73 -290 -63 11 -204 -110 41 -43 55
6223E5j80q7M28k56P2m4P9j56j8j68J26M87k70n1k20N2L38k42J93m3j55o2j7J22
$$ 55 -125 -212 216 -40 32 -12 67 -89 -107 -275 -149 338 68 17 -203 -151 187 -55 138 95 -60 -122 -139 -17
6247a7Kk45K24l57K58J60j58L30o9r1k32J42j81L23j43J71k56K68m6p3M2j79J87
$$ -17 -15 -260 -36 -393 -135 25 -133 197 128 37 -195 -53 -234 89 -54 117 -139 129 83 10 52 -127 60
6270F0K2j01K2L6m36K16J71J9q8m6lK09j93M4L50l63L43j72m44N38m96L62L5r2
$$ 60 82 -19 3 39 -397 -181 -10 9 -79 -125 -128 81 -112 -68 282 -81 262 90 -354 184 -312 50 85 -7
6294gJ55j49N3k20P0L87k72J57l18j52N14j91j07J95J67k56k40O7L19j00N3j89
$$ -7 148 -1 52 -168 -98 289 17 174 -144 -296 218 27 -80 115 282 26 -214 -147 172 72 125 -64
6316f4j8K32o8k27Q2j17J17o8J98j60J33k32L16k51K04l70J78K86j66K16k58J67
$$ -64 -82 150 82 -145 -63 -180 -63 -131 67 -93 40 -192 124 -127 77 -293 -115 171 5 221 -37 130
6338A30k69L34j50k2J5l52K11P3K9M0J53k64P4M7k5J03k77PK37j36J78j1j96K40
$$ 130 -139 195 45 23 38 -314 -103 -30 -1 39 192 -72 2 49 24 127 -150 -143 94 -42 136 125 -71 169
6362A69r4N5k67J52qN4p1J75j25R1k30L60l23J29j33J93l24M21j99K23m16K22
$$ 169 75 130 -137 15 7 61 -10 165 40 131 -99 261 -62 67 -66 127 -197 224 25 248 -168 54
6384E4J86l08L31l98L16n5l8j53J97N7j28J2j77o7j5J03K04l39M4J29k95M87r2
$$ 54 240 -68 263 -135 181 126 88 -65 132 189 61 73 -104 -171 -186 -83 121 -218 -174 -45 -340 147 55
6407E5L7j05j04J5O5J30J17j94o0J16k21J41J08o6L1o6L2l10K11K69k67K05j76
$$ 55 92 -13 -117 -102 -37 93 210 16 -44 72 -149 -8 100 34 65 -1 31 -279 -68 201 -66 139 -37
6430c7q9K32K49m12J76P6k12k8J71q5Q6k32m07P16m9n8m1k90L65m8q4m5K1j10
$$ -37 -126 106 355 -57 119 195 -17 -45 126 41 127 -105 -512 204 155 97 56 -234 131 83 -1 -46 -25 -135
6454a35K76k18p6R4K86k81K64j88P1N4m15P3K16k6q3J46p7q5Q4p9K23L2m85L38
$$ -135 141 -77 -153 -59 227 -54 210 22 93 147 -268 -195 21 -5 -88 58 -19 -104 -20 -99 124 156 -329 9
6478IR2l9o3m1j47J40N9K29l21m0K20k95K53m5k19J39k9K03k12l2J65O5p4K32
$$ 9 101 62 -1 -42 -189 -49 10 239 -82 -122 98 -197 56 11 -208 -69 -98 105 -107 -139 26 91 17 249
6502B49m8l80N3J74J39k30M5q1j10K09P8k45N0K55l92J64n0jK48k13L8J48k18
$$ 249 201 -179 -126 48 187 -43 2 -79 -189 20 98 -147 -97 158 -234 -70 -120 -121 127 -86 -48 100 -118
6525a18N2N8k30J27K85l31K09j96L53l05M3O3P8L6j45M0j23J39k6j12K73j54R0
$$ -118 -66 -8 -238 -111 174 -157 52 -144 209 -96 -53 10 88 124 -21 19 -104 35 9 -103 170 16 106
6548A06p1p3j16J50J69j12j54J62j2n6l1j18K7J75j1R6j86M4M8J16o3k29K05k4
$$ 106 35 -38 -154 -4 165 53 -101 61 49 -7 -38 -156 -129 46 35 131 -55 -11 37 153 90 -139 66 42
6572D2N6j14J44k37Q6M8q1j29J1Q3j57K73Ll9r1P6l8R5k35L04j39j16J08J77m2
$$ 42 98 -16 128 -109 -23 25 -56 -185 -174 -91 -248 25 28 -11 -102 -26 -64 31 -204 100 -39 -155 -47 130 88
6597H8l9L01j02j87n3p1J6J31k41j62K98rK1j62J83J1K50l34J00j31q4M00l23
$$ 88 49 350 248 61 8 -63 -47 84 -157 -319 -21 -30 -9 -171 12 23 273 -61 39 -92 -176 224 -99
6620i9J98k62j62L98j63P7J90j65k7j25J30R3j58J1N9O2k15J70m2j22M27l03J77
$$ -99 99 -163 -325 73 -90 -13 177 12 -15 -140 -10 83 -75 -64 -5 57 -158 12 -30 -152 275 -28 149
6643A49Q5m04K94m2P4k58J67m7MK98k52O4k92Q8J64j6k14K18j21lj72K05j44J01
$$ 149 234 -170 124 82 156 -102 65 18 22 320 68 132 -160 -72 92 76 -138 80 -41 -44 -216 -11 -155 -54
6667e4J70Q3l87L65j73M3J3J59l51o1K62l10K20J00j0j29Q3kj74j3K51J80m88
$$ -54 116 199 -188 177 4 47 60 219 -132 -193 69 -241 -21 79 69 -60 23 21 -153 -166 85 265 -223
6690b23K09j82K07k1jr7K9mK82k37K7j02Q8j8qRl4J00l45L83J48k03j39J29L3
$$ -223 -14 -196 11 -10 -11 -108 -79 -83 199 -38 -11 -113 -25 -43 -51 -42 -76 24 -321 62 210 7 -132 -3 30
6715C0J93j34j24k51K06j55PK85P5r3k94L44jm51N24k16K14q3j67K8M7j11R0P8
$$ 30 223 89 -35 -286 -80 -235 -228 57 132 39 -255 89 88 -363 161 -55 159 76 -91 -63 -16 -127 -37 41
6739D1J2k91J7N47l36L8r5M0J55k78p5J35N4J54j18j3r9K9K33j06K8o2K6J62j40
$$ 41 53 -238 -221 326 -10 28 -67 -27 128 -150 -225 -90 -36 118 0 -13 -112 -83 150 44 72 10 36 198 58
6764E8J30j52j95L99m75M8L81l8m01J94r3K21J0M1l21N7J34Q1Q3m7r0o2K1J42
$$ 58 188 36 -159 240 -235 -187 194 156 -245 -51 -144 77 87 128 -193 -136 -2 79 162 115 25 -37 -16 126
6788A26J22j19k97L60Qj74n4n2K83k17Q9j45J52k34J85O3L0j14K30k68j33K84
$$ 126 248 129 -168 192 200 26 -28 -80 203 -14 75 -70 82 -152 33 96 126 12 242 -26 -159 125
6810A25j21m1J14k44L02j50O5j91J47Ok96J99n2J05o8M7L57l54m3J71k47J72k25
$$ 125 4 -37 77 -167 135 -15 50 -141 6 12 -284 -85 -137 -32 -100 -53 304 -50 -93 78 -169 3 -222
6833b22J12L2K5R5o5J6K01j92o3N0J38k37k6R2J49R7j90k65J57k7K73r0k86K81
$$ -222 -110 -78 -53 42 -23 -7 194 2 -61 -11 127 -110 -136 -44 105 202 12 -253 -96 -123 150 60 -226 55
6857E5J9P4k70J63j57J37j06R1J64k62n3K40p9M8k26P5K91n18J60P3J36M1j13
$$ 55 74 148 -122 41 -116 21 -85 6 170 -92 -145 95 16 64 -162 -87 204 -314 -154 -81 55 96 -17
6880a7k6P9j27nJ18j71J0L38j69P7k16J35m7r6J61J6q3o6J23j0n3q3N4n4O5J52
$$ -17 -43 36 -91 -96 22 -149 -139 199 30 107 -109 26 -21 -117 44 60 -23 -89 34 24 -29 -112 -58 -112 -47 105
6906A05l04K50j75KK80j78k5m6K75l18n3j54K11O0kl4q6M36j98r2J16pn4r3J24
$$ 105 -199 51 -124 -122 158 -20 -45 -91 184 -134 -187 -341 -130 -70 -72 -106 -192 244 46 -46 70 63 9 -84 40
6931D0j42L45j09r1J26J51l55R1k1L7J1l07J78j81J06P5J27j80k1L00l46L45l32
$$ 40 -102 243 134 43 169 320 -35 56 35 72 83 -224 -46 -227 -121 -46 81 -99 -120 180 -166 179 -153
6954a53J06J00pl8l6j47K34j20L3J93j26j16L78q1l18J25K80l62P3j78L04k24
$$ -153 -47 53 46 8 -28 -175 59 -61 -28 165 39 -77 301 220 -98 27 307 -55 18 -160 144 -80
6976h0J45R7k39J91l48K59k79K95J8j12K0q9K20k18J98j67L6n4oj3P2J57j3r8
$$ -80 65 162 -77 114 -234 25 -254 41 59 -53 -33 -122 98 -120 78 -89 -53 -107 -113 -126 -54 103 90 -8
7000hn3J55j32J96k69J11J28l11J17K12j79n5K12rj44J68l82M5J57N1p9L1O3k35
$$ -8 -61 94 -38 158 -111 0 128 -183 -66 146 -33 -88 124 115 -29 139 -243 -198 -41 10 -69 -38 25 -210
7024b10J19RL2J57k25K87j50j55n2K62j41OJ27k08L12l46L49j83k5K44j67j68
$$ -210 -91 -82 -50 107 -118 169 19 -136 -188 74 -67 -61 66 -142 170 -176 173 -10 -35 209 42 -126
7046a26l8l4M63j84n4L7Q2k5O7k8k95K75l85L39l42K28L10j77l28K59K39Q1k72
$$ -126 -164 -198 265 81 27 64 146 121 188 160 -135 140 -245 94 -248 -20 290 113 -215 44 283 364 92
7069I2j74m7R0n2J41p0j18j00L42k9k29K87j65O3J55j61j16K6J43j12J8J0K23
$$ 92 -82 -129 -39 -91 50 -20 -138 -238 104 75 -154 133 -32 31 186 25 -91 -65 78 -34 -16 -6 217
7092B17l06L06j69r7j7J58J63j54J09j44j28J98K51l71J11k30o3K07L1j37k7k40
$$ 217 -89 217 48 -49 -66 92 255 101 210 66 -62 136 387 16 127 -103 -166 41 72 -65 -92 -332
7114c32L95j95K04j44o4N0K10L6l5k77K56k10Q4j16K24J62l30N7Mj03K13j26p5
$$ -332 63 -132 72 -72 -136 -86 124 160 125 -152 104 -106 -22 -138 86 248 -82 -25 -21 -124 89 -37 -112
7137a12O0J08o5j39k15M27m1n1q7LN6q6L25p0J49k53PJ6K50l39K27m2k19K6p2
$$ -112 -52 56 -9 -148 -363 64 23 -28 -115 -112 -56 -142 183 113 262 9 16 32 282 -57 170 128 -91 -65 -137
7162a37O8K58j30N3j96J63J36k76M1J15O9J4l2j29j3j23J28Q3k4j11N5J92l59
$$ -137 -69 189 59 112 -84 79 215 -61 -20 95 164 178 146 17 4 -119 9 92 68 -43 12 204 -155
7185a55L2K19k43R5m2nQ8k20R0j91M50p1Lj48Q9j5nL5M7k6J05l59Q2K53Kl22J34
$$ -155 -123 96 -147 -52 -94 -99 -11 -231 -141 -332 118 47 50 -98 -9 -24 -29 6 53 27 132 -227 -145 108 110 -212 -78
7212g8J7j70K29J05j23j03R9Q9j76K81k82J6j08J84Q4j23o7K47N3k37k0q2M4J41
$$ -78 -61 -231 -2 103 -20 -123 -24 65 -111 170 -112 -96 -204 -20 64 -59 -126 121 174 -63 -83 -165 -121 20
7236B0k36R0l4m6K99k09j22K05o3o2K21q5J63K2l39Q8o1Q2P5r8K97k88K38J11
$$ 20 -216 -126 -160 -206 93 -116 -238 -33 -96 -158 63 -22 141 163 -176 -88 -149 -67 8 -90 207 -81 157 268
7260B68l95R0m4Q5n5J36Lk50K62Jj94J0L1j22L31k13Q1N5l4J81j30p1M0j66j22
$$ 268 -127 -37 -81 4 -51 85 88 -162 100 101 -93 -83 -52 -174 157 -56 25 80 46 227 97 26 66 -100 -222
7285b22N07j39l53J15O2Kqj11J4NL32j80J82l25L11k93q4K49qM1l33p7K44q5M8
$$ -222 285 146 -207 -92 -30 -28 -36 -147 -133 -128 204 24 206 -119 192 -101 -185 64 56 97 -236 -313 -69 -154 -106
7310a06j43L43j37L1N9J01j89J86J4l96L81m98J61J82K07r4l47J35K30n9J36j82
$$ -106 -249 94 -43 -12 47 148 -41 145 159 -237 144 -354 -193 -11 196 102 -245 -110 120 61 197 15
7332A5j72L48p0k69K47n0k17O16l62k50J19O3J60k13K93k13j64K73k21Q9k84N
$$ 15 -157 191 121 -148 99 49 -168 448 86 -164 -45 18 178 -35 258 45 -119 154 -67 22 -262 -257
7354b57K05M4K8m6J3j68J2J89k19L27k95j36J33L23J29l70Pq4M62l60m9O0J30
$$ -257 -52 -8 20 -26 -13 -181 -169 20 -199 128 -167 -303 -170 153 282 -88 -81 -165 297 -63 -112 -52 78
7377G8Q9q1k58J41K69l11K36k80J60j06K2K42k62L81m55l9L69qJ46k76j23K20
$$ 78 167 86 -172 -31 238 -73 163 -117 43 -63 -41 201 -61 320 -135 -174 195 187 333 57 -66 154
7399A54k88J3p%j50M09l60L55k23K05k71K32J36l55J03K38l58K46r0j21Q3J64
$$ 154 -134 -121 -128 -128 -278 131 -229 126 -97 108 -163 69 205 -150 -47 191 -167 79 -11 -132 -49 115
7421A15r4j04J04J43k61L12k64j35l9Q4J24J88j69q2r7P6K12j93P8R3R9J9l01
$$ 115 21 -83 21 164 -97 215 -49 -184 -223 -139 -15 173 4 -78 -175 -99 113 -80 -2 91 190 209 -92
7444i2R8Jl4O5j14r5J25J32n38M67ok61J99J92k59K36J8j46J59mj93k43N42j69
$$ -92 6 7 -27 38 -76 -171 -46 86 -452 15 9 -252 -53 139 -120 116 134 -12 147 143 -50 -293 249 80
7468H0o9K55k34n8J42k85K7N49m33J62k40n3L46l57R0K16P2k44j72K45QO1k99
$$ 80 11 266 32 -26 116 -169 -142 407 -26 136 -104 -157 189 -168 -78 138 210 -34 -206 39 47 108 -191
7491a91J88N3k15K90k36J94k07K78r8k3m32M13J4o7J42o3K38k65l43K98J28K5
$$ -191 -3 50 -165 125 -111 83 -124 154 56 33 -399 14 28 -39 103 40 278 13 -330 -32 96 121
7513A21j77K12k36K0L68k23Q1l13R1L5J85r0q9J09q4K6o0J37j32P0j09J19j09
$$ 121 -56 156 -80 -60 308 85 166 -147 -56 -21 164 74 -15 94 10 36 -24 113 -19 51 -58 61 -48
7536d8j17L05l06J73J56r2j22K72o0j0k19K29r6K03k97j36K10J6k06K1j9L24J35
$$ -48 -165 140 -166 7 163 71 -51 221 161 151 -68 161 65 268 -29 -165 45 61 -145 -124 -143 181 316
7559C16j81k22k0J43Q4m10K31j63R0K89k19N9JK00k65J48J0o5K19j15j06p7O9
$$ 316 135 -87 -107 36 120 -290 -59 -222 -132 157 -62 -3 -2 198 -67 81 91 26 245 130 24 -53 16
7582A6J21Q1k13k25J08J11K21j9j07m2M3k10l8J30J86O2j73p5j04K8O6j50L59
$$ 16 137 218 5 -220 -112 -1 220 201 94 52 95 -115 -153 -23 163 225 52 -23 -127 -99 -33 -183 176
7605A76l91K43j0k5j0J66j42j08L81j29r7r3J74j71K76l08k8J29J16k35M16k47
$$ 176 -215 28 18 -7 -17 149 7 -101 280 151 54 -39 135 -36 240 -68 -96 33 149 -86 330 83
7627H3J07M3k31J11k84K84j4j75J0L4k1K19k29K6J3J63l75P9K56k65K12k85K72
$$ 83 190 233 2 113 -171 113 99 -76 -66 -32 -53 166 -63 -37 -24 139 -236 -157 99 -166 46 -239 33
7650C3j85j38K56J59j19J1No7n0J97r1k9J9P7R0M7j97J12JM5p9J64l49j41O0J85
$$ 33 -152 -290 -34 125 6 17 22 -45 -95 102 11 -18 1 78 168 215 18 130 131 176 97 261 -88 -229 -169 16
7676A6k22L73j58m9Q3J2k70K45j58l6L41k83j8Q1J82q1k11J19K1l9l2nK70k27
$$ 16 -206 167 9 -40 43 55 -215 30 -128 -164 177 -106 -124 -43 139 58 -153 -34 -13 -52 -84 -89 181 -46
7700d6J52q4O4M9j88K45k9j46J27j07O2k02K33k55J78N6Qj63j21P3o9M70n24M07
$$ -46 106 22 86 135 -53 192 163 17 144 37 99 -103 130 -125 53 109 117 -46 -167 -94 -163 307 -217 190
7724A90k24k9O8n2O5j79K00j11l5l9J36j03L72j32n7K9N8k40J38k70K28Q0J49
$$ 190 -34 -63 5 -47 18 -161 39 -72 -107 -146 -10 -113 259 127 70 99 157 -83 55 -215 13 93 242
7747B42k49l15M03J39j69l19M00o1j21O6j32n5J42l0K88j05K49n27R0K93q5j40
$$ 242 -7 -322 81 220 51 -268 132 71 -50 16 -116 -171 -29 -59 229 124 373 -154 -64 229 144 4
7769Dj98L32j99K2j56j29M85O9k63j15J72j04J44j17rL05m18J38q2J03o4K01j06
$$ 4 -194 138 -61 -39 -195 -324 161 230 -33 -148 24 -80 64 -53 -62 243 -175 -37 -119 -16 -80 121 15
7792A5o4J68m0o3L6J27k9N4j54J17Q9j60l2j04Q0J9o5p8P0J73l64L34l64J04J2
$$ 15 -49 119 79 16 52 179 150 204 50 167 256 96 64 -40 40 59 -6 -84 -14 159 -205 129 -235 -131 -119
7817a19J46L5j57J4K0K30rK1m16M12k24P3N2m12M10j88p7J87R3n2j71K9J68j3
$$ -119 27 62 -95 -81 -61 169 160 181 -235 177 -47 26 78 -334 76 -112 -189 -2 91 39 -132 -103 65 52
7841E2r3Q0j5J73O8n24M02j67kj6q4Q8J99J1k58p4K63n1l7MM8j13QP4j63n6q2
$$ 52 -41 39 24 197 265 -259 143 -24 -26 -42 -126 -38 161 172 -86 -160 103 52 15 19 67 -46 -38 36 -127 -183 -265
7868b65J31K80l69J01R3K3J63nl8j66k47J94o8K40k80J13N3j09J37J68j28K0m5
$$ -265 -134 146 -223 -122 -29 -6 157 152 114 -52 -299 -105 -173 67 -213 -100 -47 -156 -19 149 21 41 -4
7891dJ71k27j45J01L37m31J82%J43N4j77J92l29r2M35l43m7K15o0qN4Jm31O70
$$ -4 167 -60 -205 -104 233 -198 -16 -16 127 181 4 196 -133 -225 210 -133 -180 35 -25 -33 21 22 -409 261
7915B61k10l6j59j9J60N2n9J49p6k82J48Q4K6m6o1j11mJ94j47K98j37j25J62k14
$$ 261 51 15 -144 -163 -3 49 -10 139 63 -219 -71 13 39 -7 -68 -179 -183 11 -136 162 25 -100 62 -152
7939a52R4L4N3n2j29J3j32L14j9j9O6j06mJ87k65J15k8L0m6j41J99K94l29j67
$$ -152 -58 -24 29 -23 -152 -139 -271 43 24 5 71 -35 -39 148 -117 -2 -30 0 -46 -187 12 306 -23 -190
7963a90K49k69J20q4O1J06n7L61k99J23k86J22J38j32N5J03K6mj91J84J3k44J86
$$ -190 59 -210 -90 -174 -113 -7 -64 297 -2 121 -165 -43 95 -37 18 121 147 143 -48 136 149 -95 91
7986I1O5k52O5p4L8J64o3P5m76K52JK26R8l65K54m56M93l2K8l8m1j43O2j40J68
$$ 91 156 -96 -31 -105 -67 97 34 109 -367 -115 -114 112 210 -155 99 -357 136 104 132 94 53 -90 -28 -168 0
8011@j6p8J93l4L7p5Q8j40OO0j52K72j6k91J96k9K40k88K76m02L44l87j0J99j06
$$ 0 -16 -94 99 65 102 27 115 -25 -19 41 -111 161 145 -146 50 21 261 -27 249 -153 191 -196 -206 -7 -113
8036a13L04m95M98k02R4j32J41k90K55j17j48J92KN1o7r1m6J81k05J99O9m7N3
$$ -113 191 -304 194 -8 86 -46 95 -195 60 -57 -205 -13 -11 40 -27 -118 -164 17 -188 11 80 33 86
8059H6r7j02L82m06n8L22p0k68K61o9r6KJ08j16J64n4K14j28l6l5O6k37j2J18
$$ 86 -11 -113 269 -137 -195 127 57 -211 50 -19 -115 -113 -5 -121 43 -11 203 75 39 4 70 -167 -179 -61
8083f1L47l16J77k22j09L82k50K31j02J30r5k41J99m4N8j05M6o0j15J30K19j83
$$ -61 286 -30 147 -75 -184 198 -52 179 77 207 112 -129 70 26 84 -21 25 -35 -150 -20 199 16
8105A6j97J29J14N6k95J11J43Q2j36j73m7J71r4K99J09l48M6J17l06%L79k7m02
$$ 16 -181 -52 62 118 -177 -66 77 159 23 -150 -197 -26 -120 179 288 -60 -14 103 -203 -203 176 149 -253
8128b53J70NL32q8k09L33k19l52M02m6N9k11k1O4J8n2J7K23j43j44R9j02j30K33
$$ -253 -83 -78 254 166 -43 290 71 -281 121 75 134 -77 -98 -34 -16 -68 -51 172 29 -115 -16 -118 -248 -15
8152a5L57k97k29J23lJ35l4n2J76O8l90J85J85j10J07j60j79L2r6R9J78l2l0q9
$$ -15 342 45 -184 -61 -64 71 37 -15 161 229 -161 24 209 99 206 46 -133 -101 -197 -98 80 48 18 -71
8176g1J68N9k52J73k30MJ94nl10K88K37l54m1k7J17
$$ -71 97 156 -96 77 -153 -149 45 40 -270 18 255 -99 -140 -167 -50
8191e0
$$ Imaginary data points
##PAGE= N=2
##DATA TABLE= (X++(I..I)), XYDATA
0@%%%%%%%%%%%%%lJ1j6J6j6J9k7L2m0M8n6O4p2Q8j04J20j36J52j73J99k26K55
$$ 0 0 0 0 0 0 0 0 0 0 0 0 0 0 -3 8 -8 8 -8 11 -16 16 -24 24 -32 32 -40 48 -56 64 -72 80 -93 106 -120 135
35A35k87L22l61M04m52N04n61O24o89P62q45R32j028J133j249J376j514J669j841
$$ 135 -152 170 -191 213 -239 265 -296 328 -361 401 -444 488 -540 593 -656 720 -794 875 -966
54i66K033k249K496k777L100l479L931m483N172o057P246q942J1573j6248K7130
$$ -966 1067 -1182 1314 -1463 1637 -1842 2089 -2394 2778 -3279 3967 -4975 6598 -9650 17480
69A7480j05057m7003J13360M41j4395l3107J01J4058L7843R609O418K3979L7658
$$ 17480 -87577 -134580 -21220 -20779 -35174 -68281 -68180 -54122 -16279 -6670 -252 23727 61385
82F1385j5072k8241J0985L1756r072k7570j5694J8527K9557k125n0635m7503O4
$$ 61385 46313 18072 29057 60813 51741 24171 8477 27004 56561 54436 3801 -43702 -43638
95d3638L6868J5587j5568j5031K174N618k316j3090O253L8254K4083j9906j8473
$$ -43638 -6770 8817 -6751 -21782 -19608 -13990 -16306 -29396 -23143 15111 39194 19288 815
108H15J7300K7582L272j7026j2852N765K4078J7440k7473m2201K320K1568j2754
$$ 815 18115 45697 48969 31943 19091 24856 48934 66374 38901 -3300 -980 20588 7834
121G834k4774K68Q782p767j9502j7632n484J5064K2134q687k8952O813L4698Q210
$$ 7834 -16940 -16672 -7890 -15657 -35159 -52791 -58275 -43211 -21077 -29764 -58716 -51903 -17205 -8995
135h995j6000m080J6919K3501J0243o434p669Q533J7259l49j9251k689J7009N812
$$ -8995 -24995 -29075 -12156 11345 21588 15154 7485 16018 33277 32928 13677 10988 27997 33809
149C3809j6337k2635q515J3615R509j7061k0711L616J6565J846j3829n016J0625
$$ 33809 17472 -5163 -13678 -63 9446 -7615 -28326 -24710 -8145 -6299 -20128 -25144 -14519
162a4519J4848R297n612q855J4679K4564m365j8945L541J9369N273j2756j2459
$$ -14519 329 9626 4014 -4841 9838 34402 30037 11092 14633 34002 39275 26519 14060
175A4060l440L266N479q720k3065l990J6777j641k2434r571J0597J0438l378r782
$$ 14060 10620 13886 19365 10645 -12420 -16410 367 -1274 -23708 -33279 -22682 -12244 -15622 -25404
189b5404k933Q785J3793K617j2008j389J8257J1950p256q934L366J2801O813r687
$$ -25404 -28337 -19552 -5759 -3142 -15150 -16539 1718 13668 6412 -2522 844 13645 20458 10771
203A0771j1268M621J2502l95j5305q400P260P299l135j0198q592N049J2806m498
$$ 10771 -497 4124 16626 16231 926 -7474 -214 7085 3950 -6248 -14840 -9791 3015 -1483
217a483j5557K3J5806N852r496n933O176R460N218k437q818K192J6314M461j4861
$$ -1483 -17040 -17017 -1211 4641 -4855 -10788 -4612 4848 10066 7629 -1189 1003 17317 21778 6917
232F917p462J0277R003o237j0782l032M066L283l649j2453n163J0609O055j0447
$$ 6917 -545 9732 18735 12498 1716 -1316 2750 6033 2384 -10069 -15232 -4623 1432 -9015
246i015j0520M250J0715L810p367n713O220J2179K746q444m154R593Q721k974
$$ -9015 -19535 -15285 -4570 -760 -8127 -13840 -7620 4559 7305 -1139 -5293 4300 13021 10047
260A0047p146k392N570O918m412j2783j382J0609L601j0464r034M814P414j90
$$ 10047 2901 509 6079 12997 8585 -4198 -5580 5029 8630 -1834 -10868 -6054 1360 1170
274A170m967n440J990R898L018r865n910R862Q892n224q708J279P646L116l455
$$ 1170 -3797 -9237 -7247 2651 5669 -4196 -10106 -244 8648 3424 -5284 -4005 3641 6757 3302
289C302o806k059Q508O355p686q487L811R165N50p947m065N077O559m72p954m287
$$ 3302 -3504 -5563 2945 9300 1614 -6873 -3062 6103 6653 -1294 -5359 -282 6277 5805 -2149 -6436
305f436O695O291m694q096n25O445M396m261q117P10R169L427o922n942M972Q566
$$ -6436 259 6550 1856 -6240 -6765 -320 4076 -185 -8302 -7592 1577 5004 -1918 -7860 -2888 5678
321E678q75n567j877L148O396P32p367m400O462O899n062q831Q68P207J336n450
$$ 5678 4803 -764 -2641 507 6903 7635 268 -4132 2330 9229 4167 -4664 -3796 3411 4747 -703
337g03m656l9N313M106n633o820L698Q005m85p556k372O082N127j955m989j780
$$ -703 -5359 -5398 -85 4021 -1612 -8432 -4734 3271 2786 -4770 -7142 -1060 4067 2112 -2877 -4657
353d657N460N873l136o612J241O692K939l948n396J612O501J438o036n390L158
$$ -4657 803 6676 3540 -3072 -1831 4861 7800 3852 -1544 68 6569 8007 1971 -3419 -261
368b61O221k440p495j741K930L322j688o516k214N334N222l409o510J902Q078
$$ -261 5960 3520 -3975 -5716 -2786 536 -1152 -7668 -9882 -4548 674 -2735 -9245 -7343 735
383G35K183m061j766L020N219K519l859m196K861O276j038p303l002M535K870
$$ 735 2918 -1143 -2909 111 5330 7849 3990 -206 2655 8931 7893 590 -2412 2123 4993
398D993m562n765j139L535K687l448n295M59O540K531l390l091L396O846J246
$$ 4993 431 -5334 -6473 -2938 -251 -3699 -8994 -8535 -1995 536 -2854 -5945 -2549 4297 5543
413E543l283k112M166O188q14n801n72M138K691l310n433j698L298K032m344o714
$$ 5543 2260 148 4314 10502 9688 3887 3315 7453 10144 6834 1401 -297 3001 5033 689 -6025
429f025j59N394J5n882l249K843L825j4l344j786L244N408M08m933l85O216L999
$$ -6025 -6184 -790 -775 -6657 -9906 -7063 -3238 -3252 -6596 -8382 -5138 270 678 -4255 -4640 1576 5575
446E575k926l766J883M274J626k845m447P23L684J039n354m429J959L912k057
$$ 5575 2649 -1117 766 5040 6666 3821 -626 97 3781 4820 -534 -4963 -3004 908 -1149
461a149m766j438K859L334q44m492L83N535L650j877k336K126N729K494k087k400
$$ -1149 -5915 -7353 -4494 -1160 -2004 -6496 -6113 -578 3072 1195 -1141 985 6714 9208 7121 4721
477D721J627M871O44n259k928K427J934k921n383k297J314J198k653m990j967
$$ 4721 6348 11219 11863 6604 3676 6103 8037 5116 -267 -2564 -1250 -52 -2705 -7695 -9662
492i662L642K742l441m204K896M798J198j497j277L068M313Q93k158j888L149
$$ -9662 -6020 -3278 -6719 -10923 -8027 -3229 -2031 -3528 -4805 -1737 2576 3469 1311 -577 2572
507B572M051j939m573o54K634J143k474m222q63K585R38k905l544R85L961M44
$$ 2572 6623 4684 111 -543 2091 3234 760 -3462 -4325 -1740 -802 -3707 -7251 -6266 -2305 -1861
523a861k570j181K707L969J129k552o03M279L650n90k837N48L542J933k050l029
$$ -1861 -4431 -5612 -2905 1064 2193 -359 -962 3317 6967 6377 3540 4088 7630 9563 7513 4484
539D484l09K314J238l632m675J158K395j773m174k194J175K000j373k705j779
$$ 4484 4175 6489 7727 4095 -580 578 2973 1200 -2974 -5168 -3993 -1993 -3366 -6071 -7850
554g850K622L091n55l399R82M231K221j312j552J342L240J609k177k259R97L046
$$ -7850 -5228 -2137 -2692 -6091 -5109 -878 1343 31 -1521 -179 3061 4670 2493 234 1231 4277
570D277q42l592k349J602J147j568l314j832K112K068j472k631N19L511K030j082
$$ 4277 3435 -157 -2506 -904 243 -1325 -4639 -6471 -4359 -2291 -3763 -6394 -5875 -2364 -334 -1416
586a416p77J939L263J956j147j299K046L559k73k943j252K184J272k280k784j550
$$ -1416 -2193 -254 3009 4965 3818 2519 4565 8124 7851 4908 3656 5840 7112 4832 2048 498
602D98R88J000k114m063k50K705M42k814j893J386K732J28j602p01J625K674P08
$$ 498 1486 2486 372 -3691 -3941 -1236 -794 -3608 -5501 -4115 -1383 -1255 -2857 -3558 -1933 741 1449
619A449k592n33K999J834q91k191Q6J491J336j764k628k15J931O66k723k650J425
$$ 1449 -1143 -1676 1323 3157 2266 75 161 1652 2988 1224 -1404 -1619 312 978 -1745 -4395 -2970
636b970J959m43j699j538J367K816m33k032k40L214K079j087j072Q36K422J492
$$ -2970 -1011 -1454 -3153 -4691 -3324 -508 -941 -2973 -3213 1 2080 993 -79 757 3179 4671
652D671m02k271K99K699M73k977j590J079J199j210k544j158K91J360q38k366
$$ 4671 4269 1998 2297 4996 5469 2492 902 1981 3180 1970 -574 -1732 -1441 -81 -919 -3285
668c285r14K091J634j267j603N31K548J151r38r48R81K355O02j696j239J578J645
$$ -3285 -4199 -2108 -474 -1741 -3344 -2813 -265 886 -52 -1000 -19 2336 2938 1242 3 1581 3226
685C226r02j938j124J012P84p67k581n08J449J265j335j849Q13J755O35j131q92
$$ 3226 2324 386 -738 274 1058 291 -2290 -2798 -1349 -84 -1419 -3268 -2455 -700 -65 -1196 -2088
702b088N50K583M88j604r38J448K022k61k187P9J582Q08n79j622o69J621Q32j541
$$ -2088 -1538 1045 1533 -71 -1009 439 2461 2200 13 92 1674 2482 1903 281 -388 1233 2065 524
720E24k029P13J754n9j839j097R15J132L65j974p36J460J716p68j428J88J111
$$ 524 -1505 -792 962 903 -936 -2033 -1118 14 379 -1595 -2331 -871 845 77 -1351 -1163 -52
737e2J035l70j077j54J746P97q76j705P82J369K82j473r97M58J174j9j662p33
$$ -52 983 613 -464 -618 1128 1925 1049 -656 126 1495 1777 304 -693 -235 939 920 -742 -1475
755a475R81J423n75k161J61J465O06m28q71r4J500Q83r22j388P24J616K05j536
$$ -1475 -494 929 354 -1807 -1646 -181 425 -3 -874 -968 532 1415 493 -895 -171 1445 1650 114
773A14j141J321O89l2j218r42Q16J497r75j226k3J242M14p14r72K09J091O54o97
$$ 114 -1027 294 983 951 -267 -1209 -393 1104 129 -1097 -1120 122 536 -178 -1150 -941 150 804 107
792A07j346L98J812k04j659j77M06J597m63j236m80J173J222m31j359q2J657N89
$$ 107 -1239 -841 971 767 -892 -1069 -663 934 471 -765 -1245 -72 1150 719 -640 -722 935 1524
810A524p96j077N75R41M76j000j376M69J401j38j615j046J061R58p02p37m46R27
$$ 1524 728 -349 226 1167 1643 643 -733 -264 1137 999 -616 -1662 -601 357 -345 -1082 -1528 -601
828f01J010l54j475J00J878O54q83j208J168Q93k7m14j272O93J421o2j501q30
$$ -601 409 55 -1420 -1320 558 1212 329 -879 289 1182 1155 741 -531 162 1583 1521 20 -810
846h10J124P12n97j584J69P79R53p47j373R3J322L59j008o78P75O68Q3m83l57
$$ -810 314 1026 429 -1155 -986 -207 746 -1 -1374 -1281 41 400 -608 -1286 -511 157 240 -243 -600
865f00L95J106J29j287j86J148Q66p32p18k38Q51K45q93q49K11L97L23p74r67
$$ -600 -205 901 1030 -257 -443 705 1571 839 121 -117 734 979 86 -763 -552 -155 168 -606 -1573
884a573N27P40m05p71k8N06R15K08q58l79J441J039l05o20n4J137J67k33r88N63
$$ -1573 -1046 -306 -711 -1482 -1510 -1004 -89 119 -739 -1118 323 1362 1057 437 383 1520 1687 1454 466 1029
904A029P00j51j365n13L74O58q35r49o52Q71O63n11r73O5J497K74p51l65P20J074
$$ 1029 1729 1578 213 -300 74 732 -103 -1052 -1704 -833 -170 -681 -1654 -1589 -92 182 -569 -934 -214 860
924H60L01m58p00K63R67O0q39o87O09N02m59j140o4K41N48p63r85nO95K85n03
$$ 860 1161 703 3 266 1233 1293 454 -233 376 878 419 -721 -785 -544 4 -759 -1744 -1749 -1054 -769 -1272
945a272n61O14Q38K59n01k02O40J022J03o44k48P65R01k10o22k24R18J37l85p25
$$ -1272 -1833 -1219 -381 -122 -623 -825 -185 837 940 296 48 813 1714 1504 882 658 1576 1713 1328 603
965F03l31O84K38r31j009J95N29J99j100m06N23P34j2p53K63K47R28k0p34L47
$$ 603 272 956 1194 263 -746 -551 -22 177 -923 -1329 -806 -72 -84 -837 -574 -327 601 581 -153 194
985A94Q29J97k83p24j27P49O3p58o11L4O03k58j128k95J32M85l41p48R8O09O51
$$ 194 1023 1220 937 213 86 835 898 140 -471 -437 166 -92 -1220 -1515 -1383 -898 -1239 -1987 -1889 -1280 -629
1006f29J33q32N29P02O12J42k94K70N86L20l80n07K07N91O0j167j41P17Jp51m14
$$ -629 -496 -1328 -799 -97 515 657 363 633 1219 1539 1159 652 859 1450 1510 343 202 919 920 169 -245
1027b45l29K16M00l64o78J31O63K51l84k24K74P73N5k85l53K95R74k52q00k1L35
$$ -245 -574 -358 42 -322 -1000 -869 -206 45 -339 -563 -289 484 539 254 -99 196 1170 918 118 97 432
1048D32K67k1r86J7L15J00m86n96J6M82J38p90k01J0N14J80m38Q8J87Q82j05k18
$$ 432 699 678 -308 -291 24 124 -362 -958 -942 -460 -322 -1112 -1313 -1303 -789 -609 -1047 -959 -772 110 5 -213
1070b13k44Q51P09m36l11O7M00M51k01p89K69J32k6m87m17L48K06j96q38j11L47
$$ -213 -457 394 1103 667 356 423 823 1274 1073 284 553 685 659 172 -245 103 309 113 -725 -836 -489
1091d89N01k12k97j82M59N74J82o68L92M02L86m09l19L5K59M68r03l93K52K27
$$ -489 12 -200 -497 -679 -220 354 536 -132 260 662 1048 639 320 355 614 1082 179 -214 38 265
1111B65k99o63O2L10q1L1o12rK65K62j98k12N23N6N99n72r4K13N42L35n66l44
$$ 265 -34 -697 -635 -325 -406 -375 -987 -996 -731 -469 -667 -879 -356 -300 299 -273 -367 -154 388 723 157 -187
1133a87L62M25J25o39k2J99K58j2p35p8M62J87l44m52J04M47M0k88m19k7O65k55
$$ -187 175 600 725 86 64 263 521 509 -226 -304 158 345 1 -451 -347 100 140 -148 -567 -594 71 -184
1155a84kk80O65J80j55k06m71O01N29l45j82k40J91L51k78m10J99M6M8k45l89
$$ -184 -186 -466 199 379 224 18 -453 148 677 332 150 -90 101 452 174 -236 -37 9 57 -188 -577
1176e77J58L04K09n58k8J74M35k21m53K79O17N5j54M8k6L80j39j37n77L47K09
$$ -577 -419 -115 94 -464 -492 -318 117 -104 -557 -278 339 394 240 288 262 642 503 366 -211 136 345
1197C45Nm60j56P6J77R9l52j72L04J43j6j84k47M22J06l95K16j88O08p7m09p7
$$ 345 350 -110 -266 -190 -13 86 -266 -438 -134 9 -7 -191 -438 -16 90 -305 -89 -277 331 254 -155 -232
1219b32J79M56r4k84l86M57J98Pl82L3K40P5k97m32K04L21M52m53o40M63J50O4
$$ -232 -53 403 309 25 -361 96 294 301 -81 -48 192 267 -30 -462 -258 63 515 62 -578 -115 35 99
1241I9l40j57K50K81Kl00j18L53L71j29k65OK77Q4p5o13r7N28K43m06k24J02K91
$$ 99 -241 -398 -148 133 135 -165 -283 70 441 312 47 53 330 414 339 -274 -371 157 400 -6 -230 -128 163
1264A63k5m61N3n4N68m25k25j83N49K65l08j78J25J68k4n1Q8r9J72P1j80j26j77
$$ 163 138 -323 -270 -324 244 -181 -406 -589 -40 225 -83 -261 -136 32 8 -43 45 -54 118 189 9 -117 -294
1287b94M09j14j60M3K16R3j82K2l29M85m9p9r2m68O48K81l97n09L43J53N0j66
$$ -294 115 1 -159 -116 100 193 11 33 -296 189 140 61 -31 -499 149 430 33 -476 -133 20 70 -96
1309i6k81M00Q4M9l49p5N46Q3j29k59j39N76J49m96j40J26K43j94j30j22nKK04
$$ -96 -377 23 107 156 -193 -268 278 361 232 -27 -166 410 559 63 -77 49 292 98 -32 -154 -159 -157 47
1332D7r8l07J67N1j80J18k95M53k2J45k16j2J28O42l54l32L22j31K43l22j17K76
$$ 47 -51 -358 -191 -140 -320 -202 -497 -44 -66 79 -137 -149 -21 621 267 -65 257 126 369 47 -70 206
1354B06R5l51K56l51J08K62l67m06K40J82K19J0k39l3K95j4j22l17K00L02l57
$$ 206 301 -50 206 -145 -37 225 -142 -548 -308 -126 93 103 -136 -169 126 112 -10 -327 -127 175 -182
1375a82O3j9M4L40K74m15k13K78K65j42l47R2J37L8k40j62QK61k85m3L4N6K54
$$ -182 -119 -138 -94 246 520 105 -108 170 435 293 -54 38 175 213 -27 -189 -181 80 -205 -248 -214 -158 96
1398I6l05k5qJ03K32J77l23K25mJ15j11l96j22O60J29m10p5J75k7J17m87l43J26
$$ 96 -209 -234 -242 -139 93 270 -53 172 168 283 172 -224 -346 314 443 33 -42 133 106 223 -264 -607 -481
1421d81M99m38J14k13L13OK0n5L3J22R3J25k50r4O05j52J17l39OL23j35j44m47
$$ -481 18 -420 -306 -519 -206 -200 -180 -235 -202 -80 13 138 -112 -206 399 247 364 25 31 354 219 75 -372
1444c72L62K40j31j37k97L56R2p7l52K1M85Q0l62n6m7J34J74j31J14R2k30L68
$$ -372 -10 230 99 -38 -335 21 113 36 -316 -295 190 270 -92 -148 -195 -61 113 -18 96 188 -42 326
1466C26m78K37J06J21j55k48K22n8K53l57k6k84L30j19Qk74Q4K82N7l36J12O9
$$ 326 -152 85 191 312 157 -91 131 73 326 -31 -57 -341 -11 -130 -122 -396 -312 -30 27 -309 -197 -128
1488a28L07p8q7m39L32L88j62o4j9K57k65K48j03M4k6Lj88j61o5K50k68k3n7M9
$$ -128 179 101 14 -425 -93 295 133 69 50 307 42 290 187 231 205 208 20 -141 -206 44 -224 -247 -304 -255
1512b55J90O8o0l1L15k3k37o8J38K07J75k00j01J6L28k19Nl6j75J4K05m18j09
$$ -255 -65 3 -57 -88 227 204 -33 -101 37 244 419 219 118 134 462 243 248 212 37 51 256 -162 -271
1535b71K42p2r0J03k77K19J93J64l61k20L18J16j32P6j87K95Qj73n4K57K06k5
$$ -271 -29 -101 -191 -88 -365 -146 47 211 -150 -370 -52 64 -68 8 -179 116 124 -49 -103 154 360 335
1557C35l60j10K45O6m4k93J91j44o0n6pK21kj45J2j16K79q2K42k93J22o1L69q4
$$ 335 -25 -135 110 176 132 -161 30 -114 -174 -230 -237 -16 -18 -163 -151 -267 12 -70 172 -121 1 -60 309 225
1581B25k0k36R0K23K43m65j65K49J86j75k97J42J82n1j04l88O4K91N4j72j8k77
$$ 225 205 -31 59 282 525 60 -105 144 330 155 -142 0 182 131 27 -361 -297 -6 48 -124 -142 -419
1603d19O08j15j64o8K36K3K6J3m2J4P5jl60L36m63J77K94m43L37N1l87J29j51
$$ -419 189 74 -90 -158 78 101 127 140 98 112 187 186 -174 162 -301 -124 170 -273 64 115 -272 -143 -294
1626b94K48K58l46o3n6J67K65j54j40r9K21L12l9l19J7K13J36k02l12K47j03J39
$$ -294 -46 212 -134 -197 -253 -86 179 25 -115 -214 7 319 280 -39 -22 191 327 125 -187 60 -43 96
1648I6j36R0k51K59k7j30j41M81k65J5j34p3L93o4j22p7qM9M1J6k6q9L06l78M06
$$ 96 -40 50 -201 58 31 -99 -240 241 -24 -9 -143 -216 177 113 -9 -86 -94 -45 -4 12 -14 -103 203 -175 231
1673B31m34L75L9j08K11m67O9J96J6m4j67J98p2k52o3O5K63J30k45l8q0K98J9
$$ 231 -203 172 211 103 314 -153 -84 112 128 84 -83 115 43 -209 -272 -207 56 186 -59 -97 -177 121 140
1696A40k88M9J75K0k64J64l5J76j50L40j81j97J15n5Q3j95P8L2j18J09l2K1L7
$$ 140 -148 -99 76 96 -168 -4 -39 137 -13 327 146 -51 64 9 92 -103 -25 7 -111 -2 -34 -13 24
1719B4P8j75J72j69K65K33n60K31k77J56k7J46J09L5q3j09J84k81M2j6r2r4J03
$$ 24 102 -73 99 -70 195 428 -132 99 -178 -22 -49 97 206 241 158 49 233 -48 -6 -22 -114 -208 -105
1742a05l4J84n7j55J43%L3Q2r0j60N3j4j37J18j1J09j41J64M0n5N9j10J45j10
$$ -105 -139 45 -12 -167 -24 -24 9 91 1 -159 -106 -120 -257 -139 -150 -41 -182 -18 22 -33 26 -84 61 -49
1766d9L02k7k47J7J08N6k17o3L32L1m46P2j4L44l26R0Q1j64J23J03o5J50l2o5
$$ -49 253 226 -21 -4 104 160 -57 -120 212 243 -203 -131 -145 199 -127 -37 44 -120 3 106 41 191 159 94
1790I4K4l00L96j46J66k41J36k67L25j18ok94nK31j2K53n42K99k28M25k84M3j7
$$ 94 118 -182 214 68 234 -7 129 -138 187 69 63 -231 -236 -5 -17 236 -306 -7 -235 190 -94 -51 -68
1813f8K08k55J29N0o7J5j11M5K32k53pP1p2j74N8J19j43M1K36LJ6M8k74N8J88
$$ -68 140 -115 14 64 -3 12 -99 -54 178 -75 -82 -11 -83 -257 -199 -80 -223 -182 54 57 73 121 -153 -95 93
1838I3k73K00p1J38L7J39k41m2p0J09Q6k80J39j2J26j16jK78lk10L90l08k1K5
$$ 93 -180 20 -51 87 124 263 22 -20 -90 19 105 -175 -36 -48 78 -38 -39 239 236 26 416 108 87 112
1862A12k82L67j14k13K49k24K6J37r2J22j32o6n1M4K60L3j88m7k47N01p1k78K85
$$ 112 -170 197 83 -130 119 -105 -79 58 -34 88 -44 -110 -161 -117 143 176 -12 -59 -306 195 124 -154 131
1885A31J28j26p2o8J57j88P2J46l90j2LR2K36k66K33N6k39J4r4K59J2j45k76L35
$$ 131 259 133 61 -7 150 -38 34 180 -210 -222 -219 -127 109 -157 76 132 -107 -93 -187 72 84 -61 -337 -2
1909bj63K60j42L31j67j65J0q4J30L8ML9j1Lj95L34k08J01k96J79O4p1R8j14o3
$$ -2 -165 95 -47 284 117 -48 -38 -122 8 46 50 89 78 81 -114 220 12 113 -183 -4 60 -11 87 -27 -90
1934i0J4J53k28QL07l09K41j30l7J75nj10o1J20J42P8l91L42p3n6k66J95P4j66
$$ -90 -76 77 -151 -143 164 -145 96 -34 -71 104 99 -11 -72 48 190 268 -123 219 146 90 -176 19 93 -73
1958g3p2m6K17l5O7L2k10n4K47R3j4j13m8K54l11l6k44L5L36R8O2K0l05J73o9
$$ -73 -145 -191 26 -9 58 90 -120 -174 73 166 152 39 -9 245 -66 -102 -346 -311 25 123 185 205 -100 73 4
1983Dj92K92o4K6k02L2K70r4J16r3k64K80j71J78j18J36l38K48J33j51LJ08M2
$$ 4 -188 104 40 66 -136 -104 166 72 188 95 -169 111 -60 118 0 136 -202 46 179 28 31 139 181
2006A81j7l8m4pk47K53l1j92K54Jj99k58J50J50L22o44L27q9J12j28J63n1j53
$$ 181 164 126 82 75 -172 81 50 -142 112 113 -86 -344 -194 -44 278 -366 -39 -128 -16 -144 19 -32 -185
2029a85K80j02J33j20J60j91K61l67q6K76k25K26j12p5K70o3p8k70L63q0q9j2
$$ -185 95 -7 126 6 166 -25 236 -131 -217 59 -166 60 -52 -127 143 80 2 -268 95 15 -74 -86
2051h6o0K48k8J27j10j12LJ15j8j81K16j00j44N1P7l9q8J74j00j0P1J4k56l4K18
$$ -86 -146 102 74 201 91 -21 -18 97 79 -102 114 14 -130 -79 -2 -41 -129 45 -55 -65 6 20 -236 -270 -52
2076e2J10j12N7j49J71q9J44Q3m1N6J71l96n3jK93j01L18n28J71k8kQ1l01M04
$$ -52 58 -54 3 -146 25 -64 80 163 122 178 349 -47 -100 -101 192 91 409 -119 52 24 22 103 -198 206
2100B06j33J55j52k93K49m3n4M8l53L18K57m44pJ71J56j67J87o8p0J00J36k13
$$ 206 73 228 76 -217 32 -11 -65 -17 -370 -52 205 -239 -246 -75 81 -86 101 33 -37 63 199 -14
2122a4k55R3K66K11o12K95j60K94l4k17p3P2J03L37m00J9l0Q1L6P3L4n7J46l81
$$ -14 -269 -176 90 301 -311 -16 -176 118 84 -133 -206 -134 -31 306 -94 -75 -105 -24 12 85 119 62 208 -173
2146a73K15J17l0m5k02J7K90k63J29l09J76O0n8P4P9k10J64J15J76j39l09J58
$$ -173 42 159 129 84 -118 -101 189 -74 55 -254 -78 -18 -76 -2 77 -133 31 146 322 183 -126 32
2168C2J21qj23O1j61K17l98L87k84%m3o6L60J00k78K26RN5k49o0j60J80J05m0
$$ 32 153 145 22 83 -78 139 -259 128 -156 -156 -199 -265 95 195 -83 143 152 207 -42 -102 -262 -82 23 -17
2192a7L6j33P5L2K46n00K74K09j71%P1k37J66j1k9j35l2O2J53n9K68O3l21J65
$$ -17 19 -114 -39 -7 239 -261 13 222 51 51 122 -115 51 40 11 -124 -156 -94 59 0 268 331 10 175
2216A75l64K25k21K92k76L98k35k6N6KJ24k71J22j49L97Q8k94k93Q0P2L86k03
$$ 175 -189 36 -185 107 -169 229 -6 -32 24 26 150 -121 1 -148 249 337 43 -250 -170 -98 288 85
2238H5j76O7P7o5n1l28K92Q5k45K53K6j18n9J39l9N9L5j09J58j79K09j77Q4r8
$$ 85 -91 -24 53 -12 -63 -391 -99 -14 -259 -6 20 -98 -157 -18 -57 2 37 -72 86 -93 116 -61 23 -75
2262g5L2j0N5P6q0j58J84r2K56j32J52j71j27j92K0J41l8L10n6k21L34q0j83r0
$$ -75 -43 -53 2 78 -2 -160 24 -68 188 56 208 37 -90 -282 -262 -121 -159 151 95 -126 208 128 -55 -145
2286a45J32n3J57m5M0L2j01j65rK13L9m38M19j8N9o7j71K82l9j12q0P2K08j76
$$ -145 -13 -66 91 46 86 118 17 -148 -157 56 95 -343 76 58 117 50 -121 161 122 10 -70 2 210 34
2310C4P8R8j31j3o0k54K04K59k69K00j14j47K33k89K82j86L02m76J32L03l43Q3
$$ 34 112 210 79 66 6 -248 -44 215 -54 146 32 -115 118 -171 111 -75 227 -249 -117 186 -157 -74
2332g4kpP2j24J06J19r6m2n7M80m81K92j96O0l45M76k3k13R7l51O39k60j57J78
$$ -74 -76 -83 -11 -135 -29 90 -6 -48 -105 375 -106 186 -10 50 -295 181 158 -55 42 -309 330 70 -87 91
2356I1N1l62J70j18M53j58k2O9j01J7j03J45j94K06j94P9K4R2j08n9m8J67l49
$$ 91 142 -220 -50 -168 285 127 105 174 73 90 -13 132 -62 144 -50 29 53 145 37 -22 -70 97 -252
2379b52K64Q0j62L03j41n1J5k72J35N9j1j73K22j3K20l50J3k7J90J31j32j69K95
$$ -252 12 92 -70 233 92 41 56 -216 -81 -22 -33 -206 16 3 223 -127 -114 -141 49 180 48 -121 174
2402A74Jp9J62k26j78k6L28j40Q7j0p3n5L19j58l11K94J61k24r9j1o2J08N8J52
$$ 174 175 96 258 32 -146 -172 156 16 103 93 20 -35 284 126 -185 109 270 46 -53 -64 -126 -18 40 192
2426A92k78L27l23l5K17n1k2r4n2L42l56K40m1n2J4Q1j39rJ11N9j03r5k6o6K27
$$ 192 -86 241 -82 -117 100 49 27 -67 -119 223 -133 107 66 14 28 109 -30 -39 72 131 28 -67 -93 -159 68
2451F8l81K98j70J28r2K43K0l8l86O38m11K01j02r9P0R7l9k29J43j09J42j82L23
$$ 68 -313 -15 -185 -57 -149 94 114 76 -310 328 -83 118 16 -83 -13 84 45 -184 -41 -150 -8 -190 133
2474A33j07K29q1k46l4R5L11l80k7L3J12J78j84j68R7Q3l29J04k02M22n0m5J39
$$ 133 26 255 174 -72 -106 -11 300 -80 -107 -74 38 216 32 -136 -39 44 -285 -181 -383 39 -11 -56 83
2497H3j17r9oJ23J08j84R2l67M05n5k29J70%Q7M7j55P4k0n6N6L37k02j42J82k29
$$ 83 -34 -133 -139 -16 92 -92 0 -367 38 -17 -246 -76 -76 11 58 -97 -23 -43 -99 -43 294 92 -50 132 -97
2522i7K70j52m05K79K36o9l2J39k19j3M74l78j74L12l31N2L33k34l1p8r8J19L8
$$ -97 173 21 -384 -105 131 62 30 169 -50 -63 411 33 -141 171 -160 -108 225 -9 -40 -118 -216 -97 -59
2545e9Q4p4l2K76j87K3k73J22K01L9m07J98n1P5J82J0j74P6K2l34L29j3l4j51
$$ -59 25 -49 -81 195 8 31 -242 -120 81 120 -287 -89 -140 -65 117 127 -47 29 51 -283 46 33 -1 -152
2569a52K14J27j30l7j4n7J89l45J76J43r0K5J89j68m9l8k52M62k99j47K86P5q4
$$ -152 62 189 59 22 8 -49 140 -205 -29 114 24 49 238 70 21 -17 -269 193 -106 -253 33 108 24
2592B4j77L67k29l10L55J78l96L08Q5k41K91l10L38k22j67n6J41K7j86K39j39
$$ 24 -153 214 -15 -325 30 208 -188 120 205 -36 255 -55 283 61 -106 -162 -21 6 -180 59 -80
2613h0l5K71L2o7n3k6j01Q0j37o9K03j2pqn8r6K32l00L75k12L1p8N2K77l79J24
$$ -80 -115 156 188 121 68 42 -59 21 -116 -185 18 6 -1 -9 -67 -163 69 -231 144 -68 -37 -115 -63 214 -165 -41
2639d1Kj46J34N9J08m79K26N7N3q5Q1q2O3N54l15k46m7K30l13J62k15J69J43j44
$$ -41 -39 -185 -51 8 116 -363 -137 -80 -27 -112 -31 -113 -50 504 189 -57 -104 126 -187 -25 -240 -71 72 -72
2663g2J34m0j27K28k52J55J36j10q5M2J45j61J83l00L3j95K67k77M57j78J37j14
$$ -72 62 22 -105 123 -129 26 162 52 -33 9 154 -7 176 -124 -91 -286 -19 -296 161 -17 120 6
2685FQ9j17k94M79j42K00M6m35J54J0J09j45J5J5l14K32L4N5j82j5J30k3L4J70
$$ 6 95 -22 -316 163 21 221 267 -168 -14 -4 105 -40 -25 -10 -324 -92 -58 -3 -185 -200 -70 -93 -59 111
2709A11j09k97L47m8J0Mk96J06K81j88j59M22k0j26j5K17l69M32l51O7l5J82r3
$$ 111 2 -295 52 4 14 18 -278 -172 109 -79 -238 184 164 38 23 240 -129 303 -48 19 -16 166 73
2732G3L9k9l21J49Q2J49k83N0J26l85L05j55N53k62j89K58J00k25j43L30k83J27
$$ 73 112 83 -238 -89 -7 142 -141 -91 35 -350 -45 -200 353 91 -98 160 260 35 -108 222 -61 66
2754F6l8L1k16J88o8j82L77k7k83K01J64k35P8j67O5K08m22M23J69n08J63k44
$$ 66 28 59 -157 31 -37 -219 158 131 -152 49 213 -22 56 -111 -46 162 -260 163 332 -176 -13 -257
2776b57K88k14M26m48P9O5R5j50k43M39m5J12K7Q2m73L34j22q9n9J88J9j35M7
$$ -257 31 -183 243 -205 -126 -61 34 -116 -359 80 35 147 174 256 -217 117 -5 -94 -153 35 54 -81 -34
2799c4k1K44k93O5J93j70j68L01o1N5l7J28j52q7K76l06R0M0j92J26jj6J81l10
$$ -34 -55 189 -104 -39 154 -16 -184 117 56 111 74 202 50 -37 239 -67 23 63 -129 -3 -4 -20 161 -149
2823a49N80k22k07l2l6p9l08O22l06J30j4R8j20k95M33p2k06K33k26J25m5J18
$$ -149 431 209 2 -30 -66 -145 -453 169 -137 -7 -21 77 -43 -338 95 23 -183 50 -176 -51 -96 22
2845B2k3k3N1k00J21J96J76l64J08P1j75LN5j21L16k02r3K84j3k01j21J24P6q8
$$ 22 -1 -24 27 -173 -52 144 320 -44 64 135 -40 -37 18 -103 213 11 -82 202 189 -12 -133 -9 67 -21
2869b1L0K27m45L74l33J06J65k13J09J48l68K99k8k96M56l23Q9j0nJ41ok12J52
$$ -21 9 236 -209 165 -168 -62 103 -110 -1 147 -221 78 50 -246 210 -113 -24 -34 -39 102 96 -116 36
2892C6L6r9O0j90J84q3J42j23J62L3j97j15L73k61k76J17K00j60L83l00Q0n5l04
$$ 36 72 -27 33 -157 27 -56 86 -37 125 158 -39 -154 219 -42 -318 -201 -1 -161 222 -78 2 -53 -357
2915c57J04L32o0p8J46j65J61O6r0k18M04k47L31q5j37J81k24j75o1m3Q4J04p1
$$ -357 -253 79 19 -59 87 -78 83 149 59 -159 245 -2 329 244 107 288 64 -111 -172 -215 -131 -27 -98
2938i8K53l29J82k39J35P2Km8J07K9l6O0k1Q5o9k33J79O0j33r4J65r7J60k09P3
$$ -98 155 -174 8 -231 -96 -24 -22 -70 37 66 30 90 69 154 85 -148 31 91 -42 -136 29 -68 92 -117 -44
2963d4QK32j04j30J31r6J47j98M4%Q4o3K9O1J11k14R5j59K3J67l5m8O9p3k09L27
$$ -44 -36 196 92 -38 93 -3 144 -54 -10 -10 74 11 40 101 212 -2 93 -66 -43 124 89 41 110 37 -172 155
2989A55j97PJ4j00K09r6j19K01m7LM5j11N7lJ77l36K62J02l09L11l16J28p5q6
$$ 155 -42 -35 -21 -121 88 -8 -127 74 27 30 75 -36 21 18 195 -141 121 223 -86 225 -91 37 -38 -124
3013a24J44N7p3l39L85j9n8L6j25K9j09Q3J24J28J23j94Q3j63j08L7K48m10N1
$$ -124 20 77 4 -335 50 31 -27 9 -116 -87 -196 -113 11 139 262 68 151 -12 -120 -83 165 -245 -194
3036a94J10K13j56r2K08q1q5J19N4j38K00k9j37j57M06l63K73N4k49K06l0j85
$$ -194 -84 129 -27 -119 89 8 -77 42 96 -42 158 129 -8 -165 241 -122 151 205 -44 162 132 -53
3058e3K92k62L1J07J45j61Jk28J21p3J3l2J25L3NJ19j44O7k4P6j61J70m16N12
$$ -53 239 -23 8 115 260 99 100 -128 -7 -80 -67 -99 26 59 64 183 39 106 82 158 -3 167 -249 263
3082B63l58M6K26j15k3l42N26k20j05K17j06p5r3K61M3k61j4L02L7k56L92m17
$$ 263 -95 -49 177 62 39 -303 223 3 -102 115 9 -66 -159 102 145 -116 -130 172 209 -47 345 -72
3104g2k0J27j01K15k67O4J45p4M1MJ20k04k82J77K67q2O7J15p4j62l00M60N5p8
$$ -72 -92 35 -66 149 -118 -54 91 17 58 62 182 -22 -304 -127 140 58 125 240 166 4 -296 164 219 141
3128A41N5l84J75J35k05K6q3J76q9K01k2l04J17K04j15j46J64n8J47l97M94l46
$$ 141 196 -188 -13 122 -83 -57 -140 36 -53 148 126 -178 -61 143 28 -118 46 -12 135 -262 232 -114
3150a14J14mr0J42r3J29k72M69m72J80O7k66J80M3j30r9J96J8J21j7j82Q7lJ06
$$ -114 0 -4 -94 48 -45 84 -188 281 -191 -11 56 -210 -30 13 -117 -216 -20 -2 119 102 -80 7 4 110
3174A10j29j59J3J02K0K42l52J75p1K7J19J03k28p7m1m6l3M59j39j31m6p4M6J74
$$ 110 -19 -178 -165 -63 -43 199 -153 22 -49 -22 97 200 -28 -105 -146 -192 -225 234 95 -36 -82 -156 -110 64
3198F4j30J6K9j14J29j5J15n36J78M00mk41M28j70j56J09o5Q4p9N5j84K60r5m3
$$ 64 -66 -50 -21 -135 -6 -21 94 -442 -264 136 132 -109 319 149 -7 102 37 121 42 97 -87 173 78 35
3222C5k63M05k23j42K15l2j29J25k19%O12l94P8k41K01O8J31k49JM9r2L3J91q9
$$ 35 -228 177 -46 -188 27 -5 -134 -9 -228 -228 384 -10 68 -173 28 96 227 -22 -21 28 -64 -31 160 71
3246G1J91k44k45K25k07K98m29M26n8j09k03K14K55n8q5q4m58M42r7M68j27j70
$$ 71 262 18 -227 -2 -209 89 -340 86 28 -81 -284 -70 185 127 42 -42 -500 -58 -155 313 186 16
3268A6K43O9m14J08R0j50m57M13L7J1P0J45k05Q1l3j27m7J70j10L9P1k69J58P5
$$ 16 259 328 -86 22 112 -38 -495 -82 -45 -34 36 181 -24 57 24 -103 -150 20 -90 -51 20 -249 -91 -16
3292a6J15k99J38K35L0q4j94J24j3j53J94j45m4J73Q8k8K2j87Q5p1M7j07Q1J65
$$ -16 99 -200 -62 173 203 119 -75 49 36 -117 77 -68 -112 61 149 121 143 -44 41 -30 17 -90 -9 156
3316A56j99j81K52k81M75k64K9J33q1P5j42M7M7p8K94m95K2K8L8J51J18N1j07
$$ 156 -43 -224 28 -253 222 -42 -13 120 39 114 -28 19 66 -12 282 -213 -191 -163 -125 26 144 195 88
3339H8j45N9j19J08K11q1j79j12L21k75L77l28P4Qk8J09k5J04l76K12N1k2k63
$$ 88 -57 2 -117 -9 202 121 -58 -170 151 -124 253 -75 -1 7 -21 88 63 167 -209 3 54 32 -231
3362b31K48J40KnJ8k28q1O9l1J57j36Q1J64k06J58p7K8k67P7k43K73L2j45J52
$$ -231 17 157 159 154 172 -56 -137 -68 -99 58 -78 3 167 -39 119 42 70 -197 -120 -363 -90 -58 -203 -51
3386e1J80l11J94r5Q2l3j77K90P2mn34L52J7k14K03oN1j4J75m5J77l17L1k3p0
$$ -51 129 -182 12 -83 -1 -34 -211 79 151 147 -387 -35 -18 -232 -29 -35 16 2 177 132 309 -8 23 0 -70
3411g0N5j40K61k43J60k07K10j26NJ63o8j36j56N33k78R5o4M0P8K15j67q4J04
$$ -70 -15 -155 106 -137 23 -184 26 -100 -95 68 0 -136 -292 241 -37 58 -6 34 112 327 160 76 180
3434A80q7J60m31K33R3k33Q4kq7qJ21j01K53l65K15J1j00K5J47j81K01l72J59
$$ 180 93 253 -178 55 148 -85 -1 -3 -90 -98 23 -78 175 -190 25 36 -64 -39 108 -73 128 -244 -85
3457h5N1M5m2J69j04j51J69J24M2r0l36J66j94K99j88J59r3o8J7j48N29j44j50
$$ -85 -34 11 -31 138 34 -117 52 176 218 128 -208 -42 -236 63 -125 34 -59 -127 -110 -258 271 127 -23
3480b3K3K28k85K05j73j13K45J40j05l87J81L5R6l17M50k88n9j59L88j66J49j45
$$ -23 0 228 -57 148 -25 -138 107 247 142 -245 -64 -29 67 -250 200 -88 -147 -306 82 -84 65 -80
3502h0L43j66l16L90j32O0k57j2Q8K35j30K50qJ50n51J79l17K63j50J21L9K1o8
$$ -80 263 97 -219 171 39 99 -158 -170 -82 153 23 273 265 415 -136 43 -274 -11 -161 -40 -1 20 -48
3525d8o6J8K57p7k1o7k88J57N1M09l60J08k61Q9m4K78m91Q5K26K18j37M3M0j24
$$ -48 -114 -96 161 84 63 -4 -292 -135 -84 325 -35 73 -188 -99 -143 135 -356 -271 -45 173 36 79 119 -5
3549eJ38k41O7M2l6J49j62M0L23m16K25q3kj27M6p0OJ96j05L3o0J82q7j47j83
$$ -5 133 -108 -41 1 -35 114 -48 -8 315 -101 124 41 39 -88 -42 -112 -106 90 -15 18 -42 140 53 -94 -277
3574b77N70l03j22J24R1N8j30j99L57j57J32l64N7K57m4j44k1R6PJ05j83o7N01
$$ -277 293 -10 -132 -8 83 141 11 -188 169 12 144 -220 -163 94 50 -94 -115 -19 -12 93 -90 -157 344
3597C44n37M2K72j83M47j38j94j68rK98p0Lm5l21nJ10K30J06k44R4q4q3J24ol0
$$ 344 -193 -151 121 -62 385 247 53 -115 -124 174 104 107 62 -259 -264 -154 76 182 -62 32 -52 -135 -11 -17 -47
3622d7j47L02k34Q0J29K0j00l42L22P2O1P1k44n8r4L05M6l63L29R2r0k05j23K06
$$ -47 -194 108 -126 -46 83 103 3 -339 -17 55 116 187 -57 -115 -209 96 142 -221 108 200 110 -95 -218 -12
3646a2q8K5J23K22k72j27k43M28k12K4J66J5j86M6J7m4N2R6j67r0L62j80j26k21
$$ -12 -100 -75 48 270 -2 -129 -372 56 -156 -132 34 49 -137 -91 -74 -118 -66 30 -137 -227 135 -45 -171 -392
3670c92K56L3M13J8m30J53n1P1k60m4L40k25L34j77j27j07j5R3M4P8J60k96J79
$$ -392 -136 -103 310 328 -102 51 0 71 -189 -233 107 -118 216 39 -88 -195 -210 -117 -73 5 165 -131 48
3693D8o0n9NJ64j3K61l30k43K36j40P9K02k23n5K41j11Q7k63R5kJ65l76M81J0
$$ 48 -12 -71 -66 98 85 346 16 -227 9 -131 -52 150 -73 -128 113 2 89 -174 -79 -81 84 -292 189 199
3717A99j90K10m46N9J25j77j7J01P4R4l7j08J33j91L24l04L10j64j59M20n32K93
$$ 199 9 219 -227 -168 -43 -220 -237 -136 -62 32 -5 -113 20 -171 153 -151 159 -5 -164 256 -276 17
3739A7K62j74L7k97k10M59k03K20m8M3l10J00m3J77l9P6k38K44J13k26r2O8OJ2
$$ 17 279 105 142 -155 -365 94 -109 111 63 106 -204 -104 -147 30 -9 67 -171 73 186 -40 -132 -64 -58 -46
3763d6j63K60k5J3L0J4j81K28j08p1M5J79j06k92P5LL07m02K73j9j99J82M0n3
$$ -46 -209 51 26 39 69 83 -98 130 22 -49 -4 175 69 -223 -148 -145 162 -240 33 14 -185 -3 37 -16
3787a6O8Q5j60P8l09K53j86J43J96l13K76j51M3K1J4J73j21J36j55l96R0L56k99
$$ -16 52 137 -23 55 -254 -1 -187 -44 152 -161 115 -36 7 28 42 215 94 230 75 -321 -231 125 -174
3810a74N8L9n5J39n1J96j0l78J46P2j68J22Q6J84k37J29k46M11k17j69n9J02J1
$$ -174 -116 -77 -132 7 -44 152 142 -236 -90 -18 -186 -64 22 206 -31 98 -148 263 46 -123 -182 -80 -69
3833f9p2L93j21k85J87K9j39K30j87K05j07k10J86P8k83J45j13J1k36K57K91j72
$$ -69 -141 252 131 -154 33 62 -77 153 -34 171 64 -146 40 118 -165 -20 -133 -122 -358 -101 190 18
3855A8k8J4J36R9k48L5n7j4N3k20K22K45k41J2J82k8l04j08J08K35j98J82l24
$$ 18 -10 4 140 239 -9 26 -31 -45 8 -212 10 255 14 26 208 180 -124 -232 -124 111 -87 95 -229
3878b29L05J43l97J64j59Q6R3j82J72j88L05k48L44j16k09j0K69l1j03k9L20k48
$$ -229 76 219 -178 -14 -173 -87 6 -176 -4 -192 113 -135 209 93 -116 -126 143 112 9 -20 300 52
3900E2j0k6J70p8j80L64q5LJ0L3k34p0k18N63l89M8K55k52j43L59k46j60K87M5
$$ 52 42 16 186 108 -72 292 207 210 220 253 19 -51 -269 294 -95 -47 208 -44 -187 172 -74 -234 53 98
3924I8k13j4L84k02j12M1k60L65j65J19q8J36M0k71o7K54j9j59J79j09K15j79
$$ 98 -115 -129 255 53 -59 -18 -278 87 -78 41 -47 89 129 -142 -209 45 26 -133 46 -63 152 -27
3946b7K54l68L10j89j42L7Q6L64o33L57M7m3j84J03K14l79L07R4l17%J34p0J51
$$ -27 227 -141 169 -20 -162 -125 -39 325 -308 49 96 53 -131 -28 186 -193 114 208 -109 -109 25 -45 106
3969A06O7j55m4K7r1pK44j83n0J55m9j50J33k16K5K64K9K5L3m4K0R9l47L15l7
$$ 106 173 18 -26 1 -90 -97 147 -36 -86 69 20 -130 3 -213 -188 76 105 130 163 119 139 238 -109 206 169
3994A69m2k54N59m67r4Q1Q9R9l20p9J11K03k80O2J83J06j77K34p0r0Ok90L96Q2
$$ 169 127 -127 432 -35 -129 -48 41 140 -180 -259 -148 55 -225 -163 20 126 -51 183 113 23 29 -261 135 217
4018B17lk48J9p9k3J50K80m40j41K14p7K1O7p8J08k92K93j53M1K85j74j08K90
$$ 217 214 -34 -15 -94 -117 33 313 -127 -268 -54 -131 -110 -43 -121 -13 -305 -12 -165 -124 161 -13 -121 169
4041A69J34j77k83O3J48j07J7P0j4p4O4l4J62p3q3J11Rk45K08j54O5m3n5R4L1
$$ 169 303 126 -157 -94 54 -53 -36 34 20 -54 10 -24 138 65 -18 93 102 -143 65 -89 -24 -67 -122 -28 3
4066CL31k05k83L8O1j65J13J79R9M4p8k50O7O5P8J13l64K81r1j10R8R5k33J98
$$ 3 334 129 -154 -116 -55 -220 -107 72 171 215 137 -113 -46 19 97 210 -154 127 36 -74 24 119 -114 84
4090H4j15J3P2j42L68k69J39k35m1J34K32K1l71K33L4j11J9K28j12k82K09j07
$$ 84 -31 -18 54 -88 280 11 150 -85 -126 8 240 261 -110 123 157 46 65 293 181 -101 108 1
4112AJ83l94O8J08J61m47L70l1k19J52q3M0j13K24J22q4l5kj07K86qn8m1K9n8
$$ 1 184 -210 -142 -34 127 -320 50 19 -200 -48 -131 -91 -204 20 142 58 23 21 -86 200 192 134 93 122 64
4137F4O2l95J65Q6j56J76Q8P6j81j82J80r2J63P0j60J64j79q4M75n86L90p7k04
$$ 64 126 -269 -104 -18 -174 2 90 166 -15 -197 -17 -109 54 124 -36 128 -51 -135 340 -246 144 67 -137
4160a37j50K32j99J06K34J91q6j56j19j6oK40l41K46J25J01o6l24K49j71K09m0
$$ -137 -287 -55 -254 -148 86 277 191 35 -84 -100 -106 134 -207 39 164 265 199 -125 124 -47 162 122
4182A22r1n3P3K1o5K43k58n3K06j44J34j10OK57k35j88L58l65J41Q8k67K51R7
$$ 122 31 -22 51 72 7 250 -8 -61 145 1 135 25 31 288 53 -135 223 -142 -1 87 -180 71 168
4205A68l30K12J19l85K67j17jR7J37j11m6l17J38K00J18k49L77m11J95p1j74L77
$$ 168 -162 50 169 -216 51 -66 -67 30 167 56 10 -307 -169 31 149 -100 277 -134 61 -10 -184 193
4227A93j23K6m7m6Q4k02J76k46M0N1L9J30r6N8l27K42P0M1k0J21j02L4j91P9J24
$$ 193 70 96 49 3 87 -115 61 -185 -145 -94 -55 75 -21 37 -290 -48 22 63 43 164 62 96 -95 -16 108
4252A08k58K55k00K1n9o3K11P5J9k48r4J91L04k35J51j63O2J92m75M76r8l65L4
$$ 108 -150 105 -95 -74 -133 -196 15 90 109 -139 -233 -42 262 27 178 15 77 269 -206 270 172 -193 -159
4275a59K47k19J0K33k95l6KJ66l2J83j63J32mq9J08j46J24j08J84k31J45J27k82
$$ -159 88 -131 -121 112 -183 -219 -217 -51 -83 100 -63 69 65 -24 84 -62 62 -46 138 -93 52 179 -103
4298a03J29j75P0j02L01k56J27R0L8k95K28J31k89J10L86m73K33j11j67K25R4
$$ -103 26 -149 -79 -181 120 -136 -9 81 119 -176 52 183 -106 4 390 -83 150 39 -128 97 191
4319A91j69J67j77K9J32l19J88k54L16k18M31j92M7m7P5n8K2N8k18m7J30k64K22
$$ 191 22 189 12 41 173 -146 42 -212 104 -114 317 125 172 125 200 142 164 222 4 -43 87 -177 45
4342D5j11rj2J62j81j12N02k38Pp7P9j30K30j84K59q8k81J06L9Jj60J32K87l91
$$ 45 -66 -75 -87 75 -106 -218 284 46 53 -24 55 -75 155 -29 230 142 -139 -33 6 7 -153 -21 266 -125
4366a25J79j74J17p6n2n7R0K17l18K32K25q2j55n9O2j36J63J47j77J58k77K07
$$ -125 54 -120 -3 -79 -131 -188 -98 119 -199 33 258 176 21 -38 24 -112 51 198 21 179 -98 109
4388A09k4m3o9o9o8L08l20K25L26l71j24J62l1P5k86J86K60j89l01J43K79j02
$$ 109 85 42 -27 -96 -164 144 -176 49 375 4 -120 42 11 86 -200 -14 246 57 -244 -101 178 76
4410G6j69K57k78L47l66K7J77m9j85L35j68j4P0q9Kj45J66J05j75o6k8L3K9J66
$$ 76 -93 164 -114 233 -133 -106 71 22 -163 172 4 -10 60 -29 -27 -172 -6 99 -76 -142 -170 -137 -108 58
4434E8m0k9N5j43K43%k88J5J22L5j96L1J90k01JJ70R2J06P4l55n6kJ99l5j28K27
$$ 58 18 -11 44 -99 144 144 -144 -129 -7 28 -168 -137 53 -148 -147 23 115 221 295 -60 -116 -118 81 46 -82 145
4460A45j93j31N0n0K59J8r4J55N5o6l66K71p6J49k85J61J17P4j7j08Q0k38K25
$$ 145 -48 -179 -129 -179 80 98 4 159 214 148 -218 53 -23 126 -159 2 119 193 176 68 148 -90 135
4483A35k42O1q9J14J5J15K3j53j0o2J6j10J04J77j05Q8k13P6J82p0K8l0N5l24
$$ 135 -107 -46 -135 -21 -6 109 132 -21 -31 -93 -77 -187 -83 94 -11 77 -136 -60 122 52 80 50 105 -219
4507b19l7K49k1j81J80N7J46l19K00m5j52L51m19K94k83Q7K44RJ06j44o0j11m7
$$ -219 -256 -7 -28 -209 -29 28 174 -145 55 10 -142 209 -210 84 -199 -112 132 141 247 103 43 -68 -115
4530a15j8N0J02K12j01m13J42LJ47j90K28l71L90J11j50j41L05m58M68P9k55K54
$$ -115 -133 -83 19 231 130 -283 -141 -138 9 -181 47 -324 66 177 27 -114 191 -267 201 280 25 279
4552B79k66J08k17OJ31K17l72l4L55l08K70l10K58j80Q3Q2k54J02O5J20k2p9j85
$$ 279 13 121 -96 -90 41 258 -114 -148 207 -101 169 -141 117 -63 20 102 -152 -50 15 135 113 34 -151
4575a51K23J8J92j64j36j23K97l15K19j36L18l22j60J69J42n1k62K39P1J89k43
$$ -151 72 90 282 118 -18 -141 156 -159 60 -76 242 -80 -240 -71 71 20 -242 -3 68 257 14
4596A4lj02R4q1R4J1J46j7m4Q7l03Q9R0n2J9J33j43K5l7m5o4N6K53n65L61j52
$$ 14 11 -91 3 -78 16 27 173 156 112 199 -104 -15 75 23 42 175 32 57 20 -25 -89 -33 220 -345 16 -136
4622a36OJ8k2K33R8j98j80L44j36Q4j47J74j73o8J92K65j49j27j63K15l03L12
$$ -136 -130 -112 -134 99 197 -1 -181 163 27 111 -36 138 -35 -103 89 354 205 78 -85 130 -173 139
4644A39m2Ln37M39q7k83O98l00L58m19J39K8l8M5l30L33k71L9K59k44R1M8N0j44
$$ 139 97 100 -437 2 -85 -368 330 30 388 -31 108 136 98 143 -187 146 -125 -86 173 -71 20 68 118 -26
4668b6r1j39K25j6L30j35j52N7K73m77J34J73k9j47J83m4p6J43m25L40j80K24
$$ -26 -117 -256 -31 -47 283 148 -4 53 326 -151 -17 156 127 -20 163 119 43 186 -239 101 -79 145
4690A45k37K21j14J0J92k58N4J25m8j79J93q9N4k56J91k52K30L15k76j48K54q0
$$ 145 -92 129 15 25 217 -41 13 138 90 -89 104 15 69 -187 4 -248 -18 297 21 -127 127 47
4712D7l0J76j56r3P1j04L5J91j44l04M13k9l11L58k03K14J09m77L87k07n3K62
$$ 47 17 193 37 -56 15 -89 -54 137 -7 -311 102 73 -238 120 -83 131 240 -237 150 -57 -110 152
4734A52l60J81J28j36K98j43P3m79L89k75L00Mj92L30l54O3M1J30rj22J87k15
$$ 152 -208 -27 101 -35 263 120 193 -286 103 -172 128 132 -60 270 -84 -21 20 150 141 19 206 -9
4756io3L58l67J27J31l84N8P6J20m9K02j83n5o8Q9L82l34N3l3R7k12L1J10KK2
$$ -9 -72 286 -81 46 177 -207 -149 -73 47 -2 200 17 -38 -106 -17 365 31 84 51 148 -64 -33 77 79 101
4781A01m0K03l58J24k4k4M29k58k05J60jj03j98M3M67q4j33j97R6Q7k55J91M7
$$ 101 61 264 -94 30 6 -18 411 153 -52 108 107 4 -194 -151 316 232 99 -98 -2 85 -170 21 68
4804F8J08k1k71LM97k53j74R6j53n5J35J17J13j81K30m63K64j33n6L62k90J7o9
$$ 68 176 155 -116 -113 384 131 -43 53 -100 -155 -20 97 210 29 259 -204 60 -73 -129 233 -57 -40 -109
4827a09K46k75L04j73Q5L84m29P5k83J11L46k77q3R7R2j35n3L7K5Q7o7P7j97k13
$$ -109 137 -138 166 -7 78 462 33 108 -175 -64 282 5 -78 19 111 -24 -77 -40 -15 72 5 82 -115 -328
4851c28K61J88p8l98K26k5J57j4j50K01K15m41j3M66k95j66L43q2p1o4r6L11k22
$$ -328 -67 121 43 -355 -129 -154 3 -11 -161 40 255 -186 -199 267 -28 -194 149 67 -4 -68 -164 147 -75
4874g5J15j53K51nJ09m40J77MP2j66J43j33jM0M2J00N5k08J71r1q5n2J5J72R5
$$ -75 40 -113 138 133 242 -198 -21 -17 55 -111 32 -101 -102 -62 -20 80 135 -73 98 7 -78 -130 -115 57 152
4899A52j25q9J40K3m0j05L8L7o9K3j8j83J84J19k33K63k85J4J97j33K00m7j70
$$ 152 27 -62 78 101 61 -44 -6 31 -38 -15 -33 -216 -32 87 -146 117 -168 -154 43 -90 110 63 -107
4922a07M1J87j3j82k43j19M02j62O6j06J64L42k66q3l4J5K10k31J67k73L12j4
$$ -107 -66 121 108 -74 -317 -436 -34 -196 -130 -236 -72 270 4 -79 -113 -98 112 -119 48 -225 87 73
4944G3J5k11J84M3k43j45RJ14N9M7K18l69J52K07r9n8r3n8J42Q0j95m4J66Pr4
$$ 73 88 -123 61 104 -139 -284 -275 -161 -102 -55 163 -206 -54 153 54 -4 -97 -155 -13 67 -128 -172 -6 1 -93
4969i3q7J18J27k09K00M5L0j32Q2k68Q1K6m7N8J5j0p1k53J90M59k46Q2k9j12j40
$$ -93 -180 -62 65 -144 56 101 131 -1 81 -187 -106 -80 -127 -69 -54 -64 -135 -388 -198 261 15 97 68 -44 -184
4994a84K29rj03J6J35j32K7J63l30j75M36l41K76M5k86L27J1k58j70J68K05n2
$$ -184 45 36 -67 -51 84 -48 -21 142 -188 -363 73 -268 8 53 -233 94 105 -153 -323 -155 50 -2
5016bj76J7K14NJ20K7k25m3j24K41j27o0j49M18j86K54k18p2J63j97Ln8J92k10
$$ -2 -178 -161 53 58 178 205 -20 -63 -187 54 -73 -133 -282 136 -50 204 -14 -86 77 -120 -117 -175 17 -193
5040a93J41L8m2m4J7k2J15j84L2K74j09l24N38o7k69J34j32J63K10k24R9J01k54
$$ -193 -52 -14 -56 -100 -83 -105 10 -174 -142 132 23 -301 237 170 -99 35 -97 66 276 52 151 252 -2
5063br0J65L1R7j88j39O0k4K02J59j50r9k79K66Nm8oK75m97K05J08m4N3P4k2k07
$$ -2 -92 73 104 201 13 -126 -66 -90 112 271 121 22 -257 9 14 -34 -40 235 -262 -57 51 7 60 134 112 -95
5089i5J88j06J2J34n5J09l71L84l16J54J23%K28l25j43M0j71J05K52k51N8R9l33
$$ -95 93 -13 -1 133 78 187 -184 200 -116 38 161 161 389 64 -79 -39 -210 -105 147 -104 -46 53 -280
5112b80K66m1m6n7k2K18Pj11K58j69J5n0J74k66L22l94n2M44j94j69L29P4j98
$$ -280 -14 -55 -101 -158 -180 38 45 -66 192 23 38 -12 162 -104 218 -176 -228 216 22 -147 182 256 58
5135E8J26l18J24K6L1k41J60P0K4j91j2K61j87K15k49k1R2J31k99L15k03J38K40
$$ 58 184 -134 -10 16 47 -194 -34 36 60 -131 -143 118 -69 146 -103 -124 -32 99 -200 115 -88 50 290
5158B90m45L53j19k40J28L43k32p5J09M9j38j84Q2l3P5l23M93l54J60P3R8j89
$$ 290 -155 198 79 -161 -33 310 78 3 112 161 23 -161 -79 -112 -37 -360 133 -221 -61 12 110 -79
5180g9L3r1K09M5J03l61K15j99Q6Q7l23K24J14J38k44J5Q7k5k04N5L89k19J41
$$ -79 -46 -137 72 117 220 -141 74 -125 -39 48 -275 -51 63 201 -43 -28 59 34 -170 -115 274 55 196
5203A96l79J67J08l20M06P5k30k69L55P4J7r6J19m29L3L8J55J31j77J91l72J93
$$ 196 -183 -16 92 -228 178 253 23 -246 109 183 200 104 223 -206 -173 -135 20 151 -26 165 -207 -14
5225a4jj37K00J5r9j10Q4K37j53j1k13L01k10Q2O0o1K7j75K0j35L21j72J8J0K39
$$ -14 -15 -152 48 63 -36 -146 -62 175 22 11 -202 99 -111 -29 31 -30 -3 -178 -158 -293 28 -144 -126 -116 123
5250A23pk43RK7J05k2K41r4j00J20k70M5J29Q2j4M7k0j72J36Q9k01L3J40q0P1
$$ 123 116 -127 -118 -91 14 -8 233 139 39 159 -111 -66 63 145 131 178 158 -14 122 211 10 43 183 103 174
5275A74k73K66L5m85M30j40J54k85K92k09J82l17J40J83j57j44J81N2k5k34m7
$$ 174 -99 167 202 -283 147 7 161 -124 168 -41 141 -176 -36 147 -10 -154 27 79 54 -180 -227
5296b27K36K84k54m4l9J64J7l14L73l87K89p9L9J02P1k86J76m7j2l13J98q4p6
$$ -227 9 293 39 -5 -44 120 137 -177 196 -191 98 19 58 160 231 -55 121 74 62 -251 -53 -137 -213
5319b13K53j76L3O7K54k57M9j06K5J01n7j34J63k29J76R6l52N35k12K38l36q6
$$ -213 40 -136 -103 -36 218 -39 10 -96 -71 30 -27 -161 2 -227 -51 45 -307 228 16 254 -82 -168
5341a68L39k40K29k11k9rJ15r2q2K74j62j62K54k8r0j07L11j12P6k65J98L13m36
$$ -168 171 -69 160 -51 -80 -89 26 -66 -148 126 -36 -198 56 28 -62 -169 142 30 106 -159 39 352 -84
5364h4j47M21k96Q5j75kK30j73K22j21J75j14j32j74K22L8n9J70k18K09n41N99
$$ -84 -231 190 -106 -21 -196 -198 32 -141 81 -40 135 21 -111 -285 -63 -25 -84 86 -132 77 -464 135
5386A35k35K02M9m50J62K05Pm9K22l83nK53k92J22N2nJ60j37K4K80j94k07m0K24
$$ 135 -100 102 151 -299 -137 68 75 26 248 -135 -140 113 -179 -57 -5 -10 150 13 37 317 123 -84 -124 100
5410A00M9o9j93P6J33p7k05J68L56o7k83j85J84J99l39K54k97Q8K61m03L24j66
$$ 100 149 80 -113 -37 96 19 -186 -18 338 271 -12 -197 -13 186 -153 101 -196 -108 153 -250 74 -92
5432i2Q5J38l76L5L21l2m34L68q9j81O8J04r6J29J54j76k06J79K28L6j31j96L02
$$ -92 -7 131 -245 -210 111 79 -355 13 -76 -257 -189 -85 -181 -52 102 -74 -280 -101 127 163 32 -164 138
5455A38r3j14p6K52m5j93m5K56j93K09k59p1R9K06kL4j29J9N3j15L9j05J28l67
$$ 138 45 -69 -145 107 62 -131 -176 80 -113 96 -163 -234 -135 71 69 103 -26 -7 46 -69 -30 -135 -7 -374
5479c74M75J28J7l26Q1j98j34J62K24o9K62m50K89k77K88l14J87J99n5j3Nk82
$$ -374 101 229 246 -80 1 -197 -331 -169 55 -14 248 -202 87 -190 98 -216 -29 170 115 102 107 -175
5501a75J52K10k37QK08l41J79j8K2r0j8J59J50k13P8l23K92j43K41j36K18k7l2
$$ -175 -23 187 -50 -42 166 -175 4 -14 8 -82 -100 59 209 -4 74 -249 43 -100 141 5 223 196 164
5524A64l43K33O7l51M20j36J44j99k6k0J95k85Q3l9J15k80L82q2J46n45N94k82
$$ 164 -179 54 121 -230 190 54 198 -1 -27 -47 148 -137 -54 -93 22 -258 124 42 188 -357 237 -45
5546d5l4K23k32P5l9m6J16L2k7J1k12j0J78J80R8k23J20k77O1k26K90Pk3J97N7
$$ -45 -79 144 -88 -13 -52 -98 18 50 23 34 -178 -188 -10 170 268 45 165 -112 -51 -277 13 20 -3 194 251
5571B51m52J3N7K77Qj17K91l70J9o9k02M37n1m3p2J80p2j5k1O7k58K42O1j36J6
$$ 251 -201 -188 -131 146 154 37 328 -42 -23 -92 -294 143 92 49 -23 157 85 70 49 116 -142 100 161 25 41
5596D1r9Nm4K7K42k95J87n4Jj28K66Lk54J20j93M3L1J61k6p6L7K46j76J28j28
$$ 41 -58 -53 -97 -70 172 -123 64 10 11 -117 149 152 -102 18 -175 -132 -101 60 34 -42 -5 241 65 193 65
5621F5Q4j65J39j46J41r6Q9j45j02K79J4k02k70L55j88O9k7L81k09j29O8r8p1
$$ 65 149 -16 123 -23 118 22 111 -34 -136 143 157 -45 -315 40 -148 -79 -106 275 66 -63 5 -93 -164
5644a64K93k58J32r2j5K10k03Q1o9L11k16K1M8jL8j4m5k37L53n36M51P7q4J44
$$ -164 129 -129 3 -89 -104 106 -97 -16 -85 226 10 31 79 78 116 102 57 -180 173 -363 88 165 81 225
5668B25N9o31O46k62N1j1j5p6M9j19L64k63k00q4M30k37J23j48PK77j23j22J29
$$ 225 284 -347 299 37 88 77 62 -14 35 -84 280 17 -183 -267 163 -74 49 -99 -92 185 62 -60 69
5691F9k6R9k05J87m7k67J95L4J01k95J84l6k09K13J29k71L45k41o8K01r3k6O4
$$ 69 43 142 -63 124 77 -190 5 39 140 -155 29 -7 -216 -3 126 -145 200 -41 -109 92 -1 -27 37
5714C7M6l1j44L65l88J16j76J48P9J95J6l82L53k40k35J48J74j88J81j54J69n
$$ 37 83 52 -92 273 -115 1 -175 -27 52 247 263 -119 234 -6 -241 -93 81 -107 74 -80 89 84
5736H4J02k68K30m50J74L6p4J26O4o8K13l8j87mj78m2K19j1J40L4l52K72j18L67
$$ 84 186 -82 148 -302 -128 -92 -166 -40 24 -44 169 131 -56 -60 -238 -280 -61 -72 68 102 -250 22 -96 271
5760B71j52R2k50J76j11l0j20J77J6m8j25J30j02J07o4j3O5j73J50J5J64n08K90
$$ 271 119 211 -39 137 26 -4 -124 53 69 21 -104 26 -76 31 -33 -46 19 -154 -4 11 175 -333 -43
5783d3M18l46j22PJ98j06L3j25J2K97q6J20k4j46J13k13J49o0O1j09l11L31J30
$$ -43 375 29 -93 -86 112 6 39 -86 -74 223 137 257 233 87 200 -13 136 76 137 28 -283 48 178
5806A78j98K37k20j28K22j28J23j98J19j49L20l33J00j65J70J75j55J6J38L16
$$ 178 -20 217 -3 -131 91 -37 86 -112 7 -142 178 -155 -55 -220 -50 125 -30 -14 124 440
5826D40p16J29L08j98r0M2K89l19K0J51p5J10l32K54K89k41J8J23r0n4J10n3j20
$$ 440 -276 -147 161 -37 -127 -85 204 -115 -95 56 -19 91 -241 13 302 61 79 202 112 58 168 115 -5
5849ej98N7K2L03j37j43J77p0o1L49l02p1K51k20j18J7J31J02j5q4OJ20m3o8j76
$$ -5 -203 -146 -124 179 42 -101 76 6 -55 294 -8 -79 172 -48 -166 -149 -18 84 69 -15 -9 111 68 0 -176
5874a76L04K5j05j05Q8p7k9J81N4l86J92J19M8k95J72Q0J61k39r4r5M06k49j9
$$ -176 128 153 48 -57 31 -46 -75 106 160 -226 -34 85 133 -162 10 90 251 12 -82 -177 229 -20 -39
5897c9J70j84L23k86J24k23K54j38J78j8m29N40l80j43K78m8l14M41l25K8K72
$$ -39 131 -53 270 -16 108 -115 139 1 179 161 -268 272 -108 -251 27 -21 -335 106 -219 -191 81
5918H1j06J2k92P6l6L0p0J16Q9J36K47j80j36j3k25K98L5L9J1j87K56k80J23j84
$$ 81 -25 -13 -305 -229 -265 -235 -305 -189 -100 36 283 103 -33 -46 -271 27 62 101 112 -75 181 -99 24 -160
5942a60K38j00J12oj15K09k17Q2r3o1r7j6L26l16J55K58k79Q1oJ03L6k32K66l61
$$ -160 78 -22 90 84 -31 178 -39 43 -50 -111 -208 -224 102 -214 -59 199 -80 1 -5 98 134 -98 168 -193
5966a93Q4Q1j32J62q9L41k32j77J28j45N8l4K08j80J35j11K93l52J94o6l2j72
$$ -193 -109 -28 -160 2 -87 254 22 -155 -27 -172 -114 -148 60 -120 15 -96 197 -155 39 -27 -59 -231
5988b31J85j21J01J12q3J14L5m22M15l47L35k31J72j1m5J58n05L49P5K9j67K89
$$ -231 -46 -167 -66 46 -37 77 112 -310 105 -242 93 -138 34 23 -22 136 -369 -20 55 84 -83 206
6010B06k30K47j31k32j84K93O5Q1j04Q6l24K27j13j68K05K06Mk01J83j05j22k5
$$ 206 -24 223 92 -140 -324 -31 34 115 11 97 -227 0 -113 -281 -76 130 134 -67 116 11 -111 -136
6032a36J90k11J23K39j90k0J17K16m77P9M6R9j21K66m06l0J89L4n8P1K50k35l
$$ -136 54 -157 -34 205 15 -5 112 328 -149 -70 -24 75 -46 220 -186 -216 -27 7 -51 20 270 35 32
6055C2M5L5l6m8j38L17q5J8k61K9P8j39J15l8m5j15J55R9k15P2K97j10m0Q9l82
$$ 32 77 112 76 28 -110 207 122 140 -121 -92 -14 -153 -38 -76 -121 -236 -81 18 -197 -125 172 62 22 111 -271
6080b71J61R1J19K0r3k34K89j02L74m37L76k70j91J18K38k3m41L24q0J61n2O0
$$ -271 -110 -19 100 120 27 -207 82 -20 354 -83 293 23 -168 -50 188 165 -276 48 -32 129 77 137
6102A37j40j81Q5J96j02l6j3J48k0j03O1K62k99l3O5qk7O4j05J9j38J17J78j11
$$ 137 -3 -184 -99 97 -5 -41 -54 94 74 -29 32 294 -5 -38 27 19 -8 56 -49 -30 -168 -51 127 16
6126A6J16k33K02j0j69J56l23o9Q8l1K03k48L21K5l55J08q5K05K25r0O4k7Q0j53
$$ 16 132 -101 101 91 -78 78 -245 -314 -226 -257 -54 -302 19 44 -311 -203 -288 -83 142 52 116 89 169 16
6150A6l64L87m2K48k96k1o6p2oK51p3J45k19k31M41n5J20K24k35m9q3L2N7q9j45
$$ 16 -348 39 -3 245 -51 -72 -138 -210 -216 35 -38 107 -112 -343 98 43 163 387 152 103 20 52 109 20 -125
6175a25J06J42k02j11P3L38l46K00o9J42k79J19j4j23j2M56l31l4j53L98K1j07
$$ -125 -19 123 -79 -190 -117 221 -125 75 6 148 -131 -12 -26 -149 -161 295 -36 -70 -223 175 196 89
6197H9k08P3J19J1r8P6p4j55K48J58q2j40m4l7J2k93K58L2K12j91KJ04K9j14M0
$$ 89 -119 -46 73 84 -14 62 -12 -167 81 239 157 17 -27 -64 -52 -345 -87 -55 157 -34 -32 72 101 -13 27
$$ [...]
8191a17
##END NTUPLES=NMR FID
##END=
