##TITLE=1H_LR-758-R3-CR4
 CCl4
 8 sc, 
 7.6.2023
##JCAMPDX= 6.0         $$ Bruker NMR JCAMP-DX V2.0
##DATA TYPE= NMR FID
##DATA CLASS= NTUPLES
##ORIGIN= UXNMR, Bruker Analytische Messtechnik GmbH
##OWNER= root
$$ XWIN-NMR		Version 3.5
$$ Wed Jun  7 14:29:04 2023 Russian Standard Time (UT+4h)  she@DPX200
##.OBSERVE FREQUENCY= 200.13135
##.OBSERVE NUCLEUS= ^1H
##.DELAY= (6, 6)
##.ACQUISITION MODE= SIMULTANEOUS
##.ACQUISITION SCHEME= undefined
##.AVERAGES= 8
##.DIGITISER RES= 18
##SPECTROMETER/DATA SYSTEM= spect
##.PULSE SEQUENCE= zg30
##.SOLVENT NAME= CDCl3
##.SHIFT REFERENCE= (INTERNAL, CDCl3, 0, 15.7039)
##AUDIT TRAIL= $$ (NUMBER, WHEN, WHO, WHERE, WHAT)
$$ ##TITLE= Audit trail, XWIN-NMR		Version 3.5
$$ ##JCAMPDX= 5.01
$$ ##ORIGIN= Bruker BioSpin GmbH
$$ ##OWNER= she
$$ F:/spectra/data/she/nmr/H-F/1/audita.txt
$$ ##AUDIT TRAIL=  $$ (NUMBER, WHEN, WHO, WHERE, WHAT)
(   1,<2023-06-07 14:27:50.87 +0400>,<she>,<DPX200>,
      <created by zg, POWCHK disabled, PULCHK disabled
       configuration hash MD5:
       00 E9 B6 7A A2 85 ED C7 34 08 36 98 17 FE 4E 26
       data hash MD5: 16K
       64 0E 24 97 79 30 3E 43 6B 5D A7 5C C1 71 0F 4A>)
$$ ##END=
$$ 
$$ hash MD5
$$ E5 F7 46 6B EA 26 BB 9D 25 BA 88 CF 94 AF 1A D2
##$RELAX= 
##$RELAX= 
##$RELAX= 
##$RELAX= 
##$RELAX= 
##$RELAX= 
$$ Bruker specific parameters
$$ --------------------------
##$DU= <F:/spectra>
##$EXPNO= 1
##$NAME= <H-F>
##$PROCNO= 1
##$TYPE= <nmr>
##$USER= <she>
##$AMP= (0..31)
100 100 100 100 100 100 100 100 100 100 100 100 100 100 100 100 100 100 
100 100 100 100 100 100 100 100 100 100 100 100 100 100 
##$AQSEQ= 0
##$AQ_mod= 1
##$AUNM= <au_zg>
##$AUTOPOS= <>
##$BF1= 200.13
##$BF2= 200.13
##$BF3= 200.13
##$BF4= 200.13
##$BF5= 200.13
##$BF6= 200.13
##$BF7= 200.13
##$BF8= 200.13
##$BYTORDA= 1
##$CFDGTYP= 0
##$CFRGTYP= 5
##$CHEMSTR= <none>
##$CNST= (0..31)
1 1 145 1 1 1 1 1 1 1 1 1 1 1 1 1 1 1 1 1 1 1 1 1 1 1 1 1 1 1 1 1 
##$CPDPRG= <>
##$CPDPRG1= <>
##$CPDPRG2= <>
##$CPDPRG3= <>
##$CPDPRG4= <mlev>
##$CPDPRG5= <mlev>
##$CPDPRG6= <mlev>
##$CPDPRG7= <mlev>
##$CPDPRG8= <mlev>
##$CPDPRGB= <>
##$CPDPRGT= <>
##$D= (0..31)
0 1.2 0 0 0 0 0 0 0 0.06 0 0.03 0 0 0 0 0.0002 0 0 0 0 0 0 0 0 0 0 0 0 
0 0 0 
##$DATE= 1686133670
##$DBL= (0..7)
120 120 120 120 120 120 120 120 
##$DBP= (0..7)
150 150 150 150 150 150 150 150 
##$DBP07= 0
##$DBPNAM0= <>
##$DBPNAM1= <>
##$DBPNAM2= <>
##$DBPNAM3= <>
##$DBPNAM4= <>
##$DBPNAM5= <>
##$DBPNAM6= <>
##$DBPNAM7= <>
##$DBPOAL= (0..7)
0.5 0.5 0.5 0.5 0.5 0.5 0.5 0.5 
##$DBPOFFS= (0..7)
0 0 0 0 0 0 0 0 
##$DE= 6
##$DECBNUC= <off>
##$DECIM= 32
##$DECNUC= <off>
##$DECSTAT= 4
##$DIGMOD= 1
##$DIGTYP= 9
##$DL= (0..7)
0 120 120 120 120 120 120 120 
##$DP= (0..7)
150 150 150 150 150 150 150 150 
##$DP07= 0
##$DPNAME0= <>
##$DPNAME1= <>
##$DPNAME2= <>
##$DPNAME3= <>
##$DPNAME4= <>
##$DPNAME5= <>
##$DPNAME6= <>
##$DPNAME7= <>
##$DPOAL= (0..7)
0.5 0.5 0.5 0.5 0.5 0.5 0.5 0.5 
##$DPOFFS= (0..7)
0 0 0 0 0 0 0 0 
##$DQDMODE= 0
##$DR= 18
##$DS= 0
##$DSLIST= <SSSSSSSSSSSSSSS>
$$ [...]
##$SUBNAM2= <"">
##$SUBNAM3= <"">
##$SUBNAM4= <"">
##$SUBNAM5= <"">
##$SUBNAM6= <"">
##$SUBNAM7= <"">
##$SUBNAM8= <"">
##$SUBNAM9= <"">
##$SW= 18.05172834244
##$SWIBOX= (0..15)
0 0 2 0 0 0 0 0 0 0 0 0 0 0 0 0 
##$SW_h= 3612.71676300578
##$TD= 16384
##$TD0= 1
##$TE= 0
##$TE2= 300
##$TE3= 300
##$TEG= 300
##$TL= (0..7)
0 120 120 120 120 120 120 120 
##$TP= (0..7)
150 150 150 150 150 150 150 150 
##$TP07= 0
##$TPNAME0= <>
##$TPNAME1= <>
##$TPNAME2= <>
##$TPNAME3= <>
##$TPNAME4= <>
##$TPNAME5= <>
##$TPNAME6= <>
##$TPNAME7= <>
##$TPOAL= (0..7)
0.5 0.5 0.5 0.5 0.5 0.5 0.5 0.5 
##$TPOFFS= (0..7)
0 0 0 0 0 0 0 0 
##$TUNHIN= 0
##$TUNHOUT= 0
##$TUNXOUT= 0
##$USERA1= <user>
##$USERA2= <user>
##$USERA3= <user>
##$USERA4= <user>
##$USERA5= <user>
##$V9= 5
##$VALIST= <valist>
##$VCLIST= <CCCCCCCCCCCCCCC>
##$VD= 0
##$VDLIST= <DDDDDDDDDDDDDDD>
##$VPLIST= <PPPPPPPPPPPPPPP>
##$VTLIST= <TTTTTTTTTTTTTTT>
##$WBST= 1024
##$WBSW= 4
##$XGAIN= (0..3)
0 0 0 0 
##$XL= 0
##$YL= 0
##$YMAX_a= 876677
##$YMIN_a= -951173
##$ZGOPTNS= <>
##$ZL1= 120
##$ZL2= 120
##$ZL3= 120
##$ZL4= 120
##$ABSF1= 10
##$ABSF2= 0
##$ABSG= 5
##$ABSL= 3
##$ALPHA= 0
##$AQORDER= 0
##$ASSFAC= 0
##$ASSFACI= 0
##$ASSFACX= 0
##$ASSWID= 0
##$AUNMP= <proc_1d>
##$AZFE= 0.1
##$AZFW= 0.1
##$BCFW= 1
##$BC_mod= 2
##$BYTORDP= 1
##$COROFFS= 0
##$CY= 11.3945322036743
##$DATMOD= 1
##$DC= 2
##$DFILT= <>
##$DTYPP= 0
##$F1P= 15.7292609196834
##$F2P= 12.9074282941183
##$FCOR= 0.5
##$FTSIZE= 0
##$FT_mod= 4
##$GAMMA= 1
##$GB= 0.15
##$INTBC= 1
##$INTSCL= 1
##$ISEN= 128
##$LB= 0.24
##$LEV0= 0
##$LPBIN= 0
##$MAXI= 10000
##$MC2= 0
##$MEAN= 0
##$ME_mod= 0
##$MI= 1.114404
##$NCOEF= 0
##$NC_proc= 0
##$NLEV= 6
##$NOISF1= 3.799351
##$NOISF2= 2.8
##$NSP= 1
##$NTH_PI= 0
##$NZP= 0
##$OFFSET= 15.70392
##$PC= 1
##$PHC0= -19904.33
##$PHC1= 9.25272
##$PH_mod= 1
##$PKNL= yes
##$PPARMOD= 0
##$PSCAL= 0
##$PSIGN= 0
##$REVERSE= no
##$SF= 200.130013532006
##$SI= 16384
##$SIGF1= 3
##$SIGF2= 2
##$SINO= 400
##$SIOLD= 16384
##$SREGLST= <1H.CDCl3>
##$SSB= 0
##$STSI= 0
##$STSR= 0
##$SW_p= 3612.71676300578
##$SYMM= 0
##$S_DEV= 0
##$TDeff= 0
##$TDoff= 0
##$TI= <>
##$TILT= no
##$TM1= 0
##$TM2= 0
##$TOPLEV= 0
##$USERP1= <user>
##$USERP2= <user>
##$USERP3= <user>
##$USERP4= <user>
##$USERP5= <user>
##$WDW= 1
##$XDIM= 8192
##$YMAX_p= 0
##$YMIN_p= 0
$$ End of Bruker specific parameters
$$ ---------------------------------
##NTUPLES= NMR FID
##VAR_NAME=  TIME,          FID/REAL,        FID/IMAG
##SYMBOL=    X,             R,               I
##VAR_TYPE=  INDEPENDENT,   DEPENDENT,       DEPENDENT
##VAR_FORM=  AFFN,          ASDF,            ASDF
##VAR_DIM=   8192,          8192,            8192
##UNITS=     SECONDS,       ARBITRARY UNITS, ARBITRARY UNITS
##FACTOR=    0.0002768,     1,               1
##FIRST=     0,             0,               0
##LAST=      2.2672688,     0,               0
##MIN=       0,             -951173,         0
##MAX=       2.2672688,     876677,          0
$$ Real data points
##PAGE= N=1
##DATA TABLE= (X++(R..R)), XYDATA
0 0 0 0 0 0 0 0 8 0 0 0 0 -8 8 -8 8 -10 14 -16 20 -24 27 -32 36 -40 44 -52 60 -69 76 -85 94 -104 115 -129
34 -129 143 -157 175 -190 208 -228 253 -275 300 -328 359 -391 430 -470 516 -568 626 -689 765
53 765 -850 954 -1077 1221 -1399 1622 -1909 2282 -2788 3495 -4526 6121 -8779 13698 -24396
68 -24396 55751 -303348 -951173 739717 -13772 -541283 876677 -239052 -553020 634471
78 634471 -161418 -133564 479029 -415592 -289890 157809 -39794 221032 -123864 -225961
88 -225961 320613 -91434 -2492 379439 -266394 -192579 119403 -55201 243766 -39234
98 -39234 -292792 177290 -102944 -31686 305093 -322590 -98049 212644 -245714 305368
108 305368 240526 -425923 198026 49186 -210860 441800 -293472 -395911 491995 -328947
118 -328947 -143095 692211 -445013 -269604 543967 -286550 34363 338623 -474440 88208
128 88208 264824 -282693 288662 35842 -424149 216569 1854 -169006 246027 -179143
138 -179143 -156762 243360 -4633 84550 53153 -159600 110862 -57484 -71391 237581 -222625
149 -222625 -181562 250428 -90988 5755 151347 -208033 26249 66978 -98755 201195
159 201195 -65367 -153149 239715 -87794 -23375 225709 -290610 -64409 189316 -238670
169 -238670 115368 128929 -292455 199073 93995 -206267 299267 -62189 -290958 294847
179 294847 -59580 -172826 260462 -153869 -122246 213658 -125207 9521 95720 -216273
189 -216273 75602 98905 -116028 153354 11995 -122923 140552 -16574 -60777 51814
199 51814 -127248 -9618 52545 -73816 99290 -6438 -109660 135633 -9230 -61918
209 -61918 113460 -85616 -28158 101744 -78962 60775 33396 -152733 104938 3576
219 3576 -154981 138604 -42977 -137838 181354 -16292 -55383 157244 -81996 -27066 101421
230 101421 -125411 25507 50232 -154816 88051 52439 -127509 109027 4160 -117433
240 -117433 104401 -11077 -52504 91522 -46691 -410 78758 -64702 23843 22784 -99544
251 -99544 29119 2549 -63265 45073 -16487 -3408 69526 -31773 33543 40149 -89458
262 -89458 41381 31390 -93798 51304 20751 -69897 52824 -2284 -44032 27910 -41114
273 -41114 6750 40788 -52227 54332 44737 -68393 64307 23665 -89094 42705 -4628
284 -4628 -73484 39936 -16158 -27657 53686 -21648 6666 46544 -43294 12936 28703 -47078
296 -47078 19895 16496 -23556 28661 -13025 -17428 18315 -49407 -5483 32027 -50010 17776
308 17776 55526 -30768 19895 38621 -28862 -1035 2818 -15703 -5260 -25962 7942 15532
320 15532 -36813 21120 28365 -44075 15448 29501 -36891 6383 24770 -8429 10992 5999
332 5999 538 604 -29609 -3416 1757 -39717 6426 27497 -16232 14599 28819 -9819 854
345 854 8359 -6057 -7118 -10650 4660 4112 -17767 5271 8420 -21903 1279 11882 -16361 -4536
359 -4536 13572 3451 4644 13353 8575 -2096 -3946 -2662 -14372 -15373 -7203 -8007 2873 9203
373 9203 1310 9713 5462 -8112 6220 3060 -11737 7353 4934 -10143 7621 3725 -14039
386 -14039 -1810 -6166 -14921 4848 1225 -9099 12648 7510 -3796 23426 10550 -21507 1676
399 1676 807 -23167 4294 4058 -21882 5800 11372 -3175 12579 -8806 -17806 16245 -3147
412 -3147 -184 29297 -20570 -14397 36188 -15429 -17863 21112 -35822 -21038 37589 -11315 -7789
425 -7789 24054 -21884 5966 38919 -18793 -5762 11021 -37401 5496 36563 -30118 -11274
437 -11274 22968 -26315 1589 37485 -29058 -25982 24687 -6209 7079 39654 -21718 -22588 23197
450 23197 -12921 -109 21769 -47120 -18704 38509 -14964 10161 32047 -52792 -4646 54267
462 54267 -21553 3506 18308 -59458 10481 51078 -28834 9844 2021 -63877 35874 40788
474 40788 -53162 16600 7041 -57068 62129 52524 -64758 8501 10773 -54714 49783 36121
486 36121 -73697 1929 20441 -31535 51160 22106 -73083 9779 24989 -22805 50286 5352
498 5352 -76268 25287 33660 -24901 38841 -9567 -79194 29495 35818 -25440 27784 -13942
510 -13942 -55152 49372 38220 -24694 13077 -30397 -44018 56789 23155 -31836 10868 -33707
522 -33707 -26167 73418 4586 -48744 19301 -30365 -16649 91430 -9820 -65883 35046 -19623
534 -19623 -15980 88817 -32874 -79821 42791 -12929 -5725 81366 -49989 -60938 59114
545 59114 -11672 7405 59885 -78636 -38686 69844 -18377 13826 42501 -88223 -20510
556 -20510 72822 -16019 1790 15307 -65738 4181 62269 -3002 -1186 -12644 -47269 23840
568 23840 46933 -16100 -12775 -16413 -36743 36141 53682 -33865 -22499 8427 -33657 32297
580 32297 63458 -59285 -33425 36232 -27409 34576 53125 -85426 -17236 42452 -39928 54271
592 54271 34058 -109461 23667 52830 -49533 65721 5428 -114108 54216 42277 -49614
603 -49614 59811 -25127 -88518 70186 25662 -30380 38961 -48666 -43524 70990 5211 -16467
615 -16467 18679 -46621 -10808 58278 2348 -22670 -9955 -24057 2989 41333 11232 -34674
627 -34674 -12944 7044 -4061 37186 12894 -61552 5018 25337 -23472 48117 -651 -81222
639 -81222 40639 21908 -36888 62954 -29171 -75661 73747 -1308 -27646 67875 -63824
650 -63824 -40887 87703 -36040 -8144 52810 -87377 3188 80148 -52927 13288 26213
661 26213 -79102 34830 50425 -46833 18613 -2842 -45113 42574 20748 -27545 2596 -13556
673 -13556 -6739 22099 9022 -6730 -24610 846 19198 -7336 20021 -2853 -46385 30728
685 30728 15789 -31808 38082 -17879 -45202 56921 -8395 -25218 47235 -48180 -17604 65590
697 65590 -39547 -192 39107 -64035 20408 43001 -53100 30834 6118 -58516 53881
708 53881 6368 -44164 46101 -25853 -29329 60313 -24857 -17034 37155 -41336 2682 39100
720 39100 -31498 6480 7568 -26029 24726 1205 -15294 14750 -20200 4034 21445 -21938
732 -21938 14622 -631 -30094 35304 -3230 -26877 35498 -22811 -16337 43849 -29292 -6607
744 -6607 31737 -38537 12911 27115 -39156 21353 5781 -34181 37697 -7808 -26559 40020
756 40020 -24978 -13133 41670 -33988 291 30249 -39880 18254 20060 -40973 29289 2724
768 2724 -36423 40211 -8315 -27459 39316 -20935 -15013 36071 -25612 -2331 22514 -26751
780 -26751 13170 9448 -24350 21385 -6902 -16986 29438 -17125 -8718 26312 -25413 3910
792 3910 20904 -28143 13432 8119 -25331 25019 -5472 -21180 30879 -16684 -11840 32842 -26280
805 -26280 -2920 27715 -29683 8281 17195 -29376 18923 5296 -24327 25225 -9442 -17204
817 -17204 30399 -19834 -8297 29472 -25884 1238 23794 -27943 8789 13902 -24006 16438
829 16438 1697 -18397 19593 -8769 -8665 20174 -17907 138 17585 -21572 8539 9885 -21446
842 -21446 15621 2279 -16743 18605 -8100 -10530 20255 -16519 -2153 18663 -21150 7187
854 7187 14034 -23582 12764 6996 -20875 17225 -1507 -15847 19496 -8661 -8555 18184 -15866
867 -15866 -24 16461 -19022 4877 10566 -18533 11763 5618 -16389 12745 -1166 -10328 14102
880 14102 -7050 -7372 10615 -8601 1577 8698 -10930 3120 3865 -7204 7140 -1173 -5583
893 -5583 5583 -3859 2961 4462 -9942 4619 1172 -8530 11741 -3041 -10846 12787 -5713
906 -5713 -4773 16420 -11504 -5607 14209 -12178 2517 12269 -17599 3343 9488 -14124 10823
919 10823 5891 -19072 9083 5033 -11497 14249 -529 -16497 12293 2053 -8878 12240
931 12240 -4813 -14852 11698 4000 -6915 7030 -5155 -10420 12949 4967 -8139 4619 -4852
944 -4852 -9651 15262 4481 -12806 4741 -3666 -7131 18461 -496 -16477 7459 -2544 -5749
957 -5749 20640 -3822 -18516 10211 -190 -3944 18097 -9001 -18403 13080 789 -3899 16203
970 16203 -11146 -17969 17123 3620 -5174 13406 -14860 -15644 23712 952 -8935 14274 -18421
983 -18421 -13065 31293 -4179 -12692 14659 -22542 -4406 37068 -13034 -12134 15149 -25112 5892
996 5892 35634 -23529 -9618 12344 -22942 17439 27661 -30916 -4203 10564 -16628 22778
1008 22778 16059 -32885 -1508 10652 -6885 20730 5112 -31125 -615 14527 -1273 11116
1020 11116 140 -27635 826 23850 -1239 1095 952 -27351 5412 31723 -11562 -4759 4819
1033 4819 -29681 16110 34339 -26287 -1738 5312 -31540 31645 27164 -40138 8308 2688 -28301
1046 -28301 44860 10798 -46761 17585 -3329 -18099 48997 -8721 -41359 23254 -6103 -3547
1058 -3547 40939 -24032 -30485 23107 -3688 6254 24880 -29272 -19674 21501 3195 6048 9103
1071 9103 -25427 -14487 23641 11413 -5069 1888 -16335 -14636 30752 12733 -22254 4291
1083 4291 -10576 -15635 41627 3464 -34430 15590 -11400 -11918 49938 -14846 -35952 27886 -17267
1096 -17267 -2019 49866 -34224 -25788 32783 -22562 10749 37250 -46361 -9049 29697 -21295
1108 -21295 21206 18551 -46453 5860 21485 -15099 21726 550 -36700 12551 16462 -6545
1120 -6545 12022 -8250 -24249 11327 18222 -2765 -2589 -4543 -15022 8139 24193 -9281 -13118
1133 -13118 5546 -13694 8496 29089 -23203 -12623 16254 -18059 15166 26957 -37559 -2191
1145 -2191 20291 -22876 24224 15667 -44674 13111 15679 -23122 29630 -441 -39916 24901
1157 24901 6934 -16096 28857 -14692 -26123 27755 -1988 -6336 19638 -21633 -11341 23146
1169 23146 -4731 -273 8033 -18315 -1278 16572 -1313 -1723 -190 -9584 -87 13903 2366
1182 2366 -9788 34 -1361 -4713 15905 1934 -19231 7790 1869 -9082 22125 -4435 -23372
1195 -23372 18507 -1235 -10622 25330 -14067 -19636 25784 -7773 -6886 23553 -21538 -9457 26057
1208 26057 -13377 -517 16535 -23300 1527 19925 -14297 4291 7813 -18540 7100 11051
1220 11051 -10367 4088 1108 -9453 7183 5135 -5075 1030 -1014 -2762 3972 4082 -2706 -3747
1234 -3747 2216 -615 191 6751 -4965 -4945 7647 -3398 -972 9777 -9967 -3048 11744 -7769
1248 -7769 1251 10038 -14200 1318 11578 -11052 4437 7102 -14114 5990 8100 -10714 6115
1261 6115 2350 -10570 8184 3577 -7219 5268 -734 -4981 6431 -183 -3086 3003 -2152 0
1275 0 3322 -1335 -504 655 -341 1202 28 -126 -323 -783 1765 -302 -1302 2719 -1331 -1338 3425 -2005
1293 -2005 -691 3446 -2079 -345 2899 -2349 674 1784 -2513 1342 911 -1398 2599 -820 -1816
1308 -1816 3277 -1326 -787 3110 -2009 -769 2972 -1640 -443 1698 -1997 533 1500 -1015 -152 606
1324 606 -603 570 369 158 363 -566 663 474 -555 39 -84 224 947 12 -389 191 -56 169 139
1343 139 -123 349 -271 727 378 -976 395 555 -600 944 -87 -1235 1284 425 -643 1018 -330
1360 -330 -405 1637 -5 -709 460 -200 146 1147 -181 -588 367 167 -451 908 429 -1089 975 1174
1378 1174 -1330 1085 683 -2590 1693 1097 -2550 2660 705 -3738 2725 612 -3289 4172 -370
1393 -370 -3939 4290 -72 -2891 4453 -1856 -3358 5151 -1195 -1861 3901 -3506 -1595 5156 -1975
1408 -1975 -639 2935 -4042 220 4723 -2597 -689 1842 -3204 1417 4730 -2635 -2156 1981 -2322
1423 -2322 491 5175 -3107 -3296 4203 -1388 -687 5592 -4695 -4077 6457 -1611 -1121 6412 -6442
1438 -6442 -3305 8299 -3136 -183 5881 -8937 -416 9305 -5854 1432 4507 -10338 3641
1451 3641 9011 -8184 2755 2415 -10931 6957 8387 -8836 2813 1677 -9476 8435 6664
1464 6664 -9849 1794 1203 -6573 9148 4563 -10668 1453 2270 -4314 9363 2408 -11975 2721
1478 2721 3891 -4132 9013 -217 -13418 6234 5644 -5524 8720 -2443 -14627 10463 6497
1491 6497 -7950 8523 -4008 -14295 14582 5467 -10437 8491 -4957 -12047 17552 3030
1503 3030 -12030 8037 -5805 -8293 19336 -838 -12953 8227 -6554 -4541 19535 -5145
1515 -5145 -12959 9168 -5580 -1338 18812 -9616 -12646 11615 -4423 733 16858 -13571 -11641
1528 -11641 14141 -3220 1033 13136 -16297 -8725 16951 -3549 -446 9689 -17416 -4361
1540 -4361 19680 -4038 -2078 6546 -17142 617 20589 -7417 -4530 5555 -14997 4095 20078
1553 20078 -11190 -6006 6633 -12686 7287 19251 -15901 -6303 8960 -11207 9451 16248
1565 16248 -20146 -4051 10777 -10595 11386 11924 -23843 766 12942 -10189 12380 5922
1577 5922 -25178 6250 12605 -9931 12422 26 -23864 11795 11677 -9644 9616 -4647 -18692
1590 -18692 15729 9376 -10150 5997 -6481 -12951 17566 7863 -11716 2732 -4750 -8137 17366
1603 17366 5397 -14550 2084 -915 -6559 17084 2609 -19154 4799 3482 -6256 17086 -1204
1616 -1204 -21346 10103 4205 -7211 17924 -6893 -20985 16795 2329 -7411 16721 -12863
1628 -12863 -15373 21474 -1698 -5999 14015 -16886 -8254 21740 -5339 -3547 9420 -16967 -92
1641 -92 18690 -7675 -2417 4786 -12940 4274 14375 -7200 -4207 1888 -7023 5075 10928 -6725
1655 -6725 -6854 3151 -1928 2810 10346 -7606 -9171 8071 -852 99 10484 -11630 -8203 13778
1669 13778 -3750 -346 11077 -16521 -3110 17009 -9335 1195 9595 -19019 3903 15714
1681 15714 -13115 4594 5042 -17638 10803 9878 -12864 7154 -1032 -11925 13439 3008 -9259
1694 -9259 6303 -4139 -4982 11305 -1341 -5514 2784 -3405 477 6478 -1090 -3439 -1024 372
1708 372 1429 2272 1755 -5168 -2169 5550 -1726 556 3882 -8690 1292 8485 -6550 3029 3706
1723 3706 -11891 7139 7052 -9868 7144 -142 -11400 11921 886 -9282 9773 -5007 -6294
1736 -6294 13369 -5074 -5179 9021 -8176 -51 10033 -8105 413 4768 -7798 4503 3952
1749 3952 -6740 3153 -86 -3183 5385 -1585 -2073 2274 -2661 2398 1925 -2772 2277 -1880 -1592
1764 -1592 4825 -2776 -306 3658 -5373 2648 3338 -5873 3835 707 -6181 6868 -613 -5208 6747
1779 6747 -4095 -2966 8294 -5763 -912 6527 -7594 2287 5388 -8110 3764 2549 -7212
1792 -7212 6460 492 -6225 5947 -2111 -3573 6621 -4037 -1799 5060 -4664 1367 3254 -5359
1806 -5359 2921 1209 -3580 4233 -1600 -2431 4262 -3324 360 3531 -4530 2232 2131 -5201 3969
1821 3969 -112 -4548 5498 -2034 -3160 5614 -3941 -1209 5226 -5205 966 3833 -5280 2836
1835 2836 1429 -5570 4498 -163 -4075 5627 -2487 -2789 5677 -3953 -664 4903 -4874 1479 3825
1850 3825 -5536 2570 1436 -4314 4126 -263 -2821 4028 -1634 -1343 3371 -3413 637 2294 -3207
1865 -3207 2391 243 -3032 3600 -1269 -2363 3816 -2844 -186 3636 -4101 1044 2387 -4283 3102
1880 3102 1380 -4422 4018 -499 -3281 4963 -2911 -2243 4759 -3383 52 4283 -4874 1206 3057
1895 3057 -4702 3480 1625 -5057 3811 425 -3816 4709 -1314 -3519 4270 -1619 -1482 3572 -2962
1910 -2962 -570 2544 -1698 608 831 -1778 506 323 62 962 -1009 -5 -260 -711 2681 -1406
1926 -1406 -1597 2239 -2388 743 3803 -4329 150 2761 -4352 3294 2497 -6322 2796 1439 -4707
1941 -4707 5810 -548 -6518 5521 -686 -3211 7069 -3513 -4907 6321 -2123 -1406 6014 -5338
1955 -5338 -2507 5938 -2495 -89 3665 -5392 -562 5000 -1730 -340 1689 -4393 -382 4777 -1086
1970 -1086 -1784 1596 -2837 -575 5611 -1457 -3700 3010 -2246 -880 6918 -3305 -4933 4523 -2863
1985 -2863 -97 8063 -5969 -4191 5999 -3781 1331 7366 -9008 -2101 7546 -4686 2825 4914
1999 4914 -10619 800 7191 -4995 3647 2144 -10266 3387 6477 -5043 2610 599 -8618
2012 -8618 5359 6475 -5462 1346 -566 -6717 6491 5676 -6653 96 833 -5230 6870 5268
2026 5268 -8368 585 2118 -4854 7289 3255 -10607 1900 3210 -4397 8057 1234 -11685
2039 -11685 4212 3650 -4172 8110 -1644 -11374 6903 3360 -4332 7362 -4454 -9822 9341
2052 9341 2878 -4465 6001 -5820 -7410 10984 1590 -5123 4432 -6070 -4718 11668 -368
2065 -368 -6330 3870 -5049 -2120 12118 -2301 -7839 4194 -3712 -457 11578 -5067 -8139 5664
2079 5664 -2478 -14 10208 -7786 -7547 7835 -1972 802 8237 -9974 -5833 9338 -2285 818
2093 818 5954 -10932 -2789 10607 -2868 139 4252 -10747 251 10555 -4404 -338 2941
2106 2941 -10011 2828 10483 -5980 -1362 2080 -8098 4647 9532 -7708 -1686 2653 -6508
2119 -6508 6223 7163 -9864 -1740 3502 -5191 6650 4759 -11073 -71 4459 -4202 6741 2457
2133 2457 -11179 1932 5313 -3900 5684 36 -10625 4589 5590 -4445 4446 -1577 -9480 6361
2147 6361 4989 -4768 3559 -2369 -7561 7990 3578 -5718 2822 -2162 -5049 8571 1837 -6513
2161 -6513 2544 -1754 -3414 8302 54 -7128 2916 -1595 -1920 7868 -2158 -6526 4143 -836
2175 -836 -1035 6715 -4121 -6129 4937 -606 -675 5298 -5213 -4646 5747 -609 -665 4232 -5346 -2794
2191 -2794 6428 -1133 -1287 2832 -5224 -1131 6513 -1502 -1726 2085 -4747 242 6239 -2977 -1806
2206 -1806 2421 -4150 1303 5248 -4188 -1629 2444 -3407 1971 4204 -5142 -721 2731 -3099 2656
2221 2656 2699 -5269 390 2933 -2859 2474 1714 -4967 1234 2537 -2420 1969 610 -4150 1295 2282
2237 2282 -2024 1565 644 -3358 1822 2052 -2394 954 337 -2913 2086 1951 -2690 661 902 -2659
2253 -2659 2270 1710 -3368 1136 640 -2425 2959 1057 -3407 1547 243 -2290 3327 -287 -2913
2268 -2913 2388 -92 -1491 2944 -1318 -2372 2577 -694 -1330 2279 -1332 -1237 1906 -642 -645 924
2284 924 -963 -803 1387 -195 -561 653 -445 -782 797 -21 -823 379 261 -658 756 509 -1349
2301 -1349 846 55 -1083 1332 -22 -1466 1255 -284 -917 1685 -1005 -1128 1674 -1075 -552 1561
2317 1561 -1321 -305 1456 -1164 428 1107 -1723 558 632 -1329 684 228 -1070 718 103 -368
2333 -368 549 -213 -534 863 -373 26 181 -96 458 -109 -161 388 -574 239 158 -945 673 199 -924
2352 -924 1099 47 -894 1147 -575 -532 1227 -1143 -242 1138 -1226 381 839 -1527 754 566 -1402
2369 -1402 1114 8 -1656 1222 -352 -1266 1486 -1043 -1080 1687 -1095 -613 1304 -1017 96 1094
2385 1094 -902 340 503 -1014 89 440 -436 -120 97 49 -226 -72 196 -302 -309 653 -521 131 563
2404 563 -1447 497 273 -892 1125 73 -1930 1347 -5 -1365 1827 -715 -1701 2236 -310 -1113
2420 -1113 1861 -1877 -948 2437 -1572 -141 1758 -2535 518 2084 -2015 564 876 -2440 1145
2435 1145 1596 -2075 597 202 -1758 1339 982 -1523 244 207 -903 1201 751 -1482 -91 752 -790
2452 -790 747 1152 -1993 -451 1518 -1015 630 1793 -2963 -202 2486 -1720 975 1247 -3586 1011
2468 1011 2616 -2566 1699 742 -4124 2534 2217 -3282 2362 -446 -3984 3804 1039 -3131 2355
2483 2355 -1272 -2526 4836 -113 -2880 2110 -1495 -1356 4381 -849 -2879 1585 -1343 -427 3679
2498 3679 -1259 -3154 1719 -300 -354 3061 -1891 -3450 2304 476 -781 3008 -2176 -3689 3851
2513 3851 320 -1660 2867 -3106 -3229 4974 -157 -1962 3131 -3620 -1919 6136 -1428 -1825 2799
2528 2799 -4351 -353 6489 -3079 -1885 2553 -4317 1572 5482 -4371 -1333 2269 -3746 2582 4651
2543 4651 -5010 -1239 2236 -2545 3073 3053 -5598 -892 2529 -1712 2623 1999 -5486 -151 3679 -1292
2559 -1292 1784 939 -5776 1119 4471 -2220 1154 335 -5943 2829 4470 -3555 986 34 -5699 4218
2575 4218 4014 -4514 974 -61 -4694 5654 2949 -5706 1494 -420 -3395 6436 1167 -5932 2210
2590 2210 -169 -2313 6155 -686 -5907 2618 162 -1397 5056 -1935 -5712 3431 971 -1006 4262
2605 4262 -3075 -5044 4613 887 -1690 3268 -3706 -4105 5389 847 -2369 2593 -3328 -2784 6693
2620 6693 -234 -3015 2400 -3813 -1400 6847 -1786 -3459 2548 -3208 -108 6250 -3228 -3352 2812
2635 2812 -2783 945 5416 -4296 -2964 3462 -2355 1534 4324 -5173 -2168 3849 -1957 1052 3207
2650 3207 -5442 -1162 4426 -1829 875 2216 -5527 249 4627 -2359 533 1305 -5042 1364 4528
2665 4528 -3102 92 1098 -4284 2657 4038 -3824 247 814 -3607 3022 2927 -4156 400 1193 -2913
2681 -2913 3368 2234 -4553 427 1481 -2116 3021 1164 -4661 1103 1796 -1735 2405 228 -4277
2696 -4277 2011 1680 -1867 2299 -228 -3931 2747 1752 -2296 2090 -489 -3375 3214 1000 -2401
2711 -2401 1795 -1168 -2608 3607 362 -2460 1852 -1177 -1728 3745 -505 -2243 1566 -996 -846
2726 -846 3213 -816 -2121 1602 -726 -305 2471 -1182 -1748 1720 -115 -350 1990 -1289 -1556 1961
2742 1961 -111 -418 1385 -1280 -1275 1988 -442 -801 1545 -1537 -1008 2310 -769 -806 1509 -1748 -407
2759 -407 2368 -1036 -382 1191 -1838 115 1783 -1748 -122 830 -1594 676 1257 -1230 210 648
2775 648 -1217 1091 619 -1248 222 446 -174 612 308 -920 106 384 -195 343 -47 -942 165 814
2793 814 -333 29 288 -851 230 619 -735 -87 388 -819 63 664 -1371 258 501 -1256 734
2810 734 355 -1168 583 -20 -969 828 4 -860 591 -82 -219 845 -362 -625 512 -451 -233 667
2828 667 -407 -158 548 -217 188 536 -59 -182 71 46 -80 -107 -111 1 146 263 -269 71 340 -605 233
2849 233 495 -520 353 302 -548 590 81 -411 655 -288 -611 561 -277 -560 816 -448 -361 706
2867 706 -519 -60 747 -752 155 479 -621 81 683 -765 -45 283 -378 468 25 -491 109 371 -416
2886 -416 413 172 -175 123 347 -244 90 73 -388 17 670 -40 -168 493 -444 106 626 -477 -121 663
2906 663 -460 85 470 -659 269 532 -869 612 581 -932 558 335 -939 740 4 -1093 695
2923 695 242 -930 1078 -63 -960 807 -114 -604 650 -179 -729 902 135 -289 755 -600 -621 930
2941 930 -93 -616 334 -728 -604 1463 -106 -1038 593 -338 -499 1192 -152 -948 962 -479 -509
2958 -509 1756 -411 -1239 1020 -629 24 2130 -1243 -708 1370 -637 114 1762 -1832 -461 1443
2974 1443 -1004 514 1302 -2030 -316 1751 -1080 600 1076 -1896 22 1649 -1056 462 548 -2101
2990 -2101 833 1711 -1260 291 720 -1627 612 2001 -1332 -108 505 -1641 1162 1989 -2039 -15
3006 -15 743 -1527 1751 1403 -2711 446 994 -1568 1739 822 -2869 833 1209 -1280 1934 12 -3237
3023 -3237 1617 1138 -1272 2130 -617 -2823 2133 1062 -1259 1699 -1096 -2226 2527 563 -1502
3038 -1502 1302 -1128 -1864 3072 600 -1782 1082 -1151 -1393 3012 -124 -2389 1322 -861 -1118 3369
3054 3369 -576 -2564 1527 -762 -505 3330 -1563 -2616 2232 -599 -194 2925 -2188 -2288 2884 -742
3070 -742 0 2429 -3290 -1503 3168 -840 -77 1742 -3119 -614 3257 -1041 -313 1264 -2960 234
3086 234 3427 -1478 -530 909 -2346 1062 3311 -2017 -921 1043 -2149 1085 2913 -2572 -893
3101 -893 1194 -1678 1672 2366 -3027 -767 1775 -1504 1820 1693 -3762 176 2152 -1617 1829 1145
3117 1145 -3972 674 2386 -1622 1934 200 -3807 1604 2002 -1843 1206 -518 -3294 2292 1957
3132 1957 -2013 1022 -664 -2446 2908 1296 -2102 762 -730 -1447 2961 892 -2582 948 -333
3147 -333 -1180 2738 85 -2863 1050 49 -781 2750 -516 -2750 1403 431 -781 2321 -1158 -2374
3163 -2374 2158 191 -806 2009 -1453 -2224 2356 302 -959 1709 -1831 -1365 2825 -103 -659 1272
3179 1272 -1733 -614 2854 -468 -879 1336 -1787 215 2289 -1086 -1040 1447 -1358 418 2248 -1666
3195 -1666 -927 1273 -785 604 1656 -1474 -672 1379 -628 428 1539 -1948 -404 1600 -682
3210 -682 338 893 -2105 40 1784 -1100 298 603 -2171 427 1682 -1010 312 486 -1461 620
3226 620 1256 -1222 -67 332 -1433 1126 1049 -1539 138 367 -1115 1204 399 -1378 542 68 -1015
3243 -1015 1260 278 -1324 693 472 -623 991 -3 -1357 651 369 -479 920 -253 -970 1194
3259 1194 84 -355 605 -327 -913 1044 222 -750 588 -392 -594 720 3 -689 271 -438 -519 903
3277 903 -135 -912 739 -318 -560 817 -148 -677 672 -95 -408 914 -19 -116 540 -141 -63 950
3295 950 -472 -211 658 -485 -157 450 -673 -180 318 -176 -148 312 -531 -180 349 -313 16 -31 -422 130
3315 130 555 -362 -28 157 -205 3 241 -344 -443 94 -93 20 462 -402 -212 300 -149 -41 318 -324
3335 -324 -234 274 -432 136 152 -534 32 566 -608 131 -82 -402 266 206 -316 283 -168 -377 372 112 -344
3356 -344 470 -243 -130 244 -71 -265 -1 84 -177 -8 -121 -120 188 133 -5 -88 125 -162 141 -16 -166 124
3378 124 155 -90 194 70 -118 248 6 -356 194 212 -197 410 -99 -247 700 -124 -424 367 135 -230 610
3399 610 -182 -235 170 -311 51 263 -383 -2 497 -323 8 532 -362 261 408 -338 211 -3 -302 234
3419 234 34 -74 -232 89 -342 -34 100 -227 -90 359 -356 -64 488 -620 -321 420 -237 -197 345 -571
3439 -571 -9 500 -392 201 539 -737 69 796 -491 340 505 -906 582 424 -643 381 153 -844
3457 -844 315 450 -743 424 -173 -646 720 475 -582 290 -221 -674 821 -1 -727 355 72 -308
3475 -308 704 -75 -464 369 144 -330 744 -61 -926 587 137 -288 777 -34 -1054 832 366 -466
3493 -466 631 -206 -1073 874 -27 -727 857 -742 -681 1295 -316 -411 919 -674 -399 1316 -367
3510 -367 -601 781 -1024 -196 1555 -783 -395 518 -680 108 1110 -1041 -572 781 -580 211 1289
3527 1289 -1222 -496 652 -772 373 759 -1490 -518 1224 -469 296 726 -1406 -81 1440 -324
3543 -324 210 583 -1864 393 1386 -999 290 356 -1728 656 1361 -1182 126 313 -1565 1127 1060
3560 1060 -1384 303 346 -1197 1290 611 -1891 70 94 -922 1441 383 -1814 560 323 -628 1747
3577 1747 86 -1552 581 188 -465 1202 -158 -1680 911 629 -483 964 -425 -1527 1049 497
3593 497 -709 874 -776 -1258 1551 244 -1118 691 -940 -869 1825 203 -1247 720 -816 -432
3609 -432 1665 -405 -1236 871 -669 -222 1641 -856 -1024 1091 -650 202 1532 -1196 -921 925
3625 925 -638 139 1154 -1291 -741 1100 -432 164 831 -1373 -190 1487 -317 12 665 -1551 -259
3642 -259 1534 -517 -105 520 -1328 376 1608 -976 -68 392 -1235 931 1351 -1067 -13 109 -1104
3659 -1104 866 921 -1395 -331 361 -1008 993 928 -1427 30 361 -488 954 226 -1412 27 692
3676 692 -396 972 54 -1152 528 837 -700 618 -36 -614 765 455 -748 607 -160 -875 810
3693 810 515 -1034 414 -90 -865 1061 377 -1369 239 -365 -640 1057 132 -1004 433 -123 -285
3710 -285 1109 -212 -620 575 -91 -470 774 -664 -754 492 -236 -281 653 -736 -546 783 -442 -204
3728 -204 703 -919 -216 708 -144 -83 811 -899 -283 896 -268 -230 447 -286 -81 834 -363 -129 318
3747 318 -237 103 712 -279 -305 437 -209 237 385 -337 116 336 -457 42 536 -472 118 498 -265 -44
3767 -44 300 -653 9 372 -340 173 97 -505 95 468 -356 225 309 -165 113 477 -321 136 -75 -387 6
3788 6 458 -440 68 127 -269 227 132 -295 -21 346 -318 361 -53 -432 175 -153 -258 202 -32 -381 340
3809 340 70 46 390 -1 -188 10 287 -177 41 13 -198 217 -238 -251 97 -126 -85 375 6 -171 186
3830 186 66 -152 185 -261 21 156 11 -7 216 -37 -289 75 7 -108 93 61 -316 15 -132 -293 246
3851 246 -75 -64 79 -244 -106 370 -57 110 264 -154 -23 265 -230 -15 40 -103 -3 311 -166 -86 239
3872 239 -108 -6 148 -210 58 221 -226 182 60 -450 179 13 -397 67 -266 -61 -171 -8 -181 -135
3892 -135 293 -250 35 -4 -297 110 146 -244 -136 -22 174 -70 -70 -402 233 47 -257 -15 270 -222 7
3913 7 81 -187 5 -210 -165 258 21 -293 74 37 -227 303 133 -291 218 -170 104 35 -109 -57 123 49 -336
3936 -336 302 -152 -83 113 122 92 247 -37 56 336 -159 40 443 -35 -334 132 -224 -42 363 -36 -181 200
3958 200 -143 107 322 -301 -264 396 -314 72 308 -235 -22 493 -156 -158 287 -742 69 132 -459 -87 304
3979 304 -391 165 381 -599 -19 -74 -328 -117 242 -408 235 189 -325 385 218 -517 -90 230 -409 278 289
4000 289 -443 -55 279 -184 129 17 -576 64 357 -221 173 -87 -610 95 283 -414 237 -91 -596 326
4020 326 195 -481 306 4 -342 508 367 -594 290 15 -342 368 36 -647 378 65 -564 613 -10
4039 -10 -641 447 -464 -331 863 -289 -789 533 -24 -370 702 -349 -390 715 -174 -126 669 -636
4057 -636 -415 743 -151 -82 554 -628 -44 877 -178 -175 207 -577 -2 561 -581 -273 98 -629 103 942
4077 942 -199 -363 226 -367 225 659 -646 -322 386 -232 515 686 -757 -220 328 -349 174 653 -993
4096 -993 -280 390 -277 352 276 -794 144 482 -528 265 176 -830 229 560 -413 90 -212 -641 542
4115 542 641 -440 291 36 -294 629 527 -438 140 65 -514 749 153 -673 53 143 -260 915 -82 -760
4135 -760 296 106 -476 848 11 -744 442 -10 -661 400 -245 -773 689 -62 -83 372 -632 -770
4153 -770 578 -45 -85 360 -392 -439 772 186 -324 360 -412 -415 630 -123 -534 171 -283 -176 589 -235
4173 -235 -633 359 -346 -137 639 -473 -377 308 -384 -163 320 -858 -228 290 251 125 601 -479 -210 391
4193 391 -156 -259 485 -731 -157 273 -469 162 442 -760 244 543 -390 237 190 -426 368 591 -701
4212 -701 237 207 -29 493 222 -304 117 105 -426 312 -73 -384 316 161 -54 148 153 -710 -3 196 -521
4233 -521 73 155 -371 317 228 -272 369 111 -295 232 118 -174 9 -162 -434 300 213 -269 -70 11 -194
4254 -194 94 306 -150 71 -120 -223 477 -159 -284 255 -100 95 424 -429 -338 288 98 -81 442 -236
4274 -236 24 -39 -25 -9 119 -216 -256 310 37 -45 326 -282 15 335 -56 4 52 -55 -263 240 -111 -300
4296 -300 247 -157 -181 254 -239 128 -152 47 -41 139 12 -219 274 -146 -160 103 -132 50 -41 -121 213 500
4318 500 -208 -311 226 -184 80 43 -157 -158 -279 -113 -76 39 -227 90 124 -135 228 150 -126 70 297 51
4340 51 23 313 -139 108 -68 -173 55 106 -59 137 -14 -180 -9 82 34 196 378 -131 75 -42 186 55
4362 55 39 -196 -11 -81 -32 291 -37 -215 -221 74 -177 75 43 1 228 38 103 -144 162 -185 98 177 99 114
4386 114 -15 77 183 326 -90 132 52 234 121 149 -185 -42 43 -318 116 -83 -126 -68 206 -78 220 194
4408 194 198 -28 -26 -88 136 181 -85 244 -314 -312 114 -223 153 96 -229 272 -33 -11 130 -76 -55 -50 170 -21
4432 -21 -9 254 -177 156 310 -140 -30 339 -14 -58 114 -217 154 164 -9 -10 -189 24 -132 171 -98 -37
4454 -37 34 -51 197 235 -286 157 279 -15 47 127 -146 106 46 -257 34 -151 232 20 -19 -179 -5 114 -142
4477 -142 111 168 -27 281 -56 59 230 -67 56 223 -100 0 74 -314 -231 236 -135 -239 -89 -64 0 370
4499 370 147 -227 106 85 -82 96 100 -505 -91 -98 -66 79 -305 -174 305 175 63 -1 -340 -201 174 -129
4521 -129 65 -4 -115 -230 387 -23 64 46 -34 14 451 -6 -246 -158 14 228 337 -260 18 -63 -72 35 352
4544 352 -246 -24 262 -200 45 191 -443 147 313 -11 412 -102 -117 -224 -98 -235 314 -17 -209 70
4564 70 84 -163 233 -63 -384 203 145 -13 210 -34 -322 -10 344 -266 255 -188 -234 394 379 -531 308 -113
4586 -113 9 172 199 -242 73 104 -290 86 294 -292 34 54 -6 507 -215 -245 54 120 -355 277 -85 -91 513
4609 513 -23 -59 218 -244 -227 429 -38 -36 136 -1 100 109 115 -49 335 -6 -23 207 -258 -426 -26 -391 -114
4632 -114 129 -128 -66 457 -282 -17 380 -354 9 133 -323 -57 185 -260 -81 -75 -302 -24 -370 -161 264
4653 264 324 -88 -31 88 -65 -52 176 -370 -12 -129 -583 179 245 -46 -123 111 -50 137 424 -4 -4 3 91
4676 91 -67 87 -209 29 -249 -412 305 181 -371 121 3 -284 11 -110 -610 127 135 79 320 -157 -439
4697 -439 63 111 -42 312 -252 -342 225 94 -253 -33 -37 -62 371 151 26 123 -174 59 159 20 -157 181
4719 181 -222 -559 187 -100 -11 -158 -116 45 215 -57 -342 405 -237 -215 398 14 -407 282 -80 128 125 -171
4741 -171 -46 215 158 -25 -91 -304 -3 -114 173 30 166 -98 -15 145 -95 368 -328 -108 -149 37 -95
4762 -95 30 374 -78 -190 -100 -318 162 -314 -291 16 55 237 148 156 -133 -22 -66 -171 -118 30 69 -100 -153 -129
4786 -129 83 125 -27 260 157 -182 -91 292 50 33 101 -1 73 175 -89 94 -108 -114 54 -90 -1 -86 -38
4809 -38 156 -22 -208 223 -172 76 -88 -56 48 -167 79 -43 27 -156 175 -23 -48 -113 -364 163 296 -84
4831 -84 -45 -314 -232 85 35 107 125 20 -9 142 106 -82 10 -51 -216 16 10 -40 -128 138 -2 39 -77 87 -9
4856 -9 -21 124 141 -130 -67 -168 16 259 38 160 50 -187 -29 -95 117 -329 78 190 125 -146 -24 233
4878 233 -125 -16 162 -45 127 -246 -209 3 94 -182 12 -116 -261 40 27 206 107 154 30 -115 -146 -128
4900 -128 157 97 -136 -150 -32 -9 69 87 34 -249 63 16 43 148 201 26 -79 71 127 -81 9 -92 -217 -69
4924 -69 -135 87 252 135 -265 -31 121 95 321 115 76 62 61 -23 28 -18 105 -144 -104 27 -49 -59 239 -79
4948 -79 85 -190 121 -20 133 -49 30 4 -126 1 -124 234 -67 -367 57 -175 -212 -45 -80 -86 -38 159 -56
4971 -56 9 174 -120 -109 -35 91 180 -133 87 111 -169 98 137 -245 -22 105 72 -118 -73 12 -32 133 85 140
4995 140 -203 154 -101 -152 -142 -65 73 -205 170 30 -183 -347 -175 113 150 35 -93 149 -22 -15 207 -4
5017 -4 146 144 35 -83 228 -36 12 36 89 94 52 269 -124 -359 207 -41 221 15 -32 93 142 -58 -108 140
5041 140 -48 -226 104 18 -118 23 -39 191 102 -97 5 -88 -27 149 131 143 -168 25 -132 170 301 98
5063 98 -102 213 -157 -7 24 -208 316 62 -47 -140 -30 -48 87 -70 51 81 211 -58 60 52 28 -184 -32
5086 -32 -140 89 10 75 -48 17 2 108 -43 -10 66 -204 41 57 -115 -173 -186 -198 28 -5 -148 142 56 -289
5110 -289 21 85 -197 -182 272 -152 -92 221 -72 211 89 -47 138 93 -214 -30 -59 -97 -97 82 40 -54 -10 -271
5134 -271 -138 -174 -153 -125 26 -92 211 -23 10 20 -17 -160 -8 218 164 -215 -149 -97 132 114 -39 88 -13
5157 -13 -197 -144 -36 113 -26 67 -26 -84 260 -111 138 14 -106 -51 -38 198 229 -151 -72 -275 226 19 0
5180 0 -48 -274 46 -15 104 -10 5 -102 99 -208 304 69 130 -331 127 -6 93 120 -205 69 21 -106 40
5203 40 -157 -117 -271 160 -64 -75 223 44 -178 39 447 -357 -4 -250 -214 -97 28 209 -202 93 -305
5224 -305 6 151 -101 87 13 -268 40 -179 74 276 -41 -55 48 -68 -98 202 -120 93 -103 -136 -136 95
5246 95 45 -11 -156 -240 -105 -11 52 127 124 4 213 -72 -231 -68 -27 -133 93 19 -62 113 -89 -253 265 45
5270 45 -46 -105 102 123 -79 21 -222 -31 231 -51 -180 -36 20 139 4 26 -128 50 -163 -190 193 141 -194
5293 -194 3 -9 36 -4 118 20 -39 256 -56 71 90 19 119 -9 -12 -75 -151 33 -103 -124 -6 -118 78 235
5317 235 -32 146 4 -79 96 134 38 162 -70 62 -18 115 7 -79 176 -91 -170 -132 -31 -145 -32 -130 -258
5340 -258 262 64 -57 94 -49 278 135 -493 21 210 -299 48 -376 -47 123 222 -493 58 100 -20 15
5361 15 47 -125 -264 -65 -179 -235 189 -104 107 196 -129 -29 -151 -31 63 160 59 123 111 127 -128 -94 -75 281
5385 281 -61 37 -39 -12 -178 -198 -55 158 83 125 -280 -89 4 195 83 -48 -143 -223 53 87 208 -180 77
5408 77 17 -141 76 -283 90 -231 188 -121 -132 161 -13 53 -8 -192 -47 -47 -83 161 -30 -66 33 -65 -109 -153
5432 -153 270 -399 -147 135 103 17 -117 121 -85 -108 20 -107 -117 109 -268 -239 -35 -79 77 -184 41 -27
5454 -27 53 132 -32 10 -102 95 -259 138 74 -57 55 227 -68 15 88 -85 -43 -62 -81 -73 -55 -104 -121 -6 118
5479 118 -17 7 -26 -79 222 -92 159 -30 -270 118 182 -58 170 5 46 28 130 13 -56 39 -193 80 140
5502 140 -33 -208 175 -44 317 149 135 14 159 -106 -76 -16 -315 116 322 88 -92 13 -45 77 20 143
5524 143 177 -108 -356 66 -37 -62 -172 -36 -51 48 -234 212 -124 -13 83 236 -66 -107 -7 18 153 169 -33
5547 -33 -95 57 -111 44 181 -43 -15 197 11 -141 35 -160 -43 139 155 -115 170 55 206 -71 -8 -141
5569 -141 -5 95 -132 29 -57 -10 174 124 27 2 26 -18 17 -119 -129 423 -100 1 127 -2 -30 143 -373
5592 -373 183 -93 -246 31 -29 -97 -83 59 105 -119 118 -287 -143 157 -19 -177 123 40 -285 115 -18 23
5614 23 57 -161 136 244 -63 120 -24 -177 221 171 120 -418 79 -33 96 183 202 75 -65 -206 -138 298
5636 298 49 -166 197 233 -50 324 -184 40 34 91 185 59 -226 54 -162 -41 -86 65 -16 76 90 -22 -130
5659 -130 -302 78 -91 77 -14 -83 102 30 395 -69 -179 87 -35 262 -13 -62 -113 -190 183 -18 42 -10 -192
5682 -192 15 36 99 163 83 -22 124 -85 52 36 -74 250 -213 -263 -191 97 -100 48 -49 -42 -169 227 61
5705 61 -267 252 183 -109 51 123 256 267 -252 -320 62 -241 -41 1 12 -5 156 247 -39 81 73 83 -106 47
5729 47 -63 51 -30 -142 92 -238 -227 195 54 69 -101 -110 -54 -110 -76 203 54 350 245 8 -63 164 -22
5752 -22 264 232 -83 -98 -294 -79 13 -23 -38 127 46 25 -34 116 -160 31 30 -90 -113 -34 -100 -199 -99 -70 -42 42
5778 42 127 -12 336 -206 -93 -124 40 -120 73 -168 -17 33 61 -129 106 143 -32 97 -99 -232 25 -130
5800 -130 14 86 -161 285 -157 143 103 199 163 -149 -124 -104 -318 275 -48 -68 -209 14 -105 199 -41 32 185
5823 185 17 -174 114 -127 74 147 -147 -191 -68 -190 76 -70 133 179 -263 253 -38 32 -10 196 -21 -356
5845 -356 -206 19 297 19 -131 -233 66 153 -210 115 24 58 93 245 20 10 -172 7 74 57 -205 203
5867 203 -80 -110 103 137 -167 37 26 59 -86 139 245 111 -60 81 -390 154 38 -101 52 -118 17
5888 17 -312 101 -39 78 9 269 154 128 67 72 49 32 34 271 47 72 77 199 221 110 -43 -125 -22 -202 -131
5913 -131 -22 -193 173 54 225 -56 -26 -140 -182 -300 -15 -115 142 75 14 -29 -111 -344 -80 80 -175 -142
5935 -142 145 -13 37 -241 106 -330 22 16 -183 377 -18 -96 331 -133 47 -22 -254 111 -16 89 -99 96
5957 96 123 10 -56 -150 113 96 -205 -242 -15 -171 65 44 -129 138 -124 -60 -89 -15 -95 -129 -19 -57 163 75 81
5982 81 -179 106 -202 79 93 7 103 97 -98 -30 -74 -133 -14 -223 -58 -57 -172 1 93 222 -44 86 139 9
6006 9 15 -133 31 -72 16 -93 -263 -8 -43 -43 70 50 143 282 -5 0 -53 -26 -70 33 -39 -209 57 -265 219
6031 219 71 194 393 -11 -19 74 -235 -219 132 -148 -216 111 105 -150 82 17 153 87 5 8 225 79 57 164
6055 164 -159 -58 -17 -168 148 -106 -21 202 -134 -214 8 -93 117 0 330 55 31 68 -159 88 149 45
6077 45 -103 171 -14 -35 -23 24 177 2 -90 185 155 -124 -171 250 -91 -19 -64 95 -43 -48 6 300 -174 -203
6101 -203 162 -7 35 -59 -90 -71 -149 -28 -269 1 29 -230 -136 -28 -106 47 217 21 9 -204 145 90 -39
6124 -39 -461 -186 -106 -118 154 -165 5 -63 -78 175 -81 28 -91 63 -2 -89 246 171 -52 -248 -280 -206 60
6147 60 136 -178 143 -48 -24 60 210 58 -25 47 130 -1 -132 -204 61 -102 15 178 -22 126 226 0 -274
6170 -274 -33 260 -103 164 -248 118 58 -14 -201 33 43 12 -15 -180 -52 132 -95 -100 9 -62 -47 362 39
6193 39 -129 293 8 6 42 -165 -165 68 -22 276 -173 -72 -290 -64 -277 118 61 -162 73 -17 9 -87 116 -102
6217 -102 -22 -234 44 7 -86 -195 -72 218 -169 46 -30 -157 -201 23 20 -5 164 23 90 42 -114 -89 158 -15
6241 -15 193 -41 158 -293 -134 -7 2 102 -136 -60 -51 -177 -3 161 -56 18 -170 321 -259 -95 35 -198
6263 -198 73 -289 -94 -113 82 185 -7 168 108 24 -264 159 -21 -209 51 -129 63 16 312 -228 123
6284 123 -331 73 -72 -139 109 72 -4 130 99 -97 104 -53 -1 -103 -198 27 280 227 -220 -109 21 -221
6306 -221 -62 -106 -91 -96 242 -145 -40 -13 78 -43 265 78 14 163 -333 -47 -69 -85 -47 -53 34 335 177 -64
6330 -64 30 226 50 27 57 -59 -155 173 -145 -156 281 -111 106 -164 51 161 141 93 80 -8 157 -105 185
6353 185 45 -164 -82 -175 -21 -214 13 -233 -77 43 204 -115 -207 180 -80 -109 271 113 -70 93 -188
6374 -188 -10 139 -99 138 337 8 80 68 100 -29 -83 -65 -47 71 -6 289 -45 173 -119 -173 -113 -125 32
6397 32 -47 -68 13 -196 -57 63 311 161 -39 87 39 -11 327 256 259 73 -92 27 333 -4 -40 42 -21 62
6421 62 218 274 -343 -62 -87 39 -89 -15 79 -104 271 -36 -208 -40 -48 98 28 82 -283 -12 41 -71 163
6444 163 189 37 169 10 -238 -101 10 61 29 113 -167 -37 -96 -53 246 43 -60 -57 -41 41 -143 7 13 72
6468 72 -106 -177 71 -159 -212 78 -31 -86 50 44 -61 195 -191 33 40 163 -155 -146 -123 -192 -46 47 29 164 142
6493 142 29 312 18 85 -187 -33 -13 107 177 -132 -97 -240 54 98 170 159 110 41 -1 225 49 -16 30 89
6517 89 24 46 -381 94 -21 -33 -145 129 132 -29 -29 -233 -31 256 -206 -30 70 -150 -228 2 -184 121 -18
6540 -18 78 1 -105 -20 84 -220 -211 -87 74 37 49 -26 -66 115 -15 -183 -127 -117 86 30 -207 -262 14 -91 -148
6565 -148 63 -117 -36 49 309 -1 96 -47 -12 208 -70 66 75 7 -189 193 153 -116 187 -119 -96 56 -268
6588 -268 -275 235 1 -177 -7 -172 106 263 -57 -145 75 -73 -41 354 -176 -9 56 141 -188 -88 53 -248
6610 -248 259 -163 -204 45 45 -110 90 -112 -105 195 19 -323 -99 70 -74 263 116 -276 16 -41 -139 86
6632 86 27 204 -37 -10 -196 232 92 176 106 68 -81 102 30 260 1 -207 100 -194 -116 50 108 -244 -74
6655 -74 -188 -57 -44 170 -204 57 9 -417 48 216 -38 -48 310 7 170 3 -43 -81 44 272 158 -51
6677 -51 -498 18 -32 -91 149 64 -143 -62 99 120 -126 93 -153 76 158 -62 249 -313 -184 65 -12 -47 183
6700 183 -194 -35 139 77 11 -66 165 -91 -102 23 -339 233 211 -110 150 -37 -246 148 -106 269 46 -16
6722 -16 48 193 -62 105 -48 -26 -70 171 -3 -249 -144 105 361 102 87 -12 91 32 43 -120 -125 -104 102 78
6746 78 -54 87 -242 186 61 -163 120 153 -158 -185 35 -59 -29 58 -257 -4 123 79 243 47 120 11 241
6769 241 -144 -71 -11 -173 139 -150 29 302 59 -21 53 205 44 117 98 -96 -30 55 175 -23 46 -107 -27
6792 -27 -109 -35 84 13 -279 -24 134 -171 100 -234 -73 156 102 -170 3 161 181 109 -151 -100 -118 86 115
6815 115 -9 59 -151 -147 17 -15 214 168 -406 -82 -35 23 28 -407 -113 127 -129 69 -11 -171 145 129 100 -18
6839 -18 116 -178 -27 147 176 -23 -59 116 -66 107 -146 -92 141 -159 41 -82 -433 41 239 32 81 69
6861 69 36 -328 198 341 187 -193 214 141 -491 -263 -15 -123 -145 -63 -37 62 28 -3 -99 273 -31 296 25
6884 25 140 -44 -114 -122 71 194 -103 124 -38 223 -188 148 208 -38 248 -200 -115 40 -37 -50 -291 29 -115
6907 -115 145 -192 58 74 -46 313 158 103 -16 118 -131 -46 -107 -55 -81 163 76 233 -112 -8 -279 177
6929 177 45 -83 209 193 -53 179 113 19 -176 -215 28 127 -68 62 68 -22 -38 317 52 149 93 93 161 -209 -108
6954 -108 -43 -328 -207 -160 -137 53 -166 167 -41 74 128 -216 7 -43 71 195 -38 -31 45 178 -18 -165 73
6977 73 -130 71 187 -76 130 -95 31 26 -224 232 109 143 -23 -118 291 26 54 139 -113 -14 -10 -352 71
7000 71 22 -21 -6 150 272 -196 196 -75 -133 -144 54 132 -44 -215 -336 -32 239 199 74 -106 -24 209 -93
7023 -93 301 -168 -27 11 -19 -231 91 192 207 205 -95 14 156 127 -270 25 -127 104 -73 89 5 361 13
7046 13 -93 159 -75 -20 -162 -26 -127 -38 13 138 61 -254 -108 86 -140 96 -244 -39 -46 174 143 14 145
7069 145 121 -144 -151 101 -94 -270 -7 19 122 219 -81 134 -14 -165 286 -126 139 45 -329 -5 -47 -59 -144
7092 -144 148 -154 -204 284 -150 43 33 125 118 -83 -34 110 98 14 -107 -94 -40 15 58 -156 -170 -10 -182 -208 -26
7117 -26 -63 -452 48 -203 102 -91 -19 111 -3 -111 -10 -82 -139 -13 -113 70 315 -153 117 18 68 -180
7139 -180 -223 54 -31 82 -182 30 225 -90 -13 85 164 -46 259 6 -2 92 -254 152 -38 -133 -8 3 -1 -312
7163 -312 39 -145 -169 -57 -168 87 -49 -177 151 -43 6 255 255 -60 146 10 -114 -55 90 -110 68 -64
7185 -64 -171 -55 198 -224 84 -66 -124 -90 -260 -98 1 191 -50 76 97 -131 46 66 -76 -160 143 -126
7207 -126 102 187 13 -25 -96 -66 261 -110 150 -101 257 -48 -147 153 70 413 21 -243 210 148 -87 -30 -159
7230 -159 -275 203 -106 -120 -12 -33 -174 70 -83 -105 -143 -100 -48 -102 -100 -307 111 87 -135 -118 68 33 -171 61
7254 61 -180 11 194 -33 169 -89 256 115 134 -7 148 -52 -15 -13 87 -3 90 -120 -29 173 365 -79 -128
7277 -128 -295 58 208 60 -209 180 93 112 -47 -212 -216 117 115 -4 171 41 -269 204 120 -147 25 86 327
7300 327 -60 -216 -171 22 3 -190 92 -134 207 81 9 27 -6 29 153 -128 -211 -36 149 -193 106 79 61
7323 61 361 -13 -63 -20 -130 -177 79 155 30 -97 181 46 -30 -220 -113 53 73 -97 -151 199 -77 143 133
7346 133 43 -201 114 216 -249 -51 -224 160 241 145 51 87 162 196 -154 276 72 19 100 46 -193 -76 -197
7369 -197 -46 -5 -235 -131 -468 218 51 75 85 -3 -60 262 -183 -16 -52 -117 82 109 -44 -182 -26 223 98
7392 98 -212 110 -115 -108 -140 -8 -105 228 24 176 37 53 106 -107 49 112 -194 -68 134 64 -310 -214 -139 49
7416 49 -142 44 150 -42 20 151 132 -44 -29 64 -191 140 23 299 50 -48 -69 -20 -14 -3 34 -182 -77 -4
7440 -4 195 25 3 136 -132 -138 211 -164 -126 -5 -194 199 213 64 -65 49 -237 81 155 35 30 118 -55 -59
7464 -59 -52 -10 -142 115 -90 56 331 -102 -279 132 146 122 -10 -97 -146 13 136 90 303 2 -12 69 -73 90
7488 90 43 -172 9 29 49 -1 134 -150 -95 -91 -177 -43 -106 -71 94 265 103 296 -81 76 146 -242 -90 326
7512 326 -159 -207 6 -98 -24 8 -149 29 36 124 88 105 -177 -344 227 86 -53 176 28 24 172 -123 190
7535 190 311 132 -15 30 -272 -174 -199 60 -291 83 82 234 -116 39 -46 -27 30 -37 92 -23 100 25 -113
7558 -113 141 -152 167 148 -212 -37 -180 -39 247 173 17 -108 231 -129 -251 122 -292 -83 -155 62 20
7579 20 125 174 140 58 75 18 -116 113 -145 -40 -241 122 -78 65 -184 210 -114 -89 313 41 5 -110 -159
7602 -159 -34 -104 132 -52 -229 -1 -49 -8 113 -22 -117 -81 340 58 172 -78 -96 46 177 20 -39 -3 -56
7625 -56 25 86 346 -38 247 27 -245 -212 318 53 194 282 -43 -212 -1 83 174 11 -15 151 13 179 27
7648 27 -68 -111 -191 -115 66 143 -133 61 -74 33 -100 -189 -37 33 -88 228 -316 -68 -111 -175 121 -206 141
7671 141 -57 -53 -52 66 -147 -25 142 -174 -102 -140 78 -162 265 269 -194 -34 12 38 55 -29 26 210 22 64 -71
7696 -71 243 313 -81 -154 95 62 165 -143 43 -179 -95 125 -76 -175 71 51 128 280 -63 84 18 23 -146 -23
7720 -23 49 125 -192 -133 -43 27 168 60 143 -47 -4 101 20 349 -5 102 -2 -69 -102 13 -211 -135 -164 285
7744 285 -79 44 -244 -224 -88 17 -69 107 -312 232 102 -49 -132 -359 -138 60 134 -20 -102 -62 185 -13
7766 -13 81 16 -169 -26 3 -152 -159 -159 -177 25 42 26 85 50 -100 42 -187 293 27 124 -136 307 61 -95 -134
7791 -134 44 -193 72 -170 93 284 -73 -2 -97 64 90 229 -180 25 41 -10 152 6 -544 23 115 -128
7813 -128 -132 -10 -119 -11 260 -12 -52 18 62 67 -90 -49 130 -238 203 -20 -175 56 -33 143 -213 38 -116
7836 -116 -37 42 -29 -51 101 67 135 128 169 -291 139 172 89 134 -35 -168 13 3 302 -319 -70 -287 27 -330
7860 -330 -45 109 106 190 -6 -43 -203 200 6 166 -3 -108 180 18 -158 138 300 89 -55 118 -144
7881 -144 39 -137 156 -106 -30 -185 126 36 131 252 150 -20 -285 24 -104 -53 -29 229 -155 102 251 -81
7903 -81 14 83 -47 109 -32 190 24 75 -94 -100 32 -203 47 -27 -211 49 -121 -197 182 85 147 41 -27 30
7927 30 138 -192 -23 -225 -248 -62 137 205 -141 -22 -31 -307 52 -174 5 135 -70 113 96 121 -229 251
7949 251 -121 -168 -74 -104 51 65 203 127 0 -19 48 -62 -38 139 171 62 134 260 30 126 -104 -5 217 -220
7973 -220 -93 -58 -152 -325 -53 -214 -247 -87 -231 133 -68 66 158 158 111 6 79 -126 -14 72 -103 -190 109
7996 109 17 -234 -81 107 -100 117 114 -129 127 -50 -96 248 -35 40 47 -174 -20 84 -30 -93 119 -110 34
8019 34 49 71 280 -241 -77 84 104 -100 40 242 -404 -17 -94 -55 -385 -35 -182 -89 -25 -92 61 124 -32
8042 -32 -330 -59 -140 207 119 -73 -180 127 -28 69 130 -135 -42 -197 -120 -10 -264 2 9 172 -34 68 31
8065 31 44 51 -71 -47 257 147 -27 -69 69 -172 -56 -160 0 43 -58 -281 65 -147 196 82 158 81 -86
8088 -86 14 -179 181 119 1 -51 -116 -117 -87 116 -282 62 93 -170 -162 212 -161 -110 -165 -42 -73 -35 192 -244 312
8113 312 -47 151 38 2 25 -265 -315 95 -144 159 78 186 297 334 85 136 58 -183 -232 14 -7 -212 271
8136 271 90 80 251 -30 149 -64 161 -18 -132 -291 54 -1 -142 111 89 -111 -178 234 -89 132 102 -18
8158 -18 -81 -5 82 -67 182 89 -10 -30 80 -122 -81 -131 220 129 156 -83 77 61 10 325 -61 285 136 -37
8182 -37 334 17 61 -81 182 -15 -115 -132 304
8191C04
$$ Imaginary data points
##PAGE= N=2
##DATA TABLE= (X++(I..I)), XYDATA
0 0 0 0 0 0 0 0 8 -8 16 -16 16 -24 32 -43 56 -72 88 -104 128 -155 184 -224 264 -312 368 -432 498 -576 666
29 666 -768 875 -1000 1135 -1282 1450 -1634 1836 -2056 2298 -2563 2853 -3171 3517 -3897 4309
45 4309 -4758 5252 -5790 6382 -7030 7743 -8530 9397 -10368 11451 -12674 14064 -15656
58 -15656 17502 -19672 22272 -25442 29416 -34556 41486 -51379 66705 -93715 154896 -549114
70 -549114 278946 750692 -933321 506198 260597 -721209 408849 262013 -308953 380988
80 380988 -301871 -279978 401453 -55147 30620 98708 -421012 138630 161628 -182540 141899
91 141899 -135564 -198086 212603 -7526 227187 115987 -420002 168424 222877 -254530
101 -254530 142829 -111749 -270206 193806 -87498 131951 248388 -495368 95232 336500
111 336500 -362793 292049 106269 -563939 418790 149663 -391142 474204 -182657 -513122
121 -513122 492352 -120297 -223084 408092 -404137 -91309 561677 -272872 13040 312997
131 312997 -414481 32804 255934 -203298 74814 -80476 -183873 256765 -27352 -68657
141 -68657 124166 -225012 6486 174227 -98370 131537 -13889 -171039 229542 -2918
151 -2918 -97385 131518 -244509 -72264 211513 -165307 46865 110306 -210500 142316 100594
162 100594 -93380 166258 -167693 -114092 284956 -187156 -34275 264959 -318571 -609
172 -609 282755 -274984 51383 120541 -305168 184202 138806 -191923 225719 -33364 -194354
183 -194354 264611 -81064 -163446 178751 -172203 -80486 208627 -96315 -7801 68849 -107612
194 -107612 95397 29268 -79074 103704 -80675 -53421 164891 -61737 -28667 64347 -117455
205 -117455 21567 27482 -92674 64766 -52443 -45687 173786 -50592 -18046 137413 -137050
216 -137050 -6465 117647 -144512 28163 48111 -139131 112085 20903 -125855 133835
226 133835 -53152 -110021 173308 -58367 -67660 151452 -81175 -11309 120439 -101112 12434
237 12434 28295 -134261 65093 9988 -108305 109378 723 -69792 124455 -9468 -56618
248 -56618 57791 -43432 -7700 30609 -41640 39712 -15301 -52051 73786 -42449 -60094
259 -60094 72170 -51337 -20669 86639 -36346 14149 53250 -45746 38715 5284 -72582
270 -72582 38422 -30361 -58263 64034 -29054 -22185 69313 -35727 7830 43389 -63167
281 -63167 29641 27572 -65101 60233 20094 -68338 55619 -3644 -72175 31439 -15967 -34767
293 -34767 31151 -8254 16888 26273 -16570 41922 1378 -45529 39627 -16565 -50840 38810
305 38810 -17632 -31712 40532 -11712 -10413 22082 -23956 5067 11837 -19716 27001 10418
317 10418 -10394 32138 -10048 -22131 10117 -35066 -15196 14802 -28996 9883 29373 -15761
329 -15761 20363 20686 -20227 10456 4655 -15440 5558 -9904 -3516 11201 -17521 2739 10139
342 10139 -27942 552 13648 -20655 3310 20916 4034 10916 10745 4454 -5097 -19885 -3065
355 -3065 -4143 -28002 1008 17109 -10473 3424 21040 -5411 -11272 12957 7653 -13782 2030
368 2030 17143 -8984 -7181 16459 -7211 -20480 2254 -3642 -13279 -1152 4151 7948 5527
381 5527 5170 22151 4806 -17230 5856 -1569 -28303 4361 13789 -21019 -973 20316 -10428
394 -10428 -4632 13927 -12603 -8837 15396 4603 7336 7008 -10806 6329 5124 -16974 5913
407 5913 -8304 -34455 15767 15308 -18718 18964 7417 -18146 29955 10214 -22909 10895 -17135
420 -17135 -18384 38231 -7197 -23583 25682 -20741 -18680 41600 -16871 -32168 29085 -4309
432 -4309 -4338 45127 -8489 -28241 19248 -7329 -10565 23564 -24000 -31674 25166 663 -5174
445 -5174 34052 -18600 -31709 39841 7181 -20971 26051 -21534 -32228 47157 8553 -22258
457 -22258 17535 -35814 -23036 50888 -13239 -19970 28138 -35845 5629 72825 -28928 -25131
469 -25131 26545 -46521 9460 63295 -50550 -24409 31348 -38699 27223 57790 -65029 -16790
481 -16790 41038 -35029 30094 51107 -74799 -12131 58234 -27364 14893 33489 -79148 -16308
493 -16308 57154 -18504 10908 21571 -62043 13148 60890 -24636 6135 4448 -67852 27793
505 27793 61920 -38898 -2769 6063 -56486 34905 57981 -44412 -14163 4064 -30133 46724
517 46724 40326 -44797 -5805 -2167 -19673 59933 9754 -74671 9473 7147 -26148 74228
529 74228 9859 -91863 28505 32089 -33019 59492 -3491 -93710 41712 37812 -28145 50505
541 50505 -30940 -81969 64166 21997 -31061 48633 -49630 -59170 91059 13214 -34853 40054
553 40054 -53821 -38309 87495 37 -41467 13597 -41372 -2206 72250 -7785 -30790 -2218
565 -2218 -31171 21774 58328 -23343 -33188 5106 -12098 23546 48800 -38101 -48246 20765
577 20765 -2414 12285 52525 -48659 -52577 54052 2530 1657 51272 -69784 -41326 77407
589 77407 -19282 74 47673 -94167 -10086 96291 -42483 4727 32957 -102512 29467
600 29467 89231 -59863 17562 15070 -88762 58188 62211 -65131 11773 -9011 -51611 69547
612 69547 28149 -50358 8392 -17591 -13796 60535 5933 -40698 -5452 -5874 8131 36694 1455
625 1455 -42109 -12747 23811 3029 14542 12584 -57050 -6785 55391 -15420 11125 18968 -73560
638 -73560 19680 59235 -46849 23745 6181 -81336 61726 41870 -63889 45057 -19080
649 -19080 -67124 92484 4428 -58222 55581 -45531 -31162 97131 -34408 -36139 47493
660 47493 -57343 6886 74341 -52396 -14007 28298 -39882 30102 39546 -41716 -8035 6184
672 6184 -5812 21423 6122 -13041 -16956 -926 26841 -4083 -3515 5653 -36305 18313 38144
685 38144 -36035 13886 9194 -51201 45424 22858 -51339 36193 -11687 -42810 67168 -12589
697 -12589 -40095 49151 -36977 -10102 64651 -46003 -5533 36959 -56557 30274 40670 -60954
709 -60954 26062 12072 -47933 51318 2207 -45346 39310 -15799 -18576 49238 -24161 -16933
721 -16933 25711 -22977 12403 18622 -26190 9966 -2951 -8955 25962 -16521 -3444 16588
733 16588 -28478 21313 18033 -39764 23908 4647 -32381 40832 -6634 -30483 37420 -21180
745 -21180 -11605 40927 -33165 -1441 29584 -36444 19766 17866 -41050 29305 2578 -32714
757 -32714 41450 -12522 -24975 39508 -26499 -7010 38564 -37456 6618 28473 -41541 22390
769 22390 17389 -41351 29609 3832 -31921 36156 -8375 -22444 30636 -17861 -5087 24845
781 24845 -24334 7574 12144 -25175 21730 387 -23388 27934 -10717 -13208 29313 -21195
793 -21195 -4179 24072 -25005 10386 14356 -28918 21681 3164 -26554 29982 -9189 -20905
805 -20905 34153 -17723 -11386 30046 -24520 1326 22689 -27299 13121 10366 -26830 24441
817 24441 -2116 -23914 30894 -11413 -16409 31594 -18944 -8907 26146 -21580 2247 16784
829 16784 -21366 12549 5829 -18125 18705 -6426 -12979 22676 -13582 -5655 20706 -18734 3325
842 3325 15242 -19982 10836 5901 -17866 18427 -3661 -14211 22089 -11984 -7405 22463 -18464
855 -18464 -944 19010 -20883 6429 12004 -20046 13981 4684 -17227 17707 -4831 -12324 20255
868 20255 -11602 -7049 18667 -14370 1023 14826 -17353 5231 9326 -13774 10845 2082 -13010
881 -13010 12173 -1494 -6300 11321 -7714 -3092 9380 -6482 2248 3419 -8133 5521 1263
894 1263 -1834 7023 -7396 -505 7623 -8242 5589 3969 -13646 9746 3191 -10747 13840
907 13840 -3999 -13149 16469 -3442 -6996 15854 -11337 -5618 16565 -10199 844 12167 -17830
920 -17830 2478 14196 -12842 5671 6920 -17619 8721 11630 -11925 6284 2604 -15179 9719
933 9719 10722 -10623 2163 1406 -9854 9888 8608 -11768 449 2362 -7675 12150 8603
946 8603 -16103 810 5971 -7144 12179 4460 -20191 4392 8586 -7887 13220 1970 -21971
959 -21971 8576 10756 -7812 10983 -2611 -20617 13248 11144 -9763 9071 -3904 -19637
971 -19637 16293 12229 -13335 5998 -4351 -16343 22515 10344 -18577 8244 -5007 -16150
983 -16150 28947 5229 -25616 11476 -5415 -12098 34558 -4515 -28513 17979 -7186 -6006
995 -6006 35640 -16588 -25263 22210 -8406 2805 29981 -28434 -18015 24525 -8501 7258
1007 7258 19741 -32267 -8915 25290 -3951 6499 7097 -29078 -2352 25690 -570 -1445 725
1020 725 -21300 291 28688 -1100 -12993 1914 -15407 2045 34142 -9021 -21055 10820
1032 10820 -13419 4924 37333 -24260 -21614 19877 -17967 13950 35033 -41605 -10549 26260
1044 26260 -22466 24228 23724 -53230 5456 26000 -22661 30640 6288 -52846 19831 19919 -17181
1057 -17181 28149 -11721 -40583 28481 13903 -9486 18313 -20819 -24941 29703 11493 -8270
1069 -8270 4007 -18066 -12551 26979 14420 -15624 -5723 -5301 -8805 25707 16619 -29675 -4659
1082 -4659 8256 -12384 29197 12701 -44391 6939 14236 -18114 35503 -139 -50249 25863
1094 25863 11472 -18758 39805 -17849 -44137 40571 954 -13803 36463 -33616 -26608 44954
1106 44954 -9379 -4936 24626 -40036 -6075 39520 -13568 1522 10024 -34171 8080 29922
1118 29922 -11832 -1424 -1284 -21074 12045 23068 -7805 -10827 -1256 -5891 7431 21826 -8945
1131 -8945 -21350 8695 486 746 25088 -17234 -24847 23277 -3304 -2264 27415 -29769 -17011
1144 -17011 34948 -12679 1723 24436 -39809 -1001 35901 -22606 9003 14274 -41853 15579
1156 15579 26660 -24774 14309 1198 -32528 25882 13209 -20234 14005 -9112 -17518 26744
1168 26744 2716 -13162 8373 -11641 -4677 20103 -818 -9218 941 -4779 839 12869 1908
1181 1908 -12535 -1643 5446 -2364 9031 4495 -20251 3065 13124 -10346 11598 4048 -26597
1194 -26597 13228 13260 -17751 15976 -712 -26381 24076 6828 -19804 19134 -8762 -19776
1206 -19776 28400 -2742 -15076 18879 -13497 -8529 25517 -9710 -8033 13526 -13708 664
1218 664 17081 -10873 -3276 6442 -8516 4490 8245 -7393 -1688 1729 -2025 3252 3454 -3355
1232 -3355 -3587 2542 1964 -1482 3935 -2367 -7075 7241 1377 -5142 8138 -4848 -7703 12598
1246 12598 -2678 -6476 11110 -8223 -5321 14992 -7270 -4018 10998 -10972 -262 13008
1258 13008 -10057 -907 7943 -10127 3604 8235 -9047 2118 3561 -6220 4578 2335 -5453
1271 -5453 2547 764 -1709 3420 -830 -2044 900 -407 729 642 -582 288 -425 900 348 -2187
1287 -2187 1655 -56 -2330 2907 -250 -2664 3389 -1421 -2018 3709 -1173 -1213 2886 -2331 -230 2008
1303 2008 -1993 1073 604 -2407 2244 91 -2392 2269 -520 -2329 3195 -193 -1743 1877 -1288
1318 -1288 -700 2040 -1089 -517 1392 -420 -30 204 -568 3 -40 425 361 -685 -346 318 -134 52 -147
1337 -147 -293 375 55 -247 -334 -220 10 -101 239 681 -924 -8 1105 -1133 352 327 -1362 887 1142
1356 1142 -1366 338 322 -1170 1247 519 -1038 587 499 -401 921 -149 -1072 326 776 31 541
1373 541 528 -1279 285 1221 -816 477 1759 -1787 65 2113 -2349 529 2052 -3295 1359 2501
1389 2501 -3582 1565 1689 -4862 2873 2564 -4128 2785 628 -4617 3837 1212 -4082 3101 -910
1404 -910 -2962 5131 -524 -3208 2784 -1745 -1453 5161 -1097 -3337 2412 -1469 -712 4507 -1928 -3700
1420 -3700 3045 146 -1261 3571 -2264 -4876 4417 1599 -2711 3854 -2194 -5769 6451 1304 -4621
1435 -4621 5153 -3131 -5554 8825 -179 -5598 5725 -4364 -3611 10850 -3163 -4736 6214 -6856
1449 -6856 -609 11321 -6632 -3676 6483 -8284 2267 11146 -9597 -2852 6549 -6925 3854
1462 3854 9133 -10818 -2538 6473 -5123 4765 6465 -11473 -1716 7131 -3484 3648 4059 -12006
1476 -12006 393 9380 -4105 2881 2374 -12889 3609 11230 -6442 1749 2057 -13429 7215
1489 7215 12118 -10831 1213 2692 -12764 10341 11288 -14779 1855 3431 -11494 12939 8687
1502 8687 -17114 3146 3380 -9767 14361 4224 -18264 5702 3675 -7858 14789 -577 -18701
1515 -18701 8397 3943 -6450 14169 -4956 -18116 12401 4420 -6504 12339 -8194 -16088
1527 -16088 16322 4156 -8225 9839 -9718 -12631 19357 2511 -10385 7688 -9978 -8632
1539 -8632 20964 -25 -12173 6709 -8532 -4026 21342 -4628 -14059 7716 -6238 -1239 20265
1552 20265 -8777 -14866 10208 -4219 146 18473 -13132 -14308 14323 -3069 -480 16025 -17022
1565 -17022 -11748 18337 -3945 -353 13073 -20875 -6902 21397 -6711 -249 10053 -22085
1577 -22085 81 21679 -10173 -163 6239 -20706 6997 20035 -13069 -991 3194 -16716
1589 -16716 11788 15760 -15142 -1576 2133 -11518 13960 11279 -16757 -1911 4195 -6486 12179
1602 12179 7370 -18500 -1777 8123 -4910 9889 5474 -20655 680 12843 -6560 7962
1614 7962 3575 -21971 6392 14879 -10868 7398 752 -22410 13632 13361 -14675 8657 -2738
1627 -2738 -19184 19786 7884 -16501 10028 -6175 -13266 22581 772 -14940 9175 -7935
1639 -7935 -5698 20695 -4929 -12201 7301 -6819 151 15642 -6752 -9889 5249 -2283 1675
1652 1675 9874 -6524 -9777 5532 2708 -156 6666 -5838 -11221 8988 5180 -5156 6389
1665 6389 -6136 -11284 14286 2568 -8748 9023 -8597 -8786 19539 -3639 -9577 11393 -12048
1678 -12048 -3491 20523 -10272 -6231 11065 -13811 3198 16083 -14302 -838 7451 -11567
1690 -11567 8591 8550 -13716 2541 2655 -6853 9618 1673 -9626 2784 11 -1595 6176 -1206
1704 -1206 -5225 99 1787 1337 663 -123 -3594 -2483 6251 739 -3425 3439 -5231 -2453 10235
1719 10235 -4528 -3664 6423 -9233 1263 11147 -10469 80 6302 -11040 7124 7047 -12914
1732 -12914 5266 2387 -10316 11156 543 -10936 8873 -2651 -5437 10889 -5418 -5560 8046
1745 8046 -5203 179 6872 -7105 132 3614 -4412 3606 1005 -4585 2517 -1210 -295 2866 -3456
1760 -3456 287 1091 -2833 4280 -880 -3619 3765 -3094 -825 5539 -5289 77 3896 -6588 3675
1775 3675 3590 -7475 4840 812 -6378 7250 -2080 -5836 7303 -4063 -2420 8114 -6433 -1400
1789 -1400 6414 -7012 2188 4667 -7877 3653 2370 -6414 5383 -485 -5350 5872 -2026 -2442
1803 -2442 5005 -4367 -544 3504 -4423 1921 1241 -3992 3662 -752 -2900 4233 -3351 -695 4377
1818 4377 -4399 1226 3108 -5657 2912 1581 -5504 4627 -534 -4389 5725 -2643 -3142 5658 -4220
1833 -4220 -505 4798 -5335 1688 3026 -5825 3270 1125 -4843 5153 -768 -3901 5394 -2941 -2102
1848 -2102 5082 -4200 -140 4171 -4468 1497 2127 -4379 2737 726 -3451 3406 -1362 -1776 3241
1863 3241 -2753 -48 2655 -3719 2213 1404 -3888 3128 -882 -2900 4247 -2169 -1596 3952 -3374
1878 -3374 -52 3474 -4547 1585 2619 -4196 3534 576 -4664 4118 -1053 -2837 5113 -3052 -1921
1893 -1921 4561 -3860 68 3793 -5385 1390 3555 -4572 2501 1210 -4791 3380 873 -3536 3299
1908 3299 -1117 -2407 3188 -1244 -1031 1525 -1608 -205 1403 -631 505 -783 -708 487 -861 1998
1924 1998 -395 -2487 1948 -635 -1268 3718 -2747 -2466 4296 -2454 -134 3966 -5746 -152 4641
1939 4641 -4599 2809 2521 -7634 3515 3298 -5597 4328 125 -7094 5919 1547 -4607 4698 -2305
1954 -2305 -5117 6494 62 -3745 3578 -3599 -2461 6020 -1010 -2936 1947 -2281 -1275 4796 -777
1969 -777 -3853 1569 -382 -1091 4897 -423 -5752 1823 1053 -2171 5166 -1118 -7128 4431 1450
1984 1450 -3306 6159 -3352 -7124 7116 90 -2972 6553 -5725 -5396 9377 -1613 -2767 5726
1998 5726 -7460 -2440 10408 -3808 -2088 4591 -8071 453 9709 -5055 -2430 2929 -6915 2773
2012 2773 8599 -5674 -2900 3107 -5000 3262 7169 -7372 -3109 4358 -3303 3300 5903 -8840
2026 -8840 -2783 6454 -2955 2829 4752 -10331 -1052 7780 -4028 2650 3437 -11317 1773 8819
2040 8819 -5500 2610 1753 -11526 5002 8437 -6694 2251 200 -10236 7560 7053 -8321 2210
2054 2210 -523 -7520 9491 4722 -9575 1942 -424 -5307 10297 2304 -10518 2419 634
2067 634 -3955 9761 -236 -11430 3801 2237 -3063 8524 -2615 -11195 6187 3227 -3476 7473
2081 7473 -4463 -10132 8646 2642 -4228 6166 -6074 -8214 11000 1286 -5359 5238 -6462
2094 -6462 -5259 12209 -401 -5883 4137 -6482 -2560 12650 -2862 -6588 4244 -5616 -166
2107 -166 11618 -5258 -6729 5024 -4116 1170 10020 -7271 -6522 6129 -2919 1989 8100 -8850
2121 -8850 -5025 7360 -2072 1580 5830 -9991 -3022 8853 -2487 942 3853 -10214 -80
2134 -80 9488 -3681 194 2508 -9637 2529 9493 -5236 -193 1865 -7922 4408 8051 -6777
2148 -6777 -1059 1463 -6366 5572 6152 -7982 -576 2133 -4582 6275 4034 -8653 542 2480
2162 2480 -3667 5921 1597 -9153 1978 3279 -3040 5320 33 -8711 3660 3405 -3158 4619
2176 4619 -1649 -7356 5156 2653 -3434 3528 -2594 -5587 6384 2243 -3981 2692 -2719 -3935
2190 -3935 6802 1107 -4377 2403 -2324 -2547 6576 -421 -4531 2624 -1767 -1376 5915 -2071 -4804
2205 -4804 3266 -1471 -625 5561 -3303 -4265 3976 -1373 -499 4801 -4200 -2674 4317 -1566 -454 3602
2221 3602 -4280 -1642 4716 -1674 -222 2690 -4421 -409 4213 -1963 -313 1600 -3799 638 3656
2236 3656 -2255 -678 1541 -2753 726 3114 -2404 -630 1489 -2011 716 2746 -2603 -706 1831
2251 1831 -1992 830 2652 -3359 -491 2227 -2184 1311 1962 -3671 392 2161 -2510 1746 1191
2266 1191 -3673 1677 1607 -2264 1849 15 -2873 2160 712 -1921 1468 -242 -1880 1919 243
2281 243 -1440 988 -387 -943 1368 33 -920 575 -312 -408 579 356 -1081 -128 839 -541 355 776
2299 776 -1468 3 826 -1103 303 793 -1533 590 817 -1152 1066 170 -1871 1409 151 -1216
2315 -1216 1686 -777 -1047 1836 -765 -840 1493 -1232 -249 1576 -1326 -194 1089 -1193 389 843
2331 843 -774 236 23 -812 461 25 -270 443 -126 98 -32 -81 464 -370 160 861 -650 -96 825
2350 825 -1117 140 657 -1262 754 -41 -1162 1228 -100 -643 1213 -580 -506 1322 -1171 -119
2366 -119 1375 -1524 34 890 -1518 801 916 -1692 911 40 -1430 1262 -97 -1386 1580 -484
2382 -484 -700 1558 -599 -692 841 -372 -135 933 -464 51 120 -30 204 -57 169 -278 -627 543
2400 543 -13 -201 780 -676 -75 1277 -993 347 982 -1664 733 1335 -1746 1123 475 -1905 1719
2417 1719 902 -2020 1425 -703 -1656 2689 -605 -1591 1699 -1513 -752 2919 -1294 -812 1828 -1942
2433 -1942 473 2527 -1856 -562 1263 -1652 596 1710 -1897 -271 1076 -582 648 1098 -1805
2448 -1805 -435 1104 -211 114 1290 -1480 -1076 2184 -217 -511 1697 -2050 -978 3186 -750 -953
2464 -953 1865 -2708 -109 3847 -2118 -583 2290 -3224 862 3979 -3523 211 1636 -3713 2612
2479 2612 3101 -4180 1032 1051 -2828 3356 1371 -4318 1235 823 -1975 3391 58 -4065 1651 753
2495 753 -1342 2894 -663 -3553 1741 1574 -1048 1687 -834 -3710 2323 2193 -2036 1408 -576 -3761
2511 -3761 3342 2210 -3257 1433 -482 -3688 4789 1720 -4341 1947 -784 -3088 5501 406 -4790
2526 -4790 2969 -1485 -2044 6128 -1507 -4424 3121 -1707 -670 5806 -3338 -4190 3846 -1373 410
2541 410 4416 -4368 -3353 4100 -855 350 3323 -4759 -1975 4622 -749 -296 2078 -4858 -1420
2556 -1420 5325 -876 -1182 1625 -4284 -139 5777 -1888 -1888 1648 -4113 1338 5723 -3610 -2256 2089
2572 2089 -3612 2174 5675 -5259 -1582 2885 -3607 3194 4232 -6363 -458 3141 -2945 3680
2586 3680 2760 -6974 808 3464 -2429 3498 1092 -7159 1921 3583 -2677 3153 -360 -6100 3054
2601 3054 3932 -2914 1832 -1159 -5374 3960 3723 -3687 1476 -1010 -4168 5176 2524 -4507 1099
2616 1099 -472 -3218 5858 1438 -5316 1715 68 -2396 5629 -348 -5813 2351 352 -1793 5682
2631 5682 -1761 -5670 3727 312 -1232 4792 -3039 -4942 4642 278 -1162 3749 -3665 -4062 5346
2646 5346 201 -1498 3052 -4168 -2447 5780 -544 -1922 2481 -3953 -1008 6000 -1544 -2202 2175
2661 2175 -3323 40 5722 -2573 -2548 2378 -2789 861 5015 -3722 -2214 2744 -1944 1368 3756
2676 3756 -4366 -1377 3424 -1830 1313 2640 -4324 -734 3480 -1670 950 2121 -4359 151 3298
2691 3298 -1846 853 1262 -3935 951 3723 -2118 62 855 -3537 1521 3357 -2902 403 885 -3440
2707 -3440 2377 2651 -3537 550 902 -2578 2492 1650 -3409 940 592 -2123 2777 591 -3214 1325
2723 1325 717 -1409 2568 -301 -2840 1547 512 -977 2037 -190 -2683 1474 811 -1030 1139
2738 1139 -609 -1896 1851 789 -1287 1028 -425 -1652 2077 731 -1721 1220 -604 -1289 2332
2753 2332 200 -1504 1411 -548 -917 2175 -495 -1501 1338 -729 -610 2115 -1222 -1304 1451 -969
2769 -969 -69 1463 -1445 -832 1114 -1168 267 1032 -1522 -454 1061 -480 33 404 -1030 203
2785 203 773 -182 -56 488 -594 -80 809 -246 -626 452 -435 -341 910 -492 -509 765 -705 -102
2803 -102 1024 -913 -410 993 -855 -49 816 -1286 -188 752 -1099 248 481 -779 594 341 -976
2820 -976 427 282 -830 754 -46 -451 490 -269 -364 465 -129 -287 623 182 -339 403 5 1 119 96
2840 96 50 104 396 30 -160 213 -657 -30 428 -195 -23 88 -274 538 411 -718 515 153 -513 295
2860 295 -155 -769 815 -22 -531 559 -160 -395 1061 -71 -524 727 -471 -283 644 -252 -178 704
2878 704 -222 -36 525 -413 -48 592 -84 97 252 -22 37 527 -73 74 69 6 -179 527 -66 -419 80
2899 80 -227 -233 361 -202 -248 633 -100 -188 734 -366 -210 849 -519 -52 632 -667 112 563 -1012 390
2919 390 427 -1032 161 671 -850 558 388 -1307 573 579 -691 571 315 -970 674 526 -718
2936 -718 564 112 -859 776 587 -947 535 -29 -622 891 394 -949 231 92 -675 1002 194
2953 194 -1350 391 689 -684 1127 163 -1641 936 489 -894 1300 -324 -1784 1732 75 -688
2969 -688 1373 -970 -1275 1737 -390 -455 1457 -1076 -795 2174 -561 -831 1174 -1463 -299 2185
2985 2185 -869 -678 913 -1530 -170 2227 -1060 -1056 876 -909 125 2034 -1411 -1164 1336 -812
3001 -812 583 1998 -1815 -1191 1732 -1065 485 1753 -2330 -556 2075 -798 756 1527 -2887 79
3017 79 2256 -1363 463 906 -3009 986 2661 -1681 579 362 -2859 1406 2266 -1979 432 283
3033 283 -2250 2177 1795 -2347 503 168 -1970 2258 995 -2599 350 843 -1424 2486 942 -3275
3049 -3275 918 876 -1035 2514 461 -3470 1169 917 -1523 2451 -440 -3402 1910 1312 -1520 2224
3065 2224 -959 -2988 3226 930 -1588 1852 -1478 -2625 3410 368 -1820 1351 -1746 -1362 3733
3080 3733 -149 -2077 1431 -1550 -814 3550 -914 -2487 1169 -1174 74 3065 -1589 -2317 1772
3095 1772 -902 230 3018 -2356 -2158 2310 -821 108 2528 -2855 -1719 2867 -560 106 2014 -3098
3111 -3098 -1149 3316 -1001 -283 1595 -3093 -352 3438 -1560 -216 1344 -3380 924 3404 -1988
3126 -1988 -7 644 -2516 1547 2956 -2438 -410 776 -2003 2113 1840 -2935 -185 995 -1423
3141 -1423 2234 1378 -3079 45 1181 -1255 1880 742 -3381 567 1674 -969 1439 219 -3022
3156 -3022 1142 1780 -1402 1313 -112 -3130 1932 1272 -1528 1483 -289 -2219 2271 1030 -2166
3171 -2166 1058 -508 -1754 2702 661 -2325 868 -453 -872 2667 -43 -2290 1133 -483 -607
3186 -607 2467 -713 -2023 1436 -293 -422 2000 -1432 -1870 1446 -378 -495 1753 -1444 -1281 1615
3202 1615 -233 -483 1195 -1311 -903 2025 -209 -401 1142 -1248 -436 2082 -347 -618 838 -1196
3218 -1196 -239 2040 -999 -615 1198 -1300 157 1656 -1293 -411 1224 -956 368 1111 -1307 -381
3234 -381 876 -784 509 1210 -1506 -200 729 -702 483 614 -1461 282 918 -924 279 304 -1348
3251 -1348 441 993 -837 137 534 -1219 534 732 -652 284 174 -1001 774 669 -1118 190 139
3268 139 -705 550 444 -873 160 386 -626 597 292 -983 502 162 -526 368 -68 -976 320
3285 320 218 -495 766 138 -975 858 124 -441 530 -180 -512 764 -122 -542 688 -168 -59 786
3303 786 -27 -258 316 -199 -418 325 -165 -22 202 94 -106 412 -67 -167 167 -263 280 210 16 -288
3323 -288 286 -32 28 147 -170 -392 309 -24 -45 284 -92 -281 471 14 -241 338 -285 -2 525 -149 -114
3344 -114 295 -294 81 278 -711 -269 304 -103 260 277 -487 329 65 -610 315 -40 -402 445 221 -266
3364 -266 -65 -107 -212 221 94 -282 192 94 -181 -52 195 -71 20 -107 -50 -238 308 -332 -175 381 -652
3385 -652 113 81 -323 325 146 -419 220 401 -258 214 185 -516 457 41 -425 394 242 -454 438 -174 -375
3406 -375 628 -67 -282 284 -195 82 232 -229 -184 478 -275 -153 626 -260 -359 163 -82 -70 588 -341 -314
3427 -314 249 -172 -337 278 -29 -173 610 123 -75 333 -191 -296 655 -268 -388 452 -443 -258 849 -381
3447 -381 -407 625 -720 126 914 -765 -100 547 -902 142 748 -622 125 428 -649 532 536 -925
3465 -925 99 155 -561 522 407 -822 226 249 -569 606 439 -958 201 568 -304 446 272 -1161
3483 -1161 430 681 -760 258 298 -987 562 873 -539 241 63 -1067 899 772 -904 338 -188
3500 -188 -1118 1095 290 -851 846 -33 -572 1450 -295 -1308 793 -225 -487 1200 -55 -1106
3516 -1106 778 -370 -431 1419 -619 -1115 1153 87 -128 995 -670 -1078 1124 -167 -479 635
3532 635 -996 -399 1521 110 -315 442 -1014 -629 1452 50 -593 834 -1157 -354 1746 -637 -568
3549 -568 740 -1111 -86 1791 -952 -793 738 -1066 413 1252 -1529 -508 913 -976 755 1201
3565 1201 -1861 36 1183 -800 786 772 -1783 45 1371 -768 627 464 -1942 316 992 -816
3581 -816 204 103 -1709 669 1063 -875 287 -78 -1450 971 1157 -1191 244 59 -1182 1251
3597 1251 824 -1532 209 0 -768 1474 567 -1557 749 251 -1008 1404 192 -1678 897 94
3613 94 -434 1506 -478 -2026 1020 276 -537 1364 -699 -1542 1212 118 -499 985 -932 -928 1133
3630 1133 481 -663 836 -1081 -641 1671 -103 -655 498 -683 -535 1586 -507 -1310 587 -838
3646 -838 -189 1969 -746 -931 610 -532 304 1660 -960 -779 1019 -501 258 1456 -939 -448 1215
3663 1215 -521 320 837 -1531 -518 1190 -290 369 523 -1510 -127 1005 -584 265 284 -1209 214
3680 214 1343 -653 -33 178 -1192 465 1290 -904 171 229 -820 457 642 -1197 25 281 -647
3697 -647 878 508 -1157 136 363 -685 802 386 -1080 384 607 -500 784 47 -1024 671
3713 671 355 -586 576 -25 -981 709 570 -417 567 -272 -533 985 286 -497 462 -289 -498 997 -148
3732 -148 -520 305 -250 -541 889 -194 -502 524 -326 -432 656 -101 -633 413 -314 -180 668 -380
3750 -380 -688 485 -490 -141 682 -212 -217 533 -154 -284 430 -523 -38 589 -226 -328 286 -410 -42 633
3770 633 -324 -141 106 -496 48 606 -161 120 182 -318 162 609 -190 -227 434 -69 155 227 -438 17 404
3791 404 -4 38 -14 -383 -216 274 -329 65 220 -564 -205 433 -190 63 158 -426 21 212 -227 71 161
3812 161 -220 196 -25 -181 101 258 -567 61 149 -346 -75 -74 -147 99 126 -317 105 -139 -334 219 79 -72
3834 -72 81 234 -194 -97 -39 -111 182 154 -177 120 53 -268 171 59 -113 201 48 -177 -106 -40 -100 28 -223
3857 -223 -223 359 48 -314 212 119 -273 221 13 -118 246 -314 -201 300 127 -57 154 131 -132 -14 137
3878 137 247 193 -302 -14 -144 5 175 229 36 68 302 -135 -81 228 -231 -109 -103 -81 -240 170 76 -189 178
3901 178 -217 -75 7 33 -17 313 -320 205 145 -10 -175 222 -165 58 337 -454 370 115 15 125 226
3922 226 -318 209 370 -120 -253 18 -278 18 167 -236 429 -117 -219 62 134 -320 572 545 -146 267 80
3943 80 -185 -30 116 70 197 -140 -106 348 283 -48 165 -157 3 55 132 -245 13 67 -190 510 -112 -604
3965 -604 415 -116 -148 320 124 -375 130 -281 -381 322 -356 -583 447 29 161 336 -494 -473 525 150
3985 150 -66 637 -87 -309 442 -127 -156 542 -143 -153 391 -250 231 282 -271 -217 439 -485 79 456 -551
4006 -551 -29 553 -197 49 104 -415 39 579 -229 -289 215 -537 213 556 -672 -314 183 -132 201 448
4026 448 -504 -301 154 -344 237 475 -659 -69 267 -444 449 216 -645 299 307 -494 439 -40 -648 339
4046 339 268 -120 610 36 -667 633 223 -140 308 -259 -515 634 296 -393 207 -205 -391 625 -115
4065 -115 -472 416 -166 -224 956 -193 -882 434 -238 -54 630 -500 -587 488 254 -168 967 -691
4083 -691 -693 465 -23 3 628 -639 -272 650 -74 -232 415 -695 -404 754 -35 -135 257 -731 -131 629
4103 629 -233 -379 335 -471 119 938 -489 -209 184 -459 229 736 -473 -9 425 -477 386 255 -663
4122 -663 -248 191 -189 399 457 -943 -39 353 -155 379 297 -837 270 594 -553 361 219 -966 539
4141 539 558 -374 300 145 -545 647 439 -389 190 -47 -619 444 349 -516 88 32 -534 559 232 -673
4161 -673 269 -94 -11 737 -221 -529 218 -126 -401 435 62 -682 420 -54 -377 720 -293 -493 468
4180 468 316 -160 583 -237 -412 373 7 -442 311 -209 -417 602 49 -378 311 -301 -312 732 -65 -358
4200 -358 470 -374 -104 452 -202 -265 329 -9 -31 478 -208 -405 620 -332 -44 222 -383 -207 443 -192
4220 -192 -149 212 -395 -96 391 -314 77 319 -17 -248 172 -32 88 113 -347 142 278 -114 -219 129 -483
4241 -483 -28 502 -46 -4 17 -324 151 215 -224 111 99 -255 200 349 -558 -45 243 -488 522 308 -342
4262 -342 72 384 -164 341 -169 -395 97 -24 -385 300 290 -162 229 4 -373 214 -86 -374 244 18
4282 18 -191 322 162 40 44 89 -215 294 -169 -347 317 131 -39 41 33 -130 150 -70 -303 29 251 -179
4304 -179 314 -78 -191 95 117 250 157 8 -255 96 -181 57 -208 78 136 140 -69 -123 272 -250 87 82 -245
4327 -245 41 66 -346 -215 112 60 -229 71 -112 -26 -47 -59 -146 -15 -177 -257 202 -241 -114 76 145 -96 -73
4350 -73 -55 96 -25 -184 -53 229 -77 69 -17 20 -137 81 -31 -221 128 -435 250 28 -5 364 197 -59
4372 -59 263 343 32 -82 178 78 -31 46 164 237 79 33 61 -25 167 -92 76 -39 356 -161 104 299
4394 299 65 13 238 30 61 -161 130 -45 248 45 -56 -52 158 -4 257 184 -110 156 62 -165 312 -44
4416 -44 -269 492 37 365 167 208 -194 12 43 -142 113 -138 48 193 -116 39 4 88 -258 96 -213 44
4438 44 222 -277 -396 8 -287 11 173 157 58 3 123 -35 11 -7 -32 73 -40 -132 -22 -42 -172 -93 -182 28
4462 28 153 -150 -74 -90 -308 174 147 -41 -298 -20 -33 -32 225 -204 149 317 -165 -46 120 -234 101 301
4484 301 -409 340 237 -234 99 157 -21 -183 220 -330 -99 244 59 -55 -294 -58 221 -52 -135 459 -45
4505 -45 -486 51 66 -169 260 -65 -216 178 179 -314 264 -460 -281 51 267 -271 118 118 -233 260 13 -16
4527 -16 241 -101 -99 542 188 -206 44 -16 -113 403 8 -97 270 -256 100 321 -62 165 208 -277 67 390
4549 390 -119 -182 108 -48 73 371 -459 -250 340 20 28 377 -366 -77 213 -398 -3 253 -114 167 175 -226
4571 -226 149 -12 -182 99 320 -72 -108 23 -293 -69 410 -300 -44 24 -287 228 130 -473 -191 148 -230
4592 -230 231 145 -88 -9 -27 -125 188 156 -378 106 44 -270 344 18 -400 116 389 -275 263 28 -71 341
4614 341 89 -204 269 -200 -205 309 59 -180 101 -166 -331 239 -133 -24 -26 -19 -60 191 -355 -188 226 260 -141
4637 -141 150 -76 -94 81 71 198 302 -252 -234 288 -138 -187 308 -216 -173 231 -57 -28 12 -308 -89 387
4659 387 -235 120 253 -220 -388 131 -308 -13 113 83 464 295 -364 -86 146 -184 128 291 -79 -79 228
4680 228 -105 73 414 -458 -31 183 -128 16 62 -300 158 -31 -292 138 102 -199 107 161 -101 133 228
4701 228 -106 243 -13 15 171 172 33 149 -20 -93 -34 170 -95 -9 245 -366 323 249 -82 210 6 127
4723 127 10 -70 -80 180 50 -108 -119 -26 -123 183 34 -67 275 -278 72 -96 -274 -221 -16 58 -396 70
4745 70 -83 -47 162 188 -206 38 -90 -91 145 -24 197 -102 -27 -160 300 -285 -69 187 -68 94 286 150
4767 150 -237 -11 -43 155 60 181 -292 220 -53 -126 152 -151 15 -15 -78 85 25 83 60 117 -18 15 174
4790 174 190 -212 30 -318 79 -71 -390 -91 -100 182 -50 95 -445 240 32 -192 -465 92 -60 -164 139
4811 139 -55 -50 -15 -112 70 -101 -116 -72 -26 -116 -59 -30 117 -4 -50 -45 -267 197 -59 -156 -46 -205 -89 -226 -40
4836 -40 85 -74 -31 -143 0 -154 -3 39 -258 11 -83 23 71 -94 25 148 90 84 17 4 -135 72 54 -29
4860 -29 -71 -9 69 -346 -17 -205 62 -236 179 11 282 -9 -107 131 -96 -33 -121 139 89 -75 17 57 205
4883 205 73 -131 -140 69 -93 -114 -168 -27 231 81 71 -66 238 140 32 -215 -50 -153 -46 -240 -42 -146
4905 -146 -168 277 0 -147 61 -9 139 -39 166 -100 345 -44 -8 1 -94 218 130 124 40 -38 -222 -136 -131 49 -44
4930 -44 68 -335 383 -166 147 -24 -151 93 -81 -231 -31 -74 -101 -126 66 200 -68 277 -227 160 99 -129
4952 -129 -207 56 38 435 -189 -179 118 71 242 159 105 -126 201 -254 -60 224 -136 57 58 -20 -350 168 27
4975 27 132 46 120 129 -54 -147 -77 127 148 -120 319 61 119 59 206 -184 -133 69 -131 69 -126 105 46 -113
4999 -113 -54 -2 408 -82 113 -212 35 -20 -90 9 122 5 -69 334 -203 171 -10 -150 398 -17 65 -289
5021 -289 -45 -32 19 27 71 206 -117 7 -179 234 -255 15 55 -81 -122 108 -305 -183 78 -113 -99 -339 -193
5044 -193 126 -164 126 75 -74 -244 203 85 132 -60 45 276 -45 59 -73 266 -64 -198 130 243 -93
5065 -93 243 -165 53 147 -51 251 -108 205 154 -43 127 -304 188 -172 155 257 55 -89 97 -53 -63
5086 -63 127 32 -160 249 -51 35 147 -115 -155 -6 -330 32 -83 87 -84 -61 36 60 -20 -161 -83 227 220 79
5110 79 113 -93 -92 -137 -20 -86 356 -63 39 -48 -166 6 142 -136 -222 417 93 -174 15 82 48 373 59
5133 59 136 -76 -57 -61 189 -184 178 -5 -298 -11 303 -2 -56 229 -23 -63 -7 -352 -341 131 -254 95 76
5156 76 -249 -29 -64 139 -86 -112 96 -228 165 183 -40 -128 307 58 80 -146 93 66 -117 -114 -25 52 50 62 -39
5181 -39 19 254 220 122 -272 -81 -164 57 -17 -57 -163 -120 226 -64 -298 142 68 -30 -114 -16 -89 17 104 -61 217
5206 217 -175 -120 155 -3 192 -33 25 -127 -132 -161 60 20 32 25 79 233 133 44 33 -142 -3 -47 -68 -39 -111
5231 -111 -142 -149 37 -142 -25 269 238 44 44 -238 475 18 -83 -290 -150 67 98 -203 -114 327 228 -202 90
5254 90 184 -73 206 -161 -2 338 192 102 124 -142 -174 210 -223 -92 58 151 -13 202 2 -166 297 -121
5276 -121 -31 156 -185 -55 103 39 115 -141 45 -230 -28 -68 -92 35 -143 -154 119 -353 -276 -31 195 233 21
5299 21 55 90 50 -215 81 8 83 -60 123 49 193 97 254 16 165 -12 94 -17 -277 1 -78 -51 -77 -33
5323 -33 -75 38 -27 -36 5 5 25 -22 -85 -114 65 -27 -48 -310 -52 -170 -68 231 45 129 -85 -129 -98 52 -76 50
5349 50 207 222 -177 16 129 231 8 -225 -93 138 38 0 -267 44 112 11 232 -147 -130 -202 122 59
5371 59 218 5 14 -4 -356 74 116 -162 -169 20 173 -38 28 117 332 94 80 138 -242 49 14 -30 8 -276 247
5396 247 -11 -210 -172 502 -147 225 174 -54 159 -93 -183 253 -58 165 129 27 -39 -136 -260 8 -125 120
5418 120 -43 -25 36 -247 239 119 3 119 -54 127 24 -124 -62 -103 -112 18 -151 -84 -39 -103 14 193 -32
5441 -32 45 262 6 -46 100 206 -63 -184 215 -28 -61 -25 -30 203 -107 252 240 71 -161 1 -209 -96 -182
5464 -182 -30 76 -34 10 -91 308 -80 145 183 193 -153 -102 237 187 -41 90 -143 -104 97 -41 193 107
5486 107 -102 -7 82 -186 128 112 29 61 112 -121 15 -40 -90 -287 228 -17 69 150 -165 -130 39 -189 192 302
5510 302 -313 100 11 -343 -41 105 90 -75 -55 -41 45 123 -14 52 -106 -73 136 310 -84 71 232 -238 119
5533 119 71 -29 121 31 -34 -64 11 -53 -347 214 -204 228 39 -202 39 -151 55 -19 63 -63 -176 -62 232
5556 232 127 152 -97 -67 -172 144 -36 -37 -89 -195 292 28 -107 -129 -191 59 29 14 11 -119 30 -127 -312 -59
5580 -59 -254 -105 42 99 112 -300 77 129 -41 61 168 -46 -134 36 140 -16 137 -153 -12 74 -53 -67
5602 -67 -62 26 240 63 287 23 54 -86 155 76 -111 28 48 51 -55 -109 -199 96 -191 -107 -66 155 -54 -91 -233
5627 -233 57 -47 -402 -12 77 -44 118 -1 -70 13 -5 -160 -47 -12 -144 -176 -263 85 45 -52 -24 259 -44
5650 -44 -138 22 156 -144 14 -64 -64 195 87 -184 43 209 -32 52 -197 -40 194 -8 -295 77 -80 -252
5672 -252 113 169 -102 -44 237 -180 138 101 -18 -18 177 -138 -117 132 -187 -79 -30 185 -24 64 -136 -106 -88
5695 -88 51 153 -100 -109 161 31 -42 -11 221 -145 207 8 -201 -23 135 -46 -173 -130 -143 12 122 15
5717 15 369 198 -48 109 -97 -21 240 164 -58 106 -88 -255 146 -107 -106 144 0 -34 -8 -83 -209 218 138
5740 138 13 166 25 98 -42 -110 -80 -87 52 97 125 207 3 -48 196 -150 -61 66 -17 -124 168 19 256 -196
5764 -196 302 161 -100 143 -110 -182 -145 13 65 108 34 -67 -71 -90 8 -88 43 -53 25 65 -51 -133 11 -306 15
5789 15 74 24 14 84 -177 -131 90 -127 142 70 -124 -227 428 -205 -4 1 -122 131 150 181 -138 106 19 6
5813 6 78 -7 80 -136 -106 -183 -36 57 -205 101 -43 153 16 -45 263 137 -66 46 -78 -48 27 126 103 11 -182
5838 -182 -76 227 -3 17 124 42 -214 -6 155 -112 -55 120 32 -109 355 -178 141 -81 141 -126 125
5859 125 95 108 -9 69 221 204 6 -177 -143 -107 -61 -86 -62 311 55 -350 208 129 133 -9 14 -112 -80 -135 24
5884 24 -223 -183 -43 -79 -115 -101 -62 95 -141 126 0 77 -252 -198 -95 -12 208 72 148 4 40 38 -119 36
5908 36 338 -86 -70 114 -25 -2 -110 226 -68 -91 -25 10 190 -46 103 168 17 -14 87 77 -143 -175 17
5931 17 -42 -78 177 52 -151 -321 103 307 -457 3 71 -199 27 26 -129 -7 142 -13 109 16 -169 22
5953 22 210 -107 295 58 -165 55 -134 85 41 -168 -250 206 -17 98 12 -70 184 63 -54 -46 -3 -112 -71
5976 -71 64 -90 151 -129 -114 -66 -18 46 26 -5 -52 -41 23 -26 70 -37 -55 -67 -231 -77 -51 66 53 -197 486
6001 486 91 164 17 -211 197 116 114 -74 -27 -185 -14 173 -66 31 -7 49 -119 -317 -59 -101 281 12 174
6024 174 -1 -270 148 -241 -57 82 262 -133 -143 75 -33 140 107 -420 70 -158 -45 301 -188 -107 -157
6045 -157 196 -121 -15 82 100 358 111 135 -39 302 -116 215 108 -10 -27 68 -95 -71 -87 -92 3 -162 -256 -18
6069 -18 278 -174 106 -62 -274 -135 -158 -134 -156 49 -33 -80 -94 -108 137 7 -26 179 -203 -149 239 35 135
6092 135 -407 108 -13 -175 133 -100 71 -77 16 31 -39 -37 157 118 174 72 -17 219 12 62 -8 -61 44 -29
6116 -29 28 223 20 -37 -283 41 -59 5 37 32 41 -6 80 -171 37 26 141 -421 135 -211 -184 -153 39 -13 -196
6141 -196 149 -139 -109 -101 22 121 -135 -154 223 -57 184 177 -49 54 36 -192 -117 186 182 32 -7 -31 131 -47
6165 -47 21 280 50 -159 16 -79 18 54 -406 91 -152 -12 -9 193 61 -155 255 -75 -201 95 -18 -270
6187 -270 206 -66 51 43 -89 56 -23 -371 27 7 -319 -114 108 160 13 146 -270 -96 40 -154 140 -156
6209 -156 83 42 -7 -83 -42 -56 -16 -190 -94 -131 -240 -236 -234 -28 58 -155 -153 -312 61 151 202 -55 -125 284 133 145
6235 145 -30 46 98 -38 -233 64 220 83 59 80 66 307 99 -16 92 44 97 -3 -21 -303 -44 -178 -187
6258 -187 -153 -42 7 -119 0 182 -83 -21 115 -52 -189 -212 -139 -30 -162 10 -14 -179 22 80 -263 -48
6280 -48 -33 57 60 -212 -167 215 18 -67 313 16 -61 65 -142 179 174 -97 -89 -186 7 32 3 -136 -32 260 -23
6305 -23 -468 -22 63 -329 221 155 -99 109 -6 -5 221 106 51 238 55 17 -53 106 -324 -193 38 -16 -76
6328 -76 176 96 114 -56 48 -272 96 20 265 -119 -253 150 156 -70 -1 -84 -167 76 -458 -183 -61 -63 -135 -8
6352 -8 -11 24 -122 16 -230 98 163 -22 -1 -1 143 -54 11 -135 101 -219 198 102 -374 -137 -167 -23 -167 193
6376 193 -204 100 -115 -5 -78 -189 -138 124 66 161 102 -181 115 -133 25 181 138 87 94 62 -165 -113 -119 16
6400 16 44 235 -270 -50 168 -80 125 92 90 42 86 99 -133 376 57 2 -284 352 -13 92 -20 -33 -101 -79
6424 -79 35 -64 -117 -31 236 -305 180 -103 77 212 -146 -269 16 218 -44 -251 107 -132 39 142 -147
6445 -147 190 -326 199 -237 113 186 83 -22 116 77 24 157 357 -65 124 -126 -168 -41 -108 93 14 53
6467 53 10 -132 95 293 -170 27 -212 -293 136 -155 -25 47 276 -246 55 -140 -253 178 130 -54 59 169
6489 169 38 55 -197 -106 266 -1 -211 71 145 32 16 -100 -99 235 -87 50 -13 -188 182 -227 130 -101
6511 -101 16 -299 -276 290 -54 -139 -27 297 11 -62 199 120 75 124 -76 167 147 -38 219 -109 177 77
6533 77 130 106 170 85 99 -58 -181 1 -57 -49 -39 17 -98 5 395 72 125 -110 168 -33 -16 -14 159 59 86
6558 86 -103 85 -80 -20 -136 -92 55 -84 -46 122 24 80 80 80 -74 -66 -134 -122 155 -13 46 -54 -55 -67 -89 121
6584 121 213 -24 -19 -72 229 87 -97 144 134 121 -106 118 -248 144 78 -205 -63 -145 -38 17 372 300 -107
6607 -107 -65 -145 295 -86 -58 281 -88 34 33 -46 -12 33 -136 -258 14 -37 -74 -9 30 -133 119 27 116 58 -352
6632 -352 45 112 270 -27 138 148 -121 22 -107 52 239 8 188 70 5 -89 45 -175 28 18 -247 75
6654 75 -128 -22 171 210 -184 -6 -143 -164 -133 163 30 -95 273 -205 78 209 38 95 -15 85 154 10
6676 10 -230 -93 94 22 88 -213 -316 -117 45 -176 70 120 34 225 -44 89 121 239 2 -255 237 47
6698 47 32 21 -149 -80 -24 46 124 -198 -208 -9 -2 -249 -87 9 -48 25 18 -364 -31 -26 -13 43 -82 -76 246 -13 -223
6725 -223 173 103 70 147 114 -361 250 -262 -343 41 23 -21 -97 -210 -24 -62 72 -115 -25 260 -67 1 78 -149
6749 -149 2 0 -71 175 0 87 177 173 -104 -123 -141 -115 -59 -22 37 115 -24 0 -77 -220 93 147 -23 48 -106 195
6775 195 128 42 -222 180 -30 -64 85 -102 -109 138 146 -123 -110 15 -294 -130 170 -104 67 53 -5 200 275 -49
6799 -49 -122 126 9 121 140 -286 -79 -51 60 -122 -94 -100 176 -113 103 43 -179 -282 -129 95 119 -3 13
6822 13 -3 -67 -83 -128 160 86 -51 181 85 37 -18 57 15 254 252 13 32 100 -12 -57 76 -183 193 -13 -52 37
6848 37 133 -102 166 5 -16 6 50 -82 -47 17 30 57 204 32 -150 232 -33 17 96 -37 87 -20 -2 166
6872 166 -132 106 -29 -51 -141 -227 -208 -37 107 -103 -202 94 -215 -169 269 27 90 16 -42 -24 61 116 -60 -100
6896 -100 -88 63 -190 5 82 178 69 -217 -316 14 -50 214 7 37 15 -5 44 -45 130 -67 55 2 -205 -97
6920 -97 54 -132 -83 160 128 -78 45 -36 246 -215 11 -103 105 84 32 -41 11 63 -35 242 -25 -188 -23
6943 -23 -228 -263 83 -204 -108 -163 -17 -560 -12 216 -360 -173 -249 -60 -237 195 -40 -266 91 -202 -8 -85
6965 -85 -91 -91 262 -408 63 48 53 264 -61 6 -214 -262 -63 -96 -117 -125 -164 77 136 -20 -297 372 20 18 177 167
6991 167 -66 7 138 -167 125 -150 -118 -66 497 -85 130 91 -275 -46 207 32 200 36 87 -214 -62 -78
7013 -78 100 -239 -37 11 -84 196 190 -216 71 172 -102 81 -175 26 -174 -171 -45 -89 99 -66 -212 -104 168
7036 168 -147 17 116 -105 -218 -46 -148 -29 75 27 106 -96 42 -39 -313 -181 88 209 -79 111 120 158
7058 158 -200 292 -315 286 115 133 162 -155 17 153 -47 -155 106 -106 298 76 35 239 -36 -56 -130 -146
7080 -146 4 -40 -221 108 119 161 -124 -87 54 196 285 -206 -190 71 -77 -32 -145 170 -79 -217 164 -84
7102 -84 -410 196 55 -90 -68 -171 16 -79 144 -174 -103 -240 -77 105 -337 -95 115 -323 -160 31 104 -112
7124 -112 50 -116 107 -87 19 -179 141 -305 -126 -150 -69 21 238 216 59 176 -119 271 7 96 77 -23
7146 -23 -297 125 19 105 -99 108 -131 244 -67 -79 150 147 -79 84 -60 128 76 -9 -100 -52 -67 -187 -139 -67
7170 -67 -205 -99 -201 32 124 160 103 45 -125 -55 -6 10 -69 -242 -110 -33 -186 62 39 161 19 119 482 -148
7194 -148 66 217 -285 -71 174 27 102 51 -157 -135 -356 -25 -154 29 -319 26 1 -348 25 41 -38 38
7216 38 107 186 89 82 -223 -20 120 -63 62 -136 -75 169 -105 267 145 93 -117 124 -116 -61 -88 14 39 66
7240 66 82 -484 86 79 -150 -257 44 8 200 180 -166 -30 -138 -272 21 -123 88 228 115 -169 30 -36
7262 -36 129 30 -153 152 -178 -22 -5 10 203 -74 -239 1 30 247 208 63 169 -97 -17 -15 186 -159 -39
7285 -39 -322 -108 58 -106 -230 -21 71 185 96 -40 40 81 -57 135 131 120 -265 -229 -277 -256 -72 87 -157 125
7309 125 139 -143 -68 -212 113 -134 -92 -59 -57 49 -235 -100 83 12 31 -100 -107 20 -236 92 -191 223 139 -84
7333 -84 9 -33 -144 -3 10 184 -16 -130 -64 -71 9 229 124 -94 111 -266 -236 53 -113 188 -25 -108 -48 133
7357 133 -94 -83 48 0 189 86 -69 -42 -90 361 152 -203 151 173 -69 -134 112 -59 10 115 35 46 161
7380 161 219 -56 -31 -285 -317 -4 -236 -190 245 48 -15 207 113 116 -57 -37 -169 331 -78 237 85 59 -145
7403 -145 -8 101 -201 161 -52 -30 24 169 148 199 -26 -21 -12 -16 -274 -85 -46 -241 -100 -118 -210 62 156 137 90
7428 90 -34 -55 7 -2 -176 -125 79 -147 40 214 -186 -96 19 -30 -140 97 -188 155 -244 245 -103 -39 195
7451 195 43 -22 -143 239 -31 -73 169 61 -35 73 -40 128 367 153 -47 -104 7 71 69 57 -115 -56 -74
7474 -74 -88 -76 5 62 -251 -27 147 52 156 80 -345 13 136 -44 11 92 -290 14 -212 -26 -80 137 22
7497 22 -97 189 53 -16 162 -75 -22 -329 97 -194 -165 19 -273 210 -74 150 25 -11 53 -3 -40 -18 109
7520 109 -57 -18 215 9 -115 -240 -98 -113 24 -154 -118 249 59 1 111 -74 -43 62 -189 56 -114 163
7542 163 -203 -218 -44 -101 -130 -225 -263 71 -106 -261 -15 84 51 -65 8 -55 46 38 -125 94 46 69 89 -130 20
7567 20 -153 -93 -98 -161 -67 -199 -39 77 -168 -118 99 118 -67 -373 14 -19 -83 -169 -11 173 -29 52 109 75 62
7592 62 -170 -68 -109 -217 -67 -10 -73 -29 122 -39 -50 -148 211 -93 33 84 -128 50 254 33 168 188 38
7615 38 -108 90 295 322 -112 134 12 139 241 -56 -3 64 97 34 158 -89 -225 257 85 -331 -29 -273
7637 -273 84 -205 -314 149 -153 -145 24 -48 -81 -83 438 268 -270 -11 -3 47 150 29 105 19 -254 -92 -124 52
7661 52 233 57 -258 166 -53 -270 58 50 -373 -97 -20 -105 232 -69 -54 -151 -57 55 -197 -27 14 -121 -195
7684 -195 -98 -36 -98 -191 -130 -270 -113 172 274 -296 122 -106 -28 76 -64 -243 -14 30 -117 38 129 53 32
7707 32 163 75 146 137 -278 -10 64 -19 88 93 166 -21 134 -133 -1 58 53 -254 107 43 64 0 162 212 -275 -155
7733 -155 254 -250 -85 194 19 369 -25 -106 -27 -145 96 -92 -78 254 67 385 -109 -32 -64 -81 -77 -291 -50
7756 -50 -92 172 89 -296 6 -61 -160 42 -146 -27 128 184 -196 51 -225 -131 -41 371 2 -105 24 -139 -201
7779 -201 151 149 199 141 92 99 23 116 -80 -32 -70 48 -191 32 -39 54 -34 115 -22 444 167 -32 73 -45 5
7804 5 -61 174 186 -29 124 -44 60 10 149 181 -231 -96 288 187 -161 131 187 -39 81 -8 15 -76 63
7827 63 141 169 198 -107 33 -110 -167 -65 -279 -28 111 -9 -266 93 -70 72 -58 -88 -59 71 55 183 -94
7850 -94 97 -13 174 48 -21 -12 -183 57 136 196 -140 46 -199 319 -5 -173 77 -47 119 -166 99 1
7872 1 -64 -109 -192 -89 60 39 -3 -98 -83 114 -59 191 -106 49 -96 -189 105 106 242 117 -2 3 447 -100 -169
7897 -169 -89 -134 -46 -154 219 13 -56 -25 -106 -52 -45 -64 -70 56 81 -23 126 -97 190 25 86 82 -61 -16 229 43
7923 43 161 -66 -194 79 -156 -209 -78 -26 422 -49 110 -108 -199 403 9 41 -107 50 125 -75 203 288
7945 288 182 -22 181 -164 85 -69 -245 120 67 264 127 59 2 143 -309 -130 269 71 -301 -111 219
7966 219 192 167 222 -43 -214 -16 -327 -54 189 -59 -87 -180 142 -60 -60 -248 -165 -175 34 -38 5 -193 296 -58
7990 -58 54 293 -133 122 188 78 -153 103 102 359 -244 -193 116 17 -6 -239 -206 -14 -121 -121 183 45 44 -178
8014 -178 259 -123 129 -33 55 -124 -108 -161 188 -95 -78 -85 -75 176 -34 -149 111 -153 296 318 48 -9 -151
8037 -151 29 -3 -34 -62 185 -146 -67 86 169 114 -210 117 78 128 213 45 70 32 142 184 4 -31 199 -55
8061 -55 81 2 -170 -86 -80 265 43 -58 -133 -108 -101 49 45 -35 308 -129 -162 52 -31 302 -186 60 -66 -399 -80
8086 -80 -185 130 21 -32 -293 -32 -56 -4 81 -73 -181 128 132 72 242 -155 28 -173 77 26 3 148 226 -84
8110 -84 -15 87 85 84 -41 79 -16 141 16 90 -143 58 395 100 -31 -100 184 -136 -47 -94 -109 -72 265 -62
8134 -62 42 190 170 -48 141 141 -28 153 -30 6 -174 -11 -177 -97 -82 -259 17 26 -25 71 50 -22 -33 107 136
8159 136 -173 55 -44 -3 -145 -80 -29 75 106 -43 -12 -224 6 184 -156 112 37 193 -156 -166 82 -80 50
8182 50 144 -3 147 182 119 319 117 165 -261
8191b61
##END NTUPLES=NMR FID
##END=
