##TITLE=1H_LR-758-R3-CR3
 CCl4
 8 sc, 
 7.6.2023
##JCAMPDX= 6.0         $$ Bruker NMR JCAMP-DX V2.0
##DATA TYPE= NMR FID
##DATA CLASS= NTUPLES
##ORIGIN= UXNMR, Bruker Analytische Messtechnik GmbH
##OWNER= root
$$ XWIN-NMR		Version 3.5
$$ Wed Jun  7 14:36:16 2023 Russian Standard Time (UT+4h)  she@DPX200
##.OBSERVE FREQUENCY= 200.13135
##.OBSERVE NUCLEUS= ^1H
##.DELAY= (6, 6)
##.ACQUISITION MODE= SIMULTANEOUS
##.ACQUISITION SCHEME= undefined
##.AVERAGES= 8
##.DIGITISER RES= 18
##SPECTROMETER/DATA SYSTEM= spect
##.PULSE SEQUENCE= zg30
##.SOLVENT NAME= CDCl3
##.SHIFT REFERENCE= (INTERNAL, CDCl3, 0, 15.7039)
##AUDIT TRAIL= $$ (NUMBER, WHEN, WHO, WHERE, WHAT)
$$ ##TITLE= Audit trail, XWIN-NMR		Version 3.5
$$ ##JCAMPDX= 5.01
$$ ##ORIGIN= Bruker BioSpin GmbH
$$ ##OWNER= she
$$ F:/spectra/data/she/nmr/H-F/1/audita.txt
$$ ##AUDIT TRAIL=  $$ (NUMBER, WHEN, WHO, WHERE, WHAT)
(   1,<2023-06-07 14:34:59.26 +0400>,<she>,<DPX200>,
      <created by zg, POWCHK disabled, PULCHK disabled
       configuration hash MD5:
       00 E9 B6 7A A2 85 ED C7 34 08 36 98 17 FE 4E 26
       data hash MD5: 16K
       18 FE 47 0B 9F 2C DA 02 E4 0B 6D 1B 58 43 28 3B>)
$$ ##END=
$$ 
$$ hash MD5
$$ C1 6F 5A CA 2D CD 10 B8 8C A2 22 48 D0 72 48 2E
##$RELAX= 
##$RELAX= 
##$RELAX= 
##$RELAX= 
##$RELAX= 
##$RELAX= 
$$ Bruker specific parameters
$$ --------------------------
##$DU= <F:/spectra>
##$EXPNO= 1
##$NAME= <H-F>
##$PROCNO= 1
##$TYPE= <nmr>
##$USER= <she>
##$AMP= (0..31)
100 100 100 100 100 100 100 100 100 100 100 100 100 100 100 100 100 100 
100 100 100 100 100 100 100 100 100 100 100 100 100 100 
##$AQSEQ= 0
##$AQ_mod= 1
##$AUNM= <au_zg>
##$AUTOPOS= <>
##$BF1= 200.13
##$BF2= 200.13
##$BF3= 200.13
##$BF4= 200.13
##$BF5= 200.13
##$BF6= 200.13
##$BF7= 200.13
##$BF8= 200.13
##$BYTORDA= 1
##$CFDGTYP= 0
##$CFRGTYP= 5
##$CHEMSTR= <none>
##$CNST= (0..31)
1 1 145 1 1 1 1 1 1 1 1 1 1 1 1 1 1 1 1 1 1 1 1 1 1 1 1 1 1 1 1 1 
##$CPDPRG= <>
##$CPDPRG1= <>
##$CPDPRG2= <>
##$CPDPRG3= <>
##$CPDPRG4= <mlev>
##$CPDPRG5= <mlev>
##$CPDPRG6= <mlev>
##$CPDPRG7= <mlev>
##$CPDPRG8= <mlev>
##$CPDPRGB= <>
##$CPDPRGT= <>
##$D= (0..31)
0 1.2 0 0 0 0 0 0 0 0.06 0 0.03 0 0 0 0 0.0002 0 0 0 0 0 0 0 0 0 0 0 0 
0 0 0 
##$DATE= 1686134099
##$DBL= (0..7)
120 120 120 120 120 120 120 120 
##$DBP= (0..7)
150 150 150 150 150 150 150 150 
##$DBP07= 0
##$DBPNAM0= <>
##$DBPNAM1= <>
##$DBPNAM2= <>
##$DBPNAM3= <>
##$DBPNAM4= <>
##$DBPNAM5= <>
##$DBPNAM6= <>
##$DBPNAM7= <>
##$DBPOAL= (0..7)
0.5 0.5 0.5 0.5 0.5 0.5 0.5 0.5 
##$DBPOFFS= (0..7)
0 0 0 0 0 0 0 0 
##$DE= 6
##$DECBNUC= <off>
##$DECIM= 32
##$DECNUC= <off>
##$DECSTAT= 4
##$DIGMOD= 1
##$DIGTYP= 9
##$DL= (0..7)
0 120 120 120 120 120 120 120 
##$DP= (0..7)
150 150 150 150 150 150 150 150 
##$DP07= 0
##$DPNAME0= <>
##$DPNAME1= <>
##$DPNAME2= <>
##$DPNAME3= <>
##$DPNAME4= <>
##$DPNAME5= <>
##$DPNAME6= <>
##$DPNAME7= <>
##$DPOAL= (0..7)
0.5 0.5 0.5 0.5 0.5 0.5 0.5 0.5 
##$DPOFFS= (0..7)
0 0 0 0 0 0 0 0 
##$DQDMODE= 0
##$DR= 18
##$DS= 0
##$DSLIST= <SSSSSSSSSSSSSSS>
$$ [...]
##$SUBNAM2= <"">
##$SUBNAM3= <"">
##$SUBNAM4= <"">
##$SUBNAM5= <"">
##$SUBNAM6= <"">
##$SUBNAM7= <"">
##$SUBNAM8= <"">
##$SUBNAM9= <"">
##$SW= 18.05172834244
##$SWIBOX= (0..15)
0 0 2 0 0 0 0 0 0 0 0 0 0 0 0 0 
##$SW_h= 3612.71676300578
##$TD= 16384
##$TD0= 1
##$TE= 0
##$TE2= 300
##$TE3= 300
##$TEG= 300
##$TL= (0..7)
0 120 120 120 120 120 120 120 
##$TP= (0..7)
150 150 150 150 150 150 150 150 
##$TP07= 0
##$TPNAME0= <>
##$TPNAME1= <>
##$TPNAME2= <>
##$TPNAME3= <>
##$TPNAME4= <>
##$TPNAME5= <>
##$TPNAME6= <>
##$TPNAME7= <>
##$TPOAL= (0..7)
0.5 0.5 0.5 0.5 0.5 0.5 0.5 0.5 
##$TPOFFS= (0..7)
0 0 0 0 0 0 0 0 
##$TUNHIN= 0
##$TUNHOUT= 0
##$TUNXOUT= 0
##$USERA1= <user>
##$USERA2= <user>
##$USERA3= <user>
##$USERA4= <user>
##$USERA5= <user>
##$V9= 5
##$VALIST= <valist>
##$VCLIST= <CCCCCCCCCCCCCCC>
##$VD= 0
##$VDLIST= <DDDDDDDDDDDDDDD>
##$VPLIST= <PPPPPPPPPPPPPPP>
##$VTLIST= <TTTTTTTTTTTTTTT>
##$WBST= 1024
##$WBSW= 4
##$XGAIN= (0..3)
0 0 0 0 
##$XL= 0
##$YL= 0
##$YMAX_a= 632867
##$YMIN_a= -692545
##$ZGOPTNS= <>
##$ZL1= 120
##$ZL2= 120
##$ZL3= 120
##$ZL4= 120
##$ABSF1= 10
##$ABSF2= 0
##$ABSG= 5
##$ABSL= 3
##$ALPHA= 0
##$AQORDER= 0
##$ASSFAC= 0
##$ASSFACI= 0
##$ASSFACX= 0
##$ASSWID= 0
##$AUNMP= <proc_1d>
##$AZFE= 0.1
##$AZFW= 0.1
##$BCFW= 1
##$BC_mod= 2
##$BYTORDP= 1
##$COROFFS= 0
##$CY= 11.3945322036743
##$DATMOD= 1
##$DC= 2
##$DFILT= <>
##$DTYPP= 0
##$F1P= 15.7292609196834
##$F2P= 12.9074282941183
##$FCOR= 0.5
##$FTSIZE= 0
##$FT_mod= 4
##$GAMMA= 1
##$GB= 0.15
##$INTBC= 1
##$INTSCL= 1
##$ISEN= 128
##$LB= 0.24
##$LEV0= 0
##$LPBIN= 0
##$MAXI= 10000
##$MC2= 0
##$MEAN= 0
##$ME_mod= 0
##$MI= 1.114404
##$NCOEF= 0
##$NC_proc= 0
##$NLEV= 6
##$NOISF1= 3.799351
##$NOISF2= 2.8
##$NSP= 1
##$NTH_PI= 0
##$NZP= 0
##$OFFSET= 15.70392
##$PC= 1
##$PHC0= -19908.07
##$PHC1= 15.45272
##$PH_mod= 1
##$PKNL= yes
##$PPARMOD= 0
##$PSCAL= 0
##$PSIGN= 0
##$REVERSE= no
##$SF= 200.130013532006
##$SI= 16384
##$SIGF1= 3
##$SIGF2= 2
##$SINO= 400
##$SIOLD= 16384
##$SREGLST= <1H.CDCl3>
##$SSB= 0
##$STSI= 0
##$STSR= 0
##$SW_p= 3612.71676300578
##$SYMM= 0
##$S_DEV= 0
##$TDeff= 0
##$TDoff= 0
##$TI= <>
##$TILT= no
##$TM1= 0
##$TM2= 0
##$TOPLEV= 0
##$USERP1= <user>
##$USERP2= <user>
##$USERP3= <user>
##$USERP4= <user>
##$USERP5= <user>
##$WDW= 1
##$XDIM= 8192
##$YMAX_p= 0
##$YMIN_p= 0
$$ End of Bruker specific parameters
$$ ---------------------------------
##NTUPLES= NMR FID
##VAR_NAME=  TIME,          FID/REAL,        FID/IMAG
##SYMBOL=    X,             R,               I
##VAR_TYPE=  INDEPENDENT,   DEPENDENT,       DEPENDENT
##VAR_FORM=  AFFN,          ASDF,            ASDF
##VAR_DIM=   8192,          8192,            8192
##UNITS=     SECONDS,       ARBITRARY UNITS, ARBITRARY UNITS
##FACTOR=    0.0002768,     1,               1
##FIRST=     0,             0,               0
##LAST=      2.2672688,     0,               0
##MIN=       0,             -692545,         0
##MAX=       2.2672688,     632867,          0
$$ Real data points
##PAGE= N=1
##DATA TABLE= (X++(R..R)), XYDATA
$$ [...]
2047F16L80k509L223j307k920L895n58k016L173k044k059L626o97j695K466k393
2063h19r15L570j110j626J896j923j06L219j871j588K319j800N9K878k028j835
2079a680K378j282J20L039l262j031L129j744j00K883l820l16L641k737P46K115
2095B079l943R88K870l104J186J660l778K231J619l276J908Q19l386K615J357
2110A845k894J563K50k696K705N81k634J686M4k401K635P83l136J900N55k548
2126a762K792M17l389K486M72k678L297m80l220K968j47k630L700j350k700L568
2142A344r54j755K837k100r36L211j587j098K453k284n5K579j985n70J793j384
2158d91m89K611j671j093K233j732l63K307j738p87K550k166p3K745k879L08K415
$$ plain form
2047 616 996 -1513 1710 403 -2517 1378 820 -1196 1977 -67 -2126 1500 803 -892 1574 -819
2063 -819 -1734 1836 726 -900 996 -927 -1033 2186 315 -1273 1046 -754 -695 2183 155 -1680
2079 -1680 698 -584 -464 2575 -687 -1718 1411 -333 -433 2450 -1370 -1686 1955 -782 -36 2079
2095 2079 -1864 -876 1994 -1110 76 1736 -2042 189 1808 -1468 440 1259 -2127 488 1845
2110 1845 -1049 514 764 -1932 773 1354 -1280 406 450 -1951 684 1467 -1669 231 786 -1762
2126 -1762 1030 1447 -1942 544 1016 -1662 1635 1155 -2065 903 756 -1874 1826 476 -2224 1344
2142 1344 390 -1365 1472 -628 -1564 1647 60 -1038 1415 -869 -924 1655 -330 -900 893 -491
2158 -491 -980 1631 -40 -1133 1100 -632 -995 1312 -426 -1213 1337 -829 -902 1843 -1036 -728 1687
2175A687k757Q31K178l364J126J620l047K105J190l393K055Q14k512K408N6k729
2191a732J952O14j900J746k78k128K222M56j607Q18L94j621J109J047j894J060
2207B58L51j872J694M01k040J773J30k079K117j76k153K909j081j850L231j615
2223bj395K844j952o39K687k283k35K456k119J88J653j858L53J004j247M14O52
2240E21r13L62J64j95j01K50n10lP52l12n52J009r82j31J827j571o70K116j956
2259h95N74J806k376N94J680k554J203J380l029J839O43k077J914l23j450K110
2275A039q67j020J569j455L10J227j256J40Q35r76P53j89m48L75m58M95l61l6
2293c23O83o60K10N11j070P88N39j391J137K59j656J439K06j531J183k75p12J675
$$ plain form
2175 1687 -1070 -239 1939 -1425 -299 1321 -1726 379 1569 -1824 231 1045 -1467 941 997 -1732
2191 -1732 220 834 -1066 680 402 -1726 496 952 -655 163 557 -1064 45 1092 -802 258
2207 258 609 -1263 431 832 -1208 565 695 -1384 733 557 -1596 1313 232 -1618 1613 -2
2223 -2 -1397 1447 -505 -1144 1543 -740 -975 1481 -638 -450 1203 -655 -302 702 -545 -131 521
2240 521 -392 -30 134 -61 -162 88 -422 -425 327 15 -537 472 -510 -641 1186 -385 -1055 1061 -895
2259 -895 -321 1485 -891 -297 1383 -1171 32 1412 -1617 222 865 -1212 702 379 -1071 1039
2275 1039 172 -848 721 -734 -424 803 -453 -313 522 -454 299 110 -338 37 -421 74 -287 -323
2293 -323 360 -300 -90 421 -649 139 678 -713 424 683 -973 466 672 -859 324 49 -663 1012
2311A012j366j67J211j324N78P58j720J525J22j413J515l74j465J649m21q64J364
2328F20j000L10M97q90O42j22k48M24o08L37K21n73M77J1n69R94j80n92Q24j069
2348d94l6J456j247L53M09j191J313j11j309J711p95r78J869q08o32J271j095
2365c14r0J021j028nP34p14N59J43k81p3K38l95N93p17P48j55j99M51m97j87L87
2386B19k75J20K30p16R04l12p76R71o39j08J125j137K7R90j112L98O76j298N18
2405a95O73r04O40j7r92Q74N46q66M94m29k42Q70j81m61M22j77l24O00l3n45N05
2426B58k09p1M40J03o94J85J27m25P99l3j281J007K34r88J287n84q61J197o16
2445a25k89R87r23j47J072o42J45P29j075n8P42q03P22K68r81j3R82p72O6L74
$$ plain form
2311 1012 -354 -521 690 -634 -56 702 -1018 507 629 -784 731 357 -1108 541 120 -744 620
2328 620 -380 -70 427 -463 179 57 -191 233 -375 -38 183 -390 87 98 -471 523 343 -249 575 -494
2348 -494 -530 926 -321 32 441 -750 563 452 -857 854 59 -919 950 142 -490 781 -314
2365 -314 -404 617 -411 -416 318 -396 163 306 25 -48 190 -205 388 -329 419 264 65 516 19 -168 219
2386 219 -56 64 294 -422 482 170 -606 365 -274 -382 743 -394 -367 623 -489 -91 585 -713 -195
2405 -195 478 -426 214 197 -795 79 625 -241 253 -176 -418 452 271 -190 232 55 -269 331 298 -247 258
2426 258 49 -22 418 521 -173 12 139 -286 513 480 -801 206 440 -548 739 155 -706 491 -125
2445 -125 -414 573 -350 -497 575 -67 78 807 -268 -326 416 -387 335 603 -378 -391 591 -181 -115 259
2465B59o03J91P39m89o05Q74q04M18Q08j125k06Q67q32L78J172j647M31L49p86
2484f11Q02K80j402Q49O35j215J280j87j450J380l14m40J018n72j089J496k17
2501B43m39O47m63r42J264n6n87O30n51o29J252mr88O96j71l97J367m88j162J369
2521E91q95l66J804r33j026J270n33k03J326j229q86J557n11j3R77j720K73J318
2539H01j208M32O12j588M58J148o89k35O33j273M71J224r19M1Q8p37R04P79j104
2558a62k4M84j027P83N52j190Q1P83o35O48N41j639Q45M15j143J114K34j584J105
2577A81J40q41J039m01j360J606R2j130J214n08j181J821j21j039J189j106l25
2594g30J588n42r02P04j50m03J360n57q67P40m63J12O95m51q16R70j91k69R21
$$ plain form
2465 259 -344 -153 586 97 -508 366 -438 -20 788 -337 -543 324 -508 -130 1042 -605 -174 175 -611
2484 -611 191 471 -931 -82 553 -662 618 431 -1019 361 47 -393 625 53 -1036 460 243
2501 243 -196 451 -12 -954 310 254 -333 297 -254 -883 369 365 -623 73 -98 -495 872 384 -778 591
2521 591 -304 -670 1134 201 -825 445 -88 -291 1035 -194 -1080 477 -34 -47 930 -790 -517 801
2539 801 -407 25 637 -951 -493 655 -34 -269 364 -909 -438 786 -133 -92 -4 -741 163 942 -162
2558 -162 -186 298 -729 54 606 -584 -503 280 -355 293 834 -805 40 455 -688 426 660 -924 181
2577 181 321 -520 519 118 -1242 364 456 -674 540 32 -1149 672 551 -488 701 -405 -730
2594 -730 858 316 -586 118 -32 -435 925 368 -499 241 -222 -110 585 134 -682 288 97 -172 749
2613G49p19p84J403m39j25N03q84n06J355m51k10O07p39k95J356q55k12O43q73
2632d76L33R55r79j34O98q55M32P67j113J05J015j239Q47K30j012K25N30p26P79
2651C82J92j223M67O59n93K49M07j128L46J078j103L48K4r35J200K28r70L79M05
2670D12q92P93J14r26N56K42q21J332p03r76J515o22o21J510q12n06J161p95k68
2689c07R69q20m86J117k58n30Q67m73o18R27j03m39N56o64l44R87o56Q1P74l87
2709A93j86N02o92j28Q83q99K64P52j356M53P46j357J112K52j127N29L49p58Q82
2728D14P1j040N13N29m88L83Pn19l0M33m26L34%l14K85l1k29K4L59p91O40M49
2750E73j153Q03Lq28R10q8o51Q26l10n39J076o04n82R65n84n2P01n14k02R77r71
$$ plain form
2613 749 30 -754 649 210 85 588 -296 -802 553 102 -108 499 -240 -535 821 -34 -246 397 -476
2632 -476 -143 812 -167 -301 397 -458 -26 741 -372 -267 748 -491 356 586 -426 -201 329 -397 382
2651 382 574 -649 -182 477 -116 133 540 -588 -242 836 -267 81 105 -830 370 598 -372 7 412
2670 412 -480 313 427 -499 57 299 -522 810 107 -869 646 24 -597 913 101 -405 756 -39 -307
2689 -307 662 -158 -644 473 215 -315 552 79 -539 388 285 -154 402 -262 -606 381 -275 -194 580 193
2709 193 7 509 -183 -311 572 -327 -63 689 -667 -214 532 -825 287 539 -588 -59 290 -468 414
2728 414 485 -555 -42 487 -1 382 389 -130 -160 273 -153 181 181 -133 152 121 -108 -84 275 -516 124 573
2750 573 -580 223 226 -602 308 220 -431 395 85 -454 622 18 -564 401 -183 -235 466 -48 -250 727 -244
2771b44J33L16p46N27M9j10O6J93l04K70k95o5K43J71m1m39M18o1j05k5o6j65
2793b80O07l49k17R27q84L4P36j059M72L88p24L16M95p44N09k19m39P80l25l95
2813c71P35m70j21O70n44j10P18n66k18L17l49O68m07q5K42k22L04l08l14N29
2833I8k93J89M18n86J84l2m05N30r6k63M65k81k51P54n24j93P60q76J07O38q42
2854d99L89M12j013P25L30n46L81M8n15N76k48k3M18o21K34K93m14j0L6m3K06
2875A16j47K64l91K7L65j20o5N26p64L4M58m64K53J94p67N66K08p45P95k09l45
2896b11N01j94m03O98n48K6N31l81k59N89o22L60on4K8K56n38J44N7J80r4k5K6
2919F1m5K14j2m94K42K1o6L33r7n71O73k22m50Q26o08j16N71m95M9N75o58L03
$$ plain form
2771 -244 -111 205 -541 -14 35 -75 -9 184 -120 150 -145 -210 33 204 163 -276 142 81 -24 -49 -115 -280
2793 -280 327 -22 -239 688 -196 -162 574 -485 -13 375 -349 -33 462 -282 227 8 -431 349 24 -371
2813 -371 364 -106 -227 443 -101 -211 507 -59 -277 40 -309 359 -48 -133 109 -113 191 -117 -431 98
2833 98 -195 -6 412 -174 10 -22 -427 103 7 -256 209 -72 -323 431 -93 -286 474 -402 -295 343 -499
2854 -499 -110 302 -711 14 344 -202 179 227 -288 288 40 17 435 -186 48 341 -73 -83 -47 -90 116
2875 116 -31 233 -158 -131 234 114 49 575 -189 -155 303 -161 92 286 -481 85 293 -452 343 134 -211
2896 -211 290 96 -307 391 -157 -131 400 19 -240 349 -273 87 81 27 55 311 -227 -83 -26 154 60 35 61
2919 61 16 230 218 -276 -34 -13 -79 254 157 -414 259 37 -413 413 -195 -311 260 -235 -186 389 -269 34
2941C4M66j057O23J96p78P23K13o56N66k5m76L12M5j5l30Q7J5J4M12l79j42K35
2963H3l37L72K01q06N82k6n59P13j86l67L42K06l84M97k44o37R51m46l07Q12p21
2984b61l82P99m60L46N85r53K13L66l63q9M96p88L94O54n97pJ66m07K91M28n97
3005a66K29K24o83O29J44m81k51M68r9j69N57p37K45N40p17M95K38j014L31R46
3025G29r77L32O0p97N86O11o71K06Rm24N21L2m16N03l25l18P01j12o66O97l21
3046d0k53O03jm63J32j62P3L24k25m88N97j85NL38k87l9J34j64k62Q69o66j27
3068b87O88l49l05O66q22N37L39p18J41K91n40K87M56o94K09K93p26N20M03p57
3088c68K20K54l95M93j49j1N2J46n92K15N23q40N56j78L8J15J56n65K84J02k35
$$ plain form
2941 34 500 -557 66 262 -516 207 420 -236 330 305 -171 141 186 171 -159 -72 -57 -43 369 -10 -152 83
2963 83 -254 118 319 -487 95 69 -490 223 37 -330 12 218 -166 331 87 -550 401 -45 -352 460 -261
2984 -261 -643 156 -304 42 627 -326 -113 253 -110 -199 297 -491 -97 557 -40 -47 119 -288 3 431 -166
3005 -166 63 287 -396 233 377 -104 -355 113 14 -155 402 -335 -90 450 -267 228 466 -548 -217 729
3025 729 -248 84 144 -653 -67 544 -127 79 88 -336 185 217 -199 304 -21 -339 362 250 -416 281 -40
3046 -40 -293 310 309 -154 -22 -184 -111 213 -12 -500 97 -88 -83 255 -32 -71 63 -101 -363 506 -160 -287
3068 -287 401 52 -253 413 -409 128 467 -251 -110 181 -359 -72 384 -310 -101 192 -534 -14 389 -368
3088 -368 -148 106 -289 204 55 44 96 242 -350 -135 388 -452 104 -74 -36 79 235 -330 -46 56 -179
3109a79K04j03m29O08O0j14q7j06j40L77K05m86Q8K27m46Q74k68m14j7K82m26
3130b90O04L3q58K96P8J1M19l55k43M16p3j72M78l73k15L21j35M5J93l26J8K42
3152A14l5L6%j73J20K64l34k89K57m8M1K56j31k35J50p5j2K69j32k70K36k15L93
3175A87R5n43R1J54K9J87J38n41J97K94l19L2j03k92M63R7l08Q7N2J97j06K10
3197B98k56Q7j78n3K02J26j03l06L25j80K68Om81J03J60l62M30R4n28M02N6l81
3219b71O79l11k35L21l62P1K24k40j53K84J95l95J43j85K48J49J1l7l35K50j60
3240a09K20j65MK42l34M2K62j40j30K56k32N6K61J2j80j1p5l46M74l06K10K0k21
3263a90L06jm06N69l21j7K65k39o0L6K69OJ90m12m8p2K17K4jN6m46N75k66J3J74
$$ plain form
3109 -179 25 -78 -507 101 161 47 -40 -146 -286 91 296 -190 -102 125 -321 553 285 -129 -146 136 -290
3130 -290 314 347 -511 -215 -137 -126 293 -62 -305 111 38 -134 344 -29 -244 77 -58 -13 180 -146 -128 114
3152 114 79 115 115 -58 62 326 -8 -297 -40 -88 -47 209 78 -157 -7 -82 -94 175 43 -227 9 -206 187
3175 187 282 -261 -170 -16 13 200 338 -203 -6 288 -31 1 -102 -394 69 166 -142 -55 -3 194 88 298
3197 298 42 129 -49 -102 100 226 123 -183 142 -38 230 236 -245 -142 18 -344 86 180 -348 54 110 -271
3219 -271 408 97 -138 183 -179 -108 116 -124 -277 7 202 -193 -50 -235 13 162 173 136 -199 51 -109
3240 -109 111 -54 -50 192 -142 -100 162 22 -108 148 -84 -28 233 245 65 54 -21 -367 107 -199 11 31 -190
3263 -190 116 115 -291 278 -43 -60 205 -34 -94 -58 211 217 407 -5 -53 -125 92 116 115 171 -275 300 34 47 221
3288B21j62j34K16K02k31K62k45m22L42lk27J15R6P9j69Q2J77M1r9l61N14m26
3310a32j4m4K96K2P5m27J29K45k10J47j21J02j56J98k22Q6J62m1l58M72n3j51
3332EM40n65K71J8m31J74K82n56M46q1J43k09Q0k2J52k96k89N92k28Q1j56n3q4
3355b86N9J81k4O5j77K79l1j65j40K37j87M8K82k18K15K4j44j89n1K78k6J30q8
3378G2j96L40M8l05J15k19J35J30l51K35J95m11j7K58l57K27K18k51K04K43o02
3399b89J58K34j68n2k02L80j9r4R0o1J08n1K20j90l95L28O1p6k03M87l60j50O79
3422D35p80j8L53j83J00J10p5N34l26k62K79j88j65L23r8j71M83m00l52L97l27
3443c31J73L52o3J06k73k96K72J67j98O5N0j52K3j75K70k17J91O0k52L22l19P
$$ plain form
3288 221 59 -75 141 343 112 374 129 -293 49 46 -181 -66 30 109 -60 22 199 240 141 -220 294 -132
3310 -132 -146 -190 106 128 203 -224 -95 150 -60 87 -34 68 -88 110 -112 -26 136 95 -263 209 156 5
3332 5 445 -120 151 169 -262 -88 194 -362 84 3 146 -63 17 -5 147 -149 -438 154 -74 7 -149 -202 -286
3355 -286 -227 -46 -70 -5 -182 97 66 -99 -239 -2 -189 -141 141 -77 138 162 18 -171 -222 56 30 160 72
3378 72 -124 216 264 -41 74 -145 -10 120 -231 4 199 -212 -229 29 -328 -101 117 -134 70 313 -289
3399 -289 -131 103 -65 -117 -319 61 42 -52 38 -23 85 34 254 64 -331 -3 58 -18 -221 266 -94 -244 435
3422 435 -345 -363 -10 -193 -93 17 -58 476 150 -112 167 -21 -186 137 39 -132 351 -49 -401 -4 -331
3443 -331 -158 194 131 237 -36 -332 -60 107 -91 -26 24 -128 -105 -280 -10 -227 -36 24 -228 94 -225 -218
3465b18K57J01k07N45o32o1M64k28l37M63j06l76N86k89K37R5n25L16K16q08N38
3486C1p2r1K19k05K35j2j06r9K34Kk02J63l51J53L29Ll96J99K44l61J80K16n59
3509b46K74L79n13K11m3q4L00l00j84N00l11j04J72k63k52N89k12l8M57n77J91
3530e4J39l37Q7O56n35RJ51j7r7J37j59P9R4l63L64p8j33j95M08l43O5K57j26
3553Il2L36m05J48M40p00k48N65j41K31k96j87L02L12m36K18l7k59J44K03j28
3574C9J12o6m74N53O2n26N46k48j37M86j54l83K72l12K10K15m08l2M89m05J31
3595c0L01j77l54M30j03jQn3k27N79Ko00J94j80J78K28N7m27L87j48J24K11p42
3618c43K70K0k79K03O14o29m6K49N3P5k01l14K9M08l96nM64l01K51j18l7P0K17
$$ plain form
3465 -218 39 140 -67 478 -154 -215 249 21 -316 147 41 -335 251 -38 199 294 -231 85 301 -507 31
3486 31 -41 -132 87 -118 117 105 -1 -100 134 136 -66 97 -254 -101 228 231 -165 34 278 -83 97 313 -246
3509 -246 28 407 -106 105 62 -22 278 -22 -206 294 -17 -121 51 -212 -464 125 -87 -125 332 -245 -54
3530 -54 85 -252 -165 491 -44 -35 116 99 2 139 -20 59 153 -210 154 76 -57 -252 156 -187 -122 135 9
3553 9 -23 313 -92 56 496 -204 -452 113 -28 203 -93 -280 22 334 -102 116 79 -180 -36 167 39
3574 39 151 85 -389 164 226 -300 246 -2 -139 347 193 -190 82 -230 -20 195 -213 -245 244 -161 -30
3595 -30 271 94 -260 170 67 66 74 21 -206 373 375 -225 -31 -211 -33 195 252 -175 212 64 188 399 -343
3618 -343 -73 -53 -332 -129 485 -144 -190 59 112 187 -14 -328 -299 109 -287 -292 172 -129 122 4 -33 37 254
3641B54m04K51kk43K80j49j83L61m9J3j52J11k95M93k82k23M70n58J81L15k59
3662g0L2o1m8j01L66m04P2K64j94K43m4J9n26L49J27J05j83J53l23K56j69K36
3684I9k15j07K64p4K85j91j09K68l51K17l6P3J2j5p4j44j30J4L44p4p8j6K8K8
3708A8l6k6J66k63l3j99L21k29J58L32j88oJ6O3J54j41m04K68p1K81k26l0M24
3731C49k81j1j65J38m7k42M16j60k2j59J66k12L47J14m38K69K05m15L38Kk31n7
3753i6L44j19k44Q0m8K61k03J26j65m7j15J66J23j29K23j21k03K68r7J61l4N6
3775A87k00K60n43K98j8j28L5rM6M0j83J17O2J31M8j3o4J26j87l7k8k62L74k20
3799a68K60m7l53K0K65m6K01l6k75K11l28M93k31k2J84j72M6m7n1J83j94J08j3
$$ plain form
3641 254 -150 101 99 -144 136 -13 -196 165 116 129 -23 88 -207 286 4 -219 251 -307 -126 189 -70
3662 -70 -38 -99 -147 -248 118 -286 -214 50 -144 99 55 74 -452 -103 24 129 -54 99 -224 32 -137 99
3684 99 -116 -223 41 -33 252 61 -48 220 -131 86 50 123 135 120 46 -98 -228 -214 130 56 -22 -38 -10 18
3708 18 -18 -44 122 -141 -174 -373 -52 -281 -123 209 21 15 31 94 248 107 -297 -29 -100 181 -45 -75 349
3731 349 68 57 -108 30 -17 -259 157 -3 -25 -184 -18 -230 117 231 -207 62 267 -148 190 192 -39 -96
3753 -96 248 129 -115 -35 -83 178 -25 101 -64 -111 -226 -60 63 -66 157 36 -167 101 4 165 131 187
3775 187 -13 247 -296 2 -16 -144 -109 -118 -72 -32 -215 -98 -36 95 143 130 66 192 5 -32 -60 -322 52 -168
3799 -168 92 45 -308 -288 -23 -69 132 96 -179 32 -296 197 -34 -56 128 -44 2 -45 -96 87 -107 1 -12
3822a2J8M2j11K1o6J48l30K24K09o1l27P4L29k97K4R2L17j04k10Q2R0j43K34k23
3846B0j81K16L7q8J38m2Q1k04k50J25R2J80j73q4J11r7P7J13J8p6J62m35N03l14
3870g1J55J15k56J35Rq3j7J05k27KL13k41L93j74l36K80j59L69o7o06L14Kk9J9
3894e5N5O4k33K17P4l1k01L9j0P0j04J54Q3j80q9J44n1n1jN2j10J31Mr0J98n0
3920B9j34K84k5j09o3j03L8J47P1p6j84J78K1J20j25j55J55j92k8K02k20N7m9
3943a61LN6J08j96M90j65Q0m56M12j42o0R5k3J9p8K36m62K37j41L61J18m45K19
3966A05P1o30K61L49k36J18q1j41N07j36l0k24L2k24L93j79J45q0k85J24K34R8
3988A91k1k03Q4N0j16j24L18k58J62j34N0kJ6K1j03J97m4M3j20J3l4k82M85j57
$$ plain form
3822 -12 6 48 -63 -42 -108 40 -290 -66 143 82 -245 -171 158 -139 -115 -23 294 190 -20 62 152 9 243 20
3846 20 -161 55 92 4 142 100 181 -23 -273 -148 -56 124 -49 -133 -22 -119 -42 71 89 13 175 -260 243 -71
3870 -71 84 199 -57 78 87 4 -13 92 -135 -133 180 -61 332 158 -178 102 -57 312 245 -361 -47 -45 -74 -55
3894 -55 0 64 -169 48 122 91 -110 -71 -81 -11 -115 39 122 -58 -147 -3 -54 -105 -106 -54 -164 -33 -29 -119 79 29
3920 29 -105 179 154 45 -18 -121 -83 64 135 59 -125 53 74 194 69 -86 69 -123 -151 51 -169 -112 -161
3943 -161 -158 -102 6 -190 300 135 215 -241 171 29 -31 64 41 60 -18 218 -244 -7 -148 213 331 -114 105
3966 105 176 -454 -193 156 -80 38 -43 -184 323 187 157 -67 -35 -259 134 -45 100 20 -265 -141 93 191
3988 191 170 -33 51 101 -15 -139 179 -79 83 -51 -1 -3 13 34 -69 128 84 127 7 20 -14 -296 189 32
4012C2j41R2j26R3J28k35K55p3N7op5j47K18Q7l38L59m10K08J51K38p55L67O7
4035D6j85J45Oj73K51j18j1J07J39k72J45J52j19j54Q8m36K83J10jJ03l6q6J39
4058A23j25J16P2k58O6q9k0M5J9KJ96m2j80P3j42K75L0q9N6j34L3k6j51J66j65
4083a49K3O5J9n9Q8j94k85K52L17o8k5mj47K41j15K3Q7j13L38l57q1MJ64j14Q9
4108an1k1J28k8r7J36l7o3Om8J62o2o8P0o9K89p5p1Lk55O0K45P7q6J7k15L02k1
4136B27l55J07K34l12K15j91r1J89k44M31j46J96k62J27K7N0k96Nn5P1Q4l60M18
4159F9K2r0P7m6J53j52j77J09P8k56J99J48l05L27k44K09o5j95J24O0O7j31K71
4182B52k28j33J95k03J14K02k18P9l3J18l30K87j34O1J37k13J14K5o6k44K85m0
$$ plain form
4012 32 -109 -17 -143 -50 78 -157 98 25 82 76 1 -146 72 159 -179 180 -230 -22 129 367 -388 -21 46
4035 46 -139 6 12 -161 90 -28 -39 68 207 -65 80 232 113 -41 47 -389 -106 4 3 106 70 -16 123
4058 123 -2 114 186 -72 -6 -95 -115 -70 -51 -49 147 105 -75 -2 -144 131 161 72 128 -6 27 1 -150 16 -149
4083 -149 -126 -61 -42 -101 -13 -207 -492 -240 77 9 -16 -20 -167 74 -41 -18 69 -44 294 -63 -144 -140 24 -90 -1
4108 -1 -52 -73 55 27 -70 66 29 -34 -28 -76 86 24 -44 26 -43 246 171 100 103 -152 -92 153 230 144 161 -54 248 227
4136 227 -128 -21 213 -99 116 -75 -166 23 -221 210 64 260 -2 125 152 202 -94 -89 -144 -73 11 -349 69
4159 69 91 1 78 32 185 33 -144 -35 43 -213 -14 134 -171 156 -88 121 56 -139 -15 45 112 -19 252
4182 252 24 -109 86 -117 -3 199 -19 60 27 145 -185 102 -32 29 166 -47 67 92 26 -218 67 27
4204B7j19J55k04J73O2R4m63K60j06n8K09Jj86J51l5J22m1J81J14l85k48J94P2
4227c0L07j66K1o8M3k2l51L29n3J45j63J13J23j57K06j52n4R5j3j45m9J03k45
4250a83J75j33K57j05j52j92M16j89J47Kk4K64l08J51j80R2j91J74J05j43K41
4271B24k88Q5L3m8K18p5P8k26K74o6j53k3j05NJ03m2r8J0Q1RKJ06m16K97P5j14
4297e4m2NL6K3J17k86K54k29K65k70N2R5n0Q9k60M96o1j20r2j05M62m37J31j28
4321a09K36P7l53L67j35nj02j5J13N6j54L39l53nR1k0k2l24M19p1p4q4k18K90
4345e6m7k7M27k63p0N6j76K63p4R4q5k62K65L9l30J83P6j8Q2oP0r4j04J12k0n1
4371a6L8k20J73L6j43r0L68k36L4J60j25k22J52P0k39Q1K54k10m5J39o0j44J11
$$ plain form
4204 27 -92 63 -141 32 94 188 -275 -15 -121 -179 30 31 -155 -4 -39 83 42 223 337 -48 -296 -102 -30
4227 -30 277 111 132 64 107 85 -266 63 10 155 -8 105 228 71 277 125 71 166 153 8 -41 62 -183
4250 -183 -8 -141 116 11 -141 -333 83 -106 41 43 19 283 -25 126 -54 38 -153 21 126 -17 224
4271 224 -64 21 54 6 224 149 227 1 275 209 56 33 -72 -67 36 -6 -104 -94 -13 -4 -2 104 -312 -15 60 -54
4297 -54 -96 -91 -55 -32 85 -201 53 -176 89 -181 -129 -34 -84 5 -255 241 180 60 -32 -137 325 -112 19 -109
4321 -109 127 204 -149 218 83 78 -24 -39 74 130 -24 315 -38 -43 48 28 6 -318 101 30 -44 -128 -346 -56
4345 -56 -103 -130 297 34 -36 20 -156 107 33 127 42 -220 45 84 -246 -63 13 -5 77 71 141 47 -57 55 35 -16
4371 -16 22 -198 -25 11 -132 -222 146 -90 -56 104 -21 -243 -91 -21 -260 -179 75 -135 -180 -41 -101 -245 -134
4394a34K72M5J9q4l5Jk32K12K06k95m2R6j31O8J67n7j46K63j94j02J08j20P3j72
4418b14M84k22LJ26j31k45L60K4m38J79K60m93M26J77k78k0J15j07Q9l17M22R2
4440B92l51K57j47O0K5k75P2l2J49J07l79L12j02k4K6k5J61p9O2R6k57N9k18M09
4464A98j92q5N1J1j51K49j27j80M9J99k68J54J72j76J08J8J33j09l22M77j39o9
4486Aj72P7L13k18K18m1p7l79O92o73L16p1Nj81j15N07j6k08m2J57L7k23J97k04
4510a00q0K38J44k5n42K28l8L4L30n9j99J15j0J42j47L2q2J76o7J0m9o5L62n85
4534b37L93N9o7j36J45M2Lj73Q6N2k4j34O4j56p7J20M5o8J73j21nk44K33n1r4
4559a72m1K78k5l53L43k5m7K8J60j87o8J94j95M6K82l46J3J55L80m98j9L61l18
$$ plain form
4394 -134 138 183 202 118 83 84 -148 64 270 -25 -67 29 -102 -34 133 76 -70 193 -1 -103 5 -115 -42 -214
4418 -214 270 48 51 177 46 -199 161 185 -253 -74 186 -307 119 296 18 -2 113 6 95 -222 200 292
4440 292 -59 198 51 111 136 -139 -67 -99 50 157 -222 90 -12 -36 -10 -35 126 47 109 205 -52 7 -211 198
4464 198 6 -79 -28 -17 -168 81 -46 -226 -177 22 -246 -92 80 -96 12 30 163 54 -268 209 70 1
4486 1 -171 -94 219 1 219 178 101 -278 414 -259 57 -14 -9 -190 -305 202 186 -22 -64 93 130 -93 104 -100
4510 -100 -180 58 202 177 -365 -137 -175 -141 189 130 -69 46 36 178 31 63 -19 157 90 100 51 -14 348 -237
4534 -237 156 215 148 12 157 199 202 29 115 167 143 9 73 -83 -160 -40 5 -63 110 -11 -16 -260 -27 -78 -172
4559 -172 -213 65 40 -313 30 5 -42 -14 146 -41 -109 85 -110 -64 218 -128 -115 40 420 -78 -97 264 -54
4582e4J18j01M4J18j62J82j45j71J18J45k15K08J22j67K90m27Q9L90n96L70n4
4603A02M8o7o0N5R8l61K26Mp0J40k2k13J3J50J25J1l31J31K10l7m09M82k3m5l49
4628a92K09N1J1J20M7j61n9J4j51N6K02k95J18q6P1ML10k52r9J72q2m9P9k75j15
4653c52L94k63K78j41K50Q4j43j80p0k9q8L58n6o9J27j0o6m2K65m32K44J17k07
4676c1r3K20k07K25P3m12M22l9r7J5j34Q6j61J38m1J21o9j37J16J32j00q4n2J09
4700@O5J93m78K95J08k40K53k46N9p7R1o2K05p1N7k42q5J78p7R4l16M39j08j41
4724a06K41n2o3M7P8k64p4M49j93r9J54k8Q3k64L20j72k16L47k31k19J52P6k02
4747b36N56k43K23r7l00j70L02q4rK51l91K51m9J95j41ll6J28j17j22J52k00o7
$$ plain form
4582 -54 64 -37 7 125 -37 145 0 -171 -53 92 -123 85 207 40 330 -97 -8 382 -214 156 102
4603 102 150 83 23 78 176 -185 41 45 -25 115 93 -120 -107 43 168 179 -152 -21 189 152 -257 225 202 157 -192
4628 -192 17 68 79 199 246 85 26 40 -111 -55 147 -148 -30 -116 -45 -41 269 17 -82 90 8 -41 38 -237 -352
4653 -352 42 -221 57 -84 166 250 107 -73 -143 -172 -260 98 42 -27 100 90 24 -18 247 -185 59 176 -31
4676 -31 -124 96 -111 114 187 -225 197 158 61 76 -58 28 -133 5 -36 85 16 -121 -5 127 27 -57 -109 0
4700 0 65 258 -220 75 183 -57 196 -50 9 -68 23 -39 166 95 152 -90 -175 3 -74 20 -296 143 35 -106
4724 -106 135 83 20 67 145 -119 -193 256 63 -36 118 90 173 -91 229 57 -159 188 -43 -262 -110 -34 -236
4747 -236 320 77 300 203 -97 -267 35 -49 -58 193 -198 53 4 199 58 55 19 147 30 -92 60 -140 -207
4770b07J34j00J31J99j33K5J16k41Q3M4o4j61jL04J4k73L65k86j55O8K48j29p5
4793i4J15mm5r8Q1J54r8J81k83P8p2M1K90j68P0K2l3m21J05N09l4j55k52j34L88
4818A43k30L13q2l38L34J7j98J15k06M1M5p6O2L92m30K67k57J15lo4O6N5N9k20
4842h0L82j57J8k85j4K90l35L42mj7j88l1j5j34L48r9j55K50o0J21l87Q9O4N0
4866gr6J1j26j7J53L63l17p9J18j26Q3J90j7P1k98L3L54o08J64J61n2k60N16l57
4890a43L3L8J95J32k00J31n03K37o6K40j99k1PK19P2j1n3j48O4r8R0j11K99j89
4914A5k2L2j98M38k99Q7l8Ql4J4k58J41K03J20K0J60k32k91P9Q1M4j00J71l07
4938a66K22n3J69kp5m4q9P5j30J7J61k63J08J60j98L2J45J49k07R9p2l45L86J38
$$ plain form
4770 -207 -73 -173 -42 157 24 49 165 -76 7 51 -13 -174 -175 129 143 -130 235 -51 -206 -138 110 -19 -94
4793 -94 21 17 -28 -126 -45 109 11 192 -91 -13 -85 -44 246 78 148 170 137 -284 -179 330 296 141 -111 -245 143
4818 143 -87 226 144 -194 140 157 -41 74 -132 -91 -46 -122 -60 332 -98 169 -88 27 24 -40 26 81 140 -80
4842 -80 302 145 163 -122 -136 154 -181 161 157 140 -48 -79 -94 -228 120 21 -134 116 56 177 -210 -121 -57 -7
4866 -7 -103 -92 -218 -235 -82 281 -36 -115 3 -123 -40 150 133 204 -94 -61 293 -315 -151 10 -42 -302 214 -143
4890 -143 -110 -72 123 255 55 186 -317 -80 -146 94 -105 -126 -119 100 172 161 108 -40 24 -74 16 -95 204 15
4914 15 -7 25 -173 265 -34 53 15 23 -11 3 -255 -114 89 209 229 389 157 -134 -55 26 70 -30 141 -166
4938 -166 56 3 172 170 95 51 -38 37 -93 -76 85 -178 -70 90 -108 -76 69 218 11 110 38 -307 79 217
4962B17k08J97j49j65J59j66M0J36K80k28O9k75J45j61K13k09L25k04j17j4P6
4983c9J72j35M09m45M4J31k47Q0k94K39j91N45j18j26K18l55L17k23k01q0L81
5004H2q7J89j52L8J07k95K77n8j14L02k68O8k34J87k2k56Q0J03j00K66jj7n5M4
5028H4k09PK00j47K06k14j01k01M11R9o5k1j54j90K96N5O4k03j11M56k51j04o8
5051a61K62j10n0K06n6j06j19L5Q1m8oM8O3J22l14J40j03J48qr2O7k46K15K11
5075A79j87J95p9k59M8Q7J06j52N93n98J38o2kN5j14J01n8j03K31q8O9l5n7lr9
5100i4K30j62j06K13l8k49K55j35k7J97jk09K60k91K11m7K71l74J57M4k75K00
5122C0k19J50L09k87Q7j31R4lM5j20j52K30jR1j6J44k62j68M5J99L6m62L68p%
$$ plain form
4962 217 9 206 57 -108 51 -115 -75 61 341 113 182 -93 52 -109 104 -105 220 16 -101 -115 -39
4983 -39 133 -2 407 -38 6 137 -110 -30 -324 -85 -276 269 151 25 243 -112 205 -18 -219 -299 82
5004 82 -5 184 32 70 177 -118 159 101 -13 289 21 89 -145 42 20 -236 -156 -53 -153 113 112 95 40 84
5028 84 -125 -118 82 -65 141 -73 -174 -375 36 135 70 49 -105 -295 1 56 120 -83 -194 262 11 -93 -161
5051 -161 101 -9 -59 147 91 -15 -134 -99 -18 -66 -72 -24 39 161 -153 -13 -116 32 24 -68 -1 -247 -32 179
5075 179 -8 187 108 -151 -103 -16 90 -62 531 -67 71 9 7 62 -52 49 -9 -112 119 31 100 65 8 5 -94
5100 -94 136 -26 -132 81 43 -206 49 -86 -113 84 83 -126 134 -157 54 7 278 -96 61 105 -170 30
5122 30 -189 -39 270 -17 70 -61 33 30 75 -45 -197 33 32 123 107 251 -11 -179 -134 65 101 -361 7 0 0
5147@j65K88N9j97o5K26j03R5j56j91K35J9k34L24m05nJ97M8O9k77J92%M4p3J47
5172G2J4k16K2J03J93k17J08n4j08K68p8k85L2K35O9o7q9k75L34j82J03N5l22
5195b85K45j44J17M1O4j62R6J80J70k82k21L29j62l3K5o5K01k15K61N8k38m6O6
5218@o6n2J35J86l36K0L49K7l65k13R6J73PR3J31J1n72K97J32j18L7J42j13m6
5242d5K94k91J48k8M1j23M1j41j16K69k14O2J30n9k52K70J57j52NrK11k61R5J64
5266A96Q1l38J37N0J8j92L18o60K25M02j19l35J15qj09J93q7M76k56j1j87l6j8
5289a45Pk0J83j32K15j16N4K87k51R0l3m7J84k58k72L63l2j73j6L06r2Q9k56j00
5313a65J11L53j56P5j86l22L84k65J99j26K22k5j2Q3j56j29J66j78K33j58j33
$$ plain form
5147 0 -165 123 182 -15 -80 146 43 138 -18 -209 26 45 -189 135 -270 -275 -78 -30 39 -238 -46 -46 -2 -75 72
5172 72 86 -130 -108 -5 188 -29 79 25 -83 185 107 -178 -146 89 158 91 2 -273 61 -121 -18 37 -285
5195 -285 -40 -184 -67 -26 38 -124 -28 152 322 40 -181 148 -14 -47 -22 -87 114 -101 160 218 -20 -66 0
5218 0 -66 -118 17 203 -133 -113 236 263 -102 -315 -219 -46 -39 54 185 196 -376 -79 53 -65 -28 114 1 -45
5242 -45 249 -42 106 78 119 -4 37 -104 -220 49 -165 -103 27 -32 -284 -14 143 -9 -4 -13 198 -63 32 196
5266 196 277 -61 76 126 144 -48 270 -390 -165 237 118 -217 -102 -110 -219 -26 -113 363 107 96 -91 -127 -145
5289 -145 -138 -158 25 -107 108 -8 46 333 82 172 139 92 276 18 -254 109 77 -96 -112 194 102 191 -65 -165
5313 -165 -54 299 143 218 32 -290 94 -171 28 -98 124 99 87 170 14 -115 51 -127 106 -52 -185
5334a85P9J05j34L48k48L01m85JL28r0L49k48j41k1L2m6R4j70K35k06J12J98r8
5357A10Q8l07Lk0L60k16q9L27l93K01j84J56R6j00j1m2j71K68O2j47J53k7j6j61
5381f0J2N1j34L02j00k5lJ8n2q0K44j28J53k00J43n6j53K12k64J61o5J25k14j83
5405b96K88nR9J14l34J88J22l38J41k63O58k94j93Q3m2L21l76K06k19K47j18k30
5427b41J25L68j57J08k09n5J12kk16J36J60m3L7J96k91kj48J89j05j75K79jok67
5451b08q3K51J2J86K7j46J5j3k0j14K8J5Q3k4L06l74M7l2J72J49m07K38%q2O8
5476I4j69K05k04j4L6j15M1k0J6K26j10J21j20J07o1J33j90L2m0j53J02P1J90
5499A78k37J82j53L1N2j09K4K94kj54p1J07J32j00l68O0M75l24j66J60l55L62
$$ plain form
5334 -185 -106 -1 -135 213 -35 266 -219 -218 110 20 369 121 -20 -41 -9 -55 39 -131 104 -102 10 208 110
5357 110 198 -109 -106 -126 234 18 -71 256 -137 64 -120 36 132 32 21 -21 -192 76 138 -9 144 117 101 -60
5381 -60 -48 3 -131 171 71 46 43 61 9 -71 173 45 198 -2 141 85 -68 144 -120 41 -24 101 -113 -296
5405 -296 -8 -13 86 200 -134 54 176 -162 -21 -284 374 80 -113 -30 -72 249 -127 79 -140 107 -11 -241
5427 -241 -116 252 95 203 -6 -61 51 49 -167 -31 129 86 123 319 28 26 -122 67 -38 -213 66 65 59 -208
5451 -208 -291 -40 -28 158 185 39 54 41 21 -93 -65 -50 33 9 315 -59 -12 -44 128 277 -130 108 108 26 94
5476 94 -75 130 -74 -88 -52 -167 -126 -146 -130 96 -14 107 -13 94 33 166 -24 8 -32 -185 -83 -12 178
5499 178 -59 123 -30 1 53 -56 -32 262 260 106 35 142 274 174 -194 -134 341 17 -149 11 -344 18
5521A8K5k72K0L42J40m09L19m19K06q4L9J61j77O9k92J46K41l39L82J35k79K0
5543hrO8k18j5j04J32L1L5J1K23j35l8k44M42j05P0J84k17j29M6j19J68k7q8L24
5568B78k92p4R2J34j65J2m5J67q6m8K04m9n46M79j30J7k1M5R4j95J0K34k83K86
5592A18k23k9K23j49mO5J4J26l02Q3N8R0Q3j34j0K5Q0j34j53Nj9K39N7o3j85l
5618a42N7j11P1L26j87m4j10K69j21r9r8O9K2R8O1m6m8P7K4j05k07k7J6L47j58
5643f6j34J89j56K4J21K26m26J66j5L0J45m2p7O6j26m2j71L04j75K45r5o5k05
5666b79L3J94p1P4L3Q2j58J10k5K74q6l17K54j38K25n9j70k1R3K31l83j32K63
5689B7k57P3L06j81j00L08k41J74j27l6P6k02L92k88M0P6Q0m8j13j65K31J22k64
$$ plain form
5521 18 43 -229 -209 133 273 -136 183 -236 -30 -114 -75 86 -91 -22 -314 -168 73 -266 116 251 -28 -8
5543 -8 -17 51 -167 -182 -286 -154 -123 -88 -77 146 11 -27 -271 171 66 136 320 103 -26 20 -99 69 42 -46 278
5568 278 -14 -88 4 138 -27 -15 -60 107 21 -27 177 128 -418 61 -69 -52 -73 -28 66 -129 -119 115 -168 118
5592 118 -105 -134 89 -60 -64 1 15 141 -161 -78 -20 70 153 19 9 34 114 -20 -173 -168 -187 52 109 46 -139 -142
5618 -142 -85 -196 -125 201 14 -30 -140 129 8 -91 -189 -120 -98 0 61 15 -33 44 68 -37 -244 -271 -255 92 -66
5643 -66 -200 -11 -167 -143 -22 204 -222 -56 -71 -41 104 62 -15 51 -75 -117 -288 16 -159 86 -9 -74 -279
5666 -279 -246 -52 -123 -49 -16 66 -92 18 -7 267 181 -136 118 -20 205 146 -24 -45 48 279 -104 -236 27
5689 27 -230 -157 149 -32 -132 176 -65 109 -18 -54 22 -180 212 -76 -36 40 120 72 -41 -206 25 147 -117
5712a17K44k04K36j97J59j41j31n0J42M4J27n9q0m4l24N93q5L4J21m54K93p8l3
5735dJ31k04J02J1k9M4K09n17K87k8K1n8o9K7K33l39J99o2J08J99n63J57J76%
5759C1O0k19N0J17l8J9LP8l00K56J7j85P7j93M14k26j64M06k50K59P4j47o7j64
5783i2q8K66k26K03m4j44K1rP3J14k59J34R4j02j11K67l42M35l10J20r4J73J98
5806B77l36M3M2m0k11L61j97K22j73N4P1Rj25K2P8k36R8n9R7RP8N4P4l80M17k18
5832C1mm35L71R3K29l80N2L4j23N7q5J86j14J45K87p3q0j8j15r1J34k81O0J69
5856D9q3Q0j7R6k02m0J31J8k57K07r2K0K34K23l00r2J18r6J55l30o0M80k83L6
5880eo1J03K7P3N6k99Q9l8k30J65J73J22j45o4j05M05m70N45l89j39L75%j19q6
$$ plain form
5712 -117 127 -77 159 -38 121 -20 -151 -201 -59 -15 112 53 -27 -71 -395 198 113 147 268 -186 107 29 -4
5735 -4 127 -77 25 36 7 51 260 -257 30 2 23 -35 -104 -77 156 -183 16 -46 62 261 -302 -145 31 31
5759 31 91 -128 -78 39 1 20 23 101 -199 57 74 -111 -34 -227 187 -39 -203 203 -47 212 286 139 72 -92
5783 -92 -180 86 -140 63 19 -125 -104 -113 -40 74 -185 -51 43 -59 -170 97 -245 190 -120 0 -94 79 277
5806 277 -59 -16 26 -14 -225 136 -61 161 -12 42 113 122 -3 19 97 -139 -41 -100 -3 6 84 138 212 -168 249 31
5832 31 27 -408 -37 56 285 -95 -43 -9 -132 -75 -160 26 -88 57 344 271 191 173 58 -33 101 -180 -120 49
5856 49 -34 46 29 125 -77 -117 14 32 -225 -18 -110 -90 144 367 67 -25 93 -3 152 -178 -238 242 -41 -5
5880 -5 -66 37 64 137 193 -106 -17 -55 -285 -120 53 175 30 -34 -139 266 -204 341 -48 -187 188 188 69 -17
5904a7K17m14M09m1j69On4m0L95l18R0J24k80P8J73m5j57O9P4m1k33K41k90K51
5928B8J38K32m58K33k60Q2J25jp8m5q3P0l7N3J91m23N5M34J34q9l34O9J03k77
5952a38M9L38l54ll3J00M2R9j12n2J15j32M2K99m30J90j62p6K27oj42M04k59K9
5976C5k70J55j5m9J3L0J10m2k72L09j7j74M15j60j30M9K46j63n0k73K68k01L66
5999A80jj83O3K05j63K0Rj78l7m3L0n9o3J46J77J26k95Rj32O3J91O2j81q0K42
6024A08q0j43J40q2m3J04q9J40j36%k48L12K99l63%J71O4j99K87j83j33j20K88
6047I4l16J77R0LL2o7k9j04l8J34J70J77k29k5l1Q5l98J48R7J35j85P2J33J1k46
6072a10J91k0J00Nn9j25O3j05PL74m31L7rP2j61M80l62K00j86K31l52L92j78j32
$$ plain form
5904 -17 200 -214 195 154 -15 -9 -63 -103 292 -26 64 188 -92 -14 159 114 -43 26 100 59 -174 67 -223 28
5928 28 166 398 -60 173 -87 -5 120 119 41 -4 -87 -17 -54 -1 190 -233 -178 256 390 301 -33 36 139 -138
5952 -138 -89 249 -105 -108 -141 -41 1 100 -12 -64 51 -81 -39 260 -170 20 -142 -218 9 3 -139 265 6 35
5976 35 -235 -80 -95 -144 -131 -101 9 -33 -305 4 -13 -187 228 68 -62 -13 233 70 20 -253 15 -186 180
5999 180 179 -4 59 264 101 121 130 -48 -85 -128 -98 -157 -220 -74 103 229 -66 -57 -189 -126 65 127 -54 -134 108
6024 108 28 -115 25 -57 -100 4 -85 55 -81 -81 -329 -17 282 -81 -81 90 154 -45 242 59 -74 -194 94
6047 94 -222 -45 45 48 80 13 -16 -120 -158 -24 146 323 94 69 38 123 -275 -127 -30 105 -80 -8 125 136 -110
6072 -110 81 61 161 166 107 -18 45 -60 -53 321 -110 -73 -82 -10 -171 309 -53 147 -39 192 -160 232 54 -78
6096g8J11k13K91J18j36k56P9j06K05J77j34k4L0j09R0k42K71j80m7j14ML71J01
6119B09M1k97J49K00J5n15J63j15J57M9k38o1J95j73L74k21K87q8k19J01n0jj00
6142a38M8J93J3k32K48j94J54j00K89l18J56k3M8q6K51k38L7J62l73J61r5K40
6164B03k33J51k53L43k39m4J0L2J69m71J99J07k32K79J6k2k60K63j70K00R5j11
6186C2j0J14j20LN0j32k47Q8L1M73j86R3k76K43k58J11Rk6o1J07k81L71J06j11
6210A23k15K3j4K24L0k26J50j9J16k14j89K7L00j80J44j26o8K39j91R9j43N5k4
6233g9J1K7L69l93L6Q9q1rk14J95k5M0K64l08J31J29m89L15k7Rkj2M7J7O4j97
6259i3J83j04j58M52j48mm06L41l02L06K9k24K39k32K48J70l66j4m8J72j67K25
$$ plain form
6096 -78 33 -180 111 229 93 -163 -84 -190 15 192 58 34 64 -45 45 -197 74 -106 -153 -267 -263 108 209
6119 209 250 -47 102 302 317 -198 -35 -150 7 56 -182 -243 -48 -221 153 -68 219 131 -88 13 -37 -38 -138
6142 -138 -90 103 116 -116 132 -62 92 -8 281 -37 119 96 144 58 309 71 108 270 -103 58 -37 203
6164 203 -30 121 -132 211 -28 -72 -62 -30 139 -332 -133 -26 -258 21 37 15 -245 18 -152 48 143 32
6186 32 22 136 16 19 69 -63 -310 -222 -191 282 96 189 -87 156 -102 9 18 -8 -69 38 -243 128 234 123
6210 123 -92 -69 -83 141 171 -55 95 76 192 -22 -211 -184 116 -64 80 -46 -114 125 -66 33 -110 -55 -79
6233 -79 -68 -41 328 -65 -29 60 -21 -30 -244 -49 -74 -34 230 -78 53 182 -307 8 -19 -10 -12 -24 23 40 104 -93
6259 -93 90 -14 -172 280 132 128 -278 63 -239 67 96 -128 111 -121 127 297 -69 -83 -131 41 -126 99
6281I9K6k35OK74L6j70O6K8j31Q3m1l31J9K24j83K80q2L36j95M4j25L5N9l1n5
6306C6L9k65o2M73m66L07n1P1k09J46J11J44m1l54J7J50j0J6q1J27J15j70j16
6329g3p9K12p8JR8j7j71K68Ok45o0J78jJ13l35J97N4r7k49J30j34J32M15r6j15
6354E4k8R6l79P6K21k87J93n4J05J84j83m0j59K66J64j46j48J55R3J9j95J72k91
6377a12K40k89K10J2n7MPj0K1k56M02j22O2j95K10j15l9J88r4n3j24J34r0nj83
6402b54N6J62l0j48L44m9n0M8p2J2j4J53k39K73j56j76J08M3M4j56K20l59J01
6425a39J25L0Q2K9J73m18O8N7l01K11N4J41L8l68L11j68J37j20r3J91q2K95j51
6448A02m78L61J49l40O94n48Q0L3j01j5m5qK06r1J8o8j4J45Q8l83LK02k04K60
$$ plain form
6281 99 125 -110 -104 170 206 36 102 130 -1 82 41 -290 -271 -47 -230 50 -32 304 109 153 28 63 122 91 36
6306 36 75 -190 -252 221 -245 62 11 82 -127 19 130 274 233 -121 -104 46 36 52 -29 98 213 43 -73
6329 -73 -152 60 -18 -17 81 64 -107 161 167 -78 -138 40 39 152 -183 14 68 -29 -278 -148 -282 -150 265 169 54
6354 54 26 122 -257 -181 40 -247 -54 -108 -3 181 -2 -42 -201 65 229 83 -65 90 183 202 7 179 -112
6377 -112 128 -161 49 61 4 8 15 5 26 -230 172 50 112 -83 127 12 -27 161 67 14 -110 24 -66 -71 -254
6402 -254 -198 -36 -66 -214 130 81 31 79 7 19 5 158 -81 192 36 -140 -32 11 55 -101 119 -240 -139
6425 -139 -14 16 98 127 300 -118 -50 7 -294 -83 -29 112 150 -218 93 -75 62 -58 -151 40 -42 253 102
6448 102 -376 -15 134 -206 488 -60 20 53 -48 -63 -108 -116 90 -1 17 -51 -65 80 168 -215 -212 -10 -214 46
6472D6j78J96j29l1M69l44N0J29l47J03j01L15p9j42J86j15l48L40mj59J47j66
6494a62J24j2mJ95J7l61J20J14p3r9K57j56p8L76j76j62L0K33k12j35L34l63K52
6517E9j18L7J50j73p6K68j9j49j21k1J04QJ04q8Q0k35J36j2J18p3K4M3R8mj55
6542a5J43j95j82J81k9J07l8J46N5l40K04J81j03j94K68r4k31m3p1J41J51k46
6564b04K75j24o5K9L02k40J2j16q0J90L7M20m98K05q1n1J21m9k7p0R6j95N0J68
6588A05P0m67K83J93k34L00o6k55n2J82oj51J20j10J00k51J66j25J13O4q7J72
6610F4K0j36o3N7j20K6o2K88k34K78j66q0K93j47L3j01K37n40K22K91n9j90q5
6633a74L09k5l25R9n2K51k36K17n8q7N9JP3R1j38J22j89J09p5j04J05l84M48k48
$$ plain form
6472 46 -132 64 -65 -96 373 29 79 208 -139 -36 -137 178 99 -43 143 28 -320 20 16 -143 4 -162
6494 -162 -38 -50 -54 141 158 -203 -83 31 -42 -141 116 -40 -118 258 82 -80 -50 183 -29 -164 170 -193 59
6517 59 -59 -22 128 -45 -121 147 128 -21 -142 -163 -59 -51 53 -35 45 -190 -54 -66 52 -21 3 46 144 140 -15
6542 -15 128 -67 -249 -68 -97 10 -28 118 173 -167 37 218 115 -79 189 95 -136 -179 -250 -109 42 -204
6564 -204 71 -53 -118 -89 213 -27 -15 -131 -211 -21 16 436 -62 143 62 11 132 83 56 -14 82 -113 -63 105
6588 105 175 -292 -9 184 -50 250 184 -71 -123 59 53 -98 22 -88 12 -239 -73 -198 -85 -21 -108 64
6610 64 84 -52 -115 -58 -178 -152 -214 74 -160 118 -48 -128 165 18 51 -50 187 -353 -131 160 101 -89 -174
6633 -174 135 110 -215 -116 -168 83 -153 64 6 -81 -22 -21 52 143 5 127 -62 47 -28 -132 -27 -411 37 -211
6657b11K05j82K53N1Q9q5m3n9j33L13J38l45nP3n0L44l17j60K0L2%J02p4M8L1
6682C5j28M6J02j58P2k15o4K83J2k89K62k6L6R7k08Q0n6J47q0N7j19l7J10K2k65
6707b84K29P1O3o6J76k06J89l16L62k7j59q2K34J70n67K64J13k22J85pM1j85k44
6730b68L96KK63k73r7k00q8K84L7M0k05k2L84l30J61m5j54J4J31O1j50K01O3n9
6754A46j6Oj72L04p5m24J26K07j40O3M7K0k36K29j89J54r7p8P1N3l6J79l9J37
6778B40j64j08m2K33k94m0J77Mk77J63P9p9rJ3J95L2jN6l73L01j44q7J24j6j4
6803c1r6L2M6K0j99J15L82j62kj94N4k27L00q7p8J25k10K67k02L34r0j65Pl8k02
6828c01N57m03J80j18m0K15r1L5J01j04L8O0l09L19n6k31j4L35n45J84R0J54R8
$$ plain form
6657 -211 -6 -188 65 116 205 120 77 18 -115 198 336 -9 -14 59 9 353 36 -124 -104 -72 -72 30 -44 4 35
6682 35 -93 -47 55 -103 -31 -246 -310 -27 -15 -304 -42 -68 -32 65 -143 -63 -119 28 -52 5 -114 -151 -41 -19 -284
6707 -284 -55 16 79 13 189 -17 172 -144 218 191 32 -50 184 354 -213 51 164 -58 127 120 161 -24 -268
6730 -268 128 130 393 120 23 -177 -265 19 56 96 -109 -131 253 -77 84 39 -115 -101 30 91 -59 142 205 146
6754 146 130 136 -36 268 193 -231 -105 102 -38 25 72 92 -144 85 -104 50 -47 -125 -54 -1 -37 142 103 240
6778 240 76 -32 -74 159 -135 -175 2 6 -271 -108 -29 -108 -117 -104 91 123 122 178 -195 106 -38 -125 -1 -17 -31
6803 -31 -127 -95 -49 -29 -228 -113 269 107 105 -89 -35 -262 38 -49 -127 -2 -212 55 -147 187 97 -68 -61 -99 -301
6828 -301 256 -147 33 -85 -125 90 -1 34 135 31 69 129 -180 139 83 -148 -162 173 -372 -188 -98 56 154
6851A54j38n2N04n75j95Q2L37n9q0J72l6j22m8j10J44P7K0k36K39j35o4K93J44
6874C16l20k45J44J12M9k13L17qO3l15K4m7J19j89J66j23K82k24K88l03K85j8
6896A60n1Q2q0m3k3m3M9J75k2n17P15n55K69o4J03k82L20j25p7j76J72j43k2J98
6920B0O2k75L35k08J09r5K19l13K06K84j94p6K1j39j88M02k89%J79k37K00j96
6942a73K91Q3l01J8J80Kj32M1r0K6n1J15K7m8M40o24M0k2r6L28J82j95j08n9K18
6967I2L6k16J91j13k31K35j69K35p1J1Qm6L05j65k1p5Q9k18L18k97M4K0j46J40
6991d4j2k84K79J22P5j67J11j44l6J19k65N79m42Q2j7m1J49J82k08L7k1J42k94
7014i8K96j79Nq6k1J73k99K92N5j14p6mO9M8j63j15K27q2j38L84m27J81m1j5M0
$$ plain form
6851 154 16 -36 468 -107 -302 -220 117 58 -22 150 114 -8 -56 -166 -22 55 75 -161 78 -57 -121 172 316
6874 316 -4 -249 -105 7 56 -157 160 152 215 -100 -76 -123 -4 -193 -27 -150 132 -92 196 -107 178 160
6896 160 109 191 111 68 45 2 51 226 204 -313 402 -153 116 52 155 -127 193 68 -9 -185 -13 -156 -178 20
6920 20 82 -193 142 -66 43 -52 167 -146 60 344 150 74 95 -44 -232 170 -119 -119 60 -177 23 -173
6942 -173 118 201 -100 -82 98 100 -32 9 -81 -55 -106 9 36 -12 428 -196 -156 -178 -274 54 236 41 -67 -126 92
6967 92 128 -88 103 -10 -241 -6 -175 60 -11 0 8 -38 267 102 81 6 95 -123 195 -102 -58 -38 -184 -44
6991 -44 -56 -340 -61 61 136 -31 80 -64 -100 19 -246 333 -109 -27 -44 -85 64 246 38 75 54 196 -98
7014 -98 198 19 24 -62 -83 90 -209 83 138 24 -52 -56 13 61 -102 -217 10 -72 -210 174 -253 -72 -113 -128 -88
7039h8K11k01j34J72j62L04j52K93j74k40O7L45k39j26K93l44L30k48J58j30L04
7060B39m40L48j86J23K33n42M75k40K14k87J31n2J54%o2j13M1k81L8P0J06K00
7082A69k00q7j8J88m78M45N2m1J36P1m19K43j33J72j52R6j19L17k25M8k40J27
7104d8J84q6j49J90N2j64R1j28J56j95j08M22j57k13n8K87q7l2N9O1k00j3K72
7127A36j99J24r2k3R7r6M7KK77l07k63M28Qk08K48rj57K67j12o3JP9l35L14j6
7152A48k4k17jQ1n1roqj20M40k75M7n2L6j71P9K47p3q0Kp8J60n1J30k08L17l78
7179a15R0J6M8L22m57J18k77N18m76M30o4j75l66M06Q0k19J22M1j78L01p4l21
7201b30N71l95J18N0Nk57N0m0K27j56J07J05k03o1j08L76l03K82k89p6K21K44
$$ plain form
7039 -88 123 -78 -212 -40 -202 102 -50 243 69 -171 -104 241 2 -124 169 -175 155 -93 65 -65 239
7060 239 -201 147 -39 84 317 -225 250 10 224 -63 68 16 170 170 108 -5 36 -245 -207 -137 -31 169
7082 169 -31 -118 -136 52 -426 19 71 30 166 237 -182 61 -72 100 -52 44 -75 242 17 65 -175 -48
7104 -48 136 50 -99 91 143 -21 70 -58 98 -97 -205 217 60 -153 -211 76 -11 -43 16 77 -123 -136 136
7127 136 -63 61 -31 -54 43 -53 -6 -4 273 -34 -297 131 139 -69 179 170 13 280 168 105 106 185 -150 164 148
7152 148 124 -93 -94 -13 -64 -73 -79 -87 -207 233 -42 5 -47 -11 -182 -103 144 71 -9 -7 -85 75 24 154 -54 263 -115
7179 -115 -25 -9 39 361 -96 22 -255 263 -213 217 153 -22 -388 18 98 -121 1 42 -136 165 91 -230
7201 -230 341 -54 64 114 119 -138 -88 -128 99 -57 50 155 -48 -109 -217 159 -144 138 -151 -227 -6 238
7223B38j82j51j44M05j16j14J11k68K11p8M2J26j73m2J05J18k72O3PQ4N02n50
7245g8J51j07k30M41l87J84N0O9j71J97k8k27M05l01J16Oj03j8j57J50l37M23
7267D8m9J56K2l79K55r9J20j30l9J90k04K7Q6j65K34r7K8k94L83o6k1L7k48K91
7291H6r6J02n5lJ23k07K36j83q9j47J98K56j71J70k05r6M46n64J90k75O19l21
7313A4o1j2j1J47j17j07J04j28K09r3K50Oj56K2k72L66k91J57r6O4J17q7J9L9
7337H3J16m13L75l22J65Qkr0J1J78m0n2j78O9q8P0n7M9J03J36J01m11K84k46n1
7362b02L41m02Q1K86k18K60j03lm13J88K86k49J12k5J4J42P9j70j63J17r6J06
7384c2K77o3k4r5j67OK9oJ66J22l89K20K07k97l4j00NK59P8l42K07k51K91RJ08
$$ plain form
7223 238 56 -95 -239 166 50 -64 47 -221 -10 -88 -46 80 -93 -135 -30 88 -184 -121 -114 -30 472 -78
7245 -78 73 -34 -264 177 -210 -26 24 93 -78 119 91 -136 269 -32 84 90 -13 -31 -188 -38 -375 48
7267 48 -1 155 177 -202 53 -46 74 -56 -95 95 -109 -82 4 -161 73 -24 4 -290 93 27 6 43 -205 86
7291 86 -10 92 37 34 157 -50 186 3 -86 -233 -35 221 50 220 15 -81 365 -199 -9 -284 335 14
7313 14 -47 -59 -70 77 -40 -147 -43 -171 38 -55 195 201 45 67 -205 161 -130 27 -69 -5 112 25 44 83
7337 83 199 -214 161 -161 4 12 10 -80 -69 109 69 17 -161 -92 -180 -110 -167 -118 -15 121 222 -189 95 -151 -202
7362 -202 139 -263 -182 104 -114 146 43 40 -373 -185 101 -148 -36 -61 -47 95 174 4 -159 -42 -138 -32
7384 -32 245 182 158 63 -104 -98 -69 -75 91 213 -176 44 251 -46 -80 -180 -175 84 162 -180 27 -224 67 76 184
7409A84j98k10K31K00m5q6O9j41J1P4p6j13P9j11J3K44j15j25J35l4O4M0l00L96
7433A86j79J51j23k4j9l9J62Ql33J43J3K00J8q9K78m56J60L18o25K50M7M4k70
7456a79J27J61J47k07P9m02K51J37q2n3o5K50N4j85j03Q6m83K86K2j70M04J69
7478B44l08P5J23k71j2J46K7j31N63j01l37J67j70j78K43j07N3n6O5O3l70J56
7500a16L22o1k18J46m2P7l7J36k82J93jk38K31K4j88r6K77L47o35K03j33k16J17
7523a90J14j63M27j54o8Lj70K17J16j53J29j97N7j36LJ83q2N5k81K06K6K30O8
7546B40j11k78L37j56o7j43L8L38j10k55K18p7j27K82k4Q4j90M84m39M9j32Q3
7568D4K30k70O8l04J24q7K21j45L8K04j97M9j6J69j47N7k55J95k72M52k46n9k
$$ plain form
7409 184 -14 -224 7 207 162 76 145 4 15 89 13 -100 -21 -132 -119 125 10 -115 20 -14 50 90 -210 186
7433 186 7 158 35 11 -8 -47 115 123 -210 -67 -54 146 164 75 353 -103 57 375 -250 0 47 91 -179
7456 -179 -52 109 256 49 128 -274 -23 114 32 -21 -86 164 218 33 -70 16 -467 -181 -159 -329 75 244
7478 244 -64 11 134 -137 -149 -3 24 -107 456 355 18 185 15 -163 80 -27 26 -30 35 98 -272 -116
7500 -116 206 145 -73 73 31 108 71 207 -75 118 117 -121 110 134 -54 -150 127 474 -161 42 -91 -307 -190
7523 -190 -76 -239 188 34 -34 -31 -201 16 132 -21 108 -89 -32 -168 -165 18 -64 -9 -290 -84 -58 172 240
7546 240 129 -149 188 32 -35 -178 -140 198 88 -167 51 -26 -153 129 105 189 -1 483 44 93 -39 44
7568 44 274 4 72 -232 -108 -195 26 -119 -81 123 -74 -25 -41 128 -19 38 -217 -22 -294 158 -88 -147 -149
7591a49O7J81j08J99j55J4L0M1k85J72n3k44L18J97k11J60q5J43j25j88J23n8
7613a6o9P9j72J38N0K44k32K1k49K87j49J11Q0k14J20K39m13m3J90R7j50K3k58
7636b86K60J48Oj68N5q8rJ18J13k76r7K68q0J98j23M1j37j94K06L60p14L58j81
7659b22J06K9J86k3j36J8m06L34K62k4k0r1o4K2m4J6J1j44%N4K29l13N57k26l27
7684b16%l5L70j9O8j67K09k12N7K2k18N3j25J32M1J39O8k16L8k5j7M3j5p0J32
7709C7l92M54o8Q2r9J33j10k1p6k26L60l5L83l56j98J89P2j55J71k68k0p5K69
7732E1p6J12j22J34M7k22n2J60O4j3j58J0k87K25j35N76k34pk83K54j26K11j43
7755a4n7L15k53q6J56Qq0p1nL0M3j58N2K48l16K35j03N5p3J67P3k19M6J94m58
$$ plain form
7591 -149 -82 99 -9 190 35 49 79 120 -165 7 -46 -290 28 225 14 174 89 232 107 -81 42 -16
7613 -16 -85 -6 -178 -40 10 254 22 43 -206 81 -68 43 123 -91 29 268 -145 -188 2 99 -51 -28 -286
7636 -286 -26 122 128 -40 15 -73 -82 36 149 -127 -224 44 -36 162 39 80 -57 -251 -45 315 -399 -41 -222
7659 -222 -116 -87 99 76 -60 -42 -448 -114 148 124 104 13 -51 -29 -73 -57 -46 -190 -190 -136 93 -220 337 111 -216
7684 -216 -216 -251 119 100 168 1 210 -2 55 77 -141 -88 -213 -81 -40 99 167 -49 -11 -36 -53 -10 -25 -95 37
7709 37 -355 99 31 113 14 147 37 16 -60 -286 74 39 422 66 -132 57 129 -26 145 -123 -143 -218 51
7732 51 -25 87 -35 99 146 -76 -128 32 96 83 -75 -65 -352 -127 -262 314 80 73 -210 44 -82 129 -14
7755 -14 -71 244 -9 -95 61 69 -11 -82 -87 -57 -14 -172 -120 128 -188 47 -56 -1 -74 93 166 -53 -7 187 -271
7780b71J66k6K29m5J5l35M03l21J32k22J49K23l10K39m4J66l35L33m49N60l44
7801h7k8m9Q2J87k95r5L72l36M05j16Q8j68Q3j57M0mk8j64K81J60j68M1j14k0
7825i0K61O3j50qm4L4l9l0j41J27l6L5j80M58j71P4j54n0J8j3J64k37O3j46K67
7850G5j02J16J65j58JJ0j40l9K39j25k02J70O0m3Q9j12L13l76l03M14j29l4L37
7873B26l33K34q7O0K32m55K78k40j36m9K61j01L6J48k2J76k88J44j33l8L04k14
7895CP3q9l9l3P8P6O7k95l2K70j77q8j02J78K49j91k8K97k03J00Qr5RlJ87k86
7921f6K27l70K62m2N3j50k50L89J68j75O7j15j02J76K40k24j77j5J30j10P9jQ9
7944H3J38k37M6j16l28N87K8j47j32J19n1Q1K13k96R9j25K34k09K98o6k71Q9j12
$$ plain form
7780 -271 -105 -131 98 53 68 -267 136 -185 -53 -275 -126 97 -213 26 -18 148 -187 146 -303 257 -87
7801 -87 -115 -164 -82 105 -190 -285 87 -249 156 40 128 -40 43 -114 -74 -78 -106 -270 11 171 3 44 -70 -90
7825 -90 171 234 84 76 32 66 27 -3 -144 -17 -53 -18 -198 260 89 163 9 -41 -23 -36 128 -109 -46 -192 75
7850 75 -27 89 254 96 97 107 -33 -72 167 42 -160 10 70 27 116 4 317 -59 -362 52 -77 -111 226
7873 226 -107 127 40 100 332 -123 155 -85 -221 -270 -9 -110 -74 74 52 228 -60 84 -49 -87 217 3
7895 3 76 -13 -52 -85 -7 69 136 -159 -191 79 -98 -186 -288 -110 139 -52 -80 217 14 114 122 27 36 33 220 -66
7921 -66 161 -209 53 11 64 -86 -336 53 221 46 113 -2 -104 72 312 88 -89 -104 26 -84 -5 -6 83
7944 83 221 -16 30 -86 -414 173 201 54 -78 41 -10 71 284 -12 87 -38 196 -13 285 219 -52 37 -75
7967g5K19l32M25n3r9k02K27q5K6k11J02J52l0m8p3k5j33K99m1k08M15p3m67L52
7991F2l5j0kk73L31J37k28l0K10j15L0k49K64j67L04k56J23r1J66k22r5R2J01
8014D7k20K3M52m67J2P5j69K87j3j65J46j62n1M61k96O6J3j15K7k83J19Q8L6L72
8038B83m07J37J9k10P7M19n85L80j32Kj24K10K8n4R9j10J7j87J30J39j57J19j48
8061e5Q9j12lJ68J50m8k45L46o1o8j26k3j55M24j87k81J71m8N7K0K33l17j03N4
8085a20J04j01P9j2m1J92j39J21k71J96J80k47K29j49K7p4j7N9n4j64K74m3Q7
8108A16k07J22M7Q1j58j6K86n34K83j22J41j70L18k26K9o1n0K12rJ85j06j44M4
8131F1J4o8J12J29l69J82J24k84J91%k41J47J28l71J01P3N4n0J07j51j5M74m48
$$ plain form
7967 -75 144 -188 237 184 85 -117 110 25 51 -160 -58 94 64 16 -57 -82 -215 84 43 -165 250 177 -290 62
7991 62 27 17 15 -258 73 210 -18 -48 162 47 77 -172 92 -75 229 -27 96 5 171 -51 -146 -54 47
8014 47 -173 -150 302 -165 -153 -78 -247 40 27 -138 8 -154 -205 256 -40 26 39 -76 -49 -332 -213 -125 -89 283
8038 283 -124 13 32 -178 -101 318 -267 113 -19 -17 -141 69 97 43 142 32 49 -138 -8 131 -26 93 -55
8061 -55 34 -78 -81 87 237 189 -56 290 229 161 35 12 -143 281 94 -187 -16 -64 -7 13 246 -71 -174 -120
8085 -120 -16 -117 -38 -50 -91 101 -38 83 -188 8 188 -59 170 21 48 -26 -43 16 -38 -202 72 29 116
8108 116 -91 31 78 159 1 -15 271 -263 20 -102 39 -131 187 -39 -10 -71 -121 91 82 267 161 17 61
8131 61 75 7 119 248 -121 61 185 -99 92 92 -149 -2 126 -245 -144 -71 -17 -67 40 -111 -126 348 -100
8154a00n2K66nl6M0k44J80l4j7j18R5j54K37q1J6K5j03K55k41M01l00Q7j02n1
8178c6L6J35k51L73mm64K94r4k1M0o3k8P5
$$ plain form
8154 -100 -152 114 109 73 113 -131 49 15 -2 -120 -25 -179 58 -23 -7 18 -85 170 -71 330 30 117 15 -36
8178 -36 0 135 -116 257 253 -211 83 -11 -32 8 -55 -83 -8
8191h
$$ Imaginary data points
##PAGE= N=2
##DATA TABLE= (X++(I..I)), XYDATA
0@%%%%%%%qJ6j6K4l2M0n6P2r6J20j44J76k16K62l10L68m33N09n96O96q08R34j076
30e74J230j406J601j815K050k313K602k918L269l649M065m521N020n566O161o811
46c575P519q291R139j0071J1094j2220J3462j4842J6383j8115K0076k2314K4895
59A3140k7907L1481l5805M1159m7987N7028o9627Q8513j20265J86772n48274O19978
71A88206L43937j154745R90070k63451n89438Q25327k22314l46414N47699n60775
81b41898K7367N22360l10086j740o42k26720L96306j40897j41363K86369l13342
92a44286j4451L48866j71344Q5205j14465k00630L78815j23520j59568K72070
102A56692l27091M5588K99262k73300K24188m0211m28422N14527l9454l53099
$$ plain form
0 0 0 0 0 0 0 0 0 -8 8 -8 16 -16 24 -32 40 -56 64 -80 96 -120 142 -168 200 -233 276 -320 376 -432 502 -574
30 -574 656 -750 851 -964 1086 -1227 1375 -1543 1726 -1923 2142 -2379 2641 -2925 3236 -3575
46 -3575 3944 -4347 4792 -5279 5815 -6405 7057 -7785 8598 -9517 10559 -11755 13140
59 13140 -14767 16714 -19091 22068 -25919 31109 -38518 49995 -70270 116502 -431772 188206
71 188206 532143 -622602 367468 104017 -485421 339906 117592 -228822 318877 -241898
81 -241898 -214531 307829 -2257 -3997 -4639 -231359 164947 24050 -117313 169056 -144286
92 -144286 -158737 190129 18785 103990 -10475 -211105 167710 44190 -115378 156692
102 156692 -170399 -124811 174451 -98849 125339 85128 -343294 171233 131779 -221320
112b21320M83446l48076k00999O53065m31985p7863M78197o44039J47678N39292
122C77396n92855J89865K30173n35731M39670J41302m76680L61701j00149k91846
132b57154M60266j45133k04309K51855k11202M7290K26710k18740L7787Q555j05082
143a09157K06687p6074o3439J36252j96873Q5407J75283k30758P2280K4809j66892
154a42475K18776k9259j31725J67590j44972J0719J90756k04608P6064O1717k39239
165a66656K50150K4380k62990K61385r0996j87996L36998j61486j39073K80006
175A43722k38712L963K92283k79744L2288J80985k57415J42605J02654k46657
185a24028J49157Q428j46554K06864o0791j21079J45651q5715l686J13979j23652
$$ plain form
112 -221320 262126 -85950 -286949 366116 -65869 -143732 334465 -309574 -161896 377396
122 377396 -215459 -25594 204579 -331152 108518 249820 -226860 134841 34692 -257154
132 -257154 203112 57979 -146330 105525 -105677 -58387 168323 -50417 -12630 -4075 -109157
143 -109157 97530 21456 -41983 94269 -102604 -17197 158086 -72672 -392 24417 -142475
154 -142475 76301 47042 -84683 82907 -62065 -51346 139410 -65198 10866 72583 -166656
165 -166656 83494 107874 -155116 106269 15273 -172723 164275 2789 -136284 143722
175 143722 -94990 -91027 201256 -78488 -46200 134785 -122630 19975 122629 -124028
185 -124028 25129 33557 -112997 93867 33076 -88003 57648 -28067 -31753 82226 -41426
196d1426K6777N1425q3672R1788j0539q2852P4488m6456J579P1398r6280L4080
208i690L8238q2467R9012j3046q8953J09904o2168l7059J25746j15679l246J13246
220G3838j31553N4807P8107j50591Q7178L1462j26164J30947j7770j03425J39746
231F6582o4427n7456J37480j05575k2160J11028j15395L4763P9356j21176N8802
242A822L8646r1468Q1811o155p0269P5165l1500j9088O0821o0205J2389L6797
254B8766n7301M5148l197n6425O4888k2409k7212O7203n1787n321N8107o0294
266a9834J8436K6090n9815M8339J638m6039N9377l2962k4024O7767n6562k454
278b0043N8091o6673K4724M1397p1392M1157K0288n9516N1189q203m4211N4695
$$ plain form
196 -41426 -14649 36776 -46896 44892 34353 -48499 25989 -20467 -18888 52510 -43770 -9690
208 -9690 28548 -53919 45093 32047 -56906 52998 -9170 -46229 79517 -36162 -39408 73838
220 73838 -57715 -2908 75199 -75392 11786 43248 -82916 48031 30261 -73164 66582
231 66582 2155 -55301 82179 -23396 -45556 65472 -49923 -15160 64196 -56980 1822
242 1822 40468 -51000 30811 24656 -45613 29552 -1948 -21036 39785 -20420 -8031 28766
254 28766 -28535 16613 13416 -43009 21879 -530 -27742 39461 -12326 -17647 40460 -19834
266 -19834 -1398 24692 -35123 13216 14854 -31185 28192 -4770 -28794 38973 -17589 -20043
278 -20043 38048 -28625 -3901 37496 -33896 7261 27549 -31967 19222 11019 -33192 21503
290B1503k4394j9943M6540l8231Q039L3514m4936K1652J0102l8657L9912p521
302G580k9897M1625k1073j2589L6463l3682q81K7125k8707J5431R824k6784K5041
315I476l942j6859K7067k1575n618K9787k8269J676K1634k8707J4740J4263k5860
328a2187J4695K002j4513J8470j0214o554J7753j3687L706J2457k2281P181J0636
341G464j7722J0363L055j2629J4143q10p461Q239q564J837R512j2518L720N492
355D121j1266Q516L574j2177O020L474m609L282j200k946K291J727J697k241j481
370a218L256l527m15K342n397L377M357n564M208K85o577R040k940q991J1330
385C566j395o848J1301o515r036J3274k400p489Q881n726n061J3968m029q179
$$ plain form
290 21503 -2891 -22834 23706 -14525 -6486 27028 -17908 3744 13846 -24811 15101 7580
302 7580 -22317 19308 -1765 -14354 22109 -11573 -12454 14671 -14036 1395 11219 -15565 9476
315 9476 5534 -11325 15742 -5833 -11451 18336 -9933 -8257 13377 -15330 -590 13673 -12187
328 -12187 2508 4510 -10003 8467 -1747 -8301 9452 -4235 -529 11928 -10353 -3172 7464
341 7464 -10258 105 3160 -9469 4674 3864 -3597 4642 -3922 -2085 7427 -5091 -1371 4121
355 4121 -7145 1371 4945 -7232 -1212 2262 -2347 935 -265 -3211 -920 807 2504 263 -1218
370 -1218 2038 -1489 -1904 438 -4959 -1582 2775 -2789 1419 1704 -4873 4167 1227 -7764 3566
385 3566 2171 -4677 6624 109 -8927 4347 1947 -5542 3339 -2387 -7448 6520 2491 -5688
399e688Q572m629j047J2711j0229p828J1057o090P69J2384j4989l818J6510r711
413b026N19J1213k0515L587J9894j7117M743J1480k6836J2364J7688k6193J1776
426E77R851k8621K0550J3898l0079J6566P103k8465K4400R734k9127J6761L124
439F272k3318K3715O867k4975J2331K354j5902K0200M799k4521R120P434j2553
452h177J9728J107l0987J4931J1199j6590K2842n334l5500L1082Q960k5407K9574
465A7428j5668l4321M9658k552l0497L6239k7683k3893O1048k1545k6725L9549
477B1038l6534p075N8505l6618j6925L5801l6833Q743M6134m3615p530K8719l2111
490a8301J6795L4053m3909m441K8849k5748J3824K8422m4652n227L6544k1562
$$ plain form
399 -5688 2884 -1745 -2792 9919 -310 -8138 2919 -3171 -2402 9982 -5007 -8825 7685 -2026
413 -2026 -1507 9706 -10809 -7222 12672 -4445 298 11778 -15058 -2694 14994 -11199 577
426 577 10428 -18193 2357 16255 -13824 2742 9845 -18620 5780 15514 -13613 3148 6272
439 6272 -17046 6669 13536 -11439 892 3246 -12656 7544 12343 -12178 -3058 4376 -8177
452 -8177 11551 12658 -18329 -3398 7801 -8789 14053 8719 -26781 4301 13261 -12146 17428
465 17428 1760 -32561 17097 14545 -15952 20287 -7396 -31289 29759 8214 -18511 21038
477 21038 -15496 -22571 35934 -684 -17609 18192 -18641 -9898 36236 -7379 -14909 13810 -18301
490 -18301 -1506 32547 -11362 -15803 13046 -12702 1122 29544 -15108 -20335 16209 -5353
502e353O442K7284m7319m748M5670k3146J657K2733m9617Q412M6127l1588O219
515B773J1539m8065L1773L3579m2098J7495k217m2913N4131J5577n2322K9122
527H374p773l6193O3404m52n7487L5654m041k8596O0100j1746n7127M0172N36
540D825k4539N3087k1310n1307M7587p81k2524M8195l3108l9700N7389j1294j7793
553a1273M4039m6652k1658O2644k4223r008L5265n4962K99N8223l4409j561K3565
566B0289n1335J7488M8871l7097m372J4895l5296K2320L8883l6840j1364J7550
578C992k1385J8440L3448m3382j3073L1503k1911J7624L0850o1421L862M4692
590B3239m1245K9502K4763q2104L6402M3275o1895M7954O963q3969O7673K1682
$$ plain form
502 -5353 1089 28373 -18946 -23694 21976 -1170 487 23220 -26397 -17985 28142 -3446 2773
515 2773 14312 -33753 -1980 31599 -10499 6996 4779 -38134 15997 31574 -20748 8374
527 8374 601 -35592 27812 27360 -30127 5527 1486 -27110 32990 21244 -35883 4289 4825
540 4825 -19714 33373 12063 -39244 8343 7562 -14962 33233 125 -39575 17814 6520 -11273
553 -11273 32766 -13886 -35544 27100 2877 -6131 29134 -25828 -25529 32694 -1715 -3276 20289
566 20289 -31046 -13558 35313 -1784 -6156 8739 -26557 -4237 34646 -2194 -13558 3992
578 3992 -17393 1047 34495 -8887 -21960 9543 -12368 5256 36106 -25315 -21453 23239
590 23239 -18006 11496 36259 -45845 -9443 33832 -28063 19891 26854 -57115 10558 32240
602C2240o4587O0226k0103o0944Q0918r589m2751N3174m1420k1247O7244l0573
614B588j4354L0285m1508J0852L9628k9562k513P882k0276J5731K0276j4644j5652
627a1267O475M558o627K4288n511m1954L2450J1065l3065M5350j8692n2529O7811
640B2352j0683l7671O3145m9420k8858Q2531m7777j0866N6406p5343J9936O2188
652D5940p2886K9001K4160p4280O1866J8130o7310N4034j2631m5635P0027j9699
664A0717l7010M5728k8070q375M1464k6472p414J3579j2237J0736K238l174j552
677A58j3933J9635O69j6802K5286k1555j2416M1971k9181l358L3181m7848J8366
690e827L4681n1942K9624J0563n4049N4444M63m9033N4917k5024l0934O6743l7935
$$ plain form
602 32240 -32347 27879 7776 -53168 27750 18161 -24590 28584 -12836 -34083 33161 2588
614 2588 -11766 18519 -22989 -12137 27491 -2071 -4584 3298 -16978 -1247 19029 4385 -11267
627 -11267 -4792 -234 -6861 17427 11916 -30038 2412 13477 -19588 25762 7070 -45459 22352
640 22352 11669 -26002 37143 -12277 -41135 41396 -6381 -17247 39159 -36184 -16248 45940
652 45940 -26946 2055 26215 -48065 13801 31931 -35379 18655 6024 -39611 30416 10717
664 10717 -26293 19435 -8635 -17010 24454 -2018 -9432 4147 -8090 2646 4884 1710 158
677 158 -13775 5860 6529 -10273 15013 -6542 -18958 23013 -6168 -9526 23655 -24193 -5827
690 -5827 28854 -23088 6536 17099 -36950 17494 17957 -31076 23841 -1183 -32117 34626 -3309
703c309j9615N1830m8552P806M5948n3731J4335K4400m4161L4647P900m0098L2222
716I622o842j9137L4522j9975j0300K3435j9469P795J1214k0855J2012j299p027
729f304J6305j4918K204J1563k1216J7402M570k6244K6403n361k1620L3950j7071
742c37j5377L3795k5569l278L0743l1270P593J9068l2244K0937Q050k9083K6560
755I588n870k0370L3456j7573j3188L0498k5067P33K6914l0482P159J7783k6621
768a3040J6194P606k4388J8408j81j2933J7505j0423n825J5212j2611M537P259
781G320j6056J1971J854j3147J5138p205p652J7418j2039j703J3019j6709Q074
794B83Q265j8262J3671P52j4786J8915p190j2269K0933j2418m501J8920j9002
$$ plain form
703 -3309 -22924 28906 -19646 -11840 34108 -19623 -5288 19112 -25049 9598 17498 -22600 9622
716 9622 2780 -16357 18165 -1810 -12110 11325 -8144 -349 10865 -9990 2022 723 -6304
729 -6304 10001 -4917 -2713 8850 -12366 5036 9606 -16638 9765 4404 -17216 16734 -337
742 -337 -15714 18081 -7488 -10766 19977 -11293 -3700 15368 -16876 4061 12111 -16972 9588
755 9588 3718 -16652 16804 -769 -13957 16541 -8526 -7793 19121 -11361 -4202 13581 -13040
768 -13040 3154 10760 -13628 4780 4599 -8334 9171 -1252 -7077 8135 -4476 61 7320
781 7320 -8736 3235 5089 -8058 7080 -125 -7777 9641 -2398 -4101 8918 -7791 283
794 283 8548 -9714 3957 4709 -10077 8838 1648 -10621 10312 -2106 -6607 12313 -6689
807f689K188J6157k0065R149P384j8638J5532O36j5374J7132p347p781J8431j4236
821c521j875J5256j6292N665R608j7849J1144L536j3322J3721m682q991J5000
834G398r046j995J0970j3346N878P221j3690R898j44j1047J4977o336p482J4621
848G877j1173l93J3132j6093N151Q940j4731J0660J591j3791J4390l482q920J4566
862G724j0324k757J4469j3679K417R297j4694Q787N441j3720J0190m16r386J2365
876E714n302n863J1185q086j14Q218r612L282M258p701N848K5n180O093l385j644
892b264N198n157L042J662o531O237j243m310P777n943k545Q960p301J225O740
907E547j1137M307O897j0387O622Q88j0723J1337O33r696R512m693n495J2845
$$ plain form
807 -6689 -4501 11656 -8409 740 8124 -10514 5018 5654 -9720 7412 65 -7716 10715 -3521
821 -3521 -5396 9860 -6432 -767 8841 -9008 2136 5672 -7650 6071 1389 -7602 7398
834 7398 -1648 -3643 7327 -6019 -141 7080 -6610 3288 3144 -7903 7074 738 -6744 7877
848 7877 -3296 -3689 9443 -6650 -1499 7441 -7290 3370 4961 -8830 5560 2078 -6842 7724
862 7724 -2600 -5357 9112 -4567 -2150 7147 -7547 1240 6681 -7039 3151 2735 -6651 5714
876 5714 412 -5451 5734 -2352 -2466 5752 -3860 -578 3680 -4021 1827 1852 -3328 2765 -620 -2264
892 -2264 2934 -2223 819 2481 -4050 2187 944 -3366 4411 -1532 -4077 4883 -2418 -1193 5547
907 5547 -5590 -1283 5614 -4773 1849 2737 -7986 3351 3984 -5712 3800 -893 -6388 6457
921F457n462n860R021p064p44J0862q548k389P093o652K384O872q732n43N904
936B599m742K156M369p511k52O103l695N25L952o590k87O890m254k77M702p434
952c746N4Q495n894l33N503r291J433J0239p944j75N452j0256M321J0134j0732
967b740O82N646j0811P553Q554j4010K592N201r652J0711M487j6105O071N219
981C398r374J2098m39j6408J1071L697r360J2612m598j5166J5436J510r777J2933
995G633q001j1972J8264j349j0058J2314r543p906J8834m843q339J0009r349l152
1009g458J6677p359o555Q547r137O80J4682r531n911P947p546K774J3044j1822
1023i68o257J0041n934J571J2907j4403o937J5530o733k01J3046j8624l892K0468
$$ plain form
921 6457 995 -4865 4156 -2908 -3652 7210 -1338 -3727 3366 -3286 -902 5970 -2762 -3305 2599
936 2599 -2143 13 4382 -3129 -3381 2722 -973 -448 3504 -3086 -3373 3517 -737 -1014 3688 -3746
952 -3746 -3692 4803 -1091 -1424 4079 -5212 -3779 6460 -1484 -1659 3793 -6463 -2142 7992 -2740
967 -2740 -2058 3588 -7223 330 8884 -5126 -2534 2667 -6985 3726 8213 -7892 -1821 3398
981 3398 -5976 6122 5683 -10725 346 4043 -5317 7295 2697 -12469 2967 4477 -5300 7633
995 7633 -368 -12340 5924 4575 -5483 6831 -2712 -10618 8216 3373 -4966 5043 -4306 -7458
1009 -7458 9219 1860 -4695 3852 -5285 -4605 10077 546 -5365 2582 -4964 -2190 10854 -968
1023 -968 -7225 2816 -3118 -1547 11360 -3043 -9980 5550 -1183 -1384 11662 -6962 -10854 9614
1037I614j0235j231J2651k2020K731K2375j7405K728R861k4427J3721J6974k3474
1050h137R987L798k2466K3114O526k3538J5070l081j5396K5679l636j9063J5905
1063D762o375p048K0614q080j2686J0866l333j938J2165o146j0837O675L886l337
1077h12O005k137j3234R558Q048j0609Q304j973j7815J9877M231j8063J7159r300
1091g61j6429L1814q554j8284K4452j9094p176L5501k2961r715K4456k5444P421
1104d774K6040l0201L037J5311k2187J7236R754k5933J0760M705j1641J6771l259
1117E619j5514J0629K94k940Q265m722q010M284O059k539j180L404j0125J672
1131d804J5518j1773k650J2179j8524O756J9057k3173M625J2033k3563J7843J1419
$$ plain form
1037 9614 -621 -1852 10799 -11221 -8490 13885 -3520 -792 9069 -15358 -1637 15337 -8137
1050 -8137 1850 5648 -16818 6296 12822 -10716 4354 1273 -14123 11556 7920 -11143 4762
1063 4762 -1613 -8661 11953 3873 -8813 2053 -1280 -3218 8947 2801 -8036 -1361 2525 -812
1077 -812 5193 3056 -10178 -620 7428 -3181 5123 3150 -14665 5212 9443 -8620 8539 -761
1091 -761 -17190 14624 6070 -12214 12238 -6856 -14032 21469 -1492 -11207 13249 -12195 -4774
1104 -4774 21266 -8935 -5898 9413 -12774 4462 14216 -11717 -957 3748 -7893 8878 5619
1117 5619 -9895 734 1028 -1912 6353 1631 -6379 -2095 3964 1425 245 3649 -6476 -4804
1131 -4804 10714 -1059 -3709 8470 -10054 -3298 15759 -7414 -2789 9244 -14319 3524 14943
1144A4943k8485J6222K761k0200K6927m686k2560K3579j0088q958K7354j8145
1156a336j0669K2085j5690K272J7612k1195J69J4025j1791N900O357j4163K476
1169c948Q008l492M61P55m760r29P190P61o666L435j331m746J1241l093r286J0560
1185D160o317l104J5290j2111m512J4306j3924L658J4564j9633M097J2484j8039
1198i081J0674Q181k0322J0287O722j4756J2838J215j4750J0955J382q010R100
1211D435l205p265Q000p29k807M456l757l283N900L62l378K379j817l069O538
1226B760N3o222M568r60m496Q405j504q387P767r31n438Q744l319o363P866k026
1242E17l295O193m110k528N900k979j069L746l994j67L816l231L69K696l677K82
$$ plain form
1144 14943 -13542 2680 5441 -14759 12168 7482 -15078 8501 -1587 -10545 16809 -1336
1156 -1336 -12005 10080 -5610 -3338 14274 -6921 -6752 7273 -4518 1382 7739 -6424 -3948
1169 -3948 4060 568 1029 1784 -2976 -3905 3285 4046 -2620 815 -516 -5262 5979 2886 -6400 4160
1185 4160 -2157 -5261 10029 -2082 -6594 7712 -6212 -2554 12010 -7623 -3526 8958 -9081
1198 -9081 1593 9774 -10548 -261 6461 -8295 4543 5758 -8992 1963 3345 -4665 4435
1211 4435 1230 -6035 1965 1236 -1571 2885 -872 -4155 1745 2107 -1271 1108 -709 -3778 2760
1226 2760 2813 -3409 1159 199 -4297 4108 2604 -5783 1984 1053 -4385 4359 1040 -5323 2543 517
1242 517 -2778 3415 -695 -3223 2677 -302 -1371 2375 -1619 -1786 2030 -1201 -832 1864 -1813 -1531
1258a531L913l727M6L691m409j17N464m874p6N136o145Q22N699n987J026L940
1274B871o094K825L441n628K427J188l248L666r54k433K681j793L07K981l729
1289a492R03J746k578K134K93k634J712N6l19N94j356J121l51p59K899k791p74
1306a596L902l681P34K928m583K242K543m801K799M78l537M259r72k946M350k887
1322g68k68L560m507J243K917m351K717R83m235L700N1k752L302j535j519K701
1338A239j652J59P11j662J952l67j395K128j433m61K457k549K70J773k023J785
1354I32j63k081J840m07q05K237k763R58K045l107J550J162l380L031N32l683
1370b102L103p49j771L549j569k230K692o50r14K056j827n10J744p67K23N51j460
$$ plain form
1258 -1531 2382 -1345 -1299 2392 -2017 -2134 3330 -1544 -1620 3516 -2629 -1807 3892 -2095 -1069 2871
1274 2871 -3223 -398 3043 -2585 -158 1030 -2218 1448 494 -1939 742 -1051 -744 2237 -1492
1289 -1492 -589 1157 -1421 713 1006 -1628 84 140 -179 415 -941 180 -171 -930 1969 -822 -1596
1306 -1596 2306 -1375 -641 2287 -2296 -54 2489 -2312 487 965 -2572 1687 715 -2231 2119 -768
1322 -768 -1036 2524 -1983 -740 2177 -2174 543 1526 -2709 991 1042 -1710 1592 57 -1462 1239
1338 1239 -413 -254 457 -1205 747 380 -1015 1113 -320 -781 1676 -873 -603 1170 -853 932
1354 932 769 -1312 528 121 -684 1553 -1210 -252 1793 -1314 236 1398 -1982 1049 1581 -2102
1370 -2102 1001 252 -1519 2030 461 -1769 923 273 -641 1415 -412 -922 822 55 278 829 -631
1387f31N45N46n43J08O69r31q9J499j192o45J543j139j33J784j561q93K580j966
1405d49m11K748k419nK427k874M59K323k753O58J375k293J581J651k928P21R31
1422G42j890K048P04l161J518J187k116J971L18l514K130J890k878J841K77l640
1438b573L258J696l860K001M13l926M822j9m182L273l60k783M541j041m333M452
1454A379j014k010M497k557k888M224j622j308M032l100k087M676k440r35L816
1469B663l555j399M738l023p52M072l941j252N029k659j132L867m529j08N230
1484C249l625o56L021m595J289N186m644j079L919m756J767N304n805o93M227
1499B109m426K560M153p641J395M548m975L268K485p795L566L674n578M040J116
$$ plain form
1387 -631 -86 460 -83 25 694 -237 -326 1173 -19 -664 879 -260 -393 1391 -170 -1063 1517 -449
1405 -449 -860 1888 -531 -536 1891 -983 -524 1799 -954 -296 1079 -1214 367 2018 -910 -189 742
1422 742 -1148 900 1604 -1557 -39 1148 -968 1003 1321 -2193 -63 1827 -1051 790 1067 -2573
1438 -2573 685 2381 -1479 522 935 -2991 1831 1812 -2370 903 543 -2240 2301 1260 -3073 1379
1454 1379 365 -1645 2852 295 -2593 1631 9 -1299 2733 -367 -2454 2222 -218 -1153 2663
1469 2663 -892 -2291 2447 -576 -1328 2744 -1197 -2449 2580 -79 -1211 2656 -1873 -1981 3249
1484 3249 -376 -1032 1989 -2606 -1317 3869 -775 -1854 2065 -2691 -924 4380 -1425 -2118 2109
1499 2109 -2317 243 4396 -3245 -1850 2698 -2277 991 3476 -4319 -753 2921 -2657 1383 2499
1514B499p565N626K719o381N120p82o340O545J237n670M991j447m951O690j8n035
1530b762L732n45l889N923m46n235M366o51l987O595r14n904M599o80l788P574
1546C988k824n991O711j567l634P840m804n165Q685l728k125Q043p526k902R647
1561D648n381r35O506q244l10R041o546m41N040p293J866P029o648K63L804o035
1577c636K830N517p092Q52L946o071L706M583p831J751M038o298M145M367q982
1592d175L219M067o885N361K455r129M773L531o701N835O78q667O110K442n803
1607b889N343q21o969O741J232n403M970j627n569P613K17o346N634j858m905
1622d637Q873j780p137P397k980m292J0014m560n851Q504m425k382R393o897l505
$$ plain form
1514 2499 -5066 560 3279 -3102 2018 1236 -5104 1441 2678 -2992 1999 552 -4399 2291 2273 -2762
1530 -2762 970 425 -3464 2459 2013 -3222 1144 493 -3494 3101 2187 -3717 882 202 -3586 3988
1546 3988 1164 -4827 1884 317 -3317 4523 -281 -5446 3239 -489 -2614 5429 -2097 -4999 4648
1561 4648 -733 -1668 4838 -3406 -3716 5325 -1221 -1662 3378 -3915 -2049 4980 -1668 -1405 2399 -3636
1577 -3636 -806 4711 -2381 -1529 2417 -3654 52 4635 -3196 -1445 2593 -3705 440 4807 -4175
1592 -4175 -956 3111 -3774 1587 4042 -5087 -314 3217 -3484 2351 3029 -5638 472 2914 -2889
1607 -2889 2454 1633 -5336 1405 2637 -2766 2204 577 -4992 2621 2838 -3508 2126 268 -4637
1622 -4637 4236 2456 -4681 2716 -264 -4556 5458 898 -4953 3551 -874 -3256 6137 -760 -4265
1637d265P988n411L2O831p827m5O019n409K130L585o934K106L869m353K331J445
1653B092m732J705L360l290J004J906m274N41N282l926j431M762n671P50P107
1668E185o644p20O026p813L138O674r587K565M904q611O942K514j0111P003N42
1683B007o712R422l418o884R276l704k945P946o545j872P144m951M58M294n798
1698b282J271L112k531R54m6j036P2N83J580k254k79K228l105K304K082n045K766
1715C74J217m719N534o62n611O978l371l046Q432o498k077Q176p514J395P175
1730E783r778L083N179q351N521J813p747O014K60m744N626k734k811N253k745
1745c78J4K525m005J969J154k525K315r77j155K226j644O68N59j994K000m19j558
$$ plain form
1637 -4265 3723 -1688 -1656 5175 -2652 -2697 3322 -2087 43 3628 -3306 -1200 2669 -1684 647 2092
1653 2092 -2640 -935 2425 -865 139 2045 -2229 -1688 3594 -332 -1763 2999 -2672 -1922 5185
1668 5185 -1459 -2179 3847 -3966 -828 5846 -3741 -1176 3728 -4883 2059 4573 -5538 1465 2007
1683 2007 -4705 4717 1299 -5585 3691 -13 -2958 4988 -1557 -3429 3715 -1236 -778 3516 -2282
1698 -2282 -1011 2101 -430 524 478 -558 -486 97 1677 -577 -856 1372 -1733 571 2653 -2392 374
1715 374 1591 -3128 2406 1744 -3867 3111 -260 -3306 5126 -1372 -3449 4727 -2787 -1392 5783
1730 5783 -3995 -912 4267 -4084 1437 3250 -4497 1517 1777 -2967 2659 -75 -2886 2367 -378
1745 -378 -364 2161 -1844 125 1279 -1246 1069 92 -1063 1163 -481 187 746 -1248 752 333 -1225
1762a225L788l542k13L915m800J942K989n986L618K197n955M804j00n016N789
1777B205j571l127N595l739j067M425m555J241K980n120K808J781m260L653j05
1792A144l606L459m80j893K703j977j18J890j383P43l04j003J431j129L66J260
1808A103k401J351P98j870J588j16j780K570j048j479K352j623J80J901k380N15
1824c39J071j996J608L36k259K099J38k148K426p57j433K052n74j318J827r13
1840a80l34J240r52k91Q88o70M6N10p17N28J74n10K36J99q30O91L54q37M52P4
1860G1n23L95O05n52m67O15l42j81O71j79q96J032p2q94O89O37j259J112k69j405
1880a212J667j32p75Q45p44m56J831j260k24J276j909J159Q53k178J270P73k470
$$ plain form
1762 -1225 2563 -979 -1192 2723 -2077 -135 2854 -3132 486 2683 -3272 1532 1432 -3584 2205
1777 2205 634 -2493 3102 -637 -1704 2721 -1834 -593 2387 -2733 75 1856 -2404 1249 1144
1792 1144 -2462 997 517 -1376 1327 -650 -768 1122 -261 482 178 -825 606 -523 -157 1103
1808 1103 -1298 53 851 -1019 569 453 -1327 1243 195 -1284 1068 -555 -375 1526 -854 -339
1824 -339 732 -1264 344 680 -1579 520 658 -1490 936 179 -1254 798 224 -1094 733 -180
1840 -180 -514 726 -226 -517 371 -299 -253 257 -460 68 242 -268 -32 167 -663 28 382 -455 -3 71
1860 71 -452 -57 548 -4 -471 144 -198 -379 292 113 -783 249 177 -717 -28 609 -650 462 193 -1212
1880 -1212 455 323 -452 393 -351 -807 1024 -236 -460 816 -1093 66 919 -1259 11 784 -1686
1897a686K403M69l084K337L6j946K656j048j478K313o79o70J184j307M7R58p22
1914b17K6M40r71P64K30k11J26m09L05n63K34P70j191P40N43j516J730o9k003
1933a242J850l81j605K986j524j733K830j383j031L344k802r44L364k717Q26K112
1949A950l338P09K040k527J958N99l503K296R72k235J969p40j781K255J91j217
1965d02O70l56j132J924L39j640J22P14j006J160O38j767PJ624j921J166J383
1982A523l151J380J064j862K143K97l373K568L80k487L123j039k753L326o76j690
1998a227L359k767j641L603j265n33K263k917m39L776k069q56K127k659L56L084
2014B195k189o30J171j714O10K755k371j001J719j374R51K051k708p98K416j591
$$ plain form
1897 -1686 717 1186 -1898 439 475 -1471 1185 137 -1341 972 293 -377 807 -500 -453 505 -217
1914 -217 -191 249 -722 42 272 61 187 -222 83 -480 -246 524 -667 73 616 -900 830 761 -1242
1933 -1242 608 227 -1378 1608 84 -1649 1181 -202 -1233 2111 -691 -1635 1729 -988 -162 1950
1949 1950 -1388 -679 1361 -1166 792 1391 -2112 184 1156 -1079 890 150 -1631 624 815 -402
1965 -402 268 -88 -1220 704 1043 -597 -475 239 -767 393 1031 -736 -729 895 -1026 140 1523
1982 1523 -1628 -248 816 -1046 1097 1394 -1979 589 969 -1518 1605 566 -2187 1139 463 -1227
1998 -1227 2132 -635 -2276 1327 62 -471 1792 -1125 -1564 2212 143 -713 1414 -1245 -889 2195
2014 2195 6 -624 547 -1167 -557 2198 -173 -1174 545 -829 122 2173 -535 -1333 1083 -508
2030e08O07J991l245n39L342j950M75J804l858J082K902k903J252J185m258K169
2046d52K525l229J715O23l698K991J488l273J911l65k744L708J55k902K108n71
2062a0j976L517k77k970J996l40j272L057j005k432K056j41j244K579j172k574
2078b208K582R7j451K600j586k386L637m23k111L029k139j902M442j922j633L050
2094A676k620j240M614k404j049K640k709J18L206k797m02K461l336J529K583
2109B270l325M83J777k578J264J984l110O52J676k313J234J927l711R25K201k528
2125a172J267J385l404J347K009k675J715J076l894K279J848l143J905J17k784
2140b124K954L82k836K594o73k351L105l69k344K798j040j481K842j023j798K271
$$ plain form
2030 -508 99 2090 -1155 -1694 1648 -302 173 1977 -1881 -799 2103 -800 452 1637 -2621 -452
2046 -452 2073 -1156 559 1182 -2516 475 1963 -1310 601 236 -2508 1200 1355 -1547 561 -10
2062 -10 -1986 1531 1254 -1716 280 -60 -1332 1725 720 -1712 344 203 -1041 1538 366 -2208
2078 -2208 374 471 -980 1620 34 -2352 1285 862 -1249 1780 -359 -2261 2181 259 -1374 1676
2094 1676 -944 -2184 2430 26 -1023 1617 -1092 -974 2232 -565 -967 1494 -1842 -313 2270
2109 2270 -1055 -572 1205 -1373 -109 1875 -1235 -583 1093 -1220 14 1941 -1770 -845 1356 -1172
2125 -1172 95 1480 -1924 -577 1432 -1243 472 1548 -2346 -67 1781 -1362 543 660 -2124
2140 -2124 830 1212 -1624 970 297 -2054 1051 682 -1662 1136 96 -1385 1457 434 -1364 907
2156I07q56j526K818p53k233K202l36j667K417n87k130K781o62j897L047j297
2172B28k030L207j564j088L367k965l60K945k762N18K361k902J42K313k381Q40
2188a31J631l050J147J494k215P23J285j929R55J142j806N20Q58j402O94J436
2204A352k151L75J208j515L43J598k169P21J707k616J194J191k784J905Q47l009
2220a803K633l39k387K832m54k263L100r49j730K653j244j251K342j692k78J780
2236I50j163j95J151j274K98O96k12l20J67j13m06N84J29q59R19r8j001J327m13
2255A67j309K193r29p93J915j767n86K608j826m55K282k581O10J927k302Q04R39
2272H97k057J426L86j809J834n48p75J539j097o0Q34q70K93N66j027N77j28q0
$$ plain form
2156 907 51 -1475 1343 590 -1643 559 223 -1444 973 386 -1744 1037 375 -1522 1525 228
2172 228 -1802 1405 -159 -1247 2120 -845 -1205 1740 -1022 -504 1857 -1045 -903 1410 -971 -131
2188 -131 1500 -1550 -403 1091 -1124 -401 884 -1045 -90 1052 -754 -234 624 -778 -84 1352
2204 1352 -799 -424 784 -731 -388 1210 -959 -238 1469 -1147 47 1238 -1546 359 1206 -1803
2220 -1803 830 491 -1896 936 482 -1781 1319 370 -1360 1293 49 -1202 1140 -552 -830 950
2236 950 -213 -408 743 -531 -233 463 251 -69 98 -15 -421 163 292 -567 352 254 -747 580 167
2255 167 -1142 1051 122 -671 1244 -523 -1109 1499 -327 -782 1500 -1081 -471 1456 -846 -42 897
2272 897 -1160 266 652 -1157 677 129 -646 893 -204 -264 570 -300 -7 559 -468 109 -19 -99
2290i9K55l30N37p2q12J280o99n72J546j244k38J393j685P53P25j757J525J67
2308F73j569J654m96j127J777j114k49J166j024r2J448j472N18O68j735J116M17
2325E59r94P07j77l31O76l38k61M28k63M81m54k42Q84p88K83M49j197P76K83j050
2345e69Q06O3o54J007p55j12Q95j343M37J221j718P29N32j390J393o6j173J161
2363D64l39q71J168n56l40J118q10j1Q16p07k4M29m25J00k21K10Q4m75P77m39
2383e2k15M73k87R4N19r64N48j4r51R27j7l73O87k74q89J542q98l80J295j322
2403e51Q3J288j343P5J045j039L44P41r99M81Rn07L13K87l59J46j04l93M84R2
2423I3n53M05%j39L40P0l86j15Q12r71M15L36j315P78P24r00N02L39j133Q80J5
$$ plain form
2290 -99 156 -174 363 291 -521 759 60 -512 1034 -210 -448 945 -740 13 738 -1019 506 673
2308 673 -896 758 262 -865 912 -202 -451 715 -309 -401 1047 -425 93 761 -974 142 559
2325 559 -435 272 95 -236 440 102 -159 269 6 487 33 -209 675 -113 170 619 -578 198 481 -569
2345 -569 237 300 -354 653 -102 -214 681 -662 -225 996 -722 7 539 -851 542 476 -697 464
2363 464 125 -746 422 -134 -474 644 -166 -177 639 -68 -92 337 -88 12 -209 1 85 -390 387 -52
2383 -52 -267 206 -81 13 532 -432 116 102 -849 78 61 -312 375 101 -788 754 -144 -524 771 -551
2403 -551 -468 820 -523 -448 597 -442 -98 643 -356 125 134 -373 -60 227 -132 14 -90 -483 1 93
2423 93 -460 -55 -55 -194 146 216 -170 -285 527 -444 -29 307 -1008 -230 494 -406 96 435 -698 182 197
2444A97j015J043j96p62J020rp68J024p18n39J407o98k67P16r18J71J009n49l77
2463b29M65l26l35J041n46o74N24l7M5Q96q87p47J034l48kR95j572j82J594r64
2483b55P6R07j366L94J156r99M6M69j375J104P96j288M33K60j275J058M59r30
2501c30O03k44q53Q10Q12j024K37j3m47J082l7j282M75O44j070J082K68j575Q41
2520b1J93p67J186j41j780J415J22n97J381p25j413J553k07o94J337j401l69J765
2538H37q21k35L96r97K85J617p41o92O73o37J45J102q69n66Q07o03N4J204j010
2557e1k64O76n67J42P71r45r9O03l88K64L37j040J23J076r65L02P84j699P46J141
2577I47j360O48L43j476J031J047j564N73K47j339J062P53j589P60P6q48J485
$$ plain form
2444 197 -818 225 29 -733 287 278 -490 534 -184 -723 684 -14 -281 435 -483 -312 697 148 -229
2463 -229 236 -90 -425 616 70 -604 -80 -117 -72 824 -63 -810 224 -124 -126 869 -703 -885 709 -255
2483 -255 -179 728 -638 -244 912 -87 -41 428 -947 157 953 -335 98 358 -917 141 600 -330
2501 -330 273 29 -824 -14 798 -226 11 -2 -449 633 596 -686 -211 433 -637 445 713 -862 -21
2520 -21 172 -595 591 450 -1330 85 207 -390 991 266 -1147 406 199 -495 842 -559 -928 837
2538 837 16 -219 177 -820 -535 1082 341 -351 322 -315 -170 932 63 -503 304 -299 -245 959 -51
2557 -51 -315 361 -206 -64 707 -238 -337 266 -122 142 479 -561 -438 638 -327 -25 759 -940 -194 947
2577 947 -413 235 578 -898 133 1180 -384 189 436 -903 159 912 -677 83 159 -689 796
2594G96q4j400P42J13n52J271o87r92Q08J04l15R97p38j019J216L0n75O94n64
2613a55o63J295j97p02Q89m73o73J103J31j327J211n72m68J492p21p74J328o61
2631F3o19J388j074m76J262n97K5Q63j126k92J136q30K63Q68j389K79O84m59J16
2650H5N30j189J35J015r28K25M14q27K19R91p95j92O14p64L81R31j090k02O46
2669A99p46M10R28j523M82O43q14Q94J10j379R34K82j188J266L3j322R41K74q18
2688c94O30j95p44J322m05n02N08l00l95Q11L12j214P36l05l90P32K6j161J085
2707A57J4o35R75m48o59P34k47l76J078m37r61J357p47j3P05p99N0Q89j130J47
2727c46Q84r04K58M91m21K36O1n69J91M38l23l7K71n45K23K92l23J28K49m91j35
$$ plain form
2594 796 712 -688 54 167 -385 886 199 -793 15 119 -196 801 63 -956 260 290 -285 409 -155
2613 -155 -818 477 280 -422 467 -6 -679 424 555 -772 439 -133 -601 891 170 -604 724 63
2631 63 -556 832 -242 -718 544 -53 -28 835 -291 -583 553 -277 -14 854 -535 -256 428 -31 85
2650 85 615 -574 -439 576 -352 -127 287 -540 -321 670 -125 -317 297 -467 -86 845 -245 -447 199
2669 199 -547 -137 791 -732 -250 393 -421 473 583 -796 138 420 -768 498 531 -791 150 424 -394
2688 -394 236 41 -703 619 214 -288 220 -80 -475 336 648 -566 170 -135 -525 207 233 -928 157
2707 157 171 -464 511 63 -596 138 -109 -485 593 156 -805 552 -195 -208 497 -302 -252 637 -493 -346
2727 -346 538 -366 -108 383 -38 198 259 -310 -119 319 -4 -41 230 -315 -92 200 -123 5 254 -237 -372
2748c72O30n32J26O22j032P62K56j014Q48j04q25P96K59q96O38m9r29J159m32
2767h9l58P46l19m13Q60m66m19N07k53K24O1j63KJ20j23R0K35l53M3K66no20M47
2790B0Q2n28Q69k60m67O25m04n07R16m33k59P91p88o0O74q80O28J76o99N40K57
2811B93q22P14M9r27J311m03o47O51m05K12K85n77K53J52k51J37j07K93p0k58
2831a17J69jl5m3k34L1N54m40K97K55p41K28M75r31P75Nm62O18l37m81Q40l98
2853B7n37P92n32j38P78n76M20N8n43L08m9j85rK35Q0J06j49J34N6l85K77k95
2875a27J99Kk36J56Qj96O5L11n05O44m98n6M43l49J27N91r93N68J15o05L53L37
2897C54p65N94J40o85N92J1k38K05j07j70M26l19K9k76j32N20J04m10K54k05L42
$$ plain form
2748 -372 258 -274 -148 474 -558 204 460 -554 294 190 -635 161 420 -476 162 113 -816 343 -89
2767 -89 -447 299 -20 -433 427 -39 -458 49 -204 20 81 -82 -80 40 -83 7 242 -111 -68 198 193 -427 20
2790 20 102 -426 443 183 -284 341 -63 -570 346 -87 -346 445 -343 -403 271 -609 19 195 -504 36 293
2811 293 -529 185 234 -693 618 215 -432 219 -186 26 311 -266 -13 139 -112 25 -82 211 141 -117
2831 -117 52 51 16 -27 -261 -230 324 -116 181 436 -305 -77 398 -533 242 247 -215 403 66 -415 425 27
2853 27 -510 282 -250 -388 390 -186 234 292 -251 57 8 -177 -186 49 129 235 86 220 276 -109 168 -127
2875 -127 72 74 -162 -6 2 -194 -129 182 -323 321 -177 -233 210 -139 -12 579 -414 154 269 -336 17 354
2897 354 -411 183 323 -362 230 241 3 208 101 -69 357 38 67 -209 -341 179 283 -127 127 -78 264
2918B64l25q4J78N5k64K65k38J68J3l97P35j47m02L41j37n96J127o19k46Q95p74
2939a88o6P58p15Q3M28n13qN84o93M82o7k41L80J7l64J42J04l78M06J03n71N19
2961B02Jk40K17O1l69lL64j16k23M61n88J46L81n42K73K99p05M40K66q97R79l62
2983D5n60J045l75m28N51l68l34J059n08n48N93l21J60N07m09l87L46k93j30O58
3003C03l37j72K84q1k14L80j45n10N99R2l80N63n72l41R97p08kL59k86j29J042
3024G42r69K01K94o42K57P17r50M12J71q88O12P82r96L61l33l23P42J20p46L60
3044g6K80m25N74J77q37M14j50PQ1p8j74K91K38n66M29j53m94M58L87o13M12l81
3066a99J6M21J05p23L79r6l10P04J06q96N17m3l71P72l17m72O76l97J10O02n21
$$ plain form
2918 264 -61 -145 33 88 -176 89 -149 19 32 -365 370 223 -179 162 25 -571 556 -63 -309 586 -188
2939 -188 -254 504 -211 -128 300 -213 -221 363 -330 152 85 -156 224 241 -123 19 123 -255 151 254 -317 202
2961 202 203 -37 180 241 -128 -131 233 117 -106 355 -233 -87 294 -248 25 324 -381 59 325 -572 407 45
2983 45 -515 530 155 -273 278 -90 -424 635 127 -421 172 -149 11 518 109 -278 68 -225 -355 303
3003 303 -34 -206 78 -3 -217 163 18 -492 107 199 -181 382 -190 -531 466 -242 -244 115 -171 -300 742
3024 742 -227 -26 268 -374 -117 600 -350 62 233 -655 -43 739 -257 104 -229 -552 190 310 -436 -76
3044 -76 204 -221 353 530 -307 107 -43 -36 45 -33 -207 84 322 -244 185 32 -462 -4 383 -230 182 -199
3066 -199 -183 238 343 -380 -1 -97 -407 297 403 -493 24 -19 -390 382 65 -407 269 -128 -18 584 63
3087F3j48L23m26P4N52p02k9K70j97L16Q5n41K29M41l35j33M51o42K80P22o96
3108d3j13M27o46N52J41n78M11k53j71L61K30m40J43K72l48N00k21m76J38L1k1
3129a04M37l35o14N83K48j14j47K5m67N83K50k60p0k29N0M92j9o69K31M7l3N26
3151D11m65J41j27j0K00J16J96p14K72J79k79P1O3k68K60J62j68K15m21j36N40
3172B38p6j42J23m14J17J63K01j79nk58J68M04l25j24L83n31K38K49l66J94QM7
3194A13o2K38k19j44J0J08n5K11k76j15K47N3O7O9m03K43k4k85L92k33k22L20
3216C3J37l89J84L05n22J07N70n11K47O7m14L56l7j96L14k09j35J86k1Q6q3j50
3238g5K27j06K19j13k29J20q5L0k70J55M04l33j11M74l42l52M31k61J47M39n90
$$ plain form
3087 63 -85 238 -188 -114 438 -264 -293 -23 -220 96 181 -360 -131 310 -25 -158 293 -349 -69 653 -43
3108 -43 -156 271 -375 177 318 -260 151 -102 -273 88 318 -122 21 293 -55 445 224 -252 -114 -83 -104
3129 -104 333 -2 -616 -33 215 101 -46 -21 -488 95 345 85 15 -214 -164 328 309 -360 -129 -82 -115 411
3151 411 -54 87 -40 -50 150 266 462 -252 20 199 -80 -9 54 -214 46 208 40 255 -166 -302 238
3172 238 162 20 143 -271 -154 9 210 31 26 -232 -64 340 15 -109 274 -257 -19 230 -136 58 66 113
3194 113 51 289 70 -74 -64 44 -11 200 -76 -191 56 109 176 245 -158 85 61 -224 168 -65 -287 33
3216 33 170 -219 -35 270 -252 -145 425 -86 161 228 -186 170 133 -63 251 42 -93 93 72 158 75 -75
3238 -75 152 46 265 152 -77 43 -42 -12 -282 -127 277 -56 -167 307 -35 -387 44 -217 -70 369 -221
3259b21K94J27nj22J03m6r2n3n0M6J95j83j02K24k13m6K63l5M6K95n60m2K28l38
3283b87M05j92m4J90O7k80L82P2l18K7N0k03k0K42O0k61J67k74K73n3l97N00j60
3306e4MK39k56j3J89k74p7K58L11m29M35n64J24k4K7kJ35k2J61l51RP3J78k45
3330a68O7J62J29m22K86K62m46J22j37M2K41j82l2K18l56N29k41m57N64k47k75
3351c41L65o1l6j6P1J44j00J90k65kjq7J75kj29k07l8K88o3m7K75k03K65k01R2
3376F6k05P1N0J60k14L02j39L0k21p6NL00l50N6L81r6l55O91n57K09q9m24K97
3399a08L25j56j8J49l00J45j07P1j55K68L1l30J44j2j32J04L22l48L66l38j38
3420b17L74k93J17R2k64J00M76k97k52N15o68K00L61n07K91rj20Q7l0j06K83k74
$$ plain form
3259 -221 73 200 195 73 176 130 38 -15 -65 -19 176 -7 -109 115 -98 -144 119 84 130 425 -135 -177 51 -287
3283 -287 118 -74 -118 72 139 -141 241 313 -5 22 72 -131 -151 91 151 -110 57 -217 56 3 -394 106 -54
3306 -54 -50 189 -67 -80 109 -165 -242 16 327 -102 333 -231 -107 -131 -104 -106 29 7 168 -183 -174 -101 77 -168
3330 -168 -101 61 190 -232 54 316 -130 -8 -145 -103 138 -44 -76 142 -214 315 74 -383 181 -66 -341
3351 -341 24 -37 -73 -89 -18 126 26 216 -49 -51 -52 -139 36 34 -95 -302 -340 -52 -115 -162 113 -90 175 -26 66
3376 66 -139 -68 -18 142 -72 230 91 121 -100 -176 -171 129 -221 -165 216 120 -235 456 -101 108 19 -405 -108
3399 -108 217 61 43 192 -108 37 -70 1 -154 114 145 -185 -41 -53 -185 -81 241 -107 259 -79 -217
3420 -217 157 -136 -19 73 -191 -91 385 88 -164 351 -317 -117 244 -263 28 19 -101 -14 -44 -150 133 -141
3442a41J46K98l33Lq9J49r9p7K6M75o62j3M75l96K97j40K87l68r5K74J64n37M73
3465A17P7l85J70N0k33L65k27j00N18l31j95M01j89j73K71l11J79K64p6l95K64
3486F1n4l13P15m43J49k06j93K14m8N4pL32k14J16J90m85r4M04m29K98Q1m34K64
3509d2J44L7k96K74m31J94N34o21M94K5o09N37j93l52N17j73m25N52j00l96L72
3530D2n6k40N29n9n68O47k89j64L80l59q2J21K78j06p3j66M81j94Q2k55J25Rm41
3553c58O15k25j85P9j7Q2N2J46m48M02l15j18N44k44o9J18j01k29M04j84J28m4
3575C3j80O57o16k51L03K05m05J11L49k69L16L2o05N03j87m34N45J36k14J5P0
3596A14n09M75jk16J59j98JJ40J35l25p1J07N8L57jn75K21j16M1L28M5k86N9O0
$$ plain form
3442 -141 5 303 -30 -27 -116 33 -66 -143 -117 358 -304 -317 158 -238 59 -81 206 -162 -257 17 181 -356 117
3465 117 194 -191 -21 29 -204 161 -66 -166 352 21 -174 227 38 -135 136 -175 4 268 192 -203 61
3486 61 7 -306 409 -34 115 -91 -284 -70 -118 -64 -71 261 47 163 353 -132 -226 178 -251 47 128 -306 -42
3509 -42 102 139 -157 117 -314 -120 414 -207 287 312 -297 240 47 -305 212 39 -386 166 66 -330 42
3530 42 -14 -254 275 216 -352 295 6 -158 222 -137 -219 -98 180 74 1 -165 316 122 204 -51 74 83 -358
3553 -358 257 32 -153 -74 -91 -9 43 189 -259 143 -172 -290 254 10 -59 59 -42 -271 133 -51 77 33
3575 33 -147 510 -106 -357 -54 151 -254 -143 206 -63 253 285 -320 183 -4 -438 107 243 29 44 114
3596 114 -395 80 79 -137 22 -176 -175 -35 100 -225 -296 -189 -131 226 225 -350 -129 -245 -204 124 169 -117 -58 2
3620BQ8J58k35k65J24K96l76M41m34nJ84j3J26Q1k58P0L59l73Q0J2l31J18K71
3643A20j33j44%J53m6N20k48m12J12J18P0J31j64k08K29J70k70K9j24J01Q3k32
3665a45j08J84k32J66J11M0j32J04q7r0K35m8J00k77N24q1k32l42K65l6J29j39
3687i1K33j78mKK23j98L5k14K05O0j64J84k73P5L07k59P1J32k14P3L4k72J88J57
3711A12k13k41L57R1p6J64j98l2L61m01L34l44j47L40o5L6k54K54j98J18P5l7
3733C6q8j99L64k32O4l2J49J84l86J51p3m8J94J17l46M0j72L7M30K00n93Q0K45
3756A22q8K6P3%k50K48k85L40j78k21M92j68j19K18k07L1j23K2Q1J02j36o0J83
3779A03L41m79N8Q0j11J57j19k8K69j91l48M70j9O0k45J58j23n9J84j74K04l33
$$ plain form
3620 2 90 248 13 -252 -128 168 -208 233 -201 -206 -22 -35 91 172 -86 -16 343 -30 50 62 -269 -151 120
3643 120 -13 -157 -157 -4 -50 470 222 -190 -78 40 110 241 77 -131 98 268 -2 27 -97 4 87 -145
3665 -145 -253 -69 -301 -135 -24 16 -116 -12 -99 -189 46 -2 98 -179 345 264 32 -310 -45 -81 48 -91
3687 -91 142 -36 -40 -38 185 -13 22 -192 13 73 -91 93 -180 -105 202 -57 14 146 -68 5 39 -233 -45 112
3711 112 -101 -342 15 106 30 194 -4 -36 325 -76 258 -86 -233 107 42 78 -176 78 -120 -2 73 36
3733 36 -52 -251 113 -119 -55 -87 62 246 -140 11 -62 -110 84 201 -145 -105 -277 -240 190 390 -203 -123 122
3756 122 34 60 133 133 -117 131 -154 186 8 -213 279 111 -8 210 3 34 -89 -67 14 116 -20 -80 103
3779 103 444 -35 23 103 -8 149 30 2 271 80 -268 202 183 243 -2 156 33 -26 158 -16 188 -145
3801a45M9J40j39J08l6j1K43j75j19K30j89k4L1O2j4r1j73M78j91Q7n5j49K3N7
3825cN5j9j8L6J45j03k93K45OJ16k37O8M5K8q2Qj98LJ25O8M9k79J35QJ20M9q4
3852gN7j35J48K8l34K94J58k08K43m92M97j47l8K5J41j71L9j63q4J42J52j86j02
3875a43L6l1L27l09K92l42Q6m8j36K41K51m46J23q1J62L23j45r7l93L89k92K89
3897E6k1k03K14o06M91J4K72j58r9o4J04j38P9r8K62P7k79K98j81r5k23M78%N2
3921B32m5l31K09k13J02R5J4J5k72K35o4R0m1k8L6l8j37K21q0J77j17j34J94k90
3945a70j18K92q2P4J24L5l46M07k80k2Q5qq7k09L00k52L15j78Q1j6J81l39K50
3968C7J08l65K26l9j06K06J81n80L88l0l37R9N08k68O2k10o2L49j93q4L59l73
$$ plain form
3801 -145 -96 44 -95 13 -23 -34 209 34 -85 145 -44 -68 -37 25 11 -80 -253 225 34 121 66 -83 -60 -3
3825 -3 52 33 15 51 196 93 -200 45 51 167 -70 -2 43 71 -11 -3 -201 -198 -73 -5 44 -235 -100 -92 28 77 -7
3852 -7 50 -85 63 91 -243 51 209 1 244 -248 249 102 64 89 230 59 98 -65 -149 -7 145 -41 -143
3875 -143 -107 -138 189 -120 172 -170 -84 -132 -268 -27 224 -222 -99 -180 -18 305 160 63 -330 59 -233 56
3897 56 35 -168 46 -560 -69 -55 217 59 -40 -104 0 -138 -59 -157 105 182 -97 201 20 -75 -298 180 180 232
3921 232 187 -144 65 -148 -46 49 63 78 -194 41 -23 67 26 -2 34 -4 -141 80 0 177 60 -74 120 -170
3945 -170 -288 4 -78 -4 120 155 -191 216 -64 -86 -1 -9 -96 -305 -5 -257 58 -120 -39 -55 126 -213 37
3968 37 145 -220 6 -33 -139 67 248 -332 56 26 -311 -212 296 28 90 -120 -182 167 -26 -110 249 -124
3990a24k6J07K59l23R1O9l50K91k2O4Rl1JK11j27j05J96j58q8Q7K2p4K81j87L0
4015A03N7k04K1Q7j12j9M61m82J73k73J7M34Q4m86j50L37k6l19K74k60K24Q0j52
4038a31K14O4l03J40L63k67n1M5pq1M7k94nL07r9p0K14k33K12k78j14L25k54P6
4062a80L59k53L1J11j75J87Q2k4l08K44Q8k64K88l24j32K75j0j99K09M8k06K03
4084E0j82J42J29n78N02J27m31J22J06J65l7k99R1q2M95k96OK27k13%r7l2KL20
4108B37m92K97R2k29K95j60p6p9p5L28M1k5l73K69q4j12K49j58j11K13O9k69J54
4131ALj61mK87r0j26L9K0R3j27J87j48J10j06J30j46j45L04l9r4%J3N9o2j17m3
4157a62OK97K5j60q0Q6m9M6k20L84k47k46L46N7j69J62Ml61J55J37j02L53n17
$$ plain form
3990 -124 -150 -43 216 -107 -16 53 -297 -6 -28 36 45 14 15 226 99 -6 190 32 -56 31 53 -21 260 73 103
4015 103 160 -44 -23 64 -48 -67 394 -88 85 -188 -171 263 347 -139 -289 48 22 -297 -23 -283 -59 21 -131
4038 -131 83 147 -156 -16 347 80 29 74 67 -14 33 -261 -266 41 -58 -128 86 -147 65 -213 -327 -2 -256 -180
4062 -180 179 -74 -43 68 -107 80 162 138 -170 74 162 -102 186 -138 -270 5 -5 -204 5 53 -153 50
4084 50 -132 10 139 -439 63 190 -241 -119 -13 152 115 -184 -93 -175 320 24 30 257 44 44 -53 -85 -83 237
4108 237 -255 42 134 -95 200 40 -36 -115 -190 138 179 154 -219 50 -34 -146 103 -55 -166 47 116 -153 1
4131 1 4 -157 -161 126 36 -90 -51 -31 62 -65 122 -26 84 -22 108 -38 -183 121 82 -12 -12 1 60 -2 -119 -162
4157 -162 -156 141 166 6 -74 12 -37 9 -211 173 -74 -320 26 83 -86 76 80 -281 -126 11 -91 262 -255
4180b55L1K70L5k63K73R8k42o8M8Q1J65j31j08L7n8L1j15o4K33J0k60K94q9q7
4204a34J79r0K08l24J93L5j45J83j17Q3k68J9L66n7m13N44m10L27l7j34j1J76
4226A73j59R8J72j79r4j49M90k84n2r6K9O6j44J02M3q7k5K02j29J07K9m41L47
4249A9N9j1j13N7k72L97n3n7j53j53K64J05j30J51l45J23K36J95j98j33p5K54
4271A67k38p9L33r1j76k1J65j56J76j10M2R4m9l02J90K80l81K68n2N0j0l83M36
4294A53j54j42J41R1j76L65k66J6j29Q8j15L16k74M8K86k72R1j70K08K9k13L14
4316B35j81l2q6L6l18J07Q3p8J88K6J13j02j19L43k16q6N6m4OJ69j82K07k00L47
4340B72k03k74K18oL54k99k1o7J44p5k3j34J36J68k52j33J48m8K32r8l53L40p5
$$ plain form
4180 -255 -224 46 81 -182 91 189 -53 -121 -73 8 173 42 -66 -29 -87 -56 -171 -235 -2 8 -252 42 -47 -134
4204 -134 45 -45 163 -161 32 67 -78 105 -12 71 -197 -178 188 131 -282 262 -148 179 142 8 -3 173
4226 173 14 112 284 105 11 -138 352 68 16 -80 -51 15 -129 -27 16 -71 -96 106 -23 84 113 -328 19
4249 19 78 67 -46 11 -261 136 83 26 -127 -280 -16 89 -41 110 -235 -112 124 319 121 -12 -87 167
4271 167 -71 -150 183 92 -84 -105 60 -96 80 -30 12 106 57 -245 -55 225 -156 112 60 110 100 -283 153
4294 153 -1 -143 -2 89 -87 278 12 28 -101 -13 -128 188 -86 -38 248 -24 67 -103 105 134 -79 235
4316 235 54 22 -64 -28 -346 -239 -156 -234 -46 -20 93 -9 -128 215 -1 -87 -31 -75 -69 100 -82 125 -75 272
4340 272 69 -205 13 7 361 62 41 -26 118 43 20 -114 22 190 -62 -195 -47 -95 137 39 -314 26 -49
4363d9k13K50nN2J88l3j67j0Ok49K05L06n46N19L2l61K52l92Q1J5K01k06J92q5
4387a7m8J33j94nK03J02k54L5j34K92k68N6J26l4K03j40j86L08k89R9K6Ko8R0
4411C8R1j03kj89J5L03j09K55o20L86N0l9J13J20m12mL10k61o7J3K67k20P7k03
4435a91J62O3R1p5k34J61j01j67R0L28l10K86k69L68k93O6K14k00R5k99N38l44
4457b1j12N2J13j02Q8L1j89R1J12J23j62J9n2JR5J88l01l3J78J17k45r2L57l70
4481a14k15R0J35N6l19M56k1k08l9R3J20K05l31J81l06QP2QJ58j55M2P4m9R9j62
4506a22l3M1K53j16l0q7RR2J31k92k0J50J98j68m3r7o5J77K14l30O5q6K65q5K07
4531B28k60k3R3j73o2J21J72j47o6J19L05k48j96j94M94j60l5l5O6k85P8L91j92
$$ plain form
4363 -49 -262 -12 -17 35 223 190 23 13 19 -230 -25 281 -265 254 286 -75 177 -215 -134 -119 82 -124 68 -17
4387 -17 -65 68 -126 -131 72 174 -80 -45 -179 113 -155 -99 27 -7 196 56 -130 178 -111 -12 14 16 -52 38
4411 38 129 26 24 -165 -150 153 44 299 -321 65 115 76 189 309 -103 -107 203 -58 -125 -112 155 -65 12 -191
4435 -191 -29 34 125 50 -184 -23 -124 -291 -201 127 -183 103 -166 202 -91 -25 189 -11 84 -215 323 -21
4457 -21 -133 -81 32 -70 18 49 -140 -49 63 186 24 43 -9 -8 87 275 -26 -59 119 236 -9 -101 256 -114
4481 -114 -329 -239 -104 -48 -367 89 68 -140 -179 -86 34 239 -92 89 -217 -209 -137 -129 29 -126 -84 -10 -59 40 -122
4506 -122 -155 -114 139 23 -7 -94 -85 7 138 -154 -174 -24 174 6 -37 -134 -199 -22 192 -138 -73 -159 106 21 228
4531 228 -32 -55 38 -135 -197 -76 96 -51 -117 2 307 59 -137 -331 163 3 -32 -67 -1 -286 -208 183 -9
4554iq6O0j22pJ1P38m90j61J86k51J10n9J71l40J24N1O7L3J9J2k09J09n2L07l04
4579i2j72J41J89J84p1j26n0L6O8j20j87l9J2J34K9L0n1j55K71p3Q6k16P6M6M1
4604ir6j75j14N40j15j93K00q7M4k85L39k12K71m20K31K85J3m0r2k9Q5l16l1J11
4628i5r0M20n58K58J45o8o5j77L10j92L08l25M15l77k6L2o9j05L05k97M91j60
4650H0k20J89J8p1J63j67j1J40P7l23q5N1P8k12L97k22N1m0K93j54o4j46L00j78
4674e6J71j19J12l07n5M68j28j00p3j9J40j73K37r0j26J77L9J0j21rJ42j90K29
4697A59l42Q1K14m2j12m5J54K49l84K2p8J91p9j33O6J96k68J70J02j42n7q9J29
4720c8J2K11q4L8k79L77j40j01R1o5L26j99l5k80J94k66N8J35K86k68J50j33J4
$$ plain form
4554 -9 -95 -35 -157 -164 -153 585 95 -66 120 -131 -21 -80 91 -249 -125 -74 -7 26 45 57 -152 -43 -95 212 -92
4579 -92 -264 -123 66 250 179 53 3 39 107 -13 -200 -239 -227 -93 -64 -34 -85 -240 31 -42 44 -172 -96 -50 -9
4604 -9 -105 -280 -394 146 31 -162 38 -49 -5 -290 49 -163 108 -312 -81 204 217 177 85 56 141 -175 -206 -95
4628 -95 -185 235 -323 -65 80 12 -53 -230 80 -112 196 -129 286 -91 -117 -85 -154 -259 46 -251 240 80
4650 80 -140 49 67 -4 159 -8 -19 121 198 -125 -210 -159 -81 -293 104 -118 -67 -107 186 32 -32 -178 122 -56
4674 -56 115 -4 108 -199 -254 214 86 -14 -87 -106 34 -139 98 8 -118 59 98 108 -13 -22 120 -70 159
4697 159 -183 -102 112 70 -42 -87 67 316 -68 -46 -124 67 -12 -145 -79 117 -151 19 121 -21 -78 -167 -38
4720 -38 -26 185 101 139 -140 237 97 -4 87 22 348 149 114 -166 28 -238 -180 -45 241 -27 123 -10 4
4743Dm7J8M04n85K37l80N36M6j38j60L00q6o9m6m12M14j01l4K16j95j75K46J56
4766A49k28%J54k7p8J06M9k27J98j14jOr2L01k94o6J83j52J14K10j43L65m34J69
4790A48j85Qj5K7K78j57m06K24J62r1J33k98J57J92j58P6m76N22k8l21J88L3P3
4813H6k7j24J22l90J62L17k52J9J00J57q2j46O9j54K09J01j40j49Qj85J17P4J61
4836E3L2P7q6j25J32j74M49l96o0J72J09j35O1M4j23j51O4J37J07k27j60L57k10
4859e3r6J72j01N6K6L82j56n14N10k74J59k08J25k04J20K8Q4k62L69k17K96k64
4881b2p5m2L83j90Ok21L8n6J47K36J9j53K1j29J26Lj56l2J97Q9l08L41m45J49
4905g4K7J71p9j6l8k6K39j56j46K58l43J34q3N3K26j56Q4Nj28K82j50k72M96j56
$$ plain form
4743 4 -43 -25 379 -206 31 -349 187 233 95 -65 235 149 80 34 -378 36 -65 -99 117 -78 -253 -7 149
4766 149 -79 -79 75 48 -30 76 125 -102 96 -18 -19 -13 -105 196 -98 -164 19 -133 -19 191 48 413 -21 148
4790 148 -37 -29 -44 -17 261 104 -302 -78 84 -7 126 -172 -15 177 19 95 -381 141 113 -208 -20 13 86
4813 86 59 -65 57 -333 -171 146 -106 -87 13 170 88 -58 11 -143 66 167 27 -122 -114 -299 -182 -108 53
4836 53 85 162 76 -49 83 -91 358 -38 -98 74 183 48 109 153 30 -121 -57 80 187 -40 -200 157 -53
4859 -53 -149 23 -78 -22 4 386 230 -284 226 -48 111 -97 28 -176 -56 -28 56 -206 163 -54 242 -22
4881 -22 -97 -139 244 54 60 -161 -123 -179 -32 204 223 70 91 -38 88 91 -65 -97 100 189 -119 222 -223 -74
4905 -74 -47 124 45 29 -9 -35 204 48 -98 160 -183 -49 -132 -79 147 -9 75 80 -48 234 84 -188 308 152
4929A52l3j40K50Ok7j07j89M2O1j65l2L82n8r4Q7m1J19k22P3l02n3L92k24K37
4953A14%p0o2K08k23O5l12L21n7Ok7j22L57p9N7m36k9L56p9rJ0J23j37K5J80q6
4979I4Kk15J89j13p8K21j3k60O4o2J17J48l1J75m53K02p6R7J10k11J99k0K32j30
5003A88m00K57J10j32mKj1k31K80j15j41L99k97m7k3J71m4L5q6J35QJ7K00l01
5027c0N6Jp4M5O2J66j95L2p1k68J15M56l41J83k71K21K08k35j45J09J72j40K5
5050H1K39l09K96k05n9mj64O1j1o5L3K97k19k2K49j73j54J90k1J04k56P9j87N63
5074C43j90k81J67r5j20K46k3j70K85j65J11m6J88r8l53K49J68l60M15m07J67
5095C1l4P5j10j70J57j67K17k63K65K1j13l8J53J02r3p4j04O3K01j08j88L69j12
$$ plain form
4929 152 119 -21 229 235 208 101 -88 -46 15 -150 -182 200 142 48 135 94 213 -9 64 -238 -291 101 -123 114
4953 114 114 44 -18 190 -33 32 -280 41 -16 -10 -37 -159 198 119 176 -260 -289 67 -12 -21 -11 112 -25 0 180 94
4979 94 96 -119 70 -43 -121 100 87 -173 -109 -171 -54 94 63 238 -215 -13 -89 8 118 -93 106 86 318 188
5003 188 -212 45 155 23 19 21 10 -221 59 -56 -197 202 -95 -142 -165 6 -38 -3 -89 46 54 71 271 -30
5027 -30 26 27 -47 -2 60 226 31 63 -8 -276 -161 295 -46 137 -134 87 295 60 -85 24 196 56 81
5050 81 320 11 307 102 43 39 -125 -64 -75 -140 -107 190 -29 -51 198 25 -129 61 40 144 -112 -33 -220 343
5074 343 153 -128 39 -56 -176 70 47 -123 162 -3 108 62 250 152 -201 48 216 -144 271 -136 31
5095 31 -3 72 -38 -208 -51 -218 -1 -264 1 22 -91 -129 24 126 33 -41 -145 -82 119 11 -177 192 80
5118H0O4l42K3L49l46K93l72K26K17j50k30K15k97L85P7k01K44k72J27k71N9L35
5140B13Kj52j31L8Qk07K01J04J40P3k60k1K3LL4p8r5L5K39j20j61K28j18K73p48
5165d77M73j16K7M6R3j20m4j37J77J87r0N4j30j1J40j97O0M5K2j65J13M5J91j29
5189E7N5J77j71j17K55k07k3l9J39r5j11j3J18p7M6K71l15qNJ0J32p0j77M31l06
5214c3j2m1m7K5J15k44L71j12j7J14M3Qj36J91k81J27n3j5p0p3N0k07M07j8l54
5239b62J64k8k8J82k8Q7J96R5l35N0k64R9J5j65O8J48m8P3J74K5j95p9J51q7J87
5264A95r7Rk13J24j3k38K37l6K44o3q7r7j13M66k07l08K28n7j02Pp9M54p2l12
5288a30n2N47m94J30M1K6j69o3M49k1k0j25j8%p4j9k23L26j79P7j19j54K83Q6
$$ plain form
5118 80 144 -198 -175 174 -172 121 -251 -25 192 42 -188 27 -270 115 192 -9 235 -37 90 -181 -122 213
5140 213 215 63 -68 -30 -22 -229 -28 76 216 289 29 8 31 34 68 -10 -105 -70 169 49 -112 116 -2 271 -477
5165 -477 -4 -120 -93 -47 46 -74 -118 -255 -78 109 19 73 -57 -68 72 -125 -65 -20 2 -163 -50 -5 186 57
5189 57 112 289 118 1 256 49 26 -13 126 31 -80 -93 25 -52 -6 265 -50 -58 -53 -43 89 19 -158 273 -33
5214 -33 -45 -86 -133 -108 7 -237 134 22 5 119 162 170 34 225 -56 71 18 3 -67 -140 -90 -297 110 92 -262
5239 -262 -98 -126 -154 28 0 87 283 378 43 93 -171 -72 -57 -222 -154 -6 -54 19 193 218 23 -56 95 8 195
5264 195 98 107 -106 18 5 -233 4 -32 212 149 62 -35 -148 318 111 -197 31 -26 -128 -121 -200 254 182 -130
5288 -130 -182 365 -129 1 42 68 -101 -164 285 264 244 119 101 101 27 8 -215 111 -68 9 -110 -264 19 105
5312A05k61K8q9J7J61m8n6NM59l19jl7R1j82R9r2K12n4J54k40K84j39l37J12J37
5337IN6k61K0L75l03J65j55q6r1J02K47J74n0l92J40K58p9k02O9n1J0k0J99O0
$$ plain form
5312 105 -156 -128 -217 -200 -39 -87 -143 -138 321 2 1 -36 55 -127 -28 -120 92 38 192 -48 236 97 -240 -128 9
5337 9 65 -196 -176 199 -104 61 -94 -180 -271 -169 78 252 202 -190 -50 208 129 -73 -4 -55 -45 -65 134 194
$$ [...]
8191a0
##END NTUPLES=NMR FID
##END=
