##TITLE=1H_LR-758-CR3-CHL
 CCl4
 8 sc, 
 22.11.2022
##JCAMPDX= 6.0         $$ Bruker NMR JCAMP-DX V2.0
##DATA TYPE= NMR FID
##DATA CLASS= NTUPLES
##ORIGIN= UXNMR, Bruker Analytische Messtechnik GmbH
##OWNER= root
$$ XWIN-NMR		Version 3.5
$$ Tue Nov 22 14:40:50 2022 Russian Standard Time (UT+4h)  she@DPX200
##.OBSERVE FREQUENCY= 200.1313499994
##.OBSERVE NUCLEUS= ^1H
##.DELAY= (6, 6)
##.ACQUISITION MODE= SIMULTANEOUS
##.ACQUISITION SCHEME= undefined
##.AVERAGES= 8
##.DIGITISER RES= 18
##SPECTROMETER/DATA SYSTEM= spect
##.PULSE SEQUENCE= zg30
##.SOLVENT NAME= CDCl3
##.SHIFT REFERENCE= (INTERNAL, CDCl3, 0, 15.7039)
##AUDIT TRAIL= $$ (NUMBER, WHEN, WHO, WHERE, WHAT)
$$ ##TITLE= Audit trail, XWIN-NMR		Version 3.5
$$ ##JCAMPDX= 5.01
$$ ##ORIGIN= Bruker BioSpin GmbH
$$ ##OWNER= she
$$ F:/spectra/data/she/nmr/H-F/1/audita.txt
$$ ##AUDIT TRAIL=  $$ (NUMBER, WHEN, WHO, WHERE, WHAT)
(   1,<2022-11-22 14:39:23.48 +0400>,<she>,<DPX200>,
      <created by zg, POWCHK disabled, PULCHK disabled
       configuration hash MD5:
       00 E9 B6 7A A2 85 ED C7 34 08 36 98 17 FE 4E 26
       data hash MD5: 16K
       BD 2F C8 16 09 9B E6 40 E3 16 D4 83 25 5E 71 ED>)
$$ ##END=
$$ 
$$ hash MD5
$$ 15 87 1F 01 D1 25 F9 D9 A1 37 EB C2 20 CC AC FB
##$RELAX= 
##$RELAX= 
##$RELAX= 
##$RELAX= 
##$RELAX= 
##$RELAX= 
$$ Bruker specific parameters
$$ --------------------------
##$DU= <F:/spectra>
##$EXPNO= 1
##$NAME= <H-F>
##$PROCNO= 1
##$TYPE= <nmr>
##$USER= <she>
##$AMP= (0..31)
100 100 100 100 100 100 100 100 100 100 100 100 100 100 100 100 100 100 
100 100 100 100 100 100 100 100 100 100 100 100 100 100 
##$AQSEQ= 0
##$AQ_mod= 1
##$AUNM= <au_zg>
##$AUTOPOS= <>
##$BF1= 200.13
##$BF2= 200.13
##$BF3= 200.13
##$BF4= 200.13
##$BF5= 200.13
##$BF6= 200.13
##$BF7= 200.13
##$BF8= 200.13
##$BYTORDA= 1
##$CFDGTYP= 0
##$CFRGTYP= 5
##$CHEMSTR= <none>
##$CNST= (0..31)
1 1 145 1 1 1 1 1 1 1 1 1 1 1 1 1 1 1 1 1 1 1 1 1 1 1 1 1 1 1 1 1 
##$CPDPRG= <>
##$CPDPRG1= <>
##$CPDPRG2= <>
##$CPDPRG3= <>
##$CPDPRG4= <mlev>
##$CPDPRG5= <mlev>
##$CPDPRG6= <mlev>
##$CPDPRG7= <mlev>
##$CPDPRG8= <mlev>
##$CPDPRGB= <>
##$CPDPRGT= <>
##$D= (0..31)
0 1.2 0 0 0 0 0 0 0 0.06 0 0.03 0 0 0 0 0.0002 0 0 0 0 0 0 0 0 0 0 0 0 
0 0 0 
##$DATE= 1669113563
##$DBL= (0..7)
120 120 120 120 120 120 120 120 
##$DBP= (0..7)
150 150 150 150 150 150 150 150 
##$DBP07= 0
##$DBPNAM0= <>
##$DBPNAM1= <>
##$DBPNAM2= <>
##$DBPNAM3= <>
##$DBPNAM4= <>
##$DBPNAM5= <>
##$DBPNAM6= <>
##$DBPNAM7= <>
##$DBPOAL= (0..7)
0.5 0.5 0.5 0.5 0.5 0.5 0.5 0.5 
##$DBPOFFS= (0..7)
0 0 0 0 0 0 0 0 
##$DE= 6
##$DECBNUC= <off>
##$DECIM= 32
##$DECNUC= <off>
##$DECSTAT= 4
##$DIGMOD= 1
##$DIGTYP= 9
##$DL= (0..7)
0 120 120 120 120 120 120 120 
##$DP= (0..7)
150 150 150 150 150 150 150 150 
##$DP07= 0
##$DPNAME0= <>
##$DPNAME1= <>
##$DPNAME2= <>
##$DPNAME3= <>
##$DPNAME4= <>
##$DPNAME5= <>
##$DPNAME6= <>
##$DPNAME7= <>
##$DPOAL= (0..7)
0.5 0.5 0.5 0.5 0.5 0.5 0.5 0.5 
##$DPOFFS= (0..7)
0 0 0 0 0 0 0 0 
##$DQDMODE= 0
##$DR= 18
##$DS= 0
$$ [...]
##$SUBNAM2= <"">
##$SUBNAM3= <"">
##$SUBNAM4= <"">
##$SUBNAM5= <"">
##$SUBNAM6= <"">
##$SUBNAM7= <"">
##$SUBNAM8= <"">
##$SUBNAM9= <"">
##$SW= 18.0517283424941
##$SWIBOX= (0..15)
0 0 2 0 0 0 0 0 0 0 0 0 0 0 0 0 
##$SW_h= 3612.71676300578
##$TD= 16384
##$TD0= 1
##$TE= 0
##$TE2= 300
##$TE3= 300
##$TEG= 300
##$TL= (0..7)
0 120 120 120 120 120 120 120 
##$TP= (0..7)
150 150 150 150 150 150 150 150 
##$TP07= 0
##$TPNAME0= <>
##$TPNAME1= <>
##$TPNAME2= <>
##$TPNAME3= <>
##$TPNAME4= <>
##$TPNAME5= <>
##$TPNAME6= <>
##$TPNAME7= <>
##$TPOAL= (0..7)
0.5 0.5 0.5 0.5 0.5 0.5 0.5 0.5 
##$TPOFFS= (0..7)
0 0 0 0 0 0 0 0 
##$TUNHIN= 0
##$TUNHOUT= 0
##$TUNXOUT= 0
##$USERA1= <user>
##$USERA2= <user>
##$USERA3= <user>
##$USERA4= <user>
##$USERA5= <user>
##$V9= 5
##$VALIST= <valist>
##$VCLIST= <CCCCCCCCCCCCCCC>
##$VD= 0
##$VDLIST= <DDDDDDDDDDDDDDD>
##$VPLIST= <PPPPPPPPPPPPPPP>
##$VTLIST= <TTTTTTTTTTTTTTT>
##$WBST= 1024
##$WBSW= 4
##$XGAIN= (0..3)
0 0 0 0 
##$XL= 0
##$YL= 0
##$YMAX_a= 547001
##$YMIN_a= -502628
##$ZGOPTNS= <>
##$ZL1= 120
##$ZL2= 120
##$ZL3= 120
##$ZL4= 120
##$ABSF1= 10
##$ABSF2= 0
##$ABSG= 5
##$ABSL= 3
##$ALPHA= 0
##$AQORDER= 0
##$ASSFAC= 0
##$ASSFACI= 0
##$ASSFACX= 0
##$ASSWID= 0
##$AUNMP= <proc_1d>
##$AZFE= 0.1
##$AZFW= 0.1
##$BCFW= 1
##$BC_mod= 2
##$BYTORDP= 1
##$COROFFS= 0
##$CY= 11.3945322036743
##$DATMOD= 1
##$DC= 2
##$DFILT= <>
##$DTYPP= 0
##$F1P= 2.36226072786647
##$F2P= -0.459571619588291
##$FCOR= 0.5
##$FTSIZE= 0
##$FT_mod= 4
##$GAMMA= 1
##$GB= 0.15
##$INTBC= 1
##$INTSCL= 1
##$ISEN= 128
##$LB= 0.24
##$LEV0= 0
##$LPBIN= 0
##$MAXI= 10000
##$MC2= 0
##$MEAN= 0
##$ME_mod= 0
##$MI= 1.114404
##$NCOEF= 0
##$NC_proc= 0
##$NLEV= 6
##$NOISF1= 3.799351
##$NOISF2= 2.8
##$NSP= 1
##$NTH_PI= 0
##$NZP= 0
##$OFFSET= 15.70392
##$PC= 1
##$PHC0= -18031.99
##$PHC1= 12.00071
##$PH_mod= 1
##$PKNL= yes
##$PPARMOD= 0
##$PSCAL= 0
##$PSIGN= 0
##$REVERSE= no
##$SF= 200.130013532006
##$SI= 16384
##$SIGF1= 3
##$SIGF2= 2
##$SINO= 400
##$SIOLD= 16384
##$SREGLST= <1H.CDCl3>
##$SSB= 0
##$STSI= 0
##$STSR= 0
##$SW_p= 3612.71676300578
##$SYMM= 0
##$S_DEV= 0
##$TDeff= 0
##$TDoff= 0
##$TI= <>
##$TILT= no
##$TM1= 0
##$TM2= 0
##$TOPLEV= 0
##$USERP1= <user>
##$USERP2= <user>
##$USERP3= <user>
##$USERP4= <user>
##$USERP5= <user>
##$WDW= 1
##$XDIM= 8192
##$YMAX_p= 0
##$YMIN_p= 0
$$ End of Bruker specific parameters
$$ ---------------------------------
##NTUPLES= NMR FID
##VAR_NAME=  TIME,          FID/REAL,        FID/IMAG
##SYMBOL=    X,             R,               I
##VAR_TYPE=  INDEPENDENT,   DEPENDENT,       DEPENDENT
##VAR_FORM=  AFFN,          ASDF,            ASDF
##VAR_DIM=   8192,          8192,            8192
##UNITS=     SECONDS,       ARBITRARY UNITS, ARBITRARY UNITS
##FACTOR=    0.0002768,     1,               1
##FIRST=     0,             0,               0
##LAST=      2.2672688,     0,               0
##MIN=       0,             -502628,         0
##MAX=       2.2672688,     547001,          0
$$ Real data points
##PAGE= N=1
##DATA TABLE= (X++(R..R)), XYDATA
$$ [...]
$$ plain form
1870 -3767 -852 2280 1709 -2960 -1378 4242 -522 -2611 -484 3687 -362 -3961 2310 2060 -1088
1885 -1088 -3022 1752 3361 -3444 -1368 2609 1895 -3176 -1555 3928 -61 -2851 -744 3831 -269
1900 -269 -4042 2103 2299 -1132 -3038 1622 3477 -3124 -1649 2341 1940 -2898 -1728 3707 237 -2811
1916 -2811 -680 3616 -73 -3949 1527 2478 -1033 -2873 1645 2960 -2727 -1906 2477 1795 -3055 -1089
1932 -1089 3303 145 -2464 -834 3476 -224 -3414 1718 2149 -845 -2524 1571 2486 -2605 -1421
1947 -1421 2120 1419 -2710 -1179 3348 -229 -2311 -93 2843 -148 -3453 1778 2244 -1473 -1966 1542
1963 1542 2149 -2419 -1520 2555 1236 -2759 -734 2822 -5 -2444 37 3117 -848 -2923 1508
1978 1508 2134 -1381 -2377 1989 2048 -2748 -1078 2401 1208 -3074 -660 3564 -580 -2456 263 2836
$$ packed form
1870c767K915L132n71m669J582N620m764k089K127M171m049l599O271k50l148
1885a088j934M774J609o805K076L977p14n071J621N483l989k790K107M575m100
1900b69l773O145J96l431j906M660J855o601J475L990m01m838J170N435l470l048
1916b811K131M296l689l876N476R51l511j840M518J315n687Q21M383o82m850J966
1932a089M392l158k609J630M310l700l190N132M31k994j679M095R15n091J184
1947a421L541p01m129J531M527l577k082K218K936k991l305N231M66l717m93L508
1963A542O07m568Q99M075j319l995K025L556k827k439K481L080l965k075M431
1978A508O26l515r96M366N9m796J670L479j193m282K414M224m144j876K719K573
$$ plain form
1994 2836 -495 -3798 2008 2185 -2291 -2002 1823 2440 -2828 -1701 3141 993 -2827 -619 3129 320
2010 320 -3168 68 3120 -808 -2926 985 2833 -1579 -2529 2286 1779 -2048 -1379 2332 1715 -3266
2026 -3266 -569 3005 -353 -2301 -199 2847 -558 -3043 1683 2441 -1437 -2046 1633 2234 -2216 -1648
2042 -1648 2499 1144 -2499 -905 2629 543 -2908 18 2502 -590 -2104 275 2659 -1074 -2267
2057 -2267 1891 1098 -1097 -1487 1508 1571 -2945 -137 1843 39 -1555 -500 2668 -879 -2079 1215
2073 1215 1430 -971 -1836 1790 1342 -2268 -892 1758 1025 -2335 -337 2486 13 -2176 295 2177
2089 2177 -796 -1664 643 2112 -1385 -1793 2143 463 -1129 -1252 1330 1361 -3149 637 1720 -339
2105 -339 -1286 -544 3119 -1599 -1743 1402 1055 -558 -2307 2456 956 -2401 -137 1343 1589 -2653
$$ packed form
1994B836l331l303N806J77m476K89L825O17n268J127M842k148l820K208L748k809
2010C20l488L236L052l928k118L911J848m412r50M815n07l827O69L711o17m981
2026c266K697L574l358j948K102L046l405k485M726P58l878o09L679O01m450N68
2042a648M147j355l643J594L534k086l451K926K484l092j514K379K384l733j193
2057b267M158p93k195l90K995O3m516K808J980j804j594J055L168l547j200L294
2073A215K15k401q65L626m48l610J376K650p33l360J998K823k473k189K471J882
2089B177k973q68K307J469l497m08L936j680j592j23K582L1m510L786J083k059
2105c39r47P42L663m718j44L145l47j613j749M763j500l357K264J480K46m242
$$ plain form
2121 -2653 -442 2911 -742 -1537 -19 2390 -582 -2338 1002 1637 -891 -2112 1887 1228 -1554 -809
2137 -809 1158 1630 -2701 55 1887 -183 -1205 -948 2930 -973 -1629 1049 697 243 -2630 2050
2153 2050 1279 -1954 239 252 1984 -2386 -834 2495 -989 -603 -893 2106 72 -2382 1359 906
2169 906 68 -2011 1033 1569 -1584 -173 195 1428 -1446 -937 1760 -329 -702 -710 1598 -168 -1692
2186 -1692 975 234 516 -1880 1185 1156 -1981 617 -276 1454 -1567 -787 2228 -1136 -96 -674 1424
2203 1424 77 -2072 1661 58 24 -1358 401 1721 -2198 390 365 715 -795 -965 2236 -886
2219 -886 -551 -183 1308 54 -1736 1138 225 11 -1269 802 1358 -1983 458 171 879 -955 -1135
2236 -1135 2452 -955 -299 -652 1399 451 -2347 1543 161 164 -1349 99 2149 -2150 183 333 752
$$ packed form
2121b653K211L353l653p95J518K409k972j756L340O35k528j221L999o59k782P45
2137h09J967M72m331K756J832k070j022K57L878l903o56K678l52m54k873M680
2153B050p71l233K193J3J732m370J552L329l484L86k90K999k034k454L741m53
2169I06q38k079L044N36l153J411L68J233k874N09K697k089l73qK308j766j524
2186a692K667p41K82k396L065k9l137K598q93J730l021P80L015l364J040n78K098
2203A424j347k149L733j603l4j382J759J320l919K588k5L50j510j70L201l122
2219h86L35L68J491j254j790K874r13k14j280K071N56l341K441k87P08j834j80
2236a135L587l407O56l53K051r48k798L890j382Lj513J448K050m299K333J50M19
$$ plain form
2253 752 -628 -1838 2552 -471 -642 -416 688 1006 -2381 778 781 92 -1029 -61 2144 -1557 -162
2270 -162 153 799 -145 -1745 2047 -164 -579 -517 638 1235 -2064 738 263 394 -822 -542 2369 -1519
2288 -1519 33 155 606 208 -2109 1868 32 -524 -460 139 1302 -1902 527 471 197 -454 -902 2010
2306 2010 -1015 -281 185 244 473 -1809 1409 84 -468 -97 17 1396 -1490 426 443 84 -372 -1121
2324 -1121 1891 -1040 -603 399 65 567 -1645 1303 65 -773 15 -114 1240 -1704 524 689 -143
2341 -143 84 -901 1920 -871 -871 783 -10 603 -1671 1131 506 -1020 139 54 1199 -1462 106 989
2359 989 -279 -357 -821 1870 -810 -1105 932 138 195 -1729 1284 762 -1269 -102 137 1338 -1941
2376 -1941 -277 1406 -454 -455 -978 2083 -464 -1421 961 259 483 -1754 842 1426 -1244 -265 94
$$ packed form
2253G52j380j210M390l023j71K26J104L18l387L159Lo89j121R68K205l701J395
2270a62L15O46r44j600L792k211m15O2J155N97l299K802m75J31j216K80K911l888
2288a519J552J22M51l98k317L977j836n56O4N99J163l204K429n6k74o51m48K912
2306B010l025P34M66N9K29k282L218j325n52L71J14J379k886J916J7l59m56p49
2324a121L012k931M37J002l34N02k212K948j238q38P88j29J354k944K228J65q32
2341a43K27r85K821k791%J654p93O13k274K802o25j526J159q5J145k661J568Q83
2359I89j268p8m64K691k680k95K037p94N7j924L013n22k031J167K39J201l279
2376a941J664J683j860jn23L061k547r57K382p02K24k237K596N84k670R79L59
$$ plain form
2393 94 1433 -1349 -690 1425 -133 -509 -1185 1806 30 -1717 785 498 274 -1731 537 1503 -1185
2410 -1185 -455 327 1294 -1246 -638 1437 -83 -238 -1144 1708 109 -1884 729 349 627 -1562 356
2427 356 1407 -1046 -162 -14 1327 -857 -934 1492 -161 -269 -776 1320 419 -1662 749 475 87
2444 87 -1122 313 1400 -1035 -458 280 916 -1001 -665 1192 24 -567 -730 1138 216 -1551 771
2461 771 495 -94 -990 408 1324 -1119 -350 473 871 -968 -666 1659 -516 -721 -263 1018 263 -1901
2479 -1901 1057 884 -544 -803 292 1331 -1192 -678 893 884 -1014 -866 1679 18 -1139 -45 1297
2496 1297 150 -1622 533 1309 -428 -1196 581 1344 -1169 -791 720 997 -1187 -974 1680 1
2512 1 -1061 -554 1335 401 -1892 607 1183 -417 -1025 207 1622 -962 -960 1039 680 -886 -1065 1488
$$ packed form
2393I4J339k782O59K115j558l76o76K991j776j747K502k87k24k005K268R66k688
2410a185P30P82R67k540O08K075j520j55r06K852j599j993K613l80K78k189J918
2427C56J051k453Q84J48J341k184p7K426j653j08n07K096r01k081K411k74l88
2444H7j209J435J087k435N77P38O36j917L36J857j168n91j63J868r22j767K322
2461G71k76n89q96J398R16k443P69Q23L98j839L02K325k175k05M58J281p55k164
2479a901K958j73j428k59J095J039k523N14J571rj898J48K545j661j157J094J342
2496A297j147j772K155P76j737p68J777P63k513L78J511K77k184K13K654j679
2512Aj062N07J889r34k293K499N76j600o08J232J415k584KJ999l59j566j79K553
$$ plain form
2530 1488 352 -1268 -110 1189 482 -1646 114 1533 -447 -1330 761 1034 -562 -1217 769 1105
2546 1105 -1232 -595 1217 195 -1013 -390 1141 149 -1460 364 990 -381 -938 458 1134 -896
2562 -896 -630 973 608 -661 -614 1157 293 -1168 199 869 71 -929 81 1303 -843 -878 818
2579 818 467 -538 -936 829 775 -1327 -129 1003 183 -1190 -48 1368 -335 -946 199 916 -460
2596 -460 -1123 997 782 -1052 -518 923 756 -1138 -356 1372 21 -1184 279 942 -258 -1186 320
2613 320 1391 -714 -1024 1124 657 -779 -933 1027 695 -1434 -110 1041 371 -1265 -288 1466 -437
2630 -437 -965 74 1107 -68 -1681 1098 648 -913 -490 542 733 -1249 -499 1109 -97 -823 -297
2647 -297 1167 -33 -1302 126 876 -313 -1141 757 666 -824 -620 729 824 -1085 -242 853 314
$$ packed form
2530A488j136j620J158J299p07k128J760J419j980q83K091K73j596o55J986L36
2546A105k337O37J812j022j208O23J531r92j609J824O26j371n57J396O76k030
2562h96K66J603l65j269M7J771q64j461J367O70p98j000J010J222k146l5J696
2579H18l51j005l98J765n4k102J198J132q20j373J142J416j703o11J145P17j376
2596d60o63K120k15j834N34J441j67j894P82J728j351j205J463O63j200r28J506
2613C20J071k105l10K148m67j436j54J960l32k129J324J151o70j636R77J754j903
2630d37n28J039J033j175j613K779m50j561M23J032J91j982P50J608j206p26N26
2647b97J464j200j269J428P50j189q28J898r1j490K04J349R5j909Q43J095n39
$$ plain form
2664 314 -875 -582 1318 -284 -644 137 750 188 -1530 945 600 -725 -38 46 943 -1093 -270 941
2682 941 -239 -365 -477 1078 -116 -842 572 220 -168 -988 621 651 -996 -80 446 474 -894 -340
2700 -340 721 -97 -525 -82 1120 -319 -762 551 348 12 -1075 861 595 -821 27 232 759 -837
2718 -837 -295 1151 -383 -295 -276 1006 -213 -1018 638 189 49 -1036 677 832 -1290 159 351 471
2736 471 -636 -555 1191 -261 -501 -274 916 -221 -1031 756 314 -30 -915 502 814 -1049 -44
2753 -44 281 604 -660 -393 1298 -282 -329 -514 834 116 -1077 897 97 134 -698 186 1006 -1068 108
2772 108 222 418 -425 -711 1100 -254 -231 -258 603 334 -1100 524 268 78 -476 96 941 -636 -91
2791 -91 215 305 -339 -685 753 -269 -153 -164 518 244 -953 579 102 231 -418 -133 888 -808 119
$$ packed form
2664C14j189K93J900j602l60P81O13n62j718K475l45j325O87Q4Q97k036Q23J211
2682I41j180j26j12J555j194p26J414l52l88q20J609L0j647R16N26K8j368N54
2700c40J061q18m28M43J202j439m43J313k03l36j087J936k66j416Q48K05N27j596
2718h37N42J446j534Q8J9J282j219q05J656m49j40j085J713J55k122J449J92J20
2736D71j107Q1J746j452k40K27J190j137q10J787m42l44q85J417L12j863J005
2753d4L25L23j264K67J691j580m7j85J348p18j193J974q00L7q32Q84Q20k074J176
2772A08J14J96q43k86J811j354K3k7Q61k69j434J624k56j90n54N72Q45j577N45
2791i1L06R0o44l46J438j022J16j1O82k74j197J532m77J29o49K85J021j696R27
$$ plain form
2810 119 89 337 -168 -696 873 -139 -211 -52 105 442 -833 590 109 -309 -197 -286 904 -722 -10
2829 -10 256 128 21 -619 806 -163 -391 -69 348 393 -920 530 387 -109 -202 -212 868 -691 -53 192
2849 192 31 11 -805 846 -196 -376 75 36 607 -874 390 234 -320 -232 -235 1011 -542 -367 322 42
2869 42 -33 -700 672 74 -634 69 -18 498 -998 225 494 -93 -124 -351 974 -377 -470 477 94 165
2889 165 -862 531 255 -390 8 -12 691 -673 102 472 -152 -134 -373 1002 -352 -547 485 -158 277
2908 277 -841 400 184 -501 -38 -23 536 -599 -151 424 -135 102 -715 610 -142 -396 393 -112 322
2927 322 -601 365 431 -401 145 -176 575 -538 -76 506 -225 88 -534 576 -59 -539 464 -221 195
2946 195 -561 163 521 -621 174 -115 498 -438 -245 579 -248 47 -382 444 116 -701 697 -93 187
$$ packed form
2810A19l0K48n05n28J569j012p2J59J57L37j275J423m81m18J12q9J190j626P12
2829a0K66j28j07o40J425r69k28L22M17M5j313J450j43m96r3j0J080j559O38K45
2849A92j61k0q16J651j042j80M51l9N71j481J264j56n54Q8lJ246j553J75O89k80
2869D2p5o67J372n98p08P03q7N16j496J223K69n87l1k27J325j351r3R47l83P1
2889A65j027J393k76o45L98k0P03j364P75L70o24J8k39J375j354j95J032o43M35
2908B77j118J241k16o85M63J5N59j135M48N75n59K37q17J325p52k54P89n05M34
2927C22r23R66O6q32N46l21P51j113M62N82p31L13o22J110o35m80J003o85M16
2946A95p56P24L58j142P95k89O13r36J93Q24q27K95m29Q26l28q17J398p90K80
$$ plain form
2965 187 -375 286 717 -580 -36 104 278 -428 -292 687 -84 -262 -55 519 99 -609 437 195 -4
2984 -4 -527 124 556 -677 -163 7 256 -552 -556 848 -211 -97 -280 398 210 -926 503 310 3 -292
3004 -292 47 657 -540 -275 290 297 -292 -562 610 48 -349 -153 322 257 -730 28 590 -215 -640 66
3024 66 580 -361 -569 195 294 -508 -491 582 140 -394 -333 480 375 -859 240 376 -139 -474 112 701
3044 701 -331 -376 380 386 -31 -666 520 172 -490 25 84 426 -534 -132 604 -364 -474 125 435 -51 -676
3065 -676 439 496 -399 -211 419 22 -451 -182 565 131 -500 96 397 -21 -626 103 507 -321 -296 156
3085 156 218 -235 -449 551 92 -470 -79 229 34 -568 32 724 -391 -364 224 493 -301 -556 505 321
3105 321 -499 -109 418 253 -484 -199 616 -88 -466 204 507 -259 -632 535 415 -536 -384 357 500 -513
$$ packed form
2965A87n62O61M31j297N44J40J74p06J36R79p71j78K07N74m20p08J046k42j99
2984dn23O51M32j233N14J70K49q08mJ404j059J14j83O78j88j136J429j93l07k95
3004b92L39O10j197K65N65Pn89k70J172n62l97J96M75o5r87P58N62q05m25P06
3024F6N14r41k08P64R9q02J7J073m42n34O1Q13j05j234J099J36n15l35N86N89
3044G01j032m5P56Om17o35J186l48o62N15N9L42r60M02P36r68j10N99L10m86o25
3065f76J115N7q95J88O30l97m73K69P47m34o31N96L01m18o05P29M04q28K5M52
3085A56O2m53k14J000m59n62L91L08j95o02O00O92j115K7N88K69p94k55J061j84
3105C21q20L90N27j65p37K85Q15p04l78O70L03p66l73J167j20r51J52P41J43j013
$$ plain form
3125 -513 -320 598 91 -481 -144 505 75 -564 121 614 -206 -587 259 596 -257 -420 425 276 -347 -419
3145 -419 546 381 -701 -269 704 -14 -405 -95 627 -177 -747 381 436 -219 -420 294 660 -387 -342 448
3165 448 193 -430 -329 546 112 -461 -28 517 -105 -686 261 461 -335 -383 308 264 -414 -148 535 211 -592
3186 -592 -57 449 3 -287 -54 715 52 -739 441 556 -219 -343 78 526 -531 -17 423 108 -481
3205 -481 -317 630 -269 -586 165 405 -70 -689 260 620 -265 -103 299 416 -483 -241 445 129 -672 -177
3225 -177 511 -33 -503 95 374 -8 -532 524 328 -425 -345 104 347 -516 -276 585 184 -184 -143 745
3245 745 85 -657 99 383 81 -564 310 522 -540 -77 171 287 -567 -285 561 63 -390 -252 635 98
3265 98 -574 117 453 117 -590 355 347 -507 -206 124 498 -380 -293 462 -90 -213 -219 449 39 -613 93 7
$$ packed form
3125e13J93R18n07n72L37O49m30o39O85M93q20l81Q46L37q53j63Q45j49o23p2
3145d19R65j65j082M32R73p18l91L10P22q04n70J128N5o55k01P14L66j047M5P90
3165D48k55o23J01Q75m34n73M33N45o22n81R47K00p96m8O91m4o78K66O83l24q03
3186e92N35N06m46k90K33P69o63p91J180J15p75j24M21M48j057N14M40l15n89
3205d81J64R47q99l17P51K40m75o19R49L60q85J62M02J17q99K42O86l16q01M95
3225a77O88n44m70N98K79l82n24J056j96p53Q0M49K43q63K40Q61m01l68M1Q88
3245G45o60p42P56K84l02o45Q74K12j062M63K48J16q54K82Q46m98m53J38Q87n37
3265I8o72O91L36l36p07R45qq54L01L30L74q78Q7P55n52j23oO68m10o52P06q6
$$ plain form
3287 7 175 -680 222 459 -480 -47 -37 429 -290 -329 505 -18 -254 -249 481 25 -626 254 161 -64 -382 11
3309 11 481 -517 -38 243 156 -338 -334 639 39 -145 -119 474 73 -677 388 134 16 -361 96 488 -433
3330 -433 -182 182 286 -127 -153 448 -120 -141 -133 418 153 -554 113 259 -80 -328 100 504 -508 24 261
3351 261 107 -250 -260 571 7 -381 -48 378 102 -665 356 213 21 -384 1 549 -348 -171 165 144
3371 144 -276 -418 509 -5 -126 -7 240 251 -633 269 286 -141 -332 16 464 -452 -237 216 116 -25 -244
3392 -244 440 -26 -207 21 185 266 -524 117 192 20 -60 -59 396 -195 -127 250 235 23 -235 612 -55 -176
3414 -176 -13 56 188 -450 158 177 -88 -225 -109 299 -253 43 236 -150 -39 -400 381 89 -302 1 18
3435 18 235 -432 142 150 -134 -80 -118 380 -314 -352 288 33 -57 -284 331 66 -239 80 130 149 -372 175 168 -139
$$ packed form
3287GJ68q55R02K37r39M33J0M66p19l9Q34n23k36NP30m56o51Q80r3k25l18L93
3309A1M70r98M79K81q7m94MR73o00j84K6N93m01p50J065k54j18l77M57L92r21
3330d33K51L64J04m13k6O01n68k1QN51k65p07O67J46l39k48M28M04j012N32K37
3351B61j54l57j0Q31n64l88L33M26k76p67J021j43j92m05L85N48q97J77L36k1
3371A44m20j42R27n14j21J19K47J1q84R02J7m27j91L48M48r16K15M53j00j41k19
3392b44O84m66j81K28J64Q1p90O41P5j72q0JM55n91O8L77j5k12k58Q47o67j21
3414a76J63O9J32o38O08J9k65j37J16M08n52K96J93l86J11l61P81k92l91L03J7
3435A8K17o67N74Qk84N4l8M98o94l8O40k55r0k27O15k65l05L19N0J9n21N47pl07
$$ plain form
3459 -139 -90 -32 375 -231 -111 320 74 -92 -250 124 118 -340 32 46 214 -355 123 292 -47 -9 -215 383
3481 383 -160 -389 122 132 -81 -258 171 53 -160 125 155 116 -265 -209 242 -41 -325 -230 298 -104 -369 143
3503 143 56 32 -390 323 118 -205 -112 68 208 -372 -53 245 -130 -280 -278 332 147 -416 305 22 29 -209
3525 -209 111 329 -337 -205 98 77 -202 -217 172 -99 -63 -27 155 -15 -352 4 168 9 -278 39 227
3546 227 -69 -59 162 212 -261 -189 182 -55 -61 -57 164 -75 -388 160 120 -42 -234 27 150 -162 -125 -50 285
3569 285 -118 -422 429 8 -297 33 248 271 -395 74 49 -141 -131 -36 125 -187 -108 -42 80 -222 -270 144
3591 144 5 -46 -78 202 -26 -194 -1 247 50 -259 -62 289 -332 -153 230 255 -109 -290 376 24 -117
3612 -117 -6 160 207 -435 4 101 -133 -199 126 454 -45 -280 386 84 -135 -127 193 312 -321 -66 264 45
$$ packed form
3459a39M9N8M07o06J20M31k46j66j58L74om58L72J4J68n69M78J69l39L8k06N98
3481C83n43k29N11J0k13j77M29j18k13K85L0l9l81N6M51k83k84R5N28m02k65N12
3503A43q7k4m22P13k05l23R3J80J40n80L19K98l75j50KO10j85n63P21k83Pk38
3525b09L20K18o66J32L03k1k79j5L89k71L6L6J82j70l37L56J64j59k87L17J88
3546B27k96J0K21N0m73P2L71k37oMK21k39l13N48m0j62j92K61J23l12L7P5L35
3569B85m03l04Q51m21l05L30K15K3o66M69k5j90J0R5J61l12P9O6J22l02m8M14
3591A44j39n1l2K80k28j68J93K48j97l09J97L51o21J79L83K5l64j81O66l52j41
3612a17J11J66M7o42M39R7k34o6L25L28m99k35O66l02k19QL20J19o33K55L30k19
$$ plain form
3634 45 -168 -54 194 142 -233 56 393 47 -250 109 291 -97 -280 310 102 -297 -167 245 257 -376 -103
3655 -103 132 -77 -167 225 334 -216 -379 152 234 -127 -166 191 233 -273 4 154 53 -151 -180 259 -43 -341
3677 -341 25 297 1 -400 193 202 -72 -299 208 -28 -171 -186 282 105 -393 9 162 -71 -253 101 277
3698 277 -293 -158 130 102 -142 -69 172 280 -312 18 351 40 -211 -130 451 -149 -289 200 274 -1 -273
3719 -273 26 266 -254 -186 232 117 -177 -226 159 -47 -315 -29 173 -49 -199 49 330 -187 -245 313 300
3740 300 -308 -111 280 245 -329 54 360 -123 -291 -135 257 -43 -303 74 339 63 -185 54 264 -235
3760 -235 -127 375 270 -50 -128 192 -90 -294 -66 198 148 -317 92 194 -160 -105 31 390 -175 -342 150
3781 150 278 -231 -329 315 12 -285 -79 88 207 -366 119 260 53 -222 241 130 -277 -194 36 168 -114
$$ packed form
3634D5k13J14K48n2l75K89L37l46k97L59J82l88j83N90k08l99J30M12J2o33K73
3655a03K35k09r0L92J09n50j63N31Q2l61l9L57M2n06K77J50j01k04k9M39l02k98
3677c41L66K72k96m01N93Rk74k27N07k36j43j5M68j77m98M02J53k33j82L54J76
3698B77n70J35K88k8k44P3K41J08n92L30L33l11k51Q1N81o00j40M89P4k75k72
3719b73K99K40n20O8M18j15k94m9L85k06k68K86K02k22j50K48K81n17n8N58j3
3740C00o08J97L91l5n74L83L06m83j68J56L92l00k60L77K65k76k48K39K10m99
3760b35J08N02j05l20p8L20k82k04K28K64n0m65M09J02l54N5J36L59n65j67M92
3781A50J28n09r8O44l03k97K06J67J19n73M85J41k07k75M63j11m07Q3K30J32k82
$$ plain form
3802 -114 -129 440 -3 -350 79 143 -37 -445 73 185 -185 -82 71 287 -305 -444 262 60 -129 -138 334
3823 334 67 -397 119 26 85 -319 31 334 -133 -137 15 181 -256 -44 418 -25 -200 -215 243 -49 -143 46
3845 46 176 197 -279 -14 290 -291 -116 136 172 -324 43 184 44 -38 -210 281 118 -302 37 202 -30
3866 -30 -227 -85 330 -155 -164 144 217 -354 -203 258 10 -272 -36 315 189 -307 -2 355 5 -232 46
3887 46 351 -108 3 -31 189 -144 -164 267 70 -185 16 281 104 -262 178 159 55 -141 79 197 -237
3908 -237 -127 -29 149 -217 -111 276 -75 -91 -221 70 -6 -373 193 128 22 43 202 106 -224 -167 118 11
3930 11 -135 -162 34 -73 -226 -1 149 13 -328 8 282 -105 64 15 353 -160 -32 142 48 -5 -252 290
3952 290 -25 -142 28 298 -19 -158 65 158 -21 -114 258 216 -226 -149 132 225 18 -105 223 69 -63 -48
$$ packed form
3802a14j5N69m43l47M29O4j80m08N18J12l70J03J53K16n92j39P06k02j89rM72
3823C34k67m64N16r3N9m04L50L03m67mJ52J66m37K12M62m43j75j5M58k92r4J89
3845D6J30K1m76K65L04n81J75K52L6m96L67J41j40q2j72M91j63m20L39J65k32
3866c0j97J42M15m85rL08P3n71J51M61k48k82K36L51j26m96L05L57l50k37K78
3887D6L05m59J11l4K20l33k0M31j97k55K01K65j77l66M40j9j04j96K20J18m34
3908b37J10R8J78l66J06L87l51j6j30K91p6l67N66o5j06K1J59r6l30N7K85j07
3930A1j46k7J96j07j53K25J50j36l41L36K74l87J69m9L38n13J28J74r4n3k47N42
3952B90l15j17J70K70l17j39K23R3j79r3L72m2m42P7K81R3k07j23L28j54j32J5
$$ plain form
3974 -48 128 -75 -281 89 152 -157 -183 46 163 -171 -22 69 201 67 -167 398 -61 -72 -29 108 104 -295 183
3997 183 31 -101 -148 16 139 -97 -206 288 161 63 -253 92 32 -125 -11 -62 177 -196 -42 154 -104
4018 -104 -279 -199 308 -63 -147 148 -1 105 -266 312 -54 -95 -15 20 123 -237 159 320 16 -133 -200 205
4040 205 -146 -225 184 150 -9 -155 39 58 17 -7 111 35 -340 -75 297 -30 42 -97 27 -161 -363 123
4062 123 7 -54 -196 82 62 -273 -33 107 143 -230 63 185 -28 -122 -50 95 -71 -207 -13 141 95 -222
4084 -222 20 87 -58 -110 -2 149 -116 -70 239 17 -73 -117 97 -121 -58 69 72 185 33 114 173 -42 -60 206
4108 206 149 -104 -112 145 -157 -186 -109 153 -60 -113 270 138 60 -144 3 135 -189 78 79 105 -82 -50 255 10
4132 10 -8 96 39 180 -221 37 1 -116 -4 -128 143 -9 -33 -98 310 -135 -83 -39 -37 76 -69 358 122
$$ packed form
3974d8J76k03k06L70O3l09k6K29J17l34J49R1J32j34k34N65m59j1M3J37ml99M78
3997A83j52j32m7J64J23k36j09M94j27r8l16L45o0j57J14n1K39l73J54J96k58
4018a04j75Q0N07l71q4K95j49J06l71N78l66m1Q0L5J03l60L96J61l04j49o7M05
4040B05l51p9M09l4j59j46J94J9m1k4J18p6l75K65L72l27P2j39J24j88k02M86
4062A23j16o1j42K78k0l35K40J40L6l73K93J22k13r4P2J45j66j36J94J54m6l17
4084b22K42O7j45n2J08J51k65M6L09k22r0m4K14k18O3J27LJ13j52Q1N9k15j8K66
4108B06n7k53qK57l02k9P7K62k13n3L83j32p8k04J47J32l24K67JK6j87L2L05k45
4132A0j8J04n7J41m01K58l6j17J12j24K71j52k4o5M08m45N2M4KJ13j45M27k36
$$ plain form
4155 122 -222 -107 196 -164 -145 117 156 -128 -29 -14 187 -180 -5 105 67 88 -192 187 54 -194 70 113
4177 113 71 -95 -132 219 -195 -131 146 8 -76 -192 243 99 -222 -13 93 97 -153 -54 133 -115 -85 -4 1 -125
4201 -125 -77 55 17 -48 -30 35 45 41 -23 60 -13 -129 101 146 -144 -76 -70 160 -75 -170 -3 61 -49 -202 230 -63
4227 -63 -294 -263 45 -46 -141 -28 279 -96 -141 6 90 69 -178 7 38 -124 -13 119 27 -242 -69 376 -97
4250 -97 -207 69 162 36 -229 152 150 58 -90 -37 145 -152 -200 88 156 -159 -43 100 -48 -33 47 94 -52 -6
4274 -6 4 234 -48 -18 -96 203 -118 -57 163 23 -36 -116 204 -156 79 6 256 -99 -167 14 299 -19 -39 57
4298 57 40 -248 -59 17 -13 -110 -121 229 -45 -104 34 189 -64 -93 63 258 -126 -76 1 37 -232 -137 16 116
4322 116 -132 -80 113 -80 -167 -23 227 -70 -255 -88 -11 -145 -61 83 172 -215 -110 196 23 -109 -147 125
$$ packed form
4155A22l44J15L03l60J9K62L9k84R9J5K01l67J75J10l8K1k80L79j33k48K64M3
4177A13m2j66l7L51m14O4K77j38q4j16M35j44l21K09J06Mk50R9J87k48L0Q1Nj26
4201a25M8J32l8o5J8O5J0mo4Q3p3j16K30M5k90O8OK30k35r5J67O4j10j53M32k93
4227f3k31L1L08r1r5J13L07l75m5J47Q4k1k47J85L1j62J11J32r2k69J73M45m73
4250i7j10K76R3j26k65L81kr2j48N3J82k97m8K88O8l15J16J43j48J5Q0M7j46M6
4274fJ0K30k82L0p8K99l21O1K20j40n9q0L20l60K35p3K50l55o8J81K85l18k0R6
4298E7j7k88J89P6l0r7j1L50k74n9J38J55k53k9J56J95l84N0P7L6k69R5J53J00
4322A16k48N2J93j93q7J44K50k97j85J67P7j34Q4J44Q9l87J05L06j73j32l8K72
$$ plain form
4344 125 -101 -192 27 35 7 -208 94 197 32 -57 65 -10 -19 -52 0 10 -219 25 15 -211 -178 107 55 37 -350
4369 -350 8 97 -68 -135 -150 114 -122 -114 39 12 -174 -80 269 -56 -87 -14 150 -15 -160 30 38 110 -61 95
4393 95 44 -5 -175 44 122 -177 -68 238 -33 -140 107 250 -89 -75 10 77 -9 -24 35 181 -105 48 225
4416 225 -91 -74 -30 178 -19 -54 -59 62 81 -82 230 162 -163 106 99 161 -110 -167 278 19 -143 -5 88 55
4440 55 -165 11 26 -116 -130 -90 211 -72 -88 109 190 106 -122 192 -25 -120 -126 277 -31 -105 -36 90 186 -254
4464 -254 143 121 -201 -39 167 273 79 -147 116 -3 -69 -77 171 -31 -176 -4 65 -52 -54 7 104 -137 -96
4487 -96 48 68 -19 56 160 92 -66 -24 33 187 -107 -16 9 16 -187 30 223 -155 -64 41 -127 -96 -207 227
4511 227 12 -250 78 -28 46 -43 92 -66 84 -1 -72 169 -44 -156 123 5 -226 -156 0 -21 -195 -62
$$ packed form
4344A25k26r1K19Qk8k15L02J03j65q9J22p5rl3N2J0k29K44j0k26L3K85n2j8l87
4369c50L58Q9j65o7j5K64k36QJ53k7j86R4L49l25l1P3J64j65j45J90QP2j71J56
4393I5n1m9j70K19P8k99J09L06k71j07K47J43l39J4Q5O7q6j5N9J46k86J53J77
4416B25l16J7M4K08j97l5nJ21J9j63L12o8l25K69pO2k71n7M45k59j62J38R3l3
4440E5k20J76J5j42j4M0L01k83j6J97Q1q4k28L14k17r5oM03l08p4O9J26R6m40
4464b54L97k2l22J62K06J06j94k26K63j19o6qK48k02j45J72O9j17kO1R7k41M1
4487i6J44K0q7P5J04o8j58M2N7J54k94R1K5Pk03K17J93l78R1J05j68L1j11M34
4511B27k15k62L28j06P4q9J35j58J50q5p1K41k13j12K79j18k31P0J56k1j74J33
$$ plain form
4533 -62 120 1 -160 131 218 -138 -140 -98 119 -142 -39 62 109 -109 -5 37 81 -200 -148 50 157 -188 142
4556 142 182 -81 -52 -149 300 -151 -43 50 82 -13 -192 303 -68 -159 45 60 206 -58 147 197 -110 -223 -17
4579 -17 -65 -185 -25 115 129 -147 -69 119 96 -136 -25 136 76 -69 -96 126 2 25 -31 107 22 -110 79
4602 79 -69 -34 -215 42 163 -278 53 282 81 -203 -119 137 -164 -133 -82 47 4 -209 201 -71 -168 -221 98
4625 98 45 -153 -14 -56 36 -61 -49 118 -116 -94 83 81 -71 -125 96 131 -55 -183 89 -11 -216 -113 33 -19
4649 -19 -132 110 183 -32 -101 -110 259 -79 -76 44 45 64 31 56 86 -37 -24 104 63 -6 -38 114 -16 -170 -15 12
4675 12 -2 -45 -15 166 -122 50 104 145 -119 -18 169 35 -245 -69 55 36 -214 -71 85 -32 -244 -135
4697 -135 84 167 -113 28 -9 -165 -133 117 26 -19 -89 -25 37 -112 147 -138 -168 -35 35 116 18 -77 -54 154 83
$$ packed form
4533f2J82j19j61K91Q7l56kM2K17k61J03J01M7k18J04M2M4k81N2J98J07l45L30
4556A42M0k63K9r7M49m51J08R3L2r5j79M95l71r1K04J5J46k64K05N0l07j13K06
4579a7m8j20J60J40J4k76P8J88k3k32J11J61o0j45k7K22j24K3n6J38q5j32J89
4602G9j48L5j81K57J21m41L31K29k01k84Q4K56l01L1N1J29m3k13M10k72r7n3L19
4625I8n3j98J39m2R2r7J2J67k34K2J77kj52n4K21L5j86j28K72j00k05J03J46n2
4649a9j13K42P3k15o9rL69l38LJ20JJ9l3K5L0j23J3J28m1o9l2J52j30j54J55K7
4675A2j4m3L0J81k88J72N4M1k64J01J87j34k80J76J24j9k50J43J56j17k12J09
4697a35K19Q3k80J41l7j56L2K50r1m5p0O4O2j49K59k85l0J33P0Q1r8r5K3K08p1
$$ plain form
4722 83 -25 -24 -27 -215 20 58 90 -114 -24 128 -21 -96 -85 118 119 -117 71 146 -132 -111 180 -59 -89 81 65
4747 65 83 21 100 125 31 -276 4 81 -187 -81 -92 -6 12 -102 169 62 -115 34 209 225 -10 -38 157 -19
4771 -19 -95 -24 -55 28 42 113 -97 49 -70 -46 36 -236 -77 213 90 -166 15 84 -59 -208 92 357 19
4794 19 -155 128 64 -72 -124 159 -3 -18 -2 100 -142 6 114 91 40 -140 -74 34 -260 -118 128 -21 -88
4817 -88 -77 -13 156 -166 -77 120 39 -91 -35 121 -29 -18 3 148 -186 -184 -34 -44 -55 96 128 -13 -109 -1 -115
4842 -115 110 -92 76 126 33 -38 -160 78 -144 -104 40 33 -224 72 103 35 -95 23 -36 82 -84 84 23
4865 23 -13 -7 111 232 21 -50 84 249 -21 0 70 35 -106 -24 195 -129 -170 -12 185 30 -64 -128 33 -76
4889 -76 -79 99 -22 -134 -14 72 266 -73 -160 163 -21 -67 -60 57 -101 -73 2 180 16 -6 -7 116 -9 45 -3
$$ packed form
4722H3j08Jlj88K35L8L2k04R0J52j49p5J1K03Jk36J88P5k78K1K91k39l0J70j6
4747F5J8o2P9K5r4l07K80P7k68J06j1Q6J8j14K71j07j77J49J75J6k35k8J95j76
4771a9p6P1l1Q3J4P1k10J46j19K4Q2k72J59K90j23k56J81O9j43j49L00K65l38
4794A9j74K83o4j36n2K83j62j5J6J02k42J48J08k3n1j80O6J08k94J42K46j49o7
4817h8J1O4J69l22Q9J97q1j30N6J56j50J1K1J45l34KJ50j0j1J51L2j41r6J08j14
4842a15K25k02J68N0r3p1j22K38k22M0J44pk57K96L1o8j30J18n9J18j66J68o1
4865B3l6OJ18J21k11p1J34J65k70K1P0l5j41Q2K19l24m1J58J97j55r4o4J61j09
4889g6lJ78j21j12J20Q6J94l39q7L23j84m6PJ17j58K8P5J78j64k2jJ23j25N4m8
$$ plain form
4914 -3 50 0 -23 68 104 -80 -84 129 77 -147 -126 68 -45 -68 -53 81 -180 -125 91 -42 -226 -22 67 -77 -66
4939 -66 -111 185 62 47 208 81 20 -175 -10 -13 -17 13 132 61 -97 37 88 -33 -48 -103 11 -117 -146 -2 11
4964 11 -90 36 -103 261 -23 -76 73 87 -145 67 260 -53 -101 -47 76 3 -234 119 84 -83 -37 81 -18
4987 -18 94 118 56 65 -88 -235 92 -71 -20 70 -2 101 -144 -153 20 80 -47 -134 103 -90 49 212 -52 -206
5011 -206 23 25 36 66 -57 238 13 -45 99 -14 -98 -126 109 6 -68 -237 33 -44 -172 -79 99 93 -189 -33
5035 -33 59 -67 -114 3 -109 75 -45 -69 132 -64 82 63 28 -44 57 153 117 -194 44 -59 101 1 -51
5058 -51 258 -3 -138 -15 -103 -28 -116 29 13 29 -43 159 43 47 18 58 87 -31 -54 -35 -121 92 -4 78 26 0
5084 0 103 -107 37 -46 129 49 34 -170 -40 1 -175 -63 252 -52 -100 -2 77 -97 -105 99 133 -136 99 7
$$ packed form
4914cN3n0k3R1L6j84mK13n2k24K1J94j13k3J5J34k61N5K16j33j84K04Q9j44J1
4939f6m5K96j23j5J61j27o1j95J65lmL0J19p1j58J34N1j21j5n5J14j28k9J44J3
4964A1j01J26j39L64k84n3J49J4k32K12J93l13m8N4J23p3k37L53l5j67M6J18r9
4987a8J12K4o2Rj53j47L27j63N1R0p2J03k45rJ73O0j27q7K37j93J39J63k64j54
5011b06K29KJ1L0j23K95k25n8J44j13q4k8K35j03p4j69K70p7j28R3J78ok82J56
5035c3R2j26m7J17j12J84j20k4K01j96J46j9l5p2J01R6l6l11K38j03J60j00n2
5058e1L09k61j35J23q8P5q8J45j6J6p2K02j16Mk9M0K9j18k3J9q6K13r6Q2n2k6
5084@J03k10J44q3J75q0j5k04J30M1j76J12L15l04m8R8P9j74qK04L4k69K35r2
$$ plain form
5108 7 84 -68 -46 45 -31 -44 -75 138 14 -247 64 96 -145 94 0 103 -20 84 109 38 3 -30 17 -117 -161
5133 -161 -73 196 -4 -127 54 31 -88 -41 113 56 130 128 13 -64 -28 -32 20 7 -76 -2 152 49 -97 -44 56
5158 56 -20 111 194 93 91 -98 141 83 21 116 98 10 -211 137 60 -24 -140 -106 -18 57 -72 17 101 -57 5 171
5184 171 175 -64 -29 175 22 -124 -15 14 -26 -25 165 103 -91 -151 -13 90 33 -45 57 48 -57 -156 -12 36 -82
5209 -82 142 44 116 9 105 89 -1 -17 267 -34 -130 -216 -17 -34 -88 142 61 -125 -123 34 144 90 -134 -17 176
5234 176 -82 -81 119 0 -83 -163 52 113 -75 124 27 105 -36 14 94 -44 -16 -18 106 -85 -100 168 140 -186 -175
5259 -175 2 38 -159 -97 -95 118 15 -148 -21 -101 -89 -28 -12 42 -135 -11 205 -78 -158 -49 -78 -105 29 180
5283 180 5 -302 -51 -37 58 -7 36 62 -90 -77 33 57 -115 -9 73 58 -12 -109 109 -103 101 14 143 -56
$$ packed form
5108GP7j52K2R1p6j3l1K13j24k61L11L2k41K39r4J03j23J04K5p1l5l3M7j34m4
5133a61Q8K69k00j23J81k3j19M7J54n7P4kj15p7L6mN2j3q3P4J54j03j46N3J00
5158E6p6J31Q3j01kj89K39n8o2R5j8q8k21L48p7q4j16L4Q8P5j29Q9Q4j58O2J66
5184A71Mk39L5K04j53j46J09K9m0JJ90o2j94o0J38J03n7p8J02rj05r9J44M8j18
5209h2K24r8P2j07R6j6r0j6K84l01r6q6J99j7n4K30q1j86KJ57J10n4k24J17J93
5234A76k58JK00j19q3q0K15O1j88J99r7P8j41N0Q0j38K8kJ24j91j5K68k8l26J1
5259a75J77L6j97O2KK13j03j63J27q0J2O1J6N4j77J24K16k83q0J09k9k7J34J51
5283A80j75l07K51J4R5o5M3K6j52J3J10K4j72J06Q2j5p0r7K18k12K04q7J29j99
$$ plain form
5307 -56 -47 78 162 -79 -98 -29 57 14 -36 -102 -52 -37 11 100 -130 -70 51 160 -50 -65 -96 103 -60 64 39 27
5333 27 -64 77 14 4 -11 -50 18 70 -31 -194 10 -66 -71 -17 62 36 -71 198 94 -74 -226 24 116 -144 -42
5358 -42 183 236 -68 -36 30 92 -82 164 12 16 31 50 133 139 -51 47 95 -94 -88 15 145 -133 -12 -21 73 -182
5384 -182 -17 115 86 37 40 -15 12 4 47 -53 47 -80 158 -10 -108 -77 -44 115 -147 -84 -50 -58 -53 -71 89 -21
5410 -21 -114 24 50 -81 2 46 -136 -5 139 155 -89 -46 1 35 -201 -30 -89 64 -36 -33 -53 96 22 9 79
5435 79 50 -130 27 84 -156 0 -86 -19 -16 66 -35 -5 -63 -56 138 113 -38 -246 -9 -5 -76 -21 61 -88 -6 48 116
5462 116 44 -36 -30 156 -152 -86 107 9 -79 17 52 271 -146 -133 262 -1 -41 76 118 -49 12 101 -12 -40 -4
5487 -4 140 29 -20 19 -126 -44 -112 51 79 29 -186 -34 107 21 -26 95 -135 -23 -3 7 -52 34 154 178 30
$$ packed form
5307e6RJ25Q4k41j9O9Q6m3n0o6N0J5M8Q9k30O0J21J09k10j5l1J99j63J24k5j2
5333B7r1J41o3j0j5l9O8N2j01j63K04p6nN4P9k6j07K69j04j68j52K50R2k60J02
5358d2K25N3l04L2O6O2j74K46j52MJ5J9Q3Oj90R8M8j89OJ03J30k78J21rR4k55
5384a82J65J32k9m9Ln5K7qM3j00J00j27K38j68r8L1L3J59k62O3L4qNj8J60j10
5410b1r3J38K6j31Q3M4j82J31J44J6k44M3M7L4k36J71n9J53j00Lk0J49p4j3P0
5435G9k9j80J57N7k40J56q6O7LQ2j01L0n8PJ94k5j51k08K37Mp1N5Q2j49Q2N4O8
5462A16p2q0OJ86l08O6J93r8q8R6L5K19m17J3L95k63m0J17M2j67O1Q9j13k8L6
5487dJ44j11m9L9j45Q2o8J63K8n0k15J52J41q6m7J21k30J12K0J0n9Q6J20K4j48
$$ plain form
5512 30 -147 31 110 -28 -40 -85 98 -7 -50 57 185 -155 41 92 94 -5 -9 -62 -5 -139 -119 42 13 -110 -176
5537 -176 129 100 -189 88 24 10 41 67 -65 -54 27 -180 -30 -272 -62 82 -124 17 20 153 78 -94 -25 38
5561 38 -60 98 -88 -8 -115 -35 10 -91 -103 95 121 61 -159 -53 11 -93 10 33 -62 -62 -110 90 10 -116 -154
5586 -154 163 159 23 11 47 83 32 -25 160 -29 -129 -10 99 -101 18 -88 -35 -24 41 77 114 -80 187 18
5610 18 86 18 18 35 -113 -53 -16 -36 -112 -160 -49 52 -52 -52 -10 -57 3 40 91 90 -30 108 33 -63 -52 27 -56 -23 -35
5639 -35 -28 103 -237 -41 138 65 40 -8 45 -150 -20 24 61 -12 -157 89 122 -60 38 127 110 -135 -8 -37 63
5664 63 -35 29 13 -7 -53 -12 42 -91 -85 -147 53 83 33 -226 -51 -240 49 169 74 -113 176 133 -48 -23 74 196
5690 196 112 -30 128 26 21 -62 -17 196 -106 -69 35 -89 -96 12 116 39 -81 -40 -94 -90 -148 -17 78 -135 -18
$$ packed form
5512C0j77J78P9j38j2m5J83j05m3J07J28l40J96N1Kr9mn3N7j34K0J61k9j23o6
5537a76L05k9k89K77o4j4L1K6j32J1Q1k07J50k42K10J44k06J41LJ33p5j72O9O3
5561C8r8J58j86Q0j07Q0M5j01j2J98K6o0k20J06O4j04J03K3r5%m8K00q0j26l8
5586a54L17mj36j2L6L6n1n7J85j89j00J19J09k00J19j06N3J1O5L6L7j94K67j69
5610A8O8o8%J7j48O0L7k0p6m8J11J01j04%M2m7O0L7N1jj20J38p5r6J1P9q3L3j2
5639c5PJ31l40J96J79p3k5m8N3j95J30M4L7p3j45K46L3j82R8Q9j7k45J27k9J00
5664F3r8O4j6k0m6M1N4j33Oo2K00L0n0k59J75j89K89J20r5j87K89m3j81K5R7J22
5690A96q4j42J58j02nq3M5K13l02L7J04j24pJ08J04p7j20M1n4Mn8J31R5k13J17
$$ plain form
5715 -18 161 150 -11 7 -73 -115 -40 -23 116 -21 16 -129 34 -20 107 8 63 108 -23 108 -22 -96 195 19
5739 19 -41 -139 -1 49 -89 -67 84 2 -150 39 46 -30 -152 -102 -109 51 -42 -129 -7 81 63 -78 88 -113 27
5764 27 132 -22 -141 -54 -4 151 77 -54 -92 45 -27 -23 71 -75 -14 -58 113 62 -149 22 120 38 -259 10 143
5789 143 -133 22 -42 129 187 -70 -36 -82 4 127 167 -17 32 -161 1 -131 -105 -33 45 29 -253 27 -22 19
5813 19 72 30 -48 11 170 135 -94 41 142 -40 -154 -54 150 105 -167 61 -21 3 37 48 -4 25 -86 -71 -26
5838 -26 -150 58 124 68 -10 82 16 58 -83 -39 49 278 21 72 -52 60 20 51 237 -68 174 76 108 -18 -118
5863 -118 -54 2 -67 25 59 119 106 -148 33 49 14 51 -85 31 -11 7 67 -59 34 21 -42 0 25 91 -52 -70 -69
5890 -69 -77 -22 -71 33 130 -101 -1 -56 -109 -65 16 1 55 -111 -120 -36 -3 -41 15 116 202 -138 -27 30 -129 18 -99
$$ packed form
5715a8J79j1j61J8q0m2P5J7J39j37L7j45J63n4J27r9N5M5j31J31j30p4K91j76
5739A9o0r8J38N0j38K2J51q2j52J89Pp6j22N0pJ60r3q7J22Q8j8j41J66k01J40
5764B7J05j54j19Q7N0J55p4j31l8J37p2MR4j46O1m4J71n1k11J71R8q2k97K69J33
5789A43k76J55o4J71N8k57L4m6Q6J23M0j84M9j93J62j32K6P2P8j6k82K80m9M1
5813A9N3m2p8N9J59l5k29J35J01j82j14J00K04m5k72K28q2K4L4J1n2K9j11J5M5
5838b6j24K08O6n6p8R2o6M2j41M4Q8K29k57N1j24J12m0L1J86l05K42r8L2j26j00
5863a18O4N6o9R2L4O0j3k54J81J6l5L7j36J16m2J8O0j26R3j3o3M2K5O6j43j8J
5890f9qN5m9J04R7k31J00n5n3M4Q1j5N4j66rQ4L3l8N6J01Q6l40J11N7j59J47j17
$$ plain form
5917 -99 -102 134 -48 -19 255 -137 -82 13 -63 -51 -62 -16 181 -47 65 4 72 -114 -54 76 51 -75 15 22 40 29
5943 29 -128 41 -111 -125 96 23 -147 -199 54 14 -120 -82 53 -8 -180 -4 130 40 -29 2 51 32 -78 -1
5967 -1 221 21 -40 4 -68 -15 -63 107 61 102 49 55 10 -49 -23 98 -15 -105 53 -24 -127 -85 143 -32 12 -59 90
5994 90 12 71 43 -1 10 -87 50 -42 135 -66 244 -6 -29 -106 83 128 -90 -73 5 -25 -153 -126 -57 -92 -137 101
6020 101 -115 -220 40 72 58 -159 -113 -74 -48 29 161 71 -96 -13 -44 -25 -4 -32 -62 62 113 -142 92 23 -52
6045 -52 3 77 5 -101 16 71 -57 82 2 -88 -26 -11 -33 -52 -16 50 -34 70 9 -27 19 -137 -118 -33 -32 -57 -63 -191
6073 -191 -180 -53 57 109 138 -187 -99 -153 106 50 24 -47 52 -47 96 -35 132 -8 77 76 -105 -30 -47 -145 59
6098 59 -163 -203 -42 1 23 72 28 -54 45 9 92 -21 5 112 141 -58 -12 30 -84 67 189 46 -43 -10 22 219
$$ packed form
5917i9lK36j82K9K74l92N5R5p6J2j1M6J97k28J12o1O8j86O0J30k5j26R0PJ8j1
5943B9j57J69j52j4K21p3j70n2K53m0j34L8J35o1j72J76J34r0o9L1M9j9j10P7
5967aK22k00o1M4p2N3m8J70m6M1n3Om5n9K6J21j13r0J58p7j03M2K28j75M4p1J49
5994I0p8N9k8m4J1r7J37r2J77k01L10k50k3p7J89M5k18J7P8l0j28K7O9l5m5K38
6020A01k16j05K60L2j4k17M6L9K6P7J32r0j67Q3l1J9K1k8l0J24N1k55K34o9p5
6045e2N5P4p2j06J17N5j28J39q0r0O2J5k2j9L6O6q4J04o1l6M6j56J9Q5Jk5oj28
6073a91J1J27J10N2K9l25Q8n4K59n6k6p1R9r9J43j31J67j40Q5jj81P5j7r8K04
6098E9k22m0J61M3K2M9m4q2R9l6Q3j13K6J07K9j99M6M2j14J51J22j43q9L3L2J97
$$ plain form
6124 219 92 -36 -108 -116 43 105 -26 -1 86 -89 137 47 86 -125 -135 99 -141 19 117 -10 50 155 18 74
6148 74 91 -101 139 85 -121 -65 -97 -117 -9 91 2 -10 61 97 7 -83 -82 -90 -123 -49 138 65 30 -75 3 -4 -82 96
6176 96 46 -15 -48 172 87 -67 -120 60 -24 -109 -73 94 68 -20 48 -63 39 36 11 34 14 30 8 108 -203 12
6202 12 75 31 59 -146 112 -112 49 -60 100 2 -65 4 330 -188 34 167 -110 -40 62 6 -74 -76 -89 205
6226 205 -124 -91 95 81 19 -84 -12 22 -167 -49 134 159 -157 -148 174 96 -126 0 132 11 12 -67 -108 -223
6250 -223 11 -6 63 9 -25 165 56 -102 23 40 46 35 112 49 -80 -91 78 120 -76 -148 8 14 -17 -65 48 -96
6276 -96 -9 -65 34 33 4 -34 71 -52 36 114 -41 -35 -94 4 13 115 15 123 -8 -6 -101 -45 30 -99 -95 65 -41 -105
6304 -105 -65 86 114 13 6 -9 -42 -44 24 -124 -130 -92 117 -44 -59 -61 37 -119 -43 -105 -7 -91 -63 60 -29 4 -157 79
$$ packed form
6124B19j27j28p2qJ59O2j31K5Q7j75K26r0L9k11j0K34k40J60R8j27O0J05j37N6
6148G4J7j92K40n4k06N6l2k0J08J00q9j2P1L6r0r0Jql3P4J87p3l5j05P8pp8J78
6176I6n0o1l3K20q5j54n3J80q4q5L6J67k6q8O8j11J02lk5K3k0J6k2J00l11K15
6202A2O3m4K8k05K58k24J61j09J60r8o7O9L26n18K22J33k77P0J02n6q0kj3K94
6226B05l29L3J86j4o2j03P2L4j89J18J83K5l16RL22p8k22J26J32j21Jp9m1j15
6250b23K34j7O9n4l4J90j09j58J25J7Oj1P7o3j29j1J69M2j96p2J56Ol1m8J13j44
6276i6Q7n6R9jk9l8J05j23Q8P8j55On9R8RJ02j00J08j31Kr5N6P5j29MJ60j06o4
6304a05M0J51K8j01pj5l3kO8j48oL8K09j61j5kR8j56P6o2R8q4K8J23q9L3j61K36
$$ plain form
6332 79 9 55 -79 137 -82 -125 -158 -125 129 -37 -23 -32 87 -16 140 70 -127 -16 94 -72 -51 -32 94 8
6356 8 124 84 -12 -63 78 50 -60 -83 -92 -97 25 -33 128 218 36 61 -100 -45 -101 -69 71 -133 86 -42 66 72
6382 72 23 -142 19 89 -39 29 45 47 -52 -148 60 81 -12 -2 -35 -31 -149 62 32 -133 -3 162 135 79 -262 -58
6408 -58 56 64 36 109 -54 -178 -15 7 -130 -8 32 102 95 101 -84 -51 -71 -61 152 9 -110 29 54 39 -85 136
6434 136 8 62 -3 173 37 -73 -182 -4 37 101 -39 21 133 -97 -58 114 38 0 -122 114 -72 42 115
6457 115 9 -176 -27 -24 -112 114 127 -57 8 -77 -67 175 37 -124 -36 29 34 13 -84 45 -84 22 -101 -1
6481 -1 -70 15 187 -167 -30 -64 -48 -80 -41 48 -1 7 -28 -9 125 -69 -37 26 106 21 58 97 19 -92 -25 -100 -79 8
6509 8 43 152 255 -12 142 73 0 48 -46 97 -113 -41 -71 -13 -149 -27 100 157 -42 103 -87 11 -76 63
$$ packed form
6332G9p0M6j34K16k19m3l3L3K54j66J4rJ19j03J56p0j97J11J10j66K1J9J26q6
6356HJ16m0r6n1J41k8j10k3rnJ22n8J61R0j82K5j61N5n6L2J40k04K19j28J08O
6382G2m9j65J61P0j28O8J6Kr9r6K08K1r3J0l3Mj18K11l0j65J30J65k7n6l41K04
6408e8J14Qk8P3j63j24J63K2j37J22M0P0pOj85L3k0J0K13j43j19J39K5j5j24K21
6434A36j28N4o5J76j36j10j09J78M1O4j40O0J12k30L9J72p6l8j22K36j86J14P3
6457A15j06j85J49Lq8K26J3j84O5q5J0K42j38j61Q8O5Nk1r7J29j29J06j23J00
6481ao9Q5J72l54J37l4J6l2L9Q9m9Ql5J9J34j94L2O3Q0q5L7L9p8j11O7p5K1Q7
6509HL5J09J03k67J54o9p3M8r4J43k10P2l0N8j36J22J27N7j99J45j90R8q7J39
$$ plain form
6533 63 87 -107 44 -155 29 -47 -49 196 -6 -8 -58 94 -10 13 -5 193 70 -98 129 -72 28 47 54 -66
6557 -66 -28 -58 175 88 -245 -177 203 93 -130 -149 -87 -97 -18 118 132 151 59 -8 46 -113 114 18 13 -36 -218 61
6583 61 132 -24 22 -18 -190 118 100 126 -37 -175 -131 -1 115 37 22 45 -56 52 53 95 -57 2 67 -16 -31 34
6609 34 -10 -82 -122 42 57 -106 46 80 -24 -51 20 60 99 103 -32 -6 38 11 -89 -29 -134 -25 -95 43 20 54
6635 54 29 -50 -150 -57 -57 71 141 8 46 86 32 -53 55 -109 -174 -50 40 3 25 -116 41 138 -193 -102 -5 -88
6661 -88 -54 -83 -84 -169 23 -94 7 -31 -39 -96 150 -71 99 -100 6 90 -40 157 -115 -25 -88 25 -91 -87 -39
6686 -39 -62 -139 -23 -65 -10 -104 -143 17 74 52 35 50 -154 0 111 57 -53 132 138 63 135 44 -42 -18 29 -87 -50
6713 -50 -60 63 -90 -44 31 129 -37 81 -69 97 -57 95 -45 -238 14 68 -36 145 -42 51 -39 51 133
$$ packed form
6533F3K4j94J51j99J84p6kK45k02kn0J52j04K3j8J98j23j68K27k01J00J9Pj20
6557f6L8l0K33q7l33O8L80j10k23j9O2j0P9J36J4J9r2o7N4j59K27r6nm9j82K79
6583F1P1j56M6m0j72L08j8K6j63j38M4J30J16p8j5K3j01J08JM2j52N9O5q3j5O5
6609C4m4p2m0J64J5j63J52L4j04k7P1M0L9Mj35K6M4k7j00O0j05J09p0J38k3L4
6635E4k5p9j00R3%J28P0j33L8M0n4q5J08j64o5J24R0l7K2j41J57R7l31R1R7q3
6661h8L4k9jq5J92j17J01l8qn7K46k21J70j99J06Q4j30J97k72R0o3J13j16MM8
6686c9k3p7J16m2N5r4l9J60N7k2j7J5k04J54J11n4j10J85Op5P2r1q6K4M7j16L7
6713e0j0J23j53M6P5R8j66J18j50J66j54J52j40j93K52N4j04J81j87R3r0R0Q2
$$ plain form
6736 133 -51 84 158 -46 -87 26 70 -70 -187 31 -8 125 -6 31 -52 -13 65 -6 38 -122 -29 93 54 -23
6760 -23 -69 110 -124 -180 -4 -72 -41 -44 -49 101 -52 -38 42 -45 -8 -171 141 -18 -42 74 -17 70 25 -94 -4 -180
6786 -180 52 -118 107 -76 10 -100 -11 -10 10 -75 63 100 -54 62 -118 -114 -72 89 10 -144 -114 -53 -121 -101 -91
6811 -91 -147 -254 -63 41 -35 2 4 11 3 -120 147 -32 -27 35 52 25 -46 10 -17 -46 -32 -59 62 -91 -36 109 15 -57
6839 -57 -154 30 155 16 -187 40 78 93 60 80 -9 -54 -66 105 62 -11 66 55 4 -18 -87 -66 -63 -42 -56 32 -49 -48
6867 -48 -76 186 56 -55 -44 -98 -40 -75 131 -44 32 28 74 -73 -12 -35 52 32 -31 -4 157 -41 -30 -54 -28 -157
6893 -157 -21 -59 134 -107 38 56 -30 -77 40 -16 -107 34 -130 -28 -171 -81 5 189 30 -57 5 71 107 118
6917 118 1 45 58 13 136 -64 -50 4 -102 -49 109 99 -66 92 107 151 -47 4 35 133 82 -80 -81 48 37
$$ packed form
6736A33j84J35P4k04m1J13M4j40j17K18l9J33j31L7q3L9P8p1M4j60R3J22l9p7
6760b3m6J79k34n6J76o8L1lnJ50j53J4Q0q7L7j63L12j59k4J16r1Q7m5j19R0j76
6786a80K32j70K25j83Q6j10Q9JK0q5J38L7j54J16j80MM2J61p9j54L0O1o8K0J0
6811i1n6j07J91J04p6L7KPqj23K67j79NO2J7k7p1N6k7k9J4k7J21j53N5J45r4p2
6839e7r7J84J25j39k03K27L8J5l3K0q9m5j2J71m3p3P7j1n1k2o9K1LK1j4Q8q1J
6867d8k8K62j30j11J1n4N8l5K06j75P6mM6j47O1k3Q7k0o3K7J61j98J1k4K6j29
6893a57J36l8J93k41J45J8q6m7J17n6r1J41j64J02j43R0Q6J84j59q7O2O6L6J1
6917A18j17M4J3m5J23k00J4N4j06N3J58j0j65J58J5M4j98N1L1R8n1j62jJ29j1
$$ plain form
6942 37 -73 39 2 -57 -139 -8 67 -268 16 -127 99 -60 88 -37 -3 -98 73 62 33 -117 -79 -18 108 66
6966 66 -13 -71 -42 61 -44 63 -56 97 -102 7 -45 14 5 -120 -59 -118 -70 -118 -83 199 35 51 87 -26 -47
6991 -47 53 -97 -20 -40 -121 49 -63 185 34 -27 44 21 -89 53 -160 -94 14 100 44 -90 38 -102 -25 -109
7015 -109 28 -45 -122 -61 8 19 -109 15 -21 144 64 -120 -58 24 -150 -73 112 97 29 122 -37 -137 16 -16 -65
7040 -65 102 -113 -106 -85 -145 -48 -78 -46 49 -96 -22 -35 53 -9 -76 -19 4 35 47 61 -63 29 86 -101 51 74 69 63 113
7069 113 -127 1 -29 -75 77 13 88 19 -98 30 -47 -178 -183 -121 -123 143 141 -176 56 -163 175 49 -120 -38 -45
7094 -45 -30 -103 -29 -29 -87 -25 -57 112 -25 -53 -151 -88 -124 17 -130 6 -100 -6 -46 -107 32 49 79 79 40 -142 -45
7121 -45 -1 -60 4 55 -50 28 88 41 129 126 -62 -159 22 20 -31 -74 111 -137 -22 16 -24 -2 31 -46 47 65 -126 -75
$$ packed form
6942C7j10J12l7n9q2J31P5l35K84j43K26j59J48j25L4r5J71j1k9j50L8O1J26m2
6966F6p9n8K9J03j05J07j19J53j99J09n2N9rj25O1n9M8m8L5K82j64J6L6j13k1
6991d7J00j50P7k0q1J70j12K48j51o1P1k3j10J42k13O6J08Q6n6j34J28j40P7q4
7015a09J37p3p7O1O9J1j28J24l6J65q0j84O2Q2j74P7J85j5o8R3j59j00J53l2m9
7040f5J67k15PK1o0R7l0L2R5j45P4j3Q8o2o7N7K3L1J2J4j24R2N7j87J52K3noN0
7069A13k40J28l0m6J52o4P5o9j17J28p7j31nO2kK66kl17K32k19L38j26j69Q2p
7094d5J5p3P4%n8O2l2J69j37k8r8O3l6J41j47J36j06R4m0o1J39J7L0%l9j82R7
7121d5M4n9O4N1j05P8O0m7Q8lj88r7J81kn1m3J85k48J15L8m0K2L3p7R3J8j91N1
$$ plain form
7149 -75 -39 -39 -41 121 57 26 10 68 -45 62 58 61 -84 -256 298 -10 105 -120 -16 1 -38 50 -101 -83 -160 61
7175 61 -123 140 -60 150 62 129 146 179 -1 0 17 28 -105 -121 10 -10 70 -163 13 -10 17 75 44 -35 67 -121
7201 -121 -34 93 37 -29 51 17 -2 -58 -38 -48 35 10 47 -67 -184 -175 106 62 29 75 71 74 -108 -16 100 -171 -70
7228 -70 47 54 -197 -14 20 -66 66 23 34 36 -78 119 71 66 121 37 -41 -9 -102 -73 60 139 49 10 126 1 64
7255 64 97 -139 70 35 -5 79 -70 206 -121 127 -89 -122 -37 -203 98 114 -29 -29 -48 -135 -161 56 87 6 20
7280 20 -8 6 -146 -7 -50 -25 -54 50 112 -96 -56 189 -18 38 -39 -83 -86 -73 134 -34 -37 47 -89 -18 11 -32 -52
7307 -52 -36 121 -100 26 -161 84 76 -99 33 -39 25 96 -49 23 2 -86 -73 -23 27 -133 71 -77 -6 -13 -56 9
7333 9 55 -71 1 -60 -162 10 -136 -64 -40 -19 70 14 73 4 167 -81 -79 -3 22 -34 -20 19 -1 -16 94 72 87 -5
$$ packed form
7149g5L6%kJ62o4l1j6N8j13J07mLj45j72N54l08J15k25J04J7l9Q8j51J8p7K21
7175F1j84K63k00K10q8O7J7L3j80JJ7J1j33j6J31k0Q0k33J76k3K7N8l1p9J02j88
7201a21Q7J27n6o6Q0l4j9n6K0j0Q3k5L7j14j17RK81m4l3M6mLj82R2J16k71J01
7228g0J17Pk51J83L4q6J32m3J1Kj14J97m8nN5q4p8L2r3K9J33P9r0l9J16j25O3
7255F4L3k36K09l5m0Q4j49K76l27K48k16l3Q5j66L01J6j43%j9q7k6K17L1q1J4
7280B0k8J4j52J39m3K5k9J04O2k08M0K45k07N6p7m4lJ3K07j68lQ4j36P1K9m3k0
7307e2J6J57k21J26j87K45qj75J32p2O4P1j45P2k1q8J3N0N0j60K04j48P1pm3O5
7333IM6j26P2o1j02J72j46P2K4K1Q9n6N9o9J63k48KP6K5n6J4L9k0j5J10k2J5r2
$$ plain form
7361 -5 -68 40 19 -44 -7 56 36 -48 -22 4 -67 -81 45 -100 -49 -14 51 69 -57 81 -62 -111 -27 68 99 -24 4
7388 4 66 -10 17 -152 103 -7 -61 -114 139 81 14 66 102 41 72 -82 67 -102 51 -54 -51 27 9 -112 87 58
7414 58 52 16 122 21 120 11 -132 -67 74 30 -158 11 -128 9 1 25 58 78 11 -53 -103 -41 46 -42 23 -165
7440 -165 -23 -33 134 58 -128 -111 -45 16 -27 -77 43 -16 -21 114 8 68 -91 -62 -4 85 148 164 -135 -109 -51 56
7466 56 24 -5 37 73 -154 -60 -43 -79 -24 15 27 9 47 -18 -28 118 68 -6 66 65 157 -101 -37 -50 -171 -31 42 21
7494 21 -143 -76 17 -130 30 -7 6 -151 -83 32 -5 31 -126 -85 -52 -18 15 -24 49 -139 69 -21 37 68 -62 -128
7520 -128 30 25 84 -10 139 126 -280 83 31 36 9 146 142 -27 -59 -144 -63 2 92 -3 137 150 -21 7 -91 8 54
7547 54 177 10 -91 -13 -21 -49 80 25 -12 28 254 -275 -71 13 -61 -18 119 -21 -30 86 28 49 -32 39 -106 -57
$$ packed form
7361eo3J08k1o3L7O3k0q4K6K6p1j4J26j45N1L5O5J8j26J38j43m9Q4R5L1j23K8
7388DO2p6K7j69K55j10n4n3K53n8o7N2L6o1L1j54J49j69J53j05LP8j8j21J99k9
7414E8ol6J06j01R9j09j43O5J41m4j88J69j39J37qK4L3K0o7o4n0O2Q7q8O5j88
7440a65J42j0J67p6j86J7O6O1m3n0J20n9nJ35j06O0j59K9N8Q9O3J6k99K6N8J07
7466E6l2k9M2L6k27R4J7l6N5L9J2j8L8o5j0J46n0p4P2jR2k58O4j3j21J40P3k1
7494B1j64O7R3j47J60l7J3j57O8J15l7L6j57M1L3L4L3l9P3j88K08r0N8L1j30o6
7520a28J58nN9r4J49j3m06L63n2Nk7J37mj69l2q5Q1O5R0r5J40J3j71K8r8R9M6
7547E4J23j67j01P8qk8J29n5l7M0K26n29K04Q4p4M3J37j40rJ16n8K1q1P1j45M9
$$ plain form
7573 -57 -97 19 -316 -26 -7 -39 -10 -77 8 60 32 142 62 -8 27 -23 117 -30 91 -65 12 37 89 -6 1 -4 25
7600 25 -41 -149 110 91 -100 -96 5 136 138 72 15 -22 -7 -64 -74 -148 -35 -56 158 -63 -65 -55 113 -62 -107 33
7626 33 -21 -40 15 -64 18 -26 -15 12 -5 2 -59 -47 -13 -214 118 61 91 32 -90 -52 45 64 -149 81 22 48 -104 -76
7654 -76 -73 -8 -4 38 9 -256 -91 -121 151 43 -68 97 -147 11 -94 83 46 -38 21 -17 -38 -46 156 -57 -91 22
7680 22 92 -4 4 48 17 41 100 58 27 35 -142 111 114 9 -18 1 11 146 49 97 -17 -73 -104 -241 -61 34 41 -157
7708 -157 -16 82 204 -97 -107 67 64 40 23 -7 49 16 56 174 69 60 -94 9 -52 -83 29 -111 -14 55 -26 -90
7734 -90 -77 -35 109 20 37 194 41 -70 83 -61 105 48 48 3 -127 -9 8 53 -57 -56 66 -87 -86 1 6 -134
7760 -134 -47 -31 -30 -37 -38 -57 26 -22 62 -2 10 67 -59 -64 -4 119 -29 -102 31 88 -50 -91 27 4 -1 -11 -20 -38 -67 -18
$$ packed form
7573e7m0J16l35K90J9l2K9o7Q5N2k8J10q0p0L5n0J40j47J21j56P7K5N2r5PnK9
7600B5o6j08K59j9j91MJ01J31Ko6n7l7J5n7j0p4J13k1K14k21kJ0J68j75m5J40
7626C3n4j9N5p9Q2m4J1K7j7Po1J2L4k01L32n7L0n9j22L8R7J9k13K30n9K6j52K8
7654g6LO5MM2k9k65J65l0K72j08j11J65k44J58j05J77l7q4N9l8k1qK02k13l4J13
7680B2P0r6QM4l1K4N9m2l1Qj77K53Lj05k7J9J0J35r7M8j14n6l1j37J80R5Pj98
7708a57J41R8J22l01j0J74lk4j7l0N6l3M0J18j05rj54J03o1l1J12j40R7O9q1o4
7734i0J3M2J44q9J7J57j53j11J53j44J66n7%m5j30J18J7M5j10JJ22j53JQ7Nj40
7760a34Q7J6Jpjj9Q3m8Q4o4J2N7j26nO0J23j48p3J33N7j38m1J18k3nj0rj8k9M9
$$ plain form
7790 -18 -91 30 -116 68 -73 66 -7 -28 150 -29 -91 28 -128 -87 -38 42 -52 5 -83 43 -49 134 48 -28 -7
7815 -7 63 69 140 73 -268 45 30 -144 -45 69 1 -190 -101 86 65 -40 -219 -50 -21 104 -68 139 94 157 -23
7840 -23 26 -53 83 -178 140 -118 -192 149 55 53 -57 -11 90 -79 -39 -63 66 112 67 158 66 -47 65 -183 16
7865 16 -201 -177 52 137 -94 93 -81 25 -27 -10 -173 118 64 82 74 -131 150 0 78 183 33 -88 1 61
7889 61 120 -15 -75 -47 19 143 49 -28 24 -27 -122 -108 -6 -59 40 102 33 110 7 -117 -42 -3 88 176 34 -82 149
7916 149 12 -147 -122 -136 41 117 94 73 94 87 63 -72 23 -61 -13 -64 24 80 -79 -64 -4 -46 -124 8 100 -45 -88
7943 -88 188 90 33 7 -14 89 154 -59 2 26 24 -86 96 28 52 80 16 -308 -34 -5 141 -11 29 30 -120 -38
7969 -38 -52 25 -13 -125 76 56 148 -220 2 -127 -32 86 -56 -58 -117 -28 -49 -26 51 -80 78 5 -58 -22 -150 -124
$$ packed form
7790a8p3J21j46J84j41J39p3k1J78j79o2J19j56M1M9Q0r4N7q8J26r2J83q6p6K1
7815gP0OP1o7l41L13j5j74R9J14o8j91Q9J87k1j05j79J69K9J25j72K07m5O3j80
7840b3M9p9J36k61L18k58p4L41r4kj10M6J01j69M0k4J29M6m5R1r2j13J12k48J99
7865A6k17K4K29Q5k31J87j74J06n2J7j63K91n4J8qk05K81j50P8J05j50j21Q9O0
7889F1N9j35o0K8O6J24r4p7N2n1r5J4J02n3R9O2o9P7j03j24P5L9R1Q8j42j16K31
7916A49j37j59K5j4J77P6k3k1K1pk4j35R5q4M8n1Q8N6j59J5O0m2p8J32R2j45m3
7943h8K76r8n7k6k1J03O5k13O1K4kj10J82o8K4K8o4l24K74K9J46j52M0Jj50Q2
7969c8j4P7l8j12K01k0R2l68K22j29R5J18j42kn9Q9k1K3P7j31J58p3o3L6j28K6
$$ plain form
7995 -124 -84 -66 83 -62 16 46 45 -71 135 -109 -48 -180 138 -121 -45 -11 39 216 -115 -89 -105 -3 -158 -25
8019 -25 136 -40 69 -96 -13 -114 -100 -17 -38 -124 45 -9 -169 -198 -23 59 -125 -104 -69 157 -72 154 -49 -71
8043 -71 63 -24 56 89 -100 -105 -103 37 -116 -20 -112 -91 -35 16 136 -9 101 65 109 -10 9 62 -118 -126 -47 -29 23
8070 23 -103 25 -68 119 93 -76 15 77 -149 -16 -73 -125 70 1 -21 136 -125 36 -5 -244 -101 71 150 47
8094 47 92 -1 20 33 92 -58 66 -88 21 12 -83 99 -70 25 104 -22 -96 94 209 -30 -22 11 55 27 27 41 -116
8121 -116 -95 136 -125 -3 12 35 91 131 -23 6 -50 -11 -77 115 78 -8 27 -138 97 70 109 -71 56 10 -76
8146 -76 95 -93 63 -93 -10 -45 99 -69 118 -86 -115 46 40 22 25 171 34 -37 -123 27 -132 -33 56 -72
8170 -72 -91 -49 125 19 -11 30 48 1 13 5 -12 22 190 6 -120 16 -143 -17 68 34 57
$$ packed form
7995a24M0J8J49j45P8L0jj16K06k44O1j32L18k59P6L4N0J77l31K6j6J02j55J33
8019b5J61j76J09j65Q3j01J4Q3k1q6J69n4j60k9J75Q2j84K1L5K26k29K26k03k2
8043g1J34q7Q0L3j89nKJ40j53R6r2K1N6N1J20j45J10l6M4j19J9N3j80qP9J8N2
8070B3j26J28r3J87k6j69R1O2k26J33n7n2J95o9k2J57k61J61m1k39J43J72P9j03
8094D7M5r3K1J3N9j50J24j54J09rr5J82j69R5P9j26p4J90J15k39QL3M4k8%J4j57
8121a16K1K31k61J22J5K3N6M0j54K9n6L9o6J92l7q6L5j65K35k7L9j80J27m6q6
8146g6J71j88J56j56Q3l5J44j68J87k04k9J61oj8LJ46j37p1q6J50j59R9Q9j28
8170g2j9M2J74j06l0M1J8m7J2qj7L4J68j84j26J36j59J26Q5l4K3
8191E7
$$ Imaginary data points
##PAGE= N=2
##DATA TABLE= (X++(I..I)), XYDATA
$$ plain form
0 0 0 0 0 0 0 0 8 -8 8 -8 14 -16 16 -24 31 -32 40 -48 64 -72 88 -104 121 -142 164 -188 219 -251 284 -324
30 -324 369 -417 470 -527 591 -662 740 -820 912 -1013 1121 -1238 1367 -1510 1662 -1829 2012
47 2012 -2213 2432 -2676 2944 -3242 3578 -3951 4377 -4864 5428 -6084 6864 -7804 8960
61 8960 -10418 12311 -14860 18458 -23864 32754 -49580 91261 -367491 -502628 545827
72 545827 -283934 207241 -319194 48740 386917 -437103 56239 44454 227269 -206809
82 -206809 -105556 282681 -126282 64875 -234594 364254 16564 -356906 339120 -80391
92 -80391 114534 -160112 86704 268653 -289255 107939 2669 211186 -139157 -89210
102 -89210 309047 -155642 79906 -151044 262539 75318 -336481 317920 -78670 98930
$$ packed form
0@%%%%%%Qj6J6j6K2l0L2m0N5o3P2q8J12j36J60j92K25k63L06l52M07m70N35o08
30c24O93p86Q87r97J118j253J402j560J732j925K134k359K605k877L172l491L841
47B012m225M645n108N620o186O820p529Q328r241J0292j1512J2948j4668J6764
61H960j9378K2729k7171L3318m2322N6618q2334J40841m58752j35137J048455
72E45827q29761M91175n26435L67934L38177q24020M93342j1785J82815m34078
82b06809J01253L88237m08963J91157k99469N98848l47690l73470O96026m19511
92h0391J94925k74646K46816J81949n57908L97194j05270K08517l50343M9947
102h9210L98257m64689K35548k30950M13583j87221m11799O54401l96590J77600
$$ plain form
112 98930 -128170 21884 307130 -323732 144633 -26995 111346 5523 -207134 332614
122 332614 -182111 34959 -13656 15750 178470 -305074 222440 -7512 -87259 55536
132 55536 -44483 170763 -199857 49154 63511 -19390 -34208 -83388 228321 -175524 -23883
143 -23883 47622 3071 86237 -250047 184247 37480 -155783 31196 592 124881 -186151
154 -186151 3653 93155 -30141 -51850 -88750 216594 -137441 -75837 77426 -13463 71657
165 71657 -220571 143712 74460 -184650 43883 2236 109028 -150473 -44118 153028
175 153028 -62258 -54229 -57614 168231 -51674 -148759 101828 24329 15417 -143832 64360
186 64360 128408 -150123 -28564 58994 75264 -97342 -63704 114419 11675 -78638 -52372
$$ packed form
112I8930k27100J50054K85246o30862M68365j71628J38341j05823k12657N39748
122C32614n14725K17070m8615K9406J62720m83544N27514k29952p9747J42795
132E5536j00019K15246l70620K49011J4357q2901j4818m9180L11709m03845J51641
143b3883P1505m4551Q3166l36284M34294j46767j93263J86979l0604J24289l11032
154a86151J89804Q9502j23296k1709l6900L05344l54035O1604J53263r0889Q5120
165G1657k92228L64283o9252k59110K28533m1647J06792k59501J06355J97146
175A53028k15286Q029l385K25845k19905r7085K50587p7499q912j59249K08192
186F4360O4048k78531J21559Q7558J6270j72606L3638J78123j02744r0313K6266
$$ plain form
197 -52372 142558 -17315 -112471 44488 43691 29196 -123280 40570 107547 -91750 -36191
208 -36191 34553 75643 -64342 -56508 84706 17824 -48498 -49612 100387 9983 -96403 37670
220 37670 30891 19111 -72118 5350 94805 -62622 -37333 37964 38539 -29355 -40759 44973
232 44973 29370 -46543 -24641 63548 -1354 -47191 10380 27254 3715 -45216 17921 40465
244 40465 -30621 -26136 28571 25944 -41735 605 25899 4654 -27790 -17984 59252 -24674 -36105
257 -36105 28755 11551 -7791 -38127 33045 27523 -43669 -10776 31864 17439 -51626 4897
269 4897 38829 -11480 -33661 -6022 57931 -29034 -42407 34551 23121 -22836 -39572 40903
281 40903 26894 -44029 -22446 40948 22902 -62725 3387 43868 -5500 -37984 -15276 68304
$$ packed form
197e2372J94930j59873r5156J56959p97j4495j52476J63850O6977j99297N5559
208c6191P0744M1090j39985P834J41214o6882o6322j114J49999r0404j06386J34073
220C7670o779j1780r1229P7468Q9455j57427K5289P5297N75o7894j1404Q5732
232D4973j5603p5913K1902Q8189o4902m5837N7571J6874k3539m8931O3137K2544
244D0465p1086M485N4707k627o7679M2340K5294k1245l2444R806P7236q3926j1431
257c6105O4860j7204j9342l0336P1172n522p1192L2893M2640j4425o9065N6523
269D897L3932n0309k2181K7639O3953q6965j3373P6958j1430m5957j6736Q0475
281D0903j4009p0923K1583O3394j8046q5627O6112M0481m9368l2484K2708Q3580
$$ plain form
293 68304 -22130 -51734 30132 30780 -12276 -54918 38488 37268 -41244 -27335 27934 41305 -57892
306 -57892 -17389 50425 4207 -34593 -27009 61126 2540 -57875 15725 34113 1340 -52522
318 -52522 13127 49471 -28201 -34548 17444 39987 -30579 -32413 34037 21931 -26797 -29855 40383
331 40383 17409 -41174 -4445 28106 11277 -38458 -4851 38363 -4921 -32877 4172 33862
343 33862 -14035 -23608 10690 23755 -9749 -31159 23972 17920 -25052 -7638 13659 12132 -19268
356 -19268 -12860 25038 2430 -21636 1191 17748 -3457 -15321 4030 15890 -8100 -13710
368 -13710 9329 9238 -9387 -10813 15021 -94 -10473 -21 6539 6170 -18788 9289 9775 -12381
382 -12381 1166 -932 13175 -12746 -9246 19251 -6620 -7547 -3728 15961 -4217 -17203 11495
$$ packed form
293F8304r0434k9604Q1866O48m3056m2642R3406j220p8512J3909N5269J3371r9197
306e7892M0503O7814m6218l8800P584Q8135n8586o0415P3600J8388l2773n3862
318e2522O5649L6344p7672o347N1992K2543p0566j834O6450j2106m8728l058P0238
331D0383k2974n8583L6729L2551j6829m9735L3607M3214m3284k7956L7049K9690
343C3862m7897r573L4298J3065l3504k1410N5131o052m2972J7414K1297j527l1400
356a9268O408L7898k2608k4066K2827J6557k1205j1864J9351J1860k3990n610
368a3710K3039r1j8625j426K5834j5115j0379J0452O560l69k4958K8077M86k2156
382a2381J3547k098J4107k5921L500K8497k5871r27L819J9689k0178j2986K8698
$$ plain form
395 11495 7490 -392 -22232 16821 14788 -24595 1180 5303 16446 -21864 -13289 31854 -7222
408 -7222 -14381 -7198 28001 -1863 -29851 15649 11228 5962 -35836 15382 31077 -35167 39
421 39 2670 24997 -17371 -30617 41848 -255 -19858 -11623 27907 11109 -38803 8249 18737
434 18737 11036 -40302 4070 43692 -29993 -10143 -2048 34810 -10116 -44340 40103 9720
446 9720 -14206 -25529 24917 26703 -41800 46 13640 25547 -37619 -15829 52896 -24559
458 -24559 -8122 -10899 27923 12097 -53354 32015 13240 -9050 -20343 7238 33686 -34618
470 -34618 -3919 9943 20431 -22051 -22634 46379 -16519 -9516 -7323 20441 13860 -45568 22468
483 22468 13578 -3941 -23814 7338 30393 -30297 1351 -2831 26368 -14981 -29600 47955
$$ packed form
395A1495m005p882k1840L9053k033l9383K5775M123J1143l8310Q575M5143l9076
408g222p159P183L5199k9864k7988M5500m421n266m1798N1218J5695o6244L5206
421C9K631K2327m2368j3246P2465m2103j9603Q235L9530j6798m9912M7052J0488
434A8737p701n1338M4372L9622p3685J9850Q095L6858m4926l4224Q4443l0383
446I720k3926j1323N0446J786o8503M1846J3594J1907o3166K1790O8725p7455
458b4559J6437k777L8822j5826o5451Q5369j8775k2290j1293K7581K6448o8304
470c4618L0699J3862J0488m2482n83O9013o2898P003K193K7764o581n9428O8036
483B2468q890j7519j9873L1152K3055o0690L1648m182K9199m1349j4619P7555
$$ plain form
495 47955 -21816 625 -6161 4207 24533 -43309 24037 4417 -7449 -5706 -2470 26911 -34116
508 -34116 12824 3447 2551 -2581 -23953 47384 -27295 -11228 18274 -1852 9332 -36187 26910
521 26910 11911 -22596 -7655 14070 22989 -40674 11420 12044 6558 -13720 -24112 55368 -28971
534 -28971 -15401 14171 4550 11865 -45335 34268 9802 -20884 -5143 6043 35726 -53118
546 -53118 14666 21838 -9887 -4261 -31667 64253 -27307 -35525 36052 1088 8584 -47912 29278
559 29278 33533 -40165 -10812 17417 36481 -49350 -6348 34991 1611 -15395 -35900 61806
571 61806 -8996 -41310 18817 11716 16304 -50490 20840 29026 -21006 -13757 -561 48344 -47219
584 -47219 -3835 27722 -8244 6425 -46247 56844 -4509 -45130 33733 -5412 22144 -44600
$$ packed form
495D7955o9771K2441o786J0368K0326o7842O7346j9620j1866J743L236K9381o1027
508c4116M6940r377q96n132k1372P1337p4679J6067K9502k0126J1184m5519O3097
521B6910j4999l4507J4941K1725Q919o3663N2094O24n486k0278j0392P9480q4339
534b8971J3570K9572r621P315n7200P9603k4466l0686J5741J1186K9683q8844
546e3118O7784P172l1725N626k7406R5920r1560q218P1577l4964P496n6496P7190
559B9278M255p3698K9353K8229J9064q5831M3002M1339l3380j7006k0505R7706
571F1806p0802l2314O0127p101M588o6794P1330Q186n0032P249J3196M8905r5563
584d7219M3384L1557l5966J4669n2672J03091o1353m0621P8863l9145K7556o6744
$$ plain form
596 -44600 12810 41350 -38883 -837 -2338 39209 -32000 -23841 43250 -11183 -616 -31214
608 -31214 37106 13029 -47197 22903 5085 12437 -31850 5125 30888 -24485 -1815 -6033
620 -6033 32366 -26122 -13463 34157 -18980 8945 -24240 29128 4558 -41416 35305 -7047
632 -7047 6854 -25518 10858 32240 -44048 13906 -1488 23887 -23318 -25160 57671 -31039
644 -31039 -2614 -5559 16929 18066 -54908 33953 12749 -14725 -14939 6721 32390 -36400 -1519
657 -1519 13238 17098 -24098 -19173 51052 -23187 -11245 -539 19164 10503 -51752 33114 16239
670 16239 -19068 -17391 11963 34484 -41331 -2659 18595 17613 -25096 -27194 59028 -19677 -20966
683 -20966 2364 17447 19613 -57886 25331 28221 -21801 -15018 2737 40799 -33049 -16306 25549
$$ packed form
596d4600N7410K8540q0233L8046j501M1547p1209Q159O7091n4433J0567l0598
608c1214O8320k4077o0226P0100j7818P352m4287L6975K5763n5373K2670m218
620f033L8399n8488J2659M7620n3137K7925l3185N3368k4570m5974P6721m2352
632g047J3901l2372L6376K1382p6288N7954j5394K5375m7205j842Q2831q8710
644c1039K8425k945K2488J137p2974Q8861k1204k7474k14K1660K5669o8790L4881
657a519J4757L860m1196M925P0225p4239J1942J0706J9703q661o2255Q4866j6875
670A6239l5307J677K9354K2521p5815L8672K1254r82m2709k098Q6222p8705j289
683b0966K3330J5083K166p7499Q3217K890n0022O783J7755L8062p3848J6743M1855
$$ plain form
696 25549 12247 -16189 -29204 45578 -2923 -28554 4223 15833 14504 -43062 13019 29417
708 29417 -17123 -18231 7135 31957 -26769 -13534 19255 13343 -14934 -26826 40312 -1915
720 -1915 -25806 4332 12588 13675 -36249 9124 26139 -14249 -13986 3623 27870 -22382 -12313
733 -12313 18226 5661 -8120 -22198 31101 1028 -26086 10867 8304 6436 -23984 5785
745 5785 24218 -17114 -12151 11593 16115 -20036 -8454 18086 4874 -14987 -11350 28829 -3671
758 -3671 -23141 10003 14279 -1829 -23941 13361 18435 -16873 -12694 13123 18393 -26378 -5047
771 -5047 21583 1020 -14517 -11420 30852 -3683 -27272 13554 15363 -4409 -23598 12256 21561
784 21561 -18574 -15427 16769 17642 -26036 -7883 23573 3996 -18840 -9557 30198 -1600 -27457
$$ packed form
696B5549j3302k8436j3015P4782m8501k5631L2777J1610j329n7566N6081J6398
708B9417m6540j108K5366K4822n8726J3235L2789n912k8277j1892O7138m2227
720a915k3891L0138Q256J087m9924M5373J7015m0388K63J7609K4247n0252J0069
733a2313L0539j2565j3781j4078N3299l0073k7114L6953k563j868l0420K9769
745E785J8433m1332M963K3744M522l6151J1582K6540j3212j9861L637M0179l2500
758c671j9470L3144M276j6108k2112L7302N074l5308M179K5817N270m4771K1331
771e047K6630k0563j5537L097M2272l4535k3589M0826J809j9772j9189L5854R305
784B1561m0135L147L2196Q73m3678J8153L1456j9577k2836R283L9755l1798k5857
$$ plain form
797 -27457 8538 20741 -5228 -26134 13711 20137 -15196 -17709 13933 22682 -26863 -8786 22612
810 22612 5002 -15604 -14111 29695 784 -26875 6495 17579 -302 -25273 9486 20847
822 20847 -12956 -15052 9039 21336 -20068 -11612 20130 4605 -12179 -12661 22292 4124 -23255
835 -23255 4191 14811 543 -20742 6626 17419 -10084 -11850 6674 17845 -16441 -9738
847 -9738 16891 2544 -9235 -10289 18408 2690 -19656 5492 11127 -496 -16103 6635 14500
860 14500 -10889 -7483 6003 13284 -13873 -8423 17225 -1490 -8386 -5350 13666 2517 -18635
873 -18635 8169 10118 -4190 -11732 5969 13451 -12154 -7220 9888 8180 -12980 -6597 16047
886 16047 90 -12621 -1130 14149 -142 -16634 6515 13131 -6871 -12607 8970 12066 -12121
$$ packed form
797b7457L5995J2203k5969k0906L9845O426l5333k513L1642Q749m9545J8077L1398
810B2612j7610k0606J493M3806k8911k7659L3370J1084j7881k4971L4759J1361
822B0847l3803k096K4091J2297m1404Q456L1742j5525j6784m82L4953j8168k7379
835b3255K7446J0620j4268k1285K7368J0793k7503j766J8524J1171l4286O703
847i738K6629j4347j1779j054K8697j5718k2346K5148N635j1623j5607K2738P865
860A4500k5389L406J3486P281k7157N450K5648j8715o896L036J9016j1149k1152
873a8635K6804J949j4308p542J7701P482k5605M934J7108j708k1160O383K2644
886A6047j5957j2711J1491J5279j4291j6492K3149O616k0002n736K1577L096k4187
$$ plain form
899 -12121 -8521 10837 9382 -14697 -6888 17302 705 -13211 -1852 14903 1100 -17883 5801
912 5801 14395 -6546 -12128 5754 13788 -10305 -11836 12073 8273 -11879 -7888 13597 6261 -15190
926 -15190 -1894 13843 1549 -13668 -1351 16771 -4831 -14084 6440 9970 -3908 -13429 7870
939 7870 12594 -12236 -6257 9419 7129 -9700 -7456 13742 2354 -11635 -1453 11365 286
952 286 -12289 3246 9098 -2162 -10473 4863 9934 -7890 -5778 6531 6504 -8511 -4649 9104
966 9104 1783 -7132 -4160 11098 -601 -10871 5428 4046 1294 -9720 2660 11934 -10686
979 -10686 -1390 3095 4880 -3624 -8982 11240 -762 -5540 -792 4789 3560 -10597 5205 4225
993 4225 -2695 -3059 -272 9161 -8205 -2936 6951 212 -4202 -3577 8235 -108 -7257 447 8114
$$ packed form
899a2121L600J9358j455k4079P809K4190j6597j3916J1359J6755j3803j8983K3684
912E801Q594k0941n582J7882Q034k4093j531K3909l800k0152L991K1485p336k1451
926a5190J3296J5737j2294j5217J2317J8122k1602r253K0524L530j3878r521K1299
939G870M724k4830N979J5676k290j6829K244K1198j1388j3989J0182J2818j1079
952B86j2575J5535N852j1260q311J5336N071j7824K112J2309k7j5015L862J3753
966I104p321q915K972J5258j1699j0270J6299j382k752j1014J2380R274k2620
979a0686R296M485J785q504n358K0222j2002m778M748N581j229j4157J5802r80
993D225o920l64K787R433j7366N269R887o739m414O25J1812q343p149P704P667
$$ plain form
1008 8114 -1036 -9909 6379 4409 -2358 -6957 2446 11269 -11171 -2423 5641 3824 -4239 -8753
1022 -8753 12631 -368 -6489 -1514 5629 5591 -13887 5479 6167 -4012 -2622 -3320 12427 -7233
1036 -7233 -7524 9745 420 -2664 -6353 8061 4151 -10246 -510 8335 1673 -11188 2054 8633
1050 8633 -1744 -9072 741 12436 -6358 -8403 5559 8103 -4492 -10232 9578 4602 -5297
1063 -5297 -7260 6380 9240 -14194 949 6020 1532 -3956 -7393 13850 -2454 -8465 4787
1076 4787 3217 1375 -9323 4705 6364 -6690 -3101 3685 6405 -9109 -1442 7605 86 -5678
1090 -5678 -2763 10219 -1580 -8106 2323 8152 -2651 -9047 6048 4202 -2332 -7855 4149
1103 4149 9615 -11761 431 4394 2337 -2696 -7541 12169 -2753 -5434 1653 2985 2594 -10506
$$ packed form
1008H114r150q873J6288j970o767m599R403Q823k2440Q748Q064j817q063m514
1022h753K1384j2999o121M975P143l8j9478J9366O88j0179J390o98J5747j9660
1036g233k91J7269r325l084l689J4414l910j4397R736Q845o662j2861J3242O579
1050H633j0377p328R813J1695j8794k045J3962K544j2595n740J9810m976r899
1063e297j963J3640K860k3434J5143N071m488n488l437K1243j6304o011J3252
1076D787j570j842j0698J4028J659j3054L589O786K720j5514P667R047p519n764
1090e678K915J2982j1799o526J0429N829j0803o396J5095j846o534n523J2004
1103D149N466k1376J2192L963k057n033m845J9710j4922k681P087J332l91j3100
$$ plain form
1117 -10506 6940 2634 -4708 -1200 360 8532 -10244 -292 8395 -3257 -2554 -3357 9914 -2278
1131 -2278 -8960 4436 6172 -2957 -9576 8802 3448 -4752 -4820 4039 10482 -13818 231 8571
1145 8571 -1158 -3988 -6498 13720 -3572 -8599 4099 4442 1720 -13552 9942 4447 -7641 -729
1159 -729 -19 12403 -13891 -2377 12570 -4700 -2620 -6164 12756 -602 -13328 7122 5770
1172 5770 -338 -12720 7859 9156 -9491 -3614 2703 12650 -13214 -5362 12984 -1230 -4856
1185 -4856 -7594 13912 241 -12800 4850 5644 2884 -14604 6722 9935 -9917 -1405 -749 12770
1199 12770 -10365 -7814 14698 -3515 -2607 -6722 11214 2788 -14339 6771 4304 1922 -11896
1212 -11896 3604 12214 -11413 -1322 820 9917 -7158 -9534 14949 -2390 -4115 -4781 9191
$$ packed form
1117a0506J7446m306p342L508J560Q172j8776R952Q687j1652P03q03J3271j2192
1131b278o682J3396J736r129o619J8378n354q200o8Q859O443k4300J4049Q340
1145H571r729k830k510K0218j7292n027J2698L43k722j5272K3494n495j2088O912
1159g29P10J2422k6294J1514J4947j7270K080l544J8920j3358j2726K0450j352
1172E770o108j2382K0579J297j8647N877O317R947k5864P852J8346j4214l626
1185d856k738K1506j3671j3041J7650P94k760j7488K1326L213j9852Q512O56J3519
1199A2770k3135K551K2512j8213R08m115J7936q426j7127K1110k467k382j3818
1212a1896J5500Q610k3627J0091K142R097j7075k376K4483j7339j725o66J3972
$$ plain form
1225 9191 3497 -13507 5691 4101 1422 -10638 2752 11779 -11201 -524 1551 7406 -5606
1238 -5606 -9200 14773 -3298 -4672 -2177 7466 3202 -14093 7513 4102 -1010 -8462 2686 12441
1252 12441 -13197 -441 4856 4411 -4678 -9341 15430 -2252 -7975 587 6816 2712 -14077 6800
1266 6800 6454 -3375 -7638 2852 12459 -12550 -2157 6654 3804 -5119 -9069 15084 -1262 -9577
1280 -9577 1053 7137 2592 -14403 6373 7722 -4342 -7390 2468 13276 -12208 -3703 8334
1293 8334 2888 -4910 -9083 14160 693 -11193 1710 7176 2502 -13404 4434 9625 -5035
1306 -5035 -6684 2168 12284 -9760 -5956 8639 2938 -4998 -8274 11790 2141 -10690 707
1319 707 7056 2261 -11786 3420 8986 -4308 -6212 1513 11077 -8431 -6118 8689 1975 -4242
$$ packed form
1225I191n694j7004J9198j590k679j2060J3390R027k2980J0677K075N855j3012
1238e606l594K3973j8071j374K495R643m264j7295K1606l411n112p452J1148R755
1252A2441k5638J2756N297m45r089m663K4771j7682n723Q562O229m104j6789K0877
1266F800l46r829m263J0490R607k5009J0393Q811k850q923l950K4153j6346q315
1280i577J0630O084m545j6995K0776J349j2064l048R858J0808k5484Q505J2037
1293H334n446p798m173K3243j3467j1886J2903N466m674j5906J7838N191j4660
1306e035j649Q852J0116k2044L804J4595n701p936l276K0064r649j2831J1397
1319G07O349m795j4047J5206N566j3294j904P725R564j9508K313J4807o714o217
$$ plain form
1333 -4242 -7037 10012 2420 -10337 1673 6556 1443 -9920 2660 8733 -4901 -5172 2443 8533
1347 8533 -7183 -5986 8638 1378 -4980 -4625 8485 2208 -9440 1690 6649 -187 -8655 3279
1361 3279 7394 -5082 -4871 3157 7230 -7025 -5306 8664 1297 -5569 -3081 8137 1555 -9501
1375 -9501 2198 6642 -883 -8468 3485 7688 -6129 -4727 3968 6615 -6892 -5446 9340 1450
1389 1450 -6632 -2172 7789 1528 -9760 1902 7570 -2181 -7962 3008 7718 -5718 -5635 4918
1403 4918 6074 -6461 -5109 8313 2593 -7472 -2078 7838 1222 -8437 655 7784 -1450 -8144
1417 -8144 3095 7280 -4458 -5496 4077 6320 -5733 -5173 7837 2441 -6344 -2611 6890 1968
1431 1968 -8268 558 7266 -1529 -6555 1786 7139 -3631 -5492 4475 4407 -3891 -5033 5796 3175
$$ packed form
1333d242k795J7049p592j2757J2010M883n113j1363J2580O073j3634k71P615O090
1347H533j5716J197J4624p260o358L55J3110o277j1648J1130M959o836q468J1934
1361C279M115j2476K11Q028M073j4255J719J3970p367o866K488J1218o582j1056
1375i501J1699M444p525p585J1953M203j3817J402Q695K647j3507J446J4786p890
1389A450q082M460R961o261j1288J1662N668r751n781J0970M710j3436Q3J0553
1403D918J156j2535J352J3422n720j0065N394R916o616r659R092P129r234o694
1417h144J1239M185j1738j038R573K243j2053N60J3010n396q785L733R501m922
1431A968j0236Q826O708q795n026Q341N353j0770j861R967o8q298j142J0829k621
$$ plain form
1446 3175 -6667 -1212 5508 849 -5982 -677 6906 -1568 -5933 2872 4617 -2345 -5044 3679 4396
1461 4396 -5108 -2978 4917 2166 -5364 -1785 6141 281 -5720 716 5268 -1072 -5369 2312 5002
1476 5002 -3442 -4030 3645 3130 -3786 -3428 4747 2285 -6024 387 4418 181 -4325 -151 6355 -2742
1492 -2742 -4420 3546 2959 -2149 -4669 4345 3480 -5795 -996 3809 2579 -5617 -1020 6780 -1352
1507 -1352 -4352 452 5260 -839 -6344 3254 4154 -3347 -3674 2845 4011 -4168 -2924 4621 2370
1522 2370 -5024 -957 4413 367 -4128 -864 5736 -1891 -4504 2465 2895 -1254 -4921 3755 3437
1537 3437 -4582 -1002 2314 3461 -4958 -2015 6634 -1598 -2802 -1197 4520 753 -6884 3200 2923
1552 2923 -1343 -3206 828 5144 -3528 -2646 2909 2215 -2610 -2460 3772 689 -2935 -1136 3387 253
$$ packed form
1446C175r842N455O720m659o831N305P583q474m365Q805J745o962k699Q723P17
1461D396r504K130P895k751p530L579P926n860o001O436M552o340m297P681K690
1476E002q444n88P675n15o916L58Q175k462q309O411M031m237m506M174O506r097
1492b742j678P966n87n108k520R014q65r275M799M805j230q196M597P800q132
1507a352l000M804M808o099n505R598R00p501l27O519J166q179J244P545k251
1522B370p394M067N370m046m495L264O600p627k613O969M30m149l667Q676l18
1537C437q019L580L316J147q419K943Q649q232j204J605N717l767p637J0084k77
1552B923m266j863M034M316q672Q82N555o94m825J50O232l083l624J799M523l134
$$ plain form
1568 253 -3574 1277 2146 -236 -3620 2162 2409 -2924 -377 835 2988 -3659 -1581 4903 -2010 -929
1584 -929 -1460 3309 1203 -5788 3584 1240 -425 -2460 9 4911 -4074 -856 1658 1393 -1173 -3204
1600 -3204 4170 -341 -2075 108 1453 1421 -3750 1353 2167 -1337 -1865 1360 2446 -3044 -468 1135
1616 1135 2091 -2610 -1684 4662 -1853 -1152 -1281 2900 1375 -5815 3278 1406 -551 -2474 -141 5397
1632 5397 -4670 -510 1564 1823 -422 -4439 5626 -507 -2050 -95 740 3164 -5265 1027 2742
1647 2742 -1225 -1377 -771 4032 -2238 -1548 1636 1883 -747 -3385 4363 -220 -1807 -954 1600 2502
1663 2502 -5309 1290 2087 -67 -2223 -1400 5496 -3144 -1320 804 1813 742 -5714 4972 259
1678 259 -2100 -251 -743 4771 -5123 201 2844 -917 -92 -2825 4866 -1527 -2308 1565 406 1392
$$ packed form
1568B53l827M851Q69k382l384N782K47n333K547J212K153o647K078O484o913J081
1584i29n31M769k106o991R372k344j665k035K469M902q985L218K514k65k566k031
1600c204P374m511j734K183J345l2n171N103Q14l504n28L225J086n490K576J603
1616A135R56m701R26O346o515P01j29M181j525p190R093j872j957j923K333N538
1632E397j0067M160K074K59k245m017J0065o133j543J955Q35K424q429O292J715
1647B742l967j52O06M803o270O90L184K47k630k638P748m583j587Q53K554R02
1663B502p811O599P97k154k156Q23O896q640J824K124J009j071o456J0686m713
1678B59k359J849m92N514r894N324K643l761Q25k733P691o393p81L873j159R86
$$ plain form
1694 1392 -4565 2974 1209 -2672 329 -344 3448 -3672 -38 2598 -578 -601 -2001 4610 -1984 -1901
1710 -1901 1305 591 1696 -5286 3721 1337 -2985 859 -987 4254 -3947 -352 3440 -1651 282
1725 282 -2621 4381 -1271 -2864 2738 -763 1857 -4414 2511 2561 -4141 1641 -387 2734 -3097 -1344
1741 -1344 4468 -2011 -654 -1530 3913 -935 -3684 2984 66 953 -4349 2650 3157 -4549 879 378
1757 378 3313 -3328 -2003 4920 -1715 -1130 -1962 4234 -123 -4860 3285 400 926 -4138 1635 4485
1773 4485 -4885 331 463 2693 -2449 -3127 5235 -1269 -1647 -1609 3544 1011 -5243 2973 1100 451
1789 451 -3484 496 4819 -4534 -519 1172 2388 -1945 -3200 4759 -443 -1687 -1602 3273 1448 -5011
1805 -5011 2635 1270 115 -3066 -74 4896 -4150 -682 1359 1835 -1308 -3359 4557 -228 -1975
$$ packed form
1694A392n957P539j765l881L001o73L792p120L634K636l176k3j400O611o594Q3
1710a901L206p14J105o982R007k384m322L844j846N241q201L595L792n091J933
1725B82k903P002n652j593N602l501K620o271O925N0o702N782k028L121n831J753
1741a344N812o479J357q76N443m848k749O668k918Q87n302O999N07p706N428n01
1757C78K935o641J325O923o635N85q32O196m357m737Q145k885N26n064N773K850
1773D485r370N216J32K230n142o78Q362o504l78L8N153k533o254Q216j873o49
1789D51l935L980M323r353M015J691J216m333j255P959n202j244Q5M875j825o459
1805e011P646j365j155l181K992M970r046L468K041M76l143k051P916m785j747
$$ plain form
1820 -1975 -948 2411 1293 -4754 2243 1493 -595 -2342 -288 4363 -3658 -1134 2146 1130 -1310
1835 -1310 -2783 4271 -130 -2466 -261 2328 1098 -4581 2245 1677 -1235 -1870 282 4026 -3320
1850 -3320 -1394 2687 915 -1625 -2082 4037 7 -2829 186 2341 735 -4337 1954 2371 -1814
1865 -1814 -1872 599 3810 -3308 -1966 3360 994 -2131 -2065 3770 51 -3380 -2 2785 410 -4520
1881 -4520 1854 2956 -1831 -2244 887 3792 -3186 -2120 3221 1182 -2459 -1995 3916 369 -3488
1896 -3488 -139 2903 568 -4462 1479 3235 -1594 -2293 865 3734 -2807 -2646 2943 1632 -2503
1911 -2503 -2144 3683 861 -3450 -251 2857 582 -4087 1000 3278 -1430 -2283 1034 3213 -2111
1926 -2111 -2530 2534 1815 -2560 -1836 3205 487 -2897 -322 2642 519 -3769 1055 2583 -1517 -2057
$$ packed form
1820a975J027L359j118o047O997p50k088j747K054M651q021K524L280j016k440
1835a310j473P054m401k336K205K589j230n679O826n68k912o35K152L744p346
1850c320J926M081j772k540m57O119m030k836L015K155j606n072O291M17m185
1865a814n8K471L211p118J342N326k366l125O6N835l719l431L378K787k375m930
1881d520O374J102m787m13L131K905o978J066N341k039l641M64N911l547l857
1896c488L349L042k335n030N941J756m829o99L158K869o541J61N589j311m135
1911b503L59N827k822m311L199L108k275m669N087K278m708q53L317K179n324
1926b111m19N064p19m375P24N041k718l384K575K964k123m288M824J528m100n40
$$ plain form
1942 -2057 913 2872 -2266 -1988 2575 1309 -2018 -1567 3222 306 -2932 160 2428 380 -3412
1957 -3412 1087 2788 -1811 -1882 1343 2443 -1982 -2072 2613 1328 -2588 -921 3017 157 -2802 -133
1973 -133 2712 -211 -3262 1346 2377 -1574 -2074 1600 2457 -2686 -1416 2598 1043 -2393 -1085 3513
1989 3513 -127 -2868 616 2481 -262 -3592 1391 3038 -2402 -1919 1843 2397 -2264 -2241 2951 1324
2005 1324 -2906 -900 2996 493 -3110 -346 3145 -635 -3018 837 2728 -1184 -2775 2105 2111 -2120
2021 -2120 -1623 2151 1898 -2552 -1408 3373 20 -2600 67 2348 61 -3291 1219 2745 -1692
2036 -1692 -2003 1514 2186 -1981 -2067 2334 1321 -2567 -1056 2523 933 -2634 -346 2726 -602 -2172
2052 -2172 406 2419 -559 -2602 1705 1498 -1708 -1178 969 1937 -2415 -976 2620 -402 -1383 -348
$$ packed form
1942b057K970J959n138K78M563j266l327M51M789k916l238L092K268k048l792
1957c412M499J701m599p1L225J100m425r0M685j285l916J667L938k860k959K669
1973a33K845k923l051M608J031l951n00L674Q57n143J270M014j555l436J308M598
1989C513l640k741L484J865k743l330M983J647n440M83L762N54m661K3N192j627
2005A324m230K006L896k503l603K764L491l780k383L855J891l912j591M880Om231
2021b120M97L774k53m450J144M781l353k620K667K281k287l352M510J526m437
2036a692l11L517O72m167q6M401j013l888J511L579j590l567K288L072l328j570
2052b172K578K013k978k043M307k07l206N30K147R68m352J439L596l022r81J035
$$ plain form
2068 -348 2383 -46 -2738 1514 1448 -978 -1789 1311 1823 -2308 -775 1838 878 -2043 -774 2689
2084 2689 -19 -2218 179 2230 -645 -2042 865 1653 -779 -2270 1872 1156 -1954 -468 949
2099 949 1487 -2577 -430 2801 -984 -1090 -422 2335 -468 -2700 1794 813 -684 -1873 1470 2277
2115 2277 -2862 -35 1607 856 -1679 -1345 3098 -573 -2199 298 1814 41 -2603 1121 1832 -907
2131 -907 -2055 1512 1868 -1873 -796 1081 1703 -1918 -1115 2469 -548 -1026 -685 2089 274 -2884
2147 -2884 1522 831 49 -1736 673 2412 -2680 66 659 852 -768 -2016 2973 -502 -1563 242
2163 242 992 999 -2875 1004 1422 -568 -1060 -61 2009 -1723 -704 918 776 -688 -1401 2109 -196
2180 -196 -976 -197 1022 609 -2087 1063 419 51 -911 -27 2109 -2177 125 634 230 -230 -1862 2599
$$ packed form
2068c48K731k429k692M252o6k426q11L100N12m131J533K613r60k921J269L463
2084B689k708k199K397K051k875j397K907P88k432j491M142p16l110J486J417
2099I49N38m064K147L231l785j06O68K757k803k232M494r81j497j189L343Q07
2115B277n139K827J642p51k535L34M443l671j626K497J516j773k644L724P11k739
2131i07j148L567L56l741J077J877O22l621Q03L584l017m78L41K774j815l158
2147b884M406o91p82j785K409J739n092K746N93J93j620j248M989l475j061J805
2163B42P50Pl874L879M18j990m92R99K070l732J019J622j42j464p13L510k305
2180a96p80P79J219m13k696L150o44l68r62Q84K136m286K302N09m04m60j632M461
$$ plain form
2198 2599 -601 -1038 510 268 903 -2429 1215 956 -984 -323 -540 2020 -1741 -588 1267 -307
2214 -307 -134 -1504 1748 31 -1331 583 441 606 -1938 892 807 -789 -675 -103 1848 -1780 -275
2231 -275 1120 -106 80 -1573 2143 -69 -1341 592 147 1045 -2416 873 1328 -963 -155 -549 2453
2248 2453 -1392 -1048 1667 -120 184 -1607 1544 611 -1865 694 326 1093 -1776 94 1641 -819
2264 -819 -486 -551 1933 -869 -1241 1308 -101 254 -1829 1329 754 -1456 242 239 1149 -1719 32 1469
2282 1469 -473 -128 -986 1916 -474 -1323 1247 -274 528 -1795 911 1152 -1682 412 -190 1280
2298 1280 -1013 -481 1460 -571 117 -1001 1424 -58 -1656 1086 -464 648 -1306 501 1282 -1456
2314 -1456 295 -129 973 -868 -608 1354 -714 248 -887 1066 -63 -1449 1178 -185 517 -1239
$$ packed form
2198B599l200m37J548k42O35l332L644k59j940O61k17K560l761J153J855j574
2214c07J73j370L252j717j362J914j42J65k544K830q5j596J14N72J951l628J505
2231b75J395j226J86j653L716k212j272J933m45Q98l461L289M55k291Q08l94L002
2248B453l845L44K715j787L04j791L151r33k476K559l68P67k869J870J547k460
2264h19L33o5K484k802l72K549j409L55k083L158n75k210J698lR10k868J751J437
2282A469j942L45q58K902k390q49K570j521Q02k323K706K41k834K094o02J470
2298A280k293N32J941k031O88j118K425j482j598K742j550J112j954J807P81k738
2314a456J751m24J102j841K60J962k068R62j135J953j129j386K627j363P02j756
$$ plain form
2330 -1239 451 1181 -1611 550 49 790 -910 -678 1517 -902 -54 -745 1097 248 -1726 1334 -225
2347 -225 171 -878 185 1501 -1603 309 421 586 -819 -785 1780 -666 -427 -525 1064 397 -2004
2364 -2004 1318 38 -42 -935 176 1670 -1648 -113 473 768 -969 -1354 2129 -448 -435 -491 1186
2381 1186 616 -2255 1128 496 -165 -778 -151 2038 -1671 -416 651 846 -599 -1459 1852 -290 -820
2398 -820 -481 1072 865 -2123 900 894 -148 -1048 -263 1915 -1154 -745 535 780 -436 -1563 1718
2415 1718 105 -645 -391 929 880 -2070 612 842 -174 -807 -262 1741 -1087 -690 667 531 -168
2432 -168 -1344 1615 122 -928 -164 451 990 -1712 333 1103 -510 -498 -242 1468 -819 -887 809
2449 809 695 -365 -994 1223 218 -1134 -98 835 576 -1705 418 1123 -443 -713 22 1475 -953
$$ packed form
2330a239J690P30k792K161n01P41j700K32K195k419Q48o91J842q49j974L060j559
2347b25L96j049J063J316l104J912J12J65j405L4K565k446K39r8J589o67k401
2364b004L322j280q0q93J111J494l318J535N86K95j737l85L483k577J3n6J677
2381A186n70k871L383o32o61o13O27K189l709J255J067J95j445q60L311k142n30
2398h20L39J553k07k988L023oj042r00P85K178l069M09J280K45j216j127L281
2415A718j613p50K54J320m9k950K682K30j016o33N45K003k828L97J357j36o99
2432a68j176K959j493j050P64O15N39k702K045P70j613J2K56J710k287o8J696
2449H09j14j060o29K217j005j352J036R33k59k281K123P05j566k70P35J453k428
$$ plain form
2466 -953 -813 893 414 -466 -1122 1560 177 -1155 167 504 646 -1640 497 1486 -869 -470 197
2483 197 1339 -812 -1256 1166 458 -785 -862 1350 331 -1460 94 1006 297 -1585 278 1561 -711
2500 -711 -1063 328 1414 -985 -956 956 898 -996 -1065 1621 420 -1435 24 1004 600 -1757 125
2517 125 1650 -752 -938 245 1332 -714 -1301 1211 404 -876 -972 1091 905 -1663 -74 1102 200
2534 200 -1325 -269 1508 -434 -1315 517 1127 -735 -1066 678 1103 -1034 -850 1196 554 -990 -385
2551 -385 944 397 -1449 -72 1119 -571 -850 99 1201 -675 -877 987 507 -756 -751 837 534
2568 534 -1248 73 991 -231 -849 20 1255 -635 -1150 799 782 -617 -646 726 758 -1284 -347 1162
2586 1162 69 -844 -362 1258 -58 -1132 479 889 -355 -1060 710 920 -936 -346 986 605 -758
$$ packed form
2466i53J40J706m79q80o56K682j383j332J322L37J42k286K137R89k355L99O67
2483A97J142k151m44K422p08j243p7K212j019j791J554R12p09j882J863J283k272
2500g11l52J391J086k399K9J912n8j894o9K686j201j855J459R80m04k357J882
2517A25J525k402j86J183J087k046n87K512q07j280r6K063j86k568J589J176r02
2534B00j525J056J777j942q81J832O10j862l31J744M25k137J84K046o42j544O05
2551c85J329n47j846J377J191j690k79R49J102j876k02J864m80j263NJ588l03
2568E34j782J321R18j222o18Q69J235j890n15J949j7j399k9J372L2k042R37J509
2586A162j093r13M82J620j316j074J611M10j244p05J770K10j856N90J332l81j363
$$ plain form
2603 -758 -664 1268 255 -1226 68 1065 -247 -1141 302 969 -475 -1142 966 743 -716 -727 872
2620 872 1009 -1361 -430 1165 393 -928 -414 1652 -135 -1316 571 650 43 -1370 743 1106 -1099
2637 -1099 -442 434 731 -817 -783 1334 161 -1004 -210 1017 170 -1171 452 966 -255 -1058 495
2654 495 1088 -808 -753 443 832 -779 -496 1135 233 -788 -479 1250 61 -1056 369 413 190 -1071
2672 -1071 378 1049 -1242 -41 137 614 -481 -892 1265 -296 -511 -148 830 317 -1193 532 444
2689 444 -375 -549 224 944 -977 -182 670 311 -604 -512 1140 34 -725 -77 786 -88 -1086 659 431
2708 431 -225 -630 275 998 -1138 26 647 216 -403 -713 1264 -381 -864 120 563 184 -1344 818
2726 818 450 -479 -314 -66 1100 -1122 -343 787 68 -433 -646 1242 -46 -917 -32 761 272 -1149
$$ packed form
2603g58R4J932j013j481J294R97j312q94J443O67j444o67K108k23j459j1J599
2620H72J37k370R31J595p72j321N14K066j787j181J887P9o07j413K113L63k205
2637a099O57Q76K97j548L4K117j173j165P94J227q47j341J623N14j221q03J553
2654D95N93j896N5J196L89j611K83J631r02j021L09J729j189j117J425M4k23j261
2672a071J449O71k291J201J78M77j095m11K157j561k15L63R78n13j510J725q8
2689D44q19j74P73P20j921P95Q52l59r15R2J652j106p59O48Q63q74r98J745k28
2708D31o56m05R05P23k136J164O21m31o19l10J977j645m83R84M43l79j528K162
2726H18l68r29J65K48J166k222P79J130p19n01k13J888j288q71Q85P93m89j421
$$ plain form
2744 -1149 498 541 -297 -430 152 1185 -1089 -370 599 97 -297 -872 1112 -96 -656 76 588 461
2762 461 -1159 492 415 -535 -196 -73 1090 -741 -515 578 32 -252 -862 972 123 -668 188 189 315
2781 315 -1013 170 602 -445 -51 -354 1039 -576 -587 460 8 41 -700 609 223 -394 178 117 554
2800 554 -1006 216 475 -517 51 -612 906 -319 -416 579 -18 332 -609 549 219 -714 437 119
2818 119 434 -755 29 620 -525 11 -328 577 -249 -700 543 -162 246 -472 559 248 -729 496
2836 496 -165 280 -586 78 650 -550 -45 -137 726 -345 -533 857 -288 60 -414 529 364 -1004 404
2855 404 72 265 -525 -83 843 -462 -85 -106 642 -144 -668 822 -60 43 -608 361 403 -829 148 -39
2875 -39 443 -340 -302 799 -392 -167 -177 645 73 -764 275 59 110 -684 312 702 -889 232 82 333
$$ packed form
2744a149J647M3q38j33N82J033k274P19R69n02l94n75J984j208n60P32N12j27
2762D61j620J651p7r50L39J23J163j831K26J093n46k84o10J834q49p91Q56JJ26
2781C15j328J183M32j047L94l03J393j615j1J047m52L3p41J309l86o17N72o1M37
2800E54j560J222K59r92N68o63J518j225r7R95n97L50r41J158l30r33J151l18
2818A19L15j189P84N91j145N36l39R05q26m51J243p05M08p18J031l11r77J225
2836D96o61M45q66O64N72j200N05r2Q63j071j88J390j145L48m74R43j65j368J408
2855D04l32J93p90M42R26j305L77k1P48p86n24J490q82J03o51R69M2j232R77j87
2875c9M82p83L8J101j191K25j0Q22n72q37J039k16N1p94R96L90j591J121j50K51
$$ plain form
2895 333 -244 -493 864 -384 2 -236 470 288 -1000 632 -22 -113 -412 -59 826 -763 37 30 254
2914 254 -197 -428 907 -489 -117 -189 199 324 -914 366 79 -55 -192 -93 925 -404 -96 308 340
2933 340 -170 -492 708 -146 -175 -67 209 178 -992 364 72 -97 -187 -298 877 -560 -78 118 224
2952 224 -39 -565 682 -159 -364 37 156 262 -673 323 322 -198 -137 -227 630 -442 -121 574 61 -201 -616
2973 -616 578 -81 -617 97 300 173 -627 297 345 -262 -267 20 641 -339 -178 363 219 -177 -707 852
2993 852 -72 -482 181 197 370 -887 46 631 -443 -156 -100 758 -400 -432 552 251 -218 -541 468 449
3013 449 -561 15 410 210 -672 -58 665 -172 -401 202 613 -234 -477 565 395 -198 -525 642 180
3032 180 -394 2 369 433 -933 -19 602 -108 -408 -142 485 -218 -555 394 222 -145 -410 391 516 -729
$$ packed form
2895C33n77k49J357j248L86k38P06j82j288J632o54r1k99L53Q85j589Q00pK24
2914B54m51k31J335j396L72p2L88J25j238J280k87j34j37R9J018j329L08M04L2
2933C40n10l22J200q54k9J08K76l1j170J356k92j69r0j11J175j437M82J96J06
2952B24k63n26J247q41k05M01J19J06r35R96jn20O1r0Q57j072L21O95n13k62m15
2973f16J194o59n36P14K03j27q00R24M8o07nK87O21r80J61N41j44l96n30J559
2993H52r24m10O63J6J73j257R33N85j074K87N6Q58j158l2R84l01m69l23J009j9
3013D49j010N76L95k00q82O14P23q37k29O03M11q47k43J042j70n93l27J167m62
3032A80n74L96L67O4j366R14O21p10l00K66O27p03l37R49j72l67k65Q01J25j245
$$ plain form
3052 -729 141 334 211 -393 -196 744 -189 -387 -50 301 -176 -480 218 456 -307 -377 435 236 -429 -151
3072 -151 329 127 -490 -33 440 15 -241 -159 498 -219 -442 270 263 -263 -500 439 284 -738 73 451 118
3093 118 -189 -158 668 -112 -463 470 242 -192 -538 317 414 -585 -117 503 164 -642 -70 652 -54 -596 268
3114 268 571 -110 -570 283 517 -492 -266 283 478 -455 -481 533 236 -569 -280 452 137 -524 -171 741
3134 741 -111 -560 161 501 -173 -542 400 556 -488 -192 371 298 -510 -256 734 34 -524 -24 536 52
3154 52 -662 160 670 -360 -256 222 678 -458 -373 624 142 -258 -131 576 131 -565 101 425 -119 -471
3174 -471 179 468 -332 -366 447 358 -280 -296 377 150 -585 -226 638 -71 -570 58 293 -32 -548 351 567
3195 567 -247 -208 140 485 -435 -359 587 -83 -304 -100 679 77 -570 292 275 112 -466 53 448 -443 -199
$$ packed form
3052g29Q70J93j23o04J97R40r33j98L37L51m77l04O98K38p63p0Q12j99o65K78
3072a51M80k02o17M57M73m25k56Q2O57p17k23P12pn26k37R39j55j022Q11L78l33
3093A18l07L1Q26p80l51R33k28m34l46Q55R7r99M68O20l39q06N72P22p06n42Q64
3114B68L03o81m60Q53K34j009K26N49J95r33k6J014k97q05K89P32l15o61L53R12
3134G41q52m49P21L40o74l69R42J56j044K96N63p3q08K54R90p00n58N00N60m84
3154E2p14Q22N10j030J04M78M56j136Q5R97m82m00J27P07m45o96O66L24n44l52
3174d71O50K89q00l4Q13q9o38j6O73k27p35L59Q64p09m99O28K35l25n16Q99K16
3195E67q14L9L48L45r20P6R46o70k21K04P79o02o47Q62j7j63n78N19L95q91K44
$$ plain form
3216 -199 263 104 -440 -407 469 118 -454 -111 459 -15 -655 265 371 -64 -569 97 562 -468 -180 236
3236 236 345 -392 -351 653 74 -367 -333 553 143 -732 212 178 -103 -537 -44 792 -500 -8 348 422 -160
3257 -160 -440 585 311 -520 -216 485 -2 -618 93 441 -42 -223 201 687 -402 -457 311 454 -339 -389
3277 -389 540 166 -345 -165 394 270 -702 268 426 -22 -417 -146 725 -442 -337 291 290 142 -365 657
3297 657 25 -292 -93 182 207 -558 102 430 -177 -184 23 611 -416 -412 277 139 -61 -387 426 79 -372
3318 -372 -93 279 184 -591 69 346 -288 -96 -78 385 -262 -316 314 151 -158 -220 361 -7 -340 70 134 208
3340 208 -474 187 429 -262 -146 -112 474 -467 -309 453 120 -243 -403 424 172 -346 -53 91 197 -434
3360 -434 80 490 -358 -185 -155 341 -298 -378 432 -37 -8 -287 397 311 -381 41 232 133 -301 157 472 -241
$$ packed form
3216a99M62j59n44L3Q76l51n72L43N70m74o40R20J06m35n05O66M65j030K88M16
3236B36J09p37M1J004n79m41L4Q86m10q75R44l4k81m34M93Q36j292M92L56P4n82
3257a60k80J025k74q31L04P01m87o16P11L48m83j81M24M86j089n5P68J43p93n0
3277c89R29l74n11J80N59j24r72R70J58m48l95K71Q71j167J05O28jj48n07J022
3297F57o32l17J99K75K5p65O60L28o07pK07N88j027MO89j38k00l26Q13l47m51
3318c72K79L72r5p75O60K77o34J92J8M63o47n4O30j63l09o2N81l68l33M10O4P4
3340B08o82O61K42o91J16L4N86r41J58P62l33l63j60Q27k52n18K93J44J06o31
3360d34N14M10q48J73L0M96o39q0Q10m69K9k79O84q6o92M22J91r9m34M58L15p13
$$ plain form
3382 -241 -189 72 494 -131 -353 396 93 -48 -290 439 225 -255 -68 111 229 -430 4 406 -215 -186 -11
3403 -11 441 -168 -332 203 251 125 -359 412 193 -450 -90 11 248 -426 -74 337 -192 -79 23 138 -16
3424 -16 -314 276 85 -235 -298 67 210 -241 13 71 23 -253 -166 432 -194 -6 -191 130 120 -409 286 -146
3446 -146 -72 -154 -20 163 -358 120 36 132 -188 -158 421 -307 -75 -147 219 194 -320 435 -81 -38 -104 57 271
3469 271 -396 229 168 146 -177 -134 458 -211 -183 87 192 41 -512 354 27 -245 -92 174 355 -336 -145
3490 -145 229 102 -270 -102 302 21 -196 -8 266 -53 -394 85 118 173 -122 -7 164 -248 -96 181 57
3511 57 -263 -137 429 -28 -43 -78 202 295 -572 244 344 -118 -123 -91 444 -406 -32 133 75 141 -358 254 42
3534 42 -212 64 159 79 -129 116 281 -135 -172 126 168 -75 -163 227 63 -52 -313 465 75 -253 -82 111
$$ packed form
3382b41N2K61M22o25k22P49l03j41k42P29k14m80J87J79J18o59M34M02o21K9J75
3403a1M52o09j64N35M8j26m84P71k19o43L60J01K37o74L52M11n29J13J02J15j54
3424a6k98N90j91l20o3L65J43m51K54N8m8k76Q7N98o26J88j85L21j0n29O95m32
3446a46P4q2J34J83n21M78q4R6l20L0N79p28K32p2L66k5n14P55n16M3o6J61K14
3469B71o67O25o1k2l23M3N92o69K8K70J05j51n53Q66l27k72J53K66J81o91J91
3490a45L74j27l72J68M04k81k17J88K74l19l41M79L3N5k95J15J71m12J52K77j24
3511E7l20J26N66m57j5l5K80R3q67Q16J00m62nL2N35q50L74J65n8O6m99O12k12
3534D2k54K76R5q0k08K45J65m16l7K98M2k43q8L90j64j15k61P78l90l28J71J93
$$ plain form
3556 111 305 -301 153 145 -52 -179 -136 348 -174 -128 206 87 17 12 241 146 -346 -28 219 126 34 52 335 -40
3580 -40 -146 -7 191 -132 -171 120 8 -200 -153 93 79 -137 -137 291 85 -213 91 110 -30 -190 29 285
3602 285 -352 -144 163 142 -189 -132 205 160 -367 25 152 264 -270 -190 339 -129 -363 134 277 -8 -112
3623 -112 337 106 -106 30 171 273 -306 -13 204 51 -504 -11 272 -84 -345 107 441 -39 -70 89
3643 89 297 -134 -220 226 234 -280 -37 205 184 -259 -10 294 246 -97 -48 287 9 -265 152 146 -116 -132 -20
3666 -20 133 -228 -98 345 50 -328 -140 462 72 -507 45 205 -53 -288 207 213 -31 -342 188 187 -330 -215
3688 -215 318 244 -215 5 347 -118 -330 -65 171 -304 -305 108 134 -101 -208 97 242 -173 -133 304 109 -250
3710 -250 -46 271 96 -412 109 95 -194 -191 128 328 -126 -205 197 22 -239 -99 373 5 -333 122 114 129
$$ packed form
3556A11J94o06M54qj97j27M3M84n22M6L34j19p0nK29r5m92L18K47r3r2J8K83l75
3580d0j06J39J98l23l9K91j12k08M7K46j4k16%M28k06k98L04J9j40j60K19K56
3602B85o37K08L07k1l31N7L37m5n27L92J27J12n34Q0N29m68k34M97J43k85j04
3623a12M49k31k12J36J41J02n79K93K17j53n55M93K83l56k61M52L34m80l1J59
3643H9K08m31q6M46Qn14K43K42k1m43K49L04m8l43M9L35k78k74M17ok62j6J12
3666b0J53l61J30M43k95l78J88O02l90n79N52J60k58k35M95Ok44l11N30jn17J15
3688b15N33p4m59K20L42m65k12K65K36m75jM13K6k35j07L05J45m15M0M37j95l59
3710b50K04L17j75n08N21j4k89LL19K00m54p9M02j75k61J40M72l68l38M55qJ5
$$ plain form
3732 129 -382 -29 423 -132 -91 250 338 -153 -49 211 192 -235 -284 245 127 -244 -54 263 116 -213 193
3753 193 172 -180 -147 107 400 -335 -350 97 -123 -126 -276 259 220 -417 65 215 -2 -345 123 300 -116 -15
3775 -15 172 461 -147 -231 399 47 -269 -212 271 210 -300 78 228 112 -190 14 366 10 -181 210 139 -179
3797 -179 -174 158 196 -339 -261 262 36 -339 -38 148 77 -178 4 307 -162 -289 -23 296 -205 -257 394 184
3819 184 -298 -101 223 58 -348 60 131 -159 -158 -2 522 -176 -321 74 194 -13 -355 202 71 -178 32
3840 32 291 65 -420 42 326 -12 -281 103 309 -313 -152 84 215 -126 -287 285 88 -274 -50 237
3860 237 27 -231 187 314 -41 -222 -118 174 -190 -112 -44 245 -94 -159 223 196 -130 -107 233 185 -286 171
3882 171 216 -88 -275 -146 196 -150 -63 155 204 -55 -247 175 166 -308 -67 169 59 -296 24 123 -117 -193
$$ packed form
3732A29n11L53M52n55M1L41Q8m91J04K60j9m27m9N29j18l71J90L17j47l29M06
3753A93k1l52L3K54K93p35j5M47k20lj50N35l9o37M82J50k17l43M68J77m16J01
3775a5J87K89o08q4O30l52l16N7M83o1n10L78J50j16l02K04L52l56j91L91p1l18
3797a79NL32L8n35P8N23k26l75L01J86p1k55J82L03m69j27K66L19n01n2O51k10
3819A84m82J97L24j65m06M08P1k90JJ56N24o98j45L95J20k07l42N57j31k49K10
3840C2K59k26m85M62K84l38k69L84K06o22J61K36J31l41j61N72j97l62K24K87
3860B37k10k58M18J27l55j81J04K92l64P8O8K89l39o5L82k7l26K3L40m8m71M57
3882A71M5l04j87J29L42l46Q7K18M9k59j92M22rm74K41K36j10l55L20R9k40p6
$$ plain form
3904 -193 -36 335 -15 -136 220 155 60 -261 128 174 -182 105 -13 186 -237 -74 184 -176 -144 -81 358 42
3926 42 -179 219 291 -175 -92 263 72 -230 -69 282 59 -447 -56 170 -204 -92 62 303 -59 -237 145
3947 145 133 -176 -134 340 63 -324 85 263 79 -231 -94 332 -47 -63 24 232 73 -155 149 34 111 -243
3969 -243 187 303 -64 72 231 155 -331 31 491 48 -159 56 370 -290 -281 274 -17 -71 -163 172 62 -183
3991 -183 -86 -121 136 -104 -229 98 -65 -192 -7 122 -174 -129 236 150 -105 -35 5 113 -225 -7 116 118 -9
4014 -9 -98 174 -101 -175 56 113 -8 -190 187 91 -101 -55 102 163 -192 -46 126 224 -44 -8 323 -27 18 -167
4038 -167 81 75 -82 92 -49 -230 -383 108 132 -238 -78 29 21 -56 -209 181 -38 -130 112 210 110 1 -19
4061 -19 -4 20 -66 67 56 -48 26 180 18 -168 -5 136 -24 3 23 202 -89 -122 -45 -23 -56 -56 -75 210 -118
$$ packed form
3904a93J57L71l50j21L56o5r5l21L89M6l56K87j18J99m23J63K58l60L2O3M39l16
3926D2k21L98P2m66Q3L55j91l02J61L51k23n06L91K26l74J12J54K41l62j78L82
3947A45j2l09M2M74k77l87M09J78j84l10J37M26l79j6Q7K08j59k28L04j15P7l54
3969b43M30J16l67J36J59p6m86L62M60m43k07K15L14o60RN55k91n4r2L35j10k45
3991a83R7l5K57k40j25L27j63j27J85J29k96M5L65q6k55P0M0J08l38K18J23Kj27
4014iq9K72k75p4K31N7j21j82L77r6j92M6J57O1l55J46J72R8k68L6L31l50M5j85
4038a67K48oj57J74j41j81j53M91K4l70J60J07qp7j53L90k19r2K42R8j00j09k0
4061a9J5K4q6J33j1j04P4J54j62j86J63J41j60K7K0J79k91l3P7K2l3%j9K85l28
$$ plain form
4086 -118 -102 156 23 83 -221 179 -21 -210 24 -68 177 -299 -162 156 -167 -99 91 101 -121 -55 192 184 -43
4109 -43 -136 376 -45 -33 5 178 -113 -148 74 122 -28 -183 58 155 -5 -72 6 -3 14 -353 6 345 -37 11
4133 11 123 -16 -262 128 244 -68 -104 -121 232 -62 -257 103 164 5 -113 139 55 -289 22 94 91 -194 18
4156 18 91 37 -161 -44 190 -48 -211 12 -9 -190 -224 146 56 45 21 50 -82 -112 -40 -14 -100 -153 44 49 -73
4181 -73 -269 64 173 -40 -104 54 11 -72 35 -4 -6 -133 -32 93 -205 -214 23 185 -11 -118 76 228 -6
4204 -6 -145 168 45 -78 31 167 88 -244 -75 72 87 -151 -67 242 -175 -199 144 149 -140 -246 101 46 -49
4227 -49 -81 75 -23 -145 -34 5 -65 -152 -65 46 87 -198 50 3 -289 -364 -72 5 -83 -38 217 5 -176 64
4251 64 15 -43 -87 105 83 59 -77 210 172 -6 -145 119 175 -132 -33 149 -47 -268 6 154 46 -117 95
$$ packed form
4086a18J6K58j33O0l04M00k00j89K34r2K45m76J37L18l23O8J90J0k22O6K47qk27
4109d3r3N12m21J2L8J73k91l5K22M8j50j55K41R7j60o7P8rJ7l67L59L39l82M8
4133A1J12j39k46L90J16l12l6j7L53k94j95L60O1j59j18K52q4l44L11P2lk85K12
4156A8P3n4j98J17K34k38j63K23k1j81l4L70r0j1k4K9j32l0P2K6q6n3J97Nj22
4181g3j96L33J09k13o4J58m3q3J07l9kj27J01J25k98rK37J62j96j07J94J52k34
4204fj39L13j23j23J09J36p9l32J69J47J5k38Q4L09m17k4L43Nk89j06L47n5r5
4227d9l2J56r8j22J11L9p0q7Q7J11M1k85K48m7k92p5K92P7q8M5K55k12j81K40
4251F4m9n8m4J92k2k4j36K87l8j78j39K64N6l07R9J82j96k21K74J48j08j63K12
$$ plain form
4274 95 142 -56 -78 -25 60 -79 -218 98 216 -144 -188 109 -205 -149 70 159 -58 -257 188 137 -116 -270 -1
4297 -1 234 54 -122 100 110 -205 -46 232 75 -142 43 41 48 -187 -17 212 0 -47 82 194 -42 -256 108
4320 108 -78 -158 -64 296 51 -216 15 -49 -62 -309 3 183 -133 -218 11 176 -76 -204 106 56 -4 -203
4342 -203 5 64 -140 -65 154 11 -194 -27 282 -75 -229 -45 214 -51 -134 216 111 -165 -44 172 77
4363 77 -178 -26 76 -118 -164 2 257 10 -140 50 89 -164 -164 91 75 -124 -85 75 -43 -204 -74 327
4385 327 121 -231 -157 221 36 -66 123 211 12 -162 119 25 -40 -71 161 36 -126 -44 114 148 -1 39 137
4408 137 -69 12 -81 118 -109 -303 32 50 40 13 147 179 -138 82 184 67 -116 40 262 -148 -61 37 55
4431 55 43 -88 236 -67 -93 29 -99 84 -78 -85 217 45 -51 -55 232 -35 -102 27 116 153 -251 179 179 -78
$$ packed form
4274I5M7j98k2N3Q5j39j39L16J18l60m4K97l14N6K19Q9k17j99M45n1k53j54K69
4297aK35j80j76K22J0l15J59K78j57k17J85kPk35J70K29k12m7J29J12k36k14L64
4320A08j86q0R4L60k45k67K31o4j3k47L12J80l16q5K29J65k52j28L10n0o0j99
4342b03K08N9k04P5K19j43k05J67L09l57j54J84K59k65q3L50j05k76J21K16r5
4363G7k55J52J02j94m6J66K55k47j50J90L9k53%K55j6j99L9J60j18j61J30M01
4385C27k06l52P4L78j85j02J89Q8j99j74K81r4o5l1K32j25j62Q2J58L4j49M0R8
4408A37k06Q1r3J99k27j94L35J8j0k7J34L2l17K20J02j17j83J56K22m10Q7R8J8
4431E5j2j31L24l03k6J22j28J83j62pL02j72r6mK87k67o7J29Q9L7m04M30%k57
$$ plain form
4455 -78 40 110 179 -67 -45 -30 97 -189 -49 288 -130 26 101 103 16 10 168 148 -240 -73 25 229 -274 25
4479 25 330 4 -11 -21 121 -240 -301 116 159 301 -239 -20 44 -194 80 192 218 -118 96 51 95 -278 101
4502 101 286 -50 -28 85 31 -54 -218 59 45 -54 51 180 244 -190 0 198 -11 -130 -47 244 -11 -40 44
4525 44 153 89 -91 -47 22 -22 68 189 111 -202 -88 58 -271 -34 131 114 76 -141 143 -19 -213 -320 -67
4548 -67 48 -181 -32 45 47 -97 66 185 10 -112 -87 12 -109 -166 -1 28 20 -184 272 80 -89 -68 112 195
4572 195 -225 -244 298 -105 -75 10 -98 -161 -251 169 177 -177 -16 5 19 -93 -130 190 -168 -28 -170 192 100 -248
4596 -248 0 69 14 -252 55 60 -153 -4 54 144 -44 116 66 95 37 -98 170 -22 -90 115 -20 30 -120 161
4620 161 196 101 -64 17 65 -172 -114 95 -52 -14 147 12 -61 -177 -14 -88 55 -49 -97 149 81 -266 -39
$$ packed form
4455g8J18P0O9k46K2J5J27k86J40L37m18J56P5Kq7oJ58k0l88J67R8K04n03K99
4479B5L05l26j5j0J42l61o1M17M3J42n40K19O4k38K74J12K6l36K14m5M4l73L79
4502A01J85l36K2J13n4q5j64K77j4r9J05J29O4m34J90J98k09j19Q3K91k55k9Q4
4525D4J09o4j80M4O9m4R0J21p8l13J14J46l29K37J65j7l8k17K84j62j94j07K53
4548f7J15k29J49P7Kj44J63J19j75j22K5R9j21n7J65K9qk04M56j92j69K1J80Q3
4572A95m20j9N42m03L0Q5j08o3r0M20Ql54J61K1J4j12l7L20l58J40j42L62r2l48
4596b48K48O9n5k66L07Nk13J49N8R0j88J60n0K9n8j35K68j92o8K05j35N0j50K81
4620A61L5r5j65Q1M8k37N8K09j47L8J61j35p3j16J63p4J43j04m8K46o8l47K27
$$ plain form
4643 -39 172 -218 -16 106 -117 -89 -32 111 -81 -195 24 160 -138 -33 -26 132 -67 34 109 63 -87 -80 175
4666 175 143 -26 80 -110 -36 -52 -89 42 85 -60 193 -8 15 -135 99 89 -106 -53 -40 105 -163 -30 170
4689 170 60 -137 24 63 10 -62 128 205 -105 -112 14 77 -226 -126 176 152 31 -17 251 234 -186 112 6
4712 6 149 -6 16 107 -47 -53 85 191 -89 -43 89 -22 40 -156 25 35 144 21 148 -82 9 60 74 -61
4736 -61 -135 -148 130 15 -5 150 34 -31 -136 -84 196 -145 -49 120 -4 -3 -7 73 -84 -82 6 -47 57 -294 -4
4761 -4 -11 -81 -102 103 139 -105 -67 148 -81 -82 -178 4 -82 -74 -43 -18 -148 -61 106 -20 -127 -34 -49 9 -118 92 145
4788 145 59 -91 31 78 47 19 13 125 53 -131 -25 48 -27 128 -57 -42 -193 -4 -113 72 0 93 181 -199
4812 -199 -247 122 23 -104 -87 44 -28 -74 -67 134 -66 130 5 215 -52 -149 -174 -59 70 -104 155 133 57 -63
$$ packed form
4643c9K11l90K02J22k23K8N7J43j92j14K19J36k98J05PJ58j99J01P5m6j50PK55
4666A75l2j69J06j90P4j6l7J31M3j45K53k01K3j50K34j0j95N3J3J45k68J33K00
4689A70j10j97J61L9n3p2J90P7l10pJ26O3l03J00L02k4j21m8K68j7m20K98j06
4712FJ43j55K2R1j54oJ38J06k80M6J32j11O2j96J81J0J09j23J27k30R1N1J4j35
4736f1p4j3K78j15k0J55j16o5j05N2K80l41R6J69j24JmQ0j57KQ8n3J04l51K90
4761dpp0k1K05L6k44L8K15k29jr6J82q6QL1K5j30Q7J67j26j07R3j5N8j27K10N3
4788A45q6j50J22M7l1k8oJ12p2j84J06P3p5J55j85J5j51J89j09J85p2R3Q8l80
4812a99m8L69r9j27J7J31p2m6PK01k00J96j25K10k67r7k5J15J29j74K59k2p6j20
$$ plain form
4836 -63 135 50 -88 47 55 89 46 58 38 -94 -24 68 237 -25 -112 -90 -147 -67 -94 92 1 -90 -26 41 54 -30 -145
4863 -145 70 151 -159 34 108 76 -85 80 -49 89 12 139 26 -150 -175 50 258 -143 41 21 -126 -198
4885 -198 -155 58 -90 86 -27 61 -59 -54 -29 44 -103 -50 72 36 -108 -79 -118 -49 -112 51 -13 -79 -230 -37 93
4910 93 -114 -123 -11 109 -3 31 166 -129 -134 38 60 65 -141 25 185 4 -203 -17 162 8 69 167 22 -158
4934 -158 -116 201 85 -98 -91 13 -42 -180 43 -21 36 113 70 49 -86 -275 -30 15 -203 -201 33 94 -159 -60 51
$$ packed form
4836f3J98q5j38J35QL4m3J2k0j32P0R2J69k62q7K2n7Q0k7J86r1r1O4O7J3q4j15
4863a45K15Q1l10J93P4l2j61J65j29J38p7J27j13j76k5K25K08m01J84k0j47p2
4885a98M3K13j48J76j13Q8j20NK5P3j47N3J22l6j44K9l9O9o3J63o4o6j51J93J30
4910I3k07rJ12J20j12L4J35k95nJ72K2Nk06J66J60j81k07J86J79j54O1R8j45j80
4934a58M2L17j16j83PJ04n5j38K23o4N7P7m3k1j35j89K45M5k18KK34O1k53R9J11
$$ [...]
8191E1
##END NTUPLES=NMR FID
##END=
