##TITLE=1H_LR-758-CR2-CHL
 CCl4
 8 sc, 
 22.11.2022
##JCAMPDX= 6.0         $$ Bruker NMR JCAMP-DX V2.0
##DATA TYPE= NMR FID
##DATA CLASS= NTUPLES
##ORIGIN= UXNMR, Bruker Analytische Messtechnik GmbH
##OWNER= root
$$ XWIN-NMR		Version 3.5
$$ Tue Nov 22 14:50:01 2022 Russian Standard Time (UT+4h)  she@DPX200
##.OBSERVE FREQUENCY= 200.1313499994
##.OBSERVE NUCLEUS= ^1H
##.DELAY= (6, 6)
##.ACQUISITION MODE= SIMULTANEOUS
##.ACQUISITION SCHEME= undefined
##.AVERAGES= 8
##.DIGITISER RES= 18
##SPECTROMETER/DATA SYSTEM= spect
##.PULSE SEQUENCE= zg30
##.SOLVENT NAME= CDCl3
##.SHIFT REFERENCE= (INTERNAL, CDCl3, 0, 15.7039)
##AUDIT TRAIL= $$ (NUMBER, WHEN, WHO, WHERE, WHAT)
$$ ##TITLE= Audit trail, XWIN-NMR		Version 3.5
$$ ##JCAMPDX= 5.01
$$ ##ORIGIN= Bruker BioSpin GmbH
$$ ##OWNER= she
$$ F:/spectra/data/she/nmr/H-F/1/audita.txt
$$ ##AUDIT TRAIL=  $$ (NUMBER, WHEN, WHO, WHERE, WHAT)
(   1,<2022-11-22 14:48:44.29 +0400>,<she>,<DPX200>,
      <created by zg, POWCHK disabled, PULCHK disabled
       configuration hash MD5:
       00 E9 B6 7A A2 85 ED C7 34 08 36 98 17 FE 4E 26
       data hash MD5: 16K
       CD 35 25 CC 94 1E 8A 37 5D BC 8A BA 9E B0 30 1A>)
$$ ##END=
$$ 
$$ hash MD5
$$ 7F FC E3 AA 2B 9F 4D 3D 3B D1 57 9F 5C 04 2B 2B
##$RELAX= 
##$RELAX= 
##$RELAX= 
##$RELAX= 
##$RELAX= 
##$RELAX= 
$$ Bruker specific parameters
$$ --------------------------
##$DU= <F:/spectra>
##$EXPNO= 1
##$NAME= <H-F>
##$PROCNO= 1
##$TYPE= <nmr>
##$USER= <she>
##$AMP= (0..31)
100 100 100 100 100 100 100 100 100 100 100 100 100 100 100 100 100 100 
100 100 100 100 100 100 100 100 100 100 100 100 100 100 
##$AQSEQ= 0
##$AQ_mod= 1
##$AUNM= <au_zg>
##$AUTOPOS= <>
##$BF1= 200.13
##$BF2= 200.13
##$BF3= 200.13
##$BF4= 200.13
##$BF5= 200.13
##$BF6= 200.13
##$BF7= 200.13
##$BF8= 200.13
##$BYTORDA= 1
##$CFDGTYP= 0
##$CFRGTYP= 5
##$CHEMSTR= <none>
##$CNST= (0..31)
1 1 145 1 1 1 1 1 1 1 1 1 1 1 1 1 1 1 1 1 1 1 1 1 1 1 1 1 1 1 1 1 
##$CPDPRG= <>
##$CPDPRG1= <>
##$CPDPRG2= <>
##$CPDPRG3= <>
##$CPDPRG4= <mlev>
##$CPDPRG5= <mlev>
##$CPDPRG6= <mlev>
##$CPDPRG7= <mlev>
##$CPDPRG8= <mlev>
##$CPDPRGB= <>
##$CPDPRGT= <>
##$D= (0..31)
0 1.2 0 0 0 0 0 0 0 0.06 0 0.03 0 0 0 0 0.0002 0 0 0 0 0 0 0 0 0 0 0 0 
0 0 0 
##$DATE= 1669114123
##$DBL= (0..7)
120 120 120 120 120 120 120 120 
##$DBP= (0..7)
150 150 150 150 150 150 150 150 
##$DBP07= 0
##$DBPNAM0= <>
##$DBPNAM1= <>
##$DBPNAM2= <>
##$DBPNAM3= <>
##$DBPNAM4= <>
##$DBPNAM5= <>
##$DBPNAM6= <>
##$DBPNAM7= <>
##$DBPOAL= (0..7)
0.5 0.5 0.5 0.5 0.5 0.5 0.5 0.5 
##$DBPOFFS= (0..7)
0 0 0 0 0 0 0 0 
##$DE= 6
##$DECBNUC= <off>
##$DECIM= 32
##$DECNUC= <off>
##$DECSTAT= 4
##$DIGMOD= 1
##$DIGTYP= 9
##$DL= (0..7)
0 120 120 120 120 120 120 120 
##$DP= (0..7)
150 150 150 150 150 150 150 150 
##$DP07= 0
##$DPNAME0= <>
##$DPNAME1= <>
##$DPNAME2= <>
##$DPNAME3= <>
##$DPNAME4= <>
##$DPNAME5= <>
##$DPNAME6= <>
##$DPNAME7= <>
##$DPOAL= (0..7)
0.5 0.5 0.5 0.5 0.5 0.5 0.5 0.5 
##$DPOFFS= (0..7)
0 0 0 0 0 0 0 0 
##$DQDMODE= 0
##$DR= 18
##$DS= 0
$$ [...]
##$SUBNAM2= <"">
##$SUBNAM3= <"">
##$SUBNAM4= <"">
##$SUBNAM5= <"">
##$SUBNAM6= <"">
##$SUBNAM7= <"">
##$SUBNAM8= <"">
##$SUBNAM9= <"">
##$SW= 18.0517283424941
##$SWIBOX= (0..15)
0 0 2 0 0 0 0 0 0 0 0 0 0 0 0 0 
##$SW_h= 3612.71676300578
##$TD= 16384
##$TD0= 1
##$TE= 0
##$TE2= 300
##$TE3= 300
##$TEG= 300
##$TL= (0..7)
0 120 120 120 120 120 120 120 
##$TP= (0..7)
150 150 150 150 150 150 150 150 
##$TP07= 0
##$TPNAME0= <>
##$TPNAME1= <>
##$TPNAME2= <>
##$TPNAME3= <>
##$TPNAME4= <>
##$TPNAME5= <>
##$TPNAME6= <>
##$TPNAME7= <>
##$TPOAL= (0..7)
0.5 0.5 0.5 0.5 0.5 0.5 0.5 0.5 
##$TPOFFS= (0..7)
0 0 0 0 0 0 0 0 
##$TUNHIN= 0
##$TUNHOUT= 0
##$TUNXOUT= 0
##$USERA1= <user>
##$USERA2= <user>
##$USERA3= <user>
##$USERA4= <user>
##$USERA5= <user>
##$V9= 5
##$VALIST= <valist>
##$VCLIST= <CCCCCCCCCCCCCCC>
##$VD= 0
##$VDLIST= <DDDDDDDDDDDDDDD>
##$VPLIST= <PPPPPPPPPPPPPPP>
##$VTLIST= <TTTTTTTTTTTTTTT>
##$WBST= 1024
##$WBSW= 4
##$XGAIN= (0..3)
0 0 0 0 
##$XL= 0
##$YL= 0
##$YMAX_a= 568154
##$YMIN_a= -451965
##$ZGOPTNS= <>
##$ZL1= 120
##$ZL2= 120
##$ZL3= 120
##$ZL4= 120
##$ABSF1= 10
##$ABSF2= 0
##$ABSG= 5
##$ABSL= 3
##$ALPHA= 0
##$AQORDER= 0
##$ASSFAC= 0
##$ASSFACI= 0
##$ASSFACX= 0
##$ASSWID= 0
##$AUNMP= <proc_1d>
##$AZFE= 0.1
##$AZFW= 0.1
##$BCFW= 1
##$BC_mod= 2
##$BYTORDP= 1
##$COROFFS= 0
##$CY= 11.3945322036743
##$DATMOD= 1
##$DC= 2
##$DFILT= <>
##$DTYPP= 0
##$F1P= 2.36226072786647
##$F2P= -0.459571619588291
##$FCOR= 0.5
##$FTSIZE= 0
##$FT_mod= 4
##$GAMMA= 1
##$GB= 0.15
##$INTBC= 1
##$INTSCL= 1
##$ISEN= 128
##$LB= 0.24
##$LEV0= 0
##$LPBIN= 0
##$MAXI= 10000
##$MC2= 0
##$MEAN= 0
##$ME_mod= 0
##$MI= 1.114404
##$NCOEF= 0
##$NC_proc= 0
##$NLEV= 6
##$NOISF1= 3.799351
##$NOISF2= 2.8
##$NSP= 1
##$NTH_PI= 0
##$NZP= 0
##$OFFSET= 15.70392
##$PC= 1
##$PHC0= -18033.89
##$PHC1= 14.00071
##$PH_mod= 1
##$PKNL= yes
##$PPARMOD= 0
##$PSCAL= 0
##$PSIGN= 0
##$REVERSE= no
##$SF= 200.130013532006
##$SI= 16384
##$SIGF1= 3
##$SIGF2= 2
##$SINO= 400
##$SIOLD= 16384
##$SREGLST= <1H.CDCl3>
##$SSB= 0
##$STSI= 0
##$STSR= 0
##$SW_p= 3612.71676300578
##$SYMM= 0
##$S_DEV= 0
##$TDeff= 0
##$TDoff= 0
##$TI= <>
##$TILT= no
##$TM1= 0
##$TM2= 0
##$TOPLEV= 0
##$USERP1= <user>
##$USERP2= <user>
##$USERP3= <user>
##$USERP4= <user>
##$USERP5= <user>
##$WDW= 1
##$XDIM= 8192
##$YMAX_p= 0
##$YMIN_p= 0
$$ End of Bruker specific parameters
$$ ---------------------------------
##NTUPLES= NMR FID
##VAR_NAME=  TIME,          FID/REAL,        FID/IMAG
##SYMBOL=    X,             R,               I
##VAR_TYPE=  INDEPENDENT,   DEPENDENT,       DEPENDENT
##VAR_FORM=  AFFN,          ASDF,            ASDF
##VAR_DIM=   8192,          8192,            8192
##UNITS=     SECONDS,       ARBITRARY UNITS, ARBITRARY UNITS
##FACTOR=    0.0002768,     1,               1
##FIRST=     0,             0,               0
##LAST=      2.2672688,     0,               0
##MIN=       0,             -451965,         0
##MAX=       2.2672688,     568154,          0
$$ Real data points
##PAGE= N=1
##DATA TABLE= (X++(R..R)), XYDATA
$$ [...]
$$ plain form
1448 -536 1844 -570 -1543 1124 782 -368 -1367 1124 1242 -1592 -194 1022 657 -1270 -622 1946 -409
1465 -409 -1300 448 1034 59 -1516 868 1390 -1245 -379 913 891 -944 -623 1438 167 -1352 256
1482 256 1058 -268 -1329 539 1117 -769 -749 809 815 -912 -646 1231 121 -1301 9 1103 -170
1499 -170 -1180 356 1458 -703 -1351 1053 753 -777 -825 1144 807 -1614 -192 1006 150 -1106 -351
1516 -351 1701 -483 -1208 446 664 -112 -1404 940 905 -988 -563 611 654 -1355 -142 1210 -356
1533 -356 -741 17 1226 -642 -645 851 495 -513 -779 1399 260 -1124 -137 937 450 -1683 424
1550 424 1165 -462 -622 -43 1541 -822 -1111 1125 263 -358 -1126 1072 633 -1321 217 645 464 -1123
1568 -1123 266 1348 -672 -549 219 937 -589 -814 1155 49 -550 -571 1176 -30 -1053 350 555
$$ packed form
1448e36K380k414r73K667l42j150r99K491J18k834J398J216l65j927O48K568k355
1465d09q91J748N86r75j575K384N22k635Q66J292k2j835L21K061j271j519J608
1482B56Q02j326j061J868N78j886K0J558Oj727K66J877j110j422J310J094j273
1499a70j010J536J102k161o48K404l00j530m8J969l37k421J422J198q56j256P55
1516c51K052k184p25J654K18p76j292K344l5j893M25J174M3k009J213J352j566
1533c56l85P58J209j868lJ496l56j008k66K178j139j384R87J074m87k133K107
1550D24P41j627j60N79J584k363k89K236q62o21p68K198m39j954J538M28j81j587
1568a123J389J082k020J23P68P18j526k25J969j106n99k1J747j206j023J403K05
$$ plain form
1585 555 86 -1181 835 1085 -1041 -160 69 1065 -1200 -624 1680 -522 -396 -578 1184 535 -1666
1602 -1666 928 593 -40 -955 75 1397 -1210 -327 360 462 -572 -699 1560 -43 -500 12 584
1619 584 183 -1036 403 418 -474 -695 817 507 -955 42 446 463 -1041 -167 1516 -706 -392 116
1637 116 1023 -190 -1616 1295 336 -514 -657 507 983 -1395 95 604 248 -592 -490 1319 -590
1654 -590 -685 295 312 -98 -1047 619 468 -785 -366 711 274 -876 59 439 94 -1009 363 888 -669
1673 -669 -276 318 620 -665 -811 1106 85 -415 -391 940 360 -1288 689 539 180 -964 1 1256
1691 1256 -1031 -273 487 285 -371 -933 937 191 -509 -198 687 131 -799 344 227 -79 -818 413
1709 413 767 -1005 -63 161 437 -646 -202 1187 -389 -374 -281 919 -205 -1028 1121 -22 37 -791
$$ packed form
1585E55m69j267K016K50k126Q81K29R96k265N76K304k202J26j82J762o49k201
1602a666K594l35o33r15J030J322k607Q83O87J02j034j27K259j603m57N12N72
1619E84m01j219J439J5q92k21J512l10j462R97M04J7j504Q74J683k222L14N08
1637A16R07j213j426K911r59q50j43J164M76k378J490N09l56q40J02J809j909
1654e90r5R80J7m10r49J666j51j253M19J077m37j150R35L80l45j103J372N25j557
1673f69L93N94L02j285j46J917j021n00K4J331n80j648J977j50l59j144R65J255
1691A256k287P58P60k02o56n62J870p46p00L11Q85n56r30J143j17l06p39J231
1709D13L54j772R42K24K76j083M44J389j576J5R3J200j124q23K149j143N9q28
$$ plain form
1727 -791 422 1142 -1428 375 344 345 -383 -683 1519 -623 -283 -51 472 -9 -1204 972 -17 -49 -587
1746 -587 153 938 -1430 555 277 105 -321 -619 1439 -715 -441 203 355 178 -1133 1326 -315 -272
1764 -272 -94 83 1141 -1536 508 561 -289 75 -576 1408 -847 -217 718 125 88 -1111 1339 -55
1782 -55 -609 119 -25 902 -1452 499 650 -586 307 -597 1066 -868 -198 854 -173 189 -960 1238
1800 1238 17 -881 512 -208 881 -1362 294 980 -938 478 -543 1015 -469 -713 1142 -467
1816 -467 124 -657 788 384 -1018 707 -297 342 -735 84 897 -1025 317 -99 536 -133 -711 1044
1834 1044 -406 -342 -458 651 9 -895 708 93 140 -701 136 973 -1064 272 197 141 -426 -583 1124
1853 1124 -531 -216 105 328 273 -1056 847 110 -230 -254 -139 892 -1070 -85 524 -386 -64 -605 979
$$ packed form
1727g91J213P20k570J803l1Jp28l00K202k142L40K32N23m81j195K176r89l2n38
1746e87P40P85k368J985k78j72m26k98K058k154K74O44J52j77j311K459j641M3
1764b72J78J77J058k677K044N3q50L64o51J984k255O30R35n93l7j199K450j394
1782e5n54P28j44R27k354J951J51j236Q93r04J663j934O70J052j027L62j149K198
1800A238j221q98J393p20J089k243J656O86j918J416j021J558j484k44J855j609
1816d67N91p81J445m04j402J725j004O39j077Q19Q13j922J342m16O35o69n78J755
1834A044j450O4j16J109o42r04J603o15M7q41Q37Q37k037J336p5n6n67j57J707
1853A124j655L15L21K23n5j329J903p37l40k4J15J031j962R85O09r10L22n41J584
$$ plain form
1872 979 -109 -546 356 186 -52 -771 313 291 -502 -186 188 544 -781 -151 667 -131 -240 -47 626
1891 626 -134 -623 473 270 -155 -488 442 436 -473 -39 261 413 -477 6 653 -265 -6 -38 430 -132 -557
1912 -557 466 -17 -228 -136 342 403 -679 -81 519 -7 -275 -225 737 -221 -428 435 24 -95 -614 310
1932 310 394 -640 80 257 237 -371 -55 570 -203 -209 306 408 -175 -415 366 130 -395 -149 505 114 -804
1953 -804 -52 370 67 -315 7 626 -119 -357 130 230 -311 -472 581 137 -173 -205 331 231 -505 -9
1973 -9 373 13 -140 -196 685 -386 -240 252 -116 -84 -348 563 184 -401 96 284 315 -591 338 254 -274 -321
1995 -321 140 434 -393 -425 541 -77 -283 -256 440 263 -400 -13 182 87 -593 -8 267 -103 -260 59 426
2016 426 -246 -352 324 2 -186 -85 63 45 -165 99 90 15 -332 279 301 -438 -188 246 332 -338 -195 596
$$ packed form
1872I79j088m37R02j70k38p19J084k2p93L16L74L56j325O30Q18p98j09J93O73
1891F26p60m89J096k03m25l33R30or09M34L00J52q90M83O47r18K59l2M68n62m25
1912e57J023m83k11R2M78O1j082N98O00n26k68N0R62r58k07Q63m11j19n19R24
1932C10Q4j034P20J77k0o08L16O25p73oN15J02n83k40P81k36n25K46O54l91r18
1953h04P52M22l03l82L22O19p45k38M87J00n41j61J053m44l10l2N36j00p36M96
1973iL82l60j53n6Q81j071J46M92l68L2k64R11l79n85M97J88L1r06R29q4n28m7
1995c21M61K94q27l2R66o18k06K7O96j77o63L87J95r5o80N85K75l70j57L19L67
2016D26o72j06O76l22j88J01J48j8k10K64rp5l47O11K2p39K50M34Q6o70J43P91
$$ plain form
2038 596 -107 -582 84 393 -301 -406 38 288 -77 -505 256 231 -295 -274 297 400 -367 -191 149 112 -423
2059 -423 19 314 13 -296 123 336 -247 -130 318 261 -240 -33 319 -24 -405 113 194 115 -364 153 220
2080 220 -293 -122 108 286 -356 -308 618 44 -139 -191 473 120 -633 350 265 2 -446 15 420 -126 -100
2101 -100 314 166 -137 -180 465 46 -249 -38 244 133 -212 162 110 -92 -241 260 234 -210 1 233 151
2122 151 -425 -66 501 -125 -309 -70 336 111 -673 450 44 14 -410 123 457 -462 -2 216 25 -244
2142 -244 -426 446 -61 -413 56 127 212 -262 385 257 -251 -43 41 311 -233 -82 119 100 -250 141 255
2163 255 -255 91 50 230 -304 -203 418 -138 -253 -249 152 81 -601 157 159 23 -207 -216 699 -248 104 232 -40
2186 -40 29 -499 358 58 -232 97 -111 161 -240 94 253 -87 78 -180 261 -210 -3 369 55 -111 -206
$$ packed form
2038E96p03m75O66L09o94j05M44K50l65m28P61k5n26K1N71J03p67J76L40l7n35
2059d23M42K95l01l09M19K13n83J17M48n7n01K07L52l43l81N18Q1p9m79N17O7
2080B20n13J71K30J78o42M8R26n74j83n2O64l53p53R83q5k63m48M61M05n46K6
2101a00M14j48l03m3O45m19k95K11K82j11l45L74n2k02j49N01k6m44K11K32q2
2122A51n76L59N67o26j84K39M06k25p84J123m06l0m24N33L34r19M60K18j91k69
2142b44j82Q72n07l52M69P1Q5m74O47j28n08K08Q4K70n44J51K01j9l50L91J14
2163B55n10L46m1J80n34J01O21n56j15MM01p1o82P58Kj36k30rR15r47L52J28k72
2186d0O9n28Q57l00k90L29k08K72m01L34J59l40J65k58M41m71K07L72l14j66r5
$$ plain form
2207 -206 253 32 -174 -31 83 -113 -429 205 237 -74 -115 25 453 -541 73 108 49 -76 -424 604 -170
2228 -170 -253 75 111 153 -508 198 218 -314 -16 -40 516 -361 -25 378 -299 -27 -137 376 115 -309 350 70
2250 70 52 -277 312 224 12 17 -163 192 -342 59 269 32 37 -121 396 -256 -342 204 -84 249 -520 360 150
2273 150 -405 -187 -172 189 -357 45 309 -239 57 -187 197 -205 -433 472 12 -8 -224 230 200 -342 51
2294 51 -78 80 -268 -114 273 -272 -63 -97 149 89 -296 385 -102 -202 -284 236 238 -334 252 55 18 -333
2316 -333 221 240 -73 59 78 294 -173 -172 279 -49 42 -252 272 90 -156 145 -10 96 -255 73 269 -230
2338 -230 127 93 171 1 -120 232 -240 -152 -59 159 16 -424 225 77 14 -281 27 260 -315 113 -8 246
2360 246 -160 -94 237 -202 4 -15 254 -115 -334 140 11 -54 -362 235 293 -222 145 206 143 -166 -235 300
$$ packed form
2207b06M59k21k06J43J14j96l16O34L2l11m1J40M28r94O14L5n9j25l48J028p74
2228a70q3L28L6M2o61P06K0n32K98k4N56q77L36M03o77K72j10N13k61m24O59k80
2250G0j8l29N89q8k12Nj80L55n34M01K10k37Nj58N17o52q6N46k88L33p69Q80k10
2273A50n55K18J5L61n46M02K64n48K96k44L84m02k28R05m60k0k16M54l0n42L93
2294E1j29J58l48J54L87n45K09l4K46o0l85O81m87j00q2N20Kn72N86j97l7l51
2316c33N54J9l13J32J9K16m67JM51l28R1k94N24j82k46L01j55J06l51L28J96m99
2338b30L57l4P8j70j21L52m72Q8R3K18j43m40O49j48o3k95L08K33n75M28j21K54
2360B46m06O6L31m39K06j9K69l69k19M74j29o5l08N97N8n15L67O1o3l09o9N35
$$ plain form
2382 300 -212 -8 -92 279 -17 -115 263 91 -98 -87 245 123 -192 93 -100 127 -32 -131 253 -268 85
2403 85 47 104 12 -234 212 36 -146 -201 71 191 -387 71 -18 182 -218 -166 317 -145 -59 165 69 36 -379
2426 -379 175 -77 -45 -178 -5 15 -371 103 104 79 -171 80 292 -88 65 90 101 -107 -248 227 -72 -218
2448 -218 31 258 -57 -431 68 15 -186 -194 -21 249 -242 -68 346 -167 -55 -228 166 68 -279 126 127 94
2470 94 -244 -12 180 -164 9 111 182 -216 -18 131 -18 -195 -54 245 -1 -220 138 239 -115 -78 115
2491 115 128 -130 -68 19 37 -211 -168 182 -113 -207 50 180 -8 -57 66 83 -72 -327 93 103 -7 -76 84
2514 84 87 17 -2 22 91 -140 19 40 -188 -1 75 57 -102 30 256 -68 -109 -85 59 -166 -325 57 60 -11 -110
2539 -110 191 270 -189 -171 179 116 -259 -88 136 37 54 10 12 61 -210 122 185 -30 -70 156 -59 99 -120 164
$$ packed form
2382C00n12K04q4L71k96r8L78j72j89J1L32j22l15K85j93K27j59r9L84n21L53
2403H5l8N7r2k46M46j76j82n5K72J20n78M58q9K00m00N2M83m62Q6K24r6l3m15
2426c79N54k52L2j33J73K0l86M74Jk5k50K51K12l80J53K5J1k08j41M75k99j46
2448b18K49K27l15l74M99n3k01qJ73K70m91J74M14n13J12j73L94r8l47M05Jl3
2470I4l38K32J92l44J73J02P1l98J98J49j49j77J41K99k46k19L58J01l54L7J93
2491A15J3k58O2Q7J8k48M3L50k95r4K57J30j88m9J23J7j55k55M20J0j10o9J60
2514H4Lp0j9K4O9k31J59K1k28J87P6j8j59J32K26l24m1K4J44k25j59L82Lp1r9
2539a10L01P9m59J8L50o3l75J71K24r9J7m4KM9k71L32O3k15m0K26k15J58k19K84
$$ plain form
2563 164 109 -97 -112 197 -31 -271 44 220 -205 4 8 22 -117 -179 118 -4 -216 -23 64 -107 -115 -23 191
2586 191 -129 -197 15 200 50 -93 73 15 -70 23 237 -89 -50 -24 4 25 -74 47 6 124 -23 -181 102
2609 102 146 -96 234 -1 -215 -89 194 -125 111 200 226 59 -59 192 135 -29 -183 -46 199 1 -191
2630 -191 156 69 13 -137 29 -12 -162 58 64 49 -208 -91 134 62 -95 25 140 -74 -194 78 193 46
2652 46 -72 129 -106 -132 -53 18 -120 -300 190 -49 10 40 101 143 -195 104 116 -142 73 -169 111 33 -163
2675 -163 35 -104 84 -206 200 -12 -143 133 -61 190 -98 -11 109 -95 -72 -183 268 51 130 36 -47 -23
2697 -23 -13 154 -70 11 -36 -27 -59 -281 -66 159 66 -147 4 228 -251 22 95 1 -9 -249 202 78 -289 -45
2721 -45 41 87 -135 -187 182 -281 32 24 112 -27 -32 84 -196 -5 44 -3 49 28 111 73 -56 -35 -29 57 -108 108
$$ packed form
2563A64n5k06j5L09k28k40L15J76m25K09MJ4j39o2K97j22k12J93Q7j71qR2K14
2586A91l20o8K12J85j50j43J66n8q5R3K14l26L9K6K8K1r9J21m1J18j47j58K83
2609A02M4k42L30k35k14J26K83l19K36Q9K6j67j18K51n7j64j54J37K45j98j92
2630a91L47q7n6j50J66m1j50K20Oj5k57J17K25p2j57J20J15k14j20K72J15j47
2652D6j18K01k35k6P9P1j38j80M90k39N9L0O1M2l38K99J2k58K15k42K80p8j96
2675a63J98j39J88k90M06k12j31K76j94K51k88Q7J20k04K3j11M51k17P9r4q3K4
2697b3J0J67k24Q1m7Rl2k22K15K25r3k13J51K24m79K73P3r4j0k40M51j24l67K44
2721d5Q6M6k22n2L69m63L13qQ8j39nJ16k80J91M9m7N2k1Q3l8j29K1OQ6j65K16
$$ plain form
2747 108 107 -35 32 97 26 -41 -50 -131 123 -82 68 193 -87 94 -171 48 82 -134 33 72 219 -219 -95 19
2771 19 -163 -12 -158 29 121 -117 126 -36 95 -162 12 174 -38 -25 1 152 7 -93 157 15 -90
2792 -90 70 121 94 -24 147 66 -61 -157 3 32 -77 69 -177 36 -113 54 123 -48 154 78 205 21 -275
2815 -275 231 -81 -62 -134 -79 92 -217 246 20 -8 -131 -151 152 -155 90 76 -35 11 41 214 -148 94 5
2838 5 -43 67 -322 234 70 -6 -68 169 152 -185 75 -28 220 -102 -2 168 -161 21 -79 175 8 -232
2860 -232 67 -21 -39 -45 64 160 55 76 -7 110 -14 -233 222 -34 40 83 -90 119 -328 106 -17 -153 -165
2883 -165 75 203 -150 238 72 20 56 -191 116 -182 -7 63 -147 -46 -136 29 -3 26 -27 146 -26 -121 193
2906 193 -15 -46 -117 -268 131 -196 164 179 -7 -23 -12 -25 34 -93 183 95 271 91 -20 104 -123 -16 -55
$$ packed form
2747A08jj42O7O5p1o7rq1K54k05J50J25k80J81k65K19L4k16J67L9J47m38J24J14
2771A9j82J51j46J87R2k38K43j62J31k57J74J62k12J3K6J51j45j00K50j42j05
2792i0J60N1k7j18J71q1j27r6J60K9j09J46k46K13j49J67O9j71K02p6J27j84k96
2815b75N06l12J9p2N5J71l09M63k26k8j23k0L03l07K45j4j11M6L0J73l62K42q9
2838Em8J10l89N56j64p6o2K37j7l37K60j03K48l22J00J70l29J82j00K54j67k40
2860b32K99q8j8oJ09R6j05K1q3J17j24k19M55k56P4M3j73K09m47M34j23j36j2
2883a65K40J28l53L88j66n2L6k47L07k98J75P0k10J01r0J65l2K9n3J73j72r5L14
2906A93k08l1p1j51L99l27L60J5j86j6J1j3N9j27K76q8J76j80j11J24k27J07l9
$$ plain form
2929 -55 151 -34 7 -68 -75 -43 -285 64 94 -16 26 -181 -30 -244 161 178 -45 97 77 227 -183 -36 41 -58
2953 -58 139 -73 49 -71 -137 145 -6 58 -210 -18 -19 28 53 4 139 8 -135 195 111 190 -145 79 62 -69
2977 -69 24 -41 59 -137 110 -200 -132 -43 -26 13 -43 -15 76 7 40 -186 90 103 -113 93 -114 108 -85 -42 97
3002 97 -71 97 -144 114 -32 -104 50 -43 47 -14 37 82 -128 -90 93 5 -40 -8 110 -56 27 71 -46 10 13
3027 13 -41 -183 -56 -20 86 -102 -107 -59 141 62 -25 24 153 -118 -25 -78 -72 -36 -81 248 -64 -28 -91 -89 106 -76
3053 -76 81 -9 -113 88 -108 115 -131 -16 185 -131 -102 36 -9 68 118 -25 42 -63 5 60 45 -148 -78 51
3077 51 -1 60 63 222 94 -121 178 81 -143 -4 -11 25 -33 -107 -1 -1 28 -41 64 2 -83 -23 175 -70 -93 -124 122
3104 122 160 -11 122 -30 -149 49 23 -34 -75 192 64 -24 36 -113 57 -207 -100 191 48 -190 -50 -43 41
$$ packed form
2929e5K06j85M1p5pL2k42L49L0j10M2k07J51k14M05J7k23J42k0J50m10J47P7r9
2953e8J97k12J22j20o6K82j51O4k68J92jM7K5m9J35j31j43L30q4P9l35K24j7j31
2977f9R3o5J00j96K47l10O8Q9J7L9n6K8R1o9L3k26K76J3k16K06k07K22j93M3J39
3002I7j68J68k41K58j46p2J54r3R0o1N1M5k10L8J83q8m5L2J18j66Q3M4j17N6L
3027A3n4j42J27L6J06j88nM8K00p9q7M9J29k71R3n3OL6m5L29l12L6o3KJ95j82
3053g6J57r0j04K01j96K23k46J15K01l16K9J38m5P7N0j43O7j05O8N5j5j93P0J29
3077E1n2O1LJ59j28k15K99r7k24J39pL6n8p4J06%K9o9J05o2q5O0J98k45k3l1K46
3104A22L8j71J33j52j19J98k6n7m1K67j28q8O0j49J70k64J07K91j43k38J40PQ4
$$ plain form
3127 41 -116 -2 -22 -141 -107 -14 7 65 22 -47 -119 160 -95 27 -31 -15 33 49 -55 40 -109 -12 45 -15 104 25
3153 25 64 -128 86 140 61 -92 167 -13 -35 -46 202 53 -58 188 104 4 -219 -37 8 -27 -29 -22 -56 -269 -14
3178 -14 -92 49 -5 41 21 -115 -24 132 6 -57 -130 177 -68 -205 37 28 60 -99 105 22 -52 15 -78 -195 -40
3203 -40 62 155 110 -14 98 -44 76 -43 -55 59 218 135 -261 174 -7 -77 -174 -69 131 93 98 48 -62 -20
3227 -20 -95 -39 -79 146 -34 298 34 -101 133 39 -4 -67 -169 -263 7 -156 -46 63 17 59 -39 15 -61 -39 30
3252 30 20 107 174 -77 65 -171 -7 -65 -23 -19 -93 -12 20 10 13 -46 131 92 -83 -39 -156 -42 -85 -4 79 29 -13
3279 -13 90 -83 -141 81 -8 108 -120 -4 3 -140 59 -90 -1 197 -23 102 46 34 35 -14 -46 -150 -169 -54
3303 -54 93 -67 -29 18 -52 53 6 111 142 -107 -48 13 73 -89 -7 122 -306 2 -15 -40 -55 126 97 -14 -162
$$ packed form
3127D1j57J14k0j19L4R3K1N8m3o9p2K79k55J22n8J6M8J6j04R5j49R7N7o0J19p9
3153B5L9j92K14N4p9j53K59j80k2j1K48j49j11K46q4j00k23J82M5l5kPl4k13K55
3178a4p8J41n4M6k0j36R1J56j26o3p3L07k45j37K42rL2j59K04q3p4O7r3j17J55
3203d0J02R3m5j24J12j42J20j19j2J14J59q3l96M35j81p0r7J05K00l8Nn0j10M2
3227b0p5N6m0K25j80L32k64j35K34r4m3o3j02r4K70j63J10J09m6M2r8N4p6K2O9
3252C0j0Q7O7k51J42k36J64n8M2Mp4Q1L2j0Ln9J77l9j75M4j17J14m3Q1Q3n0m2
3279a3J03j73n8K22q9J16k28J16Pj43J99j49Q9J98k20J25n6j2Jm9l2j04j9J15
3303e4J47j60L8M7p0J05m7J05L1k49N9O1O0j62Q2J29m28L08j7k5j5J81k9j11j48
$$ plain form
3328 -162 2 79 145 53 -15 44 -36 -151 -88 -108 -67 36 -35 -1 41 129 59 -59 33 -66 -8 128 -138 -10 -34 -21
3354 -21 50 70 138 127 -61 -214 35 -58 -110 -20 -21 -29 -6 -4 31 -117 112 -45 -105 -166 3 59 50 11 117 33 -130 -29
3382 -29 -58 15 123 -136 -46 157 -35 5 -26 48 124 15 81 -191 -83 53 -124 -55 51 73 -40 -83 -55 96
3406 96 -35 29 -30 26 97 -71 -142 15 -102 58 -42 -21 45 12 13 -199 -36 -35 57 45 -10 137 -90 71 9 185
3432 185 -4 -43 -73 55 -79 -51 -216 144 162 -100 67 -145 97 -138 -66 -85 -73 -18 -65 102 -75 37 35 -162
3456 -162 -33 53 134 61 -12 -27 -124 -5 91 -78 15 -28 88 -237 22 75 -96 7 -66 -161 31 107 -178 62
3480 62 -67 -159 -25 -112 -159 1 -146 19 -58 110 5 76 -2 -230 -10 -39 86 -66 130 -13 126 24 55
3503 55 8 111 60 117 156 -41 55 -120 41 21 -166 -30 79 -70 -140 -1 55 -38 -104 -72 -63 -86 -21 -18 7 -21 -101
$$ packed form
3328a62J64P7O6r2o8N9q0j15O3k0M1J03p1L4M2Q8p0j18R2r9N8J36k66J28k4J3
3354b1P1K0O8j1j88j53K49r3n2R0jqK3KL5j48K29j57o0o1J69N6rl9J06q4j63J01
3382b9k9P3J08k59R0K03j92M0l1P4P6j09O6k72J08J36j77O9J06K2j13m3K8J51
3406I6j31O4n9N6P1j68p1J57j17J60j00K1O6l3Jk12J63JR2j2n5J47k27J61o2J76
3432A85j89l9l0J28j34K8j65L60J8k62J67k12K42k35P2j9J2N5m7J67j77J12kj97
3456a62J29Q6Q1p3p3j5r7J19R6j69R3m3J16l25K59N3j71J03p3r5J92P6k85K40
3480F2j29r2J34q7m7J60j47J65p7J68j05P1p8k28K20k9J25j52J96j43J39j02L1
3503E5m7J03n1N7L9j97R6j75J61k0j87J36J09j49p0J39N6r3o6L2Rk3O5LK5k8q0
$$ plain form
3530 -101 49 -150 -96 -166 -33 -148 121 -47 8 135 -45 -14 111 -84 72 5 -123 -88 3 13 90 -19 -30
3553 -30 81 -5 -2 -82 97 -164 95 -3 77 -48 -32 -115 202 -2 49 73 -43 -67 54 -8 -46 81 172 -8 -150
3578 -150 -1 -7 -42 13 40 77 -18 -19 8 2 -257 -71 61 -48 17 -89 -6 3 49 38 32 69 -60 -62 -37 10 20 36 -32
3607 -32 -48 -105 -33 95 -85 100 -138 56 207 22 135 -101 34 151 -98 9 -24 18 102 32 23 29 -79 28
3631 28 -138 -123 19 -25 -196 -26 32 -65 36 72 147 73 50 -6 18 91 -11 -151 142 87 -157 -3 -80 -28 40
3656 40 -1 9 -36 -46 59 37 43 -90 -15 11 -20 37 -13 126 26 5 53 -33 225 -49 -137 -4 73 163 -20 7 107
3683 107 -48 75 -127 0 121 39 -62 111 -148 26 126 50 137 -168 -114 -88 76 17 6 51 -94 -126 -74
3706 -74 -118 85 71 -110 41 -17 141 -4 -6 -34 -108 145 -27 39 -120 125 54 -77 -137 -19 -53 25 -5 65 -92
$$ packed form
3530a01J50j99N4p0J33j15K69j68N5J27j80L1J25j95J56o7j28L5R1J0P7j09j1
3553c0J11q6Lq0J79k61K59r8Q0j25J6q3L17k04N1K4j16k4J21o2l8J27R1j80j42
3578a50J49ol5N5K7L7r5jK7ok59J86J32j09O5j06Q3RM6j1oL7j29kK5M7J0J6o8
3607c2j6n7P2J28j80J85k38J94J51j85J13k36J35J17k49J07l3M2Q4p0rOj08J07
3631B8j66J5J42m4j71J70N8r7J01L6P5p4k3n6K4P3j02j40K93n5k44J54p7N2O8
3656D0m1J0m5j0J05k2Oj33P5K6l1N7n0J39j00k1M8q6K58k74q8J33P7R0j83K7J00
3683A07j55J23k02J27J21q2j01J73k59J74J00p6Q7l05N4K6J64n9j1M5j45l2N2
3706g4m4K03j4j81J51n8J58j45kk8p4K53j72O6j59K45p1j31o0J18l4P8l0P0j57
$$ plain form
3731 -92 -104 101 -105 75 -77 85 -36 -73 106 -56 -47 -35 40 -71 111 -6 27 53 -100 -40 -161 20 75 -9
3755 -9 42 12 62 -105 -59 -158 214 -205 -159 2 -78 11 84 -2 106 -12 87 89 -35 71 87 -37 142 66 -37 -174
3781 -174 48 -21 -48 181 -81 80 -45 -71 99 -48 -64 -23 -110 -15 -125 35 46 27 48 16 42 53 -126 40
3805 40 78 -5 4 -160 -86 -48 2 16 -107 -55 -15 36 -3 33 -65 -20 -64 56 69 26 -22 -15 72 -42 50 -41 64 35 26
3834 26 -113 -34 -30 64 -119 -19 89 -14 71 106 -40 58 -72 -3 -17 20 225 -44 66 87 9 -32 16 -34 -68 -39
3860 -39 -30 150 21 111 3 27 -42 -102 98 85 -83 10 -79 -88 -54 -53 -123 -212 -18 -91 20 44 105 -37 33 36 -62 -102
3888 -102 88 -96 113 -97 -83 3 -40 -11 -113 -60 -19 -13 -42 54 -98 2 4 1 58 119 94 9 123 78 -113 -16 -104
3915 -104 26 67 7 83 -9 -25 56 -80 -63 -66 3 58 6 158 66 -32 5 -31 -50 141 110 39 1 -85 -52 115 -184
$$ packed form
3731i2j2K05k06J80j52J62j21l7J79j62RJ2P5j11J82j17L3K6j53O0j21J81N5q4
3755iN1l0N0j67M6r9L72m19M6J61q0Q9P3q6J08j18R9Kj24J06J6j24J79p6j03j37
3781a74K22o9k7K29k62J61j25k6J70j47j6M1q7R5j10J60J1j9K1l2K6J1j79J66
3805D0L8q3Rj64P4L8N0J4j23N2M0N1l9L6r8M5m4J20J3m3m8PQ7j14R2r1J05k9r
3834B6j39P9MR4j83J00J08j03Q5L5j46R8j30O9j4L7K05k69J10K1p8m1M8n0l4K9
3860c9RJ80j29R0j08K4o9o0K00j3j68R3q9rL4Jp0q9J94p3J11K4O1j42P0Lr8m0
3888a02J90j84K09k10J4Q6m3K9j02N3M1Ok9R6j52J00KlN7O1k5q5J14m5j91R7q8
3915a04J30M1o0P6r2j6Q1j36J7lO9N5n2J52r2r8L7l6j9J91l1p1l8q6L3J67k99
$$ plain form
3942 -184 -13 -106 53 -146 -36 10 -127 -145 -158 -66 -85 108 8 -162 -125 100 -78 -78 -160 48 123 -11 -6 18 -74
3967 -74 -233 93 -55 120 -4 -136 -50 -32 -46 -24 -106 16 -26 165 -35 -149 -112 25 -45 -5 142 -15 -30 71
3991 71 -154 40 99 -50 -42 -132 9 -119 70 -181 61 158 29 -167 -88 2 -24 -193 -15 -101 -37 105 21 -52
4015 -52 22 37 -93 -167 -160 94 124 -114 81 -197 148 52 22 -25 -64 -86 -121 1 -120 -13 71 -40 -80 18 40 106
4041 106 15 29 54 137 1 90 -21 95 24 -45 212 -107 14 8 153 -53 65 135 90 -5 82 26 -5 -44 2 -62
4067 -62 -18 75 28 143 133 185 -23 13 -31 51 73 13 -31 0 84 -72 149 -45 22 -53 -42 -49 -14 88 -26 113 113
4094 113 -172 -54 51 -10 11 32 2 79 -16 63 -12 -123 58 30 73 163 -94 -76 12 -60 125 -136 108 126 43
4119 43 107 -91 -182 -128 -17 -18 -73 -159 -145 60 -69 -25 32 110 56 48 -38 83 58 34 -172 131 86 56 76 -58 142
$$ packed form
3942a84J71r3J59j99J10M6j37j8j3R2j9J93j00j70L7K25j78%q2K08P5j34NK4r2
3967g4j59L26j48J75j24j32Q6J8j4K2q2J22m2J91k00j14L7J37p0M0J47j57j5J01
3991G1k25J94N9j49Qr0J41j28J89k51K42R7j29j96P9R0k6j69J78q6O4J42q4p3
4015e2P4J5j30p4PK54L0k38J95k78L45r6l0m7l9k2l5J22j21J07Q4j11m0R8K2O6
4041A06r1J4K5Q3j36Q9j11J16p1o9K57l19J21oJ45k06J18P0m5r5Q7n6l1l9M6o4
4067f2M4R3m7J15j0N2k08L6m4Q2K2o0m4L1Q4j56K21j94O7p5J1pL5J02j14J39%
4094A13k85J18J05o1K1K1l0P7r5P9p5j11J81k8M3R0k57J8Q8p2J85k61K44J8q3
4119D3O4j98r1N4J11jn5q6J4K05j29M4N7P8n4qq6J21k5k4k06L03m5l0K0j34K00
$$ plain form
4146 142 -75 74 -15 -3 142 -44 -2 -142 -37 0 -58 78 46 66 170 107 -32 -110 -94 77 -23 -38 -141 71
4170 71 29 166 3 -5 -14 -35 -17 66 -56 -87 -3 19 70 39 -151 -99 24 -32 -104 195 54 59 -31 -61 -96 46 33 55
4198 55 142 74 76 174 -21 -41 58 48 101 4 69 -19 57 -14 9 1 -29 -6 29 -141 136 48 -88 -168 43 -37 124 -14
4226 -14 110 -40 -13 86 76 100 -93 -18 -139 -39 -38 -5 2 113 108 25 -54 50 -52 -103 9 2 13 -196 -29 -141
4252 -141 -28 17 115 21 33 2 -51 24 16 -49 16 65 148 -94 82 -1 11 0 15 109 36 -99 -104 19 -57 86 163 -83
4280 -83 -1 10 -21 -59 -37 6 -141 -48 -241 10 6 63 -50 -11 -69 -83 36 60 41 166 54 89 69 -79 -266 61
4306 61 173 -50 43 -165 -71 -71 102 -18 34 -69 71 -80 -111 -34 41 -16 -57 -104 -21 13 26 120 70 -42 159 96
4332 96 124 216 -88 -63 -168 -79 35 -137 -64 -119 -47 39 84 208 -44 36 6 -48 -84 -114 41 -1 -158 161 26
$$ packed form
4146A42k17J49q9J2J45j86M2j40J05L7n8J36l2K0J04o3j39p8J6J71j00j5j03K12
4170G1m2J37j63qrk1J8Q3j22l1Q4K2N1l1j90N2J23n6p2K99j41Nr0l0l5J42j3K2
4198E5Q7o8KR8j95k0R9j0N3r7O5q8P6p1K3ql0K3L5j70K77q8j36q0K11q0J61j38
4226a4J24j50K7R9j0K4j93P5j21J00JL3PJ11nq3p9J04j02n1J12pJ1k09J67j12
4252a41J13M5R8r4J2l1n3P5qo5O5M9Q3k42J76q3J2j1J5R4p3j35nJ23p6J43P7k46
4280h3Q2J1l1l8K2M3j47R3j93K51mN7j13L9n8j4J19K4j9J25j12L5k0j48j87L27
4306F1J12k23R3k08R4%J73j20N2j03J40j51l1P7P5n7m1m7Q3L4J3R4n0j12K01o3
4332I6K8R2l04K5j05Q9J14j72P3n5P2Q6M5J24k52Q0l0n4l6l0J55m2j57L19j35
$$ plain form
4357 26 78 54 -86 -49 42 15 36 33 113 86 30 90 42 -25 -54 99 -46 -44 59 8 -175 -103 -70 100 27 -176 28
4384 28 -157 -145 20 -109 -15 -120 -9 -11 -36 56 210 42 42 91 172 -72 234 83 -13 -63 -50 348 -34 28 -70
4409 -70 10 -21 -45 69 -23 -160 -84 9 -77 38 -26 -117 54 93 44 -44 38 0 -77 86 29 -85 53 -11 -153 78
4435 78 -11 2 -53 113 -108 -132 150 82 81 7 10 -15 -123 -15 9 59 -23 -31 39 59 2 -15 -37 81 63 3 -4 163 24
4464 24 -62 -58 -98 56 4 -76 22 26 -45 -137 -81 -188 22 18 26 4 85 -1 -58 -73 -14 11 -61 -215 35 -64 59 57 2 -7
4494 -7 -69 39 64 142 -91 -22 -65 74 -65 12 -55 102 73 39 92 7 21 16 27 -136 41 -39 92 -12 -166 -318
4520 -318 -96 0 -9 -41 75 -45 34 -83 4 -47 92 -52 -38 -53 -49 -43 -66 -71 -41 -4 11 44 2 66 8 -29 8 15 -29
4549 -29 -102 67 -142 -1 60 -216 99 -96 -147 40 70 -60 71 -54 -7 1 -121 78 -23 -60 -21 -73 -91 -16
$$ packed form
4357B6N2k4j40L7R1k7K1lQ0k7n6O0m8o7k9J53j45KJ03n1j83P2L3J70p3k03K04
4384B8j85J2J65j29R4j05J11kk5R2J54j68%M9Q1k44L06j51r6n0J3L98l82O2r8
4409g0Q0l1k4J14r2j37P6R3q6J15o4r1J71L9m9q8Q2l8p7J63n7j14J38o4j42K31
4435G8q9J3n5J66k21k4K82o8jp4Lk5j08J08K4N0q2qP0K0n7j7k2J18j8o0pJ67j39
4464B4q6Mm0J54n2q0R8Mp1r2N6j07K10mQk2Q1q6n7j5N9K5p2j54K50r9J23kn5r
4494go2J08K5P8k33O9m3J39j39P7o7J57k9l4N3q5J4nJ1j63J77q0J31j04j54j52
4520c18K22R6rl2J16j20P9j17Q7n1J39j44J4j5MOk3nL0L7J5L3m2O4n8l7L7Pm4
4549b9p3J69k09J41O1k76L15j95n1J87L0j30J31j25M7Qj22J99j01l7L9n2j8P5
$$ plain form
4573 -16 -88 177 -67 117 85 -20 113 -56 19 10 15 109 -45 115 -132 122 -161 -137 117 -3 116 -33 -91 -68
4597 -68 -37 -7 -77 22 29 68 -49 2 42 -162 -3 66 88 45 -15 -117 -130 127 -8 -39 149 54 -113 -21 -29 49 -138
4624 -138 235 14 142 -204 -114 -9 67 -71 26 -101 1 168 118 -7 97 7 48 44 -53 44 -8 189 -134 95
4648 95 -57 -55 18 -113 47 126 48 -3 -63 1 -32 -28 -9 -116 -65 -14 -92 70 -168 79 147 -54 -35 -94 -89 243 145
4675 145 -172 -101 117 47 -166 -29 1 -43 -107 -32 -61 40 -135 64 3 104 -44 -12 1 -18 -143 -71 -172 -65
4699 -65 -118 15 -23 -5 -8 11 43 9 -73 -21 23 -125 17 20 -73 1 100 -182 -127 20 35 -46 -21 -96 40 185 -26
4726 -26 -108 65 99 -110 -18 -69 59 -185 -21 120 27 -19 -58 75 -150 94 35 71 -33 -102 -19 -16 -19 -54 -23 -6
4752 -6 -43 -36 11 91 62 -153 -102 23 -78 81 -24 18 18 -2 -5 -49 131 93 -143 -93 210 110 79 -170 -185 -144 -18
$$ packed form
4573a6p2K65k44J84l2j05J33j69P5rNR4j54J60k47K54k83K4K54j20J19j49n8K3
4597f8L1L0p0R9PL9j17N1M0k04J59O9K2m3o0j02j3K57j35l1J88r5j67R2qP8j87
4624a38L73k21J28l46R0J05P6j38R7j27J02J67n0j25J04r0M1mr7R7n2J97l23K29
4648I5j52KP3j31J60P9p8n1o0O4l3MJ9j07N1N1p8J62k38K47O8k01J9n9NL32r8
4675A45l17P1K18p0k13J37L0m4o4P5k9J01j75J99o1J01j48L2J3j9j25P2j01J07
4699f5n3J33l8J8lJ9L2l4q2N2M4j48J42Lr3P4R9k82N5J47J5q1K5p5J36J45k11
4726b6q2J73L4k09R2n1J28k44J64J41r3m6l9J33k25K44n9L6j04o9Q3Lll5L1J7
4752fl7PM7Q0k9k15N1J25j01J59j05M2%k0lm4J80l8k36N0L03j00l1k49j5M1J26
$$ plain form
4779 -18 -87 36 11 33 116 -121 -45 51 33 44 -52 65 41 25 223 -97 25 -127 -104 20 -142 -37 2 114 89
4804 89 -99 -107 17 56 24 -150 96 -247 -28 164 31 -17 27 113 -3 -118 -127 -23 -21 -136 -12 -98 38 -131
4828 -131 -56 144 -185 51 -133 -118 88 -52 -52 -4 88 19 -55 25 20 97 90 -11 -197 -21 -49 113 -85 -88 -156 -133
4854 -133 -121 -34 289 102 -53 -51 -20 -82 -4 -87 -26 140 -112 107 94 33 -56 29 -4 10 -9 25 175 -131 -145 -39
4880 -39 -8 9 7 125 -140 96 34 -59 121 -79 8 166 -161 44 38 -4 -54 -15 -2 -119 40 -64 27 29 -102 -28
4906 -28 45 45 10 -27 127 78 17 105 134 29 -165 111 60 -40 -66 -145 -76 -15 113 97 78 -33 -53 7 -31 -174 -14
4933 -14 -150 122 -40 -136 72 -80 -133 -52 62 -34 -130 47 48 -57 101 56 8 -36 15 -39 142 139 72 110 40 -11
4959 -11 -150 54 92 30 78 132 -65 94 -36 33 -19 -96 34 -76 78 5 -31 184 -2 -29 38 -137 -43 -17 67
$$ packed form
4779a8o9J23k5K2Q3k37P6R6j8J1r6J17k4j6J98l20J22j52K3J24j62J05L9J12k5
4804H9j88qJ24L9l2j74K46l43K19J92j33m8M4Q6j16j15rJ04Kj15J24q6J36j69
4828a31P5K00l29K36j84J5K06j40%M8R2o9p4Q0nP7pj01j86J76k8J62j98lo8K3
4854a33J2Q7L23j87j55KL1o2P8q3O1J66k52K19j3o1q9Q5l3J4j9L4J50l06j4J06
4880c9L1J7kJ18k65K36o2r3J80k00Q7J58l27K05om2n0L9J3j17J59j04R1Kj31P4
4906b8P3%l5l7J54m9o1Q8K9j05j94K76n1j00k6p9O9O1J28j6j9j11k0O0l8j43J60
4933a4j36K72j62r6K08j52n3Q1J14r6r6J77Jj05J58m5m8m4N1n4J81lo7L8p0n1
4959a1j39K04L8o2M8N4j97J59j30O9n2p7J30j10J54p3l6K15j86k7O7j75R4K6Q4
$$ plain form
4984 67 -24 154 167 -53 -111 -1 -110 -19 98 64 -111 -67 -57 40 -32 -208 56 20 -59 38 -44 -46 16 51 58 -47 78
5011 78 17 41 174 -124 127 -91 -46 0 -22 54 -69 -61 -76 159 -66 -24 -68 -50 -1 -36 -17 39 43 -129 244 -55
5037 -55 -65 16 -1 -97 160 -8 150 2 -229 65 -65 90 57 -55 -13 -32 -168 -99 55 66 1 68 31 -40 -92
5062 -92 -51 -23 75 65 21 111 -24 -45 -130 49 -76 -85 -89 -47 -140 -66 -59 31 19 -19 91 -28 7 -29 -31 49 -88 -146 86
5091 86 -13 -36 18 4 9 65 118 96 -64 46 -65 -14 -98 -11 135 -113 31 -145 31 168 -197 -49 -12 -155 -25
5116 -25 77 -62 25 39 161 -82 -33 39 -20 64 -31 29 20 -42 -83 -104 128 108 -168 48 165 -90 13 204 61
5141 61 85 -35 4 -27 135 -13 -14 160 -58 71 80 67 5 12 11 -50 -78 256 -82 4 -42 56 -45 -32 182 228 -29
5168 -29 -87 9 -73 -30 10 36 2 -197 -92 -39 -21 188 -125 -1 1 -70 107 -77 53 -103 -85 -31 -2 17 59 -81
$$ packed form
4984F7r1J78J3k20n8J10j09R1J17l4j75M4J0R7p2j76K64l6p9R7q2kO2L5Pj05J25
5011G8o1K4J33k98K51k18M5M6k2P6j23Qj5K35k25M2m4J8M9l5J9N6Mj72L73k99
5037e5j0Q1j7r6K57j68J58j48k31K94j30J55l3j12M2j9j36O9J54J1o5O7l7p1n2
5062i2M1K8R8j0m4R0j35k1q5J79j25rmM2r3P4PR0j2l8J10j19L5l6kQ0j37n8K32
5091H6r9k3N4j4NN6N3k2j60J10j11N1q4Q7J46k48J44j76J76J37l65J48L7j43J30
5116b5J02j39Q7J4J22k43M9P2n9Q4r5O0ro2m1k1K32k0k76K16J17k55J03J91j43
5141F1K4j20L9l1J62j48jJ74k18J29Rj3o2Pjo1k8L34l38Q6m6R8j01J3K14M6k57
5168b9n8R6q2M3M0K6l4j99J05N3J8K09l13J24Kp1J77j84J30j56J8N4K9J9M2j40
$$ plain form
5194 -81 35 1 32 -69 14 -9 71 60 -163 -29 -152 44 -67 49 16 -12 104 -39 8 -88 131 -53 151 -36
5218 -36 68 71 106 -3 33 -31 -92 111 -92 32 22 -69 98 151 85 -36 98 20 35 106 47 90 81 66 86 -133 94
5245 94 4 14 -58 19 132 -83 116 161 33 -70 -26 -107 68 157 112 -102 -14 -35 46 31 28 -45 21 106 -94 -9 288
5272 288 30 79 89 -2 -27 39 114 71 -91 -96 -12 15 102 -13 83 -43 -63 -75 -71 2 240 -30 -81 -81 90 -23 -29 -25
5300 -25 -17 -57 -114 -91 24 -47 -66 -4 -78 -87 41 6 109 9 -27 107 2 119 80 -31 44 -120 8 103 164 -24
5326 -24 111 -90 -150 -143 14 80 -59 -49 -243 249 4 54 46 -144 -26 5 38 -126 -9 15 5 76 -74 37 -8
5351 -8 -21 -56 -39 -82 -90 32 -91 106 143 10 92 44 48 -82 -93 -29 169 88 128 12 -18 -98 -38 -41 -11 99 -61 27
5379 27 43 38 17 -87 -142 -110 28 -11 -7 39 36 118 -19 -76 -50 60 104 -59 -121 119 32 -90 -29 -44 -124 -16 -56 -45
$$ packed form
5194h1J16l4L1j01Q3k3Q0j1k23J34j23J96j11J16l3k8J16j43M7r6K19j84K04j87
5218c6J04LL5j09L6o4o1K03k03J24j0r1J67N3o6j21J34p8J5P1n9M3rj5K0k19K27
5245I4r0J0p2P7J13k15J99M5j28j03M4q1J75Q9m5k14Q8k1Q1j5lp3O6Q5k00Q5K97
5272B88k58M9J0r1k5O6P5m3j62nQ4K7Q7j15R6j26k0j2MP3K38k70n1%J71j13oM
5300b5Qm0n7K3J15p1j9O2p4rJ28l5J03j00l6J34j05J17l9j11P5j64J28R5O1j88
5326b4J35k01o0PJ57O6j39J0j94M92k45N0qj90J18L1L3j64J17K4j0P1j50J11m5
5351hj3l5J7m3qJ22j23J97L7j33Q2m8Mj30j1O4J98q1M0j16l0q0O0lL0J10j60Q8
5379B7J6nk1j04n5L2J38l9MM6lQ2j37n7K6J10M4j63o2K40q7j22O1j5q0J08m0J1
$$ plain form
5407 -45 76 -11 -46 81 -96 89 -28 -72 -80 -24 5 -66 88 -92 -19 41 71 143 4 43 145 10 61 105 -41
5432 -41 131 -109 33 59 16 -44 -61 -21 -90 -139 -11 -123 3 171 2 -9 39 64 -27 -11 113 -23 -211 94
5456 94 29 -37 -63 72 81 -27 -77 76 -59 -16 67 101 56 48 115 72 -65 10 -120 -48 76 -35 63 -140 133 26
5482 26 150 -95 76 -25 -41 -29 -84 -42 -28 55 36 -77 50 88 112 67 -42 45 -131 36 -73 -27 -36 -44 -107 -163
5508 -163 10 48 -173 -39 -48 -9 0 148 -21 -155 -44 6 -78 -17 12 -46 25 -112 -74 64 43 -122 -56 -118 -92 5
5534 5 116 60 208 -34 -122 33 31 1 18 -22 70 -75 51 55 2 77 -107 -42 -4 128 47 -87 105 44 -12 103
5560 103 -119 -74 90 79 -110 -102 91 18 5 22 -183 -106 0 -127 -15 168 -2 -11 -83 102 -25 101 -129 -92
5584 -92 50 28 2 39 -11 71 121 105 83 -32 -68 71 -170 35 -66 83 87 -39 -37 40 143 72 154 16 -29 69
$$ packed form
5407d5J21q7l5J27j77J85j17m4qN6K9p1J54j80P3O0L0P2j39L9J02j35N1M4j46
5432d1J72k40J42K6m3o0j7M0o9m9J28j12J26J68j69j1M8K5r1J6J24j36j88L05
5456I4o5o6k6J35Rj08n0J53j35M3Q3L4m5qO7m3j37P5j30P2J24j11R8k03K73j07
5482B6J24k45J71j01j6J2n5M2J4Q3j9j13J27L8K4m5j09Q7j76J67j09M6rqo3n6
5508a63J73L8k21J34rL9RJ48j69j34J11N0q4O1K9n8P1j37L8J38k1j65O6o2K6R7
5534EJ11n6J48k42q8J55kl0J7m0R2j45J26Mn3P5j84O5L8J32q1j34J92o1n6J15
5560A03k22M5J64j1j89QJ93p3j3J7k05P7J06j27J12J83j70rp2J85j27J26k30L7
5584i2J42k2k6L7n0Q2N0j6k2j15l6J39k41K05j01J49Mj26KP7J03p1Q2j38m5R8
$$ plain form
5610 69 -128 123 11 -142 -50 -34 11 11 -78 218 59 -36 -18 -24 41 -23 -177 -72 37 -48 74 6 125 127 -16 9
5636 9 57 -44 119 -47 -164 -13 -20 -19 43 -141 -118 -40 -7 74 -15 -168 -174 65 63 37 133 -254 -24 66 -11 -14 -30 -105
5664 -105 185 -57 83 256 55 63 -107 -155 -2 -17 162 -190 71 22 35 16 -43 -235 -87 -110 -54 -113 7 -23
5688 -23 -61 69 -171 -18 -28 65 -70 97 -96 -157 8 78 81 1 21 -14 13 72 -59 55 78 19 -18 137 -147
5713 -147 -1 -40 -136 -42 115 -55 53 52 99 -93 -56 -180 71 -190 -38 -30 -83 -110 70 134 7 53 27 142 33
5738 33 -21 101 -30 -97 94 -3 108 -224 251 -14 61 65 -34 -32 114 -127 28 -9 30 60 7 -126 -21 -7 -119
5763 -119 39 38 -42 213 67 40 158 99 -54 68 119 -15 111 105 -29 0 135 180 48 98 18 -10 164 -2
5787 -2 -84 25 -132 22 2 20 -41 -91 230 -120 -25 9 -148 89 19 -2 -10 -68 49 2 -180 49 40 235 -36 -15
$$ packed form
5610F9j97K51j12j53R2J6M5%q9K96j59r5J8oO5o4j54J05J09q5J22o8J19Kj43K5
5636IM8j01J63j66j17J51pJO2j84K3P8L3Q1q9j53oK39kk6R6l87K30R0p7lj6p5
5664a05K90k42J40J73k01Qj70m8J53j5J79l52K61m9J3j9n9j92J48k3N6n9J20l0
5688b3l8J30k40J53j0R3j35J67j93o1J65P0Lq0K0l5K7N9j31J14K3n9l7J55k84
5713a47J46l9r6R4J57j70J08jM7j92L7j24K51k61J52Qn3k7J80O4j27M6k6J15j09
5738C3n4J22j31o7J91r7J11l32M75k65P5Mr9KJ46k41J55l7L9L0n3j33J05J4j12
5763a19J58jq0K55j46k7J18n9j53J22N1j34J26oj34K9J35M5j32N0q0k8J74j66
5787bq2J09j57J54k0J8o1n0L21l50R5L4j57K37p0k1qn8J17m7j82K29rJ95k71K1
$$ plain form
5813 -15 30 17 99 -121 55 -31 -176 -12 -46 -63 0 -198 27 36 -15 38 -50 14 -2 23 90 56 -204 48 20 38 6
5840 6 -18 -197 21 115 104 -28 113 92 -94 -90 -43 -80 2 -6 -122 -24 57 -26 83 50 42 85 -33 42 124 111 56 -3
5868 -3 -7 43 -68 -92 49 10 181 79 -114 106 -32 56 102 -2 -8 -255 180 111 44 72 99 -22 9 -70 -18 29
5894 29 35 89 -16 -140 -88 -19 41 75 -23 -253 4 -46 -3 11 45 16 112 -54 -55 20 -175 34 51 191 10 -14 -21
5921 -21 -14 91 -135 -33 23 -31 -70 -16 -64 -127 -4 -178 83 -158 -38 46 -203 209 -29 -94 56 -134 -67 -130
5945 -130 -8 43 25 -32 36 -36 120 -30 -152 -18 65 -142 149 84 11 109 79 -146 -74 -43 49 -48 -109 -5 69
5970 69 50 35 62 -3 58 90 68 -47 -175 65 17 30 -111 61 35 -32 -53 -25 135 -92 59 36 32 -1 -32 112
5996 112 -27 -16 26 33 59 -66 83 22 33 83 -24 -69 -48 106 36 -129 -60 -178 -26 39 -147 -64 57 26 -88
$$ packed form
5813a5M5j3Q2k20J76q6j45J64l4j7O3j98K25Rn1N3q8O4j6K5O7l4k60K52k8J8l2
5840Fk4j79K18R4j1j32J41k1j86MM7l7Q2qj16R8Q1q3J09l3qM3j18P5Q2j3n5n9
5868cmN0j11k4J41l9J71j02j93K20j38Q8M6j04ok47M35o9o7K8K7j21L1p9N2M7
5894B9ON4j05j24N2O9O0L4r8k30K57n0M3J4L4k9R6j66jP5j95K09J7J40j81k4p
5921b1PJ05k26J02N6n4l9N4m8o3J23j74K61k41J20Q4k49M12k38o5J50j90O7o3
5945a30J22N1j8n7O8p2J56j50j22J34Q3k07K91o5p3R8l0k25P2L1R2r7o1J04P4
5970F9j9j5K7o5O1L2k2j15j28K40m8J3j41J72k6o7k1K8J60k27J51k3ml3l1J44
5996A12j39J1M2PK6j25J49o1J1N0j07m5K1J54p0j65O9j18J52O5j86Q3J21l1j14
$$ plain form
6021 -88 71 -160 -73 -24 -35 96 -45 -67 -32 -115 25 -14 -38 60 34 -73 128 -42 -49 34 -8 75 -12 59 -64 90
6047 90 -48 31 60 -136 57 166 47 -129 8 -3 -171 -6 -14 -44 -23 -40 -26 29 -22 -52 15 24 -1 -66 5 -38 68
6074 68 -25 104 91 -22 -67 55 -91 132 -95 74 72 -84 28 5 70 -31 14 -77 -55 -8 -166 121 -50 -84
6098 -84 -54 -26 -69 161 44 -79 -58 -30 38 -12 122 -3 24 -18 -26 58 -7 11 -127 -7 -158 56 179 -62 24
6123 24 72 67 -17 78 37 141 8 -106 58 35 110 -82 165 -90 -54 -49 49 13 29 43 -105 -144 18 18 54 -95 -123
6150 -123 -203 -46 33 1 -3 97 -62 54 -9 -80 -82 40 103 -35 23 34 11 -13 -34 -102 55 63 -20 147 -38 48 150
6177 150 6 -22 9 138 17 -115 21 -19 60 -64 94 -43 -51 -66 -101 -49 47 -91 22 12 115 -54 -108 -40
6201 -40 -61 -140 10 -29 -81 -7 -213 -120 -103 112 38 -151 -22 54 67 -1 9 -29 -50 58 204 -30 -37 141 38 -13
$$ packed form
6021h8J59k31Q7M9j1J31j41k2L5q3J40l9k4R8k6j07K01j70pQ3m2Q3q7P1j23J54
6047I0j38P9K9j96J93J09j19j76J37j1j68J65ql0K1j7J4N5n1l0O7Rk5o5P1m3J06
6074F8r3J29j3j13m5J22j46K23k27J69kj56J12k3O5j01M5r1K2M7j58K87j71l4
6098h4L0K8m3K30j17j23K1K8O8n0J34j25K7m2qQ4o5J8j38J20j51K14J23k41Q6
6123B4M8nq4R5m1J04j33j14J64k3P5j92K47k55L6NR8l6J6J4j48l9J62%L6j49k8
6150a23q0J57P9l2mJ00j59J16o3p1kJ22O3j38N8J1k3k4k1o8J57Qq3J67j85Q6J02
6177A50j44k8L1J29j21j32J36m0P9j24J58j37qj5l5N2R6j38J13j0J03j69n4O8
6201d0k1p9J50l9n2P4k06R3J7K15p4j89J29P6J3o8J0l8k1J08J46k34pJ78j03n1
$$ plain form
6227 -13 9 -114 -61 -65 -156 -34 27 -46 -5 69 -132 108 216 52 61 62 10 13 64 -10 -90 69 -122 143 10 11 -5 -47
6255 -47 80 -41 -35 -85 -79 109 153 -44 -51 4 -75 143 -91 -10 -52 -49 126 -23 -30 -156 -37 17 51 -64 37 2 -134
6282 -134 -181 58 -10 -62 90 -164 -39 164 -70 -8 -2 -17 61 -44 85 -64 72 22 10 39 -53 148 -54 -23
6306 -23 -22 -50 13 -130 -106 -124 -44 34 29 36 -102 36 103 -47 80 -48 -136 -23 164 -134 -119 78 -140 29 -79
6331 -79 -20 -115 72 11 -52 -1 -22 20 -199 -12 221 138 99 -37 -20 -82 -26 26 -66 -99 17 -25 -8 150 -7 118
6357 118 155 29 19 -47 72 -131 40 150 59 -129 -32 19 1 -85 80 143 -96 26 -100 66 -109 83 -49
6380 -49 139 -15 -28 250 -4 28 -172 -29 141 153 51 -92 -22 -52 83 -82 -13 18 -55 -89 -30 50 -56 90
6404 90 33 93 216 82 75 -72 -10 71 -125 49 48 85 48 -11 -100 86 110 -37 94 -27 -73 25 -91 -44 -132 12
$$ packed form
6227a3K2j23N3mr1J22O1p3M1P4k01K40J08j64RJn2LN1p4q0J59j91K65j33Jj6m2
6255d7J27j21On0OJ88M4j97pN5p9K18k34Q1m2LJ75j49pj26J19N4L4j15J01l5j36
6282a34m7K39o8n2J52k54J25K03k34O2Oj5P8j05J29j49J36n0j2K9r2K01k02L1
6306b3Jk8O3j43K4j8Q0P8nPj38J38O7j50J27j28q8J13J87k98J5J97k18J69j08
6331g9N9r5J87o1o3N1k1M2k19J87K33q3l9j36J7o2N6N2r2l3J16m2J7J58j57J25
6357A18L7j26j0o6J19k03J71J10r1j88R7N1j8q6J65O3k39J22j26J66j75J92j32
6380d9J88j54j3K78k54L2k00J43J70J2j02j43P0l0J35j65O9L1p3l4N9Q0j06J46
6404I0n7O0J23j34pj47O2Q1j96J74jL7l7n9q9J86K4j47J31j21m6R8j16M7q8J44
$$ plain form
6430 12 38 -13 36 -124 126 -55 -25 -24 -135 -58 102 157 -167 -35 30 32 68 -18 67 -104 -26 8 55 -122 123 -141
6456 -141 -26 -82 40 -31 -29 57 -55 -33 -59 -38 56 -70 5 65 -103 -60 -30 -53 40 125 20 -24 -98 -29 -42 -129 22
6483 22 -15 -173 -2 71 -45 -63 -1 -117 -71 19 -37 -52 26 57 -48 -51 38 -126 68 124 -40 76 107 104 -21 28
6509 28 -8 -36 -97 87 -44 59 16 64 204 103 42 121 165 -39 8 -85 -48 68 -111 -166 -130 43 15 8 -42 66
6535 66 -55 -15 -7 67 -31 -20 -49 -88 -32 79 82 -35 104 42 58 78 -98 -35 59 35 71 -92 -33 36 74 66 189 -39
6563 -39 -7 -35 -37 -109 13 -88 -32 -88 28 104 -77 201 20 59 -85 -54 236 148 48 76 78 68 -52 -15 1 62
6589 62 54 -84 -11 58 -92 -64 -60 95 -72 -30 14 -76 62 56 -11 -12 -61 88 30 3 87 -25 -54 55 -13 -46 -131 91
6617 91 68 1 -64 6 37 -79 -41 19 -72 -74 -69 -117 23 -47 53 -65 6 26 -52 -48 -27 -45 -33 -33 -90 -157 -78 -140 -60 121
$$ packed form
6430A2K6n1M9j60K50j81L0Jj11P7J60N5l24J32O5KL6q6Q5j71P8L4M7j77K45k64
6456a41J15n6J22p1KQ6j12K2k6K1R4j26P5O0j68M3L0k3R3Q5j05m4p4O9j3q7J51
6483B2l7j58J71P3j16j8O2j16M6R0n6j5P8L1j05lQ9j64J94N6j64J16L1lj25M9
6509B8l6k8o1J84j31J03m3M8J40j01o1P9M4k04M7r3L7J16j79n5L6J73k8pn0J08
6535F6j21M0QP4r8J1k9l9N6J11Lj17J39o2J6K0j76O3R4k4L6j63N9O9L8qJ23k28
6563c9L2k8kp2J22j01N6n6J16P6j81K78j81L9j44L1K90q8j00K8Kj0j20L7J6O1
6589F2qj38P3O9j50K8MJ55j67M2M4r0J38oo7jm9J49n8k7Q4j12k9J09o8l3q5K22
6617I1k3o7o5P0L1j16L8O0r1kNm8J40p0J00j18P1K0p8MK1j8J2%n7o7P9o2Q0J81
$$ plain form
6647 121 -56 91 -190 -16 -40 -39 -89 22 117 -187 -36 -46 -37 90 -95 66 -26 -225 -44 76 66 55 -187 39
6671 39 -98 -27 -23 25 102 -102 -10 -22 20 -65 79 -102 52 -20 62 -114 -52 115 184 -5 -21 -2 45 41 26 -89 67
6698 67 135 78 94 -113 -36 8 89 70 -76 -60 79 14 78 31 -111 49 -29 -116 -121 -15 9 101 -30 -79 132 -21
6724 -21 -80 -33 35 -42 -137 124 109 -50 -35 112 81 69 16 -135 -51 21 -1 -1 32 72 -50 -125 -117 -64 -39 -90 43 -205
6752 -205 -23 -81 7 -120 -189 -69 -43 78 -145 29 -33 42 -96 22 22 -91 -59 -52 128 100 -105 -23 102 109 -29
6777 -29 -110 3 90 29 56 56 47 -8 84 117 26 -92 -31 -69 -88 -130 72 169 76 -31 -79 -36 -86 14 91 -13 -99 -22
6805 -22 -20 -58 -50 49 221 -41 -47 -167 -2 -127 -6 -1 -104 -89 -7 56 39 154 90 40 53 8 -71 129 -8 -67 -15
6832 -15 5 -88 113 -32 124 81 13 -14 -7 -69 84 117 -18 20 61 -120 -97 -68 54 -116 -47 -5 55 -64 -126 62
$$ packed form
6647A21j77J47k81J74k4Jn0J11R5l04J51j0RJ27j85J61r2j99J81J20j0j1k42K26
6671C9j37P1MM8P7k04R2j2M2q5J44j81J54p2Q2j76O2J67O9j89j6J9M7mj5j15J56
6698F7O8n7J6k07P7M4Q1j9j46J6J39o5O4m7j42J60p8q7nJ06K4R2j31m9K11j53
6724b1n9M7O8p7r5K61j5j59J5J47l1j2n3j51Q4P2k2%L3M0j22p5QN3K5n1J33k48
6752b05J82n8Q8j27o9J20K6J21k23J74o2P5j38J18%j13L2PJ80k8k05Q2J25Pj38
6777b9q1J13Q7o1K7%rn5R2L3r1j18O1l8j9m2K02R7r3j07m8M3n0J00P7j04q6P7
6805b2Kl8QR9J72k62oj20J65j25J21Nj03J5Q2O3j7J15o4n0J3m5p9K00j37n9N2
6832a5K0r3K01j45J56m3o8k7Po2J53L3j35L8M1j81K3K9J22j70O9M2O0j19o2J88
$$ plain form
6858 62 -101 -35 34 -14 -98 55 -89 38 39 57 -87 -177 108 11 68 -53 62 -108 7 59 18 -125 28 -46 -54
6883 -54 -97 -50 -9 43 -3 122 34 13 -80 32 64 197 118 -147 17 -47 -14 -58 -23 -74 -47 -86 36 51 -58 -79 24
6910 24 58 -6 -62 -94 -52 26 70 -15 4 -32 -78 -18 108 126 2 -3 31 43 84 -77 -47 -88 28 -73 143 81 -49
6937 -49 -79 -7 -17 95 -159 -115 31 -93 24 0 23 12 0 120 9 -2 21 -1 88 -37 58 71 83 -72 75
6962 75 32 -10 88 78 -17 -64 60 -17 1 -81 -36 51 -20 -1 -61 20 64 -41 -126 147 30 47 -19 102 -196 47 -7
6989 -7 51 -4 -162 -44 140 91 -4 -103 73 -159 -110 -83 63 -4 -15 129 -89 -75 -6 97 92 5 76 182 -34 -38
7015 -38 65 -58 -16 56 -50 -33 -105 -54 33 38 17 42 -20 -73 -40 -6 156 -24 44 12 4 54 163 8 -76 13 -1 41
7043 41 41 42 125 12 4 -62 66 -28 -166 -45 35 119 45 -16 88 -45 -119 -76 138 33 7 8 -55 -53 28 145 12 109
$$ packed form
6858F2j63O6O9m8q4J53j44J27JJ8j44r0K85r7N7j21J15j70J15N2m1j43J53p4q
6883e4m3M7M1N2m6J25q8k1r3J12L2J33p9k65J64o4L3m4L5n1K7l9J22J5j09k1J03
6910B4L4o4n6l2M2P8M4q5J9l6m6O0J26J8j24nL4J2M1j61L0m1J16j01K16o2j30
6937d9l0P2j0J12k54M4J46j24J17k4K3j1j2J20j11j1K3k2Q9j25R5J3J2j55J47
6962G5m3m2R8j0r5m7J24p7J8q2M5Q7p1J9o0Q1M4j05q5K73j17J7o6J21k98K43n4
6989gN8n5j58J18J84m9r5r9J76k32M9K7J46o7j1J44k18J4O9J03nq7P1J06k16m
7015c8J03j23M2P2j06J7p2N1Q7Nk1K5o2n3L3L4J62j80O8l2qN0J09j55q4Q9j4M2
7043D1%JQ3j13qo6J28r4j38J21Q0Q4p4o1J04j33p4M3K14j05k6Jo3KQ1J17j33R7
$$ plain form
7071 109 -41 -55 33 -133 -99 34 -36 70 -27 26 -28 26 45 -142 -132 64 120 13 72 -51 -155 71 46 38 8
7096 8 106 131 71 -57 124 13 -81 -7 -45 17 -62 29 85 -21 59 51 84 35 96 -32 -219 65 -92 77 41 -5 -70
7123 -70 109 -2 -91 -19 -7 12 -52 -100 57 -91 52 33 61 67 41 -79 -50 33 -175 -56 151 -87 -149 -43 106
7148 106 -76 29 -118 53 -8 -108 0 123 -2 -9 176 -42 9 46 3 6 66 132 64 -23 130 -3 -59 -146 -35
7173 -35 85 -77 44 84 105 -156 -37 -10 -117 -23 -60 -6 -31 65 -34 79 23 184 -148 23 39 173 -38 11
7197 11 3 -50 28 -65 17 -26 -153 -100 105 49 13 113 39 -14 -3 118 -38 30 39 97 -25 59 -19 -16 -21 -75 21 -115 71
7226 71 11 -31 -90 -110 -62 14 22 -31 2 -131 -34 -22 87 73 67 166 13 -44 70 -31 -47 -72 104 106 63 -98 -84 -91 -163
7255 -163 -84 19 68 -64 -26 -62 40 -14 43 -88 -40 -118 -96 137 -69 39 -105 66 -101 -80 -15 -62 43 62
$$ packed form
7071A09j50j4Q8j66L4J33p0J06r7N3n4N4J9j87J0J96N6j07N9j23j04K26k5ql0
7096HR8K5o0j28J81j11r4P4l8O2p9R1N6j06Q0qL3m9O1j28j87K84j57J69l6m6o5
7123g0J79j11q9P2J2J9o4m8J57j48J43j9K8Ok6j20K9Q3k08J19K07k38o2J06J49
7148A06j82J05j47J71o1j00J08J23j25pJ85k18N1L7m3LO0O6o8q7J53j33n6q7J11
7173c5J20j62J21M0K1k61J19K7j07R4l7N4k5R6r9J13n6J61l32J71J6J34k11M9
7197A1qn3P8r3Q2m3j27N3K05n6l6J00p4n3J1J21j56O8RN8j22Q4p8Lnn4R6j36J86
7226G1o0m2n9k0M8P6Qn3L3j33R7J2J09j4oR9j53n7J14j01j6k5J76Km3j61J4pp2
7255a63P9J03M9j32L8l6J02n4N7j31M8p8K2K33k06J08j44J71j67K1O5m7J05J9
$$ plain form
7279 62 -10 101 6 97 -27 101 98 -30 -113 -49 -142 -11 25 51 -135 113 53 29 -56 -122 68 43 19 -20 129 6
7305 6 -9 -38 -88 -51 -16 -69 -35 91 63 -56 -30 32 -91 -176 41 -123 -29 -29 -90 -71 -92 -11 -116 119 -55 -102 54
7332 54 33 104 127 1 -150 -3 43 96 -38 -12 18 -93 76 15 20 -63 110 -36 106 -16 5 -86 65 -110 41
7357 41 -105 -45 -28 -21 -94 -59 156 -116 5 12 -44 -242 -28 101 -62 110 -26 140 -38 29 106 -46 10 -10 59
7382 59 108 -207 57 112 -78 117 -33 9 -181 -46 -47 62 8 80 126 22 -129 -104 -223 -5 101 -71 -17 -50
7406 -50 -129 27 40 -79 -98 67 -25 48 97 -6 -24 -75 31 -7 21 -15 -118 -129 133 51 40 -69 5 119 69 33
7432 33 145 39 -41 82 70 -94 24 -8 78 -65 -94 48 -48 -3 23 76 11 3 -14 -11 -96 -72 -44 67 43 -17 146
7459 146 71 -54 2 74 74 84 163 34 121 -4 -47 95 62 -48 -23 -60 -114 110 152 117 -68 -147 11 -63 -142 -95
$$ packed form
7279F2p2J11r5R1j24J28lj28q3O4r3J31L6K6j86K48o0k4q5o6J90k5k4l9J49j23
7305Fj5k9n0L7L5n3L4J26k8j19K6O2j23q5K17j64R4%o1J9k1Q1j05K35j74m7J56
7332E4k1P1K3j26j51J47M6N3j34K6L0j11J69o1Nq3J73j46J42j22K1r1J51j75J51
7357D1j46O0J7Pp3L5K15k72J21Pn6j98K14J29j63J72j36J66j78O7P7j52N6k0O9
7382E9M9l15K64N5j90J95j50M2j90J35jJ09n4P2M6j04j51K5j19K18J06j72N4l3
7406e0p9J56J3j19j9J65r2P3M9j03j8n1J06l8K8l6j03j1K62q2j1j09P4J14n0l6
7432C3J12j06q0J23j2j64J18l2Q6j43k9J42r6M5K6N3o5qj7Lq5K4K8J11k4o0J63
7459A46p5j25N6P2%J0P9j29Q7j25m3J42l3j10K5l7n4K24M2l5j85p9J58p4p9M7
$$ plain form
7485 -95 8 -49 61 45 -34 -104 153 2 46 16 -101 12 113 -24 106 19 94 67 -2 -10 -8 -18 33 -71 52 -136
7511 -136 85 -36 -64 -63 -25 -70 40 6 87 -60 -81 -133 -151 89 54 -4 14 52 79 -80 -122 5 -98 62 71 29
7537 29 7 -28 143 70 -115 -32 56 83 88 19 14 146 -66 -114 61 118 -35 -36 30 -197 -60 3 23 10 17 -81 -4 10
7565 10 34 26 128 52 -34 -65 -54 3 -112 -140 41 -18 -6 -72 -74 29 8 -63 -67 146 -63 140 -71 -86 -10 -20 -44 133
7593 133 85 98 -98 -105 57 -86 -19 72 62 -67 -54 -61 -58 87 -83 -81 -40 -89 51 4 -76 -53 158 -70 -154 28 4
7620 4 -1 -106 21 -234 -159 -39 84 110 -1 -54 -77 -16 115 14 -18 27 25 -120 16 -85 -291 11 -113 -86 78
7645 78 138 151 52 -35 171 11 103 33 -43 -247 -45 65 -65 84 80 -36 2 -84 5 37 129 -233 -159 126 -57
7670 -57 40 -93 -31 14 74 -16 -4 87 96 -91 -37 143 87 -9 -15 -10 77 -34 32 -124 -62 -43 208 59 13 -69 -69 -22 -22
$$ packed form
7485i5J03n7J10j6p9p0K57j51M4l0j17J13J01j37J30q7P5k7o9qKj0N1j04J23j88
7511a36K21j21k8JL8m5J10l4Q1j47k1n2j8K40l5n8J8L8K7j59m2J27j03J60Rm2
7537B9k2l5J71p3j85Q3Q8K7No9nJ32k12m8J75N7j53jO6k27J37O3K0j3Pr8P7J4
7565A0K4qJ02p6q6l1J1N7j15k8J81n9J2o6kJ03k1p1mK13k09K03k11j5P6j0k4J77
7593A33m8J3j96pJ62j43O7R1j0j29J3pLJ45j70KM1m9J40m7q0K3K11k28q4J82k4
7620Dnj05J27k55P5J20J23K6j11n3k3O1J31j01l2M5kj45J36j01k06L02j24K7J64
7645G8O0J3r9q7K06j60R2p0p6k04K02J10j30J49mj16L8q6Q9L2R2l62P4K85j83
7670e7R7j33O2M5O0r0J2R1Rj87N4J80n6r6oNQ7j11O6j56O2J9K51j49m6q2%M7%
$$ plain form
7699 -22 29 -92 -22 20 87 -25 55 34 -2 183 -8 -139 -22 -76 -58 -72 -77 41 -162 -81 -78 84 -78 38 -34 199
7725 199 -5 41 208 -1 43 77 -24 -17 106 100 -46 -63 -49 31 175 62 135 37 -86 -101 -97 -95 -26 -69 44 -24 61
7752 61 -106 67 62 160 -82 112 -88 70 4 -152 -87 79 -16 -267 -72 -24 -60 22 15 9 -101 25 -102 73 -102
7777 -102 -143 22 16 212 -58 -65 -25 -125 -40 -136 18 -5 -26 64 0 -54 147 -131 52 112 41 102 101 37 -102 148
7803 148 8 4 51 20 108 -132 46 -14 -115 39 58 -47 85 89 22 88 55 -12 -114 14 83 85 -116 31 -151
7828 -151 -112 -41 -120 -168 6 -89 94 -16 -107 24 30 168 -9 69 -55 53 -24 63 -6 23 -122 14 -9 -36 4
7853 4 12 22 24 55 84 63 64 -41 -22 32 -9 176 -26 -43 -130 -158 -150 -57 42 -116 -34 5 -28 190 79 -24 -69 84 -66
7882 -66 30 21 -38 123 28 27 -78 10 80 142 38 63 73 2 0 -36 61 83 24 64 -91 32 -14 65 -2 -38 78 93 78
$$ packed form
7699b2N1j21P0M2O7j12Q0k1l6J85j91j31J17n4J8j4nJ18k03Q1LJ62j62J16p2K33
7725A99k04M6J67k09M4L4j01PJ23oj46j7J4Q0J44j13P3r8j23j5MKO9m3J13o8Q5
7752F1j67J73nR8k42J94k00J58o6j56O5J66r5k51J95M8l6Q2poj10J26j27J75j75
7777a02m1J65oJ96k70pM0j00Q5r6J54k3k1R0o4n4K01k78J83O0p1O1jo4j39K50
7803A48j40mM7l1Q8k40J78o0j01J54J9j05J32Mo7O6l3o7j02J28O9Kk01J47j82
7828a51L9P1p9m8J74r5J83j10r1J31OJ38j77P8j24J08p7Q7o9K9j45J36k3k7M0
7853DQJ0KL1K9k1Jj05J9N4m1J85k02j7q7k8QR3R9j58Q2L9l3K18j11j03m5J53j50
7882f6R6rn9J61r5jj05Q8P0O2j04K5J0p1kl6R7K2n9M0j55J23m6P9o7l6J16J5j5
$$ plain form
7911 78 -54 30 164 58 -137 -45 132 -27 49 -120 -85 -175 48 -34 -38 -56 -16 -10 -65 -77 -50 -116 6 103 -69 -88
7937 -88 30 -25 -31 -21 -12 12 -51 10 54 113 -26 -112 75 8 -5 -65 -43 12 99 13 109 -33 -31 -161 -80 -37 70 -6 19
7966 19 64 7 -34 89 -218 108 104 -106 -121 -125 26 -12 4 -23 6 25 35 64 -59 -90 -172 -3 -10 69 35 52 -62 -27
7994 -27 109 -128 -84 0 -147 -74 15 1 111 -108 -26 -34 161 -87 54 62 11 13 -26 -50 -92 -31 109 -97 30 151
8020 151 -91 96 -22 -16 69 123 63 -53 -135 22 -26 -56 -57 56 -89 60 -8 -102 53 -23 -8 111 -5 244 -34
8045 -34 72 -136 -189 13 -41 -6 25 1 34 -57 30 -22 7 239 70 83 90 59 10 272 -209 44 -5 85 175 26
8071 26 -38 59 101 -54 -55 41 -51 72 -11 68 88 32 -46 -76 57 -20 -143 98 -36 72 -17 -112 -114 -11 22 1 23
8098 23 -111 -40 52 167 65 -84 -110 69 38 -5 -126 -80 -10 43 123 55 138 -44 -97 -91 -8 -66 57 80 -42 -23
$$ packed form
7911G8j32Q4J34j06j95R2J77j59P6j69L5r0K23q2mj8M0On5j2K7o6J22R7j72j9
7937h8J18n5oJ0RK4o3O1M4N9j39q6J87o7j3o0K2N5Q7q6R6j42Kj30Q1M3J07p6K5
7966A9M5n7m1J23l07L26mk10j5mJ51l8J6k7K9J9J0K9j23l1q2J69pP9l4J7j14L5
7994b7J36k37M4Q4j47P3Q9j4J10k19Q2qJ95k48J41Qn1Kl9k4m2O1J40k06J27J21
8020A51k42J87j18OQ5N4o0j16q2J57m8l0jJ13j45J49o8r4J55p6J5J19j16K49k78
8045c4J06k08n3K02n4L5L1k4L3r1Q7n2K9K32j69J3Pl1m9K62m81K53m9R0R0j49
8071B6o4R7M2j55jR6r2J23q3P9K0n6p8l0J33p7j23K41j34J08q9r5kJ03L3k1K2
8098B3j34P1R2J15j02j49k6J79l1m3j21M6P0N3Q0o8Q3j82n3OQ3n8J23K3j22J9
$$ plain form
8124 -23 -69 -110 -133 55 -51 -72 124 20 -123 -79 126 77 19 81 -34 -59 -61 -17 -11 76 -94 -70 -4 -60 -14 22 57
8151 57 -73 -164 -121 108 -50 66 15 57 -163 41 180 -62 -28 0 92 15 -10 13 134 -96 -173 -84 -29 3 -28
8176 -28 84 43 -11 123 -185 -75 -23 -41 36 -180 110 -119 1 2 -180
$$ packed form
8124b3m6m1k3J88j06k1J96j04j43M4K05m9n8O2j15k5kM4OQ7j70K4O6n6M6L6L5
8151E7j30r1M3K29j58J16n1M2k20K04J39k42L4K8R2p7k5K3J21k30p7Q9N5L2l1
8176b8J12m1n4J34l08J10N2j8P7k16K90k29J20Jj82
8191a80
$$ Imaginary data points
##PAGE= N=2
##DATA TABLE= (X++(I..I)), XYDATA
$$ plain form
0 0 0 0 0 0 0 0 0 -8 8 -8 8 -16 16 -24 24 -32 40 -48 60 -72 84 -100 116 -136 156 -180 207 -236 272 -309
30 -309 352 -396 448 -503 566 -631 704 -784 870 -966 1070 -1180 1305 -1439 1586 -1745 1918
47 1918 -2112 2322 -2552 2809 -3094 3412 -3770 4177 -4642 5179 -5805 6548 -7445 8547
61 8547 -9935 11736 -14159 17574 -22693 31071 -46811 85206 -331425 -329861 568154 -451965
73 -451965 254200 -142231 -20475 301462 -413559 182669 -34753 77300 -45681 -154888
83 -154888 203730 -134889 53018 -149000 183203 17043 -247622 250454 -134999 74081
93 74081 -81056 37766 127552 -277591 205587 -102721 44998 -6687 -136680 243907 -196119
104 -196119 39183 -19821 84706 34782 -245509 273051 -119630 15192 -45991 -23034 229574
$$ packed form
0@%%%%%%%qJ6j6J6k4L2m0M8n6P2q8J08j32J56j84K16k52K92l36L87m43N08n81
30c09O61p48Q44r51J069j197J335j488J654j836K036k250K485k744L025l331L663
47A918m030M434m874N361n903O506p182P947q819R821j0984J2353j3993J5992
61H547j8482K1671k5895L1733m0267N3764p7882J32017m16631J564Q98015j020119
73d51965P06165l96431J21756L21937p15021N96228k17422J12053j22981j09207
83a54888L58618l38619J87907k02018L32203j66160k64665M98076l85453K09080
93G4081j55137J18822Q9786m05143M83178l08308J47719n1685j29993L80587m40026
104a96119K35302n9004J04527m9924k80291N18560l92681J34822o1183K2957K52608
$$ plain form
115 229574 -350636 192848 -15597 -63752 124733 -246083 294167 -147122 -56091 129396
125 129396 -114653 170633 -233152 140338 47168 -175518 134865 -92337 119538 -129563
135 -129563 7020 122711 -128916 73689 -75487 125838 -65793 -79905 137074 -91413
145 -91413 78285 -135535 86696 75596 -197323 135709 -47421 59404 -61359 -48849
155 -48849 167338 -132773 32591 -12981 51219 -5293 -111667 126554 -58732 21350 -59413
166 -59413 31706 86215 -165360 115524 -27238 19116 -9418 -75432 173332 -149451 29780
177 29780 35930 -36416 61266 -143519 138506 -28853 -66791 61945 -43318 97991 -124987
188 -124987 43228 72468 -82303 38924 -58975 103441 -63072 -57001 97757 -54119 30973
$$ packed form
115B29574n80210N43484k08445m8155J88485l70816N40250m41289R1031J85487
125A29396k44049K85286m03785L73490r3170k22686L10383k27202K11875k49101
135a29563J36583J15691k51627K02605j49176K01325j91631j4112K16979k28487
145i1413J69698k13820K22231j1100k72919L33032j83130J06825j20763J2510
155d8849K16187l00111J65364m5572O4200n6512j06374K38221j85286Q0082q0763
166e9413R1119N4509k51575K80884j42762M6354k8534o6014K48764l22783J79231
177B9780O150p2346R7682k04785K82025j67359l7938J28736j05263J41309k22978
188a24987J68215K9240j54771J21227r7899J62416j66513O071J54758j51876Q5092
$$ plain form
199 30973 -70597 62551 32858 -96398 66392 -13969 36365 -58301 -601 80713 -80288
210 -80288 19055 -15074 47464 -29244 -57560 93197 -43356 6072 -28604 39032 32967 -94615
222 -94615 69291 -8105 7602 -34002 -12969 87875 -94067 23207 8739 10647 6099 -77384
234 -77384 107440 -39921 -23095 22460 -9827 55810 -96688 49976 27496 -47434 14988
245 14988 -29778 72028 -58811 -16352 58235 -27863 13468 -46648 63321 -2380 -58708
256 -58708 46817 -10547 20846 -53305 17284 48860 -59770 11486 3197 32360 -31261 -23787
268 -23787 58942 -21004 -9730 -17085 41977 -2184 -54465 41604 -1666 3671 -37451 17004
280 17004 44327 -57980 15961 8067 20431 -22938 -27296 63816 -31937 -11336 -407 19058
$$ packed form
199C0973j01570J33148k9693j29256J62790q0361N0334r4666N7700Q1314j61001
210h0288R9343l4129O2538p6708k8316J50757j36553M9428l4676O7636o065j27582
222i4615J63906p7396J5707m1604K1033J00844j81942J17274j4468J908m548q3483
234g7384J84824j47361J6826M5555l2287O5637j52498J46664k2480p4930O2422
245A4988m4766J01806j30839M2459P4587q6098M1331o0116J09969o5701n6328
256e8708J05525n7364L1393p4151P0589L1576j08630P1256q289K9163o3621P474
268b3787Q2729p9946J1274p355N9062m4161n2281R6069m3270N337m1122N4455
280A7004K7323j02307P3941p894J2364m3369m358R1112r5753K0601J0929J9465
$$ plain form
292 19058 11016 -60774 47163 5228 -18435 -6338 499 47969 -53994 4750 32455 -10809
304 -10809 -7026 -24955 48796 -15597 -35009 25792 7107 1835 -36894 26769 25135 -35897 1404
317 1404 13523 20361 -32229 -8253 37462 -12108 -20889 -743 29724 -11270 -28585 20939 16632
330 16632 -12831 -23128 27578 14485 -28886 -1644 17341 12402 -33733 422 31647 -15832
342 -15832 -15005 523 29210 -13540 -27438 30468 6366 -12791 -15253 19798 18784 -38044 5226
355 5226 21094 -3717 -18803 -5809 34961 -15980 -22346 20006 12354 -8846 -21863 22187 16941
368 16941 -29667 -2743 20243 3638 -22305 -5177 28893 -7513 -23916 11979 19094 -10026
380 -10026 -19409 15964 18886 -21882 -10781 21310 5837 -20180 -7803 24798 -417 -25592
$$ packed form
292A9058q042p1790J07937m1935k3663J2097O837M7470j01963N8744K7705m3264
304a0809L783j7929P3751o4393j9412O0801j8685n272l8729O3663j634o1032L7301
317A404J2119O838n2590K3976M5715m9570q781K0146L0467m0994j7315M9524m307
330A6632k9463j0297N0706j3093m3371K7242J8985m939m6135L4155L1225m7479
342a5832Q27J5528K8687m2750j3898N7906k4102j9157k462L5051j014n6828M3270
355E226J5868k4811j5086J2994M0770n0941o366M2352p652k1200j3017M4050n246
368A6941m6608K6924K2986j6605k5943J7128L4070l6406j6403L5895P115k9120
380a0026r383L5373K922m0768J1101L2091j5473k6017J2377L2601k5215k5175
$$ plain form
392 -25592 8140 18755 -5963 -19995 9997 23348 -19634 -12468 18695 8171 -15489 -13805
404 -13805 24656 3973 -26426 5315 17460 -1152 -20962 5378 24982 -15315 -15387 15815 12271
417 12271 -14176 -14588 20090 7968 -22421 -2963 20120 347 -20897 3907 20947 -7499
429 -7499 -18279 11417 15983 -13113 -15024 16842 11227 -20687 -5525 17785 4075 -18838 -3669
442 -3669 25184 -6330 -19167 10413 13374 -3762 -21374 14618 17022 -21696 -4653 11274 10723
455 10723 -17967 -9455 26129 -5400 -14130 1685 16242 52 -24349 16010 11023 -12387 -8972
468 -8972 7722 16575 -22444 -4546 18924 -858 -12482 -4874 22408 -4290 -19392 10116 13189
481 13189 -6070 -18146 13286 13613 -16507 -8650 13569 10614 -19058 -3912 17887 2132 -16456
$$ packed form
392b5592L3732J0615k4718j4032K9992J3351m2982P166L1163j0524k3660J684
404a3805L8461k0683l0399L1741J2145j8612j9810K6340J9604m0297p2L1202l544
417A2271k6447m12L4678j2122l0389J9458K3083j9773k1244K4804J7040k8446
429g499j0780K9696M566k9096j911L1866n615l1914J5162K3310j3710k2913J5169
442c669K8853l1514j2837K9580K961j7136j7612L5992K404l8718J7043J5927n51
455A0723k8690Q512L5584l1529q730J5815J4557j6190k4401M0359m987k3410L415
468h972J6694Q853l9019J7898K3470j9782j1624P608K7282k6698j5102K9508L073
481A3189j9259j2076L1432L27l0120P857K2219k955k9672J5146K1799j5755j8588
$$ plain form
494 -16456 -1293 21068 -7946 -12896 5437 12011 -3946 -20334 18505 5871 -14902 -274
506 -274 5119 13256 -21319 906 20368 -11834 -5207 -1629 17701 -8159 -18705 19911 2188
519 2188 -7743 -11323 13421 12909 -25551 5136 12405 1569 -12794 -6254 25873 -10202 -15099 9799
533 9799 8463 -2944 -16803 10881 12750 -15060 -5249 12367 4717 -12151 -2713 12890 689
546 689 -14709 4199 12718 -8787 -8155 6630 10215 -11226 -8102 15757 1513 -11236 -4115 15597
560 15597 1573 -20240 8329 11402 -4875 -11941 1394 21102 -14721 -11764 15665 3243 -5069
573 -5069 -12816 13175 11110 -21202 3137 10343 -315 -7983 -5789 18482 -6834 -12055 10993
586 10993 2279 -1377 -10901 9904 8417 -17240 4838 6239 1557 -9566 -3431 19708 -11893
$$ packed form
494a6456J5163K2361k9014m950J8333O574j5957j6388L8839j2634k0773J4628
506b74N393Q137l4575K2225J9462l2202O627L578J9330k5860j0546L8616j7723
519B188r931l580K4744n12l8460L0687P269j0836j4363O540L2127l6075m897K4898
533I799j336j1407j3859K7684J869k7810R811J7616p650j6868R438J5603j2201
546F89j5398J8908Q519k1505O32J4785L585k1441L124K3859j4244j2749P121J9712
560A5597j4024k1813K8569L073j6277p066J3335J9708l5823K957K7429j2422q312
573e069p747K5991k065l2312K4339P206j0658p668K194K4271k5316n221K3048
586A0993q714l656r524K0805j487k5657K2078J401m682j1123O135K3139l1601
$$ plain form
599 -11893 -8595 8659 5485 -2323 -16441 15375 8086 -15583 -1283 8509 8244 -15813 -2884
612 -2884 16259 -2745 -11345 -121 14461 -4491 -11984 6420 9449 -5705 -10590 11205 3234
625 3234 -6909 -4774 7943 6545 -17389 8404 4770 -3011 -3309 -5106 20611 -16232 -4660 14523
639 14523 -5660 3642 -16011 17379 4421 -21764 12771 -208 7447 -15383 -477 21431
651 21431 -16813 -241 -443 11813 -4442 -17167 20258 -3354 -4017 -5395 5931 10798 -19839
664 -19839 7141 5748 -1034 -6624 -1449 14944 -11305 -2325 3377 6785 -6284 -9118 16578 -5479
678 -5479 -3421 -3368 8327 5232 -19984 13551 1905 -1851 -6192 -2139 20311 -20076 2028 6149
692 6149 888 1088 -17987 23755 -6135 -10016 7252 -2853 12680 -20728 7845 11845 -13565
$$ packed form
599a1893L298J7254l174p808j4118L1816p289k3669J4300R792k65k4057J2929
612b884J9143j9004q600J1224J4582j8952p493J8404L029j5154m885K1795p971
625C234j0143K135J2717j398k3934K5793l634p781k98j797K5717l6843J1572J9183
639A4523k0183R302j9653L3390j2958k6185L4535j2979P655k2830J4906K1908
651B1431l8244J6572k02J2256j6255j2725L7425k3612o63j378J1326M867l0637
664a9839K6980j393o782n590N175J6393k6249Q980N702L408j3069k834K5696k2057
678e479K058N3J1695l095k5216L3535j1646l756m341M053K2450m0387K2104M121
692F149n261K00j9075M1742k9890l881J7268j0105J5533l3408K8573M000k5410
$$ plain form
705 -13565 4050 -5135 14268 -10200 -7447 14853 -5699 131 -8333 12482 325 -13847 9874
718 9874 -112 3130 -11496 4783 11509 -14185 2278 1508 7833 -8574 -5994 14588 -5361 -2742
732 -2742 -4699 11533 -972 -13646 11045 -848 2289 -10418 4319 12923 -17003 5524 1070
745 1070 4480 -4255 -10230 18807 -9397 -3155 1761 2852 5381 -17250 12869 2503 -6827 517
759 517 -1565 12800 -14133 -644 10812 -5185 -732 -6606 12238 -2336 -10597 8122 1767
772 1767 230 -9618 6811 6409 -9355 -63 2902 6598 -9859 -1532 10362 -4171 -3021 -2846
786 -2846 9898 -2807 -9406 8587 929 -349 -8156 6703 6459 -11875 3534 1486 4929 -7606
800 -7606 -3677 14093 -8729 -1711 913 4577 1682 -13072 11679 1120 -5629 -452 648 9091
$$ packed form
705a3565J7615r185J9403k4468K753K2300k0552N830q464K0815j2157j4172K3721
718I874r986L242j4626J6279O726k5694J6463p70O325j6407K580K0582j9949K619
732b742j957J6232j2505j2674K4691j1893L137j2707J4737Q604k9926K2527m454
745A070L410q735n975K9037k8204O242M916J091K529k2631L0119j0366r330P344
759E17k082J4365k6933J3489J1456j5997M453n874J8844j4574q261J8719o355
772A767j537r848J6429m02j5764R292K965L696j6457Q327J1894j4533J150J75
786b846J2744j2705o599J7993p658j278p807J4859k44j8334J5409k048L443j2535
800g606L929J7770k2822P018K624L664k895j4754K4751j0559o749N177J100Q443
$$ plain form
814 9091 -12402 1467 7277 -3408 -1954 -4087 11226 -4822 -6946 7089 861 267 -8384 6882
828 6882 4598 -9303 1505 2700 4190 -8349 -349 8376 -3962 -3313 -569 8313 -4422 -6209
842 -6209 7013 860 -1577 -6408 6825 3584 -9697 3406 2195 2888 -7505 -353 9816 -6923
856 -6923 -1291 333 6008 -2822 -8177 10124 -1440 -2780 -2746 3576 5649 -11672 4541 4222 -1802
871 -1802 -2601 -2331 10140 -6492 -3922 5522 1187 -1013 -6613 7543 1631 -6860 1072 3311 2522
886 2522 -7500 1515 6402 -3616 -3317 1178 6229 -4569 -4164 5586 1832 -3650 -3633 7128 220
901 220 -5806 857 4230 988 -7395 3305 5278 -4264 -2394 1473 5663 -5306 -3684 6866 -417
916 -417 -2845 -2934 5904 1342 -7597 3456 3497 -901 -4517 1503 6431 -5486 -2845 4200 1719 -3060
$$ packed form
814I091k1493J3869N810j0685J454k133J5313j6048k124J4035o228n94q651J5266
828F882k284j3901J0808J195J490j2539Q000Q725j2338O49K744Q882j2735j787
842f209J3222o153k437m831J3233l241j3281J3103j211O93j0393P152J0169j6739
856f923N632J624N675q830n355J8301j1564j340L4O322K073j7321J6213l19o024
871a802p99K70J2471j6632K570R444m335k200n600J4156n912q491P932K239p89
886B522j0022R015M887j0018K99M495N051j0798M05R750l754n482J7J0761o908
901B20o026O663L373l242q383J0700J973r542J870L867M190j0969J622J0550p283
916d17k428q9Q838m562q939J1053M1m398l616O020M928j1917K641P045k481m779
$$ plain form
932 -3060 -3772 6178 967 -5867 1231 3897 27 -5375 1423 5665 -3694 -3666 3358 2965 -3376 -3610
948 -3610 4986 1846 -5210 -200 4342 587 -5232 1010 5118 -2126 -4077 2240 3949 -3220 -3760
963 -3760 4204 2145 -4164 -1587 4662 1125 -5066 152 4322 -305 -5116 1909 4326 -2745 -3347
978 -3347 2218 4312 -4369 -2716 4901 725 -3215 -1822 4850 885 -5849 1950 3317 -722 -4304
993 -4304 1350 4814 -4268 -1838 2558 2620 -3207 -2807 5731 -635 -3517 72 3215 708 -5823 2854
1009 2854 3300 -3036 -2095 1399 4396 -4518 -1822 4646 671 -3043 -1977 5379 -437 -4788 1541
1024 1541 3123 -344 -4869 2034 4348 -3873 -1819 2084 2951 -2927 -2607 4703 116 -3073 -565
1039 -565 3559 -84 -4123 1544 3011 -1658 -2975 2273 2921 -3706 -1213 3331 983 -3341 -1223
$$ packed form
932c060p12R950n211o834P098K666l870n402O798M242r359K8P024l93o341k34
948c610Q596l140p056N010M542l755n819O242M108p244j951O317J709p169n40
963c760P964k059o309K577O249l537o191N218M170m627m811P025K417p071o02
978c347N565K094q681J653P617m176l940J393O672l965o734P799J367m039l582
993d304N654L464r082K430M396O2n827M00Q538o366k882L589L143k507o531Q677
1009B854M46o336R41L494K997q914K696O468l975l714J066P356n816m351O329
1024A541J582l467m525O903K314q221K054L903Q67n878L20P310m587l189K508
1039e65M124l643m039N667J467m669j317N248O48o627K493M544k348m324K118
$$ plain form
1054 -1223 4575 -831 -3858 990 3628 -1488 -4349 3050 2983 -2416 -2648 2419 3835 -4712 -1168 4063
1070 4063 -2 -2138 -2480 4782 -86 -4978 2370 1422 287 -3439 1235 3951 -4078 191 1483
1085 1483 1390 -1831 -2732 5413 -2332 -1981 1095 1165 1213 -5376 3932 2115 -3717 4 1023 3860 -4584
1102 -4584 -1279 4627 -908 -2482 -1630 4828 -961 -4018 1849 2153 415 -4859 3086 2562 -3148 -732
1118 -732 381 3716 -4331 -382 3084 -1216 -377 -2323 5142 -1964 -2801 3841 -1350 1890 -4459 3256
1134 3256 2757 -6361 3798 -1084 2429 -3257 -1788 7183 -5101 18 -96 2870 256 -6111 5872
1149 5872 -498 -1140 -1939 796 4763 -6788 1958 1552 281 -1316 -2908 5895 -2957 -976 804
1164 804 1712 199 -4112 4454 -925 -695 -880 846 3187 -6233 3334 558 -496 -340 -2387 6550
$$ packed form
1054a223N798n406l027M848K638n116k861P399o7n399k32N067J416q547L544N231
1070D063m065k136l42P262m868m892P348r48j135l726M674K716q029M269J292
1085A483r3l221r01Q145p745L51L076P0M8o589R308j817n832L721J019K837q444
1102d584L305N906n535j574Q52O458n789l057N867L04j738n274P945n24n710K416
1118g32J113L335q047L949L466m300Q39j946P465p106q37O642n191L240o349P715
1134C256m99r118J0159m882L513n686J469Q971j2284N119j14K966k614o367J1983
1149E872o370o42p99K735L967j1551Q746m06j271j597j592Q803q852J981J780
1164H04R08j513m311Q566n379K30j85J726K341r420R567k776j054J56k047Q937
$$ plain form
1180 6550 -5100 -277 2257 -463 1362 -5702 6259 -635 -3425 1985 -935 4569 -6403 1691
1194 1691 4096 -3874 1261 -2704 4918 -2249 -3225 4508 -1669 581 -3283 3050 1078 -3816 1852
1209 1852 -132 1886 -3807 1169 3060 -3268 865 -1132 3370 -2423 -2308 4413 -1791 144 -2271
1224 -2271 3160 660 -4244 3066 -245 1653 -3523 909 4211 -4932 1490 -380 2133 -903 -3814
1239 -3814 5666 -2091 -739 -94 1075 1899 -4653 2774 1015 -1143 -1174 -114 3222 -3327 -172 1821
1255 1821 310 -975 -1991 3732 -801 -2037 972 1302 203 -3099 2102 1098 -1225 -1450 729
1270 729 2644 -3587 172 1866 107 -825 -1931 3716 -1086 -2267 1647 399 431 -2866 1550 1923
1286 1923 -2376 -114 670 1810 -2326 -692 2961 -1157 -917 -498 2068 -127 -3080 2172 1033 -1513
$$ packed form
1180F550j1650M823K534k720J825p064J1961o894k790N410k920N504j0972Q094
1194A691K405p970N135l965P622p167r76P733o177K250l864O333j972m894N668
1209A852j984K018n693M976J891o328M133j997M502n793J15O721o204J935k415
1224b271N431k500m904P310l311J898n176M432L302r143O422j870K513l036k911
1239c814R480p757J352O45J169Q24o552P427j759k158l1J060L336o549L155J993
1255A821j511j285j016N723m533j236L009L30j099l302N201j004k323k25K179
1270G29J915o231L759J694j759r32j106N647m802j181L914j248L2l297M416L73
1286A923m299K262P84J140m136J634L653m118K40M19K566k195k953N252j139k546
$$ plain form
1302 -1513 -908 664 1951 -2081 -888 2375 41 -1690 -76 2018 -376 -1983 502 1917 -976
1317 -976 -1996 1447 1203 -1520 -862 1597 1016 -1927 -276 1963 -46 -1809 -39 2244 -995 -1547
1333 -1547 970 1067 -621 -2105 2029 1039 -2198 225 678 978 -1767 -686 2651 -1358 -1087 435
1349 435 1271 -122 -2368 2068 834 -1219 -770 916 1543 -2528 210 1849 -519 -849 -756 2319 -795
1366 -795 -2113 1616 639 -559 -1403 1296 1279 -1816 -444 1475 598 -1970 15 1576 -362 -1327 99
1383 99 1936 -1165 -1072 1249 680 -684 -1387 1973 443 -1657 -3 929 645 -2446 571 1814 -1148
1400 -1148 -527 -227 1971 -1152 -1647 2206 -129 -663 -1008 1237 1137 -2387 618 1074 -64 -1356 151
1417 151 1992 -1325 -990 949 942 -939 -1309 1713 411 -1730 -243 1364 222 -1460 150 1443
$$ packed form
1302a513O05J572J287m032J193L263k334j731J614K094k394j607K485J415k893
1317i76j020L443k44k723O58K459n81k943J651K239k009j763J770K283l239n52
1333a547K517R7j688j484M134r90l237K423M53L00k745J081L337m009K71J522
1349D35Q36j393k246M436j234k053M49J686O27m071K738J639k368l30R3L075l114
1366g95j318L729r77j198q44K699j7l095J372J919q77k568J985J561j938r65J426
1383I9J837l101R3K321n69j364p03L360j530k100J654R32k84l091L017J243k962
1400a148O21L00K198l123m95L853k335n34l45K245j00l524L005M56j138j292J507
1417A51J841l317L35J939pj881l70L022j302k141J487J607j142j682J610J293
$$ plain form
1433 1443 -460 -1518 894 1244 -1009 -693 762 1232 -1399 -687 1763 -240 -922 -145 1243 6
1449 6 -1841 991 1118 -623 -880 687 1407 -1539 -645 1340 114 -1147 -908 1726 4 -1587 713
1466 713 1075 -241 -1454 569 1591 -1032 -745 1093 626 -840 -817 1274 394 -1401 -22 1197 -210
1483 -210 -1098 253 1348 -711 -989 826 667 -744 -639 1295 301 -1234 -213 1270 -138 -1154
1499 -1154 120 1291 -425 -1310 763 953 -997 -883 829 1015 -1340 -492 1149 -70 -844 -534 1463
1516 1463 -3 -1537 737 918 -283 -1093 461 1201 -1126 -242 733 568 -971 -414 1356 -182 -648
1533 -648 43 1116 -293 -1065 879 491 -704 -816 959 676 -1399 28 825 335 -1283 -115 1678
1550 1678 -771 -582 178 1130 -223 -1575 1272 246 -761 -524 427 1205 -1510 -85 958 144 -813
$$ packed form
1433A443j903j058K412L50k253L16J455M70k631P12K450k003o82P77J388j237
1449Fj847K832J27j741k57J567P20k946Q94J985j226j261K39K634j722j591K300
1466G13L62j316j213K023J022k623K87J838m67j466K3K091q80j795J379J219j407
1483b10q88J351J095k059k78J815j59j411J05J934r94j535J021J483j408j016
1499a154J274J171j716q85K073J90j950J14J712J86k355Q48J641j219p74L10J997
1516A463j466j534K274J81j201q10J554P40k327Q84R75j65j539N57J770j538m66
1533f48O91J073j409p72J944l88j195j12J775k83k075J427P97m90j618J168J793
1550A678k449J89P60R52j353j352K847j026j007K37R51P78k715J425J043q14r57
$$ plain form
1567 -813 -288 1414 -558 -723 388 583 -330 -1088 1057 155 -809 -333 714 556 -1297 408 764 -144
1585 -144 -810 95 1317 -1192 -295 573 485 -382 -1213 1732 -75 -906 96 351 592 -1706 336 1100
1603 1100 -677 -578 -210 1343 -833 -828 886 199 -163 -979 961 400 -1114 251 409 187 -871 231
1621 231 741 -466 -416 447 744 -989 -89 728 197 -508 -517 1670 -214 -879 557 446 301 -1493 646
1640 646 910 -1117 -194 212 955 -1040 -477 1109 -173 -309 -632 1160 32 -1281 771 311 -63
1657 -63 -705 -11 852 -742 -319 680 353 -587 -174 469 -10 -609 -96 1081 -733 -576 567 154 -183
1676 -183 -831 1197 312 -733 -32 478 549 -1294 274 874 -497 -407 -177 1345 -603 -799 783 161
1694 161 -279 -796 723 318 -892 -134 453 300 -994 203 445 -331 -472 76 1113 -778 -145 724
$$ packed form
1567h13N25J702j972j65J111J95r13p58K145r02r64M76J047j58j853J705L56r08
1585a44o66R05J222k509Q97Q68q8q67q31K945j807q31J002K55K41k298K042P64
1603A100j777R9L68J553k176NJ714o87l62q16J940n61j514J365J58k22j058J102
1621B31N10j207N0Q63K97j733R00Q17n31p05rK187j884o65J436j11j45j794K139
1640F46K64k027R23M06P43j995N63J586j282j36l23J792j128j313K052m60l74
1657f3o42O94Q63j594M23R99l27r40M13O43m79n99N13J177j814J57J143m13l37
1676a83o48K028q85j045P01N10P1j843J568O00j371R0K30J522j948j96J582o22
1694A61m40n17J519m05j210P58N87j53j294J197K42p76j41N48J037j891O33Q69
$$ plain form
1712 724 257 -223 -566 1073 -174 -835 151 450 350 -1426 752 563 -639 -50 -184 1274 -1276 -287
1730 -287 854 -105 18 -856 1022 5 -955 284 183 376 -866 548 534 -740 102 -218 1033 -1066
1748 -1066 -259 974 -338 71 -524 1032 -266 -937 752 -30 449 -1134 642 618 -1114 605 -465
1765 -465 794 -980 -519 1319 -772 129 -458 848 159 -1230 1176 82 33 -768 347 806 -1233
1782 -1233 421 -201 497 -622 -312 1413 -890 19 -221 641 183 -1013 1094 -283 131 -550 504
1799 504 689 -1287 821 -102 354 -437 -521 1607 -1176 42 256 153 241 -1346 994 -163 -396 -13
1817 -13 199 704 -1412 595 414 -148 138 -541 1242 -826 -246 477 -61 133 -918 829 56 -663
1835 -663 150 287 412 -908 609 312 -421 -63 -350 843 -952 -237 706 -273 121 -866 1090 -30
$$ packed form
1712G24m67m80l43J639j247o61R86K99j00j776K178j89j202N89j34J458k550R89
1730b87J141r59J23q74J878j017r60J239j01J93j242J414j4j274Q42l20J251k099
1748a066Q07J233j312M09n95J556j298o71J689p82M79j583J776k4j732J719j070
1765d65J259j774M61J838k091R01n87J306o89j389K406j094m9q01J115M59k039
1782a233J654o22O98j119L10J725k303R09k40Q62m58j196K107j377M14o81J054
1799E04J85j976K108r23M56p91q4K128k783J218K14j03Q8j587K340j157k33L83
1817a3K12N05k116K007j81n62K86o79J783k068N80P23n38J94j051J747p73p19
1835f63Q13J37J25j320J517k97p33L58k87J193j795P15R43r79L94r87J956j120
$$ plain form
1853 -30 -791 486 71 516 -740 426 532 -700 32 -124 636 -585 -650 897 -380 -66 -280 369
1871 369 506 -892 532 282 -180 -271 65 498 -577 -107 146 317 -512 -260 801 -162 -349 -13 388
1890 388 62 -849 466 271 -144 -250 269 554 -510 -119 175 76 -383 -293 853 -304 -246 262 147 89
1910 89 -737 430 445 -569 88 50 424 -541 -326 658 2 -420 -170 676 104 -535 352 57 -25 -423 73
1931 73 809 -680 -94 411 43 -204 -256 644 -168 -505 362 342 -122 -488 366 335 -268 -205 325 392 -599 -112
1953 -112 552 -282 -413 -240 642 -204 -441 307 276 -123 -499 393 245 -227 -160 262 243 -551 27 449 -258
1974 -258 -134 -166 520 -4 -555 428 119 -294 -248 242 251 -621 218 72 54 -462 -53 541 -399 -253 5 352
1996 352 -80 -597 558 147 -411 -154 303 367 -421 -176 394 194 -409 -108 578 -156 -255 -39 337 -76
$$ packed form
1853c0p61J277m15M45j256J166J06j232P32j56P60j221o5J547j277L14k14O49
1871C69J37j398J424k50m62r1L36M33j075M70K53J71q29K52J061r63j87L36M01
1890C88l26r11J315j95m15j06N19K85j064L91K94r9m59R0J146j157N8N08j15n8
1910H9q26J167J5j014O57l8L74r65K15R84o56m22K50Q46n72o39Q87k95q2l98M96
1931G3P36j489N86N05l68k47n2R00q12l37Q67k0m64l66Q54l1o03O3N30O7r91M87
1953a12O64q34j31J73Q82q46k37P48l1l99l76Q92j48m72O7M22j9p94N78M22p07
1974b58J24l2O86n24n51R83l09m13M6M90Rq72Q39j46j8n16M09N94r40J46K58L47
1996C52m32n17J155m11n58K57M57O4p88K45N70k00o03L01O86p34r9K16L76m13
$$ plain form
2016 -76 -445 292 94 -240 -130 123 80 -325 -58 191 -164 -257 105 251 -225 -224 298 106 -247 -187 472 124
2038 124 -563 -28 429 -11 -350 110 485 -57 -469 307 315 -264 -363 364 355 -306 -110 427 104 -241 -47 198
2060 198 33 -384 -49 116 -137 -15 206 195 -147 -246 324 53 -339 87 392 -79 -243 89 283 -350 -257
2081 -257 183 360 -125 -451 507 -15 -499 81 209 474 -547 155 461 -115 1 -37 447 -2 -189 233
2101 233 59 -73 -378 319 92 -302 96 -10 29 -118 76 221 -53 -177 110 342 -279 -30 376 -8
2121 -8 -310 -58 512 7 -373 23 199 134 -514 344 353 -411 -48 57 358 -580 -285 283 -16 -12 -247 412
2143 412 102 -271 194 -10 79 -165 195 440 -278 -152 123 56 -178 -164 256 42 -217 -7 454 -296 -192
2164 -192 185 106 28 -161 228 104 -380 67 93 286 -383 -90 235 -247 -73 -246 435 -106 -353 450 4
$$ packed form
2016g6l69P37j98l34J10K53m3m05K67K49l55r3L62J46m76JN22j92l53O0O59l48
2038A24o87N35M57m40l39M60L75n42m12P76Qn79r9P27ro61J96N37l23l45J94K45
2060A98j65m17L35J65k53J22K21j1l42r9N70k71l92M26L05m71j64L32J94o33R3
2081b57M40J77m85l26R58n22m84N80J28K65j021P02L06n76J16l8M84m49j87M22
2101B33j74j32l05O97k27l94L98j06L9j47J94J45k74j24K87K32o21K49M06l84
2121hl02K52N70n05l80L96J76o5o48Q58Rp64L63J05L01r38K95N68k99Mk35O59
2143D12l10l73M65k04Q9k44L60K45p18J26K75o7k34J4M20k14k59K10M61p50J04
2164a92L77p9p8j89L89j24m84M47K6J93o69K93L25m82J74j73O81n41k47Q03m46
$$ plain form
2185 4 134 -458 129 320 -515 189 -29 38 -335 -93 447 -115 -43 65 231 -215 -343 236 14 -171 -196 320
2207 320 31 -400 152 121 163 -335 160 297 -292 -72 -32 380 -215 -205 526 -310 114 -284 356 352 -533 340
2229 340 96 36 -329 -82 439 -346 88 72 -62 -135 -358 481 -169 58 -17 251 55 -461 356 68 -183
2250 -183 -112 34 324 -170 27 325 288 -137 -125 625 -160 -54 -137 255 83 -532 295 -105 -18 -218 -30 474
2272 474 -303 42 11 112 -135 -197 477 -162 -84 -78 -79 260 -558 221 165 -319 -8 -4 296 -421 33 192 -23
2295 -23 -32 -65 340 -215 -224 19 134 0 -375 212 139 -214 -117 46 384 -399 -176 -24 31 -109 -139 401 -438
2318 -438 -159 71 78 94 -190 271 -111 -126 -29 -132 196 -225 110 193 -121 -115 -278 422 -243 79 130 -253 -128
2341 -128 -421 278 74 -145 89 -56 19 -260 76 45 31 -135 -60 331 -311 -151 79 -13 5 -196 234 -134
$$ packed form
2185DJ30n92N87J91q35P04k18O7l73K42N40n62P2J08J66m46j28N79k22j85k5N16
2207C20k89m31N52l1M2m98M95J37n89K20M0M12n95J0P31q36M24l98O40mq85Q73
2229C40k44o0l65K47N21p85M34j6j34p3k23Q39o50K27p5K68j96n16Q17k88k51
2250a83P1J46K90m94J97K98l7m25J2P50p85J06q3L92j72o15Q27m00Q7k00J88N04
2272D74p77L45l1J01k47o2O74o39P8OjL39q18P79n6m84L11ML00p17M54J59k15
2295b3rl3M05n55rK43J15j34l75N87p3l53R7J63L38p83K23J52N5j40l0N40q39
2318d38K79K30PJ6k84M61l82j5R7j03L28m21L35Q3l14Oj63P00o65L22N1l83J25
2341a28k93O99k04k19K34j45P5k79L36l1j4j66P5L91o42J60K30r2J8k01M30l68
$$ plain form
2363 -134 -222 112 -20 20 -331 224 253 -177 3 -53 269 -375 23 172 -172 -22 -321 396 -5 -339 123
2384 123 -9 21 -346 148 55 -342 -112 -53 170 -172 1 344 -169 24 -194 385 -150 -96 91 59 -8 -338
2406 -338 138 112 -243 -38 66 74 -355 119 69 -135 25 -225 57 -63 -183 219 -130 -144 -81 163 -14 -322
2428 -322 6 23 102 -257 119 201 -169 118 75 233 -92 -161 171 -32 -85 -38 295 110 -270 23 246 137
2450 137 -120 154 249 -201 -21 2 276 -53 -152 316 -23 -30 -60 102 82 -273 7 190 -26 -110 -50 268 -84
2473 -84 -218 40 161 124 -55 174 -170 -20 19 66 -102 -99 -73 100 58 -85 68 59 -186 -109 125 155 -135 -112
2497 -112 257 -104 -84 112 304 145 58 239 -74 -15 -141 -18 197 -163 -88 153 178 -122 -173 286 76 -187
2519 -187 161 -22 87 41 -64 113 -160 131 149 62 -247 81 137 117 -56 -66 9 -86 49 -7 151 -135 -34
$$ packed form
2363a34q8L34j32M0l51N55K9m30J80n6L22o44L98J49l44J50k99P17m01l34M62
2384A23j32L0l67M94r3l97K30N9K23l42J73L43n13J93k18N79n35N4J87l2o7l30
2406c38M76k6l55K05J04Qm29M74n0k04J60k50K82j20j20M02l49j4O3K44j77l08
2428c22L28J7P9l59L76Q2l70K87m3J58l25o9L32k03n3M7L33j85l80K93K23j09
2450A37k57K74R5m50J80K3K74l29r9M68l39pl0J62k0l55K80J83k16q4O0L18l52
2473h4j34K58J21l7j79K29l44J50L9M7j68LK6J73m2j43J53rk45P7K34L0k90K3
2497a12L69l61K0J96J92j59q7J81l13N9j26J23K15l60P5K41K5l00n1M59k10k63
2519a87L48j83J09m6j05J77k73K91J8q7l09L28N6k0j73j0P5r5J35n6J58k86J01
$$ plain form
2542 -34 149 252 -30 -344 112 105 -120 -124 123 54 -95 -119 -33 115 -44 -23 -120 -57 -58 70 -20 -6 -32 -17 -134 -96
2568 -96 -23 182 -88 -24 65 -72 -10 -104 164 8 -58 42 199 110 -203 -10 226 -43 -35 11 78 154 -303 58
2592 58 63 -72 -163 113 68 -38 -57 -1 163 -101 -82 -3 43 -112 194 178 -135 56 10 4 28 -159 238 -112 15
2617 15 118 -55 8 -272 70 81 -206 -1 32 278 -298 -126 236 -96 -109 -263 -7 117 -167 -31 180 83
2639 83 -130 -67 177 -96 43 -3 190 -39 -64 123 -6 -66 100 264 -16 -51 268 27 42 -191 97 83 -74
2662 -74 283 -180 -6 -167 -217 187 -11 -72 -66 337 8 -331 181 -6 -18 -35 -130 326 -260 91 135 -106 -40
2685 -40 -52 200 -23 43 47 9 -11 -100 74 -4 -72 -35 161 -23 -79 117 92 -11 -149 103 181 -218 -36 -97 55
2710 55 -48 -264 165 -120 -64 -90 16 119 -295 143 -15 81 59 -180 177 -161 -33 -11 -47 69 -132 89
$$ packed form
2542c4J83J03k82l14M56pk25mK47o9j49k4Q6J48j59K1r7O3jJ28r0J4k6J5j17L8
2568i6P3K05k70O4Q9j37O2r4K68j56o6J00J57q9l13J93K36k69QM6O7P6m57L61
2592E8Nj35r1K76m5j06j9N6J64k64J9P9M6j55L06j6l13J91m6oK4j87L97l50J27
2617A5J03j73O3k80L42J1k87K05L3K46n76J72L62l32j3j54K56J24k84J36K11r7
2639H3k13O3K44k73J39m6J93k29k5J87j29o0J66J64k80l5L19k41J5k33K88j4j57
2662g4L57m63J74j61n0M04j98o1OM03l29l39N12j87j2j7r5M56n86L51M4k41O6
2685d0j2K52k23O6Ml8k0q9J74p8o8L7J96j84n6J96k5j03j38K52P8l99J82o1J52
2710E5j03k16M29k85N6k6J06J03m14M38j58R6k2k39L57l38J28K2l6J16k01K21
$$ plain form
2732 89 23 36 -30 -95 -44 -102 18 -52 -78 -15 -98 -11 -133 -115 37 79 -137 -37 236 -106 -113 -61 3 69 -153 126
2758 126 -103 23 -9 66 98 -178 70 -24 5 0 -295 145 -48 -12 57 24 282 -216 161 -72 77 11 26 -26
2782 -26 -126 20 31 -11 82 43 41 -45 -32 -90 170 65 -177 216 12 -45 131 59 -46 -120 -126 145 50 -41 -97 163
2808 163 -229 -39 24 -108 125 -281 -22 -166 -124 27 -60 -11 -308 49 81 38 10 -43 207 -89 -146 -87 216
2831 216 21 -139 37 -64 99 -42 56 -58 -108 47 -17 -107 113 23 -17 -287 125 -21 60 113 -203 129 65
2854 65 -85 -50 -43 161 -152 63 188 -209 79 -152 55 -57 -208 -23 -118 -31 45 162 -24 -196 -3 -80 47
2877 47 -25 -17 29 -104 26 37 93 -36 -54 8 71 -147 -91 150 -92 -2 176 156 12 -49 -2 -42 -82 206 -120 -21
2903 -21 -119 -144 106 -135 107 -35 215 136 -215 23 -91 80 -115 -4 133 -23 96 -82 -29 20 -145 136
$$ packed form
2732H9o6J3o6o5N1n8J20p0k6O3q3Q7j22J8J52M2k16J00K73l42pN2O4O6k22K79
2758A26k29J26l2P5L2k76K48r4K9nk95M40j93L6O9l3K58m98L77k33J49o6J5n2
2782b6j00J46J1m2R3l9kq6J3n8K60j05k42L93k04n7J76p2j05p4oK71r5r1n6K60
2808A63l92J90O3j32K33m06K59j44M2J51q7M9k97L57L2m3k8n3K50k96n7N9L03
2831B16j95j60J76j01J63j41R8j14n0J55o4r0K20r0m0k70M12j46Q1N3l16L32o4
2854F5j50L5PK04l13K15J25l97K88k31K07j12j51J85r5Q7P6J17j86j72J93p7J27
2877D7p2QM6j33J30J1N6j29j8O2O3k18N6K41k42R0J78k0j44o1M7m0m0K88l26R9
2903b1r8k5K50k41K42j42K50p9l51K38j14J71j95J11J37j56J19j78N3M9j65K81
$$ plain form
2925 136 -206 -167 129 12 235 -268 165 -170 -3 -166 64 19 -54 229 35 84 -194 -16 194 -173 -197 125
2947 125 178 3 -225 123 27 176 -38 36 -33 -164 77 -57 -122 29 13 139 -27 10 67 -27 -104 -101 26 29 -20
2972 -20 59 293 173 89 79 73 -61 -74 -6 231 -190 110 55 -24 -38 19 67 -63 -48 -53 -72 -55 -55 -24 61 -97 39
2999 39 -202 40 3 -11 160 61 164 -107 94 24 -117 118 2 -84 35 -21 281 -6 69 76 132 14 -45 120
3023 120 39 -241 84 177 12 88 148 241 -90 -156 85 36 -235 -80 -70 75 -171 -60 132 65 60 -67 140 -103
3047 -103 13 -12 -11 20 -147 -8 209 -179 -128 -8 -60 179 -76 -33 -83 -143 202 -28 -33 68 -56 247 -116 81
3071 81 179 -107 -118 80 -40 115 -13 178 32 -57 -142 -27 107 -31 -199 64 10 -11 -13 81 40 68 105 -81
3095 -81 67 -58 32 22 62 66 8 -103 53 -58 11 -91 117 -15 44 -68 -72 48 98 -68 -68 53 -100 75 -131
$$ packed form
2925A36l42L9K96j17K23n03M33l35J67j63K30m5p3K83j94M9k78J78K10l67k4L22
2947A25N3j75k28L48r6J49k14P4o9j31K41j34o5J51j6J26j66L7N7r4p7LJ27Lm9
2972b0P9K34j20q4j0oj34j3O8K37m21L00n5p9j4N7M8j30J5nj9J7%L1Q5j58J36
2999C9k41K42l7j4J71r9J03k71K01p0j41K35j16q6J19n6L02k87P5PN6j18n9J65
3023A20q1k80L25R3j65P6O0R3l31o6K41m9k71J55J0J45k46J11J92o7nj27K07k43
3047a03J16k5JL1j67J39K17l88N1J20n2K39k55M3n0o0L45k30nJ01j24L03l63J97
3071H1R8k86j1J98j20J55j28J91j46q9q5J15J34j38j68K63n4k1kR4m1K8L7j86
3095h1J48j25R0j0M0Mn8j11J56j11O9j02K08j32N9j12mJ20N0j66%J21j53J75k06
$$ plain form
3120 -131 8 32 -103 -2 107 -17 35 -81 127 77 -141 -58 -125 56 -141 48 -30 -106 159 -62 119 -41
3142 -41 -6 -56 -36 15 38 -60 23 -115 -73 88 -51 136 47 -56 -42 117 150 56 85 -102 -87 20 -173 32 37 -125
3168 -125 0 36 34 -152 128 3 51 107 -97 210 -34 -2 -77 144 6 48 72 -168 -27 -40 73 -46 -97 -58
3192 -58 -136 -52 9 -64 173 -183 206 2 -54 8 69 141 57 38 -61 140 201 -50 141 -134 -20 15 19 -58 22 -55
3218 -55 -120 106 -4 -151 -61 -75 -122 3 -169 -34 43 71 62 -92 -19 -74 46 -89 44 -60 36 56 -33 -118 68
3243 68 1 -37 -98 -5 48 176 58 -232 40 -5 41 -137 8 61 1 -62 -33 33 140 -62 19 -107 30 -136 -51
3268 -51 97 156 30 20 -48 -90 -44 -38 140 101 -73 38 74 -153 73 130 27 -42 -24 56 7 -142 4 -27 -146
3293 -146 -37 95 -81 -8 5 -63 176 -4 -103 48 176 43 177 31 46 -42 82 -20 -56 27 34 -85 34
$$ packed form
3120a31J39K4j35J01J09j24N2j16K08n0k18Q3o7J81j97J89p8p6K65k21J81j60
3142d1L5n0K0N1K3r8Q3j38M2J61j39J87q9j03J4J59L3r4K9j87J5J07j93K05Nj62
3168a25J25L6kj86K80j25M8N6k04L07k44L2p5K21j38M2K4k40J41j3J13j19n1L9
3192e8p8Q4O1p3K37l56L89k04n6O2O1P2q4j9r9K01O1k51J91k75J14L5Mp7Q0p7
3218e5o5K26j10j47R0j4m7J25j72J35P7K8rj54P3n5J20j35J33j04R6K0q9q5J86
3243F8o7l8o1R3N3J28j18k90K72m5M6j78J45N3o0o3K9O6J07k02Q1j26J37j66Q5
3268e1J48N9j26j0o8m2M6OJ78l9j74J11L6k27K26N7j03o9J8Q0m9j49J46l1j19
3293a46J09J32j76P3J3o8K39j80r9J51J28j33J34j46J5q8J24j02l6Q3Pj19J19
$$ plain form
3316 34 -36 172 -39 -22 -116 -53 79 -31 11 145 -141 -104 -2 4 -168 151 63 13 -12 91 76 -1 -105 -135 142
3341 142 192 -83 139 -16 118 172 -79 132 -14 -79 -47 -76 131 -99 17 12 -159 -53 -66 57 -108 -144 -27
3364 -27 -123 -23 181 -38 19 17 29 -51 -20 18 141 26 -253 -37 46 12 -132 44 133 -48 89 54 34 -74 3
3389 3 77 -21 -16 -96 195 -45 -27 4 -84 -27 -54 76 -27 -147 11 55 -118 -138 -137 79 -123 -40 68 9 66 -44
3415 -44 -13 -8 -11 -35 -21 74 -165 48 14 50 -57 -56 -97 -23 60 37 67 -8 -30 70 -85 -65 22 142 -65 -231 87
3442 87 -182 -80 91 92 25 -114 80 16 -107 -6 -27 -168 -12 72 27 73 211 -118 -98 -82 154 24 -24 -11
3466 -11 6 67 -6 -56 99 -50 -38 -137 -49 -32 79 -134 51 -28 -85 76 153 2 57 59 -27 -149 -195 -23 118 74
3492 74 -140 -120 -113 -49 -22 32 -51 -156 -110 84 1 -119 -74 -70 23 -140 -21 18 -149 198 73 46 190 -77 218
$$ packed form
3316C4p0K08k11J7r4O3J32j10M2J34k86L7J02Oj72L19q8n0k5J03j5p7j04l0K77
3341A42N0k75K22j55J34N4k51K11j46o5L2k9K07k30J16nj71J06j3J23j65l6J17
3364b7r6J00K04k19N7kJ2q0L1L8J23j15k79K16Q3l4j44J76Q9j81J37l5k0j08P7
3389CP4r8Nq0K91k40J8L1q8N7k7J30j03j20J58M4j73k0JK16k02Q3J08n9N7j10
3415d4L1Nlk4J4R5k39K13l4L6j07Jm1P4Q3k3L0p5k2J00j55K0Q7J20k07j66L18
3442H7k69J02J71Jo7j39J94o4j23J01k1j41J56Q4m5M6J38l29K0J6K36j30m8J3
3466a1J7O1p3n0J55j49J2r9Q8J7J11k13J85p9n7J61P7j51N5Kq6j22m6J72J41m4
3492G4k14K0PO4K7N4q3j05M6J94q3j20M5MR3j63J19L9j67L47j25k7J44k67K95
$$ plain form
3517 218 131 -238 139 -24 154 -120 -172 -63 53 38 -2 32 177 -200 -37 -19 -68 65 -67 148 28 -40 -8
3540 -8 -47 -13 178 45 -17 -92 -22 -126 -17 -81 -43 -33 6 12 -97 -13 -182 123 10 -131 26 35 164 118 -134 -202
3566 -202 -48 191 7 16 -94 61 96 -6 185 -109 -38 144 81 -12 133 84 20 39 69 -47 -4 -69 48 103
3590 103 -1 48 -48 -234 137 -33 25 99 -53 -40 -130 189 189 -38 142 95 -17 26 -30 106 -80 111 -61 56
3614 56 -55 -117 -73 119 -273 19 -70 -177 -49 -13 75 -72 119 -54 -135 149 15 -16 115 32 7 68 22 -59
3638 -59 -196 -87 -20 46 -35 55 -7 87 172 -16 113 24 -197 95 -103 -52 168 -71 -94 -20 35 221 134 102 -7
3663 -7 -107 42 58 50 -53 -9 151 -2 -27 66 161 93 40 54 21 80 -146 10 68 74 -95 21 6 -45 203 -1
3689 -1 -5 0 104 -14 -145 112 132 -168 -28 -156 178 -64 116 209 119 -62 -36 -61 4 92 -64 135 -64 -172
$$ packed form
3517B18q7l69L77j63J78k74n2J09J16j5m0L4J45l77J63J8m9J33j32K15j20o8L2
3540hl9L4J91j33o2p5P0j04J09o4L8J0L9Oj09Q4j69L05j13j41J57RJ29m6k52o8
3566b02J54K39j84Rj10J55L5j02J91k94P1J82o3r3J45m9o4J9L0j16M3o5J17N5
3590A03j04M9r6j86L71j70N8P4j52J3r0L19%k27J80m7j12M3n6J36j86J91j72J17
3614E6j11o2M4J92l92K92q9j07J28L6Q8j47J91j73q1K84j34l1J31q3k5O1m6q1
3638e9j37J09O7O6q1R0o2R4Q5j88J29q9k21K92j98N1K20k39k3P4N5J86q7l2j09
3663gj00J49J6qj03M4J60j53k5R3R5o8n3J4l3N9k26J56N8Oj69J16j5n1K48k04
3689amNJ04j18j31K57K0l00J40j28L34k42J80R3r0j81K6k5O5Q8j56J99j99j08
$$ plain form
3713 -172 -58 106 -55 64 -64 120 16 53 18 95 33 4 23 -225 -108 35 -151 78 20 36 -10 1 -5 89
3737 89 -137 -43 154 122 -3 6 69 -74 -90 166 -94 -59 -3 97 -11 -137 -141 64 75 17 -117 -49 -41 19 82 -260
3763 -260 -135 13 11 77 58 191 -49 152 111 -42 126 -211 9 22 71 100 -93 104 97 91 30 -16 36 -55 -22 -173
3789 -173 68 -79 183 146 -35 -60 -145 -83 -35 -29 -100 1 53 -3 -2 -35 6 62 94 146 -63 -42 12 -31 48 -52 -43 -16
3817 -16 -48 98 -116 39 14 101 -114 -30 223 16 77 -140 -83 -106 124 -26 -3 90 100 41 69 137 -10 -27 147
3842 147 18 -6 -89 -9 93 163 -89 -45 -91 -69 -13 147 -22 26 -191 -63 7 27 -22 -32 -66 123 22 -88 -145
3867 -145 -143 92 6 -18 61 20 68 115 61 43 100 10 -36 -17 -142 48 -170 -38 -35 -92 111 -103 -65 -26 -3 87 10
3894 10 -126 -28 -56 -49 -31 -108 -38 18 47 54 8 14 126 -59 36 -112 26 55 -43 74 125 179 14 27 -4 97 174 -24
$$ packed form
3713a72J14J64j61J19j28J84j04L7l5P7o2k9J9k48J17J43j86K29n8J6m6J1oR4
3737H9k26R4J97l2j25RO3j43j6K56k60L5N6J00j08j26mK05J1n8j34O8QO0O3l42
3763b60J25J48kO6j9J33k40K01m1j53J68l37K20J3M9K9j93J97poo1m6N2r1L3j51
3789a73K41j47K62l7j81k5q5O2M8Op1J01N2n6Jl3M1N6L2N2k09K1N4m3P9j00RK7
3817a6l2J46k14J55k5Q7k15Q4K53k07O1k17N7k3K30j50K3R3J0n9K8O8j47j7J74
3842A47j29k4q3Q0J02P0k52M4m6K2N6J60j69M8k17J28P0K0m9j0l4J89j01j10n7
3867a45KK35q6k4P9m1M8M7n4j8N7r0m6J9j25J90k18J32Ln7K03k14L8L9K3R0p7
3894A0j36R8k8PJ8p7P0N6K9Pm6OJ12j85R5j48J38K9r8J17N1N4j65J3l1J01P7j98
$$ plain form
3922 -24 -7 119 74 5 68 130 13 -23 -119 -4 157 34 -4 -58 65 -10 -151 81 -42 -30 129 -126 33 61
3946 61 -163 -13 -40 -64 -145 -92 42 50 -33 -27 72 84 -82 22 -13 55 9 127 -74 124 62 -78 22 78 21 -82
3972 -82 87 4 27 -41 31 -58 -176 -9 -191 30 18 -176 34 29 133 63 49 97 28 24 -6 143 16 -46 -21 -71
3998 -71 98 16 -108 211 30 -25 247 -42 -50 -73 56 -109 60 22 -33 -130 -14 139 51 -68 149 -178 7
4021 7 -88 -1 44 -27 110 -30 -16 -10 -106 -33 115 100 -66 81 34 14 -114 -72 74 -53 1 -57 -12 62 2 34 39 -83
4049 -83 -3 43 35 2 96 -51 -87 -49 32 -45 -29 79 -73 129 9 23 48 80 -3 57 158 85 52 -32 149 99 65
4076 65 -142 -3 -54 -92 151 -99 7 101 72 -49 66 -16 42 99 0 -87 61 65 42 -46 -146 8 37 -13 163
4101 163 -80 18 55 -108 14 119 -135 -2 -10 85 -154 -52 -7 101 122 -41 -30 69 -55 -98 12 -63 -16 -150
$$ packed form
3922b4J7J26m5o9O3O2j17l6r6J15J61j23l8n4J23p5j41K32j23J2J59k55J59K8
3946F1k24J50k7k4q1N3J34Qq3OR9J2j66J04l5O8m6J18k01J98o2j40J00N6n7j03
3972h2J69q3K3o8P2q9j18J67j82K21j2j94K10nJ04p0j4M8o9ml0J49j27o2K5n0
3998g1J69q2j24L19j81n5K72k89qk3J29j65J69l8n5r7J16J53q8j19K17l27J85
4021Gr5Q7M5p1J37j40J4Or6P3J48j5j66J47m7k0j28M2J46j27N4n8M5P4o0L2Nj22
4049h3Q0M6ql3R4j47l6L8Q1p7J6J08j52K02j20J4K5L2q3O0J01p3l3q4J81n0l4
4076F5k07J39n1l8K43k50J06R4k9j21J15q2N8N7r9q7J48Mk3q8j00J54K9n0J76
4101A63k43R8L7j63J22J05k54J33qR5k39J02M5J08K1j63J1R9j24m3J10p5M7j34
$$ plain form
4125 -150 -202 50 76 -14 -92 -34 89 -119 -80 -102 53 -29 77 29 -176 -234 51 -122 41 38 174 -38 122 -20
4149 -20 35 87 192 -112 -141 71 97 -94 -56 -48 9 191 74 -57 22 67 -40 5 -18 3 -11 -21 -112 -11 -8 84 124
4176 124 -59 -98 -58 -33 39 -10 20 17 9 -132 -10 -32 -175 5 -107 -109 113 71 -94 -27 -30 107 -82 40 74 -171
4202 -171 40 -17 264 20 -38 -30 47 -65 156 -6 25 3 52 102 -117 -45 -107 -63 -31 -76 25 -88 52 9 -136
4227 -136 -24 -25 75 24 85 -16 230 117 -11 -158 -45 10 27 10 -33 38 44 112 -99 89 169 9 -138 57
4251 57 -46 87 -54 142 -122 -26 148 -17 -9 45 30 133 -111 31 111 99 -78 -28 -18 69 29 43 18 -52 84
4276 84 -19 92 113 -114 95 -18 30 -48 -55 123 2 82 109 -145 -63 113 117 -47 95 -38 -57 28 -43 -146 3
4301 3 -43 253 45 -71 151 -150 -31 -11 -71 -23 138 -65 77 61 117 -25 -42 -93 214 32 -57 -121 41 -60
$$ packed form
4125a50n2K52K6r0p8N8J23k08L9k2J55q2J06m8k05n8K85j73J63lJ36k12J60j42
4149b0N5N2J05l04k9K12K6j91L8QN7J82j17j31P9M5j07M5k3K1j4j0r1J01LR2M0
4176A24j83l9M0K5P2m9L0lqj41J22k2j43J80j12kK22m2j65O7lJ37j89J22L4k45
4202a71K11n7K81k44n8QP7j12K21j62L1k2M9N0k19P2o2M4L2m5J01j13J40m3j45
4227a36J12jJ00n1O1j01K46j13j28j47J13N5J7j7m3P1OO8k11J88Q0j60j47J95
4251E7j03J33j41J96k64R6J74j65QN4j5J03k44J42Q0j2j77N0J0Q7m0J4k5p0J36
4276H4j03J11K1k27K09j13M8p8pJ78j21Q0K7k54Q2J76Mj64J42j33j9Q5p1j03J49
4301Cm6K96k08j16K22l01J19K0o0M8J61k03J42j6N6j42j7n1L07j82q9o4J62j01
$$ plain form
4325 -60 79 -25 -27 98 -136 -97 -46 250 224 -146 -20 -25 -111 -70 39 117 9 82 56 50 115 -88 10 47 -31 -99 8
4352 8 -13 -51 108 32 146 90 -56 -65 -45 -9 20 32 -13 -75 -148 30 70 140 -127 88 22 34 60 46 59 14 107 34
4380 34 75 17 84 84 59 -46 -56 33 165 -118 105 -44 -117 74 48 71 -118 105 -6 61 123 -26 -144 158 -138
4405 -138 -21 -12 106 48 -32 -35 41 -40 67 15 -72 40 72 179 -32 83 81 111 77 75 -42 -13 -32 -12 72 19 94 -67
4433 -67 -11 -125 -9 -23 106 -41 45 49 96 -80 64 -138 1 5 -62 -109 111 39 -68 -77 -1 155 63 37 55 -15
4459 -15 8 -8 86 126 -63 -82 -93 -67 -93 -41 58 -35 31 -90 148 -33 18 12 -81 102 -23 -85 -5 -9 -29 8 91 85 -56
4488 -56 97 33 11 91 7 -72 -85 -100 63 78 -10 13 -22 40 -50 95 -121 107 44 -50 66 -59 40 -13 128 -121
4514 -121 39 -27 -17 -250 -33 95 -33 59 -76 85 -3 -138 -37 9 12 -228 1 -6 -63 60 -42 -17 -33 -77
$$ packed form
4325f0J39j04kJ25k34L9N1K96k6l70J26nq6M1J09P8j08P3k6oO5k03R8L7p8o8J07
4352Hk1l8J59p6J14n6j46rK0L6K9J2m5o2p3J78M0P0k67K15o6J2K6j4J3m5R3p3
4380C4M1n8O7%k5j05j0Q9J32k83K23j49p3J91k6K3j89K23j11O7O2j49j18L02k96
4405a38J17RJ18n8q0lP6q1J07n2q7J12L2J07k11J15kL0l4kj17K9j9K0Q4n3P5j61
4433f7N6j14J16j4J29j47Q6MM7j76J44k02J39Mo7m7K20p2j07rP6J56r2k6J8p0
4459a5K3j6R4M0j89j9j1K6k6N2R9r3O6j21K38j81N1or3J83j25o2Q0mk0L7Q3oj41
4488e6J53o4k2Q0q4p9j3j5J63J5q8K3l5O2r0J45k16K28o3r4J16j25R9n3J41k49
4514a21J60o6J0k33K17J28j28R2j35J61q8j35J01M6Lk40K29pn7J23j02K5j6m4
$$ plain form
4538 -77 22 9 -41 6 59 77 12 209 -100 28 41 5 -155 -9 106 -63 -88 72 -100 -58 20 -10 99 -34 134
4563 134 25 -83 -46 132 65 41 -47 -95 5 17 -25 -45 12 47 -79 -124 -121 27 4 41 87 -35 -17 -27 44 153
4589 153 56 29 10 -132 -56 44 -151 191 45 -31 129 -50 -33 -28 -202 173 -26 -22 64 -44 -46 -27 -44 -150 55
4614 55 80 -130 -77 -3 54 16 -84 -95 -49 -77 7 -38 79 158 9 150 -102 -120 41 -14 -9 -26 -28 67 -129 170 32
4641 32 27 43 91 -13 51 -93 -38 66 -47 12 26 85 -93 68 22 13 135 43 177 -54 -56 -34 -36 74 -44 188
4667 188 61 53 -1 98 114 91 -7 -61 -48 -19 37 -20 60 -187 -42 -53 -60 11 -66 -61 -49 77 146 86 -150 78 -27 -46
4695 -46 -46 -64 -60 -8 -39 -26 -17 83 -78 -37 -69 31 -89 82 -21 -19 12 -67 -71 -127 -85 -15 129 -36 -19 -21 184 -64
4723 -64 81 81 -6 109 -8 32 119 -116 -64 -4 62 206 -114 7 18 47 -56 3 42 34 120 164 -142 -117 -32 -129 42
$$ packed form
4538g7R9j3n0M7N3J8o5J97l09J28J3l6j60J46J15j69k5J60j72M2P8l0J09j33J68
4563A34j09j08L7J78o7k4q8m8J00J2m2k0N7L5j26m5LJ48k3L7M6j22J8j0P1J09
4589A53r7k7j9j42P6J00j95L42j46p6J60j79J7Nj74L75j99MQ6j08kJ9j7j06K05
4614E5K5k10N3P4N7l8j00j1M6k8Q4m5J17P9j49J41k52j8J61n5Nj7kR5j96K99j38
4641C2nJ6M8j04O4j44N5J04j13N9J4N9j78J61m6rJ22r2J34k31kK2kJ10j18K32
4667A88j27qn4R9J6k3r8n4J3K9N6n7Q0k47J45j1pP1p7NJ2J26O9o0k36K28j05j9
4695d6%j8MN2l1J3RJ00j61M1l2J00j20J71j03KL1p9mn6M2P0J44j65J7kK05k48
4723f4J45%q7J15j17M0Q7k35N2O0O6J44l20J21J1K9j03N9L9qQ6M4l06K5Q5r7J71
$$ plain form
4750 42 19 126 75 13 52 -57 155 55 38 -30 -33 -95 89 25 -35 65 55 112 125 125 -21 74 -77 27 40 83 43
4777 43 59 3 -134 27 133 13 89 101 -154 -24 26 26 109 49 -74 -59 -175 -25 -102 79 -6 -26 87 -118 112
4802 112 48 81 -70 22 -81 -97 114 90 -104 91 -1 110 127 -39 56 12 -15 -100 -121 52 -40 -16 61 57 -70 -66
4828 -66 78 52 82 6 44 104 -60 -19 69 -84 92 51 -30 90 23 121 -96 -32 15 51 64 65 -14 -155 -4 -52 52
4855 52 68 -231 203 -39 -72 60 -19 131 -18 100 258 -172 -128 -106 3 32 -189 -161 79 66 -172 -38 -67
4878 -67 -189 -32 71 114 20 11 213 -55 -23 -55 -20 18 111 -90 -82 110 -40 -121 -45 77 -24 -126 104 84 62
4903 62 -70 135 -41 44 -93 80 101 -7 145 11 101 -94 -32 -83 26 52 23 103 114 4 20 -65 102 3
4927 3 -25 66 47 143 30 -2 -2 -79 7 -147 30 69 46 -51 28 -174 -38 39 -55 3 36 -77 -72 -133 -90 -76 25 1
$$ packed form
4750D2k3J07n1o2L9j09K12j00j7o8lo2J84o4o0J00j0N7J3%j46R5j51J04J3M3m0
4777D3J6n6j37J61J06j20P6J2k55J30N0%Q3o0j23J5j16J50p7J81q5k0J13k05K30
4802A12o4L3j51R2j03j6K11k4j94J95r2J11J7j66R5m4k7q5k1J73r2K4P7mj27M
4828f6J44k6L0p6L8O0j64M1Q8j53J76m1q1J20o7R8k17O4M7L6J3Jp9j41J51m8J04
4855E2J6k99M34k42l3J32p9J50j49J18J58m30M4K2J09K9k21K8K40j3k38J34k9
4878f7j22J57J03M3r4rK02k68L2l2L5L8R3k01QJ92j50q1P6J22j01j02K30k0k2
4903F2j32K05j76Q5j37J73K1j08J52j34R0j95O2n1J09K6k9Q0J1j10J6q5J67r9
4927Ck8R1j9R6j13l2%p7Q6j54J77L9k3r7P9k02J36P7r4N8L3j13No1M3J4J01k4
$$ plain form
4955 1 -81 -11 -140 27 46 232 -138 151 -137 -57 -105 -4 81 -78 23 106 105 -34 110 46 -63 -115 19 -202
4979 -202 -37 -26 -191 111 -74 -20 56 123 167 -15 -37 87 76 -99 -6 110 -25 17 58 -170 -53 -8 -11 48 -149
5004 -149 -41 -52 9 -92 -15 -48 168 41 58 29 24 -87 -120 -47 -81 17 42 -24 -23 86 27 64 -83 -72 84 179 8
5031 8 -230 -31 139 -281 -35 -26 96 -28 -208 60 77 -50 123 -48 -38 19 41 -14 77 240 -148 -90 -9 -124
5055 -124 30 4 164 13 123 -128 -238 18 10 -51 -108 -43 37 -22 17 4 53 -49 122 -154 25 -98 105 -2
5079 -2 -62 23 89 50 -76 -71 -11 -6 113 11 -32 58 12 30 0 23 -79 -2 -55 37 17 -105 -40 87 203 139 -6 -146
5107 -146 75 72 31 -22 36 -74 68 -2 -67 -6 -39 -47 128 39 -76 36 50 -3 34 -47 98 -53 49 -11 67 -71
5133 -71 22 40 7 -26 33 20 -94 9 -9 24 -23 -174 -173 -11 128 55 15 73 63 65 -53 55 127 -82 -21 -86 -90 -122
$$ packed form
4955Aq2P0j29J67J9J86l70K89k88Q0m8J01Q5j59J01Q3jj39J44o4j09n2J34k21
4979b02J65J1j65L02j85N4P6O7M4j82k2J24j1j75R3J16j35M2M1k28J17M5lN9j97
5004a49J08j1O1j01P7l3K16j27J7k9nj11l3P3l4R8K5o6JJ09n9L7j47J1J56R5j71
5031Hk38J99J70m20K46RJ22j24j80K68J7j27J73j71J0N7K2n5R1J63l88N8Q1j15
5055a24J54k6J60j51J10k51j10K56qo1n7O5Q0n9L9j3M9j02J71k76J79j23K03j07
5079bo0Q5O6l9j26NO0NJ19j02m3R0m6J8l0K3j02P7n3R2k0j22O5J27J16o4j45j40
5107a46K21lm1n3N8j10J42p0o5O1l3qJ75q9j15J12J4n3L7q1J45j51J02o0P8j38
5133g1R3J8l3l3N9j3j14J03j8L3m7j51JJ62J39p3m0N8j0Kj18J08P2k09O1o5ml2
$$ plain form
5161 -122 -170 197 186 25 -53 28 -5 52 -35 144 86 4 59 -68 54 -45 116 133 130 98 -101 -19 84 -88 -71 116
5187 116 168 135 211 120 40 158 9 -22 184 -25 -54 98 0 -262 18 -39 10 -34 67 -48 163 61 45 80
5211 80 -159 109 55 -65 -44 -52 -12 -124 -20 291 -158 -64 -22 165 151 68 -53 -30 -123 -8 -9 21 98 -77 60
5236 60 139 -14 -107 216 167 -62 75 16 16 59 -57 -69 80 -5 -2 -69 -115 106 134 -45 -159 -38 99 20 -27 107
5262 107 11 -121 -91 -4 -51 20 -118 -158 75 158 -27 -41 -26 -39 6 42 -69 20 -30 -22 102 8 -62 54 -85 -179
5288 -179 -186 9 48 -65 98 39 36 28 15 78 133 -121 -211 -37 51 -55 -10 -97 139 125 99 -5 -34 -19 -53 40 71
5315 71 -146 -30 -60 29 -92 43 46 -138 152 18 -88 -73 59 -62 36 52 -25 54 115 -53 -44 -42 55 20 191 -15
5341 -15 -44 52 215 31 21 -105 -145 51 -36 82 -19 -79 17 59 -57 85 -76 24 -18 68 68 -100 140 -75
$$ packed form
5161a22m8L67j1j61p8Q1l3N7q7J79n8q2N5j27J22r9J61J7ll2j99Q2J03j72J7J87
5187A16N2l3P6r1q0J18j49l1K06k09k9J52r8k62K80n7M9m4J01j15K11j02j6L5
5211H0k39K68n4j20K1qM0j12J04L11m49R4M2J87j4q3j21K3r3J15jL0P7j75J37
5236F0P9j53r3L23m9k29J37n9%M3j16j2J49q5Lo7m6K21K8j79j14J21J37p9m7J34
5262A07r6j32L0Q7m7P1j38m0K33Q3j85j4J5j3M5L6j11Q9n0QJ24r4p0J16j39r4
5288a79pJ95L9j13J63n9lqj3O3N5k54r0J74Q8j06M5q7K36j4k6j04k9J5l4R3L1
5315G1k17J16l0Q9j21J35Lj84K90j34j06J5J32j21R8J6p7P9O1j68RKR7l5J71k06
5341a5k9R6J63j84j0j26m0J96q7J18j01o0R6M2j16J42j61J00m2Q6%j68K40k15
$$ plain form
5365 -75 -47 136 -44 -45 1 -82 151 -102 -13 85 -2 37 29 56 117 67 -11 30 -48 7 -115 -52 33 -68 -49 -16 8 140
5393 140 -20 -83 -152 -161 42 20 135 44 -131 -48 33 118 -9 -22 -189 -34 -202 -11 -25 104 76 -49 19 102 59
5418 59 -122 78 139 100 -76 15 -172 122 -53 38 35 -71 47 33 -82 -120 -23 -18 -78 24 -101 34 78 -110 21
5443 21 113 88 91 84 -4 109 49 -9 130 -139 8 27 45 51 80 200 24 176 -12 154 1 53 67 101 137 125 34
5470 34 25 89 -28 -185 -1 93 -28 3 31 65 26 82 -105 145 63 12 -22 -134 -113 -49 -13 109 115 10 43 -17 8
5497 8 -52 75 -109 -22 21 -77 49 176 42 -90 31 -28 -133 -7 64 -69 29 -157 -128 0 143 -132 25
5520 25 -207 30 52 -54 90 -37 -128 -50 127 73 -10 11 8 -8 69 32 -8 -36 -3 91 67 78 -56 -56 95 -107 149
5547 149 -86 199 121 -75 -94 -7 21 23 -84 13 -37 -29 -28 54 -127 -14 83 -119 81 32 -43 32 -30 -40 -104 -77 -70 55
$$ packed form
5365g5K8J83j80jM6q3K33k53Q9R8q7L9qK7O1n0p8M1p8N5j22O3Q5j01J9L3K4J32
5393A40j60o3o9rK03k2J15r1j75Q3Q1Q5j27j3j67J55j68J91j4J29k8j25O8Q3m3
5418E9j81K00O1l9j76R1j87K94j75R1lj06J18j4j15l8R7No0J02j25J35M4j88J31
5443B1R2k5Lpq8J13o0n8J39k69J47J9J8OK9J20j76J52j88J66j53N2J4L4L6j2r1
5470C4rO4j17j57J84R4j21L1K8L4l9N6j87K50q2n1l4j12K1O4L6J22Oj05L3o0K5
5497Ho0J27j84Q7M3r8J26J27j34j32J21n9j05J26P1j33R8j86K9J28J43k75J57
5520B5k32K37K2j06J44j27r1P8J77n4q3K1lj6P7l7m0k8L3R4k4J1j34%J51k02K56
5547A49k35K85p8j96j9Q7K8Kj07R7n0QJQ2j81J13R7k02K00m9p5P5o2j0o4K7PJ25
$$ plain form
5575 55 28 -143 56 61 59 -52 144 108 70 78 53 32 -28 77 37 100 20 135 -90 -81 -117 126 165 -143 83 -98 -61
5602 -61 -6 160 -100 46 77 -20 125 -53 127 117 -97 -92 -74 -161 -39 -140 15 -15 69 -113 -26 85 66 -111
5626 -111 82 27 45 10 61 -39 38 -88 143 61 113 -75 10 99 -57 -16 -64 117 122 48 57 -30 -30 -19 42 -48 -56 154
5654 154 -60 67 -109 -87 -133 -111 -58 -11 -133 -12 62 -57 85 -50 -91 -175 -2 147 -113 -126 -15 -29 -146
5677 -146 -25 -2 139 121 78 -109 12 64 -103 -12 2 -48 -94 50 -39 18 100 -95 -70 109 22 64 12 8 15 -121
5703 -121 82 81 -6 20 101 79 78 -14 41 -42 89 -30 61 -73 -98 4 75 -21 193 89 -116 -61 35 -47 62 28
5729 28 58 -24 10 -121 41 108 -159 33 -90 -44 22 -69 -32 62 14 137 -28 -12 -10 -163 -20 139 -98 44 -123
5754 -123 -90 -73 10 63 -112 43 -26 77 -100 -14 24 70 -92 -53 -33 99 174 -74 8 118 56 -64 82 125 12
$$ packed form
5575E5k7j71J99Nkj11J96l6l8Qk5k1o0J05m0O3q0J15k25Rl6K43L9l08K26j81L7
5602f1N5J66k60J46L1r7J45j78J80j0k14NJ8q7J22j01J55l0Q4j82Q7J11j9j77
5626a11J93n5J8l5N1j00P7j26K31q2N2j88Q5Q9j56M1m8J81Np4Rq7%J1O1r0qK10
5654A54k14J27j76K2m6K2N3M7j22J21P4j19J42j35m1q4J73J49k60j3J11j4j17
5677a46J21K3J41j8m3j87J21N2j67R1J4n0m6J44q9N7Q2j95K5J79q7M2n2mPj36
5703a21K03jq7K6Q1k2jr2N5q3J31j19R1j34k5J02P1r6K14j04k05N5R6q2J09l4
5729B8L0q2L4j31J62O7k67J92j23M6O6r1L7R4m8J23j65J6Kj53J43J59k37J42j67
5754a23L3J7Q3N3j75J55o9J03j77Q6L8M6j62L9K0J32P5k48Q2J10o2j20J46M3j13
$$ plain form
5779 12 -60 -17 6 -37 0 99 -193 -35 109 111 111 -49 9 -2 -111 -142 -58 -12 -218 56 -17 -27 -57 4 -191 -98 42
$$ packed form
5779A2p2M3K3m3L7R9k92J58J44K%j60N8j1j09l1Q4M6k06K74p3j0l0O1j95R3J40
$$ [...]
8191A5
##END NTUPLES=NMR FID
##END=
