##TITLE=1H_LR-758-CR2-BA
 CCl4
 8 sc, 
 22.11.2022
##JCAMPDX= 6.0         $$ Bruker NMR JCAMP-DX V2.0
##DATA TYPE= NMR FID
##DATA CLASS= NTUPLES
##ORIGIN= UXNMR, Bruker Analytische Messtechnik GmbH
##OWNER= root
$$ XWIN-NMR		Version 3.5
$$ Tue Nov 22 14:20:14 2022 Russian Standard Time (UT+4h)  she@DPX200
##.OBSERVE FREQUENCY= 200.1313499994
##.OBSERVE NUCLEUS= ^1H
##.DELAY= (6, 6)
##.ACQUISITION MODE= SIMULTANEOUS
##.ACQUISITION SCHEME= undefined
##.AVERAGES= 8
##.DIGITISER RES= 18
##SPECTROMETER/DATA SYSTEM= spect
##.PULSE SEQUENCE= zg30
##.SOLVENT NAME= CDCl3
##.SHIFT REFERENCE= (INTERNAL, CDCl3, 0, 15.7039)
##AUDIT TRAIL= $$ (NUMBER, WHEN, WHO, WHERE, WHAT)
$$ ##TITLE= Audit trail, XWIN-NMR		Version 3.5
$$ ##JCAMPDX= 5.01
$$ ##ORIGIN= Bruker BioSpin GmbH
$$ ##OWNER= she
$$ F:/spectra/data/she/nmr/H-F/1/audita.txt
$$ ##AUDIT TRAIL=  $$ (NUMBER, WHEN, WHO, WHERE, WHAT)
(   1,<2022-11-22 14:18:45.07 +0400>,<she>,<DPX200>,
      <created by zg, POWCHK disabled, PULCHK disabled
       configuration hash MD5:
       00 E9 B6 7A A2 85 ED C7 34 08 36 98 17 FE 4E 26
       data hash MD5: 16K
       0D F9 36 CD 7F 1C 0B 97 B0 97 D5 97 29 47 9A DD>)
$$ ##END=
$$ 
$$ hash MD5
$$ 5A 59 0B E8 D7 DA 0D C0 21 6C 8A 94 0A BC A8 8C
##$RELAX= 
##$RELAX= 
##$RELAX= 
##$RELAX= 
##$RELAX= 
##$RELAX= 
$$ Bruker specific parameters
$$ --------------------------
##$DU= <F:/spectra>
##$EXPNO= 1
##$NAME= <H-F>
##$PROCNO= 1
##$TYPE= <nmr>
##$USER= <she>
##$AMP= (0..31)
100 100 100 100 100 100 100 100 100 100 100 100 100 100 100 100 100 100 
100 100 100 100 100 100 100 100 100 100 100 100 100 100 
##$AQSEQ= 0
##$AQ_mod= 1
##$AUNM= <au_zg>
##$AUTOPOS= <>
##$BF1= 200.13
##$BF2= 200.13
##$BF3= 200.13
##$BF4= 200.13
##$BF5= 200.13
##$BF6= 200.13
##$BF7= 200.13
##$BF8= 200.13
##$BYTORDA= 1
##$CFDGTYP= 0
##$CFRGTYP= 5
##$CHEMSTR= <none>
##$CNST= (0..31)
1 1 145 1 1 1 1 1 1 1 1 1 1 1 1 1 1 1 1 1 1 1 1 1 1 1 1 1 1 1 1 1 
##$CPDPRG= <>
##$CPDPRG1= <>
##$CPDPRG2= <>
##$CPDPRG3= <>
##$CPDPRG4= <mlev>
##$CPDPRG5= <mlev>
##$CPDPRG6= <mlev>
##$CPDPRG7= <mlev>
##$CPDPRG8= <mlev>
##$CPDPRGB= <>
##$CPDPRGT= <>
##$D= (0..31)
0 1.2 0 0 0 0 0 0 0 0.06 0 0.03 0 0 0 0 0.0002 0 0 0 0 0 0 0 0 0 0 0 0 
0 0 0 
##$DATE= 1669112324
##$DBL= (0..7)
120 120 120 120 120 120 120 120 
##$DBP= (0..7)
150 150 150 150 150 150 150 150 
##$DBP07= 0
##$DBPNAM0= <>
##$DBPNAM1= <>
##$DBPNAM2= <>
##$DBPNAM3= <>
##$DBPNAM4= <>
##$DBPNAM5= <>
##$DBPNAM6= <>
##$DBPNAM7= <>
##$DBPOAL= (0..7)
0.5 0.5 0.5 0.5 0.5 0.5 0.5 0.5 
##$DBPOFFS= (0..7)
0 0 0 0 0 0 0 0 
##$DE= 6
##$DECBNUC= <off>
##$DECIM= 32
##$DECNUC= <off>
##$DECSTAT= 4
##$DIGMOD= 1
##$DIGTYP= 9
##$DL= (0..7)
0 120 120 120 120 120 120 120 
##$DP= (0..7)
150 150 150 150 150 150 150 150 
##$DP07= 0
##$DPNAME0= <>
##$DPNAME1= <>
##$DPNAME2= <>
##$DPNAME3= <>
##$DPNAME4= <>
##$DPNAME5= <>
##$DPNAME6= <>
##$DPNAME7= <>
##$DPOAL= (0..7)
0.5 0.5 0.5 0.5 0.5 0.5 0.5 0.5 
##$DPOFFS= (0..7)
0 0 0 0 0 0 0 0 
##$DQDMODE= 0
##$DR= 18
##$DS= 0
$$ [...]
##$SUBNAM2= <"">
##$SUBNAM3= <"">
##$SUBNAM4= <"">
##$SUBNAM5= <"">
##$SUBNAM6= <"">
##$SUBNAM7= <"">
##$SUBNAM8= <"">
##$SUBNAM9= <"">
##$SW= 18.0517283424941
##$SWIBOX= (0..15)
0 0 2 0 0 0 0 0 0 0 0 0 0 0 0 0 
##$SW_h= 3612.71676300578
##$TD= 16384
##$TD0= 1
##$TE= 0
##$TE2= 300
##$TE3= 300
##$TEG= 300
##$TL= (0..7)
0 120 120 120 120 120 120 120 
##$TP= (0..7)
150 150 150 150 150 150 150 150 
##$TP07= 0
##$TPNAME0= <>
##$TPNAME1= <>
##$TPNAME2= <>
##$TPNAME3= <>
##$TPNAME4= <>
##$TPNAME5= <>
##$TPNAME6= <>
##$TPNAME7= <>
##$TPOAL= (0..7)
0.5 0.5 0.5 0.5 0.5 0.5 0.5 0.5 
##$TPOFFS= (0..7)
0 0 0 0 0 0 0 0 
##$TUNHIN= 0
##$TUNHOUT= 0
##$TUNXOUT= 0
##$USERA1= <user>
##$USERA2= <user>
##$USERA3= <user>
##$USERA4= <user>
##$USERA5= <user>
##$V9= 5
##$VALIST= <valist>
##$VCLIST= <CCCCCCCCCCCCCCC>
##$VD= 0
##$VDLIST= <DDDDDDDDDDDDDDD>
##$VPLIST= <PPPPPPPPPPPPPPP>
##$VTLIST= <TTTTTTTTTTTTTTT>
##$WBST= 1024
##$WBSW= 4
##$XGAIN= (0..3)
0 0 0 0 
##$XL= 0
##$YL= 0
##$YMAX_a= 85443
##$YMIN_a= -83369
##$ZGOPTNS= <>
##$ZL1= 120
##$ZL2= 120
##$ZL3= 120
##$ZL4= 120
##$ABSF1= 10
##$ABSF2= 0
##$ABSG= 5
##$ABSL= 3
##$ALPHA= 0
##$AQORDER= 0
##$ASSFAC= 0
##$ASSFACI= 0
##$ASSFACX= 0
##$ASSWID= 0
##$AUNMP= <proc_1d>
##$AZFE= 0.1
##$AZFW= 0.1
##$BCFW= 1
##$BC_mod= 2
##$BYTORDP= 1
##$COROFFS= 0
##$CY= 11.3945322036743
##$DATMOD= 1
##$DC= 2
##$DFILT= <>
##$DTYPP= 0
##$F1P= 2.36226072786647
##$F2P= -0.459571619588291
##$FCOR= 0.5
##$FTSIZE= 0
##$FT_mod= 4
##$GAMMA= 1
##$GB= 0.15
##$INTBC= 1
##$INTSCL= 1
##$ISEN= 128
##$LB= 0.24
##$LEV0= 0
##$LPBIN= 0
##$MAXI= 10000
##$MC2= 0
##$MEAN= 0
##$ME_mod= 0
##$MI= 1.114404
##$NCOEF= 0
##$NC_proc= 0
##$NLEV= 6
##$NOISF1= 3.799351
##$NOISF2= 2.8
##$NSP= 1
##$NTH_PI= 0
##$NZP= 0
##$OFFSET= 15.70392
##$PC= 1
##$PHC0= -18033.49
##$PHC1= 15.20071
##$PH_mod= 1
##$PKNL= yes
##$PPARMOD= 0
##$PSCAL= 0
##$PSIGN= 0
##$REVERSE= no
##$SF= 200.130013532006
##$SI= 16384
##$SIGF1= 3
##$SIGF2= 2
##$SINO= 400
##$SIOLD= 16384
##$SREGLST= <1H.CDCl3>
##$SSB= 0
##$STSI= 0
##$STSR= 0
##$SW_p= 3612.71676300578
##$SYMM= 0
##$S_DEV= 0
##$TDeff= 0
##$TDoff= 0
##$TI= <>
##$TILT= no
##$TM1= 0
##$TM2= 0
##$TOPLEV= 0
##$USERP1= <user>
##$USERP2= <user>
##$USERP3= <user>
##$USERP4= <user>
##$USERP5= <user>
##$WDW= 1
##$XDIM= 8192
##$YMAX_p= 0
##$YMIN_p= 0
$$ End of Bruker specific parameters
$$ ---------------------------------
##NTUPLES= NMR FID
##VAR_NAME=  TIME,          FID/REAL,        FID/IMAG
##SYMBOL=    X,             R,               I
##VAR_TYPE=  INDEPENDENT,   DEPENDENT,       DEPENDENT
##VAR_FORM=  AFFN,          ASDF,            ASDF
##VAR_DIM=   8192,          8192,            8192
##UNITS=     SECONDS,       ARBITRARY UNITS, ARBITRARY UNITS
##FACTOR=    0.0002768,     1,               1
##FIRST=     0,             0,               0
##LAST=      2.2672688,     0,               0
##MIN=       0,             -83369,          0
##MAX=       2.2672688,     85443,           0
$$ Real data points
##PAGE= N=1
##DATA TABLE= (X++(R..R)), XYDATA
$$ [...]
1535c06J366n51j264L99N83o89l27J036O44r18n45M35J26j80Q01R7q40j047Q63
1554c17J220j266j55J209j94j540J71J807O85k056j21R43j17o17k7J618q76j036
1572f69R1R27k0k00N58K5j266L65Q11j75m12k7P24j300m23J317J092q48j295Q97
1592A72R48j333k54J322J91j388p77J588L71n73j70K36n2n29J87J117n03k43K74
1611E84n44m80K13J571q29q33j02J054k7j159J144J077j374j162Q85J207k83j390
1629d48R27J46q00l38J007P55r20m26L96o7J22P17k46m90o59N47O05j017M29Q02
1649A042m01j164PK129m03j390N11M88l29j199J024J132q32r71J06R68j3p09J180
1668A176m23p67j2K46N63q10Q37j46r60q0Q65J030j487k07Q37J07r37M2J520N2
$$ plain form
1535 -306 1060 509 -755 -356 227 -462 -789 247 891 -27 -572 -137 -11 -191 610 707 -133 -1180 -317
1554 -317 903 -363 -518 691 497 -1043 -872 935 1620 -436 -557 386 269 -348 -375 1243 367 -669
1572 -669 -578 349 329 129 687 712 -554 -189 622 447 35 8 732 -568 -991 326 1418 570 -725 172
1592 172 1120 -213 -467 855 1046 -342 -1119 469 840 267 97 333 281 -248 -61 1056 553 310 584
1611 584 40 -440 -227 1344 515 -318 -420 634 607 -552 592 1669 295 -867 18 1225 942 -448
1629 -448 479 625 -175 -513 494 1249 329 -97 299 232 354 1071 825 335 -324 223 828 -189 240 1042
1649 1042 641 -523 -516 1613 1210 -180 331 819 490 -709 315 1447 615 -356 -250 718 705 -4 1176
1668 1176 753 -14 -26 220 783 -27 810 664 -296 -376 489 1519 32 -175 662 769 -168 -126 1394 1446
1688A446j858j55J203K17p99M36L18l31q23K33J364q11N5j36pl79nJ082m66n92
1708hK00K99k81n74J227N42j561n41Q95J125j121k86Q73l05n87m19J305M07j117
1727G3L2K55K2l50K69Q87r59j26q9M93n64J51J199j095o42J46J378l03j018P00
1747D59N90r98q72J112R92j032p62K82Q62n67l53J030p5m77n32O95J51n40P39
1766G04k85p84o1O44O89q00j66P88n90n88j2J806n63j348K79N55L43j027O22O79
1786H85q15o83L50J057l04m90N03l42m15J70O78j8j129O60j05k57j45J134K87
1805A021j410k43N57O35r34P3J030m77q83j00J025M60j188N24m6k8l85K88J054
1824I73q99j79j41N7k4J67O36m96o41M29N38j9r24R09K42j171k16N51J271j295
$$ plain form
1688 1446 -412 -567 636 853 54 490 808 477 -346 -113 1251 440 495 359 352 -27 -32 1050 584 -8
1708 -8 192 491 210 -364 863 1405 -156 -697 198 1323 202 -84 789 484 -103 -522 783 1190 73
1727 73 105 360 382 32 301 1188 229 103 14 507 -57 94 1293 198 -444 -298 1080 777 -241 459
1747 459 1049 51 -821 291 1283 251 -511 -229 633 66 -287 743 668 191 -341 354 505 -35 704
1766 704 419 -365 -426 218 907 107 -59 729 139 -449 -461 1345 782 -566 -287 268 611 -416 206 885
1786 885 70 -613 -263 794 490 0 503 161 -254 -84 594 576 -553 107 2 -255 -400 734 1021
1805 1021 -389 -632 -75 560 -374 -301 729 252 -631 -731 294 754 -434 90 44 16 -369 -81 973
1824 973 74 -105 -246 -189 -213 -46 590 94 -547 -118 420 401 -523 386 628 -543 -759 -208 1063 -232
1844b32l72P25k3l92l91J198J36j291J36L56K65k68J80J66q25J19K94N45n70J56
1864h8N71q07k99K27J223o75r42M33L73k22m54N95R07j190o26O36O49j01q59Q92
1884B43l69l66n1N38K20p60L77j27l18J64N91L88j188o0R83m24k96j40J279o73
1904A1j176K31J051K89j099L26N00o22k26M85Q26n09p20L69p8q5J30O07l57p71
1924h18N90q0L51n23P09J11j172j30Q36M10o49k45Q10l01p25L56Q10L88j441L49
1944c64P5J46k01J58N64q28l35N51R7j82J16N25p91l82O48M43j72o30N17J31q29
1965g43J91O30M87j067o17P47M02k88j36N58Pj046J97O25L08m86j77J66l74J22
1985d94M17K34l94o5L46m42j80M36O94n72j047N47O30k0o22J67R10j035l37N47
$$ plain form
1844 -232 -604 121 98 -294 -685 513 649 -642 -506 -150 115 -153 27 193 -632 -513 -219 326 -244 -88
1864 -88 483 -324 -623 -396 827 152 -790 -357 16 -206 -660 -65 842 -348 -974 -338 311 210 -649 243
1884 243 -126 -492 -543 -5 215 -545 -168 -295 -613 -449 142 530 -658 -718 265 -159 -455 -595 684 11
1904 11 -1165 -934 117 406 -693 -367 133 -489 -715 -230 596 87 -633 -264 -342 -427 -297 310 -47 -818
1924 -818 -228 -308 43 -480 229 340 -832 -962 -126 284 -365 -610 200 -101 -826 -470 340 728 -713 -364
1944 -364 -289 -143 -344 -186 378 -450 -785 -234 -137 -319 -203 322 -469 -851 -203 240 68 -562 -45 86 -743
1965 -743 -552 78 565 -502 -1119 -372 30 -258 -394 164 171 -875 -678 -53 255 -231 -408 -242 -616 -494
1985 -494 -77 157 -237 -302 44 -398 -578 -142 552 -20 -1067 -520 110 90 -532 -365 545 -490 -827 -280
2005b80R69q05n18N71k96r6J30N86j00o77J02L48l86K68M10k2q31l16J249j98
2025A08l43k91P95l82p52N38O74n2q39O2O97n01j53O42P1m27o50M34M54j68k0
2046a03L10m59l55L22N29j67m83M96o0n07k1Q76J83j002l21R01om70J38O19j66
2067B54r36K15O70J79n49K7L60n99k4M29O8%l04K45j41m63P63L82m85o92N05M32
2089C36m65j06N49K14q33l35Q47O95r15j20J20K74m84j07P14k81j79j12K46OJ3
2110G7L72N9q69J24M41o3l66K43M70m50o87O62O35m33m71K67M20n83k68P12L08
2131F00m80m57L25M17l24l8K85j59l18J16N78m10P0J63n2m82j98R65j48p09J61
2152i5N06k96l72K67J007p95n26L3P69j50m77M16p9l66j30L48M54l19j46K15m36
$$ plain form
2005 -280 689 -116 -634 -63 -359 -455 -325 261 161 -516 -414 -66 -452 -184 226 204 -627 -943 306 108
2025 108 -235 -526 269 -113 -865 -327 347 295 -544 -482 215 -286 -439 203 274 -153 -803 -369 85 -83 -103
2046 -103 207 -252 -607 -285 244 77 -406 90 30 -477 -498 378 561 -441 -762 139 133 -337 -199 420 254
2067 254 -682 -467 203 382 -167 -140 220 -379 -403 26 94 94 -210 35 -106 -569 194 576 91 -601 -96 336
2089 336 -129 -235 314 528 -305 -640 207 902 -13 -133 -13 261 -223 -330 384 103 -76 -188 58 64 77
2110 77 449 508 -361 -237 204 141 -225 18 488 38 -649 13 648 215 -256 11 431 -152 -420 292 600
2131 600 120 -337 -12 405 81 43 328 169 -149 -33 545 135 205 368 316 -166 -364 601 453 -256 -95
2152 -95 411 115 -257 10 1017 222 -304 -271 498 348 -129 287 208 -158 -288 60 514 195 49 264 -172
2173a72J47J71K82k52k85J82J73k15NP10j55q03l15R72J77p29K40L08j09n81J83
2194f6Q42l23o25L70j30K30j15K92j5n47J54J14J00m32N19K48n70m58N20M73j72
2215D09n81Q50j67o47l29Q47M35o44k69J20M04l27J3L85k14k46NJ82J73k81M00
2236E18k18p51L89M35J53r14N22L82m74k21L30R69p48p49L67N06k96l95N93J59
2256E57m84j93N3O30m26r6L79n80R6J46M35k11m55M57p9m11J26O44j68q89L30
2277a39L93J85m25j63Q83o08m98P6P66Jo87L08J64k43M9Q5L27l19j94J35j24P5
2299D7L3N03p16o0M77j36J27m80P29k22n27k36P67L44p19j26M30j71j78j15P50
2320E21l63m69L42k9L43l18N48n25l66K00L64j02r8J71Q0n03o1M95L71n02p44
$$ plain form
2173 -172 -25 146 428 176 -109 73 246 31 36 746 591 -212 -527 445 622 -107 133 441 332 -249 -66
2194 -66 776 453 -172 198 68 298 183 475 460 -87 67 181 281 -151 368 616 46 -412 108 581 409
2215 409 -172 678 511 -136 -465 382 817 173 -96 24 428 101 114 499 285 39 44 226 399 118 518
2236 518 300 -451 -62 373 526 -388 134 516 42 -179 151 1120 372 -377 -10 496 200 -195 398 557
2256 557 73 -120 -67 563 137 41 420 -160 -64 82 517 306 -149 308 229 -182 -56 588 420 -469 -139
2277 -139 254 439 14 -149 734 126 -372 -296 470 471 -216 92 256 13 62 147 474 155 -39 96 -28 47
2299 47 80 583 -133 -193 284 148 275 -205 524 302 -225 -461 306 650 -69 -195 235 64 -114 -229 521
2320 521 158 -311 31 2 345 27 575 50 -316 -116 248 146 48 219 299 -204 -265 230 601 99 -645
2341f45R00nl11k72N36M31j001r4M48M29m19j06L81k69j62J92O4J25k74J64l36
2362b24j28L12L62k7p48M19L29j99n16N04O14o22p39N48O80m03o11L60L14m99
2382b74j6L95M22n39j37K99n53K43K88O5k58l35N17J9l21LO02j42q90L00N85m0
2404B33m27j50M85l15l84L34O67l52m01L0L47j04k96N14j86k77r6M15n1o4M9J85
2426A56n20j16N67J63j93m90O43j25n58K40N45m5q45K3O42q0n6j21K97j59k02
2447b34O1P1K39l87J38o3k17K23M01l33k52J77K63m26R2L75R0n48n38P27J73j20
2469h8j22K25J30o55J3N81M13o08j77P1O9k69K99K37j35l30K67lk75L69K59k37
2491C4p27N61J73k5m86L60K50m88k14M78L69p3p07L66K43l06K10K04j09n62O8
$$ plain form
2341 -645 255 250 -61 -333 203 634 -367 -461 -13 416 -3 -109 272 3 -159 33 97 222 -52 112 -224
2362 -224 -352 -40 322 295 -453 -34 295 96 -420 84 698 76 -663 -115 565 162 -449 -89 225 -274
2382 -274 -290 105 527 -12 -149 150 -403 -160 128 193 -65 -400 117 136 -185 -182 420 278 -612 -312 273 233
2404 233 -194 -344 141 -174 -558 -224 443 91 -310 -280 67 -37 -333 181 -5 -282 -378 37 -14 -78 -29 156
2426 156 -364 -480 87 250 57 -433 210 85 -473 -233 312 267 -578 -555 87 7 -49 -170 127 -32 -234
2447 -234 -173 -102 137 -250 -112 -175 -392 -169 232 -101 -353 -176 87 -339 -247 128 218 -330 -868 -141 32 -88
2469 -88 -210 15 145 -510 -497 84 497 -111 -288 -217 -148 -417 -118 119 -16 -346 -79 -82 -357 12 271 34
2491 34 -693 -132 41 16 -470 -110 140 -348 -562 -84 285 212 -495 -129 114 -192 18 222 113 -449 -381
2512c81K93o0J04J49j24n03J44N45O7l04o3J40J06p36L89O49j94n73o2P58k65
2533G9l00J26L87l97l94L69K33p4l55L06k03n9J25L74j92k31J41Q4j89k11N92
2554B11K32p85j67N44J98k82k79N34j02n17J32N00ok93l14N38r6k14J36J54k86
2575a62k1J5k6m1J77L37l16k07M1M16k22k28M91J11n71l40M86M12j99n75L93Q4
2597E5j54j3L94p1m36K2J78jK2K66l05k8j79N20k45q7Q7L78m02m68K69N40l10
2620C2n23J81N75j03m61M23L63m51l15K16M34j90k20K17r0k06M9K62K4j63k4O2
2642I2k82J74L94M6o56j26M43J54l58K15J69J6n39L6M97Q9m51l1M33l28j67L19
2664A39J87j24m00J14J65j94K99K57m00m19M98N9k85M9L17J02o11j13N01L39n50
$$ plain form
2512 -381 -88 -148 -44 105 -19 -522 -378 167 234 -70 -133 7 113 -623 -234 415 221 -352 -414 344 79
2533 79 -221 -95 292 -105 -499 -130 103 29 -326 -20 -223 -282 -157 217 25 -206 -65 19 -170 -381 211
2554 211 443 -342 -509 35 233 -49 -328 206 104 -413 -281 219 213 -80 -394 144 48 -166 -30 124 -162
2575 -162 -183 -168 -194 -235 -58 279 -37 -244 -203 213 -9 -237 254 365 -206 -546 -60 352 153 -422 -29 55
2597 55 -99 -112 282 211 -225 -203 -25 -26 -4 262 -43 -71 -250 270 25 -62 25 403 1 -467 -198 342 32
2620 32 -491 -310 265 162 -299 124 487 36 -279 -63 371 181 -39 178 88 -118 -69 193 217 54 30 92
2642 92 -190 -16 378 424 -232 -358 85 239 -119 96 265 281 -258 -222 275 364 -87 -118 315 -13 -180 139
2664 139 326 202 -198 -84 81 -113 186 443 43 -376 122 181 -104 -55 262 364 -247 -360 141 480 -70
2685g0j83N63m5l12J05M43j29l48j98K32J00j50J32L5j04j81K53L6J5N2J1l87
2707a30j04L36M93m56l47K67J59l00j39L36N21o40l03M39K65k92k19L05j7r9q2
2728gM22j92j19mj50k3m6L93J06k65k0J58k59j28K34M66m53l79K33M46r1k72R6
2751A46K37n5p21O22J26k11j56j03K68q4P6RL4k25K74Lj05j4L21o5m76R5K42J15
2775C53k28j57N14k91l86O3O35j95m36O7K83j15q5N2K91l33j1P3K28k70K85pk82
2798D8k15K27K20k88j96M01n2k66oM97J11o09m6R5L73l58J2L68j10j28j29K54
2820B03M0j21l5R0k79K14O6R2k76M6Q7j5l48J95K96k57j82J80L52k19k61K52J12
2843B32k56r4L5K39r6k44K18Q6l4j14L78j62k07M4K46l82J28L66l43l14K02J01
$$ plain form
2685 -70 -253 310 265 -47 58 501 372 24 -174 58 158 8 140 175 71 -110 143 179 194 246 257 -130
2707 -130 -234 102 595 139 -208 59 218 -82 -221 115 636 -4 -307 132 397 105 -114 191 174 75 -7
2728 -7 415 223 104 100 -50 -73 -119 274 380 115 95 253 -6 -134 100 566 113 -266 -33 413 322 50 146
2751 146 383 328 -393 229 355 144 -12 -115 153 69 145 154 188 -37 237 240 135 121 442 377 -99 -4 238 353
2775 353 125 -32 482 191 -195 -132 503 308 -128 -61 222 107 22 74 365 32 21 94 322 52 337 330 48
2798 48 -167 60 280 -8 -204 197 145 -121 -127 370 481 -128 -174 -79 294 -64 -52 316 206 78 -51 203
2820 203 243 122 87 177 -102 112 178 270 -6 40 127 112 -236 -41 255 -2 -184 -4 348 129 -132 120 232
2843 232 -24 -118 -83 156 60 -184 34 120 86 -28 350 188 -19 25 271 -111 17 383 40 -274 -72 29
2865B9J08k82K5M98l00l10L44K82k46l02J38POj02J17K25k07j04k7J35j9Q1n3
2888D3Nk89K77K24k43m3K87k17l62o1O59J44n32r9J50J92l46J39M08j66o01K77
2910a54K16N0k76K45j21o9L8p6M07k60M5N0k15n8K05L25l67l50N13O3l24p1L22
2933A38K45m24k26K71K28l38q4L38k93J7L9J84r3j86P1N9P8p1J83j68l8K7Oj14
2957a51J06j13M62n17j47L82M07l22m68L25J23j32j33K60J89n14M7J78O7j66J06
2978a1J03j21j93J64P1%l13L35j1k88n2L75J03l72O7L41k54j07L11O5j33k23m6
3001a89K55J4k08J00k6j30O6Q4K09j93qP3j19j35K32J49j70j29J87j15j4j20K68
3024H1K41o94J06L68J72m86O9L61k81k16J37J78L1k40K10j00o9R9P1q9j90O3O7
$$ plain form
2865 29 137 -145 -120 378 78 -232 112 394 148 -154 -16 -9 -3 -105 12 237 30 -74 -101 34 15 96 43
2888 43 48 -241 36 260 17 -26 261 44 -318 -379 280 424 -108 -207 -57 135 -211 -72 336 170 -431 -154
2910 -154 62 112 -164 81 -40 -109 -71 -147 260 0 45 95 -120 -178 27 352 -15 -365 148 211 -113 -184 138
2933 138 383 -41 -267 4 232 -106 -190 148 -145 -128 -89 95 2 -184 -113 -54 24 -47 136 -32 -70 -43 -37 -151
2957 -151 -45 -158 304 -213 -360 22 429 107 -361 -36 87 -45 -178 82 271 -243 -196 -18 49 -117 -11
2978 -11 92 -29 -222 -58 13 13 -300 35 24 -264 -316 59 162 -210 -143 198 -56 -163 148 213 80 -143 -189
3001 -189 66 80 -128 -28 -54 -184 -118 -34 175 -18 -26 47 -72 -207 25 174 4 -125 62 -53 -67 -187 81
3024 81 322 -372 -266 102 274 -212 -143 218 -63 -279 -142 36 67 -173 37 -63 -132 -33 38 -51 -241 -178 -111
3047a11m7l5L41p4l14j11M81l1j09l33K99O1l13KL22J20k89k15K55J32k40J72
3069c7J44j72K6mJ32j93K0K00j22k66M0L66j51j67J74M3j90JK52J35k59l93L09
3092a12K57k07k21K47J87m10RJ93J93j78n1O0k38P6J68np2jJ67o4k51O8M45q1
3116A79l79PJ88K1q2J14Q2k81l5Q5K43P7k66J57j81j9j8L32l60O3nK31k84m0K84
3141A13m8l07o7M55j67J2j31M10j68l73K8L00m0o3j84M24l5l49M22j69Q9l46J86
3164hJ97k93J11O8k9j56N5K10k10m7J71N2j35j84M32O6l42k03L79j03j43m2J80
3187B6J61l81M9J82K45k30J9L0p0k35K62p5J13j40J74j07j60J46L33l29j78K88
3209A23P4j35j82J32J49k12o5L3K31%j39l3K37k20l9J32K38j90j31L1q8P0J66
$$ plain form
3047 -111 -158 -193 148 74 -240 -351 130 99 -10 -343 -44 17 -296 -294 28 148 -141 -356 -101 31 -209 -37
3069 -37 107 -65 -39 -43 89 -104 -84 116 -6 -272 -232 134 -17 -184 -10 33 -157 -156 96 231 -28 -421 -112
3092 -112 145 -62 -283 -36 151 -259 -250 -57 136 -42 -93 -33 -271 -195 -27 -32 -104 -105 62 -2 -253 -185 260 179
3116 179 -200 -193 -5 16 -66 48 130 -151 -186 -101 142 219 -47 110 -71 -90 -108 224 -136 -73 -78 153 -131 -171 113
3141 113 65 -242 -309 146 -21 -9 -140 270 102 -271 -243 57 17 -46 -230 194 159 -190 232 63 152 -194 -8
3164 -8 189 -104 7 75 46 -110 -55 155 -55 -102 69 121 -14 -198 234 300 -42 -245 134 31 -112 -154 26
3187 26 187 -194 -145 37 282 52 71 101 31 -204 58 -17 96 -44 130 23 -137 9 342 13 -165 123
3209 123 197 62 -120 12 161 -51 -116 -83 148 148 9 -24 213 -7 -46 86 324 134 3 34 -54 16 182
3232A82J27l96R2j3J44q2N6L19n85k7K30J30l8o3j67J34O9k49J48P5o0j43J1J62
3256E6M6M0j6k9j11OM6j89K95Jj1j12j97K81K22l64j05K75j4k45K6M41l6l92Q2
3281dK32k57O7J72l8o3j81J24J01j29LL2j04p9J46J95r7k80K86lp1j45M01j03
3305B05k39m23O07J79k18j36J10J97l74m7R5J97k78J56j42J74j23J01J23j51N5
3326F8J35j68j67J61R3j72j78L16R2P3n72J92K62j35j50K76J53j19l03K50j08
3347aM7N1R0r6j72K2Q8q2P3K05j50p9j21K83J97l98R8J36N1m46J48J16J87l88
3371a41J04K21j76O5j8J08j29j00N1J80m5j46K40k02j61J19Q6J49l01J44J71k93
3393g4J58K3Kn8j86J77J73j84j64L41M0j65k65J95J78j95q8J46m2j34J6K44L2
$$ plain form
3232 182 309 -87 5 -8 136 54 110 429 -156 -183 47 177 139 76 -91 43 112 -137 11 86 26 -117 -106 56
3256 56 102 142 126 97 -14 -8 38 -151 144 145 134 22 -175 106 328 -36 -141 134 120 -125 -99 342 306 -86 -4
3281 -4 228 -29 38 210 172 109 -72 52 153 24 27 59 -45 -124 22 217 120 -160 126 123 52 -93 308 205
3305 205 -34 -457 150 329 111 -25 85 282 -92 -139 -44 153 -125 31 -111 63 -60 41 164 13 68
3326 68 203 35 -132 29 122 -50 -228 88 180 253 -319 -127 135 0 -150 126 279 160 -143 107 -1
3347 -1 46 97 187 91 -81 -59 29 -53 20 225 75 -4 -125 158 355 -43 55 191 242 -204 -56 60 247 -141
3371 -141 -37 184 8 73 55 163 34 -66 -15 165 120 -26 214 12 -149 -30 56 205 -96 48 219 -74
3393 -74 84 107 109 51 -135 42 215 31 -133 208 248 83 -182 13 191 -4 -92 54 12 -122 -106 138 170
3416A70l16K91j82l7J37K37k66j77J14K97j04l36J70K01l31j02L79J77k80j58
3436a16K38p5n8J4J0P3r8j45K60p2Lm0K6j06j31K90j47J34j07J55k63j40K73K18
3460A96k16k11L55J6q8j10J07J30k21L0J1Q8j75J04k0o2j03J59J7J06j05r4Rn2
3484a29L7J19J05k21J4j8K54k46J30R1o0l76J89K90l6j80J4Jo2l5J14L3j03J6
3508e9p7J00j52K68P4j43j13J85K8j79j02J38J57l79J88R3O9k71J69O0n2j23p3
3531a94K88m9j96j01L04k18L0J30J0j1k7KK7kn7J22k56J06m5L16k95k7J82Q0j33
3556a4k34L13M8k61J9P9J02p1j30P9%l7J75O0m0j27J56q7k54K08J19k72k1O5J92
3581F7Nj84K38j4p6l86L74L6K9k22K07J8j28k56K96J10j18l9l2J34j64K44j32
$$ plain form
3416 170 -146 145 -37 -74 63 300 34 -143 -29 268 164 -172 -2 199 -132 -234 145 322 42 -116
3436 -116 122 47 -11 3 13 86 -12 -157 103 31 34 -6 20 -86 -217 73 -74 60 -47 108 -155 -295 -22 196
3460 196 -20 -231 124 140 52 -58 49 179 -42 -12 -1 87 -88 16 -4 -66 -169 -10 7 113 8 -86 -77 -129
3484 -129 -92 27 132 -89 -75 -93 161 -85 45 136 76 -300 -111 179 143 -37 -23 -22 -84 -119 -5 28 -75 -59
3508 -59 -136 -36 -188 80 154 11 -102 83 111 -68 -170 -32 125 -254 -66 27 96 -175 -6 54 2 -121 -194
3531 -194 94 45 -151 -252 52 -166 -136 -6 4 -7 -34 -32 -5 -7 -64 58 -198 -92 -137 179 -116 -143 39 119 -14
3556 -14 -248 65 113 -148 -129 -50 52 -19 -149 -70 -70 -107 68 128 88 -39 117 30 -224 -16 103 -169 -190 -125 67
3581 67 72 -112 126 112 36 -350 24 60 89 -133 74 92 -36 -292 4 114 -4 -43 -75 59 -105 139 7
3604Gj25q1J66Q3j70K22r0K9j83j03L54l9j01M2j80J32k16K46j7Qj64RJ55p5q
3629i9q9J79L6r6J08p0q4J01j35J1K2J65M5j70P7l1K19k44j00L26M3m58J34L7
3653g3k5J83j47Q0N5j05p9J34j51J77Nm7m4p8K18k63r0K83L9j54p8J77P7j07k42
3678b55M4K91m9k7K0k3p5k33L03J18j90n7J78j80J17J49L9j99M8J0Pj37O7J62
3702A28O1m62K45J32J70k78j2L7n9k5nJ36J0j44K1J74j35j88L66k40J14j56J67
3725E7j83J72OO5m6k06K29j19Q5k0L8N5l15J9K21o0K4j73Q8K19j61j4J32k57R5
3750d9j27L24o8j45J69m9n9M5M7Q2j83P4K9J8k42K34J93k67k12L07n1k36K67m6
3774E5J92l97M4J97o2N7k85L23kj35J27O4j23p7m6J09j38P1K72j25l16J4K69j78
$$ plain form
3604 7 -118 -199 -33 50 -120 102 12 41 -142 -245 109 70 -31 11 -169 -37 -253 -7 -24 -16 -180 -171 -16 -91 -99
3629 -99 -188 -9 27 -69 39 -31 -115 -14 -149 -138 -116 49 94 -76 1 -30 189 -55 -155 171 214 -244 -110 -73
3653 -73 -98 85 -62 18 73 -32 -111 23 -128 49 54 7 -37 -115 103 -160 -250 33 72 -82 -160 17 94 -13 -255
3678 -255 -211 80 31 4 24 1 -74 -307 -4 114 -76 -133 45 -135 -18 131 170 -29 19 29 36 -101 -34 128
3702 128 189 -273 -28 104 274 -4 -16 21 -38 -63 -68 68 78 -66 -45 129 -6 -194 172 -68 46 -110 57
3725 57 -126 46 52 117 71 -135 94 -25 60 40 78 133 -182 -163 58 -2 22 -151 -63 156 -5 -19 113 -144 -49
3750 -49 -176 148 80 -65 104 55 -4 41 88 170 -13 61 90 108 -134 100 293 26 -186 121 70 -166 101 55
3774 55 247 -150 -106 91 29 86 -199 124 122 -13 114 178 55 -22 -68 41 -97 -26 246 121 -195 -181 88 -90
3798i0R5m9K55l14k29L46J36j66M0J3Ok24K47O8r4J00l35K54M1l1L3J88l74P4
3822a0J01K4k30J77P9o0j34R0J16k8j90N6Q1m0j3J15J5r5j75J59Mj52J43R3j22
3847DpJ01r3J86o3n9l4Q4j30L17k03j13q9J59Q4p0m0J30o2j17r4L52K1k36j18
3872i0K23j81m0J36Pn5l6J0m5%Q7nM3n6q9J49k01K32M9o7o6j0K09P3m8l89L94
3899B34j39j95j5K39Rj98J08J9L3o0K6Q6p4k10J55N3K0j05J10j51OK31k6OO9j82
3925D9J6J9j09R7N3j42J92k42R8J3j4j2m2N3m8P8m0P8n1J35k82R4K11j31n1j09
3951h7K30j06j00J2K32m6k09j88K40J01j71nO5P8p5J48j16%p8J23om0lQ2m0j20
3977g9K28Q2l28K3Q4J72k39j6L6O9q7N6m3J11k04P2K13Kk00R8J65l17N4L5J71
$$ plain form
3798 -90 5 -44 211 -103 -332 14 150 -16 24 37 43 -181 66 134 40 140 -195 59 100 69 102 290 -84 -10
3822 -10 91 115 -115 62 141 81 -53 37 153 125 -65 -9 72 32 19 134 149 54 -121 38 42 -110 33 126 4
3847 4 -3 98 5 191 128 69 35 119 -11 306 103 -10 -99 60 144 74 34 164 102 -15 -109 243 264 28 -90
3872 -90 133 -48 -88 48 55 0 -36 -26 -71 -71 16 11 54 -2 -91 58 -143 89 138 71 5 -5 204 277 229 -160 234
3899 234 95 -100 -115 124 133 -65 43 62 95 35 61 147 73 -137 18 71 91 -14 96 -55 -49 182 156 162 231 49
3925 49 65 84 -25 72 125 -17 175 -67 31 44 30 18 -24 29 -19 59 19 97 46 181 -101 -7 204 73 22 -87
3951 -87 143 37 -63 -51 181 135 -74 -262 -22 79 -92 -97 -32 46 -29 119 3 3 -75 48 42 2 -1 81 41 -79
3977 -79 149 231 -97 -74 10 182 -57 -73 -37 32 -55 1 -42 69 -135 -63 150 152 -48 50 215 -102 -48 -13 158
4002A58q5j68M2K0N5j28P5J62k11L5L2L6l38K87N7j31J30J17j17lq4m7J21q8J2
4027f1J93L2j76J1o8N9j04P1R5k29O8N4J78q9m3J33j45jP2r8J16k66O5J94r7N0
4053A4k5J31j89L9J23J36j61j26K0l2J23l3L3R6q5k53J84P6n2J11r6n7r9J78L1
4078H7j63N0Q2k64J07j0J50Pk8j73J71k0n9n6J80M1k78J17RP3p1J41j82mP0Q4
4104F1k9N1j4r4j5j08Q4l4Q2q6K10k05Q3k1J87l7j45r2qJ12n1J82k12J35k16J61
4130a9r5o6L8J74n7j72O6J36l7j23J07k2J4j68L58Lj63j0k7J50k95K44P1j09k56
4155b58K94j54M6J02o7p2N9l0Q9L3j73M9K7M1j22J05J64k07rp1J90j73R9lQ1j13
4181g3j21K12MK1L6l0J2l5L0M8j03j51J41J96k78PJ15n2j8MQ8j1j29k1L29j85
$$ plain form
4002 158 73 -95 -53 -33 22 -106 -31 131 -80 -45 -13 23 -315 -28 29 -102 28 145 28 25 -59 -106 15 -73 -61
4027 -61 132 164 -12 -1 -69 -10 -114 -43 52 -177 -109 -55 123 34 -9 124 -21 -22 50 -48 68 -198 -133 61 -36 14
4053 14 -11 120 -69 -30 93 229 68 -58 -38 -70 53 20 53 149 64 -189 -5 71 19 130 34 -23 -122 56 87
4078 87 -76 -26 56 -208 -101 -111 39 46 18 -155 16 -4 -63 -119 61 102 -176 -59 -50 23 -48 93 -89 -93 -23 61
4104 61 32 83 69 -25 -40 -148 -64 -98 -16 -102 108 -97 -14 -35 152 115 -30 -122 -130 -18 -69 113 -99 36 -180 -19
4130 -19 -114 -180 -142 32 -25 -197 -131 5 -32 -155 -48 -70 -56 -224 134 137 -26 -36 -63 87 -208 36 107 -2 -258
4155 -258 36 -118 -72 30 -37 -109 -50 -80 9 42 -131 -82 -55 -14 -136 -31 133 -74 -83 -154 36 -137 -38 -41 40 -73
4181 -73 -194 18 22 43 79 49 61 26 56 104 1 -150 -9 187 -91 -84 31 -21 -39 -35 53 42 -87 -108 221 36
4207C6j28J38K8p6N1k21J72j4J13k73J79k9k48L04J11p4p3J01j68J03K0q8J0K7
4231Aj15J16j18o6K61j79k8K38o4j9j5L2j47J49j82K95k68K86k59P6jpRK15p8
4256A32j68L0Jo5j97M72k62P1o5L1J50k52L7K18m1j48O0J24j10m4L6j11J44q4
4280d1L3j26K05o4n2P4j57J15J09RJm0J0j01P3k9j8J3r5L7M3N4q6N6j38RK33j13
4308A4j3l8l6r3K40j20N9Q8J08l28O4L9o7J04R7lq8j4n9N7p7j23J45J38j04R1
4334H1Rl3p7L4O1k9j02n1jJ86k14J98K5p8LL8p8J52j31R5q9n3J29M4k63K69j2
4361A13j08J0N6n7M5N8k03J73k29J6J31O9O7j92P1J30j34j6Q1j5k57O1J89R1j85
4386c5pJ61m9l34J50J02n4M9J10o3j28KM3J52j01OJ22J5j49p1R9R7J00o8l81M37
$$ plain form
4207 36 -92 46 74 -2 49 -172 0 -14 99 -174 5 -24 -272 32 143 69 -4 97 -71 32 52 -36 -26 1
4231 1 -114 2 -116 -182 79 -100 -128 110 46 27 12 44 -103 46 -136 159 -109 177 -82 -6 -7 -14 -5 210 132
4256 132 -36 -6 -5 -70 -267 205 -57 14 -51 -20 130 -122 -85 133 92 -56 4 128 18 -26 10 -101 43 -41
4280 -41 -8 -134 71 7 -45 29 -128 -13 96 105 106 66 76 -25 48 19 1 14 -81 -44 -1 53 -33 23 -115 -106 127 14
4308 14 1 -37 -73 -166 74 -46 13 101 209 -119 -55 -16 -83 21 118 115 27 13 -46 11 -66 -189 -44 94 -10 81
4334 81 90 57 -20 14 75 46 -56 -107 -108 78 -136 62 87 9 12 50 -28 124 -7 88 -1 -54 75 119 -144 125 113
4361 113 5 15 71 14 59 117 -86 87 -142 -126 5 74 141 -51 20 150 16 0 81 66 -191 -130 59 150 -35
4386 -35 -42 119 70 -264 -114 -12 -66 -17 93 30 -98 -96 -53 99 -2 4 126 141 -8 -79 20 117 217 149 -232 205
4412B05k36l6P5j25J68R6n1j61R9Kl6J2O9j24J05j50R4J25l1k49L19j32k3j09
4436i4Q0N2m6R6O4m9j78N0K18j85j89J65j29O0L0L37l44J83j52k3J15j70K41R1
4460B23j54j26J19Jr4J5K30l17N1K24L2j6j53N5k70K39n2o4QO2p5L6J32r0L2j8
4486C0o5k7K12M2k72K45l04J72P4j00K4l4K08j76Q5N2k14n0QR4j19J58Kql12L15
4512D0R5j58j56K62J7j18j49P3J78j48n6M6J29j02m7J07J12j16mq8j12J86l8j7
4536f4j11J45p5J13qQ4j09J5L2r6RJ88j87Q3J19j96J59K6k86n8J78N4l6k3MJ41
4562A01j2p9m0R6r9L7j37J85l8j6LP2k04L4J18j9m0j9k1P2j03R0P2R9k62l2K54
4589A12k53R3r7M4O0J06j46K58m43K94P6j1q3m3j94J91k6J60o6k3K0k4k5q6O3
$$ plain form
4412 205 -31 -67 8 -117 51 147 96 -65 34 36 0 12 81 -43 62 -88 6 131 100 -149 170 38 15 -94
4436 -94 -14 38 -8 88 152 103 -75 -25 193 8 -181 -16 -145 -85 -55 282 -62 121 -31 -54 61 -109 132 223
4460 223 69 -57 62 63 -31 -16 214 -103 -52 172 204 188 35 90 -180 59 7 -57 -49 13 -62 -26 106 16 48 30
4486 30 -35 -62 150 192 -80 165 -139 33 107 7 31 -3 205 29 114 166 -48 -98 -90 4 -115 43 45 37 -275 40
4512 40 135 -23 -179 83 100 -18 -167 -94 84 -64 -120 -74 55 -47 -94 13 125 9 5 -83 -195 -9 -47 -64
4536 -64 -175 -30 -105 8 0 84 -25 -10 22 -74 -65 123 -64 19 138 -58 101 127 -159 -217 -39 15 -21 -44 -40 101
4562 101 89 10 -30 66 -33 4 -133 52 14 -2 1 73 -131 -97 21 2 -38 -57 -78 -6 -109 -19 53 152 -110 -142 112
4589 112 -141 -48 -145 -101 -41 65 -81 177 -266 28 104 93 10 -33 -227 -36 -62 98 32 9 29 5 -20 -106 -43
4614d3M5Q5j69O7N6k3jp7K11k75J55j49R6M5N3j42j73K58o3M5r4R5q5P4n9Q4M7
4641F3j09p7l3K15L2j64l6K1J63q9m6k6J96o8j06J29j73J48R5j57pN8L8J14k00
4666a9N0K7k02J6L06j43k40J49J17l00L05j45nK40k40o1J17j2JM1K2K7j93J09
4690c3PL1j11J47j18P8mN5j51M8M3K5j73L1M9%J11j18P4j00LJ8j9Q1J2p8J26P2
4718A06k49L46j79j31J1R8J89r1o4j73J76j8j92M55j01l33M0M3j9J94j32M2R2
4741A10j84Q8J9J04j77K0Q7j74J59m0K06k58O4j65R7P0j33J30j6Q4j97J19l9Q8
4765F2j76K3L2J84n2J04k03j13K96j04j28L4K30r4k10P2j8n2M9K3O0m5l2J20j21
4790e9L7M0LMq4L1N3J34k90K11R7j36n6R5j83jJ24MN5k05J25k1J12k00J10K4J
$$ plain form
4614 -43 2 87 -82 -15 41 18 17 -60 151 -124 31 -118 -22 23 76 -66 -239 19 -44 1 -93 2 -83 -9 -68 16 63
4641 63 -46 -123 -156 59 91 -73 -109 -88 75 -14 -60 -86 110 42 -64 65 -108 40 135 -22 -29 29 67 181 -19
4666 -19 31 58 -144 -128 178 35 -205 -56 61 -239 66 -79 -84 156 -84 -145 -28 -40 -39 2 24 51 -142 -33
4690 -33 -26 5 -106 41 -77 1 -3 52 -99 -51 -8 17 -156 -125 -76 -76 35 -83 -9 -109 -106 -88 -107 -26 -14 -92 34 106
4718 106 -143 203 24 -107 -96 2 191 100 36 -137 39 21 -171 284 183 -150 -110 -67 -86 108 -24 18 110
4741 110 -74 14 33 137 -40 -20 67 -107 52 12 218 -40 24 -141 -44 26 -107 23 7 91 -106 13 -26 62
4765 62 -114 -91 -59 125 73 177 -26 -139 157 53 -75 -41 189 95 -115 -43 -61 -113 -64 -41 19 -26 -58 62 -59
4790 -59 -22 18 21 25 -59 -28 25 159 -131 80 177 41 -15 80 -103 -104 20 24 79 -126 -1 -22 90 -110 0 24 25
4817B5k1J57l51k6L07k05O8J20j74J61j01k6R8Om9q9n6J34O1j28NJ8O1m4L4o1
4843g6M7m2J03j00O8O1r4J20j10J68n1k13J76M3j92Qo8R4l2J9MQ2R8j02j45Q3
4869e1J03j32l6J65o5R3j38P4j63J55J60k34J50l2j25J67j88M3P9k02K37l2k2
4892Fq1n8L45j70j2r4Q6J9j01j6J05m3k12K4K36j42N2P6j69K30R6k59O3j4JJ24
4918I2L3k4k64K33O5k33L6J39mj19J04M1m1%k9k3OJ04p2r5J57o7m7k3P4m8m1k6
4946g2nJ87j51m2J60N2j51R4j5O0j13L3K9l4r3n5J91J6L1p2j17k9oM1o6L70j95
4973D8j2K8O9j95J51Lj48JO4Q3j29j60L20k4r3j13N8J73j82O0O0j37O2J87l4k40
4999a00J11L3k1j3oJ41l5l78K30j3J85j51j25J82R0r9q1J96j56j4P5jj34j51L33
$$ plain form
4817 25 4 161 -190 -216 91 -114 -46 74 -100 61 -40 -66 32 38 -11 -100 -156 -22 39 -89 -84 -66 -5 -49 -15 -76
4843 -76 -29 -71 32 -68 0 61 -33 87 -23 145 94 -119 57 100 -92 -84 -152 -58 -90 -71 -67 15 113 11 -134 -51
4869 -51 52 -80 -116 49 -16 77 -61 13 -150 5 165 -69 81 49 -76 91 -97 -54 25 -177 60 28 6
4892 6 -75 -133 212 42 30 -64 22 41 -60 -76 29 -14 -226 -202 34 -108 -56 20 -149 81 177 -82 -19 -33 -32 92
4918 92 125 101 -163 70 135 -98 -62 77 73 -46 58 99 58 58 29 6 12 116 44 -51 106 39 -8 -31 43 -5 -46 -72
4946 -72 -77 110 -41 -83 77 129 -22 72 57 117 4 37 66 32 -61 -116 75 91 122 50 -67 -96 -102 -61 -127 243 48
4973 48 36 64 133 -62 89 92 -56 -55 9 92 -37 -197 123 99 6 -107 -49 124 -58 2 62 -75 -13 174 140 -100
4999 -100 11 44 23 10 4 145 110 -268 -38 -51 134 -17 -142 40 130 31 -50 146 -10 -24 51 50 -84 -235 98
5024I8j08n8J6J9J28M3j74J30m4M7q1J17r4r7R5l0q4j6J52m7onr9K2K14l1J3q6
5052C4j56J21L9r6j21J96o3l1M3jJ01k2o3K5k8K8j1M4K4oj10m4r0K28jN6r8q6
5080h8J97j22Q5j14J12o0j17K40k30n2L02p1r2J0JJ81j40j32Q4r3L9Q3J21pk75
5105a38P6L2P9rk0o3l7J27O9j64N0r6R2k3oO3m6r7J25j16Pp1J76p3J29J8j51J6
5133e1L7j11K67n4p1J7j26L9N0KlP9N3r4n5qQ7n3o1Nr5K74r4m3j19L1R2l2o4J04
5163CN3n9q2K07o9N0p6Ok8j97N7L4K53l72J73L0K42k29n7Q9m5j58J99L0j43l8
5189a27Q8K5O9k6J63r2r7o2j6N3j7K45k15L0q9m9K76j58k03J43J90j49J04j50
5213f4J64p1r0K6m8M7M4q6J72n1k15K53j81Q0Q2p7J9n9J03k8m5r5J03Q1j05n4
$$ plain form
5024 98 -10 -68 -52 -33 95 138 -36 94 50 97 16 133 39 -58 37 7 -77 -93 59 12 6 1 -98 -76 138 107 120 34
5052 34 -122 -1 38 -58 -179 17 -46 -77 -34 -35 66 44 -19 6 -22 6 -5 39 63 57 -53 -97 -187 41 40 96 -2 -88
5080 -88 109 -13 72 -42 70 10 -107 133 -97 -149 153 82 -10 0 1 182 42 -90 -6 -99 -60 23 144 137 -138
5105 -138 -62 -30 49 40 20 -43 -80 47 116 -48 2 -94 -2 -25 -31 32 -14 -111 14 -102 -95 -166 10 -63 66 84 -67 -51
5133 -51 -14 -125 142 88 17 34 -92 -53 -3 -1 -4 75 128 34 -21 -29 58 5 -56 -51 -146 128 34 -9 -128 -97 -5 -37 -101 3
5163 3 56 -3 -85 122 53 103 27 33 5 -192 -135 -101 152 -220 -47 -17 225 -4 -61 28 -17 -175 24 54 -89 -127
5189 -127 -39 -14 55 29 192 100 3 -59 -75 -22 -39 206 -9 21 -68 -117 159 1 -202 -59 131 -18 86 -64
5213 -64 100 29 -61 -35 -83 -36 8 -78 94 43 -172 81 -100 -20 62 -15 4 -55 48 20 -25 -120 -17 64 -41 -95
5239i5J41j70J44o2M4O3m5o5N3j34J47k25J38P7l1J91j23o8r9K51k03qJ4J77r9
5264A3j22M4J75q5K5J3o8q4L7K7j2j29R9J15p8J54j92O7j40Q3O3K2M5j52L6r4
5290a38K1R4J59J0j00m8N8K3j14JR6k30K18m8O3q5O1q5K2N0r6o9O9n5Q9K63k95
5317f6j2R6Q2j12j6K8P1n4L8r2K45j24k04J58o6k07L03P4j36QM9J14j69r4J92
5342A06J8q5j0j6j06O9j7J60j98k6J22r6P7L3r6L3L4j03J35P1j22O7M9j74M7P
5368b1k8J63j48N1l7r2K38j29n0R0P1j71J50j97L05k3k18j3k0J11j5n5J18l5k
5393D3r2J54r3r3J5O5M3o8R3j89P7J5j0N1j08J14R1j63J16q0M8N1k6r5N8o3L4
5420a2j7P9q8l5RN7P5j59J56L1K24l07j16K71j61QK63l48m7Q8J36j31Kp7K18l34
$$ plain form
5239 -95 46 -124 20 -42 2 65 20 -45 8 -126 21 -204 -66 11 -20 171 48 -20 -119 132 -71 -79 -65 112 13
5264 13 -109 -65 110 25 50 63 -5 -89 -52 -25 -37 -166 -67 48 -30 124 -68 -1 -141 -58 5 27 72 -80 -44 -138
5290 -138 -117 -23 136 146 46 -2 56 79 -35 -34 62 -168 50 2 65 -20 41 -44 -22 28 -68 -137 -68 -123 -34 229 -66
5317 -66 -78 18 100 -12 -28 0 71 17 55 -37 208 84 -120 38 -28 -235 68 142 6 14 63 177 8 -86 106
5342 106 124 39 29 13 -93 -24 -41 119 -79 -105 17 -79 -2 31 -65 -32 2 -101 34 105 -17 50 99 -75 -28 -21
5368 -21 -49 114 -34 17 -20 -112 126 -3 -53 37 108 -63 87 -110 195 172 -46 -59 -79 32 17 -38 80 45 43
5393 43 -49 105 12 -81 -66 -1 42 -26 67 -122 -45 -30 -40 11 -97 17 108 -55 61 -19 29 80 54 -41 17 -46 -12
5420 -12 -29 50 -38 -73 -64 -7 68 -91 65 96 320 13 -103 168 7 15 278 -70 -117 -29 107 -24 -22 -99 119 -215
5446b15K36J51j98n6P1Q1Jo7J75j58o1PJ86k81J19J61j79J20q8j90N6J15K5j95
5470a84J48J36j01MK1j13L2K17j54k6L7j2j4j37k2K30o7j12P2R4o3L5o4J8l1M0
5496a6O5p8Q1n7j0K4j19P6R3q9P8n7J4M5rJ9R1j05m7J23k78L0Q4K4l6L8o8m5J20
5525iP1j67M6J38k9J32j80j22O1K42j77k05K66Q0o3k74K22O6j58O8n5Q0O0l10
5549b17J44j3K26j38NP3M9j05J18o9Jn2r1N1pMN0k43L52J4k88J38P9o2k3k47J65
5576h6J46j24K09j49N1j30%M8J05L1k56P3M3J14j13j5Lq7K87j01q3n1R4j6J10
5601A03j85L6J39k37J04n6P3Pl5K46k63J40r6R6r5lq1J56J3r2R3p8L7J08j23j9
5627a2O0kl7r9J24q3K02j86M5LL3j74R7j44J37O4o2L5J6j02j37K89Oj71rK03j65
$$ plain form
5446 -215 21 172 -26 -82 -11 70 71 4 179 21 -40 -33 153 -128 -9 152 -27 93 5 -185 -129 -14 11 -184
5470 -184 -36 100 -1 3 24 -89 -57 160 6 -20 17 5 -9 -146 -168 62 -5 -117 -45 49 -14 21 -43 -25 -56 -16
5496 -16 49 -29 52 -5 -15 9 -110 -34 59 -30 48 -9 5 50 41 60 151 46 -1 122 -156 -126 -42 -18 -54 -16 -84 -129 -9
5525 -9 62 -105 -59 79 50 182 2 -120 -59 183 6 -199 67 147 84 -190 32 98 -60 8 -47 33 93 -217
5549 -217 -73 -86 140 2 7 80 129 24 142 73 74 22 -69 -18 -25 -21 29 -214 138 152 -136 2 81 19 -4 -251 -86
5576 -86 60 -64 145 -4 47 -83 -83 -35 70 101 -155 -82 -39 75 -38 -53 -50 -137 150 49 -34 -85 9 -7 103
5601 103 -82 -46 93 -144 -40 -96 -23 -16 -51 195 -68 72 -24 72 -23 -26 -107 49 62 -30 63 -15 22 130 7 -12
5627 -12 48 46 9 -90 34 -49 153 -33 12 15 48 -126 -29 -173 -36 28 -34 1 17 -85 -222 67 73 -98 -107 96 -69
5654f9J53j14pJ23j24J60j25J40j28mj36M3l5J48O3k39R4P6j1k9Q7n8j68K27K9
5679I6L3r0q6M6q0K32j68L4j02n9J64L1k18J13J57j38n8l9J73q0qJ7l0O6K4j06
5705g6J20o0r9J61k1j26J22J5m9oj3ol3J02m2R4p6j7j29J75m7j01J26Q0o1Mq5
5732d8J37j3j7R7k19j74K54m0L2p1j21K42m5m1K7K6r9J20j07p1L59k00On2L4O0
5758G6j62K0j89K35J25j13O4r1P3O8p4j3j07J62j26J67l5r0r5J63j67N1R3M5L7
5783A17j66P4j6r1m0K47k29PK0m4nK16n5k8M7j33K13N6k79m8P7Q8q5j49L06j04
5809dKl8j6J81mn5l8O4nq1L6j61J88q0J28l71K60O3L8k17J02Q9k18J60j71N3J61
5836F6j08Rq6J71k9l8J55p2o3l1Q9j61m7J00L4K5N1p5Q9k70J35L9L3o1O1N2j48
$$ plain form
5654 -69 84 -30 -37 86 -38 122 -3 137 9 5 -131 -88 -123 25 88 -151 -57 19 8 -21 66 8 -160 67 96
5679 96 129 39 -47 -1 -81 151 -17 17 -85 -144 20 51 -167 -54 103 -35 -93 -132 41 -39 -47 -30 -60 6 30 -76
5705 -76 44 -16 -115 46 25 -101 21 36 -13 -19 -32 -38 -71 31 -11 83 7 -10 -139 36 -11 -112 14 94 33 37 -48
5732 -48 89 76 59 156 -63 -237 17 -23 9 -62 -183 59 14 -27 0 26 -73 47 -60 -131 228 28 34 -18 16 76
5758 76 -86 -66 -255 -20 105 -8 56 -35 38 106 32 19 -88 74 -52 115 80 -10 -105 58 -109 -58 35 80 117
5783 117 -49 25 9 -82 -122 125 -104 -97 -77 -121 -126 90 35 7 54 -79 134 190 -89 -137 -60 28 -57 -206 100 -4
5809 -4 -2 -40 -56 125 121 66 28 92 87 6 42 -119 69 -11 117 -254 6 69 107 -110 -8 81 -137 23 -148 -95 66
5836 66 -42 -33 -119 52 23 -15 140 68 5 -26 63 -98 -145 -45 -11 14 65 -10 79 -191 -56 -17 16 -45 16 68 -80
5863h0J21j03j6l9J30O9p8M6j0k6k2L9m8j11J90r5R1p5J92j81l9L1q0J28Nlk1
5890A5O1l8Q1l23J54j9R9J71k47J79k15N4k5J31k8l0k0j5J2N0k2l0k1m8P0o0J
5917f3J4K14j17j25Q6jm2J5J71k94J6K13j27J23j47J42r5P0k08K27j4j14J26k2
5941D8j7N3p9j8o9n6J47m4oJ1o2J57q1J29j35N5j99J16J16n2j55L08q3m2rj04
5967g1J29k0J86k75J6p9J44m5N1j2N1o5Mj30L29J6k30mK46j70o9j64K94k14K27
5992A45j34N9%L5p7k3l1L1R7j88J66k19O6o2n4J18MO4K56j81k6k5N1o2N4pj18
6019f1K05r3J3j11P2n2J6K9q3J93o6k35J07m2J8J57p6M8j08l8J47N7o6J76k51
6044d4jo3K05k7R0j53q6OK5k1J37J30k09J9m5lr8P9J5L9l5j00J98l2k8N8j52J5
$$ plain form
5863 -80 41 -62 -78 -117 13 82 4 50 40 14 -8 31 -17 -128 62 -33 58 -17 175 -6 -45 -14 -94 34 39 36 15
5890 15 76 38 119 -204 -50 -69 30 201 -46 133 -82 -28 -53 78 50 20 0 -15 -3 47 25 -5 -26 -74 -4 -64 -63
5917 -63 -49 165 48 -77 9 8 -34 -19 152 -142 -126 87 -40 83 -64 78 -17 53 -155 72 58 -56 70 48
5941 48 31 84 5 -13 -82 -138 9 -35 -41 -30 -92 65 -16 113 -22 33 -166 -50 66 14 -141 167 84 42 33 -71
5967 -71 58 38 224 -51 -35 -114 30 -15 36 24 75 10 14 -116 213 229 -1 -5 241 71 2 -162 132 -82 145
5992 145 11 70 70 105 28 5 -26 5 102 -86 80 -139 -73 -135 -189 -71 -67 -3 253 72 46 21 72 10 64 57 -61
6019 -61 144 51 64 -47 25 -27 -11 18 -65 128 62 -173 -66 -108 -90 67 -9 39 -69 -107 40 97 31 207 -44
6044 -44 -45 -108 97 70 160 7 -79 -73 -48 -69 68 198 -11 8 -37 -40 -138 -59 -44 -5 -40 -140 58 26 -2 56 -96 -81
6072h1P9o6O8r8Q3J8o3PL9K19k97J29%%L7p8J09%j90J54o6l4J28J2j34O7j6Q4
6100A10j35j03J53j19O3P8O1j31M9k5K0J16j50q5R4L0q6J46o9R8K6lk86J24n4
6125g8J78j13J08j2m9N2j56p7J40m1P8J00l0j56m2J04RJ59l15L01m4j47l8J1K00
6150A42l37K00j09J23N6j15K4O7k5r0mK06j88m0J18K3j7j40J91k10%K30j42jK6
6175a2k6q2J87n5k7M9k08Q7R0p5O1lJ42j27m5Q1J24m0q9k3k21QJ51k0Np4K14n0
6203B2k02J14L3M4R0k39J59J0P8k11J88j36J38k5p5K9j79j28K85p9J41k6J05l10
6227a74J10P6R6p4R1L2k04J22p3k7q4J43N4K6j5k39L23o2l90M51k68J48q3q7O5
6252d3j09J18k3O6Jq9J20J2k26J95J42j13O4j20K0j37K0J51l8j36K25j44kJ31
$$ plain form
6072 -81 -2 -68 0 -98 -15 3 -60 -53 -14 205 -92 37 37 37 74 -4 105 105 -85 69 3 -31 97 109 -25 42 26 110
6100 110 -25 -128 25 -94 -31 47 108 -23 26 1 21 137 -13 -98 -4 26 -60 86 17 115 141 138 -148 -24 -78
6125 -78 100 -13 95 83 34 86 -70 -147 -7 -48 30 130 100 -56 -98 6 15 174 -141 160 116 -31 -69 -58 142
6150 142 -195 5 -104 19 75 -40 -16 51 26 -64 -68 138 -50 -90 28 51 34 -106 85 -125 -125 105 -37 -38 -12
6175 -12 -38 -120 67 12 -15 34 -174 -87 3 -72 -11 -14 128 1 -44 37 161 121 32 9 -212 -204 -53 -73 -68 -142 72 22
6203 22 -180 -66 -33 11 101 -138 21 31 109 -102 86 -50 88 63 -12 17 -162 -290 -5 -84 57 31 136 -174
6227 -174 -64 12 108 34 125 157 -47 75 2 -25 -109 34 88 114 99 -140 183 121 -269 182 -86 62 -21 -108 -43
6252 -43 -152 -34 -57 9 10 -79 41 53 -173 22 164 51 115 -5 15 -122 -102 49 11 -125 100 -44 -46 85
6276H5j60J23L3L9q9M7qj58J30k5j8p9j37J89J70j47j7o1O2k05K47n6j84J98J
6301b0R0Qj42Oj3N0KN7l5K1j3o7J29Q2j45m3k9K2J75p0j83J70K1j5K4l9j52J49
6329D0Q2j83Q2J1j9l7%j20Q8J43j40L15j49m8O0j69j54Q6K68O2p9j12j35oK49
6354A35j58J2J10J39k42N0m0j26K09l66L74J1j12M5j10J17L5j76K01l5j46J22
6376D9o5J01j57K22j21r1L7J18n3j68K52j26j05K04k32L00k44M5N8j3k7j40K25
6399F9j63R0K43j49j02J3j43O9J68q4M7n5n1m5K19j26j19K81j82j16N7OjJ9P7
6424B2j00J53mJ22k13j90K62n8R5r2J4k0k%J27j12%q5J14N7j49O6RQ7k01O3p5
6451a10J96l6K2l1r1j6j1R6P5J1j53p4K53j39q6L40k23k8M7j00M2oJ8K7n0N9J5
$$ plain form
6276 85 -75 48 81 120 31 78 70 -88 42 17 -1 -80 -217 -28 142 -5 -22 -83 -21 -226 21 -35 -219 -21 -20
6301 -20 70 78 -64 -58 -71 -21 -19 38 3 24 11 -56 73 155 10 -33 -62 -40 135 65 -118 52 73 58 82 43 -109 40
6329 40 122 -61 21 32 13 -24 -24 -144 -56 87 -53 262 113 65 125 -44 -198 -112 156 218 139 27 -108 -114 135
6354 135 -23 -11 99 238 -4 46 6 -120 89 -277 97 108 -4 41 -69 48 83 -93 108 73 -73 49
6376 49 -16 85 -72 150 29 -62 -25 93 40 -128 124 -2 -107 97 -135 165 -79 -34 24 11 -16 -156 69
6399 69 -94 -4 239 90 -12 1 -142 -73 95 11 58 3 -48 -93 126 0 -119 162 -20 -136 -79 -73 -74 -55 22
6424 22 -78 75 71 193 -20 -210 52 -6 89 -3 11 -9 -11 -11 116 4 4 -81 33 90 -59 7 16 103 -98 -35 -110
6451 -110 86 50 72 41 -50 -66 -77 19 94 105 -48 -122 131 -8 -94 246 23 -5 42 -58 -16 -22 -4 23 -27 32 47
6478D7j25J78j30j5K1J38K6j10J6r6j6K0JO6l7K7n8J69k41J07N5J81j78j46K33
6503A33r8RL5k11J78K8l1k1j01O3j04Q2J10o9K6n2J57n5j85J51l9J03m5kQ1k68
6529a25O8K80j96j14O9K9p3L4J6m0J90k36J14o3J27N3j72J01q8J49r2m8RL4M6
6554G2p6M3J24r1j19K3R8k04%K12j9j86K7J54j00n0K12N6k31J40r2J8qQ3r2p3
6580g9J59k08K02p8J3j07J97M9j25Q0J8j33J54k96J76O1l1k34K28l2M8j46nP7
6604a2o3J22O3j47N9J9q9J04M4r6n5J87q6j56j6K41m6r7J39j11k3K6L3p7J10p0
6630CJ54j02j08J09n2k2j5O4j7Kp3k6J19M6Nj47Q1j4%O3r5Q6l7j26K7R5r4k6J75
6659G5k04K55K9K2k82J14m0m3J05M1j62o2J33j17J80RJ1p8J15K6n1j47K09k52
$$ plain form
6478 47 -78 100 -30 -45 -24 114 140 30 46 -50 -66 -46 -45 21 -16 11 -47 122 -119 -12 43 224 46 -100 133
6503 133 35 44 79 -132 46 74 43 22 -79 -16 -120 -38 72 3 29 -23 134 79 -106 45 6 109 64 62 143 -125
6529 -125 -57 223 27 -87 -18 11 -62 -28 -12 -52 138 -98 16 -47 80 133 -39 62 -26 123 31 -17 -8 26 72
6554 72 -4 39 163 72 -47 -24 74 -130 -130 82 63 -123 -96 58 -42 -92 120 176 -55 85 -7 11 3 86 -6 -79
6580 -79 80 -128 74 -4 9 -98 99 148 23 103 121 -12 142 -154 22 83 52 -182 46 14 62 -84 -89 -12
6604 -12 -75 47 110 -37 22 41 -48 56 100 4 -51 136 50 -106 -122 119 73 -24 115 4 -19 7 40 -37 73 3
6630 3 157 55 -53 56 4 -18 -33 31 14 16 -57 -83 36 82 87 -60 21 7 7 70 -25 61 24 -102 -75 20 -74 -100 75
6659 75 -129 126 155 177 -105 9 -31 -74 31 72 -90 -152 -19 -136 44 53 64 -14 101 127 76 -71 138 -114
6683a14l2k5k2P2J75r3J45J15l45Q9kk5M9j0K54j58R9o2j8Kk5k12J55K00k57M3
6709bJ35n5j97K41j22R7l5j52N3Pn8J26L5k20K60n4n8J04k81J67M7r7JJ18Lr8
6735c5J64j41N0j46J79j64R2j53m9K93j32M7j47J29K2n8M7kJ03j78l4J83M2j07
6759EJ20k7j96J75L0j92L3K45l00J78k13J65M8j45Q4L9j0j7P6r3K0j08P6k8J13
6784G8j04J96l41K63n3j06O9m3P6J1p8J39q0j34kJ30o9K7R4j13J4L7j7j23K01
6809G2lk02pK19j14P5p0nJ60l1j14o5j14J74M7lq4Q4l1L6K3Q3j13m5J7r8m9J63
6837EK8j74J51P4M7j11n5J47j8L1j21O3k8j3j6l9J12q4N4o8m7mK2j19J37l8Q1
6864A7j9L4l4j54K43j26J48r2l5o5J27k00J11m8Q8lK8M4k09K09n8K00j91O2l6
$$ plain form
6683 -114 -146 -171 -193 -121 54 -39 106 221 -124 -35 -37 -62 -13 -23 231 73 172 110 92 94 69 -143 12 212 -45 -2
6709 -2 133 78 -119 122 0 97 62 -90 -37 -30 -88 38 73 -147 113 59 1 105 -176 -9 38 -59 -58 60 63 -35
6735 -35 129 -12 38 -108 71 -93 -1 -154 -203 90 -42 5 -142 -13 9 -49 -2 -4 99 -79 -113 70 112 5
6759 5 125 98 -98 77 107 -85 -52 193 -107 71 -142 23 71 -74 10 49 39 22 98 5 25 -83 -7 -35 78
6784 78 -26 170 -171 92 39 -67 2 -41 35 46 -32 107 27 -107 -109 21 -48 -21 73 -40 -26 11 -6 -129 72
6809 72 69 -133 -140 79 -35 40 -30 -35 125 94 -20 -85 -199 -25 22 19 -65 19 -12 24 47 130 17 -28 -11 -109 -158 5
6837 5 33 -141 10 84 131 20 -35 112 94 125 4 67 39 26 10 -29 83 -1 53 -15 -62 -66 -44 -163 -26 -64 17
6864 17 -2 32 -2 -156 87 -39 109 17 -18 -83 44 -156 -45 -93 -5 -8 20 64 -145 64 6 206 15 77 41
6889D1mMq1Pk8J47j84P3l2K41j99q3P6R5r8p6J53r6m4J96j83N9J01K6J15k25N4
6916E5o6J35j4j81O4oR9j53O8J51k24Q0R8o1LO6j39j33J09Q1m2P8j36N3J19k34
6942a30K44j9k07J59m7k3J07R2l8j57M3O8j05J28r9Rj5k8n4J01Q1r8Om9L2J82
6968A83j85J8l1L4M1J22k20J72R0j98j14J02L3j34J49N3j49K2K29k42j1K13j61
6991A6j4j6K27n2k35J24j69J41M9q8Q2j32K81j55k4k12K49j67K22j39j5m7k8K45
7015A43j06r7M4K14j66o3m2J39o6o0J41j11j8p4O7J9Q4o0kP5p0m9Q9p2J14q2j0
7042a9N2k7M8j83Q9J10n4N4j11MJ47j22m4J8K4J12n1L4P7kj72J54j07j1%j21R7
7069dl9J17k10P2J25m1j46K60j59o7P8q7J55J11j35r9LL8r0L20l04R6o3j8K89
$$ plain form
6889 41 37 41 -40 -33 -61 86 -98 -25 -57 184 -15 -98 -22 73 -25 -101 52 -44 -88 108 -75 -16 85 111 226 1 55
6916 55 -11 124 110 -71 -7 -13 86 -67 1 152 -72 8 106 45 48 114 -25 -158 -49 32 -10 68 -68 -15 104 -130
6942 -130 114 95 -112 47 0 -23 84 176 138 -19 24 92 -13 115 16 25 10 -18 -72 29 110 12 18 -31 1 183
6968 183 -2 16 -15 19 60 182 -38 134 224 26 -88 14 47 -87 62 115 -34 -12 217 -25 -36 177 16
6991 16 2 -14 213 161 -74 50 -119 22 71 -17 65 -67 214 59 35 -177 72 -95 127 -12 -27 -74 -102 143
7015 143 37 -60 -16 198 32 -31 -73 66 0 -60 81 -30 -48 -122 -55 -36 48 -12 -14 61 -9 -58 31 -41 73 -9 -19
7042 -19 33 6 54 -129 -40 70 16 70 -41 -37 110 -12 -56 -38 -14 98 47 81 158 156 -16 138 31 20 20 -101 -4
7069 -4 -43 74 -136 -64 61 20 -126 134 -25 -92 -14 -101 54 165 30 -69 -66 -28 -118 202 -102 -6 -69 -87 202
7094B02j48J31j98n1L5P2j02P0Q3n9o3P5k1J3M3k86J50Q8J0p1M0l2K2j02P9j15
7120a35K59k50Q9n0K47o1k20P4L7K09j56o0O4N2r2L0K0J1j3rK7p8M6j2j25P0j23
7147a49K9P6o3J97r0j25M6J09N0k45J84nMr8J62l5q0P8%L0R%o3O8j53M5p1J64
7175G4Pn3l9l0m1K05j77J0p8Q3J18k9j88J63O8m4r8j3M4K2R9k27L07k63l7N3k8
7202i2J24l9J05j65L0J45O8k46K31k96J95J6j17J33J0j0j32J48r6k9j21J89r6
7225d5j1l9r7Q6O4j38N8K07J6on7K3n8q3N3NQ6N2j39O7j46J42j22R3R4r5n3J34
7253I1p1n0j5R7j31L4K4j4L8rj43J78P9j15q6J16j76J24K22m58J43l1K92j40p
7278hR5j26N4j34N1J14J25k06qQL6R6l3j0j28K2J29l08K02K35k93n2O6J58j26
$$ plain form
7094 202 54 185 -13 -64 -29 43 -59 11 94 35 -28 47 26 39 82 -204 -54 34 44 -27 13 -19 3 -99 -20 -135
7120 -135 124 -126 -37 -87 160 99 -121 -47 -10 199 43 -17 47 99 7 37 57 68 55 46 73 -5 41 29 -96 -26 -149
7147 -149 -120 -44 -107 90 0 -125 -79 30 80 -165 19 14 18 -80 82 47 -33 45 45 75 84 84 21 89 -64 -19 -90 74
7175 74 81 28 -11 -41 -82 123 -54 -44 -122 -39 79 50 -138 25 93 49 -49 -62 -18 4 103 -124 183 -80 -117 -64 -92
7202 -92 32 -7 98 -67 -37 108 176 -70 161 -135 60 76 -41 92 102 92 -40 108 12 -17 -138 51 -45
7225 -45 -56 -95 -192 -106 -42 -180 -122 85 101 95 38 61 3 -80 -27 -22 64 116 -23 44 -102 40 -82 11 105 10 -43 91
7253 91 20 -30 -45 52 -79 -45 -21 -35 3 -6 -149 29 108 -7 -93 23 -153 -29 193 -265 -122 -153 139 -1 -8
7278 -8 87 -39 15 -119 -68 46 171 -35 -43 -35 1 97 64 54 -74 -52 77 -231 -29 206 -87 -139 -73 85 -41
7303d1L6ol2L6k6R4j58L0L8r1K12l2k75J80k6J15N8k07n7K13r2L7O9l5P3j73J07
7330D7%R4j66q8J71K4J8n0j71R6pM7O8r5J0J3l0q0Q3O6K3m8j37l5J40R0l4n5q8
7359i4p9K27O6l3j22p2K43l58J16J98j03q2n1R6J42j9j35k2J13q6J6O8j66J5K97
7384A75p6l4j06j3J87r1O7J1k17N6q5J80Q0j4j04o5r6K72j64P1m9N6l0l5q3J44
7410C7k8r3J41J1j5j02M0J5p5P4j9K9l6R3j03JL9p8jJ09l7q3mJ72qP7j54k5J31
7439A08j62L8o1J35q7N1m2N4j00K01k32N6J27j91K9J3n8L32q5k16J01J4J11j66
7463c0n9L30q3j73j20K58k41J44l5l3J21jj86P0J63j67k5J15J33k17J23n7m4j22
7487a36J95o6L4K9j39O1M1j18J20k3J98l29O5O6N9l1k5o4L5P0n5MJ52l69L16O4
$$ plain form
7303 -41 -5 -11 -43 -7 -33 61 -97 -67 -29 -120 92 60 -215 -35 -61 54 112 -95 -152 61 -31 6 75 40 113 -60 47
7330 47 47 141 -25 -113 58 82 100 50 -121 -25 -32 15 83 -12 -2 11 -19 -99 -16 50 73 25 -112 -147 -7 83 49 -6 -94
7359 -94 -173 54 120 87 -35 -107 136 -222 -106 92 -11 -93 -144 -48 94 75 -60 -82 31 -55 -39 29 -137 -122 175
7384 175 99 65 -41 -54 133 42 109 120 -97 -41 -126 54 134 120 16 -49 -145 127 -37 34 -15 41 11 -24 -107 37
7410 37 9 -84 57 68 53 -49 -9 6 -69 5 -14 15 -21 72 -31 -30 9 -69 -70 39 2 -81 -85 87 79 156 2 -23 108
7439 108 -54 -16 -77 58 -29 22 -20 34 -66 135 -97 -41 86 -105 -76 -63 -121 211 126 -90 11 25 136 -30
7463 -30 -89 241 158 -15 -135 123 -118 26 -9 -42 79 78 -108 -38 125 -42 -67 48 181 -36 87 30 -14 -136
7487 -136 59 -7 27 56 -83 -22 19 -99 21 -2 196 -133 -68 -2 57 26 1 -63 -28 42 -13 -9 143 -226 90 154
7513A54l24K62j24m9j30L41j35O9k5ol9J2m4Q7j54K55r6k47J87pJ16m6j34p7K28
7538G4m9j49J3K9k9J25q8k5J67q8N2j91J57l6n0L8P8P7p8j25J85r2j06J00j6l9
7564f6L7L9J3j1r6Q0j09J03k4j27o0J53R3M9k4P4l37K41L4j19O5j9L5M7k40J13
7590e6j39K64l1J7N1n2Rm3R1j68J31j0j81J03J05k1M4r4L0J34k81J32jj3m7r5
7616a21J63nj18K66k39j03K05Jj49J28p2j01J05K2J7Q4j9r7L4P0k7j70J11j27
7640a42J38j09K4Oj8N8L9J11L7j43l2lJ96j82M2j31J35J40k09P5l9QK12k49o7
7665a03J11Mk3J21j7p7j3J48j25p6k03L67j88M8l4m2K73j25M7J01j58n2qJ63p8
7690F1j80K85q5j40J50r4K01p8k01J40j42JM2R0J14q4j38M9m1R2n1j3m0j37J72
$$ plain form
7513 154 -170 92 -32 -81 -211 130 -5 64 39 33 -6 6 -38 49 -105 150 54 -193 -6 -13 103 57 -77 -154 74
7538 74 25 -124 -111 -82 -111 14 -74 -99 68 -20 32 -159 -2 -38 -88 -50 28 105 27 -98 87 -5 -111 -11 -27 -66
7564 -66 -29 10 23 12 -84 -4 -113 -10 -34 -161 -221 -68 25 74 50 124 -213 28 62 -57 8 -11 24 71 -169 -56
7590 -56 -195 69 38 55 106 54 63 20 111 -57 74 64 -117 -14 91 70 114 20 50 184 -97 35 34 21 -26 -121
7616 -121 42 37 -81 185 -54 -157 48 49 -100 28 -44 -145 -40 -18 -1 83 64 -33 1 71 44 -126 -15 -142
7640 -142 -4 -113 -89 -83 -101 -43 -4 107 144 1 -31 -34 162 -20 22 -109 26 166 -43 32 -7 1 213 -36 -103
7665 -103 8 12 -11 110 93 16 3 151 26 -50 -253 114 -74 -26 -60 -102 171 46 93 194 36 -16 -24 139 61
7690 61 -119 166 81 -59 91 -3 198 120 -81 59 -83 -82 -40 50 164 80 -58 -9 -50 42 -9 -22 -62 -199 -27
7715b7M4r1O4j8n8jJ34p6K6R0j16J86j15p9K6L1P6j52J59p3L7kj95R7O3Q3l6q3
7743fp6o6J30J5j89N9J63m6p2K59j93j29L3J58n4J17k1j32N8m9l1J7m3j8K83j95
7769b8J22j8p0o4J66j80J22J04j78j0o5P6j52J58O8J37j59j9J27K3j14J47k94
7792a01KK11j2j60l6K13j86Q3k2P5k1q5J5q0N8o2J76j7M7j26O7j03%O9P1p7n3
7819e4K65l49K48r4J0m5o3J03j05M8J41l8j03n9J73l5j34rJ53J11nj28N9R6j98
7844a2L2l3J10r4n2l9J01p3Q9k9j7J27j59L4o3P7Jk0J01o7N5r8j00K74q7O5l5
7871H8m5J1p5K1Q9j17n0J01p4p5k6P3P7j31J19pJ01j23J70J1j13K19j61j73L2
7896e8m5M4R1n0M7o9j26J30n4J65r1Q3j57J02J04n7j1p0k7J38O9m0o7J28j65K1
$$ plain form
7715 -27 17 -74 -10 -28 -86 -87 47 -29 -3 87 -29 157 42 -37 -11 20 96 -56 103 30 67 65 -130 -33 30 113 77 -6
7743 -6 -82 -148 -18 -3 -192 -133 30 -16 -88 171 -22 -151 -118 40 -14 103 82 -50 8 -41 -72 -55 -98 -116 167 -28
7769 -28 94 76 6 -58 108 -72 50 154 -24 -34 -99 -23 -175 -17 51 188 29 10 137 160 46 193 -101
7792 -101 -99 112 100 -60 -96 117 -69 14 -8 67 46 -39 -24 -104 -46 -108 68 51 98 -28 39 -64 -64 5 76 -1 -54
7819 -54 211 -138 110 16 26 -19 -82 21 -84 -36 105 67 -36 -95 78 43 -91 -100 53 164 159 31 90 186 -12
7844 -12 20 -13 97 3 -49 -88 13 -60 29 0 -17 110 -49 -15 -78 -1 0 -20 81 14 69 -29 -129 145 58 123 88
7871 88 43 54 -21 0 89 -28 -78 23 -51 -126 -152 -79 -2 -133 -14 -21 80 -43 127 138 25 244 83 -90 -58
7896 -58 -103 -59 32 -18 29 -40 -166 -36 -90 75 -16 67 -90 12 116 59 48 -22 -49 89 158 118 51 179 14 35
7922C5n5pO3J74k47J4N0j16j2J02J37j25J12l6j66j2J61j95J03N2j32J06L9J18
7946A63l09J51ko2J20j25R9O9j53Q8J20j01r5NR3Jj08P9j8M8m7L0o5q1P8L8j15
7973i9J1J03J7L1m8j8P6mj2QQ8j27k13J49k1J04N8j21j14K22j59N3J68k81J26
7998cJ8rJ10j32k9K7OJ56j10k3j11J90j76J42j64K58j54j42J68J03k81J57M5P9
8022A25jj34L5p2rq4J84n6R9k02J42j82J89m9J24j03j23pqJ59J6p8Nk13J78N7
8048hL7j4O0j02r5K57j64R2k93K45k4n8L05l86k9L39k47J11p4j02R3K1q4J09P
8073dP8Pm2m4N1PJ06p6j77K8M9q1%J60n8p9pJ44M1k0j65Q3n5J33n2O6q1K2J9l3
8103B0M6J24j59q9K24j60J4n2j2J83nj82k3l9p2L63k47J25M3j79N2oO0n4j24J26
$$ plain form
7922 35 -20 -27 36 210 -37 -23 27 -89 -101 1 138 13 125 89 -77 -89 72 -123 -20 32 -100 6 45 163
7946 163 -146 5 3 -59 61 -64 35 104 -49 39 159 58 -37 -32 61 62 -46 33 15 63 16 46 -19 -100 -22 16 -99
7973 -99 -88 15 32 63 15 -3 73 69 57 65 153 26 -187 -38 -59 45 103 -18 -132 90 -69 -16 152 -129 -3
7998 -3 15 6 116 -16 -45 -18 -12 144 34 11 -100 90 -86 56 -108 150 -4 -146 22 125 -156 1 46 125
8022 125 124 -10 25 -47 -56 -140 44 -12 87 -115 27 -155 34 -15 109 6 -117 -124 -132 27 43 -35 -30 -243 -65 -8
8048 -8 29 15 75 -27 -122 135 -29 63 -230 15 -9 -67 238 -148 -177 162 -85 26 -48 -150 -57 -36 -120 -11 -4
8073 -4 74 81 39 -5 46 53 159 83 -94 -66 -17 -98 -98 62 4 -75 -82 62 103 83 -82 1 -54 79 27 93 12 34 53 20
8103 20 66 190 31 -58 166 6 20 -32 -44 139 134 -48 -71 -110 -182 181 -66 59 102 -77 -25 -31 29 -25 -149 -23
8129b3J01j6o8K0j31J92J2p3N1P5k01p9O8J83k00NJ72l9j36K01n0j42J32m5j2
8154cjJ02k51J16J79r2j6P8o0o3K2N4j68K18K1j91L0l1r9J86P5p3J08l33K35n4
8180a1o2O8R4j42J0n8n9J50J44p7m2
$$ plain form
8129 -23 78 62 -6 14 -117 75 87 14 65 140 -61 -140 -72 111 -89 -84 88 49 -87 114 64 -78 54 9 -3
8154 -3 -4 98 -153 -37 142 50 34 112 52 -11 11 65 -103 115 136 -55 -25 -56 -155 31 106 33 141 -192 43 -11
8180 -11 -73 -5 89 -53 -43 -101 -160 -10 134 57 15
8191A5
$$ Imaginary data points
##PAGE= N=2
##DATA TABLE= (X++(I..I)), XYDATA
0@%%%%%%%%%%%%%%Qj6J6j6J6k4L2l2L8m6N0n8P0p8Q8j04J20j36J52j68J89k13
36a12K37k65K96l28L62m02M44m88N38n94O55p21P92q70R59j056J162j282J417
55G44j570J748j954K194k481K829l260L812m540N538o988R267j3311K2321o8984
70e4635K483J34384j65601J18706m6587J7264K7127j10624J01463j4953Q265k1276
82c984k8903O6402n2620J6452j3125L8116q18o5648N7385k6653K8940j2579o031
95c066J6853m2119M8683l5420J7915Q440j8485K4677n0607L5743L386J2113j6196
108A917l4705O7044m7525J1860o724J6951L1257r0019N9162r088K540K1509o0199
121c6020O8158m0839k906K3678k7876N4253n9321K8859p365k4181N5456m0655
$$ plain form
0 0 0 0 0 0 0 0 0 0 0 0 0 0 0 0 8 -8 8 -8 8 -16 16 -16 22 -24 26 -32 38 -40 48 -56 64 -72 80 -88 101 -112
36 -112 125 -140 156 -172 190 -212 232 -256 282 -312 343 -378 414 -456 503 -553 609 -673 744
55 744 -826 922 -1032 1162 -1319 1510 -1750 2062 -2478 3060 -3928 5339 -7972 14349 -54635
70 -54635 -52152 82232 -83369 35337 -11250 6014 33141 -77483 23980 9027 17292 -3984
82 -3984 -32887 33515 -19105 -2653 -15778 22338 21520 -44128 13257 -13396 15544 2965 -3066
95 -3066 13787 -28332 20351 -15069 2846 11286 -7199 17478 -33129 2614 6000 18113 1917
108 1917 -32788 34256 -13269 -1409 -8133 8818 40075 -49944 9218 130 2670 24179 -36020
121 -36020 32138 -8701 -11607 12071 -15805 38448 -20873 7986 621 -23560 31896 -8759
133h759K3491k9706J4821K0063m2905L2479l331J4453k7034j8617M4967j4736
145E186P088k5430J4931K2260m9434L0494k794J4229r439k3602K7744j7336J8211
158A2108p727M95r97j0946J8324j9950J4427n7M917l034l3970M1356m441k467
172H038r083p839L8307m4458J0166J3252J290R366m5400L4932q14p995J3179k2223
186i282L0943k8596M436J2953j7378K7558k4096J1226j4676m83L0295k4617O262
199D545o852J0811K009k7323K6037O516o493j5971m403K9706j5728k239p18J0553
213A0450k996j8798J7155q65Q941j3190o63L914q684J6924r085J345l855L23J0019
228A0935k2203J6797O944k889q912j7315L5938j2513q559M575j081J6251l2396
$$ plain form
133 -8759 14732 -14974 -153 19910 -22995 9484 6153 20606 -6428 -25045 19922 5186
145 5186 12274 -13156 1775 24035 -25399 5095 2301 16530 7091 -16511 11233 -6103 12108
158 12108 4381 4876 3879 -7067 11257 -8693 5734 5677 10594 7560 -26410 14946 10505 8038
172 8038 -1045 -8884 29423 -15035 -4869 8383 9673 19039 -26361 8571 7757 -238 12941 -9282
186 -9282 21661 -6935 -2499 10454 -6924 20634 -3462 7764 -6912 -7395 22900 -1717 4545
199 4545 -2307 8504 10513 -16810 9227 15743 9250 -6721 -11124 18582 2854 615 -103 10450
213 10450 7454 -11344 5811 4946 13887 697 34 3948 -4736 12188 3103 4448 593 916 10935
228 10935 -11268 5529 12473 9584 672 -16643 19295 6782 -1777 2798 1717 17968 -14428
241a4428J1490J6406o933J499j8916J9580m062n235J0698j0909J1519j4285N926
254B350O96p704J9446j1057l093o037O463J5614j8344k68J0744m73r521q631J8730
269H915N516j3080j0177J1771O861j1591L906Q56Q757j2611l365R640l491O509
283H416o582J06l786m1J1938r179o25L150K963k565j5941K0736L594r220o635
298c671l276K2789j6283n777J3140j088l61j5021R145J1365q309j85l840N372
312D000l899l73O281o948M872k072k147j782O57J1885m075j3232N027Q591j801
327D984r166K711J1709o263j2987M598J3301k361r402j099R978m276m301L546
341I72L296J374r408L709m48r96P818m613l340j202K988O724j0840K271R266l587
$$ plain form
241 -14428 -2938 13468 6535 8034 -10882 8698 4636 -599 10099 -810 10709 -3576 2350
254 2350 3046 -4658 14788 3731 638 -5399 1064 16678 -1666 -1934 8810 8337 -1184 -9815 8915
269 8915 14431 1351 -8826 2945 9806 -1785 2121 2977 11734 -877 -4242 5398 1907 8416
283 8416 1834 1940 -1846 -1887 10051 872 247 3397 6360 3795 -12146 8590 12184 2964 -3671
298 -3671 -6947 15842 -441 -6218 6922 5834 5473 -9548 -403 10962 2653 2468 -1372 4000
312 4000 101 -272 6009 -939 3933 1861 -286 -2068 -1411 10474 6399 -6833 -1806 6785 4984
327 4984 -4182 -1471 10238 3975 -9012 -4414 8887 6526 -2876 -3975 6003 1727 -2574 972
341 972 4268 5642 -3766 -57 -505 -1501 6317 1704 -1636 -2838 150 6874 -3966 -1695 7571 3984
357C984q102n240J7183j14j1991M5N141N440j1271j011J4372m249o388k312L543
372i70O349o424J627P1k603J050L95J102k148L040L602j0232l87P611M171m671
388A583j0579J0556L645r517j513P302O536r759q422J0918L990m598k929K051
402g36M474p737P64L687L98K17k485p98j683J560P320m024o226M302K648j262
418D19p557O534Q429q665q331N100Q978k936q829N642M844m936m618K642R457
433F173o195l801J550m58K340j028J653p99m075N446k423k744L968K670J259j2255
449h719K888J0115k740n927j050Q520j876j0053M474Q807q04q133j962Q417k149
464a92k703J147K303j046m502K182J203J14K495o73m708l73L969M901p132k141
$$ plain form
357 3984 -4118 -9358 7825 7711 -4280 -4235 906 6346 -4925 -5936 8436 4187 -2201 -4513 -970
372 -970 5379 -1045 582 653 -1950 -900 -505 597 -1551 1489 5091 -5141 -5528 2083 6254 1583
388 1583 -8996 1560 5205 -4312 -5825 1477 8013 -1746 -10168 750 4740 142 -2787 -736
402 -736 3738 -3999 -3235 452 850 1067 -1418 -2216 -3899 -2339 4981 957 -5269 -967 1681 419
418 419 -7138 -604 7825 -840 -9171 -4071 4907 1971 -6858 -1216 3628 -1308 -5926 -3284 6173
433 6173 -22 -3823 -2273 -2731 -391 -1419 234 -565 -4640 806 -1617 -4361 -393 2277 3536 -8719
449 -8719 -5831 4284 1544 -4383 -5433 3087 1211 -8842 -4368 4439 3635 -4498 -6460 1957 -192
464 -192 -2895 -1748 555 -491 -4993 -2811 -1608 -1494 1001 328 -4380 -4753 -784 4117 -3015 -5156
480e156P189j523n849j623Q996M088j1749j980Q048J349l355m477R333j510p743
495e962K061J606N028l754k850L543m561K846L290k912P46j717M079n188k351
510f096P670J703l737q169N879P071p490j458N262J964m258p546Q918M820n278
525g45k779Q15L076l283K13L522j048j892l1o60J018m09N281j469q298M236L687
542A234p58l570L1P236m909q373P480N548j407p246Q46O585l871k261K211M682
558C458l945m901L676L63R41K054k922O97l808M128K867n378K513J638n22o423
574e564N72R415j340o502r26M420L449q349K448P506l841m500k302O872J509m389
590a522K95J308j656m42J418K302j410k38Q53m016M31M210L248n925l781N154
$$ plain form
480 -5156 2033 510 -5339 -6962 2034 6122 -5627 -7607 441 1790 -1565 -6042 3291 1781 -5962
495 -5962 -3901 -2295 2733 -1021 -3871 -328 -4889 -2043 1247 -1665 -919 -2636 1443 -3745 -6096
510 -6096 1574 3277 -460 -8629 -2750 4321 -3169 -4627 635 2599 -1659 -9205 -287 4533 -745
525 -745 -3524 -2709 367 -2916 -2703 819 -229 -2121 -2152 -2812 -1794 -2203 3078 1609 -6689 -2453 1234
542 1234 476 -3094 -3063 4173 -736 -9109 -1629 3919 2512 -4734 -3888 2697 -1174 -3435 -1224 3458
558 3458 -487 -5388 -1712 -1349 -408 1646 -1276 -579 -4387 -259 2608 -2770 -257 1381 859 -5564
574 -5564 -4992 4423 3083 -3419 -4345 75 3524 -4825 -2377 5129 1288 -3212 -5514 1358 2867 -1522
590 -1522 -1227 81 -1575 -2017 -599 1703 293 55 908 -3108 -2677 1533 4781 -1144 -4925 229
606B29K499n039o59N974J860q233k803Q551J813l606l678L906J345n596J743M033
622B339j23j640l435L092r14N07M835m952o67n58K478P85m898N569K078o507k190
639d201K506Q052m447o109O060l28r57m120M860N140o984k307K113J955J93j603
655a77K633j655k791K956j97P61q88K348j550n259K382N679o26n690J053M010
671B989j353n190M208N480l372n860J009N735j225l375L048k11j535j952J286
686c18M880m140K038j593k164J658N58M592n505k302N520k721p31p85N100K039
702F126j0306K756L895K057m022j868N935l076l586Q19N208L7m573M75J025k36
718F66N10J243J301m664K081M87j582Q37P62L814o477k021M699L124l079l415
$$ plain form
606 229 2728 -2311 -2970 3004 4864 -3369 -6172 2379 4192 586 -3092 814 2159 -3437 -1694 2339
622 2339 2216 576 -2859 233 -681 -174 4661 -291 -958 -1516 962 1747 -3151 2418 4496 -2011 -4201
639 -4201 -1695 6357 1910 -4199 1861 1533 576 -3544 1316 6456 -528 -2835 -722 1233 1426 -177
655 -177 2456 801 -1990 966 769 1530 642 2990 1440 -3819 -1437 4242 3616 -2074 -1021 2989
671 2989 1636 -3554 654 6134 2762 -3098 -2089 3646 2421 -954 2094 1883 348 -1604 -318
686 -318 4562 422 2460 867 -1297 361 919 5511 6 -2296 3224 503 -228 -1013 4087 6126
702 6126 -4180 -1424 2471 4528 506 -1362 4573 1497 -2089 -1270 3938 3975 -598 -123 902 666
718 666 1176 2419 3720 -944 1137 1624 42 879 1641 5455 -1022 -3043 1656 4780 1701 -1714
734a714N062M85n205p89N346K976o243j727K918J001q12k011N422l506j716J216
750G03m07L131k893L108j990m393L979J439M20l798Q00M735o254K48K288N007
766F123l174p216O041L91k19k715K146L626o256n35L169J253J35k854K179k041
782E3o73L126m41J78l122L020j260k672K008M301j083n918J720L394N61l863N20
799a51N549m773l781L107K790J277n920K621Q93j953J109j43L757m687K96J598
815A589k902K623K33J614k977l793O275p46j504o32K631J358p569K974L498J221
831C893l994k487M986j671k011J791K226l25m029P76K107l80M77k8J4l429K072
848a2J496p43p30L99K309m556n82L901K752l772l183L599P04k412k94K214L034
$$ plain form
734 -1714 3348 3833 -1372 -2161 3185 6161 -82 -1809 1109 2110 1298 -713 4709 1203 -513 703
750 703 296 3427 534 3642 1652 -2741 1238 2677 3097 -701 99 4834 -1420 -1172 1116 6123
766 6123 2949 -4267 1774 2165 1946 -769 1377 5003 -1253 -1788 1381 2634 2769 -85 2094 53
782 53 -620 2506 2065 2243 -879 2141 881 -1791 217 4518 3435 -2483 -763 2631 3192 -671 -151
799 -151 5398 625 -3156 -49 2741 4018 -1902 719 1612 -341 768 625 4382 -305 -9 1589
815 1589 -1313 1310 1543 3157 180 -3613 2662 1916 412 -220 2411 3769 -3800 -826 2672 3893
831 3893 -101 -2588 2398 727 -1284 507 2733 2408 -1621 -845 1262 882 1359 1331 1345 -2084 -12
848 -12 1484 741 11 410 2719 -1837 -2419 1482 4234 462 -2721 878 1582 -830 -1124 1090 4124
865D124o111r17M153j10M65k670K810j742j751K530nP08k034R87k96l194L653
882F00J845j208k927j86M771l742p15K429J974k479n011M161K879k033j803J219
898b26J481k563r00L441N20j449j774J026k20l85K016L64k394j197K582l34j035
915a047M19K846j391m321J528L789k23l351J1L185j799l038L004K309n21m246
931b846J248J928j004N08L11M99k612J96J662m70Q8R55n81j702j639M227J327
948B095l415n83J875P74l603N29M532o20m247k07K524J505l061J276J571j463
964e18j553J38K841r65o39K46j203o85J303J975l80l156K222N08j881k47K393
981C99K128m546j531K682J846j914j363K463O51l533rL077Q73j867j163J139k04
$$ plain form
865 4124 -1987 -2904 1249 1139 1604 -1066 1744 2 -1749 781 776 1484 -550 437 141 -3053 600
882 600 2445 1237 -1690 -1876 2895 -847 -1562 867 2841 362 -4649 -488 2391 358 -1445 -226
898 -226 1255 -1308 -2208 1233 1753 304 -1470 -444 -664 -1049 967 1331 -1063 -2260 322 -12 -1047
915 -1047 -628 2218 827 -3494 -1966 1823 1600 -1751 -1740 1445 -354 -3392 -388 1921 1400 -2846
931 -2846 -1598 330 -674 -166 145 644 -1968 -1772 -110 -580 -492 463 -118 -1820 -3459 768 2095
948 2095 -1320 -1903 -28 746 -2857 -2328 2204 1584 -2663 -2870 -346 1159 -1902 -626 945 -518
964 -518 -2071 -1933 908 -57 -696 -450 -1653 -2338 -1035 940 560 -2596 -374 134 -1747 -1994 399
981 399 2527 -2019 -3550 -868 978 -936 -2299 164 815 -2718 -2727 350 1223 -644 -1807 -668 -872
998h72o63J154J294k257k63K73M98r22J048K601k663k239Q28L166m13l326K434
1015c22J171k810j165J480M396l377k067J998m13J065k407L305L6l248J121l27
1031a564J245m05L09J313l832Q79K142L25r68j558L503k333k066J563K804J26
1047A483m548P09K435m72j413R83K423j980k261J101J885q0j407J258j719r9L61
1064a341J273R21k902K537j079j236O01J672K132m810n59K859j83n02j874M148
1080A657j277l759J922Q56L394m243K65J931k629J458p38K225p45k356J951j330
1096a418O05J184N38l38l557K949L27n02o93Q67J922m385J28K359K075k169k089
1113b197K688l95j110l37K319J139l862O51J52J266j50q91K357l615J400M54J41
$$ plain form
998 -872 -1535 -381 913 -1344 -1607 -1334 -836 -1758 -710 1891 -772 -3011 -2183 983 570 -2756 -322
1015 -322 849 -1961 -3126 -1646 2750 -627 -2694 -696 -1109 -44 -2451 854 890 -2358 -1237 -1564
1031 -1564 -319 -724 -415 898 -2934 -2055 87 412 -556 -2114 1389 -944 -3010 -1447 1357 1483
1047 1483 -3065 -2356 79 -393 -1806 -823 1600 -380 -2641 -1540 345 265 -1142 116 -1603 -1702 -1341
1064 -1341 -68 853 -2049 488 -591 -1827 -1226 446 2578 -2232 -2791 68 -115 -617 -2491 1657
1080 1657 380 -3379 -1457 -601 2793 -1450 -1185 746 -1883 -425 -1163 1062 317 -2039 -88 -1418
1096 -1418 -813 371 909 571 -2986 -37 290 -212 -905 -38 1884 -2501 -2373 -14 2061 -108 -2197
1113 -2197 491 96 -1014 -1351 968 2107 -1755 -1104 -952 314 164 -727 1630 -1985 -585 -131 10
1130A0O52j804L296l060j309K422P16J103m622J948K202l175J334m03L799l207
1146i8k638L358m47J121k084J394j5k483J841Q0J093j109l61J399k980K142P96
1163A009Q00j807k010L715k157j68L37K122l18m187K141J768L43j758m73K547
1179A904k586j02O71J510j8k908K289j830J186N62K26R23l864L078k49j238J106
1196F60j83K094m264l75L989r62J44k561L067k32l174K458L25J945l807j31K107
1213A100j137R25q35J443j137j660K628j256J012j38K95l61l018L498J00k36k012
1230g89P85J941k983O12J434J851k324k448L145m37K58r95N60J865m440K145K10
1247C90P91L55k127K382k783J261J537p81N8j879K200j001j710K544M54K04l691
$$ plain form
1130 10 662 -1142 2154 -906 -2215 207 923 2026 -2596 -648 1554 -1621 -287 -690 3109 -98
1146 -98 -2736 622 175 1296 -788 606 591 -1892 -51 29 1122 13 -348 1051 -1929 213 1009
1163 1009 1809 2 -2008 1707 -450 -618 -281 1841 1523 -2664 -523 1245 1588 -170 -643 1904
1179 1904 -682 -784 -113 1397 1379 -1529 760 -1070 116 678 904 1827 -2037 1041 792 -446 660
1196 660 477 2571 -1693 -2068 1921 959 1103 -1458 1609 1377 -1797 661 986 2931 -876 -1007 1100
1213 1100 -37 888 53 1496 359 -1301 1327 71 1083 945 1240 879 -2139 1359 1459 1223 -789
1230 -789 -4 1937 -1046 -434 1000 2851 527 -1921 1224 787 1045 50 610 2475 -1965 180 390
1247 390 1181 1536 -591 1791 -992 269 1806 1025 1083 -796 1404 403 -1307 1237 1691 1895 -1796
1264a796J566K441j711K8l08K338k649j560K748M04K06k496J231K57j052J532
1280A179m32J032j676k60J616k143K050k29O94k272j135L655j217k71p28J816
1296A679k08l224K314J359O5j933q97K824k179L20O46N02J43k935K367l95K08
1313F56O88n54K80k279J915Q78j273L31k96J049k318j64L313o59p82k158K516
1330A143L13j997J249M37O48k948K33K018k22j24o13O06o16n85J766o02L49j151
1348i6Q54l90j596K468J17n21k195J162J773j901L65P87R76j820j989L131L25
1365A450r62q20J67J421k522J530N66L8o39o77J152j263Q81J057q71q34n85J487
1383E76J69j616J584L71o14k118J460K218j246j225j40J691j492o74J734N57r84
$$ plain form
1264 -1796 -230 2211 500 528 220 2558 -91 -1651 1097 1501 1707 -789 442 699 -353 1179
1280 1179 747 1779 103 -157 1459 -684 1366 1137 1831 -441 -1576 2079 862 591 -137 1679
1296 1679 1471 -1753 561 1920 1985 52 -845 1979 -200 120 766 1268 1411 -1524 843 448 656
1313 656 1344 790 1070 -1209 706 1584 311 642 346 1395 -923 -1087 2226 1567 785 -1373 1143
1330 1143 1456 -541 708 1145 1793 -1155 -922 1096 874 750 137 743 127 -458 1308 706 1055 -96
1348 -96 758 368 -1228 1240 1357 836 -1359 -197 1576 -325 40 827 1803 -17 -2006 1125 1450
1365 1450 488 -332 -165 1256 -1266 264 830 868 229 -448 704 -559 322 1379 508 -326 -911 576
1383 576 745 -871 713 1084 470 -1648 -188 2030 784 -441 -581 1110 -382 -1056 678 1235 251
1400B51j442Q73Q00m12M27P3k93j252P19J150j170N23m5K86j961L30K458j20j497
1419c02o81J554j32j883J339J426p58j629n33K505q40l92K56K59j47j250J517
1436C09L82m91j57p5q11j19J172J095j540j004J029M98j015j03K063m15j710r84
1454a876K376L27j273l67J201n82j195N77J247M04j530J24L20l25J94R37l19q79
1472f39n23J121j25q84J318L89j167j563J706J496r24j332J050N35j431p11K031
1489C47M51j396r33R28P68r05P40N90o43j047L64N39j3k35P53n60j456P57J229
1508B78J87j407K14Q72l92j380J206J718j297j754O70J288o01k59K21R66j571
1525a041l00R84N81k36k06O1o05m55J017O79j193l50N05M77j323N81J621k53k019
$$ plain form
1400 251 -1191 -318 482 70 497 570 277 -975 -256 894 -276 247 202 488 -1473 -1143 1315 1195 -302
1419 -302 -983 571 439 -1444 -105 1321 563 -1066 -1599 906 66 -326 -70 189 42 -1208 309
1436 309 691 200 43 -32 -843 -962 210 1305 -235 -1239 -210 288 -727 -830 1233 818 -892 -1876
1454 -1876 500 827 -446 -813 388 -194 -1389 -812 435 839 -691 -567 -247 -572 -378 559 240 -639
1472 -639 -1162 -41 -166 -1050 268 657 -510 -2073 -367 1129 205 -1127 -77 458 -973 -1684 347
1489 347 798 -598 -1531 -603 165 -740 0 590 -53 -1100 -736 -197 -210 -445 308 -252 -1708 -951 278
1508 278 465 -942 -728 144 -248 -1628 -422 1296 -1 -1755 -1085 203 -398 -657 -436 530 -1041
1525 -1041 -1341 -357 224 -12 -218 -157 -762 -1217 -200 479 -714 -1064 -559 -82 -1405 -824 797 544 -1475
1544a475l1J517L56j403J58J255o51j327K60J911j27j415J85N82m99Q0O05M65
1562D46j236o0M94o37M44L43J000j575q94J671M33q07o36J225L13k031K9J884
1580D06J26r88r52J043L21q92O06P12j63j216m0Q59Q7n14Q30p63n40J66J160r9
1600A49j070P71M40r46n91J161J179j101j646J290M69n84p64J468O18j912r6R87
1618a78P49p40k87M84n24o21J061J94k03n86O82j66j034Q20J151m31j479M41J079
1637D12j85j327J191O70j161j212R60J469o45o80K94K97n05l18R50O24j364J78
1655c52q1j7q9O89Q88j601k94P56M12n44j67J065k39j645M49J079N43j581k6J297
1675E42o17o02J67J581o41j112M12M07j94L3L87pj073J11Q81k81o8M64K05r99
$$ plain form
1544 -1475 -1506 11 367 -1036 -878 377 -274 -1601 -1341 570 443 -972 -787 -205 -704 -624 -19 446
1562 446 -790 -850 -356 -993 -549 -206 794 -781 -1675 -4 429 -378 -1014 211 524 -1507 -1478 406
1580 406 532 -456 -1408 -365 -44 -936 -330 382 219 -997 -1037 -178 -91 -605 225 -538 -1078 -912 248 149
1600 149 -921 -150 290 -656 -1247 -86 1093 -8 -1654 -364 105 -479 -1243 225 843 -1069 -1165 -178
1618 -178 571 -169 -456 28 -496 -1117 -56 138 -65 -651 31 -135 -1169 -349 802 371 -1108 -667 412
1637 412 227 -1100 91 761 -400 -1612 -652 817 172 -508 -214 83 -422 -740 210 834 -530 -352
1655 -352 -433 -450 -539 150 1038 -563 -857 -101 311 -233 -400 665 426 -1219 -770 309 852 -729 -755 542
1675 542 -75 -677 -510 1071 430 -682 -270 137 -57 -24 363 356 -717 -606 275 -6 -74 390 595 -404
1695d04m05J123J233j732n44R29M1o21k63J543n5j361j70R17M91o40r6P10r27
1714b31j98K44Q13j96p28Q83q37l50N32Q52j12j279N72O83o46m31P64R94j395
1733f6j007J341M88k98q77J025J37r47j80Q27P73j312M1L11j80j32N55L09q53
1752d5l73Q33j96j40j11J256p08j435R14O44L19j364N38O00p13n83N87J245n88
1771F80j295P68J28n1r7O45R5j289L73J40K47j26M35L65j449J48R09L18p00m92
1791b48J047m55p69M95Q75L62j916K12J202m56k17l2J007r35o31N42O66l69l47
1810C3M35m35k87M91M32R6p78L02M52j114L44M00R80j388o32R51M87l85o90J208
1830I02lj410L00P51L27n03n09P08o95K7L56O16n64p20Q70m29L9M67N22n67j091
$$ plain form
1695 -404 -809 314 1547 -185 -729 200 241 -380 -643 900 845 -516 -686 231 722 82 -14 696 -231
1714 -231 -429 -185 628 432 -296 587 -250 -600 -68 784 672 -607 -35 648 2 -429 335 1329 -66
1733 -66 -1073 268 756 458 -419 606 743 -204 -384 443 1216 -96 -55 256 76 -56 499 808 -45
1752 -45 -418 415 219 79 -32 1224 516 -919 -5 639 958 -406 132 732 19 -564 23 1268 680
1771 680 -615 153 281 230 133 778 873 -416 -43 97 344 218 653 1018 -431 -283 626 944 244 -248
1791 -248 799 344 -425 70 945 1307 -609 -397 805 349 132 100 1107 172 -459 83 749 380 33
1810 33 468 33 -254 237 669 765 -13 289 741 -373 -29 371 1351 -37 -669 282 769 384 -306 902
1830 902 899 -511 -211 540 867 364 -145 563 -132 -105 251 867 303 -417 453 24 63 530 1052 485 -606
1851f06O20Q27m35n10N17M03r89n34R36Q99n07j016R39j59k24j73O76J62j108
1870b82O6L78J68K2q2M16q92j33P97j24J48m94O75m36j030R36N71J20j427N31
1890g2P96n59l10M75O60n87j202R59K33K6l67L37o5q55N56K80J95l99L2J06o04
1911c65K04P52J5p08m42Q66J81r47L38Q44j47j267K92Q75J0n66R3L39m26m57N17
1932AN49l27n25J71O6j70N56M0N6j059L41O61n91L44O8M03j342j21J186L91o44
1953E4n55Q03N2j013M77N93J66q12n38R17k41l8K70R1m36k28M36J22j49K35K53
1974D59n04p93M41J137p00l09J24M57o42k02Q50M32p57p49O54K14l69o1L55o6
1994b9m66n9N98o1o4JJ10o57K40Q29k88j52o38Q37l30n44N14O44l26j101M25R52
$$ plain form
1851 -606 14 841 406 -104 413 816 -173 -707 229 1128 621 -395 544 385 161 -12 664 826 -282
1870 -282 -216 162 330 352 270 686 -206 -339 458 334 482 -12 663 227 -803 133 704 824 -603 -72
1890 -72 724 165 -145 330 990 403 -799 160 393 419 52 389 324 -531 25 305 500 101 133 239 -365
1911 -365 -161 591 606 -102 -544 322 503 -444 -106 738 591 -676 -384 491 501 -65 28 367 -59 -516 1
1932 1 550 223 -302 -131 -65 -235 321 361 417 -642 -301 360 -231 113 181 584 -758 -879 307 698 54
1953 54 -501 302 354 -659 -182 411 577 -235 -773 144 -97 -135 135 226 -210 -438 -2 120 -29 206 459
1974 459 -45 -838 -397 740 40 -269 -145 312 -330 -532 318 750 -7 -756 -102 112 -257 -318 37 -29
1994 -29 -495 -554 44 -17 -81 -80 30 -627 -387 442 154 2 -636 201 -129 -673 -159 485 159 -942 -517 435
2016D35l02m82K44M48n19r41J196J67j73n35J50L02m13L49L46k53m27J2L00j31
2036b27k31P50j50q01j74R83K00q07N3N83j33p75J44R86k34p64K5M62P3l85K78
2057a44M77n93l75M59J5m0J79j59m3n36N23M25l85j93J91K69o14j20J146j63p95
2078d76k78N65N37q40L21L13j63m77l38R50j31k66J96R6m16o3M56K21n76p1M22
2099a8m27o6K80Q49p56p61N86N86n60l14O61L54j050k28O35M25k78m70M98j4l51
2120d19j71Q63k18k30p3M5j24j23O11o7o35o2O52Qo80L54N99n69n40K85R65j92
2142B79r86M87Q0Nn27P36M36p21l59L98J65r3k09L78k89m27N38J20R5m08O28l42
2164a6m99k3Q17k6n78j48M90nn47M31N57j41r97K57N58m6l14J10J65l83Q3R3L92
$$ plain form
2016 435 133 -349 -105 343 -176 -1117 79 246 73 -462 -312 -10 -423 -74 272 19 -408 -396 -96 -227
2036 -227 -458 292 142 -659 -833 150 350 -457 -404 179 46 -729 -585 401 167 -597 -572 -110 -37 -422 -144
2057 -144 333 -260 -635 -176 -161 -201 -22 -181 -224 -760 -237 188 -197 -390 -199 70 -544 -664 482 319 -476
2078 -476 -754 -189 348 -492 -171 142 -21 -498 -836 114 -17 -283 -87 9 -407 -470 -14 207 -369 -440 -18
2099 -18 -445 -511 -231 618 -138 -899 -313 273 -287 -601 60 414 -636 -864 -229 196 -82 -552 -54 -68 -419
2120 -419 -590 273 55 -175 -248 -203 -327 -450 161 94 -541 -603 49 57 -623 -269 330 -239 -779 -494 471 279
2142 279 -707 -220 -140 -135 -662 74 510 -211 -570 -172 -7 -100 -309 69 -220 -647 -109 11 106 -302 326 -16
2164 -16 -515 -538 279 253 -325 -473 17 12 -535 -104 453 312 -685 -428 130 84 -230 -120 45 -338 -255 -162 230
2187B30m72Q6L60o54k05P10K50k03p94P00J54n05J1N14K95j037r1O44N13o31j95
2208c20M84j7o65L91L49O7m84O3J73l12K69K01qm77L8L19j82p1K06O47p10n43
2230e82N65N33k89n58K35M42p15j66L51Q33n32m70L66j48L91k77M05m95k85K57
2250a39L86j89N4k4J14r12N68O23j49l84k07R57p37l68L86O99l21r80M86M93j90
2271A66l21K79M07o39m1M57j06J28l82P6j09l53P18m5J33p08O87rp11L62N84K06
2293G79j034k47Q89o9l28LO07k29q11N55Q8K99o20L5M19m05N6M44o9l19j69M85
2315C59m16q5N66J85m66o18Q30J9l92N1J64K84q61J38P60K05o72j07K61j20j09
2336b4K93n8K01n08M1K09j71L49j20k8n19L22L37M8m36K3M66m02n51P01N31m87
$$ plain form
2187 230 -242 -156 204 -450 -655 55 305 102 -692 8 162 -343 -332 182 477 -560 -651 -7 506 -125 -320
2208 -320 164 147 -518 -127 222 289 -195 -132 41 -271 -2 199 191 -286 -248 71 -111 -182 24 671 -39 -582
2230 -582 -17 516 227 -331 -96 346 -369 -535 -184 649 117 -353 13 -135 256 -21 384 -111 -396 -139
2250 -139 247 58 112 88 202 -710 -142 481 332 -52 -259 698 -39 -407 -21 678 357 -623 -137 356 166
2271 166 -155 124 531 -108 -149 308 202 330 -52 24 -85 -438 280 235 368 -340 347 338 -373 -11 573 779
2293 779 -255 -502 387 318 -10 -7 600 371 -440 115 203 502 -118 -83 336 -69 -13 431 362 43 -126 359
2315 359 -57 -142 424 609 143 -475 355 374 -18 33 197 481 -380 -242 518 723 51 -56 205 85 -24
2336 -24 269 211 412 -96 -55 154 -17 332 212 184 -335 -13 324 372 -64 -41 425 23 -528 173 704 217
2358B17m83K62N14m79N2K61L13o38k64M28J02n9k57L05k86j49M42L5j90j39R1
2379G8K47o60N00M69k09p85N6P72m37r6K89J18L1q18K64P99k44l84K31N4l02j73
2401b00N34kQ1n73K78j9j50N07P8n07m63P72m7l44j7L90q1p76L71P72k30l49j78
2424a53M64j21n71L99M30j2q58J80N33l50K68Q5k46j91K3M25l06%K42J6k71n52
2446e66R96J95n42l62J97M88p61K0O43K71p89k66P06Q2k37k9N4j64k57M54K90
2467D23k98r3P8k14j6K39L09k58n35K33M50m15l01M93L74m24o52N22L55k33k12
2488a75l4M26l82r0L63M8k47j07J44ql8K98J54n43j16L54P7l74K59L55n29l89
2510e54K07N97l2o44J58O62n11l08M23M90m60l19J55R3j5N7J14j14j32k16L81
$$ plain form
2358 217 -266 -4 510 31 83 344 657 19 -245 183 285 226 -31 274 -12 -161 281 316 126 -13 78
2379 78 325 -335 165 634 425 -360 -304 468 31 -65 224 342 373 -445 -181 618 374 -10 221 275 -27 -200
2401 -200 334 332 413 -160 118 99 -51 456 534 27 -436 336 289 -55 -72 318 237 -539 -168 604 374 25 -153
2424 -153 311 190 -381 18 448 436 -422 -242 291 -59 209 294 48 -143 -120 305 -1 -1 241 257 -14 -566
2446 -566 430 625 83 -279 -82 406 -355 -335 308 579 -210 -476 230 312 75 46 100 -64 -321 133 423
2467 423 125 32 110 -104 -120 119 428 170 -365 -132 318 -97 -398 95 469 45 -607 -85 270 37 -175
2488 -175 -209 217 -165 -255 108 156 -91 -198 -54 -62 -100 198 352 -191 -307 47 124 -250 9 364 -165 -554
2510 -554 -347 250 218 -426 -268 394 -117 -425 -2 488 28 -291 -136 -43 -58 -1 113 -1 -133 -349 32
2531C2j92J23J69k3m59k2L06M45n81k64O69j84m12K57M52q6n18k14O66m9k11l5
2553a31M25m62m10K97M58k25k9J18Qk81Q2N64m50k51L12o0k75j63N94K39o22k71
2575e33N40K48l62j04L26K19q06N5M54L0k94o7J33N8o7L43k75l3k05L51j60j73
2597c22M50r0k66k57K23N95l06m52M18Q3k52l20N03M05m10m23L51L8k10P4K97
2618A29j48l73N9J11J44RJ5K2j84LJ80K20o63K26M05k66k12P9M65j2o53J03M35
2641I4Jl07J39J44k08k94N7K63J02p4q2l4k5J70K59m50J65l8N7k68K0L91m4m23
2665c85r3N19j0l68j37P73k97m84J44O82j83l29kJ20K9k22K59O6j13j6J33k07
2687a21J68L9j02k13k28M43M4j80j65M10R1n30j11N26O1q5m18L82O1l72m9N27
$$ plain form
2531 32 -160 -37 132 109 -350 -372 -66 379 -202 -466 203 19 -393 -136 316 230 -288 -502 164 115 -96 -131
2553 -131 294 -168 -578 -281 177 -48 -77 41 49 -232 -150 414 -36 -287 25 -35 -310 -473 121 360 -262 -533
2575 -533 7 255 -107 -211 115 334 -472 -417 37 67 -227 -294 -161 -103 -170 173 -102 -135 -340 11 -149 -322
2597 -322 128 38 -228 -485 -262 333 27 -425 -7 76 -176 -496 7 412 2 -421 -70 -32 -242 -168 129
2618 129 -19 -392 -333 -222 -78 -69 -54 -32 -216 -213 -33 187 -476 -250 155 -111 -323 -244 221 209 -444 -341 94
2641 94 95 -212 -73 71 -137 -431 -374 -111 -9 -83 -165 -199 -224 -54 205 -245 -80 -118 -61 -329 -309 82 38 -385
2665 -385 -478 41 31 -337 -474 299 2 -482 -338 344 161 -168 -170 -50 -21 -243 16 82 -31 -47 86 -121
2687 -121 47 86 -16 -229 -457 -14 30 -150 -315 95 186 -344 -455 71 132 47 -371 11 72 -300 -349 178
2709A78j11m34M0O1M08p1L4n1p5k70M39k13j07Q4K70j92m42K37O46j82n10K87
2731B6J68k91j22J06M08l59m88L08M67p1k49J71j81O2m9K02k21k7J24m9k70R6
2753b39M84o1l97r2M59j84k53L43K64j27o19J45O45j23l44J44J45k50j83L06J89
2774B52l67L6J99m07K32K08J22l83r2J98J16j28k70M96K3n45j28O44R2k17j92
2795a11J53O4l12RM53j47j00j03L05j34Q0J11q3k95P9K93k35J60j08J78l30j90
2817b63L46J79j73k62K36L39l55j74M91J10m47l72K32L13k70m7M68j56k00p2J98
2838A21J30l17K24j15n8j14L42k03j62L00J52l20j54L06K23j65n50M57J50j60
2858H7o2M0L81m33k6R3Q7r6J84pk78J51Q7R0k12j36K32k21q3J23R7J9k83J15L42
$$ plain form
2709 178 67 -367 -327 -266 142 71 105 54 -21 -291 148 -65 -172 -88 182 -10 -452 -215 431 249 -261 26
2731 26 194 -97 -219 -113 295 -64 -552 -244 223 152 -97 74 -107 -45 -94 108 -113 -140 -16 -65 -335 -239
2753 -239 245 184 -213 -305 154 -30 -283 60 324 197 -422 -277 368 245 -99 45 190 -60 -243 63 252
2774 252 -115 -79 120 -287 -55 153 275 -108 -200 -2 114 -14 -284 212 235 -310 -438 206 298 81 -111
2795 -111 42 106 -206 -197 256 109 9 -94 211 77 157 268 185 -110 -31 262 27 187 79 257 -73 -263
2817 -263 83 262 89 -173 63 402 47 -127 364 474 27 -345 -113 200 -70 -117 351 195 -5 -77 121
2838 121 251 -66 158 43 -15 -129 213 10 -152 148 300 -20 -174 132 355 190 -360 97 247 87
2858 87 25 65 446 13 -13 80 167 71 255 248 -30 121 208 298 86 -50 182 -39 -122 1 98 117 -166 -51 291
2883B91Q3l82q1M17j15m31J82M43j02l84n5K85k38QL26J77n44M2K42j17N8l9J02
2906A68o2k65L05Pj7j24K29J35m89JM32K15p87N2K85N4j26p6K67j61p8j00K91
2929A56J28l14M6J12l86L23J97k05k00J2L75k55K4K66J36l64k75K95L02n24lK22
2951F8J51j83j9J41Q0j51k05L45j26j00L5K20p8k77K30j24j92K13L35j07l14j84
2973b42M23n7k64K51J31j28n93M87L68k13j72q4K79j82n8K78K7o2k40R4j85K69
2995A27J4k57J16k7J59l7j03j6K79j27l20k0M87k1m21R1K58j05l27Q8M75k16l45
3018b48K02K63j41l7J58r4k22K6J41p0R0J76j27k63j18N12l5n1l28K31J57m13
3040a91N3L35J53n83P5L16N2j61n8L0O6k16J27K91j26J7k18q9O9J8K20q0l23R8
$$ plain form
2883 291 374 -8 -89 328 213 -218 -36 407 305 -79 -134 151 -87 -79 247 424 -120 -78 164 47 105 66 168
2906 168 106 -159 146 153 136 12 241 376 -113 -112 320 535 -252 -200 85 139 13 -63 204 43 -35 -135 156
2929 156 284 -30 16 128 -258 65 262 57 -143 -131 244 -11 13 279 415 51 -224 71 373 -151 -154 68
2951 68 219 36 17 158 238 87 -118 227 101 1 36 256 178 -99 131 7 -185 28 363 256 -58 -242
2973 -242 181 124 -140 111 242 114 -479 8 376 163 -9 -93 186 4 -54 224 251 189 -51 43 -142 127
2995 127 141 -116 0 -27 132 95 -8 -24 255 128 -192 -212 275 254 -167 -76 182 77 -250 -162 313 97 -248
3018 -248 -46 217 76 39 197 103 -119 -93 48 -22 68 244 117 -146 -264 248 213 162 -166 65 222 -191
3040 -191 -138 197 350 -233 -158 158 210 49 -9 21 87 -129 -2 289 163 180 -38 -127 -58 -40 180 100 -223 -125
3064a25L44l74p6M82j05j88o1N4K75l94j1Q9K64n12K94JK38o8l57K77q1M8p3Q2
3088B3j2j74J51J99k21j47M72k93l72PN76k27j23J20K0Mk91L75L3j00l38K37K16
3111A35k38q3J60J16k72P5J19M2n4oMq9j48L30j09k13R2R2J91l31J99O6j5k44
3135a81m5K87K8k67J03L02k07m15L37J94j55q1pK9k9P7l4J22k42J99j66j9p2L95
3159A53J36o44K7L68J22n11Q8L65J34m20j09M37J3l62O7J15r1k15L12P5m1j89
3181a70J47j02r6K76Ql7l19J88J53k07J8K0K92k72k80L93K25l43j82L17M4q3j05
3204a15M11k15l16r7L78r2N1n0J92k67n3K77L2k87l9L02m3l96K97J05j61qr3L26
3228A39k13p1J41J37k99k3L6J70M5l14K36j52j56J44K89k2j17MP2p1l0N2N6k06
$$ plain form
3064 -125 219 -155 -231 251 146 -42 -103 -49 226 -168 -179 -90 174 -338 -44 -43 195 127 -230 47 -34 14 -59 23
3088 23 11 -163 -12 187 -34 -181 291 -2 -374 -367 209 -18 -141 -21 -1 3 -288 87 120 20 -318 -81 135
3111 135 -103 -186 -26 90 -182 -107 12 54 0 -6 -2 -91 -239 91 -18 -231 -139 -47 144 -187 12 78 63 -181
3135 -181 -226 61 89 -178 -75 227 20 -395 -58 136 -19 -100 -107 -78 -107 -30 -64 58 -184 15 -151 -170 -242 153
3159 153 289 -355 -328 40 162 -349 -261 104 238 -182 -291 146 159 -203 -136 -21 -112 -327 -15 60 19 -170
3181 -170 -23 -125 -221 55 63 26 -293 -105 48 -159 -141 -121 171 -101 -381 12 237 -106 -288 29 73 -10 -115
3204 -115 296 81 -235 -332 46 -46 5 -45 147 -120 -173 104 136 -151 -190 112 69 -327 -30 75 -86 -94 -187 139
3228 139 -74 -145 -4 133 -166 -189 -153 17 62 -252 -16 -168 -324 -180 109 87 -30 -26 46 -25 -55 -3 53 -153
3252a53l4K38p0j52M2J65m0j56N9K61J36k73j40P0k2j9J08N9j70rJ23k14K53P6
3276A38k03J90k22j8J45n0j72J20J52j28j01J57J59r5k30J25J82k02n7K79Q9m00
3298a42q8J13J43k13J32O7j81K6K45q7J12k48K10n8j89K13K88m03l2K2J66j94
3320i8Q4O6L40n08p0L52n9k61P4K15k22oJ01J60Nj47kp3r5K21P5n5j03j2KK00
3346A84m59J89L16k11j53qK82o7j23R8J46k42j77K53P4J32k65J17k7q1l7J11J59
3369B11j75J6J4l9r3K34Pj46r1J58j6o0j94K17l0n7k3L51k6l51M5J60p8r6P6K74
3395B88k64k89J69J10Po3R3P0j04L6J30k41M8N1M3n8lK34k8j71k18K42M5j1m8
3420F8k5M9j60O9q4K71Qk10Q3K1M4j55O2N8o1J10K7k65K33n2q7k30K55K43q7k83
$$ plain form
3252 -153 -187 51 -19 -171 -129 36 -4 -160 -101 160 296 23 -117 -47 -69 -88 20 79 -91 -100 23 -191 62 138
3276 138 -65 125 -97 -115 30 -20 -192 -72 80 -48 -149 8 167 72 -158 -33 149 -53 -110 169 258 -142
3298 -142 -230 -117 26 -187 -55 12 -169 -143 102 15 127 -121 89 31 -158 55 343 -60 -92 -70 96 -98
3320 -98 -14 52 392 -116 -186 166 107 -154 -80 135 -87 -93 8 168 173 26 24 -49 -144 77 152 97 -6 -18 -16 184
3346 184 -275 -86 230 19 -134 -142 140 73 -50 48 194 -48 -225 28 102 234 -31 86 59 -22 -59 52 211
3369 211 36 52 66 27 -66 168 175 29 -62 96 80 20 -174 43 13 -44 -67 284 258 -93 -48 112 34 -62 14 288
3395 288 24 -265 -96 14 21 -42 51 121 17 53 183 -58 -10 41 84 26 23 257 229 58 -160 82 127 116 68
3420 68 43 92 -68 1 -83 188 196 -14 69 90 134 -21 41 99 38 148 175 -90 143 91 4 -226 29 272 185 -98
3446i8M7K35j65p1J41J00k69P4j0L0n4K8kN0j61J68k9o5O4NP2j35O8J71p6j27
3472im2n3K14m39L13K27Q4l70j0K29j75J9K2J67Rj45MP1P1j77j29k1J02p9J99
3497H2j4J6M3j01j24J32J17Q3j90pJ02J8k60J45K00j45j98j37J54J89j48J19l7
3520C9o7J37p2L9Q7j84J03k47N2K88j07j42j25J89j00Q4r0K16Q4j44k32L37J11
3543B56k78n5L8K92l51P9J00Q7n6j91R3J5n9J08j84n3K13R6j08j55K00j06J52
3566A33j46K24J12l10j95J50J43k94J50N5J48k64Q7o8L46k47m8N3j49p3R4O0P5
3589C6j4K6j38r4J87M7J03k33l4J60j73n4J7J88J97n03K02J88k26N1l4L10k62
3612e3j12Q7J13l0j36L3n5k0K38K6j34pM7R4l27K71Ml3o0j06L39j18j56q7J52
$$ plain form
3446 -98 -51 184 19 -52 89 189 -80 -6 -16 14 -40 -12 -14 36 -125 43 14 -51 13 18 90 -45 23 194 118 -9
3472 -9 -51 -104 110 -329 -16 211 295 -75 -85 144 -31 -12 10 177 186 41 45 116 187 10 -119 -140 -38 -117 82
3497 82 68 84 127 26 -98 34 151 234 44 37 139 157 -103 42 242 97 -101 -238 -84 105 -43 76 39
3520 39 -28 109 37 76 163 -21 82 -165 -113 175 68 -74 -199 -10 -110 -26 -116 100 184 40 -192 145 256
3543 256 -22 -77 -39 253 -98 -19 81 168 112 -79 14 29 -30 78 -106 -159 54 150 42 -113 87 -19 133
3566 133 -13 211 323 13 -182 -32 111 -183 -33 22 170 -94 -7 -75 271 24 -24 29 -120 -193 -99 -39 36
3589 36 22 48 -90 -184 3 50 153 -80 -114 46 -127 -181 -164 24 221 -282 -80 108 -118 -67 -101 209 -53
3612 -53 -165 -78 35 5 -131 -98 -153 -173 65 91 -43 -50 -3 91 -236 35 39 6 -54 -160 179 61 -95 -182 -30
3637c0m5q3J57Q2O8k94J18m3m0jJ43P6j22l7%o4N6J1%j56L8J39P0o7r4O3J59k68
3665a64J9J67J45k06j96J51o3J1J12J00j70P0J02r5m5n0J78k5k43J65K60j91o8
3688c6j15L99j02k70P1J83q4j30PJ74k63j7J44J6j47m9K74o7L5j07J29j20o6K72
3712A31k4j94J1KK39j69k2J4oj3QQ1P4l20J28L6L2j37K04M2q9j17l2J01j29J5
3738a34K18m4j62l0J33j20qJ42J2k29J34P4P9k0j35J90o6q5j34L60j60k16K4K42
3762F5k2k74K25M4K7l1j42J45J1n0P9m4k36K04J9j69J30N7k1n0k92L35J14j56
3786c2l31J89P5R0q2J58p3k8j50K62k1m6Kj09J59m8j3m0Q6j51O8n6M8M9L32m24
3812h6K7j06K09p4r4J62Q7j43r7r0K07L7k24K46j57Q6m4R0O8l20Q2L14j94j4L0
$$ plain form
3637 -30 -75 -158 -1 81 149 -145 -27 -70 -110 -111 32 108 -14 -51 -51 -115 -59 -48 -48 -204 -166 -27 43 -24 -118 -55 104 -164
3665 -164 -145 22 167 -39 -235 -84 -147 -136 -24 76 -94 -24 78 -17 -62 -112 66 41 -202 -37 223 32 -36
3688 -36 -151 248 146 -124 -53 130 46 -84 -77 97 -166 -183 -39 -23 -170 -219 55 -12 23 -84 45 -75 -141 131
3712 131 107 -87 -76 -74 165 -4 -26 -12 -18 -31 -23 58 132 -188 -60 -24 8 -129 75 117 28 -89 -121 -20 -149 -134
3738 -134 84 40 -122 -152 -19 -139 -147 -5 7 -222 -88 -14 65 45 -90 100 34 -51 -185 175 15 -201 -177 65
3762 65 43 -231 -6 38 65 34 -108 37 48 -2 77 33 -203 1 20 -149 -19 38 17 -33 -325 10 124 -32
3786 -32 -363 -174 -99 -9 -91 67 -6 -34 -184 78 57 11 13 -96 63 15 2 -38 48 -103 -35 -91 -43 6 338 -86
3812 -86 -59 -165 44 -30 -124 38 125 -18 -115 -205 2 39 -185 61 -96 -10 -54 36 104 -216 -134 180 -14 -28 2
3837BJ7j07l4K28n4j44J57j09p4p4J92L0J43j62m5J24l7p7J09O0j77P6j75J11
3861b0O2J2m5k1j55K13j22J39j70K74j75p1J7K6N6p6L4R9j06j34K04K1Q7j89J18
3886G8o7J51k05q1J34K7j28K3M0Q7o6P8m2o5K4Q7Kj07M7j4N6k10J84L7j53r8J86
3913EP9o5m5R8l3r2OJ45p9Nj48J32N9j09J65m4P8l25K70j60J39l7J11j73l1J29
3939H0l1J1pO8j31M7j25Q3J63n6j1K5K6p4r0mK3j36K5J12J71r5j07J58j67P6L4
3966F8N4j95J39Q0k33J24j92J90J05l40J82K46k14k03J13K79L0l68J50P4M0j88
3988e9J83j03j87K77Q8k26JJ06n1K6p6J64J14j19k78J16R0l9L0J16k30J0J56L8
4012A47mk56R5K7k3j5RJ15j19n1L3J12K1j4K8j02O7n6q8j4p9J00K77k76J81k15
$$ plain form
3837 2 19 -88 -122 106 52 -92 65 -44 -118 -192 0 30 173 11 -34 90 53 -24 85 145 -32 44 -131 -20
3861 -20 42 54 9 -12 -167 46 -76 63 -107 167 -8 -79 -62 -36 20 -56 -22 77 -29 -163 41 62 149 -40 78
3886 78 11 162 -43 -124 10 37 -91 -68 -28 59 -7 71 29 -36 -12 75 77 -30 17 3 59 -151 33 70 -83 -181 5
3913 5 84 19 -26 72 39 -53 -47 98 19 24 -124 8 67 -42 123 79 157 -168 102 -58 81 44 155 -18 -49 80
3939 80 49 60 53 121 -10 37 -88 -5 158 102 91 116 142 68 -22 -26 -3 -139 -114 -2 169 74 -33 125 -42 34 68
3966 68 122 -73 66 146 -87 37 -155 35 140 -200 -18 228 14 -189 -76 203 233 -135 15 89 129 -59
3988 -59 124 21 -166 111 199 -27 -26 80 29 55 -21 143 257 138 -140 -24 66 27 57 173 -57 -47 109 147
4012 147 143 -113 -18 9 -14 -29 -20 95 -24 -75 -42 70 91 77 105 3 70 14 -74 -88 -167 -67 210 -66 115 -100
4038a00L72l17n2J85j1l6j24J88Pl07J89q2J00NP4o7j89J34P0j7mN1N3l8k25J51
4064A0Q2j7o6j2L6R2j25pR0Qk42J97J12j69J3N2LQ1j06J87q9k68J23Nm8p2Q6K90
4092B46k66J7O4l7j24rK59j75m9N8O3m6l2l9Q3P1k62L31j48J07j71K36k63l0J79
4117F3%Pm2j22K08j85J44M2j29n3N4q2L44k14j72J92p8Rm2O7P5o3o3J10r9m1n
4144g5J39j57J41j67K80j89O2L3j44m9K03K0k13Q9lO9j74J20n1O8n4j07K43q8
4168dj03jK06r0l4j9J16p1j10o0K55j23j2J28O7j66j51J94j6J8q8L0R5j96J19
4193a6N0J57k38KJ74j97J02l4O1K9k13R6MK8qJ3j48j08K31NL9j27J4J64k22J49
4219Gn2l2J7J2Q6j5j26J26K5oj27L9J37k4m2J29j07l2n1K6k7Pj86L78k18N6J04
$$ plain form
4038 -100 272 -45 -97 88 77 41 -83 105 112 -195 -6 -88 12 17 91 24 -165 -31 39 22 18 69 122 84 -141 10
4064 10 92 75 9 -3 33 125 0 -7 83 91 -151 46 158 -11 2 54 57 138 32 219 130 -138 -15 -10 -58 -130 -44 246
4092 246 -20 -3 61 24 -100 -109 150 -25 -74 -16 47 1 -31 -70 13 84 -178 153 5 112 -59 177 -86 -116 63
4117 63 63 70 28 -94 114 -71 73 115 -14 -67 -13 -95 249 35 -137 55 -23 -14 -56 11 86 23 -40 70 -29 -70 -75
4144 -75 64 -93 48 -119 161 -28 34 67 -77 -126 77 97 -116 -27 -30 39 -135 -15 -66 2 -52 -159 84 -4
4168 -4 -107 -108 98 8 -26 -45 71 0 -110 -170 85 -38 -50 78 145 -21 -172 22 6 24 -64 -34 61 -135 -16
4193 -16 34 191 -47 -45 129 -68 34 0 61 90 -123 -27 -23 5 -3 10 -138 -246 -15 -10 29 -98 -84 80 -142 7
4219 7 -45 -77 -60 -48 38 23 -103 23 48 42 -85 -46 91 67 25 154 47 15 -36 -10 -37 -30 -216 162 -56 0 104
4246A04j24q0p9J53M5r3M2J16j50N2j49J53jj28K39j23J5N5j03O0R3k08K01j8
4270G2j47J88j51N4j60q0J91j59K94j05j24J46j06J25R2k8j54l1N4MPr5Q9L4P8
4295H8j77l0L5l5K41l61J32P5Q5j65J2K68j17j54L9N8m3J04r6M2p3on6L82k74
4320b6L9K8J03l67J61J81j17M9r5O2j14P7J31oj29M1L4j17O5j00J99j68j23Q5
4344a07L59l13NN4K1j46m5J26K19k52q7PJ57m8m3K01p5k37M5J66j02q9R2L2o3
4369a23R3m3J34j36Q7J51j22p5j52J60Qq7P8K7PN5p3Q5q6k02K70M0lo5J17k38
4395i3O8QO8k1j08J35o3J07k37K84pn7j11P2O0n4k58J86K9k58K10Qk6q3J11J10
4421H0l6j24K31j75l5J1L7R6k59p5L82j32o6J90j60j6N1L5k36J32J96j60rk8j64
$$ plain form
4246 104 -20 -100 -179 -26 19 -74 -32 84 -66 -14 -163 -10 -11 -139 100 -23 -8 47 -56 4 97 -111 90 72
4270 72 -75 113 -38 16 -144 -224 -33 -192 102 -3 -127 19 -87 38 130 102 -52 -83 -29 -25 -18 -113 -24 10 88
4295 88 -89 -119 -84 -119 122 -239 -107 -32 53 -112 -100 168 51 -103 -64 -6 -49 55 -41 1 -72 -78 -134 248 -26
4320 -26 13 41 144 -223 -62 119 2 51 -44 18 -96 -19 112 106 -23 18 52 -65 0 -100 99 -69 -192 -107
4344 -107 252 -61 -56 -2 19 -127 -172 -46 173 -79 -166 -159 -2 -50 -93 108 33 -204 -159 7 -95 -184 -92 -60 -123
4369 -123 -30 -73 61 -75 12 163 41 -34 -186 -26 -18 -105 -27 0 7 62 -11 74 -12 -214 56 96 93 28 145 -93
4395 -93 -25 -17 51 30 -78 57 -6 101 -136 148 141 84 -27 45 105 51 -207 -21 8 -250 -40 -32 -58 -141 -30 80
4421 80 44 -80 151 -24 -59 -48 -11 85 -174 -249 133 1 -65 125 -35 -51 0 35 -201 -69 127 -33 -42 -70 -234
4446b34J57J38p9J28mpj14j31K36j24l5J21N7o7o3j04J72q0k4K4J36j65J34J08
4470A80j47j72J20J01j50K4n0J75j42n6Q2R4n8Q3j83N1J0p7Q2J21P5j35N7n3m8
4495a6R3j18O0n9J60r9j57J25q3J38j80P5J46k18Q4m0j0P9j2N3M0j10j76K68j02
4520e9N0L1J43j90J42l3j71K18l00K13N2j19j28L82p8j78j44P1J67rP8j76L0Q7
4544G9j53J43m5q3J24j81J85r7J05o7O5m9n3P9mj49K05R7l84J15M8N1Pk9Q7j73
4570g7m4J34N6p3lM1m0o8J13N8Pj86J09Qj5Qj03J70j39K34m9j72J05k6j22J68
4596I4j09P4k01K22l6q4J86j11o1m4K14l31K54j39J35j24K35j06r7m6Q4N4k61
4619a98R4K10r6j66J77rK1J38k04P0o9l16M29l2q4J3J2J6K54l68J62j38L0k7K06
$$ plain form
4446 -234 -77 61 -18 110 106 99 -15 -146 90 -34 -69 52 109 42 -21 -125 47 -33 -57 -33 103 -62 72 180
4470 180 33 -139 -19 82 -68 -44 -94 81 -61 -117 -35 59 1 84 -99 -48 -38 -115 -33 88 163 28 85 32 -16
4495 -16 77 -41 19 -40 120 21 -136 -11 -94 44 -136 -61 85 -133 -49 -89 -99 -20 -32 21 61 -49 -225 43 -59
4520 -59 -9 22 165 -25 117 84 -87 131 -169 44 96 -23 -151 231 153 -25 -169 -98 69 60 138 -38 -8 79
4544 79 -74 69 24 -59 65 -116 69 -28 77 10 75 26 -27 52 48 -101 104 201 -183 -68 -20 31 38 9 96 -77
4570 -77 -121 13 69 -4 -7 34 -6 -74 39 97 104 -82 27 35 20 28 -75 95 -44 190 141 -31 74 48 -74 94
4596 94 -15 59 -142 80 44 -40 146 35 -26 -70 144 -187 67 -72 63 -61 174 68 -29 -75 9 63 -198
4619 -198 -104 106 10 -156 21 12 33 171 -33 37 -32 -348 81 49 -35 -22 -10 6 260 -108 54 -84 -54 -81 125
4644A25j51L5J59j86R3j17L8L4l7j7j04J29p5J51J75k88J03j60J15K44m13K51
4666A04M1q8l9j67M50k90k28K49j27P3L2k7j15K61j51k2p1J68J90j87o5m3Q9p7
4690d0j16K47q9R6m8m3K4L9Ml5N7j58K6Ln3O1J05p8q9J90rJ7r2Qj9OJ56l28O5
4719i3J8N7j30K00j12JO9RJ73j02l63K26R5j15p6R1N7j13K79j06j10mJ64p3j51
4744a09J81j13J45l27M0J18J03k85J33J10R4j31L1P2l7q5k12J31K39j15j59K03
4766B7J5k7l4J86j76j13j1K20p0m9O8o9o3K4K4J16r0j02N0N5q1K62q6j40L6K9
4792AM5k2Lq0p3J06O4k3J79k04J5Q5j69P5j57K98k28J01j19Q6q5N2J17q8m6K4
4818d3J44k19J12n4J31n6m8j7MN7k4j7J70k9j85J63j91J10j07J36M0j36J50m9
$$ plain form
4644 125 -26 9 168 -18 75 -42 -4 30 -7 -24 -128 1 -74 77 252 -36 67 -93 22 266 -147 104
4666 104 145 57 18 -149 301 11 -217 32 -95 -22 10 -17 -132 129 -22 -44 -115 53 243 56 -9 -52 37 -40
4690 -40 -156 91 2 98 50 7 31 70 74 39 96 -62 -36 -33 -86 -25 80 2 -87 103 94 111 19 27 8 14 170 -158 -93
4719 -93 -75 -18 -148 52 -60 -59 10 19 192 90 -273 -47 48 -67 -143 -52 5 -108 171 65 -45 -49 115 42 -109
4744 -109 72 -41 104 -223 -183 -65 38 -247 -114 -4 90 -41 -10 62 25 -60 -272 -141 98 -17 -176 27
4766 27 42 15 -19 167 -9 -122 -133 87 17 -32 36 -33 -96 -72 -48 68 -22 -124 -74 -19 -100 162 76 -64 -28 1
4792 1 46 24 27 -53 -126 -20 44 21 200 -4 11 96 -73 2 -155 143 -85 16 -103 -17 -102 -50 67 -21 -67 -43
4818 -43 101 -118 -6 -60 71 15 -33 -50 -46 11 -13 -30 140 111 -74 89 -102 8 -99 37 77 -59 91 42
4842D2j53L4pJ35m3k4J40j58O5j37J39M3j18J05j72R7m9j64J12R5k6K2l6l1k5
4867a14J65o8k4P2j28L3J32Qj05k9m0J88j96O9j9J10j21J31k10L21n0j9l8j7N9
4892A10n6j00J59k25O2J15p9N1j23J22m9r2J16n9k5j6J84j88J20m7j39L38j54
4915B5j36K1J35q8J30j82M1J66j68Q7J13j12j46J01j17K77q8j2J6j30J42j70J94
4938I9j29J30r1Q5Lk66K57j46J0L9oj66R3K27p4n2J0p7M8k5M0oj50J20%j06J31
4965bj01Q7L1M3p8O1L0Oj72M7r2Q1J52k2o5j6J11o1p8P7M2j68O4j4Q5Km3N6O1
4994A24k32J18M7q5l9J46L5l16K88j05J35k38L1K27j09j1q7pnk9K67j87N2L8m6
5019A2l5N7j34J69j05N4J4M9Ok30K19p8oo5K5K05k09J10j93K26r7q4K45J65k58
$$ plain form
4842 42 -111 -77 -84 51 8 -16 124 -34 31 -106 33 76 -42 63 -109 -12 -61 -225 -113 -18 -44 -22 -58 -89 -114
4867 -114 51 -17 -41 31 -97 -64 68 76 -29 -58 -98 90 -106 -37 -56 54 -67 64 -146 175 125 106 68 51 110
4892 110 54 -46 113 -112 -50 65 -14 37 -86 36 -13 -105 11 -48 -73 -89 95 -93 27 -20 -159 179 25
4915 25 -111 -90 45 -43 87 -95 -54 112 -56 31 144 32 -114 -13 -130 147 59 47 63 -67 75 -95 99
4938 99 -30 100 9 94 97 -169 88 -58 -48 -9 -15 -181 -88 139 65 13 23 -54 -6 -31 9 3 -147 -27 -27 -133 -2
4965 -2 -103 -16 15 58 -20 41 71 77 -95 -48 -140 -59 93 71 6 -10 101 40 -38 39 81 -87 -23 -37 48 50 7 63 124
4994 124 -108 10 57 -28 -67 79 114 -202 86 -19 116 -122 -91 136 27 16 -71 -78 -83 -112 155 -32 20 58 12
5019 12 -23 34 -100 69 -36 18 32 81 87 -143 76 -2 -8 -73 -48 157 -52 58 -135 91 -6 -90 155 320 62
5044F2j38M5Q9Q5k28J28l1N1k2k5rO6O5r0p8P8N3N2j63j45K32m5p2N2K6k9M5m5
5072Il0R5q9l5J84j24j40J38k3j4%J1JR0p3MR3n9M2p3kl5Q9J7m9j42J40k9j48
5101a52J45J17J5j41P6j01P8o1M8m8J74k05j30J90J11m3j73J10N5lK91m10m4K15
5125A14J9p8Pn2N9r7j56LJ30Q1M3k5J3q1k7p1Q5l1R2j82K20K1j98K74m10N09l33
5152g1J43k30J05J01n3M4l5l9j61J09J6J5N8j39J05J40q6J63Rr9j44K6pl9N4J67
5178A52j68K5J2p1L0p0J18j15Q6L0L9n3n7j27J70Q4l2KN3J0n9j83J80q6M7J21
5204A38j8q1l3M0K7J1j23Q0K14m02J25J9m8o8K2L75k84o5j3K51j33j4p9Q2O2n
5230H0j62J19j44K8j1K1N9p9J27l2j18K4Q6K6m1J89m4j52Q1K9j71O7N0J46k21
$$ plain form
5044 62 -76 -31 58 143 -85 43 12 63 41 16 7 73 138 48 -30 48 101 153 -10 -155 77 32 -40 12 38 9 54 9
5072 9 -21 74 -15 -50 134 10 -130 8 -15 -29 -29 -18 -17 73 0 4 97 38 80 7 5 -30 59 76 27 -115 25 -4 -152
5101 -152 -7 110 125 -16 60 -41 37 -24 24 -24 150 -55 -185 5 116 73 -100 10 65 62 353 -57 -101 114
5125 114 133 55 62 10 69 -28 -184 -181 -51 30 73 48 61 -20 -47 -118 -33 -64 28 -154 66 87 -111 163 -247 262 -71
5152 -71 72 -158 -53 48 -5 39 4 -35 -196 -87 -71 -56 2 -137 -32 108 22 185 194 95 -49 -23 -30 -69 -15 152
5178 152 -16 9 21 -50 -20 -90 28 -87 -1 29 68 15 -42 -169 1 85 53 55 108 118 59 -124 56 -30 17 138
5204 138 120 39 6 46 73 84 -39 41 255 -147 -22 -3 -51 -119 -97 278 -6 -71 -84 167 34 20 -59 23 85 80
5230 80 -82 37 -107 -79 -90 -69 -10 -89 38 6 -112 -88 -2 24 -17 172 128 -24 57 86 -85 -18 32 178 -43
5255d3J8k1M0M6q4k8n3J84j81K03O4k31LL8k8R4mJ01n0k03J65j07J4L9J9K5j27
5282a07K13l7N8r6or6J70l4n1q5K28k00K9n5J42m1j84K15oj30J64n5k10L30j94
5307c8l1m2K30j03n3qJ17j67m0J44q3K37j47j6m1N3K03l50J43K6n9J30l1M6j79
5332e9J9L4L6L5J08j61o0j07L15j53K7m3J16m7l2j27K17j25j7Q7j45L65k96K64
5356B51k62m8J20j07Q5j46J76pO8k92K85J67k09k72K28l7j62K08J28k42K30k93
5378a31O8M0j6J08k50K03q8j33J25QJ16m6j97J12n4K38k01r2J82N8Qk73K73l3
5402B5m4l4j4O0l9n5P9j19J7O8J08K0k07J41j15J07o7J51l3Nr8j62J27J25j43
5427i7J38J22r6k0l4M7L4j57Q4r0J43j13P1k0j9K8k0j3O6R9q0j8k05K17p7L0j65
$$ plain form
5255 -43 -25 -46 -6 40 -44 -72 -125 59 -122 81 145 -86 -83 -45 -73 21 17 118 68 -135 30 -77 -63 -24 -5 20 -107
5282 -107 106 69 127 31 25 -71 99 65 14 -71 157 -43 -14 -69 73 32 -152 63 57 -73 91 36 -174 156 -38
5307 -38 -69 -111 119 16 -37 -45 72 -95 -135 9 -74 163 16 0 -41 12 215 -135 8 34 -25 105 74 120 -59
5332 -59 -40 -6 30 65 173 12 -48 -155 160 7 34 -9 107 60 28 -99 118 -7 -24 63 -82 283 -13 251
5356 251 -11 -59 61 -46 39 -107 69 62 130 -162 123 290 81 -191 37 0 -162 46 174 -68 162 -131
5378 -131 -63 -23 -39 69 -181 22 -66 -199 -74 -66 50 4 -193 -81 -135 103 -98 -190 -8 50 58 -215 58 25
5402 25 -19 -53 -67 -7 -46 -101 -22 -141 -124 -56 52 72 -135 6 -109 -2 -69 82 49 54 -44 -206 -79 46 -97
5427 -97 41 163 67 47 13 60 94 -63 21 -69 74 -39 32 12 -7 21 1 -12 54 153 73 55 -150 67 -10 20 -145
5454a45K92j70l7NJ91J3j28Mm7k6j19N2J97l50K09P1lj55j1J22p5L8o6J77r0L0
5480b1J11j98J79n8k07J6K70O5p0p6K9j42J09l9N1j7j15J10LR0j07ppM5p6r1o0
5507b13J40J75j90L5O0J65j50n6J9j10J08O4m0q3K6q4J93j03R3k6Lq6K15lj52
5532@k4o5O2j2J53j4M1j42n2L4J20j18m1J39k6K7l1j59Ll6K22qk35J36M2p6K25
5559A65j60o3N6N0L7P3q4Q5j80n4J93l8k9j37J25j04M8J05j20J32m0j50K04p4
5583D0J56j11P6k09J0O8K4J74j33K9k23J77Pm0oO5j13J34j57k8M2n9K0l8K5L7
5609c3J72j75J2l4qO8O1j43J3J12o6m3J71L7k14K45j93J49j96R4J80k99J19r5
5633f6J0QR5M2q1j29J6J16j04P9r5J30J1j70Q9Q8J0R1k37M9l4k5P8j12J17K2J01
$$ plain form
5454 -145 147 -23 -60 -55 136 149 21 25 -22 -48 -167 -115 82 -268 -59 12 9 -146 -157 -35 -110 -72 -138 39 -51 -21
5480 -21 90 -108 71 13 -194 -178 92 157 87 11 40 -102 7 -32 19 2 -113 -3 0 90 -17 -24 -31 14 -62 -153 -213
5507 -213 -73 102 -88 -53 7 172 22 -34 -15 -125 -17 47 7 -76 -50 -134 59 -44 49 23 26 -60 155 152 0
5532 0 -24 -89 -27 -39 114 100 141 -1 -53 -19 101 -17 -58 81 55 82 51 -108 -105 -141 81 73 -162 -26 16 -60 165
5559 165 5 -58 -2 48 85 158 74 159 -21 -75 118 80 51 -86 39 -65 -17 88 -32 100 60 -90 114 40
5583 40 196 85 161 -48 -38 30 54 228 95 124 -99 78 85 45 39 104 -9 125 -32 -60 -18 -77 -57 -95 -70 -33
5609 -33 139 -36 -24 -58 -66 2 63 -80 -67 45 -21 -64 107 144 -70 175 -18 131 -65 29 209 -90 29 -66
5633 -66 -56 -48 47 89 8 -121 -105 11 -93 -14 -109 21 32 -138 -49 39 49 140 -97 -48 -82 -107 -29 -141 -24 -2 99
5660I9j28j66K03j08J53m9J58r8j42L4J96n1lm1P7j80N9j78K03j69J8K8j5Q8p0
5685h2L15l74J52j69K06k4m7P3pP8q6k7l1L3q9J05o6J11l5j5p4J63M3m2Rj26r
5712a5J13jl4M4l1Mj17r8K43j22m0l2Q7O1Q6K2n8j51N1J3j37J30j6L7l3P7j77
5739i4J15p7K65k32K09m09J96R9ln8O6Ol8lj2L5J10k15n4J90k39J70Q6k5l12K26
5765BQ4j93J48N3r3P8j79O9O2KJ1q7J05j76J91l9K7j01n8J60r3J06n4j0r9p6K56
5792I6n8J33k17J02O5k16P2k2N8p9R0k4r1R4k1N5L5j04Q6k58J4P5Q7j6r0m3L16
5819A39r3j49J47M1k4l4J10j26M5k0r1Q8o0Q0o1k8p1K00j96R7K08l04J01j46j
5844a48P5K02j35r5n6Q6J50L5k11J9J28o9P1L6n5j25J34j35m7J88m4j75lK10J05
$$ plain form
5660 99 -29 -195 8 -100 53 4 162 64 -78 -44 152 101 98 57 134 -46 13 -165 38 -131 -113 -85 -100 -12 -82
5685 -82 233 -141 11 -158 48 24 -23 50 43 121 35 8 -23 10 -79 26 -40 71 36 21 -53 110 153 111 120 -6 -15
5712 -15 98 97 63 107 76 80 -37 -135 108 -14 -54 -86 1 62 148 170 112 -39 12 25 -112 18 2 39 6 83 -94
5739 -94 21 -56 209 -23 186 -223 -27 72 69 11 77 83 45 42 30 65 175 -40 -94 96 -143 27 113 88 -224 2
5765 2 86 -107 41 94 1 79 -100 -31 31 33 44 -43 62 -114 77 38 65 -36 -94 66 -27 79 25 15 -84 -160 96
5792 96 38 171 -46 56 121 -95 -23 -45 13 -66 24 0 -91 3 -18 37 72 -32 54 -204 -190 -115 -28 -44 -134 -177 139
5819 139 46 -103 44 85 61 27 137 11 56 36 -55 33 -27 53 -8 -36 -107 93 -103 -6 202 -102 -1 -147 -148
5844 -148 -73 129 -6 -101 -157 -71 79 114 -97 -78 50 -19 52 88 33 -92 42 -93 -140 48 4 -171 -174 36 141
5869A41j25j30J44k42J46K7j0K2n1J97q3L4j57K64k28m1OM5O4n7j03J03R6r8J2
5894b4o8k%J69k38J51R6o4r9l6J67Q3k59K50j62Q3j6j20o8N4J98j11J17j08m6
5919e3O8p0j09J09Q7m4N9n7J09k5j30J32o8J3l8l8rJ33k30Q9R0J16n6j62L2Q3
5945C1l2k5jJ16j47J54j39J64j16j66J41J1j39K29j43J67j18j6p3J80l8m9p2j2
5969i3j24K74Kr4p5J19M8j07n4P5K9p1R3j32J22j08K05l24K19k4R8J1l2o3k9j14
5995a49Q9kJ52p4m7L2K9j15K1J44j16o6R9J52j54p3Q5l6j82K47n6N2r4M2K22k08
$$ plain form
5869 141 16 -114 30 -212 -66 -39 -49 -27 -78 119 36 70 -87 177 -51 -92 -86 -41 23 -34 -137 -34 62 -36 -24
5894 -24 -92 -94 -94 75 -163 -12 84 20 -79 -115 52 135 -124 126 -36 47 31 -89 -157 -103 95 -16 101 -7 -53
5919 -53 15 -55 -164 -55 32 -12 47 -10 99 74 -56 76 8 21 -17 -55 -64 69 -161 -72 18 134 78 -84 -52 31
5945 31 -1 -26 -27 89 -58 96 -43 121 5 -161 -20 -9 -148 81 -62 105 -13 -29 -102 78 40 -9 -81 -93
5969 -93 -217 57 59 -35 -110 9 57 -50 -104 -29 0 -71 22 -110 12 -96 109 -215 4 -20 78 89 57 -6 -35 -149
5995 -149 -60 -62 90 16 -31 1 30 -85 -64 80 -36 -102 -3 149 -5 -78 7 -29 -211 36 -20 32 -62 -20 202 -6
$$ [...]
8190iL9
8191C0
##END NTUPLES=NMR FID
##END=
