##TITLE=1H_LR-758-2-CR8-H
 D2O
 8 sc, 
 3.7.2023
##JCAMPDX= 6.0         $$ Bruker NMR JCAMP-DX V2.0
##DATA TYPE= NMR FID
##DATA CLASS= NTUPLES
##ORIGIN= UXNMR, Bruker Analytische Messtechnik GmbH
##OWNER= root
$$ XWIN-NMR		Version 3.5
$$ Mon Jul  3 15:41:16 2023 Russian Standard Time (UT+4h)  she@DPX200
##.OBSERVE FREQUENCY= 200.13135
##.OBSERVE NUCLEUS= ^1H
##.DELAY= (6, 6)
##.ACQUISITION MODE= SIMULTANEOUS
##.ACQUISITION SCHEME= undefined
##.AVERAGES= 8
##.DIGITISER RES= 18
##SPECTROMETER/DATA SYSTEM= spect
##.PULSE SEQUENCE= zg30
##.SOLVENT NAME= D2O
##.SHIFT REFERENCE= (INTERNAL, D2O, 0, 15.7039)
##AUDIT TRAIL= $$ (NUMBER, WHEN, WHO, WHERE, WHAT)
$$ ##TITLE= Audit trail, XWIN-NMR		Version 3.5
$$ ##JCAMPDX= 5.01
$$ ##ORIGIN= Bruker BioSpin GmbH
$$ ##OWNER= she
$$ F:/spectra/data/she/nmr/H-F/1/audita.txt
$$ ##AUDIT TRAIL=  $$ (NUMBER, WHEN, WHO, WHERE, WHAT)
(   1,<2023-07-03 15:40:07.78 +0400>,<she>,<DPX200>,
      <created by zg, POWCHK disabled, PULCHK disabled
       configuration hash MD5:
       00 E9 B6 7A A2 85 ED C7 34 08 36 98 17 FE 4E 26
       data hash MD5: 16K
       5F 60 4E F4 BB 51 8E FC EE AC AF 94 EA 0D 82 6B>)
$$ ##END=
$$ 
$$ hash MD5
$$ 1B 30 FC 8B 86 A8 2F D0 05 1A A1 2B 56 D8 E4 61
##$RELAX= 
##$RELAX= 
##$RELAX= 
##$RELAX= 
##$RELAX= 
##$RELAX= 
$$ Bruker specific parameters
$$ --------------------------
##$DU= <F:/spectra>
##$EXPNO= 1
##$NAME= <H-F>
##$PROCNO= 1
##$TYPE= <nmr>
##$USER= <she>
##$AMP= (0..31)
100 100 100 100 100 100 100 100 100 100 100 100 100 100 100 100 100 100 
100 100 100 100 100 100 100 100 100 100 100 100 100 100 
##$AQSEQ= 0
##$AQ_mod= 1
##$AUNM= <au_zg>
##$AUTOPOS= <>
##$BF1= 200.13
##$BF2= 200.13
##$BF3= 200.13
##$BF4= 200.13
##$BF5= 200.13
##$BF6= 200.13
##$BF7= 200.13
##$BF8= 200.13
##$BYTORDA= 1
##$CFDGTYP= 0
##$CFRGTYP= 5
##$CHEMSTR= <none>
##$CNST= (0..31)
1 1 145 1 1 1 1 1 1 1 1 1 1 1 1 1 1 1 1 1 1 1 1 1 1 1 1 1 1 1 1 1 
##$CPDPRG= <>
##$CPDPRG1= <>
##$CPDPRG2= <>
##$CPDPRG3= <>
##$CPDPRG4= <mlev>
##$CPDPRG5= <mlev>
##$CPDPRG6= <mlev>
##$CPDPRG7= <mlev>
##$CPDPRG8= <mlev>
##$CPDPRGB= <>
##$CPDPRGT= <>
##$D= (0..31)
0 1.2 0 0 0 0 0 0 0 0.06 0 0.03 0 0 0 0 0.0002 0 0 0 0 0 0 0 0 0 0 0 0 
0 0 0 
##$DATE= 1688384407
##$DBL= (0..7)
120 120 120 120 120 120 120 120 
##$DBP= (0..7)
150 150 150 150 150 150 150 150 
##$DBP07= 0
##$DBPNAM0= <>
##$DBPNAM1= <>
##$DBPNAM2= <>
##$DBPNAM3= <>
##$DBPNAM4= <>
##$DBPNAM5= <>
##$DBPNAM6= <>
##$DBPNAM7= <>
##$DBPOAL= (0..7)
0.5 0.5 0.5 0.5 0.5 0.5 0.5 0.5 
##$DBPOFFS= (0..7)
0 0 0 0 0 0 0 0 
##$DE= 6
##$DECBNUC= <off>
##$DECIM= 32
##$DECNUC= <off>
##$DECSTAT= 4
##$DIGMOD= 1
##$DIGTYP= 9
##$DL= (0..7)
0 120 120 120 120 120 120 120 
##$DP= (0..7)
150 150 150 150 150 150 150 150 
##$DP07= 0
##$DPNAME0= <>
##$DPNAME1= <>
##$DPNAME2= <>
##$DPNAME3= <>
##$DPNAME4= <>
##$DPNAME5= <>
##$DPNAME6= <>
##$DPNAME7= <>
##$DPOAL= (0..7)
0.5 0.5 0.5 0.5 0.5 0.5 0.5 0.5 
##$DPOFFS= (0..7)
0 0 0 0 0 0 0 0 
##$DQDMODE= 0
##$DR= 18
##$DS= 0
##$DSLIST= <SSSSSSSSSSSSSSS>
$$ [...]
##$SUBNAM2= <"">
##$SUBNAM3= <"">
##$SUBNAM4= <"">
##$SUBNAM5= <"">
##$SUBNAM6= <"">
##$SUBNAM7= <"">
##$SUBNAM8= <"">
##$SUBNAM9= <"">
##$SW= 18.05172834244
##$SWIBOX= (0..15)
0 0 2 0 0 0 0 0 0 0 0 0 0 0 0 0 
##$SW_h= 3612.71676300578
##$TD= 16384
##$TD0= 1
##$TE= 0
##$TE2= 300
##$TE3= 300
##$TEG= 300
##$TL= (0..7)
0 120 120 120 120 120 120 120 
##$TP= (0..7)
150 150 150 150 150 150 150 150 
##$TP07= 0
##$TPNAME0= <>
##$TPNAME1= <>
##$TPNAME2= <>
##$TPNAME3= <>
##$TPNAME4= <>
##$TPNAME5= <>
##$TPNAME6= <>
##$TPNAME7= <>
##$TPOAL= (0..7)
0.5 0.5 0.5 0.5 0.5 0.5 0.5 0.5 
##$TPOFFS= (0..7)
0 0 0 0 0 0 0 0 
##$TUNHIN= 0
##$TUNHOUT= 0
##$TUNXOUT= 0
##$USERA1= <user>
##$USERA2= <user>
##$USERA3= <user>
##$USERA4= <user>
##$USERA5= <user>
##$V9= 5
##$VALIST= <valist>
##$VCLIST= <CCCCCCCCCCCCCCC>
##$VD= 0
##$VDLIST= <DDDDDDDDDDDDDDD>
##$VPLIST= <PPPPPPPPPPPPPPP>
##$VTLIST= <TTTTTTTTTTTTTTT>
##$WBST= 1024
##$WBSW= 4
##$XGAIN= (0..3)
0 0 0 0 
##$XL= 0
##$YL= 0
##$YMAX_a= 372889
##$YMIN_a= -538428
##$ZGOPTNS= <>
##$ZL1= 120
##$ZL2= 120
##$ZL3= 120
##$ZL4= 120
##$ABSF1= 10
##$ABSF2= 0
##$ABSG= 5
##$ABSL= 3
##$ALPHA= 0
##$AQORDER= 0
##$ASSFAC= 0
##$ASSFACI= 0
##$ASSFACX= 0
##$ASSWID= 0
##$AUNMP= <proc_1d>
##$AZFE= 0.1
##$AZFW= 0.1
##$BCFW= 1
##$BC_mod= 2
##$BYTORDP= 1
##$COROFFS= 0
##$CY= 11.3945322036743
##$DATMOD= 1
##$DC= 2
##$DFILT= <>
##$DTYPP= 0
##$F1P= 15.7292609196834
##$F2P= 12.9074282941183
##$FCOR= 0.5
##$FTSIZE= 0
##$FT_mod= 4
##$GAMMA= 1
##$GB= 0.15
##$INTBC= 1
##$INTSCL= 1
##$ISEN= 128
##$LB= 0.24
##$LEV0= 0
##$LPBIN= 0
##$MAXI= 10000
##$MC2= 0
##$MEAN= 0
##$ME_mod= 0
##$MI= 1.114404
##$NCOEF= 0
##$NC_proc= 0
##$NLEV= 6
##$NOISF1= 3.799351
##$NOISF2= 2.8
##$NSP= 1
##$NTH_PI= 0
##$NZP= 0
##$OFFSET= 15.70392
##$PC= 1
##$PHC0= -20637.27
##$PHC1= 13.25272
##$PH_mod= 1
##$PKNL= yes
##$PPARMOD= 0
##$PSCAL= 0
##$PSIGN= 0
##$REVERSE= no
##$SF= 200.130013532006
##$SI= 16384
##$SIGF1= 3
##$SIGF2= 2
##$SINO= 400
##$SIOLD= 16384
##$SREGLST= <1H.CDCl3>
##$SSB= 0
##$STSI= 0
##$STSR= 0
##$SW_p= 3612.71676300578
##$SYMM= 0
##$S_DEV= 0
##$TDeff= 0
##$TDoff= 0
##$TI= <>
##$TILT= no
##$TM1= 0
##$TM2= 0
##$TOPLEV= 0
##$USERP1= <user>
##$USERP2= <user>
##$USERP3= <user>
##$USERP4= <user>
##$USERP5= <user>
##$WDW= 1
##$XDIM= 8192
##$YMAX_p= 0
##$YMIN_p= 0
$$ End of Bruker specific parameters
$$ ---------------------------------
##NTUPLES= NMR FID
##VAR_NAME=  TIME,          FID/REAL,        FID/IMAG
##SYMBOL=    X,             R,               I
##VAR_TYPE=  INDEPENDENT,   DEPENDENT,       DEPENDENT
##VAR_FORM=  AFFN,          ASDF,            ASDF
##VAR_DIM=   8192,          8192,            8192
##UNITS=     SECONDS,       ARBITRARY UNITS, ARBITRARY UNITS
##FACTOR=    0.0002768,     1,               1
##FIRST=     0,             0,               0
##LAST=      2.2672688,     0,               0
##MIN=       0,             -538428,         0
##MAX=       2.2672688,     372889,          0
$$ Real data points
##PAGE= N=1
##DATA TABLE= (X++(R..R)), XYDATA
$$ [...]
1556b121J427O83J277R84j034r25n77j630K79J235R3J372J327j171o79q56j796
1573b112M60J161M3J560J038o82q93r86j733N51J153R0J389J218j030p37q05j398
1591a713o2R08N79J524R89j395o2p14k219N41J117o8J487R71r15l02o18j934L46
1610a540P45J60J764P93j025K03j208j849M73R51p1J374J068q89r1r95j639N69
1628a207O08k90K013Q87j277K72p67j905L91N46l2J671P38o15M0j057j466K47
1646a203J90o1K322P12j464L34j66k294K27P56l5J495P12o07J78j080j616O86
1664i14J1K1J894O02j040N11o67j871L55N17m73J826Q18p36K96j346j304Q66j11
1683g45m63K064O49r28M47p32j670L15K89j75J729L49k78N37j192j591O30j80
$$ y = [-2121, -694, -11, 1266, 2250, 1216, 291, -286, -1916, -1637, -402, -309, 1063, 2390, 1219, 540, -316, -2112, -1652, -491, -448, 1112, 2150, 1468, 575, -411, -2144, -1593, -440, -350, 1039, 2257, 1227, 490, -315, -1713, -1775, -867, -288, 1236, 2225, 830, 768, 54, -2165, -1624, -507, -575, 912, 1883, 968, 666, 48, -1886, -1540, -795, -635, 1129, 1922, 897, 1100, -108, -1957, -1484, -533, -604, 770, 1838, 949, 858, -137, -1776, -1207, -599, -889, 1124, 2011, 734, 1006, 239, -1666, -1275, -729, -761, 910, 1648, 1033, 1073, 16, -1450, -1203, -1013, -1074, 1248, 1960, 496, 830, 664, -1630, -1403, -647, -682, 813, 1525, 918, 1096, 16, -1600, -914, -903, -882, 1012, 1614, 574, 1085, 418, -1453, -1098, -581, -1054, 772, 1590, 854, 1150, -196, -1500, -634, -745, -1208, 856, 1505, 577, 1024, 292, -1378, -1063, -774, -949, 780, 1129, 851, 1388, 196, -1395, -765, -945]
1701i45r2K039J25p02R73j255j642N59K18k40J671M07n80Q39r29j776O50j98n3
1720i31J581M10m74P15j070j455Q16n51o5J706L65m14O88j076j224N41o99k8J868
1739G03K36m42R11j115j478O82l91k81J669M69m50Q35j073j149L86n81L9J642
1757F12Q8j87R36j234j270N69l64k60J768Nl00J049j214j133P19o84l22J719L05
1776H02l18Q14r24j208L93o24j15J614J95m1P71j105r25L27p75J2J592k3p3J129
1796A518j337j040O68q59n9J637j63J82J013j329q30K84p93J36J334o9J84J075
1814A552j434p69M58q71J40J259j55J83J162j442o75M08q84j69J670m3J1J045
1832A446j100p09K63j013K15J312j59J47Q48j026n84L88j042N3J360l74L44Q95
$$ y = [-945, -1037, 1002, 1127, 425, 1398, 143, -1499, -940, -722, -962, 709, 1116, 536, 1375, 446, -1330, -680, -878, -931, 650, 1060, 586, 1301, 231, -1224, -408, -959, -1024, 682, 1047, 633, 1321, 245, -979, -438, -1137, -1165, 703, 939, 497, 1408, 293, -1185, -503, -894, -1175, 494, 963, 513, 1348, 275, -874, -488, -1069, -1030, 612, 700, 513, 1449, 215, -1055, -486, -850, -1110, 658, 663, 363, 1412, 198, -935, -216, -900, -1222, 497, 802, 484, 1298, 374, -834, -441, -1065, -1180, 434, 629, 588, 1359, 254, -671, -344, -1119, -1107, 485, 462, 389, 1518, 181, -859, -191, -1050, -1109, 528, 365, 547, 1560, 231, -599, -315, -1108, -972, 362, 293, 477, 1552, 118, -651, -193, -1064, -924, 335, 180, 363, 1525, 83, -592, -184, -1068, -1237, 433, 390, 401, 1446, 346, -363, -100, -1113, -898, 414, 255, 402, 1250, 224, -360, 28, -1014, -961, 399, 25, 369, 1264]
1850A264j058o56L24q90J71J167j97L84O23q49n98L36j104j1J457k70L95Q49j064
1869B73m68J64j205N29J017k48M34R31j306l99J34p96j07J098L3L89Q19j065m61
1888b34K02q23O5Q70r9N09O95j034l85L27r74R7R25k48L51Q68q17m38J09q61k3
1909i18Q94k08O38N85n73l49j28q52J67R74m31P92N14q26l04K12j120Q0J023k32
1929f2L89P43q05m16J60q97J71Q66k87N39N86o35l65j55o21J08O39k02O29M69
1949H54p31j08P4r72J62R28m06M43N50m51l22Q3r33Q3O60j30N65N43m50l36K4
1970A30p88J08L43q3O17M22m38M3m75p59L91M08k80O98N24q07J83k17o96K78K41
1991a57J4N34M20o74N2p4o73Q5J45J9O17M65m93j0k25o62K78J93k17N62L66k49
$$ y = [1264, 206, -450, -126, -1016, -845, 322, 125, 509, 1132, 283, -315, 21, -1083, -1094, 363, 93, 488, 1337, 273, -195, -31, -1236, -707, 310, 62, 496, 1427, 121, -278, -144, -940, -1047, 51, 84, 473, 1292, 227, -234, -32, -855, -790, 80, -19, 490, 1185, 151, -234, 93, -881, -784, 141, -107, 244, 1112, 295, -143, -34, -895, -918, -24, -232, 406, 991, 418, 69, -59, -911, -744, 230, -201, 591, 1105, 279, -25, 187, -933, -853, 170, -62, 327, 1070, 265, -151, 9, -888, -717, 149, -138, 401, 987, 352, -13, -168, -789, -681, -42, -244, 385, 854, 123, 15, 89, -883, -721, 207, -199, 244, 794, 343, 21, 104, -829, -746, -86, -216, 349, 892, 442, 106, 130, -658, -550, -207, -290, 327, 749, 311, 354, -121, -880, -489, -81, -361, 337, 861, 54, 237, 20, -676, -398, -157, -143, 391, 811, 137, 189, 115, -558, -473, -328, -309, 308, 773, 280, 270, 45, -617, -339, -146, -363, 199, 565, 316]
2013C16o9j08o92J42L42k05M36N96m48r7k51n16J48L52j03L98N63n20o6O1q33
2034e54M9N79m48O02K36m91M10q4j058K07M59j31M89L14k30O7j40r14O6K22P8
2055b72N02K35l19L01k85o87L8K91m7M01M13l35K68l30p06K50l6l6L87M13j76
2076B70l5n1m88J41j29PL00M34j34O9j81o53J68K2k3M20L27m21L36k85m54J19
2098b41qP3M12O5R6Q4k36n61N2K0JK74L10k61L97l37l93O1J05l26O14R0M4o3p0
2123B02m22Q0j95J29M98K8j18Q9n9m91J75l22K30M50J6k25L73l22m37M1L6K2L40
2146A18J45m4J3l1m52Q8k2n1K50K80j20K98m36l44J9q7J36L35j5N7J78l58k62
2169c05K94k94J4M64J15j41L48m17k90np7r8M42L46j41K61m78q5j63j42J3M83
$$ y = [316, 247, 139, -553, -411, -69, -274, 162, 758, 310, 213, -38, -554, -406, -54, -157, 241, 804, 284, 218, 279, -554, -505, 74, -374, 228, 464, -27, 383, 299, -759, -552, -93, -224, 265, 579, 349, 416, 276, -638, -572, -350, -272, 230, 465, 146, 447, 162, -525, -487, -196, -243, 158, 571, 236, 504, 174, -532, -282, -318, -354, 33, 446, 270, 235, 184, -304, -163, -292, -285, 15, 449, 315, 384, 203, -450, -282, -260, -283, 137, 464, 43, 379, 94, -360, -241, -249, -176, 236, 301, 397, 481, 245, -316, -264, -244, -243, 31, 341, 80, 477, 140, -253, -192, -87, -413, 201, 291, 335, 272, 202, -220, -140, -335, -206, 292, 320, 202, 291, 232, -259, -84, -406, -176, 274, 290, 65, 438, 116, -321, -280, -244, -222, 118, 263, 219, 232, 201, -251, -163, -185, -236, 14, 294, 174, 472, 36, -308, -289, -376, -240, 95, 80, 137, 315, -43, -305, -11, -305, -291, 173, 288, 147, 495, 78, -212, -217, -294, -392, 50, 396, 255, 516, 38, -47, -210, -352, -339, 144]
2191A44o7P6L86l75n53L74j79j22L73mL51j00j85k55K9j51n4L61R2N8R0l08j63
2214a82J9q7Q7J91K8K92J70l89n00K73j27j08N06N2J2K60l64k63m4n5j25N22j89
2237b1J89K51l93j08m3k76J34K82o7M55K4m20j23k2k88J65M33j34J16J80l71K7
2259a0Q6l99Q1K21J91j47M97m75n8j8n40K08M87M1P2N4l27m4j8k92J35K91k19
2282a83M57R4l79J31q9n79M06J4Q9J91K36k60j17l0l81L89J6r6M34R3o14L26k74
2305a26l03K21J55j04K67M4l00K25J0n56L19Q6r4N97p9m44K27j97m15M42o1M5
2327d1K38J86k61k3M6m56J87J09k55M80Q4k48O7k44j61K86q7j43N29m4j76K19
2349B92j90m28J88L1j6L16j17n8J91j80m45L21r4J93K74p0j19K82l52k77L76j67
$$ y = [144, 77, 153, 539, 164, -389, -15, -194, -316, 57, 53, 404, 304, 119, -136, -107, -258, -312, 49, 141, 199, 289, -19, -182, -163, -250, -163, 28, 56, 348, 518, 129, -371, -98, -225, -333, 173, 225, 237, 497, 133, -130, -174, -229, -354, 168, -21, 168, 419, 26, -82, -125, -401, -267, 15, -52, 403, 427, 7, -116, -138, -426, -261, 172, 38, 154, 334, -37, -10, 76, -323, -242, -21, 170, 23, 520, 45, -13, -31, -571, -363, 124, 165, 237, 291, -36, -80, -98, -390, -255, 36, -183, 274, 368, -11, 120, 31, -548, -142, -128, -39, 152, 388, 128, 11, -19, -400, -11, 5, -91, 343, 436, -178, 148, -126, -429, -208, -53, -157, 110, 154, -146, 79, 89, -467, -148, -62, -156, 441, 362, -82, 145, -52, -467, -25, -86, -41, 197, 383, 122, 99, 145, -311, -124, -15, -270, 210, 294, 46, 113, -131, -292, -6, -93, -236, 293, 249, 73, 292, 102, -326, -138, -107, -123, 193, 76, 18, 209, 29, -416, -95, -189, 4, 278, 208, 89, 371, 19, -258, 118, -49]
2371d9o8M23j06j36J59k56l77L83p4j27M41j36r9J48j96k88M29j44k99P07k27
2392A08N9l0j40j17L2O1j17L70j08L4l1o9k79K92j01j20N18j80k73K31j35k64
2414b59J86k4M6K77q8k5J66l40l8N0j89K08K05k9ol2k43O9J22k07oK70l5L4o3
2439D9k01j7Q8r5k8M16o5k5J49k52j40J67k35N7L12k91K29Q1k11j64L73m05J30
2462g8J50QM7J1j38r3%j40K37K9oK4K23k85k12Jl8P3L20k70L34q8q1o4J61k78
2488a53P9K50k75K42m2J8k64M4o2J48O1n9J23r9L9j52R4k57K47OP7q9J70k24o6
2513a44J5q9J96k7J51N4j10r8P1m0k56K25K46p4J05r0k14L8L3j36N9R7R5O6J31
2538C04l67p2K19k22J68Q8k65L12Nj42j90j1J43k51N33j85J09K3Qk64r6J07k9
$$ y = [-49, -117, 306, 200, 64, 223, -33, -410, -27, -101, -228, 213, 77, -22, 126, -70, -358, 71, -73, -372, 335, 108, 167, 137, -3, -120, -88, -27, -144, 226, 118, 152, 121, 52, -227, 65, -36, -156, 362, 182, -91, 140, 5, -259, -73, -97, -51, 226, 138, 113, 279, -61, -99, -49, -238, -30, 175, 146, 140, 108, -135, -66, 56, -151, -157, 113, 78, 112, 49, -152, -169, -81, -176, -204, 212, 147, 122, 271, 19, -121, 46, -189, -132, 180, -111, 118, 199, -12, -176, 197, -208, -78, 72, 80, 127, 138, 0, -93, -93, -233, 4, 33, 27, 51, 274, -11, -223, -222, -260, -187, 133, -137, 197, 109, 28, -36, 125, -153, -74, 176, -99, 143, 101, 119, -145, -101, -163, -15, 46, -13, 110, 11, 50, -102, -8, -265, -18, -12, 65, -24, 146, -78, -144, -129, -218, -22, -49, 102, 156, 46, -52, 19, -21, -277, -52, 194, 120, 225, 135, -79, -41, -8, -144, -85, 12, 107, 173, 304, -63, -135, 84, -138, 30, 118, -147, 165, 170, 28, -162, -173, -30, -281, 252, 67, 176, 199, 207, -57, -153, -46, -75]
2561g5L9J20Q1j03O3k40r4K9J98J1j9O3J07j70j09K4M0K6L5Q7r4J25j55nm7L7
2587b6n1J69j05o6L21j12r0r0L8N0P5L1k98M27j65j15nk07O6L45k46J08J51k12
2611gk31L60p4j16O1q2K30L3r8j59K16k89K0J59p8M6K68j54r6K4j25K6J09K6Q3
2636A52j51R1j80Q8k79J91J30j12J89J39k81j43J73j03j91M00j15L5K2J73k72
2657d4l7J4j58K99o4K04mq9p3j43j27L2J38o5R5K05j97j99J53m6L6pM7J01L2j06
2683cq0R5j26Q2M3k08L40Lk52o0J68k31J81J59k60R5J94j02p6J82k69r3M45k35
2707hj00K52j16Q1j1j88k30L01M6J25j17Kk6N3k14K70J40m11K44N5o6j59K40k49
2731h6r5K55j58L8K67r2j61M2l7o6J38k56%L47j31J39l6k34R7l4k7K48J55l27
$$ y = [-75, -36, 84, 165, 62, 125, -115, -209, -180, 18, 29, 10, 73, 180, 10, -99, -75, -35, -9, 26, 113, 19, 144, -11, -16, -63, -26, -77, 92, -13, -79, 242, 130, 40, -50, -12, 38, 113, 144, -154, 273, 108, -7, -12, -219, -153, 192, -54, 54, 205, -7, -238, 122, 48, -68, -7, -89, 141, 174, 76, -83, 133, -156, -136, 23, -55, -9, 259, 105, 9, 33, -92, -66, 43, 69, 152, 1, 92, -88, 0, -279, -88, 42, -70, 119, 258, -23, -166, 7, -96, -287, 113, -2, 33, 55, 228, -44, -81, -67, -225, 74, 10, 214, 210, 121, 48, -95, -222, -190, -52, -117, -22, 183, -14, -213, -60, -106, -70, -77, -30, 71, 103, -3, -83, 12, -114, -32, 11, -197, 143, 146, -106, -166, 2, -229, -48, 111, -149, -54, 140, 38, -38, 144, -125, -218, 227, -8, -108, 144, 28, 109, 98, -90, -320, -19, 27, 152, 35, 37, 11, 64, -150, 120, 260, -151, 93, 148, 82, -77, 163, -86, -181, 74, -84, -46, 221, 129, -32, 10, -27, -93, 45, -211, -211, 136, 5, 144, 108, -126, -29, -63, -90, 158, 313, -14]
2755a4J49K3l45P5J03q9K60K2j48O7m0j32l0P0R6l0K67l08K11j61j90qO2r8L21
2780A33R6k80P7J76k27K0M2j53K95ok10K6n4j39L19j86qJ26K01l08Q1O2j47lp9
2805a46M2K42k47J4QJ17j94J23J42k46L0K49r2J97l37KJ43j02q4K33Rj64L41k47
2829C3k26K13Q5k33K72j2j25J10k05l3J91j06l6J79K4m5m0m5j2J40j05j28J78
2852G4J8j47K43j97q5J72j80j2J27K9k4q9RO2j2%O5j20p5K95j03j16kR7j06J21
2878D4pQj01K11q7j16J40k37J46J75k34K2M2J21j54jm0j27K99j09o9K63q9j24
2902b4L0j42K12J11j52r8K31k05r6J04J22k68L55j86l2N1k24J80Nn0l8J34K4r
2926C5rj06L0K28k43j30K85j47K35j59n0OJ68l1j49K10j78J03M9j54Lj80K5K41
$$ y = [-14, 135, 158, -187, -112, -9, -98, 162, 184, 36, 103, 63, -69, -99, -29, 67, 37, 304, -4, 207, 46, -144, -152, -90, -188, 133, 229, -51, 26, 202, -25, -5, 37, -116, 179, 173, -37, -11, -65, -204, 115, -71, -79, 47, 248, -60, 21, 83, -64, -67, -146, -104, 138, -109, -95, -87, 30, -164, -41, 101, -145, -115, 134, 42, 239, -98, -96, 47, -55, -139, 94, 103, -61, 280, 33, -193, 20, 105, -128, 144, 132, 7, 117, -88, -121, 70, -36, -72, 107, 131, 86, 46, 1, -11, 129, 24, -104, 74, 92, -55, 188, -9, -94, 78, -102, -114, 13, 42, 18, -71, -62, 0, -12, -12, 53, -67, -142, 153, 50, -66, -68, 29, -77, 44, 37, 45, -56, 155, 68, -48, 92, -145, 1, 176, -58, -36, 6, 127, -27, -28, -68, -195, 104, -5, -74, 189, 100, -24, 6, -136, 76, 187, 35, -63, 168, -37, -133, -29, 93, -175, 180, -6, -38, 13, -211, -31, -26, -76, -114, 20, 44, 35, 26, -80, -50, 178, -65, -195, 90, -57, 178, 19, -31, -25, 143, 112, -37, 173, -5, 98, 147, -7, -4, -184, -159, 82]
2950H2j76K30k09J16j80K13l1k76J61J13q7J83j73pJ77j15m8R7N6j22j06O3q3
2973a22P0O2Qn1J9j02K11L6j08J22l20L5n3L34j89J49j79J15O9P2j65Oj20N4K45
2998A98l01q0L01kk24QJ28J59q1m3M1kj02n9j92J73P7L7l5J78j60m2o4J90N7l32
3024a72K55j16J03N2j96J53J04j04p5j5m7J08j24r8O8J09j9M0J01J4j32O2l8j90
3048a57J6K48p1LOL8m1j83L04j45j0j56J91M0k07J06L7j08Oj9J14j1r6j1jJ39
3074C2m2p3O4k3K00J0j55J37k62J30Oj23J96m1L9P9o6j04NQ5j06l8o0J12O7Rn2
3101B6n5k6l9J05J87j66J16r1k42J34j35L34j61P6j07J82j97J12l7j66N1q7K45
3124E9O5l6k6o5j7m3Q7j97K13l1n3N1j52J41j23J49nj35K96j04l59M06k65J69
$$ y = [82, -94, 136, -73, 43, -137, 76, 45, -231, -70, 43, -44, 139, -34, -41, 136, 21, -27, 70, 126, 4, -102, -39, -122, -52, 10, 18, -33, -14, -116, 95, 131, 23, 145, -175, -140, -193, 141, -48, 101, -78, 37, 106, 178, 13, 19, -101, -47, 198, -103, -183, 118, 116, -108, -100, 28, 187, 106, 63, 104, 102, 0, -59, -251, -78, -1, 36, 1, 179, 19, -23, -87, 103, 160, -172, 83, -33, 70, 122, -74, 79, 183, 79, 4, -11, -58, 50, -74, -172, -104, 5, -14, 26, 127, 141, 9, 71, 33, -157, -141, 107, 36, 39, 45, 83, 42, -141, 163, 18, 8, -148, 43, 83, -124, -18, 19, -89, -83, -102, 12, 1, -95, -106, -107, 32, -10, -83, -19, -42, 158, 168, 13, 150, -112, 18, 24, -99, 97, 56, 95, 174, 108, 4, 9, 94, -12, -50, -110, 2, 69, 78, 26, -29, -55, -94, 11, 198, 32, 148, 57, -185, -51, -186, 148, -13, 63, -44, 138, -59, 53, 16, -150, -99, -186, 59, 124, 88, 62, -3, -20, -63, 24, -173, 40, 9, -44, 7, -145, -4, -127, 22, 17, -118, 178, 74, -285, 121, -144, 25]
3148B5J9PR3j72JP5l8J31k39L6rJ8Q6j85J66K50k99j01J71lR8j09L2l22K75p4
3174f8K2K1L7p5P2l1j14K57j75k8K03o1n3j6M1%j18P4p0J39q1J55k12J43q1Q8
3200F9r3j0k6Q6J75k11q3p2J07J16k03J47l8j5Rn2J74p9P4o1m7K72j17O7j72r3
3226g6J91l26K13O4j0M9l3K1j61R0J1j14MM5J14r7j05N3j3L4j5J8j23K7J83J21
3252A65l23nJ37M8j09Q1J98j96L2J50k26O7R2O4j19k1M2o6M9j79J0K42j68m5O3
3277a7J65r8o5R5n6r8R8k3J41k99J81Pn2J44k61K33n5L7p1r8O4OJ4M3j28R3N4
3304E4q6Q3l5N9mP1l19J90j11j6M6K28j74P4q8O5O4r2O2o8j1j25J30R4k6p5j34
3331a44K50k23J36J9nL1J58j55r8K37k79N1r3j7J48j29Q3J55j00M2j14J21j29
$$ y = [25, 44, 51, 144, -28, -27, 48, 10, 141, -98, -62, -71, -53, 33, -152, 14, 264, -35, -136, 35, 32, 130, 21, 53, -269, 6, -68, -46, -25, 12, -63, 9, -22, -136, 121, -54, -82, 121, 60, 7, -9, 32, 32, -86, -12, -82, 57, -24, 131, -81, 62, -19, 69, -24, -34, -60, 26, 201, -10, -93, -165, -58, 58, -145, 2, -36, -51, -42, -94, 80, 1, 75, 14, -33, 239, 122, 189, 17, -76, 115, -211, 2, 66, 56, 105, 72, 93, -68, 22, 33, -81, -77, -32, 82, -15, -120, -67, -80, -46, -61, -43, -166, -139, 44, 165, -158, -163, -26, 22, -87, -6, 192, -4, 28, 178, -48, 19, 111, 175, 56, 35, 77, 11, 60, -119, -109, 133, -35, -80, -17, 148, 50, -15, 80, 24, -74, 24, 1, 142, -157, 24, 31, -21, 123, -138, 95, 40, 77, 6, -92, -28, -22, -8, 35, -93, 0, 54, -32, 51, 16, 75, 71, 142, -177, 13, -98, -114, -68, 160, -14, 60, -28, 37, 101, 9, 71, 3, -8, -133, -3, 91, 65, -10, -144, 106, -117, 19, 38, 33, 64, 222, 67, -31, 206, -73, -22, -115, -132, 16, -113, -30, 125, 25, 67, -47, 74, -55]
3354e5r5J37K2K45j64j75O8J73k19L1N9j75L30j47N7j51rpK28k16L3J06j51MJ42
3379G1j31M6k5%j9q5O6J06J1O3k42R5Q9j89J46k4k4J13j77J00Oj7q6K35j41O9
3405E6J05j9r0n8j88J78jJ16j45Kp1K06r4q5M5m0j8N8J09L1L9m4rk15K62k00K96
3432B26m04J07J62m1k03J86Mm3J24k9k48J42J03m4M1j00q2J35J4j05K17j70%j45
3456a53K45j94J7J60m0o0J47L1j83R8j27P9M2n6j4k8n0p9K49k38J04Rnk82L89
3481F1p5J98j61M5j06n0L12j08q1k29J90m6L5j13Q8N8K5j28J87j51N8J2J44j28
3505C7l3P4j9k3p3N1R1j65M9N9J42k44nN0O0Q8k27J9J4Q2lq4j0K01m6m4j38J78
3533H1m7L6m5l7Q6o0n2J11r0l2M0J1p3N3l6J92p9j5K2k1k35K50k17J03K05k91
$$ y = [-55, -150, -13, 9, 254, 90, -85, -17, 156, -63, -32, 27, -148, 182, 35, 92, -59, -68, -75, 153, -63, -30, 76, -75, -71, 71, -60, -14, -39, -39, -58, -143, -77, 29, 40, 103, -139, -44, 45, -144, 2, -22, -46, 67, -110, -10, -4, -21, -107, 128, -13, 56, 161, 142, 52, -6, -194, -16, -17, 99, -46, -44, -115, 91, -3, -88, -43, -83, -101, -43, 66, 97, 136, 92, 83, -132, 130, -70, 226, -178, -71, 91, 50, -153, 33, 37, -6, 118, 89, -159, -17, 86, 42, 83, -17, -99, 36, 50, -55, 162, -8, -8, -153, 92, -102, -85, 75, 35, -25, 122, 153, -30, 68, -59, 20, 62, 6, -8, -36, -86, -165, 84, -154, -50, -41, -46, -328, 61, -14, 184, 23, 68, -38, -88, 224, 116, 35, -194, -4, -50, -15, -128, -40, 18, 43, -85, 102, -49, 9, 21, 165, 37, 4, 78, 59, 36, -37, 14, 105, -60, -11, 48, 190, -54, -59, -9, 51, 139, -88, -69, -55, 27, 24, -60, -70, 131, 85, 41, -97, 81, 34, 70, 25, -12, 74, 14, -38, 73, -17, -49, -9, 2, -71, -18, -54, 138, 59, 44, 66, 45, -190, 60, -157, -54, 151, -140]
3559a40J37j5r2J45k3r2OR3j67O5K17j83M1j6K63j27n0L0r5j61K21j23P1k0PJ30
3585A22k22K01n9Pm5p7R4m8J02r0J80M4k12mj7j0K10j50M9Pj01J3P6N8k72J36
3611hR6j92J52j5K0J51j62j01N6o6p0J83q7N0M1j3k1p2l3J66j38J11kL1l1j11
3637f5mq2R7Q2r9J31r2j02J41J06m5k8j19nO6p8J77j13J88j75J09j88L0N1KQ1
3663F6r8P7j23K4J57oj94J51Q7o2j68L1K37j47QR9J2k21P0m8p7P7J12N5r4J03
3689A28j38J16j12J3j1r6J16o6K0r4K13n6L1o6m4P5l6n8K16m5j28j32L39q9j46
3714e0j84J58M2N7M4k8j25K20l9j24J11K5Np8O8K9q3q0k9R4K8k2M0o5P8j11k5
3741d4P0O7j91J42l9q3l0K18j12P8j2l6R8q8j29P5m3J29n7M4P2n6l3m4ol5L7J55
$$ y = [-140, -3, -18, -110, 35, 12, -80, -74, 19, -148, -83, 134, -49, -8, -24, 239, 112, 62, 92, -3, -164, 57, -66, 5, -15, -8, 122, -100, 101, 42, 49, 4, -73, 21, -27, 75, -15, 165, 209, -3, -7, -24, -34, 176, 26, 75, 82, -19, -6, 70, 128, -144, -8, 88, -104, 48, 33, 53, 204, 42, -59, -3, -69, -139, 44, -43, 7, 48, 35, 14, -58, -91, 75, -63, 48, 46, 77, 46, -65, -69, -151, -54, 28, -71, 60, -32, -134, 7, 113, 68, 40, -79, -84, -18, -96, 81, -32, 156, -19, 90, -98, -68, -17, -15, 66, -32, 45, -78, -54, 103, 97, -97, 54, 141, 79, -89, -58, 179, 32, 40, 139, 151, -70, 0, -48, -125, -48, 64, 119, 25, 128, -10, 106, -6, 7, -4, -100, 16, -50, -30, -124, 89, 33, 64, -2, -46, 29, -7, -65, 151, 106, -22, -154, 185, 96, -50, -234, -76, -34, 23, 67, 39, -86, 134, 95, -29, 82, 107, 112, 34, 102, 131, 48, -32, -61, 33, 61, 39, 79, 14, 92, -19, -44, 26, 93, -98, 44, 5, -78, -108, 110, -2, 76, 64, 28, 126, 38, -91, -16, -59, 70, 13, 57, 129, 73, 40, -4, -10, -45, -8, 147]
3769A47j28r1J9m1K3K8J52R5j27jK1q9q0j7j7R9Q7j06J08l8k06J19J88j24m3J42
3795A20m5k9o0j76K31m0j31K59jk95N8Q1j59Q5K16l3j71O3P1R8l12J53P7j31R9
3820B8R3k19J48p0q1l4J19J7K5j06J92l0j01J06r3j30L7R0J55j82l3J06r4L35
3844B78k27J5k44j25K80QjO4N9l1k20J3J32O0p2q5K05j22Rm7J96j59j20J72m5
3869gm9Q1p4K0j84K43J4j28N0N9m8Q9j08kQ7k25L05J62l98pJ16l4M3%J45j44J29
3896A35j44J14j94q3J89j1R4or3k3L1rO8K7j74J70l8o0n1q9K51q6J2j04N3k4j7
3923f2%L5OP6J10r2Ol9j46J69j90K77j86P9J27k77J85k39K89j12J76k25P4q8j26
3948a73J17m2J47k17J95mP0K8k62J3J89m4n8K20k15J52l8p5K1k8Q6j05p0J78k24
$$ y = [147, 19, -72, -53, -94, -71, -43, 109, 204, 77, 76, 97, 8, -72, -89, -106, -7, 80, -26, 82, 44, -162, -43, 145, 21, -22, 120, 75, 46, -14, -190, 41, 1, -130, 129, 128, -167, -109, -28, -187, -102, 114, 81, -90, -27, 44, 142, -170, -17, 60, -71, 28, 121, -98, 50, -20, -101, -135, -16, 1, 26, -80, 112, 82, -19, 87, -6, -136, -99, -9, 146, -36, -69, 37, -57, 278, 51, 66, -178, -303, -23, -15, -16, 48, 107, 76, -144, -131, 1, 61, -11, -96, 109, -13, -4, -51, 145, -14, -134, 38, -7, -56, 25, -49, -29, -213, 30, 44, -84, -34, 25, -23, 66, -42, -44, 43, -182, 123, 285, -113, -120, -4, -38, 5, 5, 150, 6, 135, -9, 105, -89, -172, 17, 6, 100, 94, 1, -22, 9, 0, 68, 95, -79, 91, 53, -7, -58, -147, 104, 18, 30, -74, -21, -45, -62, -62, -27, -21, 55, 165, 73, 79, 40, -106, 63, -127, 150, -36, 43, 170, -107, 78, -161, 128, 16, 192, -33, 41, -47, -173, -56, -98, 49, -168, 27, 23, 93, 121, -141, -128, 61, 17, -41, 179, -36, 116, 78, 3, 24, -4, 82, -23, -93, 85, -139]
3973a39J83k3M5j19J1r5J24M5j29K34j50lJ02N0j46j7m8R8Nj91J48J40k07L5p0
3998a17O5J22o3PL3M3m7j5j33K8J13J3o0m8J04L3q1J51j31k2p8k6J95j0k2p0K9
4025A3j9Rp5K02j44m4kN2K54k13k10L02r0k1m5mJ04l7j16J28q1O1q8L1q9J15J14
4052A07j95J2N1p9J60krm4J36k11rJ9L1O7m4j63K32p1J07j93k1K03O3n5Jj12J1
4079hP0p1j0j40J75m3m3PJ42q8Q1j10M4m2j31J29R3k05P2J00k8o4J4M4r9K24j
4106A12j21J61k55Q0j57K02j6k8n0m5J66k05J71O2j72J10n9L8j32O0J47j1k4j33
4130i9L3J60j27J86q8o9nP1j17r6J73J8m7J19q5j80n1K04l1Qj10M8Q7Q6j61K68
4156A95k11O5j0j37Q5J0j26J50q9p3L45k02K9O2j27k41J74O9J24m7J8r8O3j47
$$ y = [-139, 44, 21, 66, -53, -42, -137, -13, 32, -97, 137, -13, -16, 86, 136, -10, -27, -75, 23, 28, -163, -15, 125, -82, -47, -117, -52, 70, 7, 14, 47, 90, 43, 28, -105, -77, 36, 49, -11, -59, 45, 78, -3, 148, 17, -5, -83, -109, 86, 76, 54, -16, 13, -6, 3, -72, 130, -14, -58, -60, -8, 246, 33, -177, 125, 35, 14, -31, -35, 69, 32, -84, 44, -37, 24, -64, -33, -122, -7, 107, -88, -76, -25, -104, 56, 54, 45, 1, 137, -74, -83, -64, -33, 34, -10, -173, 59, -12, 95, -98, -119, 84, 147, 92, 93, -19, -8, 62, -9, -19, -159, 16, -27, -70, -63, 79, -9, 72, -38, 6, -36, -167, -38, 55, -150, -78, 22, -6, -70, -56, -12, -111, 113, 112, -9, 152, -103, -23, -180, 22, 6, -22, -72, -117, 49, -156, 15, 77, -95, 15, -44, -6, -138, -78, 69, 58, 34, -99, -66, 94, -33, 153, 65, -4, -9, 62, -55, -151, 22, 40, -7, 112, 27, -153, -204, 0, -31, -23, -133, -85, 2, 88, -73, 195, -16, 49, 39, -98, -13, -3, -129, 21, -68, -141, 204, 2, 31, 93, -34, -275, -101, -32, 92, 45, 63, -35, 28, -119]
4180a19Q1Qn7LQ5P8j58P5K2j31K17p4P4jk44J15j66K63n8R0M8j61j00J85j54o0
4206a39J80j05n1J5J70j1l8l9N3Mm1k3J44j16j48J79j28j4K33k26J50nj52O3J13
4231F8q5J60k21K16k69O7J18j18L7j8j22J10q4J02j33J20J58j10m2R7j1l6N8j6
4255D6k3k0M0m0L6o9n5K50j55j32J42r5J2K08q3n6J2P7o8j46J94j90k9N2P1J0
4281a1r4J09K8po8Q1j23O3j28M1O9l0J96j80J22j4j25k7J61J62j12l2j92NP8j02
4307a30O2J33Oo7O1r8J2N8Q1j25q1J11qJ14j72OJ34q8K8mq8r9J54J3Nl0J18m9
4335E7j08K44k76J27J5k04K83J9l31J59N7r6J99j53j1O8nNm8N1j74N6J2K7P3N4
4361A00l0M7Qj61Q8N1J2o0m1j41R5j2OL0j31K22J6r8m3J01J9j10JM4qJ65j34O5
$$ y = [-119, -38, -30, -87, -84, 1, 79, -79, -4, 18, -113, 104, 30, 104, 103, -141, -26, -192, 71, 13, 103, 151, -10, -110, 75, -79, -139, 41, -64, -115, -100, 70, 59, 21, -18, 35, 39, -2, -25, 119, 3, -145, 34, -94, -108, 125, -101, 49, 44, -108, -45, 68, -17, 143, -78, 138, -131, -64, 54, -64, -27, -45, -167, -57, -141, -39, -172, -52, 106, -4, -46, 51, 40, 4, 62, 46, 23, 3, 43, 3, 39, -30, -85, 165, 10, -122, 20, -75, -63, 145, 62, 6, 18, 95, 27, -119, 75, -115, -144, -92, -21, -11, -105, 4, 32, 25, -43, 38, -85, -22, -150, -109, -40, -70, 126, -54, 68, 54, -71, -98, 63, 225, 113, 81, -111, -106, -28, -130, -68, 65, 71, 4, 65, -33, -21, 37, 118, -7, -88, 23, 15, 129, -43, -37, 97, 9, 37, 33, -55, -154, 0, 13, 18, -12, 106, 57, -51, 193, -83, 44, 59, -145, 138, 157, -174, -15, 42, -54, 145, -8, -19, 49, 44, 49, 1, 52, -122, -66, -54, -27, 46, 100, 70, 117, 125, -36, 52, 103, 115, 55, 14, -127, -32, -44, -38, -8, -139, 83, 99, 1, -42, 59, 78, -32, -31, 13, 5, 170, 36, 101]
4389A01k30R3K06m6j81J92k69M8J37J1j12r5J08J31j01J3P3p0k31J57J33K3j30
4412c9R5O2k31J11l7n8l3J48Q7j4j48O7J23j80J0r9J80LM4J5k22J02O6L5j20J4
4438a9k7M2J7r9L1j33R4J78l3L1K2Qk75L23j16p2J74l2O1k63J24L2J3r1j7J79
4464A52j65J31j27P7j8r3m7J23mJ5K9q4j4j62K19m0J53j98r3K10q3n5M3n3J62
4489G8q0L7M3Nr5Jq3J31J01k78K19k00K56j53k3M7k67K45j05J83m6J49j65J14
4513A14m9j37K45k16J6K8j41K66q7J00j68K7r9R4J24j56K80k94O2k64O7K51N1
4536A14j6j00R5j56J33L5j00MM1l9j54K31L1j74j3N0J8n6J30j62k0J6K28j3N3
4561A76k63O7J7ML0k15R0J27J2j50m8J27j45J07J8K2j22Q2J28j30J48j49N1P6
$$ y = [101, -129, -36, 170, 124, -57, 135, -134, -86, 51, 62, -50, -145, -37, 94, -7, 6, 79, 9, -222, -65, 68, 91, -39, 56, 118, -113, -2, -39, -97, -130, 18, 105, 91, -57, 10, 133, -47, -37, -136, 44, 47, 91, 106, -116, -14, 52, 87, -33, -19, -46, -4, 13, -86, -55, -188, -94, 84, 51, 82, 104, 112, -163, 160, 44, -28, 146, 114, 175, -88, 36, 68, 81, -10, -27, 152, -13, 118, -9, 68, 50, -43, -90, 33, 29, 44, 73, -11, -25, -187, 32, -8, 145, -53, -146, 64, -19, -74, -31, -84, 78, -2, 35, 78, 83, -12, -11, -94, 37, 138, -140, 79, -121, 135, -18, -41, 6, -261, -16, -121, 62, 16, 165, 0, 114, 65, -72, 173, -43, -27, 1, -140, 126, 39, 139, -29, -2, -101, -7, 117, -39, 241, -53, 9, -255, -188, 63, 114, 98, -2, 93, -63, 70, 105, 5, 9, 50, 11, -143, 88, 119, -55, -68, -18, 0, -56, 74, -88, -108, -92, 136, 123, 176, -87, -20, -3, 1, 31, -184, -94, 33, 45, -105, -153, -26, -171, -64, -46, -24, -146, -64, 64, -66, 82, -67, -16, 60]
4585F0Jnm6M3p5qJ45n5K4or1L7p4j29J40p4J24o7O5j84K54m0q3N9j3o0j14K28
4613E6j83L5J06L9p3jK15j43M8Om4n9r7O3LJ9K7q5M2o1L3O0J31j42n0j15J67J65
4641A62k51k0R5j9OP3j0k7j53L55j48j44J92R3j83j4q3K13M7j88PJ25j26m2J46
4666A06j09O9j03l9J04r5K24j23j08J0M4k8o7O4N7j67J00j07J46P1j18J38n9J07
4690A17j25j01p2J08J54Lr5l3K7m5K4r6K70j09O9j26Op2K15k20K38j69pL0k14
4715b23J60J57p2p7J77n8k36Q7J67j9n9j48j06J20O9L1n1J32o2J53j67J7Q5N1
4739A28J1j45R4p8k7P6j6j82r8K50J32j82l6l8J20R0j22N5j09J59n0j18P0p9K0
4764g5J19j40K00K1j17j04J80ok35K68j33p1J99j39M3K48l52O3J01r7j4K3lr4
$$ y = [60, 61, 56, 10, 53, -22, -30, 115, 60, 84, 78, -13, 24, -50, -179, -39, -113, 11, -56, 9, -175, 79, 39, -44, 15, 2, -58, -172, 56, -127, -92, 14, 53, -20, -21, 194, 51, 99, 105, 61, 2, -95, -32, -29, -10, 17, -68, -26, -87, -54, 6, 137, -5, -55, -170, -3, 162, -89, -109, -14, -33, -27, 46, 36, 9, -144, 211, 63, -81, 111, 204, 21, 7, -76, 137, 184, -4, 3, 128, 2, -40, 106, -3, 66, -37, -76, 28, -67, 157, 34, -74, -64, -20, -48, -115, -51, 6, -161, -61, -168, -22, 49, -69, 69, 10, 117, -8, -109, -181, -73, 81, 84, -11, -44, -17, -62, -38, -134, 136, 27, 96, -30, -24, -96, 119, -101, 137, -32, -39, -9, -223, -63, 94, 22, -55, 122, 64, -172, -85, 82, 63, 4, -144, -250, -130, -61, -30, -81, 51, -11, 142, -25, -8, 77, 128, 139, -6, 88, 10, -17, 59, 43, -139, -237, 13, 145, -37, -73, -111, 9, 99, -23, 32, -77, 82, 32, -86, -16, -95, -75, 44, -96, 104, 125, 8, -96, 84, 78, -157, 111, -22, -93, 106, -33, 10, 258, -94, -31, 70, -27, -41, -18, -21, -115]
4788a15j8L08l23m2K41P3r7k6j40K28j98j0pK29r9R3j6j58J28j40J88J3l6q2J09
4813A03p2j6j6j56K51j18k2R0j55OJ89j59J06q3J61q9k3O3m2R3k9j30K8M0K4k4
4839B0oj10K02L1j50J8N0j96O5J2O3p2NQ6n4J18L8j36N6nl05J17J30j15K73j34
4865An2k8Q3K7L1o5l7R7j11J38m0j00Q8kp0O8q7N7j13J96j06q5K15Jj70L1j29
4892a62J23J18k11K39j99Nkp7J88J72lk30R9j06J8J9j55J15N0J8J9r4P0o4k7O2
4918a5M1j52n8L7J46j00q4J57j03J66l6l8P2j1K4r9R2L1k0J07k33o6K6J44J4j10
4944f8M0jN0j64J39j53J29J76k18q9N6J28k43K01K58k15j2l1j03K26q6j48l0N0
4968a08J37j14O4%K0n7O3K8P5j10M8O4j18p3J1J6M0N3j62K4N8L5R1j5J50p3k78
$$ y = [-115, -133, 175, -148, -190, 51, 124, 27, 1, -139, 89, -109, -119, -126, 103, 4, 97, 81, -77, 51, -89, 99, 112, 76, -6, 103, 31, 15, -1, -157, 94, -24, -46, 44, -111, -105, 84, -75, 31, -52, 109, 20, -3, 60, 18, 111, 82, -48, -20, 20, 44, 20, 14, -96, 106, 137, -13, 5, 55, -141, -76, -64, -1, -73, -68, 18, -36, 82, 120, -16, 40, 35, -270, -153, -23, -138, 135, 1, -51, -79, 4, 31, 62, -3, -40, 57, -54, 84, 44, -56, 32, 30, -40, 28, -59, -2, -115, 81, -25, -110, 105, 106, -64, -33, -162, -39, 79, -132, 107, -92, -87, -89, -166, 22, 194, 191, -39, 60, -46, -28, -9, -164, -49, 1, 19, 38, -56, 14, -50, -77, -15, 26, -126, -184, -147, -1, -101, -185, -28, -131, 35, -1, -39, 33, 22, 46, -53, 39, 70, 50, 157, -76, -142, -116, 28, 42, -68, -28, -29, 21, -143, -4, -157, -28, 148, -70, -159, -103, 25, -218, -17, 241, 26, 14, -17, -120, 106, 20, -128, -158, -108, 29, -85, -21, -21, -1, -58, 5, 33, 108, -2, 46, 110, -8, -81, -70, -54, -14, 39, -123, -99, -41, -6, 85, 70, 220, 147, -131]
4995a31N4J91r8J58r1J48j19p5k04J19P0Q4j61K7qJ95j93J1n1K56N2j50o6n0J50
5020A18k2j11Q3P2q9j58J9K89j62j32R0K2m3j00J35m7jR5j30O3q4R5K77l07K06
5045A78k11l9M9J60j78O7Q4j04lrj08J20l6L2o9N6l4R4j0q1r5J14Q0N1j22J15
5071A01q7j14O8M4J35j26K3o2M6j81K4K49Ln2j1j69J33K9j04R9K7N5n4l1k0J01
5097A26p2J40k15Nk8J0Rk1O0M7l0R3j28%O4k16K88j85K7LKO3J0j34K5O4Q1m9l
5126C6o2J8J25K4q0J3j35K47j55p2P9p3J3j51J19J2n1j30K19j34K9J04J07n5M7
5151I4j28L0k4J62j42Q8j44N1J51j12Jj33J58p9qm4R3mj6K0j49K16j05N6o6J1
5177b3QN7n6jJ5O0n5m7J19M6k04K80l02LR9k2J01J31j76LK8j23R5M4n6o4MNK7
$$ y = [-131, -77, 114, 16, 174, 83, 231, 112, 37, -167, -48, 22, 106, -55, -28, -36, 159, -34, -23, -74, 182, 234, 84, 18, -32, 118, 96, -15, 68, 140, 51, -107, -88, 201, 39, -93, -3, 19, -24, -124, 11, -36, -37, 58, -72, -9, -93, 2, 279, -28, 178, -33, -72, -23, 137, -41, 26, 110, 6, 3, -6, -114, 6, -30, 2, -67, -11, -45, 49, 39, -42, -137, -23, 57, 108, -14, 101, 14, -100, -32, 12, 147, 21, 44, -18, 28, -153, -129, 120, 123, 71, 60, -109, 24, 53, -51, 48, 75, 130, 76, 45, 25, 126, 54, 194, -21, -16, -44, -34, -25, -46, 14, 61, 31, 124, -4, -4, 60, -156, 132, -53, -26, -23, -21, 42, 52, -82, -57, 7, 88, 39, 36, -26, -8, 117, 141, 61, 74, -61, 186, 31, -41, 38, -35, -22, -173, -54, -42, -93, -223, -4, -138, -109, -5, 102, 47, 94, -34, -4, -28, 134, -8, 80, -64, -13, 138, 26, 27, -106, 52, -27, -35, -79, 14, 10, -6, 14, -135, 81, -24, 32, -34, -23, -15, 42, -14, -15, 0, 60, 5, -42, 77, 123, -81, 199, -103, -100, -1, -23, 78, 209, 33, 36, 64, -59, 36, 80, 24, -40, -36, -31, -4]
5206dO7k13O7j6K8O2j75K13k78K71j12Q7P0k36R6K9lQ2K1k2Jp5L2kN6j9K2m2L6
5235D3j4j22J21J10p4K5j31r1J73ok5J49k06q8L30j86L5j02o5Q2q6J31k5k3J70
5260A25k12jR3J5m2j9Q5j75L9J82J7j29j58L12q9j78N2K46k20K38j60P6J22j60
5284E9k05J82L9j56J5l6N7L2q2j19J63J44r1j2J21k02J02j23K31j36J1L1k9M1
5308C7j04R8k04K37N6k05R7Q7j8k19J10p2M6P9p9lJ68j08l4j7J5Ql2J43j05J37
5334A18l32J28K15n6M3j59L5O5jr3L0j10J56j3N6j19J54p8JO0p1l4r8J94m4o0
5360a3%j16J78j56J27R5n1j62J03Q2j70NM1P8J87j81j4n6R1J49j81j47M2J10M6
5385H7j99J33P9j68R1l6RO0J3J21j82J52k15O8o7J99j79NkO4o6R1l4m9j5P3k9
$$ y = [-4, 63, -150, -83, -99, -71, -9, -184, 29, -249, 22, -90, -3, 67, -169, -73, -44, -47, 35, 56, 34, 35, -40, -8, -10, 46, 27, 49, 7, 43, 29, -93, 28, 138, 64, 89, -42, -133, 40, 34, 9, 158, -48, -136, 194, 8, 43, -59, -124, -42, -128, 3, -22, -45, 125, -87, -88, 5, 20, -22, -41, 44, -131, -92, 90, 107, -22, -180, 132, 43, -135, -83, 163, -57, 181, 21, 97, 219, 59, -146, 36, 75, -81, -66, -102, -45, -13, -95, -214, -51, 93, 2, -10, 111, -91, 11, -112, 119, -17, -6, 25, -4, 37, -67, 31, -173, 64, 120, -85, 12, 99, 81, -138, -28, -100, -54, 25, -54, -57, 111, 3, -31, -48, -33, -25, -57, 86, -19, 118, -214, -86, 129, 73, 116, -43, -8, 57, 56, -37, -7, -117, 39, 26, 82, -37, 117, 39, 40, 100, 29, -5, -103, 91, 47, -13, -13, -129, 49, -107, 20, 115, 64, -98, 5, 87, -83, -78, -37, 41, 228, 47, 33, -23, 68, 217, 36, -111, -69, 41, 87, -112, 21, 100, -68, 23, -13, -4, 56, 69, 190, 8, 160, -55, 13, -54, 145, -34, -29, -31, 33, -33, 58, 24, -25, -40, 33, 4]
5412Do4J26pl8K02k16n9N0j01L15l11J67j17Q1r3O6j06p8J81J33k22J77j02m9
5436f1J26k29L08j62o7J30N4j45q5L02j79m5P8oJ9o4PJ43k56J18K2k5J05j40R3
5461D1jL8K5q1p0J0P3j2j51J86k7n1J14m6l5J95k79J14J0P6j39R4k77K51N6N6
5487A70n7j10j2qPJ19j99J97j17n4N9j7RM2k77K88P6j97j1k3J26M7m8J64k09r0
5513a25Q3N1K27r7j00L0n9M8j77J68L4QR2j77L1o6L6L9rL1j66J14J55l03K62j73
5539d3J58J8k69J20k40L92o4n4k4J03RK8o5j65J53nj02K8K53r8j48R5mj28N6O0
5565F4m1j41N3K09p9k10P6R7q2J3M1K54j88J04j47N0k01J48r5n4K79j96n9n4N7
5590a02O5J15N0k08N4Q6Lml6J03m6j82M1R4J04r3Jk51K14L0J22j39R6lJ7n8o9
$$ y = [4, -60, 66, 59, 21, 223, 7, -52, -2, -103, 212, -99, 68, -49, 32, -61, 5, -101, -179, 2, 135, -87, 90, -12, -61, 65, -164, 144, -18, -85, 45, 99, -46, -131, 171, -8, -53, 25, 19, 38, -26, -19, 124, -132, -14, 8, -17, 88, -52, 41, 40, 78, 103, 22, -48, -38, 35, 23, -128, 58, 31, -20, 94, 48, 13, 208, -71, 43, 53, 129, -10, 84, -193, 58, 114, 170, 113, 3, -9, -17, -10, 109, -90, 107, -10, -64, -5, -22, -13, 29, -248, 40, 116, -81, -92, -115, 11, 58, 10, 174, -35, -125, -42, 9, 236, 139, 39, 69, 10, 58, -119, 49, 83, 91, 183, 6, 37, -29, 7, 46, 37, 68, -98, 16, 171, -132, 130, -43, 115, 133, -136, -16, -256, 136, 72, 18, -6, 97, 106, 134, 69, -96, 57, 52, -50, -22, 231, 133, -15, 80, 76, -52, 4, 64, 23, -118, -65, 144, 65, -145, -69, 28, -54, -41, 0, 254, 66, 170, 23, 73, -128, 20, -75, -129, 150, -46, -105, -159, -102, -37, 78, 128, -80, -26, 60, 63, 59, 23, 126, 80, -102, -61, 33, 137, 44, 45, -206, 8, 38, 160, 21, 117, 114, 131, 73, 4]
5617DO2j56O4n8N8j7j2j22J27K08r4q1Q4q4k06M06k04K17j15k9k7K64j78j99J01
5642A3J30k26J88o2l9J89l17J43j01J28o3L3K0l7J07j01r1l3O2l1J35j04O1J01
5666A05j61K1l5J65J33j97J29j93k2J90m0j18j12Q6n0J40j63J16J26p6P3l07J64
5689b6p4N4l2m6J37O7j69m7J95j4j79L0M5R5Q5J3k14Q2r1J00n8K3J1p8N1J96l9
5716A17r2n0j0J3J34j69M7l6rJ64j79R8l0J43j38K19k17j8Q4q0N6k2j3j02m5M0
5742i5O0l3M2J50q8m8n5j98K99k3K4j8q4N4j21K08r2o9QO9L4J2J32j32j1J9Mn
5770D3o1J6l8M7k2Q5q0J0n1k5L5O0k1K04l53L0J40j16O1J33j54m5J03l7J40j41
5796c7mP3j8J31k59J21K5j48J45j02n2lJ04p0O6N8O3j09L4l2r1J63k8Lj8p4Qp8
$$ y = [4, 66, -90, -26, -84, -26, -43, -55, -177, -50, 158, 64, -17, 67, -17, -223, 183, -21, 196, 81, 52, 25, 289, 111, -88, 13, 143, -83, 105, 43, 4, 193, -124, 19, -82, 46, -17, 16, 36, -1, 106, 5, -86, -119, -57, -88, 47, -57, 4, 105, -56, -35, -70, 95, 228, 31, 160, -33, -55, 135, 95, -23, -135, -49, -99, 41, -122, -6, 120, 44, 117, -190, -26, -100, -46, -78, -124, 13, 80, -89, -136, 59, 45, -134, -104, -59, 36, 121, 134, -80, 2, -89, 11, -47, -24, -13, -91, -40, 156, 117, 25, -25, -35, -22, 112, -57, -10, -46, -55, 109, -70, 28, -2, 141, 3, 222, 5, -13, 71, -9, 47, 25, 12, -90, -135, -95, -35, -68, -26, 124, 36, -12, -67, -265, 34, 11, 35, 17, -67, -13, -134, 74, -18, -87, -79, -10, 24, 36, 168, 36, 25, 44, 48, 43, -18, -2, -40, 7, -15, 70, -10, 0, -51, -76, -41, 19, -2, 202, -151, -121, 19, -97, -36, 97, -57, -102, 1, -36, 104, -37, -41, 32, 14, 145, -114, 7, 32, -116, 29, -73, -125, -128, -24, -94, -28, 30, 93, -16, 18, -14, -105, 58, 30, 33, 15, -59, -51, -129]
5824a29J15l8J91l51J39J31k01J74J34k55J6J37j75L5J39n0J7P7Ok15J32J24K6
5847A79k03K16j71k9L6j08m7MO7J32j08N9j13J36jn0J39j90P4J22j00lM2j41K72
5872B14j65r7J88j68q2NJ42L2k0j04P6L2j06P8j00J79k29L24j2j71j54M6n4J01
5896d5O6J55k78j6J93k8j48O7j10J86p7R9p9j76K87j03LP3J9j84N1R0J00j44N0
5921E1j3p1j66R9J5K66j41M2ko3K5p7K42l98L28j66O8Mq7j5J67l8j02K2o8R3j64
5948a49J12o3N8J02q0%p9J68m5j1J19j04q0l3J47j22m2J66j37K6j08Q3N5MNOL9
5975C7j08J78pj17J31k82J57j07J90r2R9Kj27N0p0L4N6j50J6N0K9o5j0K31j50
6000b5J9l2r9J64J06j01q2q4K74j10m9mL4om3N7J16k61P0J04j33j35K64j63J09
$$ y = [-129, -14, -52, 139, -212, -73, 58, -143, 31, 165, -90, -74, 63, -112, -77, 62, 12, 29, 106, 112, -103, 29, 153, 179, -24, 192, 21, -8, 28, -80, -127, -123, -56, 76, -32, 27, -86, 50, 49, -1, 138, -52, 22, 144, 44, 41, 83, -58, 214, 49, -48, 140, -28, -110, -105, 37, 69, 49, -55, 21, 53, -53, 25, -75, 104, -125, 199, 187, 16, -138, -92, -146, -45, 21, 176, -102, -118, 75, 47, -101, -34, -144, 42, -35, 64, -15, -191, 96, -7, -4, 69, 88, -96, -45, 45, 145, 1, 51, 38, -33, -199, -100, -85, 181, 40, 82, 80, 17, 42, -35, 207, -191, 137, -29, 39, 43, -44, -59, 108, 70, -32, -10, -78, 15, -149, -37, -100, -42, 60, -20, -20, -99, 69, 24, 13, 132, 28, -52, -85, 62, -60, -102, 64, -73, -47, -155, -72, -17, -13, -8, -2, 37, -71, 107, 100, -17, 114, -168, -11, -118, 72, -20, 79, 81, -46, 4, -66, -32, 24, -126, -110, -60, -31, -96, -106, 125, -25, -6, -38, -137, 27, 133, 32, -50, -134, 140, 30, -19, -23, 11, 5, -38, 19, 135, -126, -56, 48, -85, -220, 44, -119, -10]
6025a0J25j71l0jj9R5Q4j07J25q7j87J77n1p4O4R7jK1j02j49M51k46o4P6J90l19
6051a13R5J02j07r6r3L80k62J83O5j41L6j97J1O2M5j0j7J23l8JK3k13J53j12K13
6076I3j95J93k54K46N8l0k6M5r0j24K74j90K7j39K2Q5P7Pj10J67j15k7JkJ33j96
6102g0J7K13M5q4j16J7j54J38m3J3j40O8j52J59J36j43P2K0n3Q9k6k4o6oJ81m4
6128D7k2j32J47n1J29p8p7qp8K05k44J54Ok4J30j57K9J14k16J45p5Q4M0m6J5J43
6154A80k60oQ5j8k6J11m7P1j46J18O5q1j28LK2J44j72P8L5N4j05O4o2L7Ko7Q2
6181C3Q6j80J88j72O3m5n9M4p9K16j00j14J78j48J17N9M0n3j70J48K9j54N1M9
6205B7k1r4K79j82R6m3j17N7j69K69j26J51m6j12J6J42j31j2J09k03K0K86j47
$$ y = [-10, 115, -56, -86, -87, -106, -11, 73, -34, 91, 4, -183, -6, -57, -131, -67, 30, 29, 50, -52, -201, 250, 4, -60, 16, 206, -113, -18, 84, -23, -119, -212, 168, -94, 89, 154, 13, 49, -148, -137, -75, -30, -40, -57, 66, 28, 29, 52, -161, -8, -120, 93, -102, 91, -163, 83, 141, 111, 85, 130, 40, -84, 190, 0, 27, -112, -90, -5, 72, 79, -31, 136, 21, -6, -5, -7, 126, -70, -53, 160, 205, 121, 5, 22, -132, 6, -37, -24, -164, -96, -248, -89, 47, -96, -24, -4, -57, 32, 6, -18, -84, -90, 91, 47, 25, -107, 40, -11, 118, 40, -37, -45, -123, 82, -162, -8, -2, -26, 104, -53, -24, 90, -126, 19, -56, 28, 68, 22, 37, 180, -80, -86, -1, -19, -45, 66, 19, 90, -56, 62, 127, 46, -82, -79, -57, 87, -85, -7, 28, 82, -23, 41, -21, 16, 18, -49, 33, 119, -61, 127, -45, 18, -27, -86, -42, -121, 95, -5, -119, 59, -89, 28, 87, 127, 74, -96, 52, 81, -73, -22, 27, 6, -88, 191, 9, 105, 62, -55, 2, -167, 102, -24, 127, 81, -31, -15, 127, -4, -16, 93, -110, -90, 196, 49]
6228D9O2Pk97K1K52O4j07j11J02K05k11L1K1Jj69j4J23M0k16J22O3pJ72j33j39
6253f9R5p2J50J03j53k05K55q2p6P5M4k43K38K1j31Q7o3J51j91j20J41J25k06
6276a26J4R0M1lJ5k7j18j3J20J63k03O5J1j73J89lmj14O5N2j64O1Nk9K87j02j50
6303e1J15j22J17j28o0N4l9J59mj19J79j35qq3K14q6J20j17J50r7j50K15l00L09
6327A33j09n6J33K4o6j19P0K0j06M6J00on9n3J78l2O5j38L1J19k03Q2j68J09r
6352a4J13r6Q0p7Q8j30J8N5q8M6P9J9k37J49L1j56K71J3l92K13J06k88J37p9L14
6377A75j47J4j75J51n7P1j6r3p1J37j97K98j06j73K37j71J48R0j98J15p2l5l6
6400a11MN2J9M5p5J9m2R9k09J01J85j60P1k4L0K0K1J5K0j09J08j50J00K37k86
$$ y = [49, 111, 118, -179, -158, 94, 158, 51, -60, 42, 247, 36, 67, 88, 89, -80, -94, 29, 69, -147, -25, 38, 31, 203, 70, -69, 26, -46, 104, 207, 54, -151, 104, 22, -54, 21, 65, -178, 60, 81, -50, 37, -26, 125, -66, -186, -45, 80, -126, -112, -22, 19, 16, 31, 4, -114, -127, -7, 156, -47, 18, 29, -144, 45, 42, 38, -76, -11, 41, -123, -62, -57, -86, 201, 99, -51, 64, -58, 59, -69, -129, -75, -114, 45, 41, -78, 101, -34, -42, -125, 89, 3, 123, 6, 156, 59, -91, 124, -176, 133, 24, -32, 101, 125, 59, -60, 10, 30, -76, -30, 70, 64, 5, -48, 130, 98, 163, 25, 56, 175, -28, 54, -114, -5, -14, 99, 3, 83, 6, 94, -36, -18, 37, -51, -5, 74, 93, -144, 5, 36, -120, 151, 164, -228, -15, 91, -197, -60, -139, 175, 28, 42, -133, 18, -39, 32, 16, -77, -148, -11, -208, 90, -16, -189, 48, -123, 25, 115, -83, 32, -40, -75, -111, -107, -55, -36, 9, -66, -47, -89, 10, -199, -98, 87, -73, -2, -26, 4, 24, 45, 60, 80, -29, 79, -71, 29, 266, -20]
6425b0Q6j21k6L9j3K35k25M8J9r9j6L1J07j9k5L5M6M6J1J43l26QJ8j6j4p5J49
6452B6j01R2p0L1j7pK52l81P9j28K21J90j53J64l15R1J7q4K25m3O1j99J2K17j33
6477D7J7j13rQ1l5J1M7j45M3j0M4j05R9J29o9o2J81l34J91o7L0k6j29J56R1j70
6503a07R4J85j01j76L29j68k2R9j28j06J80J6k80J56N4jm0Q0j76Q4N3m7k9J70
6527A19j81Q6n0LK40k97q6J06L5K69k66J35p6j16J11p3J36j3k97K70O5l0n0o3
6551b3oK1J64k51R6p1l4J26j8J46j47J5K3m3j14M8J84n0o1j63J05J3R3k5K8L6
6577I2k8J49k92l7R7R6j52NK00k7m2l5Ql6J02K1p2N9%M3j90P2j73K70m5k92K63
6604E6m6K9J34j91l5K5K3j04N5QM2O0j71N9J26j11P7p1O0J44l75J41J94j51N8
$$ y = [-20, 66, -55, -81, -42, -55, 180, -45, 3, 22, -77, -93, -62, 45, 26, 1, 36, 82, 128, 139, 282, -44, -36, -18, -34, -48, -123, 26, -75, 17, -53, -22, -39, -46, 206, -175, -96, -224, -3, 187, 34, 198, -117, -26, -9, -93, 132, 89, 150, -49, -37, 180, 47, 64, -49, -58, 23, -12, -1, 46, -99, -56, -66, -22, -127, -28, 101, 32, -30, 151, -183, 8, -59, -29, -55, -184, -28, 63, -107, -13, 172, 71, -105, 224, 56, 34, 133, 5, -101, 79, 95, -185, -29, 25, 24, -16, 64, -112, -28, 25, -22, -51, 119, -62, 24, -26, -23, 217, -80, -166, -60, -25, 244, -22, 113, 37, -79, 32, -41, 95, 82, -215, 55, 120, 90, 40, -23, -29, -8, 156, -95, 1, -70, -104, 22, 4, 150, 3, 18, 41, -2, -116, -68, 116, 66, 5, -158, -53, -40, 53, 28, 56, 92, 64, 213, -79, -116, -19, 77, -75, -70, 130, 103, 61, 26, 34, -2, 100, 121, 49, 108, 108, 151, -39, 33, -140, 130, 85, -207, 56, 10, 39, 173, -18, -53, -28, -5, -109, -54, -46, -4, 56, -115, -56, 70, -41, 36, -35, 25, 169, -206, -65, 129, -22, 36]
6629C6q9L3j7P4q0O0j36J34J87j71j3r6J36J03j84L5n8J65j57j1m0K08Jj37J51
6654A34k54N8K17j56m8K1J25m1J07j01r1J02j23R2L7j40Q1R0n6j79N0L5j1K47
6678A96l3j16q3J8J3o2R3L1P3r0O9j06p3J10J1o1P3j37K8M6k0j5j5O5l2K2rn9
6706f3pQ5o1R9j93k4J21J03r5J19O9l00mJ03q3J04J23M8k63K00k15J4j12K87k1
6731C4N5j44J06j99Q7J21K2j15j3J18j01J55m9R9p9m2j49Lp6J92k9o0j01K54k0
6756F9j45P1l1J66j03o8l7k5J48M7qj23R1q1j4L8j09Q7m7j66L62j19P8o1O8Rp7
6783B0m0J88l03J38%qo9L9R3n2q8K6J49k75K79j27Q6j52J17J07j44k7o1J17K3
6808C6j50O9l8J72k28J00J43p1N4q2j13M4K30k27J05r4o1Q3J37l31J44J02k2N2
$$ y = [36, -53, -20, -37, 37, -43, 17, -119, 15, 202, 31, 18, -78, 58, 161, -23, 12, -46, 119, -38, -49, -89, 119, 120, -17, 134, -120, -62, 155, -1, -49, -28, 97, 56, 163, 62, -29, 73, -50, 42, 79, -61, 20, 110, 54, -125, -75, -40, -51, 196, 163, 47, -36, -18, -5, -67, 26, 57, 130, 40, 109, 3, -70, 40, 51, -10, 63, -74, -46, 0, -20, -35, -50, 15, -17, 5, -4, -63, -70, 15, -46, 53, -140, -164, -43, 60, -35, 84, 153, -147, -151, -48, -131, -27, 96, 144, -119, 81, -134, -120, -232, 55, 34, 89, -55, 51, -148, -61, 60, 82, -33, -46, 72, -29, 126, 77, 176, 97, 55, -94, -91, -167, 25, -4, -64, -165, 89, 69, -76, -5, -36, 130, 27, -41, -78, -103, 45, 92, 84, -39, 52, -29, -43, -5, -114, -27, -74, -240, 122, 3, 81, 20, 88, 97, 20, -20, 168, -135, 3, 3, -5, -74, -35, 58, 6, -82, -56, 93, -182, 97, -30, 56, -96, 21, 128, -16, -43, -104, 13, 36, -114, -45, -83, 89, -139, -39, 104, 33, 87, 5, -108, -64, 166, -61, 44, -50, -111, -28, 109, -222, -78, 24, 2, 54]
6832E4M7o1r3K16k62m0K84o7K4j33n9m7J37J27k00M7N9R2j93J8P3o1M1q9K99K6
6858B39k23k00O3J52k5J29j21r6K11n1o3j02Q8pL5m5p3J46J29k07R5o0J25k2j26
6883ij9o5p6K04Q0m9p5J22k07R1O8r1M9p4m2o8K09j8J8p6J94k44K24k67L3N7l5
6910f6O7J49Kj55l3p8m4N5R3j04J96j00J8n4MQ7%j60J22L4l4L5j00J94Kqk68J52
6938Fk7J11j09N9l8Q4k15J58j48J66N6Oj45M6l6k2pp8O9J60j51J30Q2j43P2rm7
6965C0p2K2K9j79N4K79j90J64J7j29NK2m9Q2J9j25j17K55l0j42r7K8J42j21J08
6990E%Pj3j03Q3M7K2O3K6j64M4R0k90J0K30p7j34J50oj21J80l4j37K33p0L9j48
7017f8N2pQ3qp4M5m0J70l17J77N2p3j73Q4J06M3j2LN0o5j41J84m3L6o7j3j6J16
$$ y = [54, 101, 40, -53, 163, -99, -139, 145, 78, 102, -31, -90, -137, 0, 127, -73, -26, 33, 125, -68, -50, 23, -38, 3, -86, 213, 239, 16, -184, -121, 31, 6, 135, 14, -82, 129, 78, 15, -87, 1, -6, 29, -16, -89, 57, 186, -21, 74, 14, 139, 117, -9, -28, -93, -169, 35, 115, 66, -9, 113, -94, -3, 65, -26, 23, -51, -93, -161, 48, 30, 48, -28, 166, -78, 146, -121, -88, -31, -66, 1, 150, 152, -3, -36, -114, -158, -103, -10, -114, 82, -18, 0, -54, -50, 37, 37, -123, -1, 33, -1, 34, -66, 128, 130, 122, -146, 6, -21, 90, -19, 40, 2, 86, -129, 29, -119, 47, 103, 109, -36, 10, -26, -48, -55, -133, -64, 96, -55, 75, 157, 14, 86, 77, 30, -42, -20, 9, -170, -116, 163, -27, 137, 154, 25, 30, 52, 3, 85, 104, -21, -138, 117, 87, -55, -152, -124, 18, -103, 5, 5, 12, -1, -104, -21, 26, 48, 111, 137, -27, 17, 107, -183, -173, 57, -20, -154, -4, -10, -131, 49, 15, -122, 111, 41, 80, -68, -16, -23, 60, 52, -22, 23, -17, 153, -164, 13, 65, -8, -181, -97, 9, 52, 40, 43, 93, 28, -113, 71, 28, 64, -3, -16, -32, 84]
7045H4j05j54P6J13j03J04J03j97ok7K14j60%Kn2K2J21l9qK4J00Pj08J68j11o8
7071@K0Qj17n4LJ95ln7J86k26NJ52j21jp5J15J65j51r3L3kp5K31l42M4J73j20
7098a07P3M4J17k16M9Q7o0p6J70K0k08K08j47L0j3O0n7m7K29o6l9n7O5n2o2J74
7124A19k23O9O0o2nJ25n6O7K6o9o2J36j34J5j01k5K25k2j55Q8L0j95K37j05J9
7149Bj02J69j38J27M6N0k03J23Q1k46R8J1k12K04k7j07K42j92k3J75k8n5R8k49
7173a56O8J39j1q4l5J54J0j96J30r9n4q1K01L1M9q5J2L8j24m4K01Jj97Q7J63r6
7199B2q9l1M7o5M2K37j84K9M5j66L46l56J10J67j20j54K11m1l1O1j58J16m5P5
7223F8J4o5j74K30p2p2K0J01q9pJ50k11J22p0J34j57N8J91j35k2J42j34m5nJ05
$$ y = [84, -21, -175, -99, 14, -89, 15, 118, -79, -85, -112, 102, -58, -58, -56, -108, -86, 35, -4, -12, 12, 112, 119, 11, 179, 68, 0, 20, 28, -89, -143, -140, 55, 52, -5, 181, -45, -40, 112, -9, -10, -85, 30, 195, 44, -49, -16, -18, -93, 138, -204, -160, 13, -107, -34, 10, 127, -89, -40, 47, -13, -89, 81, 101, -107, 101, -46, -16, -29, 31, -26, -73, 156, 90, 51, -6, 59, 7, -55, 119, -104, -35, 25, -37, -42, 83, 27, 94, 120, 51, -11, 125, -9, 6, -95, -120, 105, 83, -72, 16, 46, -149, 88, -17, 2, -100, 69, -69, 58, 104, 154, -49, 74, 155, -91, 7, 18, -194, 10, -17, -124, 118, -74, -97, 78, 50, -5, 93, -156, -88, 51, 40, -44, -79, 75, 85, -111, 19, -80, -134, -215, -14, 17, 66, -19, -7, 31, -93, -137, 64, 65, -132, -45, 118, 22, -67, -98, -51, -116, -74, 163, -21, 8, 53, -113, 233, -123, -13, 154, 34, -120, 91, 50, 19, 80, -78, 38, -7, 68, 82, 17, -157, 73, 1, -71, -51, 50, -39, -46, 104, -107, 15, -55, 79, -78, -20, 171, 36, 14, 156, 22, -23, -28, 77]
7248G7J5Q3p4j48j19J38Q6l8J1k0p2J6M2k1J32j41p5K3J74l7o6L5O5k79J55M9
7274A1j43J36qK3p2K7J50mLp8q7P2k7j9m4O5J11j39l4L2J52k56l4L38J4j81m7
7301c9M1j15J41j86J04pq6J66jm5p2K50k09l6J27O4m6J9J49k06OR7j38O5k51K02
7327fO5L0l7O7k21mJ60j01J40r6k8p8J75j71K17m1J28j66j86J98j74N6k9J04L
7352EJ23j15k09K93o5O8k08J88j25OR3j73J08J4j40J87j17K17j13j31J64j47R5
7375A8O4q9rJ67j85L3j23J29r9R2k5M4J17K2j23p7l6k3J14Q2q3k7J18o6L9p4j09
7402a09K35r5o5N1K9J01j22R5j88P5j07J54j34J4J10j16J31m3k38K10N7KN0k00
7426a03J69l9K1q0Rm9J16o4o3O3M4M8no0j36J30r9J06m6j18K87j03K6j85K10k61
$$ y = [77, 92, 175, 101, -47, -166, -28, 58, 20, 31, 11, -61, -45, -3, -24, 108, -33, -108, -85, 89, 52, -14, 21, 86, -193, -38, 11, -132, 4, -4, 19, -53, -26, 124, 120, 123, 45, -42, 30, 3, -16, -60, 5, 116, -23, -57, -25, 127, -129, -163, 175, 189, 8, -39, 2, -113, 28, -158, -54, -61, -147, 19, 18, -27, -99, 151, -58, -94, 33, 97, 51, 70, 219, 13, 19, 116, -22, 43, -208, -6, 59, 89, 52, 119, -102, -106, 54, -47, 93, -3, -31, -109, 66, -105, 112, 71, 199, 33, -153, 45, -129, -73, -102, 2, 5, 128, 13, -196, 97, 32, 100, -108, 80, -45, -39, 54, -119, -11, 3, -137, 50, -67, 150, 37, -94, 70, -77, 18, 82, -7, -16, 151, -34, -1, -124, 5, -94, -2, -27, 17, 134, 156, 33, -44, -80, -103, 11, 93, 10, -17, 101, 35, 74, 0, -109, 126, 31, -34, 17, 46, 147, 25, 120, -68, 7, -100, 54, -80, -66, 44, -72, 59, 16, -222, -12, 45, 47, 97, -103, 66, 27, 48, -32, -23, -72, 44, -20, -83, -20, 24, 72, 67, 7, -129, 1, -98, 8, -38, -156, 131, 28, 54, -131, 79, -182]
7452a82J49O6jj14L8q5J34M6r2j33J23J55k45K03k16J24p5J61p7o3O9l5J4p6J65
7477E3n6Nj76K90j34J8J72j45m1Q7q4m8O1M6o8j06L24k28n5N4KK5J07p9r8J6o7
7504a25J38m5O3l1pKj54L11k40j12J75mJ19J05k26J16j51J5K41m7j93J7j0K5j19
7529a37K53r1j10Q4M1P2p4J01p5j10lJ10j92K15j21R0j40N4K81k23j4j91l8K26
7553HQ0k6k59L71j47J9p9l4O0j5J8o2m2K6k2j12J71k2J33q7L1J38k25L4p6J76
7579E7m9o3J96j69M4rl3r8L1N7J76m0l3q5J26o3q7J1m2P6j7mJ1j0QJ75j45P8k14
7608a15J21j31J22Q6k81K99K8k70J42n4j38J72r9J11O9M0K1n6j98J76o4l3Q3j9
7632A2m4q4J30Kj6K2j43J82k24K3J53j32K55o2qnM3j75L8K6j56J99Mk54J65O9
$$ y = [-182, -33, 33, 32, -82, -44, -129, 5, 51, -41, -174, -51, 104, -141, 62, -154, -30, -105, 56, -21, -84, -15, -50, -36, -112, 53, -3, 2, -174, 116, -18, 0, 172, 27, -14, 73, -11, -59, 2, 48, -20, -126, 198, -30, -85, -31, -29, -4, 103, 24, -74, -58, -125, 13, -32, 31, 0, -7, -5, -159, 152, -88, -200, -25, -29, 90, 195, -31, 85, -66, -51, 190, 143, -50, -33, -43, -18, -137, 116, 25, -85, -1, 40, 112, 38, 139, 64, -46, -49, 61, -131, 84, -37, 53, -87, -33, 248, 25, 11, -180, -218, 8, 88, 62, -197, 174, 27, 46, -33, -67, -7, -22, -4, -66, -108, -82, -104, -216, -45, -67, 66, -21, 10, 148, -77, -43, -119, 57, 8, -55, 141, -28, 16, 7, -26, -124, -93, -36, 140, 100, 67, -18, 108, 45, -42, -31, -73, 3, -14, -18, -7, -17, -9, 166, 21, 99, -115, 6, -125, -3, 83, -198, 101, 129, -141, 1, -53, -191, -19, -118, -7, 62, 102, 123, 67, -131, 45, -19, -52, 31, 12, -32, -116, 14, 16, 0, 22, -121, 61, -163, -140, 13, -119, 136, 74, 66, 61, 104, -71, -33, -7, -163, 36, 40, -214, -49, 20]
7658B0r6K42j52N2m5K0ro9Q1m7j15n8L00j65L6L9q8J8j2k6J87j72r3J87j7M3r7
7685c6J90j65R9r6n2q8J5K05j33J14J08k36Q1p0j15J17M2N6k9o9P6j00J78J21
7709B13k56k3J42K06k34j3k59O9pO4J40j50J28l0J97j74N3k0om3m5J13q7j07J67
7734C8M3k11J90j05O0o0J8J58M6q9Q9j54m1J32On0k56J25N7O7L7j36J09k50R9
7759g8R3l3M2J08j41K0P1o9M6j19l4J37q7m6J25j16O9Q3o1k4M5Mr5L5L4m3J23
7786H9K9j25n1m4J43j17m4J38J11j11J2K0j98J60J28j08Q4n4kJ1m3O3j32j38L33
7811A54q0k31k7K21p8k2J24j05J32j67J98k8O8j68R0O7kk9j62k5J28j2K60m82
7835a76J19J76k81J99k09J34M9%j05L6J24l9q3P4J66j91L7J6p3J60j94J20l3l0
$$ y = [20, -76, 166, 14, 66, 21, 41, 32, -37, 44, -3, -118, -176, 124, -41, -5, 34, -54, -36, -48, -74, 113, -59, -152, 35, 18, 61, -36, 154, -11, 88, -8, -60, -148, -133, 72, -61, 53, 161, -75, 6, -64, -179, -62, -20, 36, 7, -62, 14, -86, 92, 213, -43, -66, 76, 282, 48, 35, -224, -155, -162, -98, 42, -108, 20, -10, 187, 13, 66, 46, 40, -3, -48, 65, -22, -129, 38, 81, -130, 60, -45, 15, -45, -27, 131, 177, 88, 177, 23, -18, 114, 120, 70, -186, -61, -4, 63, 100, -36, 73, -177, -78, 15, -18, 24, 132, -9, 11, 82, 13, 59, -60, -94, 43, -44, -90, 35, -81, -12, 71, 10, -14, 31, 35, -60, -25, 9, -34, 89, 118, -7, -58, -102, 41, -76, -120, 18, 129, 18, 30, 50, -148, 12, 140, 32, 116, 62, 60, 71, 28, 91, -41, -179, 154, 74, -157, -184, 37, -41, -63, 61, -44, 88, -79, 119, 91, 159, -9, 81, 148, 146, 117, -45, -70, 58, 46, 306, -176, -57, 119, -162, 37, -172, -38, 11, 11, -94, -58, 66, 27, -56, 18, 184, -7, 30, 46, -27, 133, -61, 59, 26, -4]
7859dP8j92P5J01n5r9K13m8r4O8pr6N4m4J39J4q6L1r7J9n5J76j89P7r1J12R9k3
7887G6k4N3l4m0Q4j37k3O9L2n7O1j27J1o9L9J27k07J68l2l9R3j30J62j29P1R9
7913I7j93K0J49k24J47J5o6N1L1j3M3L3j91K00j49J15N1j3j53L5M9N7j90P0K01
7938A72j93k0KQl7K1L7p0J38N3n6r6Op4K18r5M8j24qmQ8J56k85Q5P8j30r2L00
7966A26j6Jm9n4J25M6k62R0L1j4q7J14J37k52J5J04N9q4r8J21j43J15k20J56j16
7991a55P7p3K8j9J15K5J13j95J04P6j74J05N1r7k16M98k14J34k51J24j55K81j68
8014A4KR7M8J6k00L3o8J84j29J84k51M7M6l4j1J30j88J39j07J71o2p5J2J85q5
8039I8o3Lk15J06J02m9L9J47k53P0R4o5P1j0j02j50K10j0P5j84P9J4j14J71j33
$$ y = [-4, 74, -118, -43, 58, 3, -96, 117, 69, -25, 43, 36, -60, -6, -50, 89, 103, 17, 48, -49, -30, -85, 91, -98, -21, -112, 0, 99, 76, 52, 105, 71, 31, 115, -22, -45, 24, 56, -1, 60, -67, -56, -125, -86, 41, -166, 2, -30, -69, 24, -106, 56, -73, -2, 97, -96, -76, 73, -151, -4, 11, -55, -4, 27, 14, 57, 90, -101, 99, -50, 65, 116, 103, -50, -15, 34, 91, -99, -29, 172, -21, -41, -39, -31, -68, -47, -10, -80, 58, 111, 55, -41, -35, -109, 109, 14, 62, -62, -70, -74, 14, 170, -115, -30, 48, -82, -174, 126, 110, 111, 62, 8, 133, 179, -83, 7, 38, 24, -63, 51, 188, -64, -49, 55, 114, 30, -68, 53, -90, 25, -195, -39, -155, -78, -151, -123, -142, -27, -2, 111, -84, 20, 96, -78, 27, 78, -19, -235, 263, 49, 183, -68, 56, -99, 182, 14, 16, 113, 161, 177, -23, 10, -58, 126, -3, 181, -70, -23, 23, -11, -22, 108, -80, 59, -48, 123, 61, -14, -2, 183, 98, 35, 38, -177, -71, 31, -18, 21, 168, -85, -15, 79, 14, 85, 75, -27, -177, 33, 23, 98, -86, -7, 7, -107, 64, -69]
8064f9r8J44K9Qr5O5q2J27K1k6Rj62L13p8r7J62j67k05J74J7O1K8j28J32j38l0
8090h5J11Q0q4kj51J39o7K20j91j1J09j45K9m2J33J29j91k9R0M6J0k75J31O5P3
8115I2k70K09N0j00P1n3M5k42J51MR7J56k92K44o4k1N3j88J91k2j17O4r3j23J32
8140b6NO2Q4p3r5J12j43Q1q6J42r7P6j26N2j9j4J0K0K31k19K2j29K7M3J98p4M2
8167A06j47L3R0r0J44o9o5L3O7J2p3n3r3J19j5N2%r9JO1p3J53k59K82
$$ y = [-69, -167, -23, 6, 14, -81, -16, -98, 29, 50, 24, 33, -129, 184, 106, 9, 171, 4, -201, -27, -10, 51, 79, -49, 83, -55, -85, 26, 106, 22, 20, -131, 8, -59, 161, -30, -41, 68, -77, -48, -90, 43, 172, -19, -48, 42, 88, 98, -177, -46, 19, 92, -178, 31, 81, -19, 52, -1, 44, -198, -47, -43, 54, 210, -82, 162, 98, 77, 130, -58, 133, 111, -6, 58, -35, -158, -26, -21, 41, 125, 52, -43, 69, -74, 7, -79, 63, -34, 42, -84, -32, -51, -65, -55, -35, 196, -23, -1, -130, -103, -60, 138, 64, 106, -41, -8, 82, -8, 136, 67, 2, 35, 102, 114, 41, -12, -105, 14, -1, 51, 51, -48, -47, 14, -59, 94, -165, 117]
8191A17
$$ Imaginary data points
##PAGE= N=2
##DATA TABLE= (X++(I..I)), XYDATA
0@%%%%%%%%Qj6J6j6K4l2M0m8N6p2Q8j12J36j60J92k24K64l12L66m28M92n64O45
31C43p34Q37r52J077j214J366j534J717j916K137k377K638k926L239l582L954
47B073m360M807n297N835o427P082p810Q621r533J0566j1744J3103j4691J6577
61H802j8861K1693k5311L0118l6853M7042o4447J02095l25874K16937L14311l93776
73a24124M44324N2689m31881j6100n4294k52633K93892J42249J1616K40902r3809
84B12831k40184O7458k65793j40795L44886L6417J4230L34678j75158k21785J11034
95G7819l12075j54915M25546l4697n6768M22085j14498l38615J21512j76145k08455
106c49206K93531P5099j108K76610r1359j95707K9109k46279q7161K82398m1927
$$ y = [0, 0, 0, 0, 0, 0, 0, 0, 0, 8, -8, 8, -8, 16, -16, 24, -24, 32, -40, 48, -64, 72, -88, 104, -120, 144, -168, 198, -230, 262, -302, 343, -391, 446, -506, 571, -643, 723, -811, 906, -1010, 1127, -1250, 1388, -1538, 1701, -1881, 2073, -2287, 2520, -2777, 3058, -3369, 3713, -4097, 4524, -5009, 5557, -6187, 6916, -7775, 8802, -10059, 11634, -13677, 16441, -20412, 26630, -37817, 64278, -261596, -44659, 269652, -124124, 320200, 372889, -58992, -75092, -129386, -382019, -88127, 54122, 65738, 306640, 212831, -27353, 40105, -225688, -366483, -21597, 14820, 29050, 363728, 188570, -33215, 77819, -234256, -389171, 36375, 1678, -55090, 366995, 252497, -86118, 35394, -140751, -349206, -55675, 19424, 18316, 294926, 203567, 7860, 36969, -209310, -296471, -14073, -56000]
117e6000M9957L31542j49988j89720R6644k54649j26129K87802k7543J7846L06747
128B86509j11820j81761O0255k17886r5756K30535k3638O7206K66873j30931j34125
139A5461N0219k37256p3044K13793m5408Q4411K66227j39265j24346O4114k21039
150a46133q5997J89381k5579Q2247K28017j13901r2603L4594k15003o4984J54989
161e4972k9703J05978K03445j16608n5448K8400k29335m4822J58694m8087R3118
172A0660J99623j09731n6155K8077k08345m7309J39618l3857R2084J79222q5401
183A08486m6434R05j91076l4650J00735l0583J16981J55727q9966k0681p88j90354
195a21698k4968Q9849l7915J15998J50229q5439k0894K27j72660l1845P1754k4152
$$ y = [-56000, -6043, 325499, 175511, -14209, 82435, -172214, -298343, -10541, -38084, -20238, 286509, 174689, -7072, 53183, -164703, -260459, -29924, -53562, 13644, 280517, 149586, 15461, 65680, -171576, -244620, -30827, -76235, 8176, 274403, 135138, 10792, 74906, -146133, -232130, -42749, -68328, 13919, 241936, 128035, 35432, 70026, -144977, -209961, -54972, -84675, 21303, 224748, 108140, 52692, 81092, -148243, -193065, -34371, -82458, 10660, 210283, 100552, 44397, 72474, -135871, -183180, -43562, -77419, 14665, 193887, 108486, 62052, 62957, -128119, -162769, -62034, -92617, 24364, 180091, 90125, 69444, 68656, -121698, -146666, -56817, -94732, 21266, 171495, 86056, 65162, 65389, -107271, -139116, -67362, -91514]
207i1514J14223J30129o9929r471j1429j61829k5262N9462k0936J07167J14845
218A35456n2523m068k9862j50473j0838M5409k3239J12249J10208m8620O96l0983
230E3412j47463j7321M1761j7351R8033J00282k5607M102m4575j28789q108K0030
242g1594j7318J06425Q7640l2502J3385l3525j28766k0244K2259n674R2948P8587
254I1621j4965J3639m3171j15592j8215J0498l830R3440P4121j5207R730l6331
266D5738j03135k8767M583Q952Q3799O3004L893J3579n0784r3969j8223j1091
278h2421k789R1339O8924m606J0820l3793q8398l2636n066Q430P1713N9464J3579
291G4560P759m6143p5804k5060j4529N567P4924N9218J1510O901l8124p0781l5933
$$ y = [-91514, 22709, 152838, 82909, 73438, 62009, -99820, -125082, -65620, -86556, 20611, 135456, 82933, 78865, 49003, -101470, -112308, -66899, -90138, 22111, 132319, 83699, 84395, 53412, -94051, -111372, -69611, -86962, 11071, 111353, 85746, 89848, 45273, -83516, -91624, -71594, -88912, 17513, 105153, 72651, 86036, 52511, -76255, -96499, -74240, -79914, 13034, 91621, 76656, 90295, 47124, -68468, -86683, -76185, -80015, 13425, 87546, 72339, 82069, 45738, -57397, -86164, -81581, -72629, 11170, 74174, 78067, 91646, 40862, -53107, -71330, -82421, -85210, 6129, 75053, 70447, 81267, 47474, -40924, -73560, -78626, -70196, 1517, 60981, 74560, 82319, 36176, -39628, -64688, -79217, -73650, 1274, 60492, 72002, 78903, 40779, -30002, -65935]
304f5935j6114J6065O6202M7228K1687J5314m4741p2648k8136j4101N706O2656
316f817N7792J9666N890l3258o3860m1310j5341J3575N1254N1474L0435O003l6512
329C8991n4683l6899k0449J0990M9792M9727K8879M818l3444n1334l8971k0658
341g3241J2780M7183M6805L1801Q793l3624n3995l6360j7326N734M1025N2853
353C2428L1810K760k6542m6708m2328j9172J0473L7806M6783L2761O778k3219
365D3630m6792m4111j8536J0041L3305M5251L3673P182k0976m1944m3052k1573
377f3902R241L5511M2236K8282Q645j6349m3210m3317j9245P508L2904M3773K9021
390E1098Q985j4733m2223m2519j8177K208K7527M7268L1677M977j4004l5172m1118
$$ y = [-65935, -82049, -65984, 218, 47446, 69133, 84447, 39706, -32942, -61078, -75179, -69473, -6817, 50975, 70641, 76531, 43273, -20587, -61897, -77238, -63663, -12409, 39065, 69500, 75503, 38991, -15692, -52591, -73040, -62050, -12258, 37469, 66348, 71166, 37722, -13612, -52583, -73241, -60461, -13278, 33527, 65328, 74121, 40497, -13498, -49858, -67184, -61450, -20425, 32428, 64238, 66998, 40456, -6252, -48580, -67752, -57279, -19473, 27310, 60071, 66849, 43630, -3162, -47273, -65809, -55768, -22463, 22788, 56461, 63643, 42667, 723, -42329, -63902, -54661, -19150, 23086, 51368, 60013, 43664, 454, -42863, -62108, -54600, -21696, 22077, 51098, 60083, 45350, 3127, -39392, -57569, -55361, -27834, 19434, 51111, 56088, 42084, 6912, -34206]
403c4206k1779J785K6944M3376L3078Q066j6674l5131l4717k3114l746K7961M3174
416A5017K9043J0629j2472l6142l4021k0348m899K5498M1598K7105J1411q943
428D3476l5941l7355j9434p53K2566L5912L1040J6750j2791l6116l1584k2036
440d6266o150K4562L5150K6853J8252q313l5137l1151k1309p230K3315L4101K6077
453C2754J7247p290l1608l0732k3702o682K1725L1990K8176J7508j0061k6081
465A3244k6722l0292p604K7601K7171K2298K2628o219k9548k7885k6268o147K1461
478b6282K4362K7946K4546j0256k7327k2891k8705r204K0756K2607K7662K4421
490D7635r393k3020k2722l1139o640K1200J6917K7896K8606j2299k4677j7502
$$ y = [-34206, -55985, -54200, -27256, 16120, 49198, 57264, 40590, 5459, -29258, -52372, -56118, -28157, 15017, 44060, 54689, 42217, 6075, -27946, -48294, -53193, -27695, 13903, 41008, 52419, 43476, 7535, -29820, -49254, -50007, -27441, 8471, 39511, 56261, 43470, 7354, -24230, -46266, -52416, -27854, 7296, 34149, 52401, 44088, 8951, -22200, -43509, -50739, -27424, 6677, 32754, 50001, 42711, 11103, -19629, -43331, -50013, -28288, 3702, 31878, 49386, 39325, 13244, -13478, -43770, -51374, -23773, 3398, 25696, 48324, 42105, 12557, -15328, -41596, -47743, -26282, -1920, 26026, 50572, 40316, 12989, -9902, -38607, -47811, -27055, -4448, 23214, 47635, 38242, 15222, -7500, -38639, -45279, -24079, -7162, 20734, 49340, 37041, 12364, -5138]
502e138k9453j1834J8351K1951L0055K0195j2538j2090j8666m0740o640K5677
514b0870J2911K4822K7728j0059j6952j8636l5481o580J9387J1837L0364K6619
526D5090j3392j3152j6230l6953o463J7064R601L1501K5833j3398r170j7596l8111
539c5376r35J5129J925L4980L0171j7979j0726j2393l6779n253J3655N243L4118
552A5780K5651j4271n359j5711l8835k170J2170L453L4035K3165j2426K40j8917
565F805m2014K964J2477j971L3808K5248j2137R05j8487m0760L195R188k583L5798
579A2436K2586j2650M596j8608m0316M547N941l129L8936J9850j4345P419j7635
592I628m0183M372K835k608M1032J8034j5195J0152j6789l9611L224R71j195M0141
$$ y = [-5138, -34591, -46425, -28074, -6123, 23932, 44127, 31589, 19499, 833, -39907, -46547, -20870, -7959, 16863, 44591, 34532, 17580, -1056, -36537, -43117, -23730, -11893, 18471, 45090, 31698, 18546, 2316, -34637, -41100, -24036, -14435, 17066, 42899, 29501, 20331, 2735, -35376, -36311, -21182, -19257, 15723, 45894, 27915, 17189, 4796, -31983, -37236, -23581, -18338, 15780, 41431, 27160, 21801, 6090, -32745, -34915, -22745, -19292, 14743, 37908, 25482, 25722, 6805, -35209, -32245, -19768, -21739, 12069, 37317, 25180, 26085, 7598, -33162, -29967, -20779, -23362, 12436, 35022, 22372, 26968, 8360, -31956, -27409, -21468, -24597, 14339, 34189, 19844, 27263, 9628, -30555, -26183, -23348, -25956, 15076, 33110, 17915, 28067, 11278, -28333, -25109, -24138, -25333, 14808]
606A4808J4043j1693J3759k0467l9816P524n61m756L9988J5264j0426J3537k1523
619I681l7670Q990l492n833M0276J4179r044J4454k2688l5208R747o544n113M0514
633A2249J2158p692J5250k4292l2217J0427j1023m630M3329R784q911J7543k1856
646A0119l2220P393j1566j495M0689O060m679J9233k4450l0479Q762j3323j210
659b7166L9560M139k078J9912k6388k8367R783j4917j735L8280L704K23J9279
672C4229k7294k6104J0369j6431j834L6712M087J914J7392k6872k2088P820j9530
685b7630J898L6434n92M367K0583k8544k2291R009j9861N96L5557K51L461J9413
699C2651k4562k0253L813j9521N544L1349l032Q544J9050k7445j7019M629k1839
$$ y = [14808, 28851, 17158, 30917, 10450, -29366, -21842, -22403, -27159, 12829, 28093, 17667, 31204, 9681, -27989, -18999, -22491, -28324, 11952, 26131, 17087, 31541, 8853, -26355, -16608, -23152, -28265, 12249, 24407, 16715, 31965, 7673, -24544, -14117, -25140, -29770, 13559, 23343, 14432, 31975, 10119, -22101, -14708, -26274, -27769, 12920, 18980, 14301, 33534, 9084, -21395, -12633, -25956, -27166, 12394, 16533, 14455, 34367, 7979, -20388, -10605, -25522, -27257, 11023, 14727, 14950, 34229, 6935, -19169, -8800, -25231, -27065, 9647, 13734, 15648, 33040, 6168, -15920, -8100, -27630, -25732, 10702, 10110, 14477, 35060, 6516, -15775, -6766, -26627, -26031, 9526, 9777, 13238, 32651, 8089, -12164, -8351, -27872, -22328, 9021, 5989, 14533, 33583, 6138, -10881, -6252, -28091]
712b8091N725L0611l730J0373J8216k8619j3962N634k4285M173L2315k562P401
725A3199J7524k4230j4509K558k0617M205K5641P94J2468J1175k4189p617k2k5067
739b8687P971K5995l133J3141J3846k4769q057j48k3484Q020K3866m267J4258
752A4552J4963k3799j0372O8j9593N846J9327l46J5536J0196k1037o116m686k0214
766b5675R908J6628k975J8179J0835k2135n211l757k0600Q809J6134j951J7278
779A5467R481j9397m381n492j9789Q461J4583p14J6632Q599j7534l627o635j8435
793b2781P639J2942N95J6580O596j5222k670q416j7638Q358J0908K61J7453O706
807B1311j4688l144q079j5789O934Q396K426J7580M158j2778q80r644j6427P814
$$ y = [-28091, -22366, 8245, 4515, 14888, 33104, 4485, -9477, -3843, -28128, -23955, 8360, 5798, 13199, 30723, 6493, -8016, -5458, -26075, -21870, 3771, 4565, 17033, 28208, 4019, -3598, -3620, -28687, -20716, 5279, 2146, 15287, 29133, 4364, -3693, -3841, -27325, -19305, 4561, 294, 14552, 29515, 5716, -4656, -4588, -24181, -18335, 992, 646, 16182, 26378, 5341, -775, -5461, -25675, -15767, 861, -2114, 16065, 26900, 4765, -446, -4203, -24803, -15994, 140, -1811, 15467, 24948, 5551, 1170, -4322, -24111, -15650, -1067, -1781, 14851, 23450, 5916, 2289, -4346, -22781, -15142, -2200, -1605, 14975, 21571, 6349, 3679, -4737, -22375, -14017, -3109, -2848, 14605, 21311, 6623, 3479, -4600, -20389, -13455, -5059, -2633, 14947, 19105, 6327, 5447, -4197, -20624, -12810]
821a2810Q049J755J6419N486j1270k183j0054j4454O431O596L515J5475M101r014
835H042j753j0986j3409N831N673L845J5413L581p884k038j0590j2466M513M653
849g575N001J4873K844o658j639j0891j1581L788L583N334J4407L267o102k267
863F384r773j0497J683K879O922J3240K709m087k537j1024q923J973J609O391
877c051J3048L209l502l027j0496q428J245J662O374J1944L684k303l549j0378
891c568p963K94K082O533J0255L876k80m006j0573p454l03J386P381R903K920
906A0483J16k789j0090q507q49K993O753P915L962J412m178r539p021j878J956
921i261P162P745M274J254m529q619o006l137J119P848P458M165J749m501q479
$$ y = [-12810, -4761, -3006, 13413, 18899, 7629, 5446, -4608, -19062, -12631, -6035, -2520, 12955, 17056, 8042, 6289, -4697, -18106, -12275, -6602, -2757, 12656, 16237, 8353, 6315, -4275, -16741, -12228, -7575, -2574, 12299, 15143, 8485, 6846, -4045, -15626, -11838, -8255, -2921, 11486, 14753, 8651, 6384, -3389, -13886, -12203, -9324, -2402, 10838, 13547, 9460, 6923, -4101, -13024, -11051, -9442, -3051, 9997, 13206, 9704, 6677, -3819, -12247, -11002, -9340, -2966, 8978, 12662, 10359, 6810, -3568, -11531, -11237, -9155, -2622, 7633, 11509, 11229, 7223, -3350, -10804, -11107, -9721, -2340, 7563, 10483, 10599, 7810, -2280, -10787, -11636, -8643, -1890, 6025, 9987, 11399, 7221, -2318, -9339, -11217, -9261, -2099, 5646, 9920, 11174, 6645, -1974, -7980, -11117, -9998, -2150, 5308, 9473, 11222, 6721, -1758]
936a758n595k891M55O464Q246N089L18m477o437n799m785J178P631O692M617J699
952A0647m099o950o001m278J510O435N861N591K143m364o793n472m423J065N906
967c222N997N697K215m443n873n923m763J641N468N299O092K272m376n697n187
982d803m999J183M766N490O948J565m862l841n405o211J256N424N163N825K133
997I632l719m255n899n341J351M335M756O441K315l575m201n881n396J866L818
1012c753L889O451L159l080n155n928m108J305K806M198P077K384l493l367n636
1027c251n471R85L735M151O059K213k405l066o180n326R34L217M332O205K013
1042H145k416k500n682o002M70L928M234N045K175j020l013o190m840O80K042
$$ y = [-1758, -7353, -10244, -9789, -3325, 4921, 10010, 10328, 5851, -586, -6385, -11170, -9992, -2361, 4331, 8948, 10647, 6548, -402, -6403, -10681, -9171, -2736, 3125, 8716, 10859, 6495, -298, -5770, -10193, -9128, -3222, 2775, 8472, 10687, 6244, 371, -5552, -10315, -8674, -3206, 2093, 8185, 10457, 6081, 384, -4803, -9802, -8619, -3853, 1637, 8585, 10150, 5288, 1447, -3958, -10169, -8913, -3489, 1674, 7499, 9632, 5913, 1658, -4241, -9582, -8231, -3896, 860, 7301, 9616, 6041, 1840, -4041, -9437, -7571, -3753, 136, 6587, 9746, 6666, 1511, -4417, -8525, -7220, -4414, -216, 6861, 9245, 5752, 2385, -3251, -8722, -7737, -4002, 149, 6208, 8421, 6016, 2950, -3230, -8556, -7622, -4405, -73, 6132, 8145, 5729, 3229, -2453, -8455, -7985, -4057, 177, 5222, 7397, 6377, 3364, -2826, -7666, -6986, -4944]
1057d944M398O203K015j837k642n519m901L06K251L577O231K941j890l666m730
1072b207l722p24J081M451O335K329j590l156m490m051j178J581M643N252K115
1087F669m95k678n441m260p4J235L720N330K751p05k480m860m586r08K140L511
1103a131M331L054M10l025n307l906n34J339K969M898L409k04l280l914l929j630
1119f450J180L664M684L149l89k389l664m413j988J863L233M095L606k63k861
1134C057k937m232k425J684L358L924L137R8k082l086m976k105K483K385K849
1149A132M547O36l092l301l708k063J449K297L630M044P7k515k547m021k771J621
1165d585K579L470L821J46k201k039m573k435J653J648L495M728q11k336q88m506
$$ y = [-4944, -546, 5657, 7672, 5835, 3193, -2326, -7227, -6921, -4670, -1093, 5138, 8079, 6189, 2523, -2207, -5929, -6653, -5572, -1121, 5214, 7543, 5953, 2797, -1693, -5744, -6922, -5341, -698, 4554, 6669, 6174, 3496, -1945, -6205, -6279, -5044, -1324, 4006, 6757, 6052, 3572, -1288, -5874, -6782, -4642, -1131, 3200, 6254, 6664, 3639, -1668, -5574, -6108, -4769, -1800, 3098, 6507, 6303, 3023, -891, -4820, -6450, -5270, -1606, 3078, 6227, 5838, 3449, -215, -4628, -6616, -4753, -1520, 2575, 6181, 5918, 3057, 120, -4112, -6537, -4853, -1495, 2429, 5566, 5664, 3582, 496, -4480, -6585, -4102, -1717, 1132, 5679, 6315, 3223, -78, -3786, -5849, -4400, -2103, 1527, 5571, 5648, 3133, 586, -3435, -6206, -4585, -2006, 1464, 5285, 5431, 3230, 1191, -3382, -5817, -4164, -2516, 979, 5707, 4896, 2560, 1672, -2834]
1181b834l545J910K509L190L861k32j685j546m807k784K104J430K583M947P7k087
1197C091j711m381k110J452L89L581N035n46j956j072m799k394K192L70K587N160
1213D888J29k064j210m579j942J319L80L047M853o91q13p34n413k160J711J08
1229c171K909M765o59n41m77n526k523K234j52K686M814o12j45p51n423k102J510
1246c164j25L198M206n10n6q55n342j404Q57r82L981N066j901r7M54n453k224
1263d351J482q24K966M793r25j09k50m833j629O30p60L405M085q54P93p61n023
1280b165j140L52j240L934L736j118J289k64n752j031J066j651L242M399j040
1295B617J029o34n137j005L29j298L317L902o59J331q78m800n98k10j657M016
$$ y = [-2834, -6379, -4469, -1960, 1230, 5091, 4859, 3174, 1628, -3179, -5963, -3859, -2429, 154, 5101, 5178, 3091, 1380, -3001, -5111, -3659, -3270, 311, 5346, 4800, 2844, 1772, -3027, -5421, -3229, -2859, -272, 4888, 5017, 2953, 1743, -2836, -4778, -3459, -3079, -32, 4821, 4130, 3317, 2583, -2830, -4990, -3279, -3171, -262, 4503, 3844, 3303, 2826, -2700, -5223, -2989, -3141, -455, 4359, 3747, 3602, 2851, -2572, -4674, -3164, -3289, -91, 4115, 3605, 3549, 2694, -2648, -4052, -3195, -4177, -196, 4870, 2969, 2872, 3326, -2127, -4351, -2869, -3693, -727, 4066, 3141, 3032, 2782, -2051, -3680, -3050, -3810, -405, 3680, 2826, 3619, 2858, -2165, -3305, -2953, -4193, -259, 3477, 2359, 3648, 3384, -2368, -3399, -2333, -3984, -742, 3657, 2617, 3646, 3012, -2125, -3130, -2801, -4099, -782, 3120, 2461, 3792, 2914, -1886, -2484, -2694, -4351, -335]
1311c35L235q34J797q33m884n72j35j850L966L290q46J682o45m860n48l37j414
1328d123L576K962m14K045j225m480k51m76j804L472K890k49K091j059m421k52
1344a718r71j411L790K084j35K600j341m255k46j214j306L761K029k97K758j166
1360B962m160l59j133j393L656J960k16K392q16l742l73j344j275L433J556K32
1376A380K348j315l090k23j915j129L522J522L99K097j375k918Q1k030j347L416
1392e77J390O36K424j671k748n9j774j425K839J474J020K153j585k379m04k021
1408b707q39L048O14J099K678j785k540k33j813o82K561N32J446K291j642k187
1424a59k15k182n75K517O77J212K093j182k110l08k421k94K186N77J586J689j082
$$ y = [-335, 2900, 2066, 3863, 3030, -1854, -2426, -2561, -4411, -445, 2845, 1999, 3681, 3036, -1824, -2372, -2709, -4123, -547, 2415, 2001, 4046, 2821, -1659, -1910, -2386, -4190, -718, 2172, 1923, 4014, 2955, -1466, -1718, -2689, -4100, -310, 1774, 1639, 4239, 2898, -1357, -1603, -2817, -4123, -362, 1667, 1370, 4128, 2962, -1198, -1557, -2690, -4083, -427, 1533, 1317, 3709, 2893, -849, -1222, -2566, -3841, -408, 1148, 1380, 3728, 2413, -677, -900, -2815, -3944, -422, 1100, 1499, 3596, 2221, -697, -616, -2646, -3993, -577, 813, 1449, 3873, 2202, -546, -605, -2379, -3804, -965, 509, 1529, 3682, 2097, -282, -686, -2707, -3546, -498, 116, 1215, 3893, 2108, -432, -665, -2478, -3160, -599, -67, 1379, 3670, 2028, -159, -374, -2556, -3131, -614, 63, 1275, 3368, 2186, 76, -232, -2653, -2947, -761, -184, 1402, 3091, 2009]
1441B009j639l41k831k35K419L54J361J845p33j826p70k082j31J476P49J833J634
1458C092j390q04j136k322q1J666L48J852J836j436q28j023k106K9J172K84K124
1475A277J748j418n60q97k597J4J292N62J727J327q00n00j315k196L44M87O86
1492h19J971J142r51M2j275k548K86R39M11J899J234n59o03j470j796J73L73M57
1510a094K367J247j153l27j137j637j93J65O53K611M33o40K25j550j837J64J91
1527a512K93K373P99m24j86j462j670J56K56L09K007Q90k05N8j894j551K52L1
1545a480O28J714P26J68Rk138j452N81k99K52K322O51j80L29j761j514J45m04
1563a703Q61J714L70Q1L44j466j418n8p48R51K100pK28O32j732j537J80q49J049
$$ y = [2009, 370, 29, -2802, -3037, -618, -264, 1097, 2942, 2209, 383, -387, -2469, -2600, -1124, -375, 1458, 3092, 1702, 898, -238, -2560, -2641, -975, -627, 1225, 3061, 1625, 797, -226, -2332, -2303, -1131, -847, 1277, 3025, 1607, 1047, 150, -2447, -2433, -1141, -579, 1148, 2475, 1675, 1175, -140, -2336, -1992, -1505, -819, 1152, 2294, 1343, 1385, 110, -2438, -2152, -1213, -802, 1097, 2331, 1772, 1169, -301, -2097, -1924, -1551, -1094, 1273, 2520, 1367, 1040, -97, -1734, -1927, -1762, -1109, 1502, 1935, 1295, 1520, -30, -1867, -1703, -1512, -1219, 1154, 1953, 1529, 1343, -119, -1789, -1633, -1377, -1068, 939, 1829, 1624, 1682, -212, -1763, -1511, -1480, -852, 862, 1588, 1756, 1765, -373, -1825, -1244, -1543, -1291, 1031, 1682, 1502, 1831, 70, -1444, -1299, -1703, -842, 872, 1242, 1323, 1667, 201, -1217, -1275, -2023, -1072, 1028, 1021, 1249, 1881, 149, -1388, -1208, -2057, -1008]
1582a008K204j71L30M93j623j560K90n27L85J777N78K34L96j937q82M9q57O31
1600a198K130P3L62L61j844r67K98j007M02K055K75N89j1j579o46j70j110P38
1618a249J936R3N67L29j507q94l20q15J014J535k50J078K78j727p35M7j206O47
1636a179J822j02J006J39j501r27r3p52O92J090K76J232Kj725n14J82j458P25
1654a085J691j7M90N30j381o04k78j141R42J162j40J197L10j774j84k90j358R93
1672i37J308k25J142L85j418o19j74j548J426R19m78J496N67j874l48j57j174
1689a709O93J223K7J004J66j311jo57j264R04J098j53J291K33j604K67o27j468
1707a888R62J222l69J390J93j294l07j79j692R74J124r1J105L16j360J61o53j343
$$ y = [-1008, 1196, 1025, 1355, 1848, 225, -1335, -1045, -1572, -1187, 590, 1168, 1402, 1798, -139, -1021, -972, -1829, -1198, 932, 1005, 1367, 1728, -116, -1083, -785, -1792, -1390, 665, 940, 1529, 1518, -61, -707, -877, -1987, -1249, 687, 780, 1347, 1676, 169, -725, -1045, -1860, -846, 689, 439, 1517, 1795, 68, -667, -620, -1826, -1179, 643, 541, 1547, 1686, 185, -742, -835, -1587, -895, 195, 471, 1703, 1705, -20, -534, -352, -1810, -1085, 606, 589, 1079, 1609, 228, -376, -654, -1795, -853, 309, 169, 1366, 1676, -98, -282, -572, -1930, -937, 371, 146, 1288, 1673, 255, -364, -538, -2086, -660, 259, -219, 1277, 1844, -30, -378, -535, -1709, -1016, 207, 234, 1238, 1404, 93, 92, -565, -1829, -925, 173, 20, 1311, 1544, -60, 207, -420, -1888, -926, 296, -73, 1317, 1510, 216, -91, -270, -1962, -988, 136, 45, 1150, 1466, 106, 267, -386, -1729]
1725a729R39N69J65J376K47j318k4o02j108Q88M98j08J648J65j688L43p00j399
1743a838J029O81l7J298M98j625O5n02r41O47N55j93J705r7j076K27q02j388J254
1762e40M82k27J468J06j270M16n43j503J172L11l85J652J68j229M10p55j195R01
1780e61L83k25J478Q7j082M29q23j280J080K13n4J470j10r90N86o62j432J020
1798d73K21k26J453J60q65M59q56j233Q54J84j48J649m8r97O97j027j084Q16R5
1817c69k04J510O1o54K84o50j427R87j44PJ575N0q48O07p79j401R46n4K27J303
1837A027j61p40M67p36r89Q19k83P0J590k30o18N00o65j082P52k59m7J433n8n09
1857B81L76q79q87Q50k49j44J387J61o03M34q41q87N33k14K52J145N9m43P28j308
$$ y = [-1729, -790, -221, -56, 1320, 1567, 249, 225, -377, -1485, -597, -99, -207, 1441, 1606, -82, 261, -439, -1838, -809, -128, -165, 1133, 1631, 6, 71, -431, -1372, -725, -170, -363, 1342, 1245, 169, 396, -406, -1794, -540, -58, -285, 1183, 1289, 19, 435, -108, -1611, -439, -128, -513, 1139, 1307, 78, 488, -267, -1462, -561, -178, -403, 1075, 1162, 80, 509, -314, -1594, -514, -301, -355, 1115, 1005, 15, 601, -61, -1493, -473, -252, -478, 975, 1135, 270, 729, -127, -1360, -506, -322, -470, 1179, 1131, 134, 831, -196, -1280, -464, -369, -573, 937, 998, 344, 628, -22, -1449, -462, -606, -599, 976, 1026, 178, 785, 6, -1395, -449, -503, -276, 1027, 866, 126, 593, -143, -1132, -313, -596, -526, 1064, 834, 216, 716, 51, -1031, -279, -538, -585, 848, 790, 281, 657, -222, -1109, -259, -508, -652, 735, 896, 293, 727, -114, -1001, -468, -682, -430, 715, 774, 331, 1059, -249]
1877b49p72Q88l90n6J314j90k61N43r26o66N29m17N2J521k71k48M29r51q14O28
1897c07k46K46J082p2k23L42r80o02M52m60K49J070n6k60M77p95n49K76l16K79
1917c93R28j81P4M45j011n20N94q03K32J227m6k80N26r49m61L56l35J49J179l18
1937D13j61N33q27m89K83m42J78R93k02K75J45r05m17L06m30J99J003j34n0M91
1957G62p37o25J99k12J33R19N8M9K04m88q71M43m73J17R29k22L61J81q63j97O8
1978b65m47L86O55N7K9K12o54m78L70m43J15R90k37K51j4o09k47K56m13M2N76
1999A32P5K25J19n87k78M6l90J43Q14j30K69K01o70l09P6l74J45O43J3K13L32
2020G08p16l29K23n27L57M18O0J84M42o73k92L8n52K46M13Q5J27M08p06j47J59
$$ y = [-249, -1021, -133, -523, -579, 735, 545, 284, 827, -99, -765, -236, -653, -601, 920, 649, 401, 830, -121, -935, -307, -553, -307, 775, 703, 480, 822, -158, -760, -308, -768, -519, 551, 495, 235, 712, -83, -632, -356, -672, -393, 535, 354, 428, 873, -138, -658, -64, -867, -635, 592, 546, 266, 792, -157, -618, -262, -597, -448, 731, 413, 252, 785, -42, -531, -248, -690, -512, 481, 279, 554, 699, -206, -623, -317, -747, -548, 455, 321, 271, 762, 25, -600, -401, -613, -480, 439, 497, 546, 750, 262, -609, -166, -639, -522, 407, 185, 546, 727, -136, -333, -265, -712, -326, 329, 386, 415, 627, -27, -505, -135, -578, -463, 527, 290, 541, 527, -82, -329, -73, -486, -444, 132, 207, 432, 551, -36, -314, -268, -658, -515, 299, 169, 438, 639, -31, -340, -264, -638, -493, 150, 163, 376, 708, -8, -337, -114, -641, -284, 134, 194, 378, 820, 147, -145, -107, -659, -413, 0, 85, 212, 620, -86, -233, -74]
2041g4n77R7P12kJ74K77n74j72k0m11J16N30R8K48Q5l63j39j28m79K81M93l7J77
2064C12M39o43p7m4n64K56M51j42L68K94m37n34J40k29K75K85l39O32K32o43k19
2085a87Q9m33M1N13k3L99J75m32j97j45l93M34J12rL43K20l44j93j56k84J69M23
2107A22l8L31L98r46N7n9m39J91N80k98N07K81o25K1k81n6l2jJ15M50K38m73K6
2130F9k4n88M85k8p8M89J01m57J22r6l16n7M32q5M71J03l52J8l12l66O6M40j2
2153B5L26J16l55N4j19n76M24J07m2M28j3k77l0j84m24L95J95j66L76J12k31K0
2175A61l50k10J58j2J86K73J99j93K8l50j20l7o1M98O1k1j85J48j82l73R3K73
2197a6j7M92j32k62J80l93k16O5J61N2L21K1J20j94l72k16K36l3n8N23K6o6J6
$$ y = [-74, -651, -554, 158, 156, 330, 607, 33, -139, -159, -570, -454, 76, 174, 422, 507, 144, 5, -123, -602, -321, 172, 135, 312, 751, 108, 31, -13, -577, -321, 130, -12, 356, 650, 213, -321, -181, -410, -135, 150, -189, 443, 675, 32, -187, -98, -531, -490, 23, 0, 399, 574, 142, -55, -200, -593, -159, -47, -56, 287, 507, 163, -30, -186, -470, -301, 122, 84, 415, 813, -133, -76, -135, -574, -383, 197, -101, 406, 687, 62, 83, -198, -254, -286, -287, -172, 278, 516, 43, 69, 45, -543, -58, -86, -164, 325, 426, -31, 91, -5, -321, -378, 54, -31, 440, 543, 191, 209, -103, -469, -403, 37, 25, 351, 467, 112, 166, 47, -529, -105, 2, -40, 388, 375, 98, 68, -116, -540, -145, 50, -116, 260, 372, 141, 161, -189, -399, -241, -253, -67, 206, 405, 212, 240, -110, -230, -267, -328, 170, 231, 210, 25, 173, -9, -382, -289, -16, -33, 459, 327, 65, 245, -148, -364, -299, -138, -86, 235, 256, 376, 182, -190, -406, -170, -203, -261, 262, 288, 222, 238]
2220B38m03j85K85m4k8M10k8k47J03k7m74J34P2P0N09n5k04l1k06q2K3M1k2L63
2244B12K8j44J05l28l25L23o2J25M03k21q5J85k44k39K28k47L23K63j11n4J53
2265B88k86k12K05k44Q3M36k14Q2K48m21l84K42k37M6O39j12N0K23n06k67K91
2286e0j01p2K51N3P6J31l17k7o5m8K9L28r5J18ll14j02J31k53K52L07j84O0K78
2310C83m40j54J70k68K45K39j37K13j16j70q6J37n00K50L24j67K31L17o20j00
2330b49J51j37J33K84PJ20Q9l82q8J46l52M12p1j89M33r6l25P0k57j32N53J35
2352B55k03J76j6k85Lj86J4J65M43l14J00J61n73K43j5j89j6M39l48M16m6k64
2374d0M3j21k83M40j04j29L26L2k48q7J25k84K87J66j26K79j20m78M08k23K4O5
$$ y = [238, -165, -350, -65, -109, -137, 273, 245, -2, 101, 74, -400, -266, -194, -124, 385, 330, 126, 95, -111, -193, -170, -129, -151, 212, 240, 96, 201, -127, -452, -129, -191, -66, 337, 116, 31, 216, -28, -267, -39, -286, 37, 300, 189, 135, 288, 2, -210, -5, -249, -166, 270, 56, 138, 386, -35, -419, -177, -414, -368, 271, 159, 209, 432, -74, -341, -50, -151, -223, 28, 81, 157, 288, -29, -56, -121, -169, -140, 188, 93, 211, 208, -106, -208, -77, -330, -78, 229, 45, 105, 383, -57, -211, -41, -309, -64, 175, 38, 251, 135, -35, -121, 16, -484, -234, 90, -77, 154, 471, -149, -249, -98, -235, -102, 182, 189, 309, 398, 16, -72, 74, -278, 134, 63, -126, 307, 211, -114, -44, -301, -433, 120, 255, 52, 228, 212, -73, -70, -256, -242, -77, 366, 52, 152, 313, -260, -17, -32, -221, -237, 202, -146, 270, 224, -40, 3, -118, -401, 39, -65, -194, 132, 164, -84, -171, -46, -330, -43, 123, -3, 276, 156, -322, 86, -137, -113, -48]
2396d8J45o4R6jl27J94j40k3K36O3k47M34k44k38J68k7k43L45L9l31M71%k66R6
2420H8l74J1K12QP3K95j69j79J33k12j93L44j30J63K51r6m59L69j20l06L53OJ1
2443G9K50k20k41L79l50j88K3J81J38L50l05j29J72k92j35L31j19K43K9j95r0
2464h9Q4j6p1J1J59m3R7p2j42J72l36kK72o8J20K86j43k15Q6k79j77L79R4j84
2488g7L13j96K1m7j92l9J90j33J46R2kQ8q9n8j70J74N2o2NJ11j77R0j82k12K88
2513f6j01J2L46o2k55K22j2k38J00J67J9o2j2M5k57J8P9R4j19l9J20K86jj30j05
2538D9j46qj9J84J03J75k69l6o1j93L06r2qL9L2k7L7m2k03p6J01m6M37r1j31J70
2564A85l56j27K02M0n7K70j17j0O2j85m4K65k10P6J17pR7n7j76p2J53k31O1K72
$$ y = [-48, 97, 33, 129, 128, -199, -5, -145, -168, 68, 131, -116, 318, 74, -164, 4, -23, -266, 79, 118, -213, 258, 258, -8, 88, -286, -275, -63, -55, 18, 313, 144, -35, 98, -114, -307, 37, -93, 70, 321, 225, -234, 135, 15, -291, 62, 68, 79, 329, 109, -132, 247, -103, -291, -268, -87, 51, 401, 96, -33, 139, -153, -288, 43, -76, 167, 196, 1, -89, -5, -21, -92, -81, 78, 35, 132, 60, -82, 90, -246, -248, 24, -44, 76, 362, 219, 4, 90, -189, -366, 13, 107, -77, 236, 40, 61, 14, -178, -217, -27, -160, -14, 78, 76, 164, 75, 17, -153, 21, 73, 11, 16, 127, -50, 40, -142, -354, -66, -167, -155, 191, 129, -126, 96, 84, -154, -54, 113, 132, 70, 58, 103, -154, -136, -57, 37, -82, -121, -1, 285, 284, 154, 49, -97, -105, -124, 60, 163, 338, 69, 33, -28, -221, 85, -7, -15, 24, 56, 29, 66, 24, -179, -255, -154, -200, 237, 146, 15, 185, -171, -298, -96, -56, -113, 157, 40, 30, 92, -93, -137, 128, -82, -6, 111, 104, 201, 144, -32, -104, 49, -182, -121, 151]
2588A51j44p7J50k44P4l6o7J85J54k13K82k88M2k49K11N2o2J48Q4k82J69N0o6
2611B4k56K1J25M52l62J4L0k24n5J74N3nJ69M7k2l1k50l%J30P1m6J95k96J93p9
2637F9l28J92j1QJ62q1j2J22p7l22L67k30Q8p7P9J11p7j15j67K33MJ51k4Jj58
2662i2J27j7r1J90k28o9J39R0J3onr6J02j32k2J03J43j16J12j37r5R7j01l5K20
2687I4j10j1J09q2j10O3j38N9J42j06m2K93k07%J53j65J0J61L0m9P4k76o0J31
2711c7o2J18P3R9jJ0l33K76o3l03L50L9l5k28K19j54m9L2m2K7J35q5K04j1p9k3
2737G7J7j83N2J75K8M2p3l60J10N7l7K3J02q8J22J69j65j23P2m9k0Q9j37K5K02
2762A27j40j60O9J77j07N3O2j31M6K7j88K25k60J89O5j68J32P6m1p8o9MO4J16
$$ y = [151, 7, -70, 80, -164, -90, -126, -193, -8, 146, -67, 215, -73, -31, -280, -69, -17, -79, 69, 153, -129, 40, 90, 24, -232, -211, -86, 366, 4, 18, 48, -176, -231, -57, -4, -9, 160, 207, 185, 154, -96, -99, -99, 31, 102, 56, 251, -45, 148, 69, -259, -67, -78, -70, 92, 11, -1, 121, 44, -278, 89, -141, -53, -130, -51, 60, -17, -132, -299, -66, -62, 89, 65, 66, -92, 35, 18, -73, 117, -111, -180, -41, 49, 62, 56, 51, -45, 57, -75, -97, 6, 149, 33, 145, 8, -87, 10, -91, -126, 94, -16, -27, 82, 0, -110, -47, -185, -126, 16, -90, -132, 161, -46, -46, 107, -58, -48, 113, 143, 94, 168, -108, -168, -37, -99, 19, 92, 191, 190, 200, -133, 143, 80, -223, 127, 166, 131, -97, 122, -32, -81, -49, -91, -64, 71, -14, 190, 179, 100, 77, 94, -89, -37, 138, 166, 208, 135, -225, -115, -58, -95, -72, 30, -58, 64, 233, 68, -55, 17, -32, -52, 37, -100, -75, 127, -13, -173, -104, 73, -34, 19, 81, -50, -4, 23, -165, 60, -200, -11, 54, -114, 18, 94, 53, -25, -94, -90, -26, 90]
2786I0n5K3N8j48q9J98k42J4K30%O3k18P0M9n0k87K14K47j48J6j04O0j1J6k69
2811b73K26n1o0J51J92l89J41K12k88R4J58k14J30L7j47Q0M3j30J20J53k23L68
2833C30j62l39J94j6j04J07n3q0L25n0r4o2n2j36J23R1kJ14m7j24J30l7k69K08
2857eQ9j16J30j53J27Op6Q5n7M2j04K04j95JJ4O9k74J44O2L7L4J2jk8N9Rk18J68
2885F5k56O6K41k17J43k35J27J85j06O7O1J09j67j45K00k22P9j9m5J58j03k23
2907b37K28k3O6Q1r0L4J09j52P6k9k3k43J40Q2n5K53j74q3L0J03q9MJ14p9J15
2932A58q1n2k30J48J97k00r9N0O7p6J30j61K18r8o1J59k08K38j93K64l6k17N1
2955c2j32J47L2o4J1n1J87k41J49J38k69K9J25N9k4O9l06J18J09j19M5J01k09
$$ y = [90, 35, 58, 116, -32, -121, 77, -165, -151, 79, 79, 142, -76, -6, 43, -7, -294, -80, 167, 19, 35, -69, -9, -20, -4, -273, -47, -98, -158, -7, 185, -204, -63, 149, -139, -45, 113, -101, 29, 66, -81, -1, 42, -88, 32, 185, -38, 330, 168, -171, 23, 7, -97, 10, -43, -123, 202, 152, 58, -4, -56, -192, -69, 22, 20, 134, 87, -37, 93, 56, -213, -5, 84, -32, 98, -55, 72, 78, 2, 87, 30, 72, -32, 172, -23, -22, -8, 61, -213, -69, -7, 30, 64, 76, 75, 47, 106, 115, -103, 65, -191, -125, 116, -101, 42, -193, -66, 119, 13, 80, 141, 250, 83, -62, 138, -84, -5, -24, -69, 89, -14, -237, -9, -32, 34, 115, 25, 59, 168, 16, 92, 63, 40, -203, -63, 19, -36, 217, 43, -40, -10, 93, 4, 8, 122, 43, 158, 77, 25, -205, -57, 140, -60, -159, -109, -42, -118, 12, -149, 69, -29, -90, 69, -139, 99, -94, 170, 134, -83, -32, -164, -17, 15, -49, -38, -89, 98, -143, 6, 144, -125, -96, 29, 88, 64, 133, -173, -55, 54, -65, -20, 81, -128]
2978a28L1j56J47P3M6j64P3J83j40R4N7o1n5k5k3R8j97J83k20J43K7m6P2q9K48
3003A71Kr0j29J20q8J8P7m1J59k22L5l4o9J21M2j37K5L4J24op4J9j79J00m7j29
3029a98K27n5jnl9O5M6j06l0J74L7o5j05O7j15K46j87j8J36l7j93K16p4J7J4O9
3055H6l7o4K4P0Q0j45J8O4l1j14ON6j44K13o0k11M21j63J2j99K16O2j85j07J80
3080D8N7j44N1L8J4j9j3k41L99j17k30N4K22k66Q5J26p1J56k36Q8O3j26J51j30
3104d1P9j6N1l8j50J20o5OQ0j93K25K5k30J35k5j20P6R5R6j91N2N2J20j16q0m7
3130a00K31l06K52m6P8O7k22M8q3K10j12J18m1j02K7n3j2J04r8r4R3qo5P9p6M8
3156f3P7n2K6l0m5m0RJ19j31K23P6l47J70RJ37Nr8L7Q1j87K2RonJ33l4j39J77
$$ y = [-128, -97, -253, -106, -33, 13, -151, -78, 105, -35, 59, 116, 55, 0, -25, -48, 50, -147, 36, -184, -41, -14, -60, 12, -77, 171, 173, 83, -46, 74, -14, 4, 81, 40, 199, -23, 12, -22, -91, 30, 72, -65, -40, -6, 118, 112, 38, 57, -122, -22, -69, -198, 29, -26, -27, -32, -71, -6, 40, -66, -96, 78, 115, 50, -55, 12, -103, 143, -44, -62, 74, 37, -156, 60, -14, 3, 17, 86, 49, -15, 9, 79, 159, 14, 32, 96, 65, -49, -43, 13, -131, 82, 22, -189, 232, 69, 81, -118, 98, 160, -25, -132, 48, 105, -39, 12, 50, 64, 45, 32, -209, 190, 73, -157, -103, 119, -147, -62, 64, -7, 149, -87, 1, 64, -62, 89, -41, 38, 22, 73, 35, -115, 5, -60, -54, 26, -167, 58, 83, -147, -12, -37, -157, -81, 14, 110, -81, -29, 23, 143, 27, -53, -100, 131, -175, 77, 31, 109, 176, -46, 2, -81, 129, 17, 135, 94, -8, 19, -34, -46, 58, -40, -134, -41, -49, -114, -35, -111, -63, 14, -38, -12, -42, -87, -127, -118, 1, -130, 93, 169, -178, -8, 1, 138, 143, 45, 82, 163, -24, -2, 7, 1, -4, 129, 95, -44, 133]
3184A33j27Pj24J93k75J11Q2N6l5n0n5J87j07r5Q7o3n8N9M2J00j23L0j04M8J23
3209D2p4L60l78J08j14jM1k6L7m6P1oN5L7j32J0n5J59L4k76J8J89q0Q1R5k25P1
3236el8r4J11j0M1p6n3K47j18M5k0k2m0J01k37J55R5n4o3j9J22k9j15J6j4J6k0
3263g8P7rR3n7QLj07l8Q5Q9m3O9j84QJ2M8j11P3jM8J18k22JJ50L6rj48J49j36
3292g6O0K04j08%j52J5Q7k05R2N4J28j81o8K17Q0k60J81L3j86O6P9j6p1pL7k9
3318b6ko2l9J91r9o3J54j33J60p9k7j4J09q0o9J45q6O9k9p5l1J14P2j07M0rJ9
3345D3k58J38k0N9o0K05l6lp7Q1j84K41j63R2j01J5M3k3j7J5J50n3j92J38j18
3370h5l6N7L9n9Q9O4k01J76l2l7J0J67k04n5J54K05j12o8Q3j18R5j68L9k7L2J9
$$ y = [133, 6, 13, -111, 82, -193, -82, 0, 56, 21, -29, -84, 103, -4, -99, -12, -75, -133, -74, -32, 68, -55, -25, -129, -81, 42, -32, 328, -50, 58, -56, -57, -16, -42, -5, -51, 20, 14, 69, 106, -26, -16, -71, 88, 122, -154, -136, 53, -27, 54, 149, -76, -5, -43, -137, -26, -36, 5, -71, -124, 123, 5, 50, 30, 8, -32, 69, -168, -13, 82, 28, -35, -54, 68, 39, -76, -60, -74, -58, -78, -1, -10, 83, 26, 34, 37, -70, -108, -23, 66, 23, 92, -92, -84, -72, -24, -135, -62, -63, -15, 103, -119, -118, 32, 68, 59, -89, 60, -76, -16, 188, 80, 80, -72, -57, 30, -175, -83, -29, 99, -82, -150, 67, 147, -113, 68, 101, -85, -19, 60, 44, -27, -34, 3, -26, -28, -90, -129, 62, -37, -100, 54, -79, 81, 2, -25, -39, 70, -10, -79, 66, -20, 49, 20, -55, -86, 28, 100, -7, 33, 24, 43, -215, -77, -97, -38, -98, 107, 71, 68, -9, 72, -112, 129, -34, 58, -43, -28, 15, -8, -25, -10, 140, 87, -105, 33, -85, -121, -64, -25, -84, 5, 69, -132, 44, 12, -25, -15, 152, -52, -107, 47, 252, 140, 72, 155, 37, 132, -36, 3, -24, 8, 27]
3396B7l6j09J67oj26J13r5J7J37j66q7K08j46O3J67j00j37l6oK10P0p9J16k6n9
3421H1k14J49J8k03K64J32j09j52l6l0J09P6j27J50L3j62m7J07L8k7j62l6jM7
3445a02MP7j01J57L1pp8Nj46M7QO9R7M4k2q3Q0j03P1Pj3r9J20Qj28j2J16p7J26
3474I6Qj90J73j22n3J64j21k39L13j5K4j15O5J2J3j18mK25p4%j55J92j63N9J2
3499a3O8r5j7M9K60m29J49J00j25R4j44O4L5Qr3J08j24J27L1r7P7l9pL7Lr2j7
3526h2J61o2j31M6J71j77L11l50Op2k1K71j94K15m6O3q9L5j20j7M4m2K7K3J0O8
3552D8k38J55KL9J57j14p9J49j05M5n2m4J56r5n4P1m2j27J91n7n3KJ04j05MJ20
3578G8o6j17p2R9K18k14J93j51k1J23p2r7R8m0R4j00L6K8r0l5p7K38m8j0k0p5
$$ y = [27, -9, -118, 49, 43, -83, 30, -65, -48, 89, -77, -164, 44, -102, -39, 128, 28, -109, -145, -151, 59, 129, 50, 166, 140, 81, -133, 16, 34, -169, 95, 227, 118, -34, -70, -100, 9, 85, -42, 108, 141, -21, -68, 39, 77, 50, -112, -148, -149, -102, -98, -21, -122, 35, 66, 59, -19, -14, -160, -113, -105, -36, 61, 105, 83, 0, 80, -23, 48, 55, 42, -57, 63, 71, -57, -69, 47, -30, 96, 104, -86, 87, -35, -88, 76, -45, -284, 29, 14, 38, -77, -12, 0, 13, -105, -109, 116, 42, 42, -113, 79, -84, -25, -13, 55, -40, -57, -8, 252, -177, -28, 72, -53, 41, -103, -39, -4, 4, -89, 19, -105, 22, 53, -44, 33, -6, -13, 24, 27, -65, -82, 79, 17, -114, -68, 103, -74, 237, -113, -107, -179, -200, 71, -123, 92, 46, 109, 20, 55, -65, -82, -38, -80, -53, -30, -20, 48, -190, -35, -33, 6, 163, 49, -30, 119, 14, 59, 7, -37, 119, 24, -30, 41, -1, -128, 63, 6, -47, -45, 59, -46, -42, 78, 12, -105, -177, -78, 140, -74, 119, -32, -53, 70, -2, -99, -1, -41, 53, -47, -11, 17, -73, -108, -185, 53, 5, -5, -25, -100]
3604a00K68k68J32l5J80j50P3j79K53l19K05J41l28K24N6j84o0j17K65P4j36n6
3626f1J6j38J11J13k6n7p5M3K8J72j15J09j55K4O0R8n8r4J5Jj8N4n4j19K13r6
3652ik5J62k15J15j24J78j13Q3o0l9l6L9R4j45J0Q8j14J25k7O4o4K8J20j96o9
3677a30Q2J48j39L5P5q0k2j7O0j4n1J6l1J41r9J24k3j37K3l5R4r9J87j65N5P5
3703G3l5o7Q6k49L01j23k7Q2J3M5m7P2o8r7R3Pq7K2nJ71k1j52J82k35J21r8N5
3730A2o0J67k31N9J41mj8l3k8kl0n9M7mM5J26k65L25l60K20J9j90K09q6N1j13
3756f2j6rJ09k12J43m0L9O7M7j4l8r3l0J78N1m5l2P4pj08l1J51j6j32J08J96l39
3783f1l4Q8J5J00j53j31J54o8M9J03o2PKk3M7N2j52K3J91j67Kj4K6Mm6J20m4N0
$$ y = [-100, 168, -100, 32, -3, 177, 27, 100, -79, 174, -145, 60, 201, -127, 97, 153, -31, -91, -208, 57, 131, -5, -61, -45, -183, -72, 41, 15, -42, -117, -74, -46, 126, 11, 120, -35, -11, 49, 147, 89, -5, 10, 11, -7, 47, -7, -126, 87, -9, -34, 128, -87, 28, -96, 82, -31, 52, -8, -47, -83, -44, 50, -95, -85, 3, -111, 14, -13, 51, -13, 15, 135, -61, -130, -48, 100, -39, -4, 71, -9, -31, -48, 12, -2, -53, -37, -68, 73, -26, 98, 75, -62, -39, -74, 20, -79, 108, -57, -2, 73, 38, -29, 57, -192, 109, -14, -41, 41, 54, 99, 52, 124, 56, -41, 52, 59, -28, -6, -11, 160, 139, -13, 169, -66, 55, -43, 12, -48, 119, -112, -53, 88, 84, 66, 33, 5, 3, -27, -86, -39, -43, 2, 128, -137, 188, -172, 48, 67, -123, 86, 0, 51, -62, -78, -87, 22, -190, -47, -87, -48, 19, 66, 52, 14, -79, -109, 69, 120, 75, 43, 117, 110, 2, -29, 122, 106, -26, 82, 278, -61, -95, -7, 8, 108, -45, -176, -22, -90, -41, 62, 0, 7, 9, -14, 33, 85, -67, -44, 147, -20, -18, -32, -6, -2, -48, 72, 28, 78]
3811G8o8N1k3N2l2L4m3j11L7N6K2J03k95J36O6j61J50j02P2Q6l59M26q3L2j82
3836e8N3o2q8J43J32k39J60j01M2J31p2r5M9j1p3N7k4P9Rp5J03J84l05m0J10j20
3862a11K10k41J31N5k23K06J10n1j08M1k11J37K17k13lJ31K3j43n9J58m3l7L9
3885A5o0oN5n6J07j48L5M0j04LJ23O8j09J54L2k02M9J50k01N9OQ0J7j59J02J1
3911F1q4Qk0K51j66k05p2J48N2Q6q5PL1j10L05k07qQ2j08j54J32J41M6l5q2Mj0
3938HN1l1N0n3j61J94L2mm2O8j10K7Kjj36O6Q2P2q5l1M1j17M9r5M1m8J04k5J34
3967H2L8k40J47M3q9L8P0j14p4LJ62o6o9M2J20j82J93l68O9J82J25j31J11j18
3991b6l4J03j53Ql0J50J77r8K9L5k10L7j03k7j1K13j46l9J05k10J88J11m6Ol0
$$ y = [78, 10, 61, 38, 90, 58, 92, 49, -62, -25, 31, 53, 156, -139, -3, 63, -98, 52, -50, 22, 108, -251, 175, 92, 124, -58, -5, -67, -155, -12, 120, -119, 41, -60, -18, 113, 41, -54, -5, -16, -89, -32, -56, 23, 32, -43, 60, 244, -61, -101, 9, -111, 99, -142, -11, 44, -179, 27, 137, 86, -22, 19, -192, -55, 162, -51, -54, 77, 100, -43, -102, 56, 13, -24, 15, -45, -51, 4, -52, 55, -93, -58, -18, -122, -119, 4, 72, -37, 117, 149, -53, -4, 146, -55, 4, 10, 90, 107, -52, 50, 61, -23, -15, -35, 216, 50, -155, -227, -79, -27, 59, -26, -19, 12, -98, 207, 0, -8, 74, -34, -188, -56, 85, 131, 96, 14, 18, 8, 59, 28, 78, 25, -136, 58, 90, 86, 44, 112, 2, 29, 31, 30, -106, -40, 42, 114, 29, -2, 39, -78, -29, -124, -83, -131, -27, -52, 82, 120, -120, 27, 70, -19, 19, 89, -25, -99, -96, 66, 0, -69, -27, 93, -89, 104, -264, -195, -13, 112, -19, 92, -26, -60, 43, -110, -102, -132, 18, 195, 97, 126, 161, -49, -12, -115, -142, -153, 60, -86, -125, -20, -230, -42, 69, 23, 29, -1]
4016aj48L65k43R9K4q3m1po3M3J04j2m4j4k8J69j77O1j24M0J69n3P6q7q1JP1j20
4044a04mJ57o2j17K83j44N4j02L2j14P7J31k08J45J0j17K12k13Q1Q3j37k2J74
4067I5o7l3L9J00j42Q6j29n9J08j0p8R6q9M4J03L4K4j44LJ41k18J38j18K35j10
4092D9M6j72J26k1N0j63J35k44K21n5O8k31K89K5k17n2L86j89J74j28j02m6jQ5
4116C3j1J1q2r5J73M5m4o2J11mj00j4m3J22P8j07N1L9JJ04j28n5j08N2q0K35r1
4143C1J92j95J4Nj8Kj90K73j44J81O3j51j98K79P1k49J5P3K5l8m2N4p8k3K19j84
4169a3J9l2k7PJ29o2o8J27J0j60o8N5Q8r4J10Q8p5L1r3P4n9J20J7n4j35P0j6k4
4197c5J63j05Q5j46P4O9k1O6p6k48ML25j48M4j25J16L4m6o6j44K78j33J28o3K
$$ y = [-1, -149, 216, -27, 72, 96, 13, -28, -35, -98, -55, 49, 37, -7, -21, -49, 120, -57, 4, -120, -80, 89, 36, 112, 25, -56, -55, 16, -104, -108, 49, -13, -130, 153, 9, 63, -39, -7, -121, -44, 87, -121, 24, 34, -83, 129, -84, -3, 80, -57, -79, 95, 28, -5, 34, 134, -8, 78, -51, -110, -2, -12, -90, 6, -83, -39, 64, 98, 122, -22, -19, 122, -96, 42, -76, 159, 49, 95, -77, 49, 28, 78, -85, 50, -194, 27, -28, 40, -191, 98, 123, -94, -146, 240, 51, 225, 97, -5, -51, -52, 33, 22, 33, -49, -144, 29, 74, 30, -32, 79, 75, -25, -39, -82, 40, 118, 11, 62, 101, 102, 206, 78, 23, -85, -33, -113, 122, 31, 223, 28, 42, 47, 29, 31, -159, 114, -30, 151, 214, 63, -135, 144, 215, -34, -19, 54, 79, 41, -1, 53, -25, -48, 171, -13, 6, -26, -53, -46, 83, 21, -47, 80, 90, -70, -138, -83, 5, -89, 21, 109, 34, 65, -28, 46, -13, 107, 124, 70, -65, 5, -11, -35, 128, 23, 108, -38, 36, 105, 84, 150, 74, -174, -170, 155, 7, 51, -74, 42, 76, 30, -36, -180, 98, -35, 93, 30, 32]
4222C2M3r3n6K06k23K87j95q9K23j31Q2j12o2J43L0j69J75o2p2J58l9k14J06p
4246c9j04J33N2o3n7l4J62m0k7j23K40k03j26M15j76P8m4r9J01J5J6j35n2N5Q9
4271C4Ko1m7M4Q8Mn2j57L1Q2K9o2k2K09j86O7J4j10K14j50R1kj5j75K59k10J00
4298A9o3o5J01N5j2J94j98n3J41j53K9l8J16j4K5q0j40K41r3J3j50J54j10j4j69
4323b64K54J4MQ2j31K15j55j6R7j09O5p0K0n3q4R9J4m6L1j3N2J10k66O7Q9K2o
4350B2r7J22O2j42J03Np7k15K71j41N3K88k29j08O8J22j44J21p8k4K87m20K31
4373H0L3m3q3J10m8j29j55L60j34l4n7K13r4o0k9R2Q3k36J36o5J6R9j85K21j10
4398a9j13J76j92L1P8J35q1O2j17O4o1n5K01j43J48j73K08r4p8k2J0M2J9r4q3
$$ y = [32, 75, -18, -74, 132, -91, 196, 1, -88, 135, 4, 86, -26, -88, 55, 85, -84, 91, 29, -43, 115, 76, -138, -32, -39, -143, -10, 42, -21, -78, -112, 50, 10, -17, -140, 100, -103, -229, 186, 10, 88, 44, -55, 46, 61, 77, -58, -110, -55, 34, 36, -25, -72, -28, 60, 64, 12, -145, -114, -32, -3, -65, -87, 122, -64, 3, 17, -93, 121, -29, 62, 60, 45, -130, 129, -81, 19, -44, -109, -8, 47, 35, 229, 31, -22, 119, -34, -5, -43, 73, 59, 84, 4, -136, 105, 12, 25, -125, 29, -81, -95, -264, -10, 4, 8, 90, -41, 174, 19, 3, 100, -9, 56, -14, 6, -47, -131, -32, -18, -64, -33, -46, 6, 116, -150, -83, 6, 28, 22, -75, 47, 109, -33, 70, 75, -2, -217, 54, -87, -34, 254, 25, -83, -15, 107, -37, 84, 6, -18, 269, -151, 80, 113, 70, -13, 97, 49, -80, -235, 125, -9, -43, -100, 113, 19, -41, -70, 22, 105, -131, 5, -60, -44, 55, -130, 91, -19, -132, 44, -148, -117, -39, 96, 15, 77, -40, 24, -37, -92, 109, -34, 114, -59, 149, 55, -23, -45, -35, 7, 26, -68, -151]
4423a51N6J51k5Jj20J36k16K75j06Q0j00J35j12k5K2n1J75k23J53j0k27L03j33
4446a2j24m1O4K20n6K5j1j1p8j16l8K10j00P9J32n0p4N6j72N8R7l0j5k4m9P6o6
4473e0k6L07k51J46q7O3j21J08k44K03J1j45O8p8J73n1q3j5J14j35J7P9J2o3n3
4498a01J6J84%L7k96K31j4j41L5o7J03K19j85J24j50K7M0K89n09Q9O0k1L5k07
4522b02J81p2L6k78L51o5J03r1o4m4K33j95MJ3k4J50l9j51J25RJ69j43j32K27
4546A01j47Q4P5j45M0k5K6j06j5J29L9j68J26j11J63p6O5N6o7k06M3J15L4l6k06
4571b12J90o7Q5K6l0P5Q5p7j33Q7k4qM9K7k20J92N1N3j1n4k44K44j87q5L1J30
4597b7K3J32o1j42r0J93J35q9j21J49rjj53M6J0J08P2j5k24r3J52j38J31J24l8
$$ y = [-151, -95, 56, 31, 32, -88, 48, -168, 107, 1, 81, -19, 116, 4, -21, 1, -50, 125, -98, 55, 45, -182, 121, -12, -136, -177, -113, 107, 51, 76, 65, 54, -24, -140, -178, 32, -68, 11, 143, 93, 19, 75, -97, -39, 58, 28, 13, -11, -60, 16, -50, -76, 231, -20, 126, 39, 102, -19, 89, -155, 48, 59, -86, -18, -96, 77, 26, -57, -72, 42, -93, -76, 3, 15, -48, -101, -85, 99, 99, 136, -160, 71, 57, -84, -49, -116, -13, 206, 21, 145, -5, 22, 62, 351, -158, -69, -9, -30, 5, -202, -21, -93, -57, -335, 16, -49, 54, -37, -101, -145, 88, -107, -103, -90, -114, 36, -3, -154, -29, -20, 149, 6, -126, 101, -46, 38, 113, -32, 8, -17, 9, -97, -112, 17, 56, -112, 14, -97, 66, -10, 55, 111, 44, -162, -119, -4, 30, -6, -212, -22, -89, -4, 22, -8, 67, 152, 75, -58, 29, 5, -3, 46, 73, -147, 45, 96, 149, 138, 84, -160, 84, -103, -188, -157, -27, -4, 128, 67, -75, -165, 28, 163, 74, -47, 102, 93, 92, -61, -15, -5, 103, 175, 160, -64, -157, -5, -143, -12, 112, 74]
4622G4j88Q3k1j00J86j8q5K14k19J12k0j36K77j31j28J30j86J25k7k4N2OQJ51
4646A35p6j96K25m4N6j16M6L1q0J11n6j48J7L00j41j04J57J66k54j02J3K75k33
4669a8K16j07j67L8kJ14j00o3J65p6j5q0n0R4J02R0j55k7Q6l30L85r0L2l5l7M
4695b6J47j69N1q1j8J09N1k7p7k3L3m4OQ9N1n1j15J08q1P6K7m3r3L8K8j54K15
4722B7P3j21J34q7J33k03n4j8J68pj29O2k3J80p0j02LpJ4J66j65l7O2j20Q3j07
4748a45J78l8n1K90k66P3K6j24K29j08q3j44K00L0p3Qo4om6N8K9Kl5KJ57m7j2
4775D0r4P7Nj83J17p7Q3o5L3O3o9P4O5m5j32L7P1NM7Q2k39P3N0j43J1L7K35O2
4803B20j34p4L3n1M6LK5m0j85J83k8j60J18O9L5O1j07m5p7L8J23n8J5J14j47m8
$$ y = [74, -114, -31, -52, -152, 34, 16, -69, 145, -74, 38, 18, -118, 159, 28, -100, 30, -156, -31, -58, -82, -30, -24, -16, 135, 59, -137, 88, 44, 100, -16, 30, 61, -19, 92, 36, -112, -95, 205, 64, -40, 117, 283, 29, -73, -60, 215, -18, 198, 91, -76, -38, -40, 74, -26, -89, 76, 0, -15, -95, -145, -51, 51, 141, -14, -41, 45, -285, 100, 10, 42, 7, -30, -26, 121, -48, 3, -78, -96, 13, 64, 37, -40, -63, -30, -74, -68, 21, 72, 21, -94, 14, -67, 9, 36, -7, -100, -62, -34, -188, 27, 100, -21, 113, 26, 159, -44, -98, -116, 52, 45, -84, -22, -45, 135, 65, -37, -34, -41, -27, 139, -26, -63, -1, -121, -38, -145, 33, -5, -56, 234, -32, 41, 67, -57, 172, 64, -19, -163, 37, 67, -6, 2, -62, -68, -114, -56, -27, -25, -60, -58, 99, 52, 40, -54, 23, 28, -155, -38, -115, -32, -97, -64, -1, -70, 4, 69, 24, -108, -71, 0, 5, 52, 134, -105, -32, 18, -125, -114, -77, 158, 220, 86, 12, 45, -6, 40, 43, 68, 28, -157, 26, -2, -162, -44, 25, 60, 121, 14, -31, -108, -70, 53, -5, 10, 124, -23, -71]
4829g1K6P6j87K09L5j39J09o3P6j04O3N8J19q2j26m4j3J64L7k12Rp4J5n6K11j09
4855g3K22l25K63j58J70k44m4K24nP2k02K39k8j23K8o1n4J09J14j44k9n1L0K3
4879d7N0M0j11J64j41J46j02Q9j51L9pJ24n4j26J46j33M6M7p9P7K4J64k42Q1o9
4904b5R7or2R3j00K2K4l1j15P6N7n4J14o3J37j15n7R0J05j59LM0r3n3J74k11K76
4931A34j14J00k00J96L1k09n5J95p6K8J7p2p0N8k3K63l61J56r3O1RM3J80k01p7
4956h0R9L3K3j82J69k1r7M1Q2o3n9l2m4J14J31k6o5m0j11J64j31R7J0O2l7m5O7
4983E9q1r5Q2LM1P2j51rO2N1K1q5j17J61lJ9r5M2m8L8J24Q1n9j48n0J25M9l2q2
5012b5N1O6j86R1l0K36j43k10J90J00j69J27k24J17o5J41R2k38J41k10R1K9Ko8
$$ y = [-71, -45, 31, -156, 53, 88, -51, 58, -5, 71, -33, 30, 88, 207, 125, -1, -45, -58, 106, 143, -69, -60, -134, -119, -175, 36, -73, 149, -176, 87, -71, 99, -145, -189, 35, 30, 102, -100, 139, 111, -12, 16, -45, -99, 10, 124, -20, -49, -100, -70, -47, 3, 43, -68, 96, -45, 101, -1, 88, -63, -24, -31, 93, 39, -87, 59, -74, -28, 19, -60, 17, 41, 205, -37, 44, -25, 72, 66, -26, 67, -33, -11, 13, -18, -133, -57, 0, -54, 60, -3, 134, 19, -38, 52, 157, -2, 1, 41, -52, -105, 69, -142, 134, 20, 120, -80, 116, 147, -62, -117, 78, 2, 30, 47, -25, -95, -37, -60, 203, -158, -2, -95, -34, -25, 18, 198, -3, -80, 19, 52, 75, -107, 62, 41, -56, -15, 67, 4, -55, -87, -131, -17, 114, 88, 23, -17, -128, 36, -95, 2, 12, 74, 37, -8, 59, -22, -117, -35, -32, 9, 81, -70, -79, -17, 34, 55, -30, -147, 14, 11, 30, -65, -23, -71, -33, 91, 172, 113, -35, -85, 40, 89, 57, -25, 26, 92, -94, -3, -33, 203, 60, -150, 40, 140, -29, 98, -126, -9, -74, 67, 159, -79, 62, -148, -57, -28, -26, -94]
5036i4J59q3M3j9L0m1k1J60l2l23K96j09k3K0Q7j51qK16j95m0J66M9j51J32j8
5061E0J71k68Q4j0j8k47K85N9j05lj14n9K43r8K5L4j38p0M3J00L1J25j39K7l5
5086b7J22o3l0m2j03K49l2j4p6K31p3q7j4L1j86J06jJ4j0p2K1Q0R6j48J6r3M73
5113C68l81p2q5J33J35q5m8Q2p5l8J59r4J02j14J7n1JN3r8p2J55L3NO1m0j72J03
5140a8l8O9M5N4j19M1l0J32j15j46J76rMj77J53N8J9J1j39K3j8K00j44n4N6j27
5166i3RL5j0pR4o5O1M6j8q1j5R7M9j25M9n3K9J61k02J57m1J0k01K03NKj36J23
5194H3L3q0j95J65J03k11L6j14O4j8J73kj65K67m2j72Q1J01l4O6l8o3r2k2J42
5219F6r0P8p1P6N7j25J79r0R7k98R7Kl9P9q2L16l23J44P5k22L4j3P3J2k29J67
$$ y = [-94, 65, -18, 25, 6, 36, -5, -26, 134, 102, -221, 75, -34, -57, -37, 50, -101, -109, 107, -88, -128, 38, 87, -64, 68, 50, 221, -47, 37, 27, 9, -238, 47, 106, 1, -2, -116, -175, 68, -30, -5, 29, -109, -179, -136, -36, -5, 120, -19, 8, -27, 95, 32, 2, -40, -143, 106, 74, 60, -16, 215, 142, 55, 41, 72, -114, -8, -9, 5, -5, -77, -56, 24, 120, -28, -12, -105, 368, -13, -85, -170, -37, 98, 13, -35, 47, -28, -66, 93, -1, 101, -13, 4, -47, -46, 7, -91, -163, -8, 25, 30, 91, 51, -121, -18, -56, 13, 58, 112, -7, 34, 4, 136, 21, -125, 51, 42, 46, -131, 22, 80, 99, 110, -29, -6, -24, 176, 32, -22, 34, -93, -84, -49, -59, -66, 28, -37, 24, 70, 52, -29, -44, 53, 102, -23, 26, -27, 2, 163, -39, 118, 77, 87, -114, 89, 94, 96, -40, 83, 116, 36, -159, 6, 109, -102, -66, -180, -116, -134, 39, 37, -128, 139, 97, -75, 6, 107, 73, 139, 101, 38, -54, -76, 66, -24, 54, -17, 59, 116, -9, 170, 80, 177, -121, -24, -22, -61, 18, -64, 252, -71, 73, 148, -74, -40, -53, 20, 32, -197, -30]
5245c0L8n3J27L7j63N3l5q2j34K05J88j87Q2R1j40m1R6k4p3N0n1J21K1k3j13O0
5271B0j16M0p6J3J01o2Q6m0N6n3O3n6k9R1j46J07J56k22O6j15J09O0O7j60J12
5296G2Q3j70L9Q9j71L5Q9j7K9j51J07Pj61L02k40M8l2k0j52K27J42l37Q5J70j26
5321e3o6J08O5k86K42j30J54p6O1j7m7J01J7M3k13J28j42J29r3K05j58J03o4j72
5345a61J03K11N6j91M1Q7j22M6k14J11jM0P2j30P3l4Q0j83p8L01l37J96J17j45
5369f2R5J15m6P4k43qJ9J09q3r4P2J18l0R9qr1k02J87Q2r2k7J4J24j91L5O7j29
5396i6P7q0J03Pj05oL22l43O5K34j90K4j03O9k8oM5j4n9k1P3k9lJ04j14K23k97
5423a48J19K2J1L5n7K0L5J17k40o1J82K8k16J86k2k4Q9k15L09j37kJ5K5j92J69
$$ y = [-30, 8, -45, 82, 119, -44, 9, -26, -108, -242, -37, 151, -36, 46, 137, -3, -44, 52, 28, -45, 5, -46, 75, 96, 73, -40, 20, -96, -56, -132, -119, -18, -80, 6, -34, 22, -31, 32, -24, -53, 38, -108, -1, 155, -67, -1, -116, -7, 53, 120, -40, 72, 155, -15, 24, 113, -58, -23, 66, 49, 78, -73, 34, 41, -120, 182, -58, -10, -42, -62, -214, 13, 155, -182, -97, 73, -53, -119, -11, 54, -232, 10, -120, 34, -42, 19, 2, -45, 56, 73, 116, -97, 31, -111, 18, -75, 130, -28, 75, 11, -161, -58, 153, 209, 18, 59, 146, 24, 70, -144, -33, -34, 6, 78, -52, 21, -13, 67, -116, -194, 107, -230, -34, 83, -62, 33, 148, 102, 176, -67, -75, -56, 53, -30, -124, -52, 66, 36, 135, 127, 36, -166, 21, 103, 11, -16, -2, 122, -69, -34, 33, -96, -19, -99, 4, 11, -94, -100, 222, -121, -56, 178, -12, 12, -91, -22, -50, -56, -11, -25, -84, -105, -32, -61, -64, 40, -74, 149, -148, -29, -7, 4, 39, -18, 2, 37, 154, -86, -147, 35, 63, -153, 33, 11, -13, 76, -139, 170, 33, 31, 46, 71, -121, 48]
5448D8nn8O3r7L6r0J95N6k81J73j92J28J1j01J91k15J61K8q8J4J4j40J77p7Q7
5473C8j02K19j29R8pk27J39J19j33j22L4R8n1P6k6l29L69r2r8J97l8P7k00R3R0
5498I3j78P4jR2%q0N2j24J28N8j61l0J23J04p8j53K8J53M9r7n9J08k47J69Q7J63
5524B73l62K36j64k9N8p9j16J52j1j7J30j69l1N7j8l7O3J47j49N1J09l5j45J61
5548G5j16n3K5J73P8j25mR5k55J53K64m02J05O6k4J8o2j19J44l0L0R8j02mjr0
5574f3J39j41O9j65j5L83j71L1k4j51j18L42l8j07K7j40P3J1J62j75Q0j52K22
5597G9O4j58J9O6Qo5N0j1k8q3P1K3J48l9p7Pj09l1RP1J03j23J06o7j01K3J20O3
5625A38j57j2N1j5J24j77J66n0r1p4L6JO0J31k28J29q5K58k02K4J62l28J67r4
$$ y = [48, 43, -15, 48, -49, -13, -103, 92, 148, -133, 40, -152, -24, -13, -114, 77, -138, 23, 51, -37, -23, -9, -149, 28, -49, 38, -64, 155, 26, 124, 117, -110, 29, 148, 15, -107, -73, 25, -26, 50, 24, -305, 64, -28, -126, 71, 33, 110, -90, 3, 93, -85, -11, -12, 80, 80, 0, 52, -72, 56, 114, -47, -77, 46, 150, 72, -81, -53, 100, 149, 52, -7, 101, -146, 23, 110, 273, -89, 147, -17, -46, 12, -67, -183, -31, -42, -59, 71, -98, -129, -72, -90, -127, -64, 83, -66, -15, 94, 59, -86, 75, -41, -94, -69, 104, 182, 57, 53, 148, -107, 46, 310, -92, 13, 79, 55, 73, 11, -108, 36, 6, 36, 134, 32, 28, 27, -63, 76, -65, 4, -161, -176, 207, 36, 67, 43, -108, -226, 116, 78, -29, -2, -142, -69, -58, 104, -71, 9, -143, 79, 143, -15, 4, 70, 78, 13, 63, 52, 24, -59, 12, 35, 183, 144, 67, 74, -35, -66, -57, 14, 117, -6, 100, 33, -68, -45, 75, 138, -19, -31, 20, 5, 129, -48, 118, 68, -23, -97, -61, -60, 0, 131, -97, 32, -53, 205, 3, 27, 189, -139, 28, -66]
5649f6K75j53k56J18l7J5J16K12l80J07L5J14n0J83k40J5M0j84J2PK15j22J89
5672A65k7j59J4O2k11PR0M1j40M5K12j46J86q6j75JM3O2oN2j16J73k04K63l28
5697a82Q7J09l34L06L7j0p7K05j92Nj38J54O2p5nM3r1J35k8k30K04R9l9k1N8Q4
5723A66j46K21k61J23o5q7m2QN3O1m1N5j16Q6J37j05p4M1KJ11j29j61J98p6J50
5748A09j50J01j59R2L9o8n8K50j13k04N0J03n3K6o4K31j50J15jj06p2K6k8J92
5772A08j8k46J81j55J52kJ55j04j94J83J1J01j42Mj05k2K42r6j24J17N9o8j25
5795h8J70k6k8K8jK9L7l9r3m8J32m9j73n3K06M2Rj35J64p2l7k2K00l23J91N3J07
5822A81j63J7k6m5J47k25R8%j6Q2N8j77L6Q6j17J26p5l6O1j5m5j2M8MlRm3q0K02
$$ y = [-66, 209, 56, -200, -82, -119, -104, 12, 224, -156, -49, -14, 100, 50, 233, -7, 8, 48, -136, -124, -117, 98, -24, 165, 138, -21, -7, 55, -156, -149, -59, -18, -158, -113, 99, -47, 139, 53, -122, -121, -78, -16, -22, 30, -86, 87, -117, 146, -182, -95, 14, -320, -14, 23, 13, -64, 141, -51, -46, -184, -30, 32, -43, -48, -5, -96, 39, 11, -219, -15, 84, 45, 24, 82, 166, 20, 241, -20, 103, 38, -49, -91, -83, -30, 31, -10, 45, -71, 15, 152, 47, -27, 14, 16, 127, -2, -163, 35, -41, 109, -41, 60, -99, -7, 32, -36, -94, 156, 43, -161, -111, -8, -61, -35, -99, 132, -18, 97, 96, -10, -82, -56, -84, 108, 90, -156, 25, -130, 22, 20, 175, 71, -123, 60, 71, 172, 30, 34, -71, -93, 149, 53, -71, 46, 105, 37, -88, 82, 56, 28, 56, 55, 84, 121, 82, -11, -59, 73, 24, -149, -202, 4, 46, 55, -80, 84, 12, -25, -47, 153, -170, 21, 74, 181, 18, 35, 9, -36, 111, -114, -16, -16, -32, 50, 108, -69, -33, 53, -64, 62, -13, -49, 12, -3, -48, -60, -12, -8, -11, -2, -45, -125, 77]
5851G7%Pj39J6J25q7j35R9P6l1Q1n3P6k06P9R0m5J09k4j89J40J84l28Q8J0K4L4
$$ y = [77, 77, 84, -55, -39, 86, -1, -136, -37, 39, 8, 89, 36, 112, -94, -15, 75, 30, 139, 115, -74, 66, 250, -78, 10, 20, 44, 78]
$$ [...]
8191e6
##END NTUPLES=NMR FID
##END=
