##TITLE=1H_LR-758-2-CR3
 CDCl3
 8 sc, 
 5.3.2024
##JCAMPDX= 6.0         $$ Bruker NMR JCAMP-DX V2.0
##DATA TYPE= NMR FID
##DATA CLASS= NTUPLES
##ORIGIN= UXNMR, Bruker Analytische Messtechnik GmbH
##OWNER= root
$$ XWIN-NMR		Version 3.5
$$ Tue Mar  5 13:50:18 2024 Russian Standard Time (UT+4h)  she@DPX200
##.OBSERVE FREQUENCY= 200.1313
##.OBSERVE NUCLEUS= ^1H
##.DELAY= (6, 6)
##.ACQUISITION MODE= SIMULTANEOUS
##.ACQUISITION SCHEME= undefined
##.AVERAGES= 8
##.DIGITISER RES= 18
##SPECTROMETER/DATA SYSTEM= spect
##.PULSE SEQUENCE= zg30
##.SOLVENT NAME= CDCl3
##.SHIFT REFERENCE= (INTERNAL, CDCl3, 0, 15.7039)
##AUDIT TRAIL= $$ (NUMBER, WHEN, WHO, WHERE, WHAT)
$$ ##TITLE= Audit trail, XWIN-NMR		Version 3.5
$$ ##JCAMPDX= 5.01
$$ ##ORIGIN= Bruker BioSpin GmbH
$$ ##OWNER= she
$$ F:/spectra/data/she/nmr/H-F/1/audita.txt
$$ ##AUDIT TRAIL=  $$ (NUMBER, WHEN, WHO, WHERE, WHAT)
(   1,<2024-03-05 13:49:05.65 +0400>,<she>,<DPX200>,
      <created by zg, POWCHK disabled, PULCHK disabled
       configuration hash MD5:
       00 E9 B6 7A A2 85 ED C7 34 08 36 98 17 FE 4E 26
       data hash MD5: 16K
       FA 88 B0 D9 67 28 E5 69 88 08 09 E5 D1 26 04 F9>)
$$ ##END=
$$ 
$$ hash MD5
$$ 68 EF A4 85 86 5F F2 36 0E 65 36 62 A7 CA E1 90
##$RELAX= 
##$RELAX= 
##$RELAX= 
##$RELAX= 
##$RELAX= 
##$RELAX= 
$$ Bruker specific parameters
$$ --------------------------
##$DU= <F:/spectra>
##$EXPNO= 1
##$NAME= <H-F>
##$PROCNO= 1
##$TYPE= <nmr>
##$USER= <she>
##$AMP= (0..31)
100 100 100 100 100 100 100 100 100 100 100 100 100 100 100 100 100 100 
100 100 100 100 100 100 100 100 100 100 100 100 100 100 
##$AQSEQ= 0
##$AQ_mod= 1
##$AUNM= <au_zg>
##$AUTOPOS= <>
##$BF1= 200.13
##$BF2= 200.13
##$BF3= 200.13
##$BF4= 200.13
##$BF5= 200.13
##$BF6= 200.13
##$BF7= 200.13
##$BF8= 200.13
##$BYTORDA= 1
##$CFDGTYP= 0
##$CFRGTYP= 5
##$CHEMSTR= <none>
##$CNST= (0..31)
1 1 145 1 1 1 1 1 1 1 1 1 1 1 1 1 1 1 1 1 1 1 1 1 1 1 1 1 1 1 1 1 
##$CPDPRG= <>
##$CPDPRG1= <>
##$CPDPRG2= <>
##$CPDPRG3= <>
##$CPDPRG4= <mlev>
##$CPDPRG5= <mlev>
##$CPDPRG6= <mlev>
##$CPDPRG7= <mlev>
##$CPDPRG8= <mlev>
##$CPDPRGB= <>
##$CPDPRGT= <>
##$D= (0..31)
0 1.2 0 0 0 0 0 0 0 0.06 0 0.03 0 0 0 0 0.0002 0 0 0 0 0 0 0 0 0 0 0 0 
0 0 0 
##$DATE= 1709632145
##$DBL= (0..7)
120 120 120 120 120 120 120 120 
##$DBP= (0..7)
150 150 150 150 150 150 150 150 
##$DBP07= 0
##$DBPNAM0= <>
##$DBPNAM1= <>
##$DBPNAM2= <>
##$DBPNAM3= <>
##$DBPNAM4= <>
##$DBPNAM5= <>
##$DBPNAM6= <>
##$DBPNAM7= <>
##$DBPOAL= (0..7)
0.5 0.5 0.5 0.5 0.5 0.5 0.5 0.5 
##$DBPOFFS= (0..7)
0 0 0 0 0 0 0 0 
##$DE= 6
##$DECBNUC= <off>
##$DECIM= 32
##$DECNUC= <off>
##$DECSTAT= 4
##$DIGMOD= 1
##$DIGTYP= 9
##$DL= (0..7)
0 120 120 120 120 120 120 120 
##$DP= (0..7)
150 150 150 150 150 150 150 150 
##$DP07= 0
##$DPNAME0= <>
##$DPNAME1= <>
##$DPNAME2= <>
##$DPNAME3= <>
##$DPNAME4= <>
##$DPNAME5= <>
##$DPNAME6= <>
##$DPNAME7= <>
##$DPOAL= (0..7)
0.5 0.5 0.5 0.5 0.5 0.5 0.5 0.5 
##$DPOFFS= (0..7)
0 0 0 0 0 0 0 0 
##$DQDMODE= 0
##$DR= 18
##$DS= 0
##$DSLIST= <SSSSSSSSSSSSSSS>
$$ [...]
##$SUBNAM2= <"">
##$SUBNAM3= <"">
##$SUBNAM4= <"">
##$SUBNAM5= <"">
##$SUBNAM6= <"">
##$SUBNAM7= <"">
##$SUBNAM8= <"">
##$SUBNAM9= <"">
##$SW= 18.0517328524113
##$SWIBOX= (0..15)
0 0 2 0 0 0 0 0 0 0 0 0 0 0 0 0 
##$SW_h= 3612.71676300578
##$TD= 16384
##$TD0= 1
##$TE= 0
##$TE2= 300
##$TE3= 300
##$TEG= 300
##$TL= (0..7)
0 120 120 120 120 120 120 120 
##$TP= (0..7)
150 150 150 150 150 150 150 150 
##$TP07= 0
##$TPNAME0= <>
##$TPNAME1= <>
##$TPNAME2= <>
##$TPNAME3= <>
##$TPNAME4= <>
##$TPNAME5= <>
##$TPNAME6= <>
##$TPNAME7= <>
##$TPOAL= (0..7)
0.5 0.5 0.5 0.5 0.5 0.5 0.5 0.5 
##$TPOFFS= (0..7)
0 0 0 0 0 0 0 0 
##$TUNHIN= 0
##$TUNHOUT= 0
##$TUNXOUT= 0
##$USERA1= <user>
##$USERA2= <user>
##$USERA3= <user>
##$USERA4= <user>
##$USERA5= <user>
##$V9= 5
##$VALIST= <valist>
##$VCLIST= <CCCCCCCCCCCCCCC>
##$VD= 0
##$VDLIST= <DDDDDDDDDDDDDDD>
##$VPLIST= <PPPPPPPPPPPPPPP>
##$VTLIST= <TTTTTTTTTTTTTTT>
##$WBST= 1024
##$WBSW= 4
##$XGAIN= (0..3)
0 0 0 0 
##$XL= 0
##$YL= 0
##$YMAX_a= 543575
##$YMIN_a= -514164
##$ZGOPTNS= <>
##$ZL1= 120
##$ZL2= 120
##$ZL3= 120
##$ZL4= 120
##$ABSF1= 10
##$ABSF2= 0
##$ABSG= 5
##$ABSL= 3
##$ALPHA= 0
##$AQORDER= 0
##$ASSFAC= 0
##$ASSFACI= 0
##$ASSFACX= 0
##$ASSWID= 0
##$AUNMP= <proc_1d>
##$AZFE= 0.1
##$AZFW= 0.1
##$BCFW= 1
##$BC_mod= 2
##$BYTORDP= 1
##$COROFFS= 0
##$CY= 11.3945322036743
##$DATMOD= 1
##$DC= 2
##$DFILT= <>
##$DTYPP= 0
##$F1P= 15.7292609196834
##$F2P= 12.9074282941183
##$FCOR= 0.5
##$FTSIZE= 0
##$FT_mod= 4
##$GAMMA= 1
##$GB= 0.15
##$INTBC= 1
##$INTSCL= 1
##$ISEN= 128
##$LB= 0.24
##$LEV0= 0
##$LPBIN= 0
##$MAXI= 10000
##$MC2= 0
##$MEAN= 0
##$ME_mod= 0
##$MI= 1.114404
##$NCOEF= 0
##$NC_proc= 0
##$NLEV= 6
##$NOISF1= 3.799351
##$NOISF2= 2.8
##$NSP= 1
##$NTH_PI= 0
##$NZP= 0
##$OFFSET= 15.70392
##$PC= 1
##$PHC0= -24944.76
##$PHC1= 12.65264
##$PH_mod= 1
##$PKNL= yes
##$PPARMOD= 0
##$PSCAL= 0
##$PSIGN= 0
##$REVERSE= no
##$SF= 200.130013532006
##$SI= 16384
##$SIGF1= 3
##$SIGF2= 2
##$SINO= 400
##$SIOLD= 16384
##$SREGLST= <1H.CDCl3>
##$SSB= 0
##$STSI= 0
##$STSR= 0
##$SW_p= 3612.71676300578
##$SYMM= 0
##$S_DEV= 0
##$TDeff= 0
##$TDoff= 0
##$TI= <>
##$TILT= no
##$TM1= 0
##$TM2= 0
##$TOPLEV= 0
##$USERP1= <user>
##$USERP2= <user>
##$USERP3= <user>
##$USERP4= <user>
##$USERP5= <user>
##$WDW= 1
##$XDIM= 8192
##$YMAX_p= 0
##$YMIN_p= 0
$$ End of Bruker specific parameters
$$ ---------------------------------
##NTUPLES= NMR FID
##VAR_NAME=  TIME,          FID/REAL,        FID/IMAG
##SYMBOL=    X,             R,               I
##VAR_TYPE=  INDEPENDENT,   DEPENDENT,       DEPENDENT
##VAR_FORM=  AFFN,          ASDF,            ASDF
##VAR_DIM=   8192,          8192,            8192
##UNITS=     SECONDS,       ARBITRARY UNITS, ARBITRARY UNITS
##FACTOR=    0.0002768,     1,               1
##FIRST=     0,             0,               0
##LAST=      2.2672688,     0,               0
##MIN=       0,             -514164,         0
##MAX=       2.2672688,     543575,          0
$$ Real data points
##PAGE= N=1
##DATA TABLE= (X++(R..R)), XYDATA
$$ [...]
1873a69o64R85j99j054J117R47j503K61J031r38J8J136r5j083O51n8j119L10O74
1892B48m70j69M94m21n50P60J39l29J82K04j44K06J83o5M9pp6J80j92o69M82K14
1914B49m82k26Q96p48p42R59R4n42K33O96k45m96Q92K00j214R22M68r39k56J071
1934G90q45p10R06k06q93N58O94p97j77P05J65r62L22J104o35r9R00l56m58m5
1954c9M73l11k54P47m34q38R1M16n17k4R72m7p06J50O43m28n03J701K1j147K23
1975A89P15j284m42J492qj324O67M74j451j38J470j87q16J146J57j560L06Q84
1993B90k54j23P31M17j209N4M87n59m74Q11L21o46n37N07j62o33Q37R30r35j35
2013b82R58m97r68R47J155j375K12O33o74j377J423M63j302M86Q61j043r36J259
$$ y = [-169, -833, 152, -47, -1101, 16, 963, -540, -279, 752, -186, -168, 968, 873, -210, 441, 383, -736, -426, 248, -222, -391, 103, -318, -868, -108, 31, -298, -116, 88, -56, 150, 333, 268, 317, 310, 234, 414, 222, -447, 35, 249, -233, -459, 437, -311, -1053, -94, 0, -542, -309, 387, 142, -354, 538, 738, -476, 446, 914, -25, -281, 790, -55, -765, 141, -65, -958, -400, 294, -503, -680, 25, 190, -772, -450, 654, 19, -80, 820, 464, 6, -39, 434, 123, -131, 616, 182, -656, -565, -149, -666, -690, 282, 235, -471, -321, 322, -106, -609, 1092, 1113, -34, 189, 904, -380, -822, 670, 662, -662, 5, 479, -972, -1110, 360, 173, -643, 503, 660, -900, -594, 290, 36, -87, 644, 1061, -148, -94, 393, -166, -640, 171, 492, -154, -691, -184, -346, -979, -142, 788, -147, -282, 676, 179, -789, 158, 1313, -62, 150, 783, 109, -1268, 155, 618, -684, -198, 663, -380, -1316, -57]
2031e7K11q80N79Q44p42j5P14p09o38J006N12p17j22O58r02l29M06K30j87q4L78
2052A56m97n61l0R47j09J31J094n25j255R8Q74n53K3J382m56j322L25L81j350
2071a247M74J649m36r61N48j82j100P81R95l06l1Q12n75j173O51K72m5N61K70
2090I57m82r12k71J5K83M35J65L70m36q23J80K90l10J014J040p83j063N65k95
2109f1q44J205R32j136o9N69j355n83J379K15o21P59M86j327m54P67R6k11R47
2128F94J36m10k31j08m71R3N22J88J91l60o95o6j47j70P90N05m04M1n0p37k6R92
2150B77k4P1P88l33j139j25N28l65J30J029m33j348M55l9m87N47Q94L4m55K15
2170B20K0j113N97N67K71j78M04o27m74l63N63j43M07j4j31l91k91K38J21Q8M59
$$ y = [-57, 154, -726, -147, 697, -45, -60, 654, -55, -693, 313, 825, 108, -14, 644, -258, -587, -181, 49, -138, -222, 156, -341, -902, -932, 15, -94, 37, 1131, 606, -649, -551, 323, -230, -207, 1175, 719, -603, -278, 103, -1247, -773, 876, 440, -521, 27, -155, -1255, -474, 521, 215, 184, 996, 421, -752, -101, 171, 126, 687, 957, 475, -437, -708, -693, -410, 25, 190, 560, 124, -699, -519, -229, -539, 475, 1515, 732, -331, 234, -61, -905, 300, 1232, 96, 27, 596, -759, -1342, 37, 252, -369, 390, 876, -451, -905, -138, -42, -253, 694, 830, 420, 189, 81, -390, -297, 225, 413, 604, 244, -451, -517, -664, -834, -44, 461, 57, 98, 48, -689, -715, 277, 253, 324, 1112, 779, -360, -485, 43, -322, -192, 837, 404, -944, -489, -528, -1015, -468, 426, 460, 5, 220, 240, -873, -276, 291, 562, 384, 788, 161, -313, -676, -113, -256, 151, 137, 6, -385, -676, -438, -317, -229, 230]
2191B30M76q76j38P00q9k69M49J61o43l43O66l65n17P65J38o63L17j1l02l37R34
2212B83m84N2M42J56k82j87K41P8k70NL69k59m90J42L21m23QM99l16j21J91k0
2234f5m49N34M37n35l6O20j95p00P86K21o11n5O52n05p07O12j45m34K46J98k9
2255a60p1J55k14K26m2L19P4K80l84k50K44k34M00J02o52P8L43m64m31N99O7n36
2277e51N76K37p78J86R60n61l61Q81k00m79K23L38p70M47L72q48p4O50n30l98
2297f80O90K58n59K32L21j63l99L64J96N7J03m61m1M22m9j99K03k28m94O32l25
2318a20k96M39K39r43K79N57n74K39R18o77j26M71J21r72N33P67q04l55N50q8
2338A58l00J95L5n43L55K26n90L44L80l16j31M42j24j71J12K49j10n9R7o19N15
$$ y = [230, 706, -170, -308, 392, 303, 34, 483, 644, 1, -342, 324, -41, -558, 207, 345, -318, -1, -12, -314, -651, 283, -201, -149, 293, 449, 167, -20, 221, 299, 29, 34, 403, 144, -346, -204, 117, -306, -298, 201, -115, -236, -45, -65, -514, 20, 457, -78, -114, 506, 311, -389, 397, 618, 7, -48, 604, 99, -608, 4, -141, -575, -329, -131, -160, -231, -76, -290, -64, -106, 213, 287, 567, 183, -67, 177, -57, 343, 445, -207, -129, 214, -250, -681, -82, -15, -551, 25, 262, -516, -330, 630, 69, -292, 589, 389, -90, 133, 471, -299, 148, 520, -328, -402, 248, -282, -680, 10, 268, -291, -59, 262, 99, -300, 64, 260, 317, 420, -41, -82, 340, 291, 92, 295, 67, -427, 205, -120, -416, 23, 262, -681, -402, 155, -419, -180, 738, 61, -65, 406, 527, -445, 88, 855, 51, -304, 246, 158, -142, 53, 88, -455, -100, 126, -464, -120, 260, -56, -187, 255, 131, -40, 72, 321, 211, 152, 249, -370, 145]
2359A45L4m20K42m6n58M92K35m93m2M36l1j92L77J99m73K57M96o95K77K80m50
2380G0n43P23M4p57L71J72o08q5Q29j63n17M95O0l11L28N19p59K67L14k62l29
2401a42M05o9m80J69j49J05oj75K26Nl92N16K32j73l56O73l38k40L87O36p17l22
2423b05M63k33m71P03j18o13J91L65o29j46J021l56l57L87M48o31J07P32n70l53
2443b65N91L57n52k90N64m07m12K23J48m20L1M60l20l31O49R4j87K69K78l84k17
2464a21N64p9p48J50N37k11m65N34J48j035K33O14j88m36Q82l21o88L55O61l52
2484C4m4P66l93o00N24J77n98P4Q67m75j219J218m6p93K34R90o54q14P05M0m36
2505d43M37O27l42o67Q50Q2q81J57P05o76m05J104m18r04N08N43n50k78Q71j87
$$ y = [145, 179, -241, 1, -45, -603, -111, 124, -369, -411, 25, -6, -198, 179, 378, -95, 162, 658, -37, 240, 520, 70, -473, 250, 294, -463, -92, 80, -528, -613, 216, 53, -464, 31, 91, -220, 108, 627, -132, 135, 449, 187, -142, 263, 194, -286, -117, -266, -161, -167, -342, -116, -111, -503, 13, 245, 72, -284, 389, 51, -189, 198, 834, 117, -205, 258, 25, -446, 257, 139, -474, -283, 82, -547, -693, 328, -28, -385, 2, 450, -181, -74, 658, 88, -265, 326, 683, 131, -159, 405, -2, -414, -191, -43, -463, -432, 28, -292, -623, 26, 120, -67, 202, 480, 96, -121, 443, 364, -384, -234, 303, 92, -373, 161, 309, -726, -493, 121, -67, -503, 379, 58, -630, -275, 386, 34, -10, 756, 363, -237, 287, 464, -134, -60, 807, 332, -887, 331, 285, -508, -274, 716, 62, -752, -47, -7, -443, -6, 621, 279, -388, 462, 544, -337, -180, 525, -151, -556, 548, 130, -774, -266, 277, -273, -551, 320, 133]
2525A33n61N10M63q50j23R96J96j211L33P80o74m42J117m80r39N97O86j113P0
2544e12R46o30n44Q18L84j127L17J308p79o45P87K73j155M74O16n70n55Q18K94
2563E18j091M14N09q28q2O86O1n42K63P20p52k54R55m4j134R58L67j008n00J418
2583F34o58o52P82O64j125m13J109l88q78J187M16j302J37J312p38o13J362l61
2601D75r09J45O73n78l71R21k44n09L9O80o29l72Q38R1o43J77J219j062l35N99
2621B05M58j110L56R36r32o82J137J94j138L37R95j313n3R26n09n31J007L27q52
2640b42L31P75p40p43J195o2r10K01R74r40k80L66J41o97J46P89k76m11N66n1
2660A32m81P6O90k2n48K95O63j095k2J046o16p34Q52L23j234K31J052r51m96J114
$$ y = [133, -428, 82, 545, -305, -428, 568, 764, -447, -114, 666, -8, -450, 667, 187, -752, -155, 531, -582, -512, 434, -196, -740, 78, 462, -665, -348, 960, 181, -464, 323, 596, -559, -85, 531, -39, -594, 224, 518, -573, -159, 350, -478, -560, 126, 187, -355, -92, 628, -124, -378, 577, 533, -601, 357, 724, -284, -784, 634, -24, -676, 106, 770, -355, -768, 341, -47, -925, 262, 678, -624, -487, 825, 87, -526, 836, 475, -434, -289, 384, -194, -565, 356, 112, -397, -358, 322, -307, -679, 159, 250, -393, -216, 1003, -59, -394, 205, 663, -447, -91, 845, -87, -769, 368, 562, -576, -239, 756, -557, -610, 316, -193, -724, 283, 610, -242, 89, 864, 124, -619, 576, 514, -396, -195, 779, -161, -441, -75, 66, -631, -485, 304, 28, -383, 183, 132, -349, -273, 417, 395, -153, 142, 805, -290, -312, 734, 118, -616, 236, 559, -675, -444, 608, -343, -839, 275]
2680B75L3j029O21O44q64J77R60p36k96M80P6o28J94N00n51kO7J84n61J22M80
2701A46m10K4J36M83m06j43K70L33p00JJ043n28m68M58%q00N37N28p17k00O53
2722B40m27m56P85J33p79M61M77o24J0Q22k68n86N33R5o21J57L47j59n18L48N2
2743B2k10p7K54Q2k61l7K19K91j71JM17o97j90Q16k50n97O54j99l83O7M05l26
2765a70j86O23j86n25M00J01m73K08K75L9k71M87n5m59O55k99k66P1l2n4N5nj16
2788a83q0K24q8j60K39j06j3M07j81%L1J49m87N82J28o66L86K16n59k01L63j50
2810a49m69N93K90o86j6N89k04K5L24k45k13L23N3j72J08k5N0m04Q3J66qj20j63
2833b70M1M39m62J80J65k02k1L71k12J54OJ57k48j06L67n48p9O07l37m33O74l10
$$ y = [275, 308, -721, -100, 544, -320, -143, 817, 81, -215, 265, 341, -287, -93, 407, -144, -146, -79, 105, -456, -334, 146, -264, -240, -104, 379, -27, -170, 100, 433, -267, -266, 777, 249, -219, 239, 239, -561, -24, 504, -213, -413, 240, -187, -643, 142, 275, -504, -43, 434, -190, -180, 642, 374, -212, 321, 416, -205, -48, 299, 140, -378, -30, 22, -188, -265, -11, 71, -190, -227, -8, 283, 112, 113, 530, -167, -357, 459, 209, -388, 266, 67, -316, -249, 156, -170, -356, 267, 81, -444, -44, 57, -416, -208, 67, 106, -165, 322, 267, -192, 463, 164, -102, -31, -63, -117, -62, -67, -183, -263, -39, -127, -287, -48, -154, -167, 240, 59, 59, 90, 239, -248, 334, 462, -204, 182, 398, -161, -362, 1, -149, -618, -25, 265, -421, -437, 152, -52, -27, 297, 52, -161, 162, 215, 43, 151, 126, 176, -228, -145, 21, 13, -107, -270, -229, 210, -252, -72, 93, -109, -130, 241, 29, 183, 189, 346, 98, -8, 359, -189, -268, 339, 2, -431, 243, -67]
2855f7m24L96N5j72J5M32j15j65M44m10o5K98J26n39M20o8l36M35j71l38J17q8
2877b20k13M07J6l61J13L17q1j63K55k9l50O17J18o93P9M85k96l37N42k24k07
2898b25J13K04k34J6J40j72J8L10k00k61L15K88l06J54J04k62k18L44k45L14K2
2919B19j03j42j66L01m28L14Q7j67M0J06j11J64N9l13K43K67k84k14J31p9k99
2940c75M98j87k55J68M02m31k28M19k1k08K83J12l57k2M49l64J9M26j23j46J19
2961A78O5j39l97J83J94l00L31K06o03J5j35M34O2j96O10n17o2LM06j81k57J32
2983C2L8j22K7J72o84N79Pl73j18P37m3m72mO14l75JM52j11l77o9L03j17o9J03
3007A31k04l51J59K91k84n7N60l1o65M08M39n72R8O22j90l48M2N01p93Q0O16n22
$$ y = [-67, -491, -95, -40, -212, -197, 235, 120, -45, 399, -11, -76, 222, 348, -191, 229, 161, -175, 260, 89, -249, -132, -220, -433, -26, -10, -371, -258, 59, -22, -185, 70, 41, -309, 308, 426, -267, -188, 297, 1, -336, 206, -18, -225, -112, 92, -142, -126, 14, -158, -140, 170, -30, -291, 24, 312, 6, 160, 264, 2, -216, 128, -117, 197, 219, 116, -26, -192, 109, -319, -5, 82, -85, -45, 61, -50, 114, 173, -140, 103, 370, 86, -128, 3, -76, -375, 123, -64, -319, -151, 251, -180, -408, 11, -10, -218, 65, 177, -180, -202, 247, -117, -98, 328, 205, 59, 178, 243, 104, -293, -110, 84, -216, 115, 321, -282, -267, -402, 32, 94, -102, 508, -9, -71, -68, 338, 157, -100, 32, 70, -52, -25, 147, -537, 42, 49, -324, -442, 295, 252, -220, -224, 390, 15, 16, 468, 357, -20, -89, 214, 97, 28, 131, -73, -424, -265, 26, -258, -315, 245, 214, -451, -43, 396, -176, -78, 544, 354, 6, 48, 549, -244, -164, 452, -70]
3029g0j94M14J53o89o5O64k42k42L67qj90j53O34l26p05J258q3o83K05M37l71
3050A11n93O90Nm03K25M08p75k26M02M05o81O61L63q61l8N82q1n29N85K60m02
3071A08k82M25k97n25O17J84l09k49N95j16q38O88M26q38L61N51l14o80L36P86
3091F29o33J99N32o27m75J64M08n15o3Q53l44n59P94k00o59M08P00p08p0M56j60
3112A30k50J57M39n79o3L71J17p83K45L05o4l42M35J77o57J26M08m81J02O74j98
3133B69l95K52K64n66M8N34n0n84K00K80o66r2J014l77n29P24r5n47M45L9j65
3154Ck87O90J53p70n2L52j72j98L34M41k54m58L61l95m86P40L15n09l7N59l48
3175a8m62N50K80l64J38N41q89J4K76J64n88K23L80o79Q9K91O2m66K04L75p2j17
$$ y = [-70, -264, 150, 303, -386, -451, 213, -29, -271, 96, 88, -102, -255, 379, 53, -652, 606, 523, -160, 45, 482, 111, -482, 208, 213, -190, 35, 443, -332, -558, -156, 249, -432, 229, 592, -269, -307, 275, 194, -335, 250, 510, 108, -174, 251, -46, -571, 46, 230, -79, -328, 267, 151, -687, 1, 427, -411, -50, 501, 187, -493, -157, 629, -4, 195, 727, 100, -375, -211, 197, -318, -381, 472, 128, -431, 363, 163, -496, -88, 612, -96, -166, 290, 130, -120, 37, 476, -103, -166, 205, 322, -461, -216, 89, 25, -317, 118, 295, -362, -236, 172, -309, -207, 467, 269, -126, 126, 390, -176, -128, 406, 356, -228, -28, 252, -414, -506, 508, 131, -398, 326, 231, -316, 129, 168, 3, -284, 406, 559, -211, -263, 89, -83, -281, 53, 494, 240, -218, 143, -252, -738, 2, 317, -192, -229, 330, -18, -480, 70, 350, -14, 124, 665, -224, -210, 66, 230, -358, -135, 245, -434, -345, -54, 8, -458, -254, 121, 49, -68]
3197f8J98j28j79M29j43k00J85j66R9o3L8m4r7k5M2L07m78m9O70o14j88O10k57
3220a21m6L78L20p10J94L75k21p50R38k59k65Q3M97m16l79M43J49l41L9M05o67
3241c54M57J70l18J22j65R3Q3r9K15j99j00j40J61Mj60L03M5l67q2K89k9j02K03
3264C0J20j96j42M20k56j86L86P0l47J49j1k27J82k5j3j74l7J00k2R7K55Ll52
3287a76L51k07J41OK14k11N6j29p6j23j66L79j02m6j23L1K10j34M2k47J30K37
3309E7J07j83pL20l62kNL94n42K49K92k49k17M12l76j13q6L96m6k31K65J6k69
3332a70K22O1p3J67l29K95k13n3j18J27q6M5J93Q9l02K12l70K06L6J12m45M40
3354D6L0p7j55M59j52k6k10M55o29N7J58m4J22j5J08l11L84m36J23l8K23P8K1
$$ y = [-68, 130, 2, -177, 252, 109, -91, 94, -72, 27, -36, 2, -42, -139, -164, -122, 185, -293, -342, 328, -286, -474, 136, -121, -167, 211, 531, -179, 15, 390, 169, -581, 357, 98, -167, -84, 413, -3, -382, 61, 210, -131, -92, 313, -354, 103, 273, -45, 77, -88, 5, 88, -11, 204, 5, -95, -235, -74, -70, -230, 73, 118, -249, -331, -42, -71, -173, 30, 150, -46, -188, 232, -24, -210, 176, 246, -101, 48, 37, -190, -8, -33, -46, -220, -257, -157, -179, -82, 173, 176, -176, 175, -32, 109, 115, 329, 118, 174, 45, -31, -154, -320, 59, -43, -89, -212, -181, 29, -105, -63, -310, -180, 57, 164, -19, -26, 294, -68, -70, -65, 329, -213, 36, 328, 79, -138, 274, -102, -215, -301, 95, 49, -182, 83, 99, -170, 52, 113, 40, 207, -122, 173, -40, -93, -211, -84, -170, -125, 68, 157, -145, 67, -303, -97, -61, 51, -394, 46, 76, -1, -156, 303, 151, 125, -85, 370, -259, -202, -44, -88, 34, 19, 127, -184, 200, -236, -113, -151, 72, 150, 171]
3377A71k66J50k02J28M7j11J88j41p5O1k23L28l64L09Rj09j43K11j11K54j16%
3399eL02k99P7J29n5k27K07j3j82n1J82k46P0J65O3j82J3m3Q3o3q1P2L18p1k29
3424f6K42J17l25J38P2rK2j38j53%JK2j13j8M80l53N9J20j73j85O28j32k00P0
3448A06J60l33r7L47j82l62K65O1j16J22J21k51q5K22K38l57J77o2J79k07pl5
3470i6p2M45j03l1j25j89J33J30k71K51k45k38M51j01k3N1M43o18k83M47P3j74
3492a45M00k11K5l4P2j23n14M16M76m64lR7k08j56J19O25n88L98p7j78O6J6L70
3515C79m04lJ00j0J0N2m4J10l74J94o6n6M3J8J7L6J28q2m41O15p5j79j56N15m09
3540h2N5K02j77P7l09M31l5k88L12o3l71J76L23j88l42L73J07l00K00J70n40L22
$$ y = [171, -95, 55, -147, -19, 28, -83, 105, -36, -111, -50, -273, 55, -309, 0, 9, -100, -243, -32, -143, 111, -5, -5, 297, -2, 75, 204, 149, -78, 129, 116, -66, -117, 65, -181, -111, 54, 117, -65, -52, -95, -12, -75, -156, -84, 234, 163, -66, 176, 293, -32, 106, 178, 169, 191, 53, -100, -100, -99, -77, -190, -208, 272, -81, -22, 98, -75, -260, 368, 236, 36, 106, 266, -67, -164, 183, 1, -361, -96, -35, -151, -29, 92, -159, -244, -22, 216, -141, 36, -26, 153, -54, -61, -96, -168, 277, 174, 143, 18, -171, -38, 92, -179, 72, -173, -411, 40, -61, -84, -33, 410, -208, -491, -44, 29, -145, 255, 44, 69, 35, 107, -16, -530, -114, 362, -102, -105, -8, -216, -372, -253, 372, -216, 182, 105, -73, -7, 9, 379, -25, -28, 72, 62, 72, 124, 80, 190, -184, 10, -56, -112, -69, -51, -34, 2, 130, 48, -393, 222, 147, -32, -188, 327, -82, -27, 175, -2, 75, -234, 197, 162, -126, 186, 123, -248, -72, 251, 63, -279, 94, 201, -99, 101, 271, -269, 53]
3562E3k59M07l61R7K89m79J00P2o9j34K89L9l8N7J21j77k10J64L58l45n2K52j49
3585B5l08K63J66k33N0K13k85l12M45K0j57N5K75l54J29J50j15k91M21K20k88
3606H9k11K06j46j82J78J41j39l20O74l05q5J54J32k14l32L42j1M3o2M5q5R8K20
3629B30j54Ok71j03J59N5N8J41k45j71K81k01q1L91J1k20M7n1J60j34M7P6k33
3652b02M48K0l57J18N2m02J35J33n6K6R6M5m8m0J90Q1j88k01M84k77l34M32m9
3675A06l11K04K7j78j1O5K6p6M87k64k27RJ24j61j54N15jj35J89l6j05j73M99
3698D19j47o42L64J76l70k3L88o9o5j24j72L09k80L09J75k34J2rj11j06J80J46
3720A26j62j89K7J55K4P8q2j64M14k42n3j68K60mr0O5J02j19P7lpk9M2J43k48
$$ y = [53, -206, 201, -160, -63, 226, -253, -153, -81, -150, -284, 5, 44, 6, 63, 184, 7, -203, -39, 319, -26, -78, 174, 25, -283, -20, 146, -87, -37, 176, -109, -421, 24, 44, -113, -58, 217, -137, -8, 142, 27, -264, 157, 377, 89, -122, 84, -62, -244, -66, 75, -64, -384, 290, -15, -100, 54, 186, -28, -360, -18, -29, 14, -48, -3, -88, 10, 230, 76, 82, -189, -292, -133, -78, -20, 121, -124, -295, -14, -215, -296, 95, 106, -114, -67, -118, 42, -92, -45, 31, -202, 246, 266, -91, 27, 79, -323, -188, -55, -111, -85, 11, 56, 8, -32, 158, 239, 51, -150, 334, 57, -277, 155, 106, -205, -1, 26, -152, -163, -98, -72, -148, 339, 75, -152, -143, -19, -180, -334, 181, 180, 45, 234, 198, 93, -80, 419, 272, -370, -6, 170, -200, -223, 165, 96, 31, -93, -265, 44, -236, 73, 248, 14, 26, 17, -94, -200, -20, 126, -36, -225, -198, -43, -19, 59, -23, -187, 227, -15, -68, -236, 24, 20, -70, -5, 97, -22, 55, 52, 45, 16, 58, 201, -47]
3745d7mk59J00J09K85k87K5P9Q0j39J25L1m8r0M9Jj76J87K59l50Q4j12R6j52K59
3770A05Rp3k57K57o4l5J3r3l3j35O22l72O5M8J31j31L3J8k66K0O4k8j3J41j7l58
3796c49M25k3q0oJ79k60J89r5J40j58K03JQ8l34L00k23j1k9p1J4J47j72j27K40
3820a2o2J1L31k53j30K66J19J09m79L27l00j0J16R9j02m1j40k7P0N3N4j26lK27
3844I7l43J52M5%L10l01K29j31j22j20O4K45j79n9J80j5k58N0J11k05L72K4r7
3867D9Nm6j81J15J77r9j25K58J62k41K60k10j92J68j08k32M01j74N0l02O7M63
3889B65l67J99K64m68j12J83J20j64K07j82J18j9j38P6k64K33J50j13Mj09j10
3910b27K18j17n5l3K51j02J58k9J73j35o2k29L05O2j20k05J03r6j7L63j72j11
$$ y = [-47, -51, -310, -210, -101, 184, -103, -78, 1, 81, -58, 67, 98, 50, -40, 9, 10, -166, 21, 280, -70, 14, -98, -2, -154, 105, 114, 41, -216, 41, -23, -58, -45, -138, -171, -306, 316, -56, 9, 57, 188, 57, 90, 108, -158, -138, -74, -102, -115, 26, 9, -349, 76, 53, -27, -33, 146, -114, 75, -20, 120, -38, 165, 166, 254, -80, 220, -3, -14, -43, -114, -100, 47, -125, -252, -12, -74, -63, 268, 15, -115, 151, 270, 379, -100, 227, -73, -83, 33, 132, 30, -11, -151, -178, -108, -55, -1, -127, -130, 97, -246, -94, -49, -49, 261, -40, 189, 58, -64, -184, -120, 125, -54, -113, 67, 52, -206, -156, -45, -250, 122, 146, 49, 54, 8, -173, -58, 119, 20, -105, 153, 315, 74, 334, 124, -68, 100, -8, -240, 161, -13, 37, -265, -198, 265, -102, 97, 361, -107, -219, -36, 84, -80, 127, -55, 63, 44, -94, -18, -282, -49, 101, -12, -8, -117, -227, -9, -126, -181, -214, 37, -65, 93, 64, 237, 102, 40, -189, 116, 178, 58, -147, -44, -140, -157, 206, 34, -77]
3932g7l1K63k0n1J32k54n2l8J61L1K26k36k50N8j0p3K40l9q3k5J9n8L33j47o9
3957e0M4M06l74n4Q2K27q9k06j00j94K25J10j23J66O5k13J1K20K9l86M01n7Qj53
3981eJ05k0p7K4l33K64j04l0J89j42J86k22L51l2k74j79K96J52k33K48m9j85K38
4004A68k03o6J1K48k80L61L0k94J69L7m9k32r8K37j48j46K57l3j6K89k99m3K68
4027A68k39J75j69K13o7p6J44j98p9O3j63K69K56l00j31Q2N0p1q0M24j27k42L66
4050B68m27J19Q6L4p6k43K55j57k1p8K7ON4L33l60L6R9J5JK34p1k28L32j25j87
4075g4J77q6p2K7j80l2J41J87j18j23K76n9P2j32J76Q8r3k32kL72m04J0J74j79
4099h6j08M6L9o7J11J16p1n7q9J02J55j15K15k45Q3K00j6l17J66j91L85l31K5
$$ y = [-77, -108, 155, 135, 84, 216, -38, -90, -128, 33, 64, 290, 54, -196, -138, -148, -221, 19, -20, -103, -128, -109, -167, 166, 19, -50, -6, 400, 26, -28, 54, 281, 192, -14, -114, -308, -83, 27, -96, 70, 135, -78, -67, 153, 182, -204, 197, 140, 148, -5, 100, 80, 3, 27, -306, -42, -146, -176, 13, -129, 57, -165, 186, 154, -120, -299, -3, 149, -84, 164, 115, -70, 168, -35, -101, -90, 158, -122, 239, 269, -25, 144, 181, 132, -100, -198, 39, -109, -255, 2, -31, -47, 242, -57, -100, 168, -71, 104, -65, 148, 81, 5, 149, -49, -128, -65, -228, 41, 297, -3, -134, -52, -2, -73, -153, 271, 144, -98, 268, -159, -40, 46, 80, 4, -239, 16, -141, -162, -240, -213, -207, -153, 180, -180, -144, -45, -30, -29, 205, 134, -94, 238, 113, -74, 103, 17, -55, -28, -208, -240, -99, 88, -30, -153, 123, 64, 136, 4, 180, 268, 175, -57, -59, 313, -91, -81, 93, -86, -194, -148, -109, -176, -65, 51, -20, -77, -166, -64, 91, -24, 191, -54, 29, 229, 213, -104, 62, -129, 256, -75, -50]
4122e0L35l25J41j28oq5J42j00J7n9Q9J03J20o3l5k75K84N3j51k5M4J22j62o1
4146g5O1J34j44L9O9k39J11k3o4n9o7M76j77P8m1l20L12L9j10n6l6j36J48q3J77
4171A4J57k63JR2j88K29N9k22pJ37K31m06J47J73o9J65j10l80M1L22k72K04j19
4194f4L24k43J65k00P6K22l43J95k48k4N5K78k11J57J19k66O4m3L15l23J53k49
4216i1j50K20J84k81k75K62K70j64k93M95k19j98L88j43k26J35m1m5QK39Kj23
4238d6j26O6K01l43K76q4r5K33J73k72J55J1K4J48n13J76j04LL47k16j49J51P8
4261I4l82L27J5j71J82l87K95j40J66K4k5J16rk97K25nk77K08J33j50Q8k44K50
4284C6N7m4j37j11K41J20k60k1O6j4k6K35p7j62J42j14L50o07K34p9L28j1l04
$$ y = [-50, 285, -40, 101, -27, -33, -118, 24, -76, -59, -118, -29, 74, 194, 131, 96, -179, 105, 158, 7, -18, 26, 148, -14, -75, -14, 120, -24, 15, 84, -155, -44, -67, -131, -190, -257, 219, 42, 120, 79, -241, 71, 110, 0, -56, -92, -228, -80, -163, 14, 171, -92, -91, 1, -187, 42, 101, -121, -128, 9, 240, -166, -19, 154, 85, 250, 140, -240, -199, 123, -149, 55, -64, 260, 17, 182, -18, 58, 280, -63, 132, -116, -140, -85, 193, -18, 139, 258, -8, 56, 13, 328, 5, 158, -91, -241, -21, 163, -118, -393, -131, 139, -25, -318, 177, -42, -240, 148, 5, -221, -86, -127, -172, -164, 75, 77, -46, -172, -106, 95, -248, 28, -56, -151, 82, 255, -17, 138, 149, 173, 321, -192, -16, -120, -117, 230, 14, -135, 16, 94, -288, 39, 54, -117, 65, -322, -27, -167, -1, 23, -2, 114, 105, -192, 33, 28, -249, -41, 92, -58, 30, -214, 36, 93, 49, -88, -199, 42, 162, -98, -119, -53, -67, -93, 142, 65, -97, 45, -69, 281, -326, -92, -171, 157, 146, -158]
4307a58J46q6O8j64N19m30M5j6M0J26o1J07k76J45L2j22J31q8o6J91p3N3L0k41
4331a48Jm3J13J61r1k19K98J61J7K3l96J9K23j15j72r6Q1OJ86k22L7k4K21Qj21
4356i2J54K53k35Q9j17j8r5J12j70n8N2K34M9j51kr0J35M6j81o3L37k12P3j59
4380a09J17j72J66P7k2r9N0Q7J26m3k47Pj2m4O6K11k30Q5K32l74J82l13K88N4
4404H3m0J40k04p5P0J94o4k16K87k12M0j27J71k0q4j03o0L53l70R1R5j07J55J04
4428A01j19j81K40K77j66o1J0j33J6PK12m25M34k70m9K95k77K6K39j29L0l7k03
4451a63K93j40J12K5j84J48j67J45N3p6j68Q9n5k13L26p3L5O9k7%O4o2r1Q6K25
4476B51k66J07j49J63j97PJ9q9L6L48l31k70J52J84J30j61L86k89N2J36J8j07
$$ y = [-158, -12, -98, -30, -194, 325, -105, -60, -76, -36, 90, 29, 136, -140, 5, 37, -85, 46, -42, -108, 83, 10, 63, 93, -148, -147, -190, -77, 84, -7, -226, 72, 233, 250, 273, -123, -104, 119, 4, -168, -264, -183, -177, 9, -213, -176, -200, 21, 29, -92, 62, 315, 80, 169, 52, 34, -61, 51, -119, -177, -125, 109, 158, 7, 5, -85, 50, 96, -85, -148, 189, -23, 50, -109, 8, -164, 2, 79, 57, -42, 8, 95, 221, 178, -69, -62, -74, -118, -52, 159, -71, 14, 246, -128, 54, -259, 29, 83, 43, 183, -21, -96, -26, 168, 104, -112, 175, -37, 3, -124, 47, 27, -57, -160, -220, 133, -237, -146, -51, -158, -3, 101, -18, -199, 41, 318, 152, 91, 101, -32, -16, -9, 203, -222, 212, -58, -107, 188, -89, -63, 176, 47, 77, 40, -163, 130, -10, 102, 127, -57, 91, -76, 69, 122, 46, -122, -33, -88, -301, 25, -48, -13, 56, 29, 29, 93, 31, -60, 26, 251, -15, 92, -57, 106, -91, -84, -65, -154, -118, 230, -101, -371, -219, -35, 95, -66, 320, 31, 83, 219, 237, 130]
4498A30J38l6m16K56j92L3n8J60j45J41j80P2j9j38J59P3lJ51j72J33k17J76O7
4521A13j45Qj15J99K97n02lK28o7K5J09j64p2Q1J03J3k02K48k7o5p4J83j86K19
4545B04j20J39k33k78K12R0m33N16k10K67o1p3j38J68P1J06l68L02P3k49j37J27
4567b5O5N4J49l94J86j32O2n1M7R7k77L30n1j74K02J15j68r0J10q1J72q4nj03
4591d6Q4K93l42K94j17r8k6Q0j25P7k02R3l03O16l52J31p3M2J25k49o4J17q7K57
4615A25j41J77k18j20J46J95o4l54K85j88K89j94k4K59j56Q9j22j04K41k73j22
4636b74N2N3J24j1Q7k89K89k4q2J64j5k7j97J72k6J32J66j1j10j13pR5k71J0R7
4661a6Q7l14J83L32k39J4J5o3l6K9Q7j42K21J78l97j37K38j30J88k3J38R4o09
$$ y = [130, 268, 232, -184, 72, -120, -87, -145, 15, -130, 11, -169, -97, -116, -254, -95, -22, -25, 126, -46, 87, -130, 46, 113, -32, -24, -139, 60, 357, -145, -148, 80, 13, 38, 147, -17, -89, -8, 95, 108, -94, 154, 127, 62, -12, 171, -15, 204, 84, 223, -10, -288, -76, 14, -419, 97, -113, 154, 93, 20, -118, 50, 121, 227, -141, 161, 234, -15, -152, -25, 40, 94, 243, -151, 35, -97, -35, -86, -39, 58, -219, 111, 60, -114, 88, 203, 35, -55, 55, -26, 146, 62, 57, -46, 38, 331, -11, 283, 166, 68, 42, 122, -3, 74, -128, -35, -338, 278, -74, 57, -16, 26, 151, -98, -162, -45, -132, 125, -16, 161, -57, -177, -31, 164, 100, -254, 31, -157, 132, -62, -86, 173, 17, 106, -16, -120, 121, -152, -274, -222, -169, -45, -56, 31, -258, 31, 7, -75, 89, 74, 47, -150, 22, -4, 128, 294, 283, 173, 60, 53, 148, -123, -113, -16, 71, -243, -60, 272, 33, 47, 62, -1, -37, -8, 79, -63, 158, 336, -61, -198, 40, -90, 98, 75, 213, 307, -302]
4684c02L24P2j84J92O3j75mOJ17k27L21Oj80R2J3k29N4J01j1q8K8Mp1k8m6J59
4710Gj78K35pn4q8J15ON3l1Nj30n2LR9q2K67l48K91o3j88K15k63L52j92L17l11
4736b2j67K35l6J98j01j26M8Q7o3j91%J81m37O22j71nJ07k73p2J24K20q5j13Q4
4760D4R1j48l08K48K48j37l63K57K61j78Q5o1K99l56m2J5j23J3K1J98k70L35k43
4783a14K35l9j33pJ62k10P9p4J66j16J33j22L08j64rj15j8J37j83J6J20k02J12
4806c8j8n7j56L48R9k26K23l03M03k43J82l60j65J31O8M8Q6j35J66r2n2J30K8
4829F7%j00J57k85jJ1L19j65o9J85k43J50K21j71m7K76m99R4j84K04R2j13OJ78
4853H3L2j35MJ29k26J10n6N1j10L95l04K71j52k93K28q3j16K09k67J0J03J30k17
$$ y = [-302, 22, 94, -90, 102, 165, -10, -14, -8, 109, -118, 203, 209, 29, 121, 134, -95, -41, 60, 49, -39, -11, -7, -78, -106, -152, 7, -171, 64, 57, 3, -85, 30, 36, 89, 58, 63, -67, -119, -116, -17, -99, 168, -180, 111, 48, -140, 75, -188, 164, -28, 289, -22, -189, 46, 10, 208, 107, -19, 29, 116, 53, -138, -138, 43, -394, 228, 57, 52, 159, -114, -186, -62, 158, 73, -40, 44, 135, -13, -321, -73, 175, 38, -325, -68, 193, 15, 100, 39, 338, -18, -60, -45, -168, -155, -134, 64, -206, 129, -114, 121, 82, -51, -58, 104, -106, -27, -101, 65, -51, 82, -40, 268, 104, 95, -20, -38, 99, -84, -68, 52, -150, -38, -56, -113, -269, 79, 178, -48, 175, -128, 275, 32, 214, -146, -311, -180, -112, -64, 22, -113, 53, -39, -91, 39, 67, 67, -33, 124, -161, -162, -151, 168, 3, -66, 119, -124, 26, 247, 76, 29, 305, -194, -100, -284, -80, 12, -101, -95, 83, 115, -20, -16, 113, -113, -3, -59, -8, -118, 277, -27, 244, 92, -201, 27, -56, -172, 37, -230, -220, -117, 13, -204]
4876b04R9J12l4j58K31J1k20L51k16n0Q7L6K50k53j36j10j35L59N4j85J71j32
4898g2J62K8k08J30qj31J1J34n3N5k45R7l4J74k41j12L34l8J55r1q9J16%j21j17
4923a64J43J35N1j04j14J15l72M38k81J0j14J58n9M02j30k95J81j32K74k32R8
4944Hk01K93j02j9L7L6j9nlj65rMm9R5j8K02l13K38n6j75M2K41Q7k69j53L32k7
4971C2N4l02J85Q8m6j62Q1J97j47O4j2L38k99j55J94k47K26P3j52r7K02k31K33
4994A17J08k9O2k73j31N5J35n2nl1j06J0J50J89m54K00K9J25K38l91K31k14Ok15
5018b46M21j17k59J39k55K64P3j91K06l6J1K89l05J01Rj21K01q7l18K0K75j77
5040a03J75n2j49NP6jj33K02l53M59L5M0p8j63J31k33K07j40k46M92j02J6n6m25
$$ y = [-204, -105, 7, -27, -185, 46, 57, -163, 188, -28, -78, 9, 45, 295, 42, -94, -204, -339, 20, 74, -111, 60, -72, 90, 118, -90, 40, 32, -99, -88, 46, -7, 48, -197, -100, -134, 40, -201, -313, 21, -17, 138, 47, -42, 74, 74, -47, -164, -21, 114, 165, 61, -53, 62, -310, 128, -153, -143, -257, -99, -158, 244, 114, -181, 0, -132, 142, -90, 8, -193, 100, -2, -21, 16, 52, 33, 28, 25, -140, -149, -145, -194, -99, -117, 85, -228, 10, -46, -221, -179, 62, 149, -120, -273, 59, 32, 86, -216, -31, 57, 11, -151, -70, 127, -20, 44, 32, 370, 71, -84, 110, -137, 89, 162, 10, -87, 115, -116, 117, 225, 196, 258, -15, -146, -91, 44, -8, -13, -44, -150, -140, 10, 199, -255, -55, -26, 99, 337, -54, 177, -37, -31, -246, 175, 58, -201, -62, -317, -53, 20, -171, 35, -1, 10, 299, -6, 95, 104, -17, 184, 97, -221, -201, 74, -103, 72, 20, -129, -124, -48, -49, -182, 20, -333, 126, 161, 201, 123, -40, 91, -142, 65, -75, -321, 171, 69, 85, 29, -396]
5064c96K05L51p1n2Q2l00L85k54J3J39m2j28K97k71J77m6l9J2o8K3K87l28L19
5087B95m61M7K01j95l1J77K84j89n8J0K56l52J51k71L7K82j04k06J17l41K02P3
5109g6K86P9l48O2l0K03r2K7K51n64N39l90r1K42J80k62M0k80L23j95K49Q0k64
5132c1n8O3J79j08QJ40k31o5J36l0R9J8K1m09J64p4J03p7O8J28K0o9q3m3K23l24
5158b32M3r4J03L64nj84o8j12J62NP1J50j93k59J44k8k27P7N39k95j44J54j03
5181a32R1p0O1J89n2J0N5l95P4N4J56j14J28Pj77K7K47m01K53k6J38k76J57j49
5205a45J12K78j28r9m5Km1J6J29n9J80k03k55J67J8k7J23J03k06K23j15M4K22
5228B94l23J64j68J38j8L3j06k29J41M7Q1j26L2J56n8J6P1k94J24J44P5K8j60
$$ y = [-396, -191, 160, 89, 37, 119, -181, 204, -50, -37, 102, 60, -68, 229, -42, 135, 89, 50, 62, -6, 17, 304, -24, 295, -166, -119, 82, -113, -144, 33, 317, 128, 70, 80, 336, -16, 135, -136, -99, 183, 79, -127, -10, -351, -149, -76, 210, 289, -59, 3, -27, 176, 84, 111, 362, -202, 337, -53, -144, 98, 278, 16, 56, -224, 99, -96, 153, 233, -31, -89, -26, 153, 45, 53, 193, -38, -103, 33, 3, 102, 120, 141, -268, -104, -178, -75, -152, -84, 44, 64, -5, -88, -131, 92, -232, -189, -283, -180, 184, 179, -5, -73, -185, -23, -18, 53, 203, 10, -249, -105, -133, -360, -283, 256, -39, -183, -29, -132, -41, -111, -50, 139, 87, 97, 152, -243, -169, -115, 41, -73, 55, 62, -115, -88, 159, -242, 11, -15, 123, -153, 4, -145, -33, 245, 117, 18, -27, -25, -66, -50, 79, 20, 200, -3, -258, -91, -73, -100, 23, 126, -80, 143, 28, 72, 294, -29, 135, -33, 105, 87, 120, 14, -215, -74, -27, 54, -72, -40, 116, 58, 74, 145, -149, -25, 119, 194, 222, 62]
5251F2J72j24j60q4L39j06j07K13j98K08k96k77N32j93j3K05k61M4R3k64K93K38
5273C16l47K4J67k02J09k89J78R2O8J45l6k81o1J95j37J38P9j78j84J7n0L91j23
5296C1m8J41p9N8k22J16k64K29J21q2K4j44J52j9O5j15k04M43j63j0j68k4n6J08
5320a10J54j56R5j26L00p7K10k01J94k51k9N4m3l0j20K81Rl17N3K48Mk68J53n0
5344b3Q2J48j93r8j31K58j0k1J07m1j03K2J69l25K28k3k37R4l4q9Q3L0R8O7j07
5369d9Qj83K62o6K98k48rJ34k69L4r0J90j71K09j61M0J22j46k29J64O9r5K42l6
5393B0k40M89l76J57J85l17J71k91M09p1j07Rl28J34M5RO2j3M0j69L11m03L32
5416E8K01j79r2j86J67Rk41K36J14Q3j74n2M5o9L96l10k14m3L5L05Kj16J7k24
$$ y = [62, 234, 110, -50, -134, 205, 99, -8, 205, 7, 215, -81, -358, 174, -19, -32, 173, -88, -44, 49, -215, 78, 316, -31, -7, 160, -42, 67, -222, -44, 48, 116, 261, 225, -56, -117, 78, -59, 79, 158, -20, -204, -187, -237, 154, 31, -17, 124, 45, 103, -119, -3, -267, -38, 83, 1, 25, -119, 33, 14, 79, -36, -240, 203, 40, 30, -138, -162, -218, -110, 44, -112, -17, -143, 157, 80, 290, 89, 283, 32, 3, 57, 14, -16, -136, 145, 154, -163, -110, 138, 142, -126, 27, -23, 59, 207, 14, -84, -215, 43, 33, 12, 119, 78, -25, -3, 166, -159, 69, 46, -191, -97, -131, -220, -137, -107, -9, 58, -49, -41, -224, 38, -28, 270, 22, 13, 147, -122, -88, -178, 12, -159, 50, -111, -71, 51, -95, -324, -160, -91, -186, 56, 20, -220, 269, -107, 50, 235, -82, 89, -202, 207, 136, 29, 38, -290, -156, -111, -102, -40, -53, -13, -182, 129, -274, 58, 259, 80, -12, -198, -31, -22, -263, -27, 87, 170, -4, -56, -11, -80, 316, 6, -208, -251, -216, 89, 91, -25, -8, -232]
5440b32K14K28p9k35j03L43K10n77L3Q0J8R2J09Rk32K45j69L4R1jL0l91K72pO9
5465E1j72J54k49L47k96M81l98J90k58o5J48P4J01j70k6J62k68M17k07J82k77
5486g9m0J07j96L99j90p0K78j81j85N7J69r5L2j05o4J71q3Q8j12K11j89J7J56
5509I6m58M63q3J4k8J99j18o3J20l9j15l8k2J01J73j10j64k19L60m6J14p0j30
5532f3j28J47L8j2R9N8K6o9k9j16J11K1LL8k36k7J16J93j55J26n2p8J6j8M5r7
5558d3P1R8o0R0j93J85p7j72lL27l61R4K21j17l38J26J03J9J39P6k42K54l85K04
5582A6l5L5j63K13k45N6j59M70pj39K34l79L02M8m01L24n4j23K3j65J16j11J98
5605E4j57J8o3J55j9jJ00n7p1O5M8k1j71K61m59L74j31n9j62L40j13k39J06J35
$$ y = [-232, -18, 210, 131, -104, -207, 136, 346, -231, -198, -118, -100, -8, 101, 110, -122, 123, -46, -12, 79, 78, 108, -283, -11, -18, 51, -121, 33, -216, 131, -165, 316, -82, 108, -150, -215, -67, 7, 108, -62, -88, 74, -194, 223, 16, 198, -79, -119, -12, -208, 191, 1, -69, 209, 28, -157, -100, 69, -26, 6, -99, -163, 8, -75, 13, -99, 112, -77, -60, 96, -362, 101, 18, 32, 4, 203, 85, 22, 142, 103, -12, -50, -72, 29, 202, 92, -72, -291, 69, 23, 137, 67, -63, -191, -44, -6, -18, 81, 139, 165, 96, 67, -49, 62, 83, 86, 124, -112, -139, -23, 170, 15, 141, 89, 11, 27, 9, 54, -43, 28, 126, 66, 156, -37, 148, 71, -101, -104, 223, -138, -44, 177, 60, -278, -152, -49, -30, 109, 185, -57, 197, -188, 16, -19, 16, -147, 66, -179, -123, -282, 188, 181, 42, 276, -103, 199, 247, -154, 170, 116, -7, 16, -149, -33, -144, 54, -103, -85, -148, 7, -12, -13, 87, 30, -41, 24, 72, 51, -120, 141, -318, 56, -75, -134, -296, 44, -69, -308, -202, -67]
5629f7j46K7K39K7j35P9l07L41r7m0J46l91J28K89l8k75J39Q5J4k42L20o4%n6
5653b4R7q7J5M6J21j79L4n4J28m9L8k71J71L4j78L37j65j61N5L99k99L2o2P1p2
5678b3P8oLl6N5K45l51K36q2j0K6j58pM2L5J72j13L4ml2k21K18j12L44l73K0J18
5705I8l7l0nQ3j05k20J07MQ2K5q6J42l4J19k21J63k32J35j35K1L00m35L11j14
5729f4J71j61J9K50j2k54o9n3P8L12j25j43j79M5K93j01lJ51l93J79pM3J24k75
5753a74L10r5J33r4j85K3J51O6k65j32P3M72k20k07J04J79j46N0k9k9j07rK94
5776A63l99N6M02N8l67J66j69K89l32K60k77j02L57j48k3J08m8r8JL65l52K66
5798A76p5J15j38j70l2Q5Qk2K0q8K07k00o0K40k32Q0L10j09j46o2R4po0K09k87
$$ y = [-67, -213, -186, 53, 80, -55, 24, -283, 58, -39, -79, 67, -324, -196, 93, 55, -220, -81, 4, 18, -224, 96, 32, 32, -24, 73, -14, 1, 47, 168, -11, 23, -31, 97, 48, 86, -185, -14, 20, -158, 179, 14, -147, -92, 307, 8, 40, -22, 49, -23, 55, 49, 52, 16, 71, 316, -35, 201, 119, 109, 135, -23, -30, 12, 47, 219, 106, 140, 136, 104, -117, 101, -11, 333, -40, -20, 98, 61, 31, 26, 109, 4, -216, -109, -105, -23, 2, -84, 58, 24, 143, -78, 85, -147, -12, -147, -126, 174, -261, 50, -64, 107, -54, -35, 215, 203, -51, -120, -173, -95, 217, 92, -51, -230, -185, 108, 7, 4, 155, -238, -59, -66, -23, 101, -174, 136, 41, 174, 80, -105, -82, 69, 135, -130, -262, -189, 283, 63, -144, -40, 139, -7, 43, 14, -15, -122, -131, 163, -236, -180, 222, 280, -87, 79, -90, 199, -133, 127, -150, -252, 105, -43, -66, 42, -6, -104, -103, 262, -90, 176, 101, 216, 78, -92, -124, -39, -31, -53, -33, -121, 86, -114, -174, 66, -166, -86, 224, 115, -31, -93, 1, -6, -66, 143, -144]
5823a44J65L12m56R0N4pl92J06J20K06n4Q1l0j85K26J56k89n6J2N8p4Q3N0o2J72
5848A42o3j5p0J88r9J16j09N9n6N5k9j29J23j75J8j30R3J65m4l39K85j10J52L2
5872F0j70Q7J02j16N0j51N9J03J49P4l74L7K99k48j07J79j69J23J19Q3j65L6N
5895F5J74j90rj23J54j57p4J31J07j06r0K7K1j65Q5J28O2r6j18N9l23N00q4Mo9
5920h7J17l0J19K1r7n1j65lO3n5J90j46L64k64J55k33K01j18NM6K90l52J8J08
5944I6J48m5k45K26n5j89l4K09l62J83p1n5J78K10j29K17l27q4K04j60J82n5j53
5967a11J72L0K2M1k10K99l34L13j85k04L9Q7r4J36Qk17J91Q3j87J13J73l72L66
5990A59j36K97k95R2J60l62j02L58j00m4k3OK7m4J72j63kJ01Ml76K91L9P0J28
$$ y = [-144, 21, 333, -123, -33, 21, 14, -378, -272, -152, 54, 0, 81, 51, -134, 92, 248, -41, -97, -85, -27, -101, -18, 32, -30, 142, 79, 64, -6, 182, 83, 199, 90, 149, 93, 148, 119, -10, 113, -62, -44, -174, -81, 84, 40, -299, -14, -124, 28, 60, -110, -23, 79, -37, 13, -138, -79, 24, 173, 247, -127, -90, 209, -39, -146, 33, -136, -13, 106, 189, 24, 60, 65, 239, 49, 40, -83, 71, -86, -160, -29, 78, -28, -118, -91, -70, -235, -150, -22, 40, -56, -174, -115, -438, 62, -22, -18, -87, 30, 0, 119, 140, 43, -8, -173, -176, -113, -168, 22, -124, 240, -24, 131, -102, 99, -19, -14, 32, 322, -30, -12, 96, 244, 199, -46, 180, 125, -64, -98, 111, -251, -68, -139, -194, -16, 194, 65, 282, -45, -129, 75, -85, 97, 42, -111, 61, 91, 113, 154, -56, 243, -91, 222, 37, -167, -128, -41, -135, 1, 9, -208, -17, 66, -121, -8, 165, -207, 159, 23, 320, 25, 117, 277, -85, -187, 171, 71, 27, 4, 10, 37, -7, 165, 2, 0, 101, 105, -271, 20, 59, 129, 257]
6014B57k95L7k49K18k5l9P2j52J94K18j97k18L17k69P1J05K03k06J13k44J62p2
6036AR5r6k09K26l57L52J02j57K9J17m04L54j8q5M4j21L4K71n71L22j02K1j4J79
6060A3J03m5n1l16K06J30K6O5l9k27R0L3J60j66r8K57j58J34J44j86l3k34L96
6083B04j5j96r2k7J74om2rN2j32J80r0J26J30k57K43n59K39R0K8l8J87j11m3p9
6108d3J16j62J1L28k23L8k71J96k1J69p7j49J82pNp9K05k02Q0L6J4j93o0L33j11
6133A15j60Jr5M3L16m61p9O29k01r4R0k04j03K34j01J86j36j44k3R7n6K91l3j22
6157a0k6q6K26k52L43l40K30j29ro5J55J29j40J95j37j0p7Qj43R6M0J85l26K30
6181H7m5J73k89k1j3Q1J10l12J66J07J05J5j25q7L50m10L64r5m9l56K00P3j9k6
$$ y = [257, -38, -1, -250, -32, -57, -96, -24, -176, 18, 236, 39, -179, 138, -131, -60, 45, 248, 42, 155, -89, 73, 1, 96, 0, -209, 17, -340, 12, 114, -43, -14, 103, -301, 53, 35, -50, -6, -127, -93, 178, -393, -71, -173, -152, -166, 13, 116, 71, 20, -296, -90, 40, 66, 131, 92, -135, -45, -12, 148, -18, -116, 141, -17, 117, 261, 75, 42, -192, 204, 189, -7, -99, -126, 48, 42, 0, -9, 43, -89, 91, 1, 127, 257, 0, 243, -316, -77, 13, 41, 3, 190, 79, 36, -43, 73, -89, -78, 250, 27, 65, -206, -10, -31, 138, 61, -88, 94, 87, 92, 13, 218, 16, 96, 132, 146, -47, -107, 226, 115, -45, -44, -139, -96, 220, -241, -320, 309, 108, 14, 104, -100, -203, 31, -70, 116, -20, -164, -187, -90, -146, 145, 112, -10, -36, -122, 104, -148, 195, -145, 85, -44, -53, -118, 37, 166, 26, 221, 84, 74, -3, 5, -138, -42, -2, 183, -143, 87, 42, 215, -74, -95, -108, -27, 83, -229, -63, 44, 149, 164, 39, -48, 302, -108, 256, 161, 112, -244, -44, 29, 10, -16]
6205a6j61L3M29l28Q5l69J49L44k12K9k0PRm2R3n4o9K44r1j45Q0J07n2R7j53Q4
6231G8j31j97N07j85j06n7K61K48n35J93J01m31L14k8j66K05k36K39j18L3K7k51
6253b35K52MQ8j30K76k23j16K46k30J9K11k8n8l36M06j98jK5l7O3j83K89JO0l20
6278a55L43j94o5J52q3p0J54n7n5J2p9lQ4j12pQ6o5J39k0o5j46K44j50P3L0l4
6304d3J73Lk45P4n8J71j07N5k50L07j33L22o2l41K12k17L62k66R4p4M0k18R4P5
6328c2qM32k68k18J89k63J48k20K31k64M04q9k30J58l04N54k28m9K50k02k85K77
6350a7L3j27K23j49K66l45O8J25l30J84J14L3q5l5o6J94O6l7j24j32M8J98j67
6373f2PO0J9k82M05j25j1L3P0m3K10m83L52K8j98k31J64J32k65L78k13l3O0Nk07
$$ y = [-16, -177, -144, 285, -43, 42, -327, -178, 166, -46, -17, -37, -30, -21, -63, 30, -24, -93, 151, 60, -85, -5, 102, 50, 147, -6, 78, -53, -250, 257, 72, -34, -91, 170, 418, -117, 76, 177, -254, 60, 32, -134, 71, -165, 74, -44, -11, 16, -235, 17, 21, 109, -21, 255, 32, -84, 162, -68, -49, 162, 134, 76, -260, 146, -52, -53, -28, -65, -2, -185, 104, 105, 165, -155, 188, -6, -71, 81, -2, -72, 82, 25, -30, -18, -97, -100, -16, -128, -135, -49, -114, 25, 5, -60, -206, 38, -112, -39, -9, -43, 130, 133, -112, -38, -96, 75, -32, 23, -227, 80, -53, 269, 207, -134, 78, -139, 223, -43, 51, -23, 17, -201, -107, -32, -40, 392, 124, -94, 95, -168, -20, -240, -9, -273, 131, 42, -188, -30, -334, 220, -8, -57, 193, -9, -294, -17, 16, -111, 112, -37, 229, -116, -48, 77, -253, -69, 45, 78, -7, -42, -108, 86, 152, 115, -9, -141, -93, 105, -62, -55, 5, 24, -258, 147, 22, 11, 44, 114, 71, 281, -202, 150, 178, -20, -251, -87, 45, -220, 158, -55, -88, -28, -23, -230]
6398b30J90J3J18N5j81M1m1L49j89N5k03K7J62k42J6K1m0n4n5J15p2l6J70l8R0
6423D1r6J59j68oN0P3R3n7J64j01j01j58J0n0J69J64r9L0k90K62l27J66J27l9
6447A6q9J11L5k91L07r6n4K84l19l2K46j02J69k70N4p8l9L29j86J83k60N2L8J38
6471A46oj88K42j03mP4k86M7P3j14J08Q0q9n5N0J52m2O3j30k50O2K15RM3l56L33
6497G4p1K20j76j08j76L47L0j19p8J6p4J77n8k3j0M8K5j65K68m1nk24J03K2j13
6522a11P0J33k29L73n4k37J05j17O1k33j33L94j97N5J22K9J83l98L23k02J80m
6544A13l45M16j91m3l5P2l7j0j9J69J3n0J8j15m7P2J59m1q0Kj9km6K48k61K63
6570B04j84J37k53K1K70k33j75K24j43K33k26J63k81L07j54O5J01M9k27J97j52
$$ y = [-230, -40, -27, 91, 146, -35, 6, -35, 314, 125, 180, -23, 4, 166, -76, -60, -39, -79, -133, -188, -73, -145, -181, -11, -49, 41, -55, 104, -64, -70, -20, 53, 146, 89, 253, 152, 51, -107, -97, -147, 22, 186, 87, 117, -173, 89, -238, -72, 55, 16, -73, 38, 73, -218, 89, -7, -61, 223, -96, -128, 118, 16, 185, -85, -31, -109, -148, 181, -5, 178, -82, -30, 8, 146, 140, -48, 194, 91, 87, 161, -125, -78, -5, -119, -11, 69, -20, -75, -25, 127, 85, 148, 18, -232, -170, 45, 54, 97, -259, 74, 3, 223, 47, -61, -237, 110, 140, 21, -57, -41, -115, 62, 4, -19, -29, 19, 44, -121, 147, 106, 101, -123, -20, 2, -111, -41, 92, -137, 236, 182, -55, 50, -67, -6, -239, -372, 22, -175, -120, 2, 31, 214, -184, 139, -63, 117, 113, -232, 184, -7, -50, -85, -13, -50, -60, -79, 90, 103, 53, 71, -44, -91, -19, 140, 99, 19, 21, 2, 0, -46, 202, -59, 204, 20, 157, -96, -75, 195, -38, -213, 11, -132, 101, -125, 38, -243, 64, -90, -25, 76, 125, -102, 95, -57]
6591e7R1J10k7j29J58k13J27R6j32j11K64P7k97P1J96J13j89J91m23J7r5K28N1
6614A17l69L59P8k99K21q4j52OO8J10j37P5L9k49M33k90R2R8k32J92K8j6K5o0
6638E3k11L18l10K73q4K3j1j25N7j2Oj05K32j43j11K17n9k6J49j06J12j27k4J3
6662aj16L60j0l33J58r0O0r2P7J37K5k98J02o3P9K35m8P6j13k31J97mj89R6L32
6687C46j46j77k27L1L76m10K19P2j15k79J56l3oL41m1Jk4m5R3j81R4lP2k82K76
6712A08k07J87j65l43K94K64j78j27J19r2K84j1j49q9J97j2k56qJ93o6J51m7J34
6735A81l58J76j82L71k35J5M8k3N4M6J10k40j26L12l99P7L86k79j29J41J83j29
6757@O0K29l51q8J3K25L5j02N7k40j7jK22J48j54J89j14l5N4l13K66j80J57mj83
$$ y = [-57, 34, 144, 117, -12, 146, -67, 60, 156, 24, -87, 177, 254, -43, 28, 224, 337, 148, 339, -84, -67, -162, 66, 117, -252, 107, 185, -114, 107, 23, -129, -123, -55, 55, -82, -7, 32, -217, 216, -74, 18, 116, -116, 76, 104, 88, 113, 53, -158, 160, -150, 123, 39, 62, 51, -74, -17, -29, -23, -128, 104, -39, -150, 67, 8, -18, 131, 25, 137, 10, -14, -1, -117, 243, 233, -100, 58, -32, 28, -64, 13, 150, 175, -123, -21, -84, -5, 230, 182, 258, 145, -86, 111, 107, -82, 14, 346, 200, 23, -204, -173, 203, -207, 12, 84, -31, -310, -154, -187, -193, 148, 107, 108, 84, 39, 132, -49, 45, 42, 114, -168, 108, -99, 88, -77, -420, -126, 138, -40, -167, -48, -140, 144, 133, -16, -105, 92, 80, -176, -184, 9, -57, 94, 47, 181, -177, -1, -183, 188, -47, -32, 16, -7, 47, 93, 203, -37, -163, 149, -250, -173, 213, -66, -195, -54, 129, 0, 60, 289, -62, -150, -137, 88, 123, 21, 78, -162, -179, -180, 42, 190, 36, 225, 111, 76, 130, -183, 83, -97, 60, 56, -127]
6782a27O0P4j12J21j1k87L47n0mJ17m8J5M4j19l9K7l4r9K26l7N1k03L8L02m08
6807a56J61j19J92j0k15J83j67Q8k2R0j11L0R4j25n5J92J56j55J8k41J64J11j19
6830a6Q7l0L8j21l4Q3L5j3JJ39K10j05j29o1p7P4k86J02L15j40M3k83J30J69K5
6855A56k6o1O5k11K81L1l63J55j39J43J72k60M7K50l12r1K46k49K19k12p4K82
6877D9k94L05N8k36R1J65j00NJ76j60k74K32J3j33K27j69K05k72j0l8L30j27k2
6900B1J77k27K9rJ3J70n1j25J28m0j01J18r2j2K60k19J28j86J59q4R9k48k2K31
6924A17r4k3J46k60K18j69J00Q2n19N51l09K76j49lQ4j16M4N1j12p9J76L14m64
6947a38R6M7j68L52l29L02l44o9L44j01j14J28l60L50J8L03l61m0J13J51j29j38
$$ y = [-127, -67, 7, -105, 16, 5, -282, 65, 15, 11, 128, 80, 95, 139, 20, -19, 8, -26, -125, 101, 64, 115, -88, -50, 252, -156, 5, -114, 78, 68, -147, 36, -131, -43, -65, 25, -86, -56, 38, -87, -142, 50, 206, 51, 69, -172, -8, 103, -16, 71, 41, 79, -42, -76, 7, 42, 29, 30, 169, 379, 274, 145, 84, 7, 81, -205, -103, 212, 72, 115, -168, -38, 131, 156, 130, 69, 134, -77, 204, 235, -128, 27, -112, 31, 203, -57, -10, 240, -72, -163, 83, -166, 53, -159, -233, 49, -245, 60, 118, -118, -27, 138, 38, 43, 219, 59, -215, 17, 30, -103, 124, -45, 160, -112, -122, -160, 170, 43, 21, 198, -29, 0, -9, 4, 174, 123, -2, 126, 86, -15, 103, 11, -1, 259, 40, 168, -18, 141, 57, 156, -92, -114, 117, 23, 0, 146, -114, 104, -65, 35, 117, -402, 149, -160, 116, -33, -36, 48, -68, -24, 27, -85, -164, 12, 326, -138, -42, 5, -163, 189, -140, 162, -182, -251, 93, -8, -122, 6, -354, -4, 14, 317, -44, -84, 29, 180, 51, -87]
6969h7J0j0K17m5j77J02j45j1K05l1J39k93N3L8J25j07J91l21j0J63j77K41K5
6992I5j90K87k16M6J70l61M5K20k76N9P0N4k93N08l90K24l9q5j05r3M21l52j06
7015c07L61J06j89n3L41k40jp9J23j50J22J15l04O5PQ2o2J38N0j69p4K41l11J14
7039g4onJ73R4m28N9J22k2K34m1J74k73J80k14J67j52j75M40m16K23O3p9j21J44
7063F7Pk93M90n0l29J34L3j56R4k3j71Q4R7L31m25Q6Qq3j2lJ99j99K41j80J86
7088A33pL5m05J54K61k96K9j4M12k74q9m3J96o5R1j46l6n6K17n7qj84O0K09K52
7113C69l87J86j50r9j77Q3K42p4J82j44PJ76k31M0N9k0k1k7J26k33K07l28L51
7136A37l94K90Lk41K76L31l56j45J2J9N5j43L39j77L6m8j07N8k79K73M5J89j76
$$ y = [-87, -77, -87, 130, 85, -92, 10, -135, -146, 59, 28, 167, -126, -73, -35, 90, -17, 174, -147, -157, 6, -171, 70, 95, -95, 192, -24, 22, 192, -169, -124, 96, -180, -121, -51, 3, -290, 218, -172, 52, 13, -72, -177, -270, 151, -201, -307, 54, 160, -29, -82, 259, 19, 18, -61, 62, -88, 34, 149, -155, -90, -83, -1, -63, 75, 125, -44, -118, 123, -188, -74, -80, -85, 88, 182, -246, -187, -65, -87, 147, 106, 280, 7, 187, -27, 140, -12, -187, 253, -163, 60, 123, 44, -77, 67, 74, -219, 271, 221, -108, 26, 59, -97, -3, -26, -197, -113, -16, 315, -110, -24, -16, -99, -111, -114, 85, -114, 127, -53, 133, 126, 161, -244, -90, 171, -125, -96, -110, 302, 28, -61, -104, 92, 27, 118, -28, -64, -120, 97, 40, 32, -152, -92, 117, 369, -18, 168, 18, -81, -258, -175, 67, -7, 175, 31, 38, 214, -17, 23, 82, 62, 41, 14, 140, -93, 114, -214, 137, -257, 33, 36, -205, 71, 402, 46, -99, -87, -68, -13, -156, 183, 6, 42, -6, -113, -55, -334, -61, -16, 173, -3]
7159cP3l18K41j06m2K81k35K11j95l8J47J50j48k04J27k5L6J15l08K32M3R5k3
7182A06j28K3l2Q3L26l08K63k92Q2j52n2K92l97J03l6P4o5L8q4L9K0R1qM4J92
7207B22j92jj44J61j12N8j40K78j24Q0k02M09k84O4j14J7j84J42l8J16l6m7K32
7230A61j63j7J93l37R5K52l87L17j61J66O3j39j35K14j56L12l57L8J74m0j89L7
7252e9M7j71K16q0l3N0J35J06k64j13K87l87O32l95j37J55k4k11J27K11m1j15
7274f4J36j4j94K24O8l13J75Q0o9o6k98L59N2q6K3k06K73J13k49K68r5k63J39
7297gk4J01m6Pk6j04lm8L38Q9l94J07M2j81M81l96N2m8QK1R2j3j70K64j37k12
7323b07M20l22K75m8j85L7L74m37L76k75P5k76K20N5ok25J35P2J3p0oO3m9k31
$$ y = [-3, 70, -248, -7, -113, -155, 126, -109, 102, -93, -131, 16, 166, 18, -186, -59, -84, -48, 67, -241, -9, 34, 129, 106, -22, 1, -31, 52, 378, 70, 333, 41, 123, -29, -81, 211, -186, -83, -119, -45, -110, -72, -156, -117, -97, -6, -14, 30, 222, 30, 29, -115, 46, -66, -8, -148, 130, 6, 86, -116, 293, 9, 73, -41, -24, -208, -66, -104, 12, -24, -71, 161, -2, -19, 174, -163, -68, 184, -203, 114, -47, 119, 182, 43, -92, 122, -34, 278, -79, -41, 133, 93, -96, -59, -12, -183, 33, -47, -80, -30, 105, 211, -53, -166, 121, -266, 366, -29, -166, -11, -35, -246, -119, 92, 51, -64, 72, 58, -136, 88, 156, -157, 18, 98, 29, -37, -335, 24, 76, -10, 13, -193, 80, 193, -56, 212, 117, -146, -7, -31, 70, 24, 31, 5, -99, -102, -150, 188, 277, -117, -10, 32, -149, 332, -64, -12, -60, -52, -31, 61, 48, -122, 142, 5, -207, 213, -109, 166, 118, -67, -30, 344, -93, 283, 8, 83, -193, 27, 82, 76, -149, -14, 58, 71, 1, -5, 58, 9, -222]
7347b22J15l0N0J26j04m6J3J20r3L55m25L4J02Q4J67p4k36O5J12k58J2l4qj30
7371c05J81R6M8J39j19m38L28K6K11k3J6k26J52q6j00K8J30l52M59l52O8pj06
7394b32J06P8J28J32j0j11q7o4n5l9M1PK3P5K33l54J33P4J58J52n99M69j87o7
7418Dk1jJ13j21Kl1m6J06J54l25J8kJ21p5Q8j45J45J49j93Q3L9p4L8j36j6RL19
7445B02Qk22k36m5L77k64K77J5l41J11K69k02K40m15J68j08Q3Q0J25j32k4J49
7467A15k57L49k19Q4j06j36K65k68M2L72k42j77J0K63pJ0k3k30ML84p3k05Q1O5
7491A01n3l0J23l77K62J07j38N7j09J30J36k68K9q7J22K36m81J72J51P9k90K45
7513A17M1j61J09j52K95l74J58j32P0J0Jj13m2J35j10RO0j5P8L3J94k31O2m1j97
$$ y = [-222, -107, -137, -87, 39, -65, -111, -98, 22, -71, 284, -141, -107, -5, 79, 246, 172, -64, 1, 113, -145, -133, -167, -175, -305, -124, -28, 20, 159, 40, -398, -70, -44, 167, 144, 160, -66, 86, 0, -100, -72, 58, -294, 165, -187, -119, -126, -232, -126, -48, 80, 212, 202, 91, 4, -60, -115, -154, -113, -106, -83, -8, 225, -129, 4, 78, 236, 388, -211, 258, 71, 4, -17, -18, 95, -26, -24, -55, -101, 5, 159, -166, -148, -150, -29, -104, -16, -161, -16, 133, -60, 23, 62, -12, 26, -110, -126, -117, 202, 210, -12, -248, -293, 84, -180, 97, 112, -229, -118, 151, -51, 189, -226, -58, -166, -83, -3, 122, -10, -34, 115, -142, 207, -12, 72, -34, -170, 95, -173, -131, 241, -1, -178, -168, 95, 88, 98, 75, -155, -151, 233, 160, -45, 36, 101, 48, 18, 141, -236, 26, 133, -5, 52, -57, 73, 209, -59, -30, -117, 5, 241, -240, -68, 83, 162, -128, 117, 158, -3, 106, -46, 249, -125, 33, -99, -29, -19, -18, -131, -173, -38, -148, -139, -79, -94, -16, 17, 211, -20, 42, 1, -196]
7538a96M37n69L41p2J86j28k00L83p1l8n1l3J4j5j45J47J32j66J77j95j42J83
7560b1k3O7K26m48J78R4k02L05l73K4K19jO8j81K30Kr0J21k71j7J28j26P9P3J2
7585G3Q6k61J46R0k68K5O2k5K30l48P9L77j46j76Q9J9j22J06l3K25l00J52l36
7608b56L41o5J90j81J33j58k2K82j95j84J95n8O8N2l49M53k49Kj10j0J68kj52
7631a07L18o4j76P6O5k79K70k96q3N3J83O9j4Q2j18j7p1J83K2k06o7J52j36K40
7655G9J19n13L85p4l93M18j51J51J5J54j75k38K21L3n0m5j65l4N9J98k5R2oJ02
7679A57j77n4R2k10N7j2K91l35M41k5k75ok14M05q5l03J54K24q5K5J78k94K19
7702A68k33K76j46j59j0J87q4r3L5J71k48J76j03p5J49R3j61j36J33P7j96J29
$$ y = [-196, 241, -328, 13, -59, 127, -1, -201, 182, 111, 73, 22, -11, 3, -12, -157, -10, 122, -44, 133, -62, -204, -21, -44, 23, 249, -199, -21, 73, -129, 176, -197, -173, 46, 45, 113, -68, 162, 164, 74, 195, -76, -93, 35, -91, -12, 61, 73, 159, -102, 44, 134, -134, -109, -47, -72, 158, -190, -111, 266, 120, -56, 33, 52, -70, 36, 3, 228, -72, 80, -256, 85, 20, 210, 29, 162, 4, -18, 264, 69, -115, 80, 22, 90, 142, -207, 246, -3, -1, -111, -121, 47, 45, -107, 211, 147, -29, 47, 112, -167, 103, -193, -276, -223, -40, 29, 15, 97, -21, -38, -109, 74, 96, -110, -177, -25, -161, 79, 198, -315, 70, -4, -397, 21, -130, 21, 36, 190, 15, -223, -2, 31, -19, -64, -229, -263, -204, -6, -31, 61, 55, 157, -20, -74, 18, -192, -135, -147, 144, -191, 250, 225, -50, -56, -270, 135, 50, -253, -99, 125, 40, 65, 243, -51, 168, -65, 211, 65, -94, -104, 83, -1, -94, -59, 112, -136, 40, -63, -138, 11, 104, -57, -193, -60, 17, -179, -50]
7724e0N6M3k29K40J6j09M5n0j64J10J24NJ26l15K84j80N1L0j8rj03J66l8P6j41
7749c4j64O6j76N42j72j15J89m1j19J29J31k27j28K46j56J2K43n8q4j56K1M3P0
7772F2O9k10Q8J50n3M3O1Kj25j6P8k81J92p3J96k61N9J68j19n3L2j90J13J64k55
7797a59J67%l1O4J39p7J94k42k1j21L0n9j2q1K32j82J90J57n1k87J21J25k40J3
7821a31L01j5j28r0M3K79j86l7m4K49k66M6l3OM0j82J2K73p2J17j68j87R0J98
7845A15Rj83P1j3O4j44J81j64LJ95m21K44J41j40rj10QN6L57m12J50L7j81P0k14
7870b90L90j33J38k2M1o3J36j42P2m9j92k6J42O2j1m2k73lK67R4j79J27m5J63
7894A62j19L0j29K6L24m32j29K06J70J07k96r6K56J40m35M43j03N3j34r3K82j29
$$ y = [-50, 6, 49, -180, 60, 76, -33, 12, -38, -202, -92, 32, 37, 163, -152, 132, -48, 3, 33, 15, 6, -97, 69, 31, 107, -34, -198, -132, -308, 234, 62, -53, 136, 95, -24, 105, 236, 9, -119, 127, -29, -17, 226, 168, 84, -72, -51, -8, 62, 131, -79, 9, 159, 106, 149, 210, 212, 87, 71, 149, -132, 60, -13, 183, -78, -19, 149, 30, -23, 9, -181, -68, 96, -159, 8, 8, -23, 41, 180, 103, 297, 55, 34, -87, -57, -116, -128, -209, 23, -159, 31, 188, 137, -150, -29, 96, -144, -131, 170, 155, 27, -63, -20, 259, 73, 36, -8, 241, -25, 21, -12, -6, 34, -148, -136, 137, 65, 182, 14, -173, -83, 115, 124, -59, 12, -1, 63, -81, 100, -64, -61, 134, -287, -43, 98, -42, -51, -161, -153, -97, 260, -152, -2, 35, -146, -76, -290, 100, -33, 105, 83, 124, 61, 197, 55, 127, 78, -114, -140, 2, 64, 53, 11, -262, -265, 2, 96, -83, 44, -1, 162, 43, 73, -56, -30, 294, -138, -267, -61, 109, 216, -80, -176, 80, 220, -215, 228, 125, 178, 44, -49, 233, 104]
7916A04j29K48l24l2L97j57k02J32l5q3j12R1J82lj47m6J12J31k65o7J18j23J93
7939a7m7K05l36J83L9j44O8J57K9j90J86L7j98J05k17Qp9M34k19Qnj46J53k58
7963b44J70K07p4r5l7j07L03J56l68l8L72j21j29O9k39J38K0J42j71q2K92k68
7985a04K9J70Koj83J2j08K77k89K10j13K63k59R4O3q1J45o2q1LK3J79j2l56P1
8010a13N8J4J21N9O2j33j50n2o0O7J03j6Q4r6L03j74P6k37Q3j2N0N4j23K57l85
8035a60L02j41j65K2j0m5M7J61j1j40O2N9L2k7J3J00J03r1j65J22k3j22J59r2
8059a0k25J63L25l52J38p4j49K95j75q6J67P2j79K26j93J97k73j4J82m9k43J15
8081a42J29j3q0j23M59j24l15O9K44k58K06M0j0k34P2J39R4l9k04j32O3M3Q6N8
$$ y = [104, -25, 223, -101, -133, 264, 107, -95, 37, 2, -81, -193, -102, 80, 77, -70, -116, -4, 127, -138, -205, -87, -210, -17, -64, 141, -195, -12, 27, -117, -49, 108, 137, -53, 133, 170, -28, 77, -140, -132, -211, 223, 4, 12, 7, -139, 14, -244, -74, 133, 59, -36, -73, -180, 123, 279, -89, -127, 245, 124, -5, 64, -175, -37, -17, 125, -46, -128, 164, -104, -75, 95, 97, 91, -92, -80, -188, 89, -200, 10, -103, 160, -99, -5, 58, -23, 122, 60, -21, -18, 5, 184, 172, -184, -113, -55, -41, 80, 139, 201, 68, -82, -134, -194, -127, -24, -40, 44, -52, 251, 77, 153, -84, -1, -13, 37, 91, -32, 225, -160, 142, 1, -164, -142, -152, -197, -150, 11, 0, -140, -78, -19, 13, -14, -1, 99, 202, 111, -54, 68, 45, -77, 82, -10, -235, -72, 253, -99, 39, -35, -184, 111, -64, -150, 17, 89, -90, 136, -57, 140, -133, -147, 35, -14, -257, -142, -13, -26, -106, -229, 230, 106, -209, -140, 104, -154, 52, 92, 82, -152, -80, 59, 153, 114, -90, -222, -159, -116, -30, 28]
8105B8O6J6k05L96j72k71J09R5j85J3J00j85J22N5j3j67J15J40n4p5pK7P6J32
8129A56k79p0M9P0j02L51j17j06R8J05M2r2j36K78m06J3J47J24j54J10j34K91
8151B38j61j91J71k35L83k24J7J40p8k9r6O5q6O7j08K71j72qK76k07J9J6o3J12
8175A17j34K9n7p5J46l26L62nP6l44K47m66K69K12j53R7
$$ y = [28, 94, 110, -95, 301, 129, -142, -33, 62, -123, -110, -10, -195, -73, -18, -31, -198, -83, 57, 3, -72, -79, -52, 24, 156, -123, -193, -144, -74, -176, 175, 58, -48, 50, 155, 197, 105, -31, 247, -159, -146, 1, 125, -29, 81, -53, 238, 77, -114, 57, -178, 205, -19, -2, 138, 60, 31, -65, 0, -86, -19, -127, 144, -28, -36, 240, 33, 52, 68, 5, 117, -17, 12, -45, -120, 26, -300, 62, 57, 133, -211, 36, -430, -161, 51, -102, -5]
8191e
$$ Imaginary data points
##PAGE= N=2
##DATA TABLE= (X++(I..I)), XYDATA
0@%%%%%%%qJ6j6J6k2L0m0M8n6P2q8J05j29J60j92K25k65L12l68M32m97N72o60
30c53P55q61R80j112J262j422J598j791K000k237K493k771L077l410L775m174
46b191M608n082N601o173O801p489Q253r103J0053j1121J2326j3705J5300j7170
60i092J9394k2089K5444k9750L5500m3611N5993p7413J24520m07987K43429O29237
72E43575p27866M9629M55840l59270l20404N11440j9474l23783K29640J63028
82B02355k70116R5627P9078k69591L6804K72954j22795m4609J45677j52667j36723
93a64006J84196l1179p4718K10498l4826k45925J58929J05628k33037P2273J86139
104A33972j99745L0990K66012k42679k25645L07269J0916k32532K69710R9958
$$ y = [0, 0, 0, 0, 0, 0, 0, 0, -8, 8, -8, 8, -14, 16, -24, 24, -32, 40, -48, 57, -72, 88, -104, 121, -144, 168, -200, 232, -265, 307, -353, 402, -459, 521, -591, 671, -751, 847, -944, 1056, -1181, 1312, -1459, 1618, -1792, 1983, -2191, 2417, -2665, 2936, -3237, 3564, -3925, 4328, -4775, 5278, -5843, 6483, -7222, 8078, -9092, 10302, -11787, 13657, -16093, 19407, -24204, 31789, -45624, 78896, -329091, -85662, 543575, -184291, -134662, 321178, -38092, -358496, 152944, 133470, -190313, 39327, 202355, -67761, 27866, 106944, -162647, -125843, 147111, 24316, -20293, 125384, -27283, -164006, 20190, -10989, -85707, 124791, 89965, -155960, 2969, 108597, -124440, -52167, 133972, -65773, -34783, 231229, -11450, -237095, 70174, 81090, -151442, 118268, 218226]
114B18226m22177P1893L41706k74255j33886L86763r4700l08978K93024J01137
124A78753l98261J00528L34632k24623j25299K71636p4930k13325J59125N3207
134F1443j37877J14669O3630j72049M0650J04130j37559N091J53674r4676o7774
145f6648J44574m4777j30752R2509K7416p4797J08106K9097j63766M0528R7067
156E8557j29106K0873J70938j14492r6845J74348m3095j80311J50704R6109j83272
167g5592N9901J59726j83977q1295K04311n3846j50404J71999N9550j97772M4545
178d2854J30285j36671l2696J58409n1575r6002J10024J0509j11499N0467N3507
189D1904p0661K7735O0643o8030j8599N2619l8872j4611O2752k5542l8400N0610
$$ y = [218226, -203951, -132058, 209648, -64607, -198493, 188270, 93570, -215408, 77616, 178753, -219508, -118980, 215652, -8971, -134270, 137366, 62436, -150889, 8236, 61443, -76434, 38235, 101865, -70184, -29534, 74596, -62963, -57872, 95802, 1126, -66648, 77926, 33149, -97603, -5094, 22322, -52475, 55631, 84728, -79038, -38510, 58557, -70549, -49676, 121262, 6770, -90075, 84273, 41178, -139133, 11571, 107680, -75592, -15691, 144035, -39942, -121237, 83074, 29228, -121176, 50823, 110373, -87399, -42854, 87431, -49240, -81936, 76473, 24898, -71104, 38920, 49429, -62070, -11603, 41904, -28757, -1022, 59621, -8409, -27008, 25611, -13261, -27872, 34880, 9338, -29062, 21548]
201B1548j6800n1714N5471J4010o3474M3803M4216p7982L963P4216n9846l3934
213d6523R6362j7759q4249O8755L5251r6463K2316P9336p0265l2593Q6170k3436
225A6902o6832N9815J8464p0000K9398N1684n3433j0416N3264k8039k9631M9266
237B0442N49m2241K4431J8477l4249O162K3022k0631j809J7561j8699n009K1178
250I184j5539q874L0572o567k6733J9938Q797k6585J2623K2375k1315l797K1002
263A5081j6595j2706K4543n378k0773K3082Q448l1645O698K5149k1567j1166K9285
276A2456k401k3028J3060R781j5485L536J0931r924j732Q492p916l518J0839m182
290I09q795R431K930j1380K879Q840m800l405N666j33k038J855j092O39M090n186
$$ y = [21548, 4748, -46966, 8505, 22515, -40959, 2844, 47060, -30922, -26959, 47257, -12589, -46523, 49839, 32080, -52169, 16586, 51837, -44626, -22310, 57026, -13239, -45832, 40338, 16902, -49930, 9885, 28349, -41651, -12253, 39431, -14002, -24418, 28846, 807, -28824, 20442, 20991, -21250, 3181, 21658, -12591, -6429, 16593, -4038, -5847, 11714, -6985, -11994, 9184, -6355, -15229, 15343, 8776, -17957, 1981, 10778, -15807, -3184, 19191, -2124, -5921, 15081, -1514, -14220, 10323, 4945, -15828, 7254, 15702, -15943, -9245, 15904, -5663, -16829, 12456, 10055, -12973, 87, 9868, -5617, -2081, 8850, -1074, -2806, 5686, -2230, -5748, 5091, 909, -7886, 1545, 4475, -6905, -4026, 4814, 14, -3391, 2275, 2142, 104, 1959, 867, 1506, 5596, 410]
306D10n629P415K196q309J411O936n099o071L313K859j000P69J275K48J244j899
322F9k374K901L637k003j079K620o18m267j015K418J09j446j179P45M42q48l64
339b252J196j59L42N50K63J22K523Q08k133N96K93j528n07J602p31k25Qk742j292
358c266K273k56k717K697L518m160k371M417J835k097J054K150j841p76J122j385
374A97N81L183j957m241Q83J721l109r79M548J185m405r08L721k38l245K805M754
391D496k466m083L417K096m528L10N854k374o552L025L396o623m05Q231j913o608
407d727M586K454q216K285R223l784m109P808j076j0293M474P059p549q01J0725
422H059m872j1320P147M309j0058K546J0485n839n760P889p67p962O214N766o991
$$ y = [410, -5219, 2196, 4392, -3917, -2506, 4430, -669, -6740, -3427, -568, -1568, -799, 476, 724, 1968, 69, -2305, 596, 4233, 2230, 1151, 3771, 3153, -1114, -2129, 289, 398, -1048, -2227, -1482, -1040, -1888, -2252, -1056, -1215, -873, -323, -60, 62, 2585, 3393, 1260, 1856, 2149, 621, 114, 1716, 985, 760, 768, -1974, -3266, -993, -1249, -3966, -1269, 2249, -1911, -4282, 135, 1970, -127, 927, 3077, 1236, 460, 1582, 197, 778, 3961, 2004, -2237, -1354, 367, -2742, -3721, 827, 2012, -2393, -3301, 420, 182, -3063, -258, 4496, 2030, -2053, 1364, 3460, -1068, -758, 5096, 2722, -3830, -805, 2591, -4032, -4437, 3794, 1881, -4727, -141, 2313, -5903, -3618, 5605, 1821, -2288, 5520, 4444, -5849, -1375, 5684, -1865, -2666, 8059, 3187, -8133, -986, 3323, -6735, -4189, 6296, 457, -5303, 2586, 1819, -6143, 71, 5837, -1154]
437a154N38P490m307p258N215K771o204L13O733j465o401j185M624o15m917N112
453g10R738p414r322R144L239j2504O322J6412j1287j0532J3138m177j6038J4011
467B0J2214j7045M58J6032j7069j2461K3392J723j9506J5609J4070k5980l553
480a2096K4434j0477j4977K3152N506k3338L884J2645j5234l706J7170j933r485
493d455O106q13j0279K490P762J899J841j380k043K07p709k301J7330K141j5205
508d409Q859Q648k6321l988K9543p883j8544K4823L503l4062R814K3815k3373
521i575k649L4479j4778k5981K7252M093l3935J7203K7533k7907o566L0146j6740
534B575k5757K5468P349k3047J3299J7697k1776p609J4512p226l819J6006J149
$$ y = [-1154, -616, 6874, 2567, -4691, 524, 3295, -2909, -2596, 4137, 2672, -3729, -4914, -290, -905, -5822, -710, 9028, 1614, -7708, 1436, 4675, -7829, -1507, 14905, 3618, -6914, 6224, 2047, -13991, 20, 12234, -4811, -4353, 11679, -5390, -17851, 5541, 7264, -12242, 3367, 17437, -8543, -12096, 12338, 1861, -13116, 10036, 15542, -7796, -3912, 8733, -6501, -10207, 6963, 5030, -4455, 1651, 838, -9441, -6951, 811, 2710, 4551, 3171, 1128, 1335, -6374, -8675, 8655, 10796, -4409, 4450, 13098, -13223, -17211, 12332, 4449, -14095, 10728, 14231, -19831, -10017, 13798, -9575, -12224, 22255, 7477, -18504, 8748, 12841, -21094, -3891, 23642, -4265, -10831, 19315, 2575, -23182, 2286, 9635, -13412, -113, 17584, -4192, -11801, 2711, -4515, -8334, 7672, 8821]
547H821o631K938q580o620J1537m04l278J5958m920k1561J0345N932k1519J4205
561c777K6366k5260j0067L0712j8149l0299L7154J5979l9638J5327L3769m0031
573g914j8622M2492j0052k9828L6369J3290m1906O985K3852k9983m889L8873q766
586I901k1560K1109k613k7133J3541J7688j1689M956J1364j7359o988Q218o814
599g379M448J6394j0553o848J2207j4913j3321K5181K510k0163K0424J0300l3502
612a5215M589K6659k4393p397L9126j1317l1641K9445O526m2330J6003L5302l1650
625f293r668L9110j7346l4102K9330J1386k9132J6774K2476k7399o103K1375j5344
638d936q664K6359k011j7830J3359N73k0536Q589J1956j1139M996R491j4460k010
$$ y = [8821, 2190, 5128, -3452, -10072, 1465, 1061, -2217, 13741, 8821, -12740, -2395, 3537, -17982, -3777, 22589, -2671, -12738, 17974, -175, -30474, 6680, 22659, -16979, -1652, 32117, -7914, -26536, 15956, 5904, -23924, 12445, 25735, -16171, -9186, 14666, -15317, -20206, 18667, 9901, -11659, 9450, 6837, -20296, -6755, 10933, -756, 4200, 15564, -1795, -8783, -565, -7379, -2931, 13463, 2910, -3938, 8269, -6644, -19965, 5216, 7726, -12437, 7987, 18287, -15215, -10626, 16033, -8360, -15757, 23369, 12052, -19589, 9856, 16382, -25948, -9945, 25357, -6293, -15961, 23149, 5803, -28299, 1031, 12417, -16715, 59, 22535, -4864, -10967, 10408, -4936, -13600, 12759, 10748, -7082, 6277, 6850, -13686, -5097, 6859, -4280, 716, 10207, -4253, -6263]
652f263R520j2681J451K0709j0197j0635K0676o790k4504J9151J3749k4746Q921
665a639K3476k5504j2404K6366j0617j9509K9494O655l1596J1986J8900k9341
677a3733k068L3447j1729j9716K4251J410k7102J1121J7274j6791o63J6045j1880
690a34q606J1951m068p153J1778k69r561P868J070j0071O683N037q701N958P028
705H810j2354R30J1572j2222n524J8417m811j5921J4916N838k1797N557J7505
718A0916j5350n436K0105o860j4510J5018L503j6551R225J1760j5756j173J5350
731A0241r506j0630J4347J389j3120O463O907j0061j250P448l745p75M980k966
745b78j041M625m302k779Q711j556o527N950K006r199K200O273o078o98P295n659
$$ y = [-6263, 3257, -9424, -7973, 12736, 2539, -8096, 12580, 5790, -18714, 437, 14186, -10560, -1639, 21837, -3667, -16071, 10295, -322, -19831, 9663, 16318, -15278, -3292, 15608, -13733, -15801, 17646, 5917, -13799, 10452, 11862, -15240, -4119, 13155, -3636, -4299, 11746, -134, -8740, 3211, -857, -8010, 3768, 3499, -6062, 1806, 2876, -7195, -512, 4525, -4176, 1782, 8810, -3544, -2614, 8958, -3264, -8788, 9629, 4818, -11103, 3813, 9651, -12146, -6589, 10916, -4434, -9870, 10235, 3375, -11135, 3883, 7386, -9165, 60, 11820, -3936, -5109, 10241, 735, -9895, 4452, 5841, -7279, -816, 6091, -3970, -5220, 2228, -1517, -2292, 2688, -278, -1319, 3306, -996, -3775, 4936, 3380, -3147, 2803, 4809, -4390, -2190, 4083, -1995, -2693, 4602, -1057]
761a057m958P718o85p269P186M835r163J279P352n613l140Q060j383o292M443
776A313J551n859K559L684n198M7M486m506k388N950q80m108L869K222m695P39
792a214L817k066q73K537j031k137K176n70k259K786Kl622J212K423l312l94L937
809A412j167k271K095P74j978J651J513j689P97O00k243k39K605j486k114L107
825A367n35l353R84K222k192l37K569r22j394J813L02j608K458P65k393O36J569
842A951k019o61K708r81k515J262K06j723M29J548m79q10J100p43j25J256j14
859B90n4J443o61j626J578M79j494P41Q90k367l36J394j393j59J220j90j507J385
877c67M16j970J813K346j862n01K056r78k478K600J259k796N43J253k430q44J967
$$ y = [-1057, -6015, 1703, 1018, -6251, 935, 5770, -3393, -2114, 5238, -375, -3515, 4545, 3162, -3130, 1313, 2864, -2995, -436, 3248, -1950, -1903, 2583, -1923, -4311, 1639, 759, -3349, 520, 2742, -1953, -1214, 2603, 537, -336, 2201, 1170, -967, 1209, 639, -1620, 1166, 1168, -2454, -1242, 1181, -2131, -2525, 1412, 245, -2026, 69, 843, -1135, 516, 2029, 340, 1137, 1737, -506, -745, 1860, 374, -1740, 1367, 832, -2521, -1537, 685, -1507, -1844, 725, -197, -1591, 222, 524, -1084, 1374, 2139, -254, 382, 1951, -68, -729, 1979, 998, -1517, -255, -49, -1772, -1343, 205, -274, -1084, 16, -727, -852, 404, 290, 236, 1679, 1018, -608, 970, 1449, -45, 696, 1586, -781, -1117, 277, -1116, -1275, -55, -245, -1752, -367, 49, -1921, -108, 2238, 376, -125, 1931, 953, -1525, 1075, 2334, -462, 81, 1334, -1096, -1940, 27]
894B7l29j178J461M37k245R7J810K40m01J150O43j168r83J270L03q18J03J260
912A679j264k098J406N92k107L78K422j486j579K188M11k743J983K219j865m87
928c51K954j259k255J717P83k537N86K320j853k112J899L35k756P09L259j134
944C05j915K121J003l331N71L512n34k507K705J100m425m81L175j021k322L849
960A805Q19n270o24L756k505j294N720J033n073Q95K870m226p32O384M31m366
976c77J474J365n148j225N401Q38l605J708J923n121k098N006J192k810K952K358
992C833m464k856M611k0l545M437L499n431k871N011k581m638N035M837n841j429
1008b413M721l035n618N662M013l942N46M802m056n257M312K690l237J350M629
$$ y = [27, -302, -1480, -19, 418, -1827, -1730, 80, 320, -81, 1069, 1712, 544, -439, 831, 1134, 316, 419, 1679, 415, -1683, -277, 315, -1792, -1414, 1008, -478, -2057, 131, 542, -2201, -218, 2001, 136, -351, 2603, 1344, -911, 806, 1589, -948, -362, 1958, 105, -2007, -108, 227, -2529, -1820, 1439, 305, -1610, 511, 1514, -1817, -1246, 2266, 1732, -775, 1930, 3030, -1395, -1876, 1299, 278, -2044, 1805, 2624, -2646, -3270, 486, -2019, -3313, 2407, 3440, -1633, -738, 2132, -2094, -2826, 3558, 3989, -377, 1097, 2462, -2686, -3911, 1490, 2328, -1277, 431, 2354, -2767, -4865, 141, 1333, -1477, 1475, 3833, -631, -3487, 1124, 1104, -2441, 1996, 5495, 64, -2807, 2204, -377, -5015, 20, 4857, -984, -2413, 2308, -727, -6345, -683, 3330, -612, -66, 4736, 680, -4577, -265, 2425, -812, 538, 5167]
1023E167m016m838L191N66l840K769N579l606m509M164L69o164K538P509l065
1038A814l854N594k77q394K778O688m184j683O743k171q356K736L664m519J356
1053b065P240k714o444L005J851m802J993P455j501n472J869J549n149m07P194
1068C602Q20n569L57L315n831k594P437J446o040L514M060p933k018Q686j665
1083A587n775Q116L017j0817O96Q265o360m427J0323O60r808K931N384p711j708
1098e627R171j250n257L972J405n787O65M679k48j085J834k89l155j353K224J996
1114A895k540m26L892k579n529M389L929o848O05R106m883o821Q004K002r875
1129e679M747Q927q509l339R929m308r628Q763M548j0149L334Q000r066m938J0063
$$ y = [5167, 1151, -3687, -496, 70, -3770, -1001, 4578, 972, -3537, 627, 996, -5168, -2630, 4879, 1814, -2040, 3554, 3277, -5117, -2339, 4349, 165, -1518, 5225, 3054, -5302, -2566, 1098, -3421, -2065, 5175, 2461, -3983, -978, 873, -3929, -1936, 5519, 4018, -1454, 415, 1964, -3185, -3592, 3602, 4422, -1147, -790, 2525, -3306, -5900, 1537, 2983, -3057, 457, 4517, -3416, -5434, 3252, 1587, -4188, 3928, 6945, -3872, -3176, 5089, -1271, -5698, 4625, 5285, -4523, -1592, 3792, -3919, -5627, 3544, 2294, -2963, 1009, 2414, -3373, -2708, 1971, 1723, 638, 2472, 2183, -972, -2325, -101, 1895, -645, -1071, 2821, 242, -5287, -898, 3031, -3817, -3212, 5894, 1011, -5810, 2194, 4196, -5679, -932, 7995, -514, -3853, 6076, 1768, -7860, 903, 5451, -4698, -1364, 6636, -2430, -7368, 2695]
1144B695j480o666P473M304q521m16M796k892j376N029K20k812L00j530j022J249
1160f49j96J461K060l269k436L904k212l089O708J555o595L228M878r121p24J0547
1176F050m470p024J0051J158j2757M153Q640r321j842J1686m155r121P828K348
1190C224r078M788P159p084j426O942m363m344O197P93m588L087J481m699N81
1205a330J602k210J588J513k855J122K320m228M41N077l252k414O427j401n908
1220c508N227J905p746L472N794o987j469P854m812o147Q349R79q390N152N725
1235E398q479q91Q289m037m138P356j69o346L649K496n753J876M095m190r55M096
1251B297l174k408M047m37k890L730L40l797K250J651l451J970K864l421m31L954
$$ y = [2695, 1215, -5451, 2022, 6326, -2195, -2611, 2185, -707, -2083, 2946, 3166, 354, 654, -876, -1898, -649, -845, 616, 2676, -593, -3029, 875, -1337, -4426, 2282, 3837, -2758, 470, 5348, -3773, -4497, 6050, 1580, -5444, 4607, 5765, -6992, -2839, 5801, -3520, -5362, 6324, 2169, -6952, 876, 3224, -5854, -1066, 6093, -991, -2417, 4525, 162, -4182, 2015, 2808, -1780, 1307, 2788, -1911, -1330, 272, -1938, -350, 1163, -1692, -570, 1750, -2478, -2037, 3040, -212, -2626, 3801, 2400, -3508, 1719, 3624, -4122, -650, 5144, -1843, -3312, 4542, -270, -6417, 1932, 2911, -5479, -327, 5398, -3081, -3972, 4317, 280, -3858, 3498, 3329, -3017, 632, 3128, -2625, -749, 3346, -844, -1799, 2297, -877, -3285, 762, 325, -2565, 1165, 1505, -2292, -42, 1609, -1842, 128, 2992, -429, -860, 3094]
1267C094l430k487N171j072m254L930J126n338J687L832l879r01N224k841k877
1282c015M759p8m355L974K127n124P69L996l766j641M580j330l476K864R57l524
1298b283J460J994k419N25K113j861r76L281j028k006L060k84k697J472J393k775
1314a031Q60J668k492l32K167j510j170K774p36k367K097J436k736R11K696k177
1330E8q56K300q66j468J490N06k149J051P06k282L64J883j445q16K138o78j633
1347a697J584R50j113P57P23j268J11Q20o49j56J013q24r40Q33m02r93O86Q67
1365C02j328J47J027r16m8J558o40m74J557o43j133J163P00j841P66J035j536
1382c04j106J759J03k197J812K82j579r7J628p62l28J807j68j327P25O22j057
$$ y = [3094, -336, -2823, 2348, 1276, -2978, 952, 2078, -3260, -1573, 2259, -1620, -2521, 2703, -138, -3015, 1744, 1666, -2689, 1285, 3412, -1712, -943, 3053, -713, -2354, 2226, 896, -2580, 284, 1241, -2283, -823, 1171, -1248, -723, 1390, -471, -1447, 1834, 806, -1200, 1860, 1576, -1121, 351, 1744, -1031, -171, 1497, -995, -1327, 840, -670, -1840, 934, 198, -2169, -72, 1364, -1372, -461, 2235, 58, -798, 1502, 636, -832, 658, 1164, -985, 66, 772, -1510, -1146, 737, -708, -1524, 614, -64, -1697, -113, 837, -276, 481, 1204, -64, 47, 867, 218, 62, 1075, 251, -689, 144, -258, -1251, -565, 302, -1026, -879, 148, -768, -816, 742, 102, -372, 1185, 542, -591, 572, 1272, -569, 197, 1232, -304, -1410, 349, 452, -1745, 67, 349, -1230, -1327, 301, -461, -789, 1018, 850, -477, 248, 870, -187]
1399a87M14J132r42p91R77m65q67R7O64q5n94M4L49k84j76R84N12l64o17R53j8
1420G36j264P60J184j407k84J392j222j218J677K34k178J316J361k086m27K377
1436I51n86j938J864J383k049jK081j386j089J559K01j723N08J276j204q06J023
1453F4j56j274Q71J304q30j138J388O82j494K0K331o29j935J279P76k053m7K702
1471A861j131k297K292P3k909O90K689j952q68L120m25l268J636J912k307M45
1487d39K905q47k881J488R85k339J52K669q53k175R09P32j930n0K419L78j710
1504e87L92J329k071q03L271K76k247J199J387k595j462L080l72k801K361J806
1520B163l602p19L084j620k013L550J621l442M39K524k346j581L188P90k363P48
$$ y = [-187, 227, 1359, 417, -374, 603, 138, -729, -632, 32, -53, -647, -603, -254, -538, -714, 270, 782, 418, -199, 754, 736, -528, 232, 1416, 9, -275, 1117, -105, -1323, 354, 588, -1590, -274, 1087, -999, -1426, 951, 365, -1573, 291, 1674, -375, -376, 1705, 319, -770, 789, 990, -733, -225, 1051, -153, -959, 64, -92, -1366, -495, 809, -21, -1159, 229, 911, -583, -563, 1768, 1139, -796, 483, 1259, -794, -841, 1861, 730, -1567, 725, 798, -2111, -1421, 1268, -684, -1552, 1568, 1143, -2125, -489, 1423, -884, -439, 2466, 1619, -1262, 226, 1211, -1128, -976, 1693, 840, -1335, -426, 306, -1624, -1674, 745, 1123, -587, -195, 1134, -937, -1740, 1531, 1807, -440, 759, 2146, -449, -1911, 1169, 797, -2004, 357, 2163, -1439, -2158, 926, -694, -2707, 843, 2464, -978, -539, 1985, -361, -1942, 1246, 2036, -327, 421]
1536D21J674k645j526J962M60j613J081J828j814j975J820M53j459R35K698j434
1552H66k101J593O29k646J022L241j452k330K019J96l815P59L391j387j415K864
1568A434n39l651J195K961j579p58L534o56l724J168J847k001R3L084o44k961
1584a197O62Q04k326R2L157J33k730J190J290k818q9L279Qk409J974J338l176
1601h18r96K819l33j935J882J008k610r98K314o87j656K240J310k001m88J891
1617I42r23j740K125J936j962r08K148j103k621J569K311k347n63K945j399l250
1633b840K096J714k487O12L310j858k696K953L88l200K013K584k306q71K304j416
1649C00k356J942J469k155M24J181j148j178P75Q31j84o5P01J78r53n74J365K17
$$ y = [421, 2095, -550, -2076, -114, 346, -1267, -186, 1642, -172, -2147, -327, 126, -1333, -398, 2300, 866, -1235, 358, 987, -1659, -637, 2604, 1152, -1178, 841, 1037, -2778, -2019, 1372, -15, -1430, 1434, 895, -2756, -1561, 1400, -179, -937, 2597, 1941, -1783, -615, 1232, -769, -676, 2408, 1764, -1197, -535, 269, -2057, -1965, 1192, 1325, -1405, -215, 1075, -1743, -1832, 1447, 1455, -954, 1020, 2358, -818, -1814, 1005, 672, -1263, 619, 1627, -983, -1981, 333, -354, -2010, 230, 1540, -461, -949, 942, 19, -1721, 404, 2340, 378, -530, 1618, 515, -2106, -537, 1774, -573, -1136, 1809, 410, -2840, -744, 970, -1517, -905, 2405, 547, -2149, 804, 1192, -2008, 5, 2589, 283, -588, 1716, 300, -2056, -114, 1355, -800, -376, 805, -343, -1521, -746, 85, -99, -164, 537, 715, -238, -812, 553, 770]
1667G70j208J082J145k277j235K466o34k175K869J258m105O95L125k726j519M326
1683A857l09l873K755J831l524K05L637k156j912K850M6l116J726J325k623P31
1699e50J510j380o83J740r79m83J225q9n46Q44k27o74J211o43q92J732k85k004
1717a173J341J161k827O5L003k112j558L194n6l326K426J879l667J046L441k960
1733a23j446L650j094l173K959J304l721Q82K716k858j126K884q39j644K185l7
1749E19k025J265J009j323J066Q95j448J87J231k034K01J872j434r33J960j038
1765c0j986K394L88k287J532J310k823K60L019j817j240L032m84k892K472N64
1781A412k788R06K316k826n13K843j773j227K413l2k640J764J434k406M31K119
$$ y = [770, -438, 644, 1789, -488, -1723, 743, 109, -2066, 803, 2061, -2044, -1349, 1776, -950, -2469, 1857, 1548, -2325, 430, 2261, -1263, -1058, 2579, 423, -1489, 1361, 1407, -1709, 17, 1342, -1281, -550, 960, -420, -1103, 637, -342, -825, 400, 311, -235, 609, 382, -292, 919, 276, -616, 1116, 831, -1173, 168, 1329, -1498, -1433, 1570, -542, -2100, 1094, 1038, -2288, 138, 2017, -1650, -604, 2837, -123, -1569, 2081, 987, -2186, 773, 2077, -1644, -762, 1954, -904, -2030, 854, 15, -1629, 556, 519, -1506, -241, 768, -555, 511, 1406, -42, 145, 1376, -658, -457, 1415, -19, -952, 1008, -30, -2016, 378, 766, -1521, 11, 1321, -1502, -1242, 1777, -40, -1280, 1752, 1268, -1624, 848, 1412, -1376, -470, 1846, -980, -1493, 1350, -423, -1650, 763, 731, -1909, -145, 1289, -1117, -686, 1433]
1797A433j277o58J896j001r99J679o25j522J660J83j894R44R09j996Q00J354j524
1814f38m12J622l81j391K135N0j877J257Q98k089Q60J352j572p42K005j183j558
1831a664K070K28j887J056R38j812K86J742q87p98J687n65j200J547n6j340J043
1848C88P35j470L8R61q77m41R66o03l00P68k49o42R58L49j140P30R26j369j14
1867c86J502r69m97J076l95q64N25K02p77N68M93j065l29J329o11p75J733p8j063
1886c81L79P68n53j68O34j28n28O34n56m58K86J60k81j13M07l93k26J47L02o9
1906a37J2N2L81R6m85K91N46n41k72N14k86o61M92L68r52N9R80o82o37Q86K85
1927C09q34M59P23p57l4J216p20o60Q53L16j133K72P43o25r21J044j88r59K35
$$ y = [1433, 156, -502, 1394, 393, -606, 1073, 448, -1074, 586, 769, -1125, -181, 728, -1268, -468, 886, -638, -1050, 572, 191, -1200, 935, 985, -892, 365, 1263, -826, 34, 1386, -186, -928, 1077, -106, -1664, 406, 634, -1253, -197, 741, -1071, -785, 957, 70, -728, 959, 394, -806, 741, 685, -655, 388, 1123, -347, -309, 652, -225, -666, 300, -303, -603, 165, -84, -726, 232, 581, -559, 171, 1097, -272, -386, 1116, 147, -350, 726, 331, -533, -8, 194, -583, -15, 478, -587, -916, 413, -198, -973, 760, 682, -381, -2, 766, 213, 45, 679, 551, 23, 657, 101, -357, -71, 89, -192, -305, 102, -291, -517, -370, -68, -137, -125, -73, 308, 404, -81, 210, 756, 215, -57, 457, 171, -490, 2, 370, -582, -523, 457, -225, -862, 24, 309, -525, -66, 657, -100, -134, 1082, 362, -298, 555, 871, -262, 10, 753, 128, -793, 251, 63, -896, -661]
1946f61R90l27m39O05k0o05J07P23N1j69L28K41j249J93N09j81m11P57J04j377
1966h31J82P61j26q68J206K49j196j31Q97j75n38J350N56j630Q3P72q41m91J476
1985G05k62j036O55K02j258J9J151l96k12O85L77j269L22P80k86m26O91N30r51
2004B1o35J163o37n75Q23M34r46n91Q25k87n27Q69R09j038l62J093n87p11R18
2023A59J109j278N8Q76q29j135J054N40j448Q86R85j270n36Q34j43o43P88R82
2041I89j163l1O69n03n70O87O12r7n77J07p1o67J1P77m7l63K36J67j177O1J427
2062D77k28n40J380l07j587K29J096o59P2J546p29j458O25J54j403P30J508m72
2080D34r77M97l36j087R91Q61M2J70J26r44k68J1K36R00J1k9j01p30q53M39O08
$$ y = [-661, 329, 2, -437, 168, 148, -457, -350, 373, 424, 255, 583, 824, -425, -232, 277, 96, -315, 442, 546, -831, -649, 112, -14, -882, 324, 573, -623, -754, 143, -32, -570, 780, 1336, -294, -211, 561, -280, -771, 705, 443, -593, 62, 264, -994, -975, 176, -220, -432, 253, 630, -639, -317, 463, 177, -249, 442, 972, 21, -614, 549, -88, -663, 160, 594, -352, -943, -118, -405, -932, -63, 846, -192, -554, 539, -48, -759, 159, 1268, -10, 48, 924, 95, -1040, 14, 554, -894, -8, 977, -293, -829, 5, -138, -781, 7, 989, -174, -205, 464, -39, -609, 78, 690, 593, 16, 123, 52, -615, -604, 173, 126, -237, -1, 166, -1011, -950, 477, 249, -291, 1089, 782, -805, -576, 520, -139, -67, 1479, 750, -708, -83, 71, -1332, -602, 906, 434, -543, -46, -382, -1469, -478, 383, 425, 595, 721, -223, -491, -480, -244, 656, 667, 638, 537, -193, -1046, -607, 1]
2101Al95M07Q18p57j353R88K36l95P93J130j007o05M50m65p26J502L14r14K73
2120B95M81j643j47R42j75q9P54K34j201l04N86O9M9J045Q5l07o29k12k37J37
2140b67K86O11p4n39p10K35k96O1Q01K89m29L52j70j192L77J223m49%R29l09j326
2161e97M8R18q02K27R71k80j038L41l06n21O90O26N2p8j7j34o52P51M29K92l59
2182E61j54j75n52l49P68O6l74K5L11p92j58O77L88o81O19N40r12K05R9r1QN57
2204E86L05j069L6N99p65k19P42m2o52L98M6k54j66K06K21k85N64J51J01o17J8
2225i6K62N3J00J71l86l37M78l99m34L44N71l90n93J099l93q03P49O18m99j26
2245a1Q53o77l7J42k1l75P8L29l39k25j03Q9k13L67l0j89K05J73k35L68j1K3J03
$$ y = [1, -394, 13, 831, 74, -1279, -291, -55, -450, 343, 1473, 466, -139, 311, -154, -880, 622, 936, 22, 295, 776, -867, -1014, -72, -247, -336, 418, 652, -549, -853, -267, -198, -149, 896, 981, 674, 45, -167, -404, -267, 19, 630, 556, 17, -693, -458, -754, -693, 108, 397, -32, 320, 150, -1042, -665, 558, 109, 109, 1038, 729, -597, -549, 369, -433, -206, 765, 485, -553, -212, -518, -1039, -349, 277, 329, 251, 234, 100, -552, 199, 628, 920, 561, 407, 232, -320, -669, 99, 165, -209, -184, 127, -665, -823, -146, 242, -439, 180, 720, -192, 13, 112, 21, 29, 586, 891, -178, -142, 457, -308, -527, 215, 173, -479, -81, -35, -289, -455, -249, -28, -313, 251, 402, 503, -114, -96, 166, 219, 319, 490, 104, -233, 245, -154, -588, -244, 327, -63, -656, 443, 50, -753, -4, 614, 115, -11, 842, 165, 128, 270, 249, -126, -48, 281, -58, -283, -386, -297, -510, -143, -173, -362, -157, 16, -219, 149, 138, 161, 264]
2268B64k30p2J30j1j85O30K0p65K40J50l68k82R29m62n84P45j41p11O43O64r00
2289b96M44O22p56k17N66J32o57K71L98p97K00K57k96k24M68k81n2L28m18oO20
2310C06m17o6P63j41p02K32N54n70K29L76q82K17L02m14j97M65N3r06Q45K05p14
2331d62M40N21l25l96N64O1o02N02j7m78N6K87o06J39N51o09j49M05K11o36M44
2352i9K85j02Q7J64k82J62O0r5l1L40n27q8L14m18k21M36J2n70N37l5l54J60L84
2375A19j94p3N39j44n21N84M28r22M53L78q84j43P45l76o70P76j32l26j19L27
2395a55n7N5K92j30k87L26L74l71K65q7j02k07K52J03m61J52O2J19l72j87J30
2416b86J69m41N34K85l31j48L56P4o59P18Q6n72Q7P22m70l65N32k83m60K12N39
$$ y = [264, 34, -38, 92, 81, -104, 526, 546, -219, 21, 171, -197, -479, 450, -12, -596, 149, 8, -703, -60, 604, -296, 148, 770, 14, -203, 363, 495, -162, 109, 507, -290, -90, 167, -129, -353, 115, -166, -218, 110, -308, -314, 306, -111, -177, 586, 445, -257, -25, 529, -41, 188, 564, -318, -101, 201, -213, -410, 55, 108, -798, 47, 252, -462, -22, 499, 174, -222, 342, 403, -199, 303, 286, -192, -136, 151, -455, -316, 235, -374, -523, -118, 93, -543, -99, 186, 84, 171, 335, 53, 215, 275, 180, 149, 489, -38, -126, 188, -230, -451, -15, -3, -573, -36, -71, -425, -265, 119, -75, -148, 391, 247, -274, 310, 738, -184, 269, 647, -237, -380, 365, -11, -681, 95, -37, -363, -482, -155, -212, -157, 135, 5, -282, 44, 418, 47, 312, 225, 123, -84, 168, 271, -190, -38, 24, 143, -229, -416, -286, -117, -558, -24, 261, -70, -218, 138, 212, -447, 271, 357, -215, -128, 594, 124, -241, 291, 8, -452, -240, 299]
2437B99n79k77Q22q1o35O42O5l51l6L68J38m98L63J32m03n1M75l36n24M99M7p39
2459f60L83M89l46k91M75J93o71L11O63k49m01M22L33q74m6Q25m44m45N12r4m61
2480c76n3M62o6k85L78R3o79K19P12l86k77P22j01q09M94M81q21J36P76k82p85
2501d47L83J98p57J72Q57l34n12P88r9o89L34Q15p06j79O49O4j151L74P65p56
2521b31p0O54j50q73M06Q39q20j52O22K37j164M11R72o45k97O72L91j331R47J48
2541E66q23m0R10k09j296Q73N10j139K72R79q47m05O82N71j208M07Q02l87o55
2560d37R18J29q84m2R17n30r41J462m45n55O3O79p03k33O22K00p46M03P14n62
2580B9m50R28K02j304L73R88j214j61J083l89q77P41P30j179l97J251l68n98P98
$$ y = [299, -280, -557, 265, 184, -451, 191, 256, -95, -131, 237, 375, -123, 240, 372, -31, -82, 393, 57, -467, 32, 79, -660, -277, 212, -134, -425, 50, 243, -428, -117, 546, 297, -104, 318, 651, -223, -269, 556, 112, -333, 179, 85, -376, -429, 33, -33, -318, 60, 153, -526, -307, 405, 19, -258, 464, 363, -446, 48, 529, -292, -156, 620, 338, -447, -64, 134, -623, -451, 406, 72, -440, 348, 249, -440, -106, 709, 3, -176, 473, 537, -614, -240, 525, -231, -301, 353, 203, -670, -264, 575, -245, -397, 225, 462, -702, -291, 681, 36, -261, 411, 802, -529, 418, 566, -257, -297, 613, 404, -892, -19, 491, -648, -376, 603, -244, -649, 33, 604, -604, -197, 605, 218, -437, 481, 610, -274, -316, 601, 71, -870, 592, 147, -408, -345, 334, -369, -602, 20, 220, -526, -123, 591, 29, -421, 507, 709, -595, -222, 766, -448, -609, 474, 85, -792, -51, 679, -500, -897, 354, -14, -612, 186]
2599A86M40q76J07O84k51p16J061M4o65k05O46m59o25Q14L39r38j69Q17l91n10
2619f67Q47P43j188J6R68o63p27J254K65j260O17O00p88r04J375j58j016O38M12
2638C64j078R3J111m84p77Q51L88p98O3R01l86r13J059J1m62k17M59k6n72N03
2658I0J40p17j06Q06m1o64K75N18n50j88J064l93p33Q09K68j235J84J235n84j005
2678h27J007N6j046K80J220q62n22J221o24n27M74M08n73j08Q91l27j27k02M81
2697B93m72J83J82j16l80j42M36j84j83P23k37l34J14M75m21m34O89K19m54J18
2717G5O83r37O4M47j56o10P72K06j077N8P54n35k31P44p6p07K70N00k61J53K61
2738C97q2m97M25J07k43r1k32P6p5p3p5O26n22R3K74k67j98M41K40m38J53L96
$$ y = [186, 626, -250, -143, 541, 290, -426, 635, 679, 14, -191, 455, -4, -629, 185, 524, -414, -583, 234, -157, -667, 180, 923, -265, -249, 719, 56, -671, 583, 848, -412, 205, 805, 17, -887, 488, 330, -686, -48, 364, -714, -621, 490, 6, -771, 80, 468, -330, -267, 634, 248, -665, 394, 405, -57, -274, 185, 159, -413, 90, 230, -487, -593, 213, 172, -492, -217, 301, -249, -437, 627, 234, -499, 310, 578, -657, -473, 762, 178, -827, 180, 236, -810, -530, 690, -172, -694, 527, -97, -624, -150, 258, -315, -423, 468, 141, 14, -188, 293, -179, 4, 186, 70, -310, -452, -16, -200, -383, 340, 103, -231, -117, 358, -63, -497, 192, 411, -43, 75, 758, -179, -115, 332, 176, -434, 338, 544, -533, -475, 279, -256, -487, 257, 181, -526, -256, 244, -17, 136, 397, 315, -182, 243, 350, 107, 16, -216, -140, -215, -288, -363, 263, -259, -166, 108, -159, -357, 84, 324, -114, 39, 435]
2760D35n55J46M06m37k11N09K03r11J04M19l16n4M62k22r1n2K69k95L25R0k2k84
2782h2K10k7J05J24J42m14rk23K46k29k7J9K83p8m98N97j39l64M21L05n12L35
2804A85K79m54l11O69k31l14K07j2l92L43L1N2l62L14j27l54M55J93k48J14j15
2825g8K55l36K08J60j24J72l48j04K57l12J71N6J40j76n3J97m34L15K43o74L60
2846a05K58k82n0O17k39n42N95Ql87rL72k90k55L99M9n15M34k32k40L12L36Lm13
2869a76L67r1k17L50J74m85J65o1l49K17J88j66N1j74m9J20R0j96L40P9k83j32
2891b38N24K0k81Q0L07o31L39k5n16J77L28j61j46L21j5l40q1K25k12L29J32j99
2913f3K01n9O6j79P7K05k14J95l53m5K74q6k83J4OR5r6J94J5L1K29l78K08J53
$$ y = [435, -120, 26, 432, -5, -216, 293, 496, -415, -311, 108, -208, -262, 200, -22, -113, -165, 104, -191, 134, 224, 202, -82, 128, 101, 206, 330, 472, 58, 49, -174, 72, -157, -184, -165, 118, 40, -458, 139, 0, -364, 57, 362, -150, 185, 464, 10, -301, 368, 137, -177, 30, 18, -374, -31, 0, 52, -310, 4, -123, -477, -22, 171, -77, 37, -78, 177, -159, 49, 209, 85, 257, -91, -195, 62, -250, -79, -23, 117, -59, -112, 85, -349, -34, 209, -465, -105, 153, -129, -179, 438, 199, -343, 252, 260, -127, -136, 236, -54, -309, 90, 139, -376, 58, -174, -414, -102, 234, 237, -176, 191, 100, -117, 233, 407, -78, 87, 26, -323, -106, 82, -84, -33, -207, -256, -136, -46, -242, 98, 177, -106, -238, 286, 306, 25, 105, 412, -219, 120, 95, -421, -244, 84, -77, -223, 98, 83, -257, -338, -113, -325, 4, 136, -63, 138, 79, 145, -34, 43, 248, 34, 229, -124, -169, 105, 19, -264, -250, -244, -149, -245, -51, -36, -5, 224, -154, 54, 207]
2937B07n78K67N63m02j84N0N90m37k70K88j09l61M04K77o39k4M53l26l9L36K06
2958B72k72K9N86q25J96J02J09j09l9K45k96l91J73K67k15j98L14k2j19j70L56
2979gn1l7K79p8j42M59j35n47J29M28l39j92K21N5m80K89L84l75l91Q39j34n85
3001d10K81N69m92J2L29j65l23J60K60k52j34L96K29p37m9L88m69O1L87Kn80L97
3023a40L30n09K97M52J85n89J39L64o77l6O29m55k47K20J99n61K04J30k06l44
3043f15Q04J10m10n4P45o09k43P05J70n54j71P79j008l53O78M31p89K78M91o81
3063b96j64N35K11m68L18L91l60p59Q12o6n47L98O78o59k78N31J12p54M06N27
3083E68m45o83N65j06n60M52N94m15j8M30l10p50N98L42n28J28M31j87p65P18
$$ y = [207, -371, -104, 459, 57, -127, -77, 513, 76, -194, 94, -15, -376, 28, 305, -334, -358, 95, -231, -270, 66, 272, 0, 29, 615, -210, -14, 88, 197, 88, 49, 294, -2, -393, -220, 47, -168, -366, -52, -74, -193, -363, -7, -58, -95, 184, 106, -36, 423, 288, -259, -130, 298, -41, -233, -12, 43, -437, -148, 236, -139, -530, 309, 175, -410, -129, 440, -52, -40, 289, 124, -199, -39, 221, -31, -165, 231, 460, -277, -326, 62, -407, -346, 41, 43, -537, -140, 190, -319, -22, 430, 615, 26, 165, 529, -148, -184, 445, -10, -257, -37, 162, -399, -195, -65, -271, -615, 189, 299, -111, -165, 580, -29, -272, 433, 603, 49, -122, 657, -351, -704, -26, 405, -384, -106, 385, -296, -460, 75, 286, -182, 136, 527, 167, -592, 220, 154, -393, 5, 683, 24, -254, 277, 389, -365, 41, 568, 123, -560, 5, -101, -661, -209, 385, -30, -48, 382, 72, -678, -80, 262, -266, -138, 293, 106, -659, 59]
3103E9n2n25M71N97n74l71L04P3l88K02O55o6n39N34j83n36N8O80k37l42M27j5
3125B32m94J38L14m33M3J59J05l91K26L04n88M42L14M1p04J97O68p64k15Q34k89
3146A39l62N54m5p20k7M45J57o40P68j80Nk41M21r6k08M77j19l83J65L23l64j35
3168f6%Q49o93m16O65m37k44K69M19m81Q5J98k29k42L04M03o07J80M09m90k7O00
3190D49m66k05J42L86n82j17N73l78k89L89J86l23J55M72m00l4k8L57p4l25K62
3211A50J23n12L03J60j37n09P25k96n02P19m2k00l25P13k64l30L60M3M8r2L20
3232D55k46r8P4j13j9l55M13k53L9M09l39k84O8L01j64rK54j63l0J17j25K89j83
3255C8O3Q6k29j72J34j4k04R2N77m82j64M09j73j92O80l74k89J71N68p25L4K83
$$ y = [59, 7, -518, -47, 550, -24, -395, -91, -18, -406, -204, 451, 385, -154, 380, 197, -339, -281, 399, 162, -180, 247, 232, -262, -124, 190, -243, -200, -41, 64, -327, -101, 203, -385, 57, 371, 412, -292, -95, 573, -191, -406, 428, 139, -223, 331, 286, -434, -461, -16, 141, -499, 269, 89, 94, -147, 274, 178, -30, 447, 328, -55, 110, 433, 69, -66, -66, 783, 90, -326, 339, -98, -342, -73, 346, -135, -50, 148, -81, -323, -19, 384, -223, -43, 366, -124, -151, 449, -17, -222, -80, 306, -276, -393, 180, -198, -487, -98, 88, -235, -80, 392, -8, -42, -70, 287, 213, -112, 150, 273, -239, 64, 224, 87, -422, 303, 7, -495, 224, 182, -18, -343, 370, 106, -224, 136, 179, 227, 135, 455, 209, 111, 185, 72, 53, -302, 111, -142, -103, 306, -33, -317, -249, 52, -112, -121, 133, -30, -60, 57, -68, 221, 38, 101, 187, -42, -214, -80, -94, -298, -206, 371, -111, -275, 134, -39, -231, 449, 75, -214, -43, 525, -200, -166, 117]
3277A17K39l03l79M09l21%K21j91L0jJ82j56L41k95j58N32k51K35j47k23L16J36
3299C33k70l00L24Jk69k51N22k29J45p7J8j24K54L0n57L79L6p3K46Q1k34o3K53
3322A75k6l17n4L23k83J77N9k80Q9k24R6K99n5o8J97r5J67k89J31J54p7J91k38
3345E2k50L44l4k62J21J74k41R2j06Q9k7RJ2o9n3M8K62j9J83j71k38lK45j68o4
3370g4R6P5j47l00N61l19O0j61J75J10j85J61J97l60L87kl01K4j12L15k89K14
3392A25j92l65N05n7J8l53K90n7r5K77l53l0M84j10j34k99O27k46j50J68j23J44
3414G4j08J42L8m31L8K24j94K80p3r0J16K23n5L7o0j46J05m1p6R6J89l05J71j53
3438Aj67m2N70m92j97K94r1j23L58mj83J97J81j88m38M50J57l63k8K12j97J39
$$ y = [117, 356, 53, -326, 83, -238, -238, -17, -208, -178, -179, 3, -153, 188, -107, -265, 267, 16, 251, 104, -119, 197, 333, 63, -237, 87, 88, -181, -432, 90, -139, 6, -71, -53, -177, 77, 107, -450, -71, -35, -108, 138, 219, -15, -78, 175, 149, -168, -222, 101, -182, -5, 54, -226, -137, -361, -265, 34, -21, -89, 108, 13, 180, -109, 22, 176, 99, 290, 52, -198, 146, 112, -150, -29, 145, -96, -4, -110, -21, -48, -39, -27, -96, -149, -101, 161, 142, 325, 154, -84, -87, 158, -10, -74, 22, 97, -50, -350, 211, -108, -48, -209, -34, 76, -109, 52, 249, -111, 276, 274, -27, -3, -115, 200, -89, 125, -67, -432, 73, 16, 34, -319, -29, -86, -181, 96, -257, -287, 197, 87, -47, -346, 281, 35, -115, 53, -70, 74, -34, 108, 146, -285, -247, -23, -217, 63, -10, -100, 16, 239, 184, 221, 161, 15, 120, 79, 3, 99, 288, -17, 154, 1, -166, -208, 362, -130, -327, -33, -124, -247, 111, 107, -76, 121, 302, 114, -324, 126, 283, -80, -108, 104, -93, 46]
3460D6l3P9l51L29m16K11j7QJ60k21L45j13M3P0K8r3P1m7J97l89m12K41M25m60
3484b99J51J41m4j32K14j7k50O7K11N5k05J18J00j55N2K90l81J1K57l12J9J23
3506A4R5k67J26K23q7k61K8J3j8J7N2L98l12J46k18m5j4J22p2O3J98k51n6l08
3530d14L08j0L3P3J47j34N0j8J66l58N02j44k06J8J38j11P4J9J90n84J56M17k67
3553D5j26j2J76r1k39M38k50J79L7j30l1P1L85m56q6lM42l46L7Q4j79o7K58j95
3577e9j56R9K90l37K63o4l4j31K45K91l47M9r0M1Pk90M42j62m14L40k62J05O6
3600a08L9n0K98j58J11l52M96l4k61J10N5j69l21M44j72k34J24K67k27MK34j78
3622h2j57N4L52l14M8M11o79N10M8o3l7j08O0N2k10K18q8j09j33L34K57o04P4
$$ y = [46, 13, 92, -259, 70, -346, -135, -152, -144, 16, -205, 140, 27, 70, 140, 168, 75, 146, 99, 296, -93, -505, -264, 161, -299, -148, -7, -51, -183, 31, 14, -236, -169, 42, 97, -108, 10, 110, -45, 7, 297, -84, -73, 184, -128, -109, 14, 109, -158, -32, 191, 104, -157, -129, -116, -134, -117, -65, 333, 21, 167, -51, -96, -110, 12, -60, 3, 201, -50, -106, -414, -106, -116, -83, -10, 137, 3, 53, 35, 201, -157, 345, 201, -5, 13, 151, 40, 114, 133, 323, -261, -105, 312, 45, -81, -93, 83, -8, -247, 191, -59, 120, 157, 27, -4, 67, 452, -4, -90, -93, 349, 3, 40, 124, -55, -122, 136, -59, -215, -116, 174, -163, 100, 36, 2, -129, 116, 407, 60, 109, 19, 60, 67, -223, 219, 57, -357, -17, -279, -174, -108, -69, -119, 179, 21, 132, -220, 276, 242, -19, 91, 146, -23, -344, 100, -72, -306, -182, 85, -142, -138, 96, -82, -239, -185, 167, -147, -99, 312, -367, 143, 191, 128, 91, -17, 43, 95, -115, 103, 15, -94, -227, 107, 364, -240, -166]
3645a66K49j84l9M44m3k19Q5Qj47J98R3m01K31J05J2m56J59J21Q7k25L7J95m14
3668b70K26J01j90J64K48k9o9k07K57J30l71J79j19j17K54m8m05K81K20j03l31
3689a99L00L4l31KK15k72J96J09n9N1l2K82l86M9P8K4k07N3P1j3j05J87j94J1
3713a36J74k48K93Mp6L22l63K6K02j03k38K07k8k14M39k05j19j61K40M1k24K40
3735G3k20J22l36N70q6j3j18J20k58L77L2l03K50o9l41P2J09P8j75j07K82j42
3757h3mQ1l2J88k24m6K26o9j2l0k39L66j35K38m39l4L12J38m95L91l82n6L99j85
3781a26Q6j70L53l46K06j50J93k1N3R4j37k13L10j17k37N5K57m56M56l67J47Q9
3803d1J23k27N9l2J01J36j10Rl0r7K64k14K18q1k09K07L9j40J67k79r1P5K87k69
$$ y = [-166, 83, -101, -140, 304, 261, 42, 127, 135, -12, 186, 279, -122, 109, 214, 226, -230, -71, 50, 137, -88, -51, 144, -270, -44, 57, -133, 31, 279, 250, 181, -26, 231, 361, -10, 169, 50, -67, 187, 139, -266, 15, 235, 132, -199, 101, 135, -196, -194, 21, -251, -55, 54, -5, 46, 14, 296, -90, -41, 37, 61, -146, -93, -22, -35, -140, 47, -147, -136, 38, -210, 83, 87, 11, 333, -30, -4, 198, 95, -143, 64, 36, -178, 261, 56, -63, -224, 16, 57, -167, 73, -147, -25, -361, 209, 123, 110, -8, 112, -146, 231, 263, -40, 210, 141, -200, -128, -19, 59, -116, -223, 59, -83, -87, -6, -38, 150, -74, -120, 106, 37, 25, -5, -244, 122, -13, 225, -214, -248, 64, 202, -293, 98, -284, -340, 59, -126, -40, -210, 143, -203, 3, -147, 46, 25, 78, 172, 35, -178, 132, 15, -222, -167, 90, -366, 90, -277, -130, -41, 82, -145, -86, -118, -17, 119, 9, 18, -12, -109, 155, -59, 159, 78, -131, 76, 115, -25, 142, -137, -228, -153, 134, -135]
3827a35O3L43j82k40L67k68l3L04p1j30K99k24l04k8K3K25q4K40k89J01j79J51
3849e1q9PJ17J3j87M75j65N0l1k6j91n4L32j90j35J29k06k8L02k52l06O94r0j81
3873f3P5J75n4j79J90R4m34L90j05J6j59J03j55l96N21j09J8j3Q4J1k98M2J28
3896a18K40m8K1j54N2J01Q9k31K7mk04K33j21N9lj67L43j9J3P2j01j35j30L17
3920A32p7j18J66M0K8j32J30k61K2Q5K01j89L0m4J72j15k9J01q2q7k02L07l44
3943b66J31K09n0j3K03j44j10l9L3j85J51J82j21R7k56jK0R3L75n66K92q4N9J19
3967A29J7l09K39p7J21K44k07k00j6N4n5n5n8j9L19m16L95j97K3N7n5k4J39j43
3991i4k6K43m53M65J24k12K79m84j1K30j95L7K30k83L34rk40K77k91J61J2p8J84
$$ y = [-135, -72, 271, 89, -151, 216, -52, -85, 219, 148, 18, 317, 93, -211, -239, -216, 9, -75, 165, -124, -23, -202, -51, -140, -133, -16, -3, -190, 285, 120, 170, 139, 113, -78, -132, 200, 10, -125, 4, -202, -230, 72, -180, -486, 208, 118, -63, 12, 187, 133, -46, 144, 238, -196, 194, 89, 105, -54, 49, -106, -502, 19, -90, -72, -85, -1, 10, -288, -246, -118, 122, 74, 95, -59, -7, 94, 183, -48, -21, -25, -229, 4, -117, -58, -61, -228, 115, 96, 109, 181, 80, -55, -185, 132, 55, -63, 103, 143, 171, 39, 169, -92, -70, 15, 216, 27, 57, 13, 185, 70, 41, 142, 60, -27, -229, 78, -266, -135, 74, 24, 11, 214, 70, -40, -79, -46, -231, -80, 102, -19, 78, -178, -179, -159, -66, 309, -257, 35, -49, 10, 129, 146, -163, 76, -1, 120, 364, 157, -43, -59, -5, -60, -115, -173, -192, 127, -289, 106, -91, -68, -11, -66, -90, 49, -94, -120, 123, -330, 135, 259, 47, 326, -158, -169, 61, -134, -97, 133, -150, 184, 175, -65, 212, -79, 82, 94, 16, 200]
4014B00l66L91k25q7J07j53J20m3l3J53k05K69L8k17K41j09k43L35j63J1J12k5
4036A08j87J25k18K52k93K48l8k94K70J50J21j49q7J2r0J91n24M67p8r7K97k72
4058h6k6K72j11k02R3O9l5p5l8k2J85k45K31k14J45O3J46p4j0J5K1P1j27J31q8
4083H9r4K26l50r1K00k54L07j23n8o9K52K4L09l72j22L36k17J35op8J07m14K29
4106c4j0K4K48k03k9Q5j85R0p7J38J26j41K44n01K04j3lm9J7P8N0R0j71O7j24
4131g9L11j3j51J40j83l4J3J57p9pj2l6j02J02j51j8K39p3k33J02J42j44J12J70
4155A73M0m38K67O8l8k36K90K23n89M78r2R3M2l05L74j04k05Mj0k00k15M56oj8
4179E2K08l07PK57k24q2L2J81n7j38J51N3r7j52J03k48K18J53l6j93j42L08k49
$$ y = [200, -166, 225, 0, -87, 20, -133, -13, -56, -89, 64, -141, 128, 166, -51, 190, 81, -162, 173, 10, 21, 133, 108, -79, 46, -172, 80, -213, 35, -3, -297, -27, 123, 244, 95, 8, 20, -70, 121, -403, 64, -14, -111, 186, -86, -112, 160, 49, -153, -60, 9, -26, -101, -139, -161, 24, -221, 10, -204, -59, 4, 150, 76, 66, 81, 102, 173, 46, 177, 89, -5, 221, -129, -220, -20, -274, 33, -90, -148, -217, 35, 59, 368, -4, -126, 210, -7, 128, 122, 44, 151, -263, -34, -44, -20, 228, 25, -4, 81, -104, -14, -91, 47, 173, 32, 276, -225, -21, -34, -37, -86, -69, 9, 59, 149, -22, 45, -79, 232, 219, 68, 208, 25, -9, 4, 161, 82, 75, 63, 27, -75, 27, -124, -142, 97, 24, -209, -107, 35, -109, 3, 173, 213, -225, 42, 110, 72, -164, 126, 349, -240, 238, 146, 239, 281, -24, 350, 246, 41, 45, 35, -165, -380, 76, 70, 52, 260, -47, -40, 217, -7, -89, -57, 124, 67, -71, 80, 133, 36, -116, -13, -261, -43, 110, 74, -119, -261, 47, -202]
4202b02J36j23J72J36l86L81k43J0J12Nr9o8K07NM7j25O8k1j64J17No0N9j04p0
4227b05J24M0K82k43j08J78J11k22k15O7O9L32l18K6J32nQq5J05j26k22K06K50
4250A81l66J57J21m6L1j83M41m91p0J69j30J4L27j38q1m1L5j20lJ49o6J92m9K2
4274E5m6j33P5j28KL69j49n1j01J57K25r6k30j20J18qJ15q4J40K4n03M63j01j39
4298a46J93j86J26K25j81J84P2k34k0j46RJ50j02J81l02M29l88J70K8n4j25J74
4320E7k45M07j40p9n0k03K92j54O9o6Q0j03N8MQ3K3m3k73N32O8k16n2j30J86Q6
4345A91j36jL7k32l4L55k72J92lp3k0j10j27P7K18m26L78l2N4L7j71J57O0M9l35
4370a67J50J07q0j30p4Q8j00J19J13k41J74j49k3K14j16L95m69K16P0n2q3pJ02
$$ y = [-202, -66, -189, -17, 119, -267, 114, -129, -119, -7, -2, -101, -169, 38, 43, 90, -35, 33, 12, -152, -35, -30, -90, -31, -135, -205, -81, -41, 241, -2, -110, 68, 179, -43, -258, -191, -122, 210, -108, -82, 50, 45, 53, -32, 73, -53, -275, -69, 181, -185, -28, 93, 47, 78, -105, 336, -155, -225, -56, -186, -172, 155, 17, -64, -105, -70, -190, -193, -44, -110, 82, 33, 55, 9, -124, -49, -177, -175, 194, 45, -6, -107, 50, 275, 179, -51, -171, -53, -61, 54, -30, 110, 134, -369, 94, -7, -146, 47, -139, -13, 212, 31, 215, 287, 53, 33, -113, -104, 46, -56, 125, -177, 252, -136, 34, 62, 8, -117, 57, -188, 219, 79, 0, -50, -253, 39, -115, -46, -112, -32, -135, -77, -73, 10, 33, -10, -283, 249, 317, 101, 49, -81, 105, 191, 55, 54, 91, -141, -175, 180, -92, 100, 97, 24, 4, -106, -233, -156, 62, -364, 14, -18, 36, 73, -98, 59, 119, 168, -167, -17, 90, 10, -120, -194, -106, -206, -87, 26, -215, -41, -190, -213, 1, -115, 280, -189, 27, 97, 45, -38, -45, 57]
4393E7j75K81k54k6K85l94K24L30l54j99K45J33k78J24R7O6Lk54M14k52j00k29
4415b56Q8J25R7jR3j74j66P2j13K49j35L98l28J28K8O2l18M3k0K4K29o0L0k60
4439a65J02j05K73j75n7o6J58O4K28m42P0O4O8j26JJ76O5k07o4J70m1l0O1P0j85
4464i3k3L15l5o3k07P9j14K26j9k53J85j4q0j0K62k45J93j87P2RK17k11j06j6
4488a18N6j53L84l12J09R9j01j48L61j40l58K01N4O9J00N6k28o7K76j1k99J97
4510B7Q3j65p9K35j82K08n3K87j63n5k0j22n8K04j77L5k0J26j04l9j65K93p8J43
4534A61l1r0J11r6j10L4P0l3l5M1j15J80k04J4K04j01j29l6K14N8j82K4j20M9
4558a22K45j91j22K85J43l14M9J32j59j25K86j88J21k13K30l8j75K69k9k61K29
$$ y = [57, -118, 163, -91, -117, 168, -226, -2, 328, -26, -225, 20, 153, -125, -1, 96, 162, 165, -89, 325, 73, -27, -256, -168, -43, 54, 53, 146, -28, -194, -122, -235, 14, -121, 277, -51, 77, 105, 167, -151, -108, -128, -104, 125, 65, 95, -165, -63, -168, 105, -70, -127, -193, -35, 29, 257, -185, -115, -51, 17, -109, -108, 68, 133, -74, -138, 32, -9, -39, 22, 92, -93, -116, 199, 164, 101, -106, -27, -141, 85, 66, -187, -2, -16, -96, -106, 156, -89, 104, -83, -11, -2, 215, 4, -102, -118, -62, -215, 169, -143, -34, 65, -36, -184, 177, 37, -321, -120, -66, 3, 103, 159, -69, -136, 140, 129, -170, 27, 110, -55, -134, 101, -81, 127, 74, 361, 198, 143, 123, 1, -57, 147, -30, 5, -15, 111, 7, -32, -197, 96, 18, 161, 130, 40, 151, 55, -55, -21, 49, 16, -19, 22, -93, 87, -117, -103, 101, 0, -129, -165, 49, 107, -75, -51, -171, -122, 123, -68, -190, 95, 238, -76, -27, 105, -54, -179, 107, -81, 40, -173, 57, 19, -156, 113, 84, -177, 52]
4579E2q0l9Qk4N3J45M4k49K65j67k18J01L5K2n8J34K04j92j06j73L99N2k72J24
4603F0O5j71K06j8l00J09m5K69k77j46P6K62o9j85M4R7K37j78qk07L45j84j28
4626a46L02j17Q3q7k44M41j67k75K01K54j3k05M6l0J13j51J82l51p2L38k4k62
4648a84M29k90P2j43K89Q4m21L18j60J98k72Q1M8j41m2K40j95Q7J97j74j21M06
4670C06m61Q9J48j03q7J52Nj69J28o9L4R1j06O0K41j15l20K13j59q7J46J41l97
4693c19L65l2q4K20j00k4O8k7k5j62J36J2j69K29q8J43l98Q5L77j25j23j21K03
4716D1k59K11K62k02j22J99M5L6j30j3K11k33K13Pm52j81M36k80L09j65K9J05
4738F7n1J22R6k85J03Q2o1n7J73r7k2k32L52p5m6M7R6m38J67j33J88J2K0j57Q8
$$ y = [52, -28, -67, -59, -83, -30, 115, 159, -90, 175, 8, -210, -109, -74, -52, -110, 24, 228, 36, -70, -243, 156, 208, -64, 60, 125, -46, 160, 142, -158, -49, -94, 175, -102, -248, -172, 90, 21, -164, -120, -23, 214, 36, 28, -179, 166, -18, -146, 156, 39, 122, 35, -209, 232, 65, -210, -9, 245, 232, 27, 73, 43, 156, 5, 187, -164, -236, 102, 78, -184, 245, -45, 27, -116, 173, 257, -164, 154, -6, 192, -80, 1, 49, -92, -134, 106, -89, -2, 195, 21, -100, 306, -155, -66, 82, -21, -108, 44, 49, -120, 8, -61, -27, 64, -42, 18, 259, 144, -176, 37, -122, -209, -63, 78, -319, 46, 14, -70, 150, 50, 26, 94, 67, 42, -120, 16, 28, -141, 88, 0, 143, -255, -170, 207, 82, -41, -162, 41, -218, -7, 255, 53, -69, 130, 175, 211, 81, 68, 279, 46, 259, 266, -186, -367, 69, -211, 98, -67, -38, 67, 16, 138, 234, -51, 52, 134, 73, 16, 189, 92, 70, -162, 190, 115, 69, 116, 212, -226, -59, -192, -4, 8, 28, -129, -41]
4763d1K22m04J70L17j97j66K12l60L64j81R2j86J96n7J19r4j18j8J39K21r2j95
4785e7MJ09k1ln9k17K96J84j12n1m3j7o0k41K68K04m12L15l53L29l7m2J77k77
4809a16J12R1k75L59k17j0q7M54m7m43Q6k4J97r4j90J83R8Q9o7j46J47p3K21l89
4833a41L17l66K24J44j97j5J01j25N3K1j66N2q4K03j38J1K62l69K41k08J06J59
4855H5J3k15OM5ML09j49j52L7L2j42L46m38J57j82K38M3K64k90J1r5Q5K04j66
4879E0J46r7j60o9L70m3j9k36m5J60J68k42k27J79J06j67J18k05L07r6p1J02K4
4902E3M5q5r5K7P4r2Q6JJ41j83J87r6K85k43l8q9o0N4o1N5l7L2O4k27Q5J08Q7
4929G8j18J39j7m0L62k25l82K09M9n0n3j60L47J91k27m4j37K21L9r0j90K00J75
$$ y = [-41, 181, -223, -53, 264, 67, -99, 113, -247, 117, -64, 28, -158, 38, -19, 100, 6, -112, -130, 9, 230, 138, -57, -53, 56, 35, 32, -27, -244, 52, 236, 124, 73, 30, 13, -47, -288, -20, 184, -228, 87, -266, 63, 26, -16, 161, -116, -4, 87, -188, 171, -46, -56, -143, 311, 264, -179, -93, -117, 80, -14, -204, -21, 77, 166, 99, -47, 100, 27, 248, -141, 176, -190, 34, 178, -19, -34, 67, -58, -5, 16, -150, -98, -182, 21, -117, -106, 156, -213, 28, -180, -74, 85, 98, -117, -111, -66, -62, 247, 98, -54, -17, 15, -127, 219, -219, -62, -244, -6, 37, 301, 11, 22, -73, 12, 216, 50, 196, 99, -61, -130, 240, 197, 178, -58, -103, 57, 225, -17, -244, -65, 41, -126, -8, -213, 94, -2, -73, 29, 53, 98, 13, -82, -55, 19, -73, 13, 14, 155, -28, 159, 63, 348, 105, 67, -22, -82, -28, -89, -34, -71, -39, 25, -202, -117, -9, 78, -40, 99, 82, 42, 404, 179, -203, 6, 55, 5, -48, -208, 139, 330, 103, 59, -78, 143, 182, 92, -98, 102, 277]
4952B77j60N4m10L74j36m3J65k12M3q1J39o0J34Q1k08J34Q5Rk31Q9j56L8N6K95
4976B76l10k1O8j2m6n2J42J81j5j45L6j52J93k03k4k58L16m8O7n4J57p0j19J58
5000F5R2j75P2L8k04OK7P9o3j03J02L64l6n93L68j43n2L32j27j57m4K67k40J52
5024B7l7J95k17m6J76MJ19j57P8j70R9M6j03q9J21P7j13M9O0k22N9J75k68m5P0
5049a12J26P1j47N5l4R7J65r4j64P5j27p7M90l97J78j6k66K18k36K36O4j74j7
5072h6K00k12M1n9K76k59J25Qj02MK42r7M6J69l74j08k5L39j67qm0M0q7j6%K17
5098F7J4l1J67m26P7j59L49l6L6n6K00r5L9j43k81L48l41K10J20l8k16J75J55
5121A35L2o8l08L10P0o2j09J07m84M92n9k8J68J16j24j60J85l64P0k3k7j0L72
$$ y = [277, 117, 171, -239, 135, -1, -44, 121, -91, -48, -129, 10, -50, 84, 165, -43, 91, 176, 185, -46, 43, -113, -75, -19, 276, -34, -55, 13, 1, -45, -97, 45, 226, 211, 66, 102, -50, 143, -60, -84, -342, -26, -74, -7, -61, 96, 26, -93, 65, 157, -18, 54, 92, -112, -106, -79, 0, -63, -166, -64, 300, 264, -329, 39, -104, -156, 176, 49, -108, -152, 115, -125, 27, -10, 185, -32, -78, 98, 102, 221, 64, 142, -28, 71, 117, 14, -75, 46, 123, 10, 59, 119, -103, -44, 131, -137, -182, -112, 14, 85, -62, -7, -41, 56, 221, 127, -37, 38, -89, -166, 324, -73, 105, 89, -177, 41, -195, 41, 105, -69, -86, 114, -98, -57, -116, 160, -99, 26, 34, -68, -64, 178, 81, 127, 296, -78, -186, -211, 128, -39, -47, -87, -47, -134, -150, -150, 67, 81, 50, 217, -209, -132, -291, 58, 22, 58, 2, 202, 107, 146, 3, -278, 70, -271, -61, 59, 21, -195, -20, 135, 167, 99, -209, 101, 171, 109, 0, 107, -377, 115, 56, 28, 196, 312, 188, 28, 213, -151, -81, -104, -131, -141, 231]
5144B31L0j82l3J42k6j82l4P3l2J97k94J40R9j04k8J80j94k65J87m8Q9J2K51m23
5168b14M46j94q6M1J03k68L46j03n3P7L4j17km7Q3Rn5Q2K05j45q4k88K42r5P5
5193hK8l5J64j04k9j74R0O7j72L48j43o9J29j81J33j19j06L37k67J80L0Q9J10
5216B98k95J82j14q8l8L8O5M4j38J73j59O6%R5j78J1j7k68M87j48K4q8L5J20k68
5241a61K62j76J64J7k51J90l02K95l6l49L21j9j15N8rJ45j19K00k38J54j13j25
5263b07J01P6K85j89k9j59J91M6n7j00j80K32J25l2M0p2j66J18r9N8oJ65j27J16
5287A30j30k57K54J65l49J26J18k8J01k32j4L43j16j59J29j85K35o4j98P1P5j73
5309a58L40k96r4J24J77j35J8j19J79K38j66Q9r0j72K79m19K1k3K00J70k81K03
$$ y = [231, 261, 79, 46, 188, 162, -20, -54, 19, -13, 184, -110, 30, 129, 25, -3, 177, -17, -282, -95, -143, -54, -42, 209, -214, 232, 38, -48, -7, 96, -172, 174, 71, 18, 95, 129, 12, 10, -37, 46, 55, 0, 82, 287, 142, 58, -230, 12, -83, -8, 20, -15, 149, 45, 16, -158, -68, -1, -173, 175, 32, -37, 92, -89, 44, -75, -181, 156, -111, 69, 99, 188, 298, 3, 185, 71, -17, -55, -17, 48, 92, -46, 127, -32, 34, 34, 129, -49, -38, -55, -323, 164, 16, 40, -48, -13, 107, -161, 101, -75, 89, 106, -145, 45, -257, 38, 2, -347, -26, -45, -160, -102, -111, 34, -85, 115, -123, 31, -82, -207, -106, -30, 255, 66, 37, -122, 69, 115, 58, -42, -222, 10, 135, 103, 143, 71, -95, 23, -76, -18, -24, 141, 14, 130, 0, -257, -3, 162, -187, -61, 57, 29, 130, -102, -116, 227, 111, -48, 81, -104, 131, 67, -131, -60, 15, -158, 182, -114, -208, -84, 93, -42, -24, -143, 36, 274, 108, 197, 107, -65, 214, -205, -184, -207, -7, 163, -118, 85]
5331H5k56M1J35r4j04K51l25M03k01j59L88k43L4m3L1K70k75j51J58K79n43N74
5353B55m48O0Q4j57L44k50J73m1q7qj71K92mq3L06k50j33q1j8M54j39o4n2J7o1
5378f2J85n6l43K82j25R7j39J44Q8J15l07oJ91k06M7K52j59o2K49j84M7M5j43
5401e0J42k5Qol98M00kj32J24j07l13K94J67k35J82j92J0RJ58j17O8N0k44J17
5425i2L70k58M1J63k39K3k00J95j48L23k8k60M1M11m80K14L1J16k09k31J52J28
5447F3J87k21j10R1J62J35j80k30M1J58k06j9L7J29j57L5K15jj40m9K04j95O1
5470A0J42j54j65K62j26k50K40J36J65k96j0J51o7K0n0J85l9m0n3Q7j84J29l0
5493F3J77k21l6J85j78j55L03j50m6j51L25j61Q9m4J66k76r2J88j70K01m3j14
$$ y = [85, -171, -130, 5, -89, -193, 58, -267, 136, -65, -224, 164, -79, -45, -88, -57, 213, -62, -213, -55, 224, -319, 255, -193, -133, -49, -206, 138, -112, 61, 20, -67, -75, -246, 46, 42, -41, 265, 15, -118, -199, -217, 237, 98, 34, -18, -1, -62, 123, 67, -276, 6, -119, -22, -161, -17, 71, 186, -121, -127, 64, -142, -95, 157, -2, -64, 185, 1, 48, 93, -50, 92, 67, 75, 69, -329, 71, 69, -63, 61, -46, -359, -65, 102, -133, 49, -143, -133, -124, 34, -83, -15, 35, -209, -92, 278, 20, 61, 224, -15, 8, -192, 3, -145, 178, 150, -110, -69, 342, -138, 76, 107, 223, 14, -217, -65, 63, 250, 29, -81, 10, 172, 307, 127, -103, -62, 96, -110, -129, -92, 37, -120, -85, 130, 129, -11, -60, 144, -51, 10, 152, -2, -167, 95, -31, -281, -41, 95, 260, -36, -46, 105, 38, 58, 8, 193, 154, 114, 61, 148, -36, 93, 63, 240, 19, -17, 168, -10, -165, 138, -12, -58, -209, 116, -45, 44, 0, 166, -110, -202, -14, -184, 17, -26, -140]
5515a40K70j93q6M3M9K06j58k15o5Q5J4R2M7PP6K64k68K26l80N5J9j64K45J16
5539A45J37J2j85j56n1L0j68J14J48j86J29Q2J30o0q1q9J0j69rL46j6J4k16k37
$$ y = [-140, 130, -63, -149, -106, -57, 149, -9, -224, -289, -204, -190, -98, -51, -44, 32, 296, 28, 254, -126, -71, -52, -216, 29, 145, 282, 294, 109, -47, -98, -68, -236, -122, 26, -160, -31, 51, 181, 121, 40, -49, -39, -208, -217, 129, 113, 127, -89, -326]
$$ [...]
8191a92
##END NTUPLES=NMR FID
##END=
