##TITLE=1H_LR-757-R2-EtOAc2
 CCl4
 8 sc, 
 27.1.2023
##JCAMPDX= 6.0         $$ Bruker NMR JCAMP-DX V2.0
##DATA TYPE= NMR FID
##DATA CLASS= NTUPLES
##ORIGIN= UXNMR, Bruker Analytische Messtechnik GmbH
##OWNER= root
$$ XWIN-NMR		Version 3.5
$$ Fri Jan 27 16:04:57 2023 Russian Standard Time (UT+4h)  she@DPX200
##.OBSERVE FREQUENCY= 200.13135
##.OBSERVE NUCLEUS= ^1H
##.DELAY= (6, 6)
##.ACQUISITION MODE= SIMULTANEOUS
##.ACQUISITION SCHEME= undefined
##.AVERAGES= 8
##.DIGITISER RES= 18
##SPECTROMETER/DATA SYSTEM= spect
##.PULSE SEQUENCE= zg30
##.SOLVENT NAME= DMSO
##.SHIFT REFERENCE= (INTERNAL, DMSO, 0, 15.7039)
##AUDIT TRAIL= $$ (NUMBER, WHEN, WHO, WHERE, WHAT)
$$ ##TITLE= Audit trail, XWIN-NMR		Version 3.5
$$ ##JCAMPDX= 5.01
$$ ##ORIGIN= Bruker BioSpin GmbH
$$ ##OWNER= she
$$ F:/spectra/data/she/nmr/H-F/1/audita.txt
$$ ##AUDIT TRAIL=  $$ (NUMBER, WHEN, WHO, WHERE, WHAT)
(   1,<2023-01-27 16:03:10.09 +0400>,<she>,<DPX200>,
      <created by zg, POWCHK disabled, PULCHK disabled
       configuration hash MD5:
       00 E9 B6 7A A2 85 ED C7 34 08 36 98 17 FE 4E 26
       data hash MD5: 16K
       E2 6A CA 25 5C 96 45 44 6F E5 27 82 3E C1 C1 CA>)
$$ ##END=
$$ 
$$ hash MD5
$$ F6 B6 2E 48 FB 05 6F 5F 2B 2A 26 B4 21 91 98 CD
##$RELAX= 
##$RELAX= 
##$RELAX= 
##$RELAX= 
##$RELAX= 
##$RELAX= 
$$ Bruker specific parameters
$$ --------------------------
##$DU= <F:/spectra>
##$EXPNO= 1
##$NAME= <H-F>
##$PROCNO= 1
##$TYPE= <nmr>
##$USER= <she>
##$AMP= (0..31)
100 100 100 100 100 100 100 100 100 100 100 100 100 100 100 100 100 100 
100 100 100 100 100 100 100 100 100 100 100 100 100 100 
##$AQSEQ= 0
##$AQ_mod= 1
##$AUNM= <au_zg>
##$AUTOPOS= <>
##$BF1= 200.13
##$BF2= 200.13
##$BF3= 200.13
##$BF4= 200.13
##$BF5= 200.13
##$BF6= 200.13
##$BF7= 200.13
##$BF8= 200.13
##$BYTORDA= 1
##$CFDGTYP= 0
##$CFRGTYP= 5
##$CHEMSTR= <none>
##$CNST= (0..31)
1 1 145 1 1 1 1 1 1 1 1 1 1 1 1 1 1 1 1 1 1 1 1 1 1 1 1 1 1 1 1 1 
##$CPDPRG= <>
##$CPDPRG1= <>
##$CPDPRG2= <>
##$CPDPRG3= <>
##$CPDPRG4= <mlev>
##$CPDPRG5= <mlev>
##$CPDPRG6= <mlev>
##$CPDPRG7= <mlev>
##$CPDPRG8= <mlev>
##$CPDPRGB= <>
##$CPDPRGT= <>
##$D= (0..31)
0 1.2 0 0 0 0 0 0 0 0.06 0 0.03 0 0 0 0 0.0002 0 0 0 0 0 0 0 0 0 0 0 0 
0 0 0 
##$DATE= 1674820989
##$DBL= (0..7)
120 120 120 120 120 120 120 120 
##$DBP= (0..7)
150 150 150 150 150 150 150 150 
##$DBP07= 0
##$DBPNAM0= <>
##$DBPNAM1= <>
##$DBPNAM2= <>
##$DBPNAM3= <>
##$DBPNAM4= <>
##$DBPNAM5= <>
##$DBPNAM6= <>
##$DBPNAM7= <>
##$DBPOAL= (0..7)
0.5 0.5 0.5 0.5 0.5 0.5 0.5 0.5 
##$DBPOFFS= (0..7)
0 0 0 0 0 0 0 0 
##$DE= 6
##$DECBNUC= <off>
##$DECIM= 32
##$DECNUC= <off>
##$DECSTAT= 4
##$DIGMOD= 1
##$DIGTYP= 9
##$DL= (0..7)
0 120 120 120 120 120 120 120 
##$DP= (0..7)
150 150 150 150 150 150 150 150 
##$DP07= 0
##$DPNAME0= <>
##$DPNAME1= <>
##$DPNAME2= <>
##$DPNAME3= <>
##$DPNAME4= <>
##$DPNAME5= <>
##$DPNAME6= <>
##$DPNAME7= <>
##$DPOAL= (0..7)
0.5 0.5 0.5 0.5 0.5 0.5 0.5 0.5 
##$DPOFFS= (0..7)
0 0 0 0 0 0 0 0 
##$DQDMODE= 0
##$DR= 18
##$DS= 0
##$DSLIST= <SSSSSSSSSSSSSSS>
$$ [...]
##$SUBNAM2= <"">
##$SUBNAM3= <"">
##$SUBNAM4= <"">
##$SUBNAM5= <"">
##$SUBNAM6= <"">
##$SUBNAM7= <"">
##$SUBNAM8= <"">
##$SUBNAM9= <"">
##$SW= 18.05172834244
##$SWIBOX= (0..15)
0 0 2 0 0 0 0 0 0 0 0 0 0 0 0 0 
##$SW_h= 3612.71676300578
##$TD= 16384
##$TD0= 1
##$TE= 0
##$TE2= 300
##$TE3= 300
##$TEG= 300
##$TL= (0..7)
0 120 120 120 120 120 120 120 
##$TP= (0..7)
150 150 150 150 150 150 150 150 
##$TP07= 0
##$TPNAME0= <>
##$TPNAME1= <>
##$TPNAME2= <>
##$TPNAME3= <>
##$TPNAME4= <>
##$TPNAME5= <>
##$TPNAME6= <>
##$TPNAME7= <>
##$TPOAL= (0..7)
0.5 0.5 0.5 0.5 0.5 0.5 0.5 0.5 
##$TPOFFS= (0..7)
0 0 0 0 0 0 0 0 
##$TUNHIN= 0
##$TUNHOUT= 0
##$TUNXOUT= 0
##$USERA1= <user>
##$USERA2= <user>
##$USERA3= <user>
##$USERA4= <user>
##$USERA5= <user>
##$V9= 5
##$VALIST= <valist>
##$VCLIST= <CCCCCCCCCCCCCCC>
##$VD= 0
##$VDLIST= <DDDDDDDDDDDDDDD>
##$VPLIST= <PPPPPPPPPPPPPPP>
##$VTLIST= <TTTTTTTTTTTTTTT>
##$WBST= 1024
##$WBSW= 4
##$XGAIN= (0..3)
0 0 0 0 
##$XL= 0
##$YL= 0
##$YMAX_a= 416182
##$YMIN_a= -480679
##$ZGOPTNS= <>
##$ZL1= 120
##$ZL2= 120
##$ZL3= 120
##$ZL4= 120
##$ABSF1= 10
##$ABSF2= 0
##$ABSG= 5
##$ABSL= 3
##$ALPHA= 0
##$AQORDER= 0
##$ASSFAC= 0
##$ASSFACI= 0
##$ASSFACX= 0
##$ASSWID= 0
##$AUNMP= <proc_1d>
##$AZFE= 0.1
##$AZFW= 0.1
##$BCFW= 1
##$BC_mod= 2
##$BYTORDP= 1
##$COROFFS= 0
##$CY= 11.3945322036743
##$DATMOD= 1
##$DC= 2
##$DFILT= <>
##$DTYPP= 0
##$F1P= 2.36226072786647
##$F2P= -0.459571619588291
##$FCOR= 0.5
##$FTSIZE= 0
##$FT_mod= 4
##$GAMMA= 1
##$GB= 0.15
##$INTBC= 1
##$INTSCL= 1
##$ISEN= 128
##$LB= 0.24
##$LEV0= 0
##$LPBIN= 0
##$MAXI= 10000
##$MC2= 0
##$MEAN= 0
##$ME_mod= 0
##$MI= 1.114404
##$NCOEF= 0
##$NC_proc= 0
##$NLEV= 6
##$NOISF1= 3.799351
##$NOISF2= 2.8
##$NSP= 1
##$NTH_PI= 0
##$NZP= 0
##$OFFSET= 15.70392
##$PC= 1
##$PHC0= -19112.5
##$PHC1= 13.40079
##$PH_mod= 1
##$PKNL= yes
##$PPARMOD= 0
##$PSCAL= 0
##$PSIGN= 0
##$REVERSE= no
##$SF= 200.130013532006
##$SI= 16384
##$SIGF1= 3
##$SIGF2= 2
##$SINO= 400
##$SIOLD= 16384
##$SREGLST= <1H.CDCl3>
##$SSB= 0
##$STSI= 0
##$STSR= 0
##$SW_p= 3612.71676300578
##$SYMM= 0
##$S_DEV= 0
##$TDeff= 0
##$TDoff= 0
##$TI= <>
##$TILT= no
##$TM1= 0
##$TM2= 0
##$TOPLEV= 0
##$USERP1= <user>
##$USERP2= <user>
##$USERP3= <user>
##$USERP4= <user>
##$USERP5= <user>
##$WDW= 1
##$XDIM= 8192
##$YMAX_p= 0
##$YMIN_p= 0
$$ End of Bruker specific parameters
$$ ---------------------------------
##NTUPLES= NMR FID
##VAR_NAME=  TIME,          FID/REAL,        FID/IMAG
##SYMBOL=    X,             R,               I
##VAR_TYPE=  INDEPENDENT,   DEPENDENT,       DEPENDENT
##VAR_FORM=  AFFN,          ASDF,            ASDF
##VAR_DIM=   8192,          8192,            8192
##UNITS=     SECONDS,       ARBITRARY UNITS, ARBITRARY UNITS
##FACTOR=    0.0002768,     1,               1
##FIRST=     0,             0,               0
##LAST=      2.2672688,     0,               0
##MIN=       0,             -480679,         0
##MAX=       2.2672688,     416182,          0
$$ Real data points
##PAGE= N=1
##DATA TABLE= (X++(R..R)), XYDATA
0 0 0 0 0 0 0 0 0 0 -8 8 -8 16 -24 32 -40 56 -72 88 -112 136 -168 201 -243 288 -341 403 -472 551 -640
29 -640 737 -849 977 -1114 1269 -1439 1631 -1838 2067 -2319 2596 -2898 3231 -3590 3985 -4415
45 -4415 4886 -5397 5956 -6567 7233 -7963 8767 -9649 10624 -11704 12909 -14259 15783
58 15783 -17519 19516 -21846 24603 -27930 32046 -37300 44307 -54271 70036 -101354 305900
70 305900 -364057 172559 20158 47446 -125427 -325353 361154 -433565 71010 -113463
80 -113463 218601 -327252 222816 37909 -6431 -32790 94920 272596 -398438 389104
90 389104 -129655 88878 -187900 36115 63387 -293447 142317 -126728 103709 -163740
100 -163740 265196 -139535 104771 15079 54073 -18115 -133867 271918 -292560 196502
110 196502 -168137 165378 -118331 -19805 84029 -168366 149475 -173568 182686 -209271
120 -209271 263416 -117978 34142 79902 -64988 114125 -260788 272770 -246653 101971
130 101971 -59825 48258 3555 -72628 179986 -174692 91507 -71842 137562 -208992
140 -208992 127982 40202 -49812 26203 -39275 181719 -267233 143092 -56741 8571 -75458
151 -75458 46902 80042 -125640 116471 -5808 30960 -139461 169987 -102268 -22351 -951
162 -951 55299 26843 -158758 226055 -123400 25480 -63658 80044 -46584 -80034 124743
173 124743 -49076 21086 -27474 132768 -131068 41228 -9090 15819 -67962 -28950 148335
184 148335 -154540 96617 -29194 72023 -78882 -1975 65525 -89809 28838 -12016
194 -12016 60414 -77192 85435 -18126 3121 -34121 15415 14335 -103683 95184 -52804
205 -52804 44007 -30563 49728 10678 -44013 40677 -36095 1459 -25941 37590 -41122 38820
217 38820 2844 14030 -18767 -2681 31324 -78916 43630 -23696 17111 -13224 30655 22771
229 22771 -30551 29652 -6881 -22296 -31508 42719 -40232 1567 16620 33674 -19058 -20083
241 -20083 66131 -58777 -6236 -375 21334 -33287 896 62819 -28459 -8342 25807 11310
253 11310 -65149 9423 23067 -25247 -26786 46715 33819 -55679 35832 25492 -27525 -38041
265 -38041 28549 11610 -58087 29329 42412 -24070 -15510 41728 -2682 -51889 2876 35179
277 35179 -38609 -18587 57983 2235 -20884 16094 31919 -33741 -34601 36992 -17507 -33977
289 -33977 25449 26475 -13963 -7417 35532 -5229 -40305 14588 10947 -32560 4455 27040 4782
302 4782 -10238 16194 17792 -38117 -3201 9021 -23939 -6031 13328 16061 -8353 13597 19812
315 19812 -18156 -7895 7803 -16825 -12993 12117 6041 -3514 7856 23125 -16939 -12287 12430
328 12430 -15507 -18499 7873 16715 -11177 9142 29180 -5744 -17914 12729 -997 -35900
340 -35900 -7 20469 -9658 -11433 34029 12616 -27702 5274 16934 -24245 -25337 27544
352 27544 4749 -23030 21655 29638 -16659 -18275 25574 -8019 -43109 10339 23047 -21358
364 -21358 -5022 39431 8015 -27184 10966 19500 -33652 -18074 27448 -7478 -17566 20686
376 20686 25881 -18451 -12479 29277 -18550 -30976 13479 12145 -15740 -433 34391 3330 -20444
389 -20444 16013 5154 -31375 -4183 7852 -4230 -13291 22916 17262 -19462 10522 9743 -14055
402 -14055 -19867 11496 1515 -13159 8946 21512 -2601 -7697 17820 -16851 -10103 -8147 5556
415 5556 -11882 -1167 30329 -10004 8118 5524 7690 -20927 -5718 8977 -16496 -495 10126
428 10126 12512 -12249 16618 1431 -13280 -9442 5080 -3800 -21030 24053 9172 -4128 3102
441 3102 19138 -7094 -19516 1927 3063 -22057 1299 20894 -8607 8059 5926 16048 -29912
454 -29912 5226 9984 -24540 368 6739 22111 -25098 22108 10253 -10727 -14958 6227 -727
467 -727 -31015 23723 -2934 10537 -11551 33675 -5110 -26351 23150 -14841 -4601 -23066
479 -23066 32157 -5687 -10222 19936 9025 -12638 -10895 14608 -20332 -5067 1623 20839 -19509
492 -19509 16571 21393 -14801 -4684 1413 5187 -32186 7770 6955 2150 -13167 31061 -2752
505 -2752 -11595 10859 -11493 4000 -32986 39841 -21896 2100 18913 3940 1494 -22997 30488
518 30488 -32652 305 -10474 20724 -16821 10170 25436 -19941 19882 -18690 21879 -42367
530 -42367 18476 1838 -16003 12532 2859 20799 -28293 23670 -10987 -5485 -17662 18674
542 18674 -10697 -6952 28657 -6942 10886 -17060 33872 -35881 -4663 6545 -3610 -8910
554 -8910 -2431 34242 -20028 10347 -1384 14876 -36805 17318 -3595 -11409 8245 259 30245
567 30245 -42231 45001 -22177 -261 -15991 3265 9993 -36384 42714 -15952 20677 -17718
579 -17718 30165 -21571 -7618 9106 -16353 8490 -25488 51000 -38373 23844 -1021 5053
591 5053 -9962 -19745 30963 -38604 20571 -8203 25554 -18844 19178 3755 -14394 1580
603 1580 -12462 14848 -38700 34015 -11003 10982 -5295 15383 1541 -21282 15421 -18656
615 -18656 10863 -24941 35534 -22607 18036 2900 -1224 3225 -26230 33566 -46288 23485
627 23485 -13697 21040 -10081 6841 21640 -23326 17260 -26220 25731 -42175 29766 -11447
639 -11447 1300 12697 -7437 26901 -43756 39331 -29861 5482 -12217 10754 7641 -16100
651 -16100 30834 -12349 11318 -21518 22884 -30923 5292 116 -155 2386 -6700 38446 -34369
664 -34369 20492 -11619 10203 -23370 436 17248 -17691 14653 -1451 20524 -28262 22855
676 22855 -16074 -2439 -11656 6931 7818 -25693 40992 -16994 18206 -22017 22137 -12418 -19356
689 -19356 17096 -15483 13762 -16233 33052 -21671 12460 -2047 -1576 -10758 -9385 24425 -32106
702 -32106 24597 -5212 21208 -18653 8709 9107 -24456 6639 -11021 11996 -22521 26559
714 26559 -4411 2882 640 7805 -2603 -25191 24377 -18008 4985 -8198 23900 -5559 -5563
727 -5563 14894 -8933 -4963 -11681 15036 -23067 12281 3586 9990 -7837 7016 17272 -29149
740 -29149 9671 -8236 6778 -20300 13172 10188 -8820 7963 2738 3479 -21443 16550 -13410
753 -13410 -1305 -2791 15488 982 -10800 26100 -12598 -1157 -12532 11613 -13880 -6888
765 -6888 13600 -652 3162 361 16302 -17465 4199 -1619 -3068 -11006 5083 13484 -13506
778 -13506 11742 4289 3109 -15447 5672 -1952 -12453 2279 4770 3517 -4891 18235 -3818
791 -3818 -3842 -1804 4052 -12826 -8916 14045 -4971 923 3071 14446 -10769 -2467 6011 -9547
805 -9547 -6372 1194 8588 -9205 9071 10053 -1056 -8689 7219 -1221 -17664 3211 2767 836
819 836 -6377 15499 4575 -8925 5696 1404 -8755 -8237 8855 -2305 -4713 7961 11425 -8172
833 -8172 -2498 9601 -9559 -9291 293 6770 -7586 2112 14912 -1189 -3500 6407 -93 -12890
847 -12890 -1407 4217 -4232 -5667 13357 5312 -8295 5801 2978 -7009 -9650 5296 -9 -7507
861 -7507 8360 9219 -2676 25 7130 -5856 -10801 978 2345 -8847 921 12771 -416 -2037
875 -2037 6665 2387 -10338 -3283 4116 -6564 -2761 8350 4351 -4323 4832 5713 -9863 -6172
889 -6172 3734 -2921 -8179 6043 9181 -2684 1947 8446 -2883 -8979 1577 -900 -8659 550
903 550 9039 -479 -2909 10059 1710 -10009 -700 2632 -6243 -5747 8460 4443 -4210 6891 6691
918 6691 -7128 -5238 3239 -4689 -9952 3899 8025 -4216 1777 11690 -2143 -6629 1463 891
932 891 -9075 -3378 9461 -1749 -1385 9225 2632 -6471 -2442 3622 -7880 -7961 7763 2003 -2844
947 -2844 5658 8811 -2765 -5288 3906 -4089 -9006 584 5332 -4535 2177 10013 -715 -3362 -400
962 -400 3870 -11236 -2516 7001 -2774 1407 4159 8455 -6154 -62 2776 -7672 -4975 342 3479
977 3479 -6564 7473 6436 -624 -1500 2367 530 -11856 2982 67 -1696 666 7091 2917
991 2917 -5145 5182 -1871 -7570 -3313 3380 -2352 -2662 8468 5801 -3600 2190 3472 -5284 -6645
1006 -6645 588 1533 -7927 7076 4844 224 -1027 4542 256 -12025 4185 -1388 -2179 -3333 11345
1021 11345 1487 -4436 7906 -2463 -2257 -10841 8646 -8035 -4198 9537 1602 1798 -3245 13253
1035 13253 -8786 -5676 2100 1006 -7578 -341 11882 -4998 2286 1782 5516 -11943 -382 3853
1049 3853 -8725 -94 4988 6514 -5488 6886 4365 -4252 -7383 4851 -4754 -6434 5239 1685
1063 1685 3091 -3108 11803 -6504 -2796 1273 -1938 -5278 -1595 10760 -5969 4992 2354 6507
1077 6507 -10807 978 2259 -10908 2321 -1626 8327 -8763 12279 1302 -4186 136 -18
1090 -18 -402 -13380 11827 -3966 2455 -1229 9933 -2077 -7084 7527 -8981 -150 -6027 10756
1104 10756 -7801 4359 8993 -1626 -1598 -2442 7680 -15641 1990 817 2159 -5298 7015 6357
1118 6357 -7160 4045 -1386 491 -11996 9372 -3048 -1911 4510 6155 987 -7338 9925
1131 9925 -7369 -3348 -5755 7898 -7429 2007 8490 -1528 3583 -4862 10796 -16497 4477
1144 4477 -692 -1722 -1515 1442 12060 -11709 8491 -3014 2225 -11189 3822 850 -7058 8349
1158 8349 -1076 9093 -9310 12382 -6034 -5083 103 -2001 1083 -7779 12171 -3141 3319 -1284
1172 -1284 4827 -6362 -2852 2577 -5721 1954 -1286 9581 -6935 7028 303 -1638 -5381 -641
1186 -641 1807 -9645 6774 -1002 6737 -5744 9742 -2275 -4476 1973 -4367 1903 -9169 12922
1200 12922 -5462 3273 1589 3683 -2609 -7468 7359 -9705 2923 -4057 9798 -4497 3742
1213 3742 6200 -5410 1541 -5585 4816 -12054 5046 1477 690 -17 4038 4875 -8444 4625
1227 4625 -4098 7 -6855 6751 -313 -1119 5851 1101 449 -6842 6649 -8278 -1635 -851 4467
1242 4467 -1317 -34 9240 -4084 1512 -3675 3339 -8803 1270 1894 -1092 1216 2236 6297
1256 6297 -8843 5517 -3652 -1156 -5507 2303 3487 -5094 7604 651 3032 -4643 4138 -4733
1270 -4733 -4120 285 -179 504 -2409 9872 -3877 1812 -305 560 -4419 -3346 4339 -3432 2392
1285 2392 2323 5107 -3649 3195 -595 -3935 -2731 -864 1913 -5448 6775 1901 1236 -636 2630
1300 2630 -1369 -5783 1369 -1300 -703 -1534 7197 -1501 438 2592 -814 -3932 -3568 3757 -4789 412
1316 412 3726 4051 -1728 2049 3017 -4705 -2244 -1108 134 -5308 4045 3166 -694 1032 3078 -87
1332 -87 -6078 1417 -797 -2304 -1322 5528 978 -1353 4069 334 -2693 -3490 1593 -3400 -2202 3551
1348 3551 2902 -985 2221 4216 -2833 -2606 -397 -63 -4655 787 3873 -295 990 2786 284 -3668
1364 -3668 -711 -393 -3175 -1825 3809 706 -167 4093 1851 -1693 -2407 516 -3010 -3654 1931 1616
1380 1616 -287 2366 3148 -1162 -1365 228 -1441 -3842 422 2853 -1013 1428 3652 1054 -2212
1395 -2212 -652 24 -4016 -1855 1899 -476 667 3455 2852 -1545 -502 1045 -3445 -3218 956 1230
1411 1230 -1711 1968 3570 -1 -1559 233 -628 -4564 114 1297 -649 1065 4100 2112 -2237
1426 -2237 1063 274 -3719 -2771 1049 -118 -1207 3008 3000 -608 -10 1349 -2339 -3206 730 455 -1691
1443 -1691 1564 3816 376 -1178 1502 -326 -4257 -1320 610 -885 -759 3839 2232 -277 1266
1458 1266 452 -2464 -3611 1165 -1106 -1528 1940 2962 502 -974 2637 -1098 -3595 -631 5 -1836
1474 -1836 236 3698 1225 269 1721 850 -3929 -1910 705 -2728 -926 2185 2650 -397 889 2912
1490 2912 -2378 -2199 -103 -1106 -1728 1040 3115 -99 442 2805 -761 -3871 -121 -353 -3255 240
1506 240 2142 2114 -543 2658 1568 -3331 -383 -492 -2176 -2227 2168 2041 -1611 2323 2987 -1747 -2671
1523 -2671 933 -1330 -3397 979 2122 579 -36 3695 623 -3009 517 -1160 -2945 -1490 2526
1538 2526 628 -1207 4101 1439 -1609 -1163 1133 -2197 -2956 1976 340 531 1380 3468 -1331 -2011
1554 -2011 1918 -2901 -2926 -666 2275 -1009 521 4408 496 -1052 -37 407 -3796 -981 1172 -913
1570 -913 122 2475 2965 -2017 207 1095 -3393 -1981 527 997 -664 1396 3766 -896 147 592
1586 592 -1670 -2701 -776 757 -1984 1487 2420 1435 -991 1911 444 -4108 -202 -898 426 -1022
1602 -1022 2559 2333 -1126 1971 -569 -1248 -2741 459 -1190 -1338 1984 2072 813 -574 2603 -1566
1618 -1566 -1979 -796 -612 -805 -362 3031 330 -17 1803 232 -2118 -1225 251 -770 -1525 2498 1743
1635 1743 159 994 1195 -590 -3134 -79 -1363 -852 -369 2551 785 -192 2942 -1000 -182 -2530
1651 -2530 1212 -1858 -1264 2034 631 1874 -80 2657 -2651 -1006 -989 -1387 -722 -527 3381 -1288
1667 -1288 2464 887 568 -1724 -1062 179 -3041 474 579 1802 -915 2906 527 -1332 -618 -330
1683 -330 -1452 -2111 2180 692 355 1090 3185 -1384 -1050 -200 -1186 -2349 -897 2790 -1682 2478 1350
1700 1350 1634 -1887 128 388 -3725 712 -433 2151 -2139 3845 441 -1200 83 -1159 142
1715 142 -4762 3215 -1281 508 1462 2172 406 -2336 2427 -2563 -1249 -1559 2540 -1892 727 2997
1731 2997 -22 378 -739 1637 -4164 -6 252 -133 -647 2496 2136 -1181 1176 -865 -477 -3949
1747 -3949 1780 -1187 -589 1464 1832 1179 -1422 3232 -2752 -957 -1739 1440 -1890 219 3628 -1146
1763 -1146 1338 -1111 2716 -4119 -271 138 -1398 106 751 3339 -2241 2960 -383 -176 -2748 212
1779 212 -167 -3236 2742 192 1840 -1485 2882 -1036 -1809 -601 -419 -950 -1400 3909 -1251 1664
1795 1664 342 1916 -2472 -1681 966 -2627 -61 -183 2835 -1605 2491 871 -267 -1480 -747 442
1811 442 -3452 2550 -17 1307 -578 2513 234 -2618 727 -1374 -980 -2106 3017 -701 1216
1826 1216 1484 903 -452 -2074 1708 -3219 -127 -46 1613 -841 1164 2588 -1658 -86 -444 647
1842 647 -3746 1509 568 185 716 1637 1504 -2412 1345 -1725 -1339 -1851 1974 -113 -634 2383 875
1859 875 232 -1421 1993 -2578 -1054 72 91 -303 393 3093 -1323 191 -218 104 -3294 -197 750
1876 750 -1295 1249 1497 2108 -1974 1759 -384 -1874 -1304 192 -16 -1306 2714 735 299 -768
1892 -768 1477 -1655 -2058 659 -648 -81 305 2933 -365 210 735 -766 -2217 -892 859 -1696
1908 -1696 767 1491 1629 -665 1227 820 -1870 -776 -178 -290 -1257 1779 1079 -59 456 1174 -1199
1925 -1199 -2032 361 -970 -906 173 2271 -38 38 1715 -290 -1479 -809 835 -1992 39 1209
1941 1209 994 -504 1215 1220 -1664 -419 -394 -851 -1275 913 1660 -493 1135 1566 -421 -1767 45
1958 45 -1069 -1668 209 1398 285 202 2001 44 -1246 -43 107 -1581 -912 732 446 -143 1175
1975 1175 1207 -967 -600 -41 -1451 -1402 455 859 -450 797 2001 -136 -1257 236 -786 -1960 -675
1992 -675 788 -103 37 2032 558 -923 -134 -32 -1675 -1164 669 301 -523 1238 1705 -646 -511
2009 -511 185 -1304 -1933 -295 846 -523 485 1778 288 -171 622 -375 -1652 -750 692 -176 -54
2026 -54 1527 1252 -691 553 -431 -1181 -1050 -171 222 -784 1689 1371 -126 261 468 -1029 -1858 -65
2044 -65 29 -834 507 1644 314 -407 954 -389 -1383 -632 29 -596 -668 1948 922 -146 462 464 -735
2063 -735 -1597 337 -543 -946 746 939 363 194 1381 -641 -852 -365 -191 -779 -307 1953 5 531
2081 531 961 187 -777 -1346 -152 -1123 -367 891 513 66 574 1363 -971 -951 -289 -687 -916 -164 1687
2100 1687 -452 620 1312 -133 -532 -1047 61 -1818 64 1104 -111 518 872 1409 -1365 -202
2116 -202 -324 -1056 -1046 -149 1162 -674 1221 1022 204 -421 -464 145 -2138 275 668 29 441 1106 568
2135 568 -1229 182 -151 -1064 -829 495 335 164 1248 948 -460 -11 -62 -660 -1481 250 389 -452
2153 -452 1394 1055 523 -878 553 -400 -1761 181 -16 322 -355 2097 299 -180 186 -425 -747 -1759
2171 -1759 854 -884 -272 1131 1283 414 -536 1103 -1283 -731 -256 174 -490 232 1416 223 203 -11
2189 -11 -69 -1455 -594 63 -618 129 1209 890 -198 478 175 -794 -1112 302 -673 -241 679 1144 -21
2208 -21 276 1134 -851 -772 -396 255 -741 642 1030 380 451 369 408 -1643 -204 -283 -1153 -111 1008 1222
2228 1222 -393 1220 350 -432 -860 -101 -776 -975 1038 455 658 89 970 -411 -999 103 -759 -805
2246 -805 -213 981 2 393 969 581 -959 -324 -277 -1296 -263 210 742 -94 982 271 -278 -576 10
2265 10 -640 -963 422 96 512 119 1421 6 -517 -23 -622 -870 -511 795 -284 501 495 754 -802
2284 -802 -337 117 -1295 -395 -245 698 -287 986 793 -358 -374 -3 -481 -1477 190 184 397 89 1303
2303 1303 493 -568 246 -459 -1012 -936 571 -313 262 797 541 -28 156 281 -1283 -462 -114 641 -452
2322 -452 832 1025 53 28 -268 -386 -1440 116 -298 254 220 897 912 -374 532 -395 -636 -988 241
2341 241 -163 -220 1075 662 255 -41 726 -1119 -563 -420 -87 -205 322 1219 -40 273 341 74 -1123
2360 -1123 -238 -528 -536 -97 484 803 -198 1123 -136 -227 -719 -286 -594 -576 849 699 477 53 859 -699
2380 -699 -583 -175 -343 -447 -92 1471 176 705 233 259 -1133 -454 -369 -908 3 260 814 -128 934
2399 934 461 -431 -268 -390 -384 -668 767 211 234 477 934 -179 -621 -355 -684 -376 -544 706 97 412
2419 412 848 351 -336 -382 48 -1055 22 214 827 87 881 688 -406 -241 -109 -375 -1016 74 433
2438 433 162 510 808 227 -198 133 -441 -258 -634 545 -346 111 706 315 65 -374 150 -1185 -180
2457 -180 17 196 239 514 723 -35 159 -317 -334 -970 -442 -125 -370 525 605 268 -161 -101 -237 -475 -372
2478 -372 10 -179 247 848 375 286 388 -117 -715 -801 -135 -174 -247 456 695 197 184 216 -150 -788 -318 -76
2500 -76 -178 175 501 518 -97 410 -195 -395 -717 -126 -178 -512 827 493 475 98 294 -392 -743 88 -548
2521 -548 -524 402 847 331 132 782 -32 -632 -537 -445 -604 -394 575 249 361 520 105 -344 -690 -5 -709
2542 -709 -727 597 579 27 466 1041 -314 -452 -322 -521 -487 -211 662 -185 470 469 65 -611 -459 273 -955
2563 -955 -445 606 294 335 723 541 -528 -376 -70 -938 -567 358 269 -25 1042 502 162 -317 -20 -175
2583 -175 -1036 261 472 353 405 654 506 -338 226 -154 -583 -399 248 -61 -174 828 532 -25 -24 306
2603 306 -644 -905 142 -74 -41 224 639 246 -303 342 -332 -490 -362 277 -86 11 767 377 -103 13
2623 13 75 -492 -490 187 -456 -79 793 513 233 -161 364 -930 -476 -183 -246 -252 77 758 -222 248 36 -329
2645 -329 -727 -622 -162 -494 688 274 561 -73 65 251 -910 -249 -299 -430 -135 212 785 -40 301 430
2665 430 27 -564 -271 -156 -344 368 472 411 80 478 76 -712 -304 -553 -215 -310 426 460 -109 688 41
2686 41 -277 -416 -58 -402 -392 300 454 65 234 322 -49 -610 -17 -433 -323 10 327 320 -55 698 326 -141
2708 -141 -180 -238 -641 -651 99 216 180 475 725 -230 -441 -254 -674 -295 164 525 264 5 960 -178 -276
2729 -276 -66 56 -562 -378 286 -172 -22 633 652 -57 247 -27 -716 -614 333 223 -232 675 763 -94 -114
2750 -114 28 -137 -639 -125 114 176 218 820 259 51 -72 -97 -791 -420 282 -233 -12 394 686 65 -1
2771 -1 -136 -487 -543 -258 54 -264 691 362 -154 215 544 -194 -806 -303 -182 36 34 675 460 -166 388 -5
2793 -5 -377 -369 109 -340 -135 619 395 224 417 421 -616 -360 -368 265 -141 210 758 172 574 396 -224 -618
2815 -618 -308 -432 -449 -296 633 292 22 453 -157 -122 -718 74 -432 -527 402 196 248 100 370 -556 -88
2836 -88 -250 -187 -383 -105 418 -58 333 301 286 -415 -20 -270 -375 -313 373 225 33 897 438 -76 -459 35
2858 35 -152 -583 165 240 455 365 898 -211 -120 -137 -480 -824 24 500 -268 215 513 247 -423 -168 -327
2879 -327 -654 -354 15 320 -4 606 413 209 -389 293 -216 -631 121 -156 13 309 926 174 20 -215
2899 -215 -406 -420 -395 458 -164 256 518 496 -54 114 -271 -630 -278 -44 12 -156 636 531 34 157 180 111
2921 111 -650 -22 -98 -132 220 733 146 153 508 -179 -189 -214 59 -122 -44 567 201 313 -52 18 -418 -372 -68
2944 -68 -276 -300 326 457 122 254 189 -161 -756 19 -392 -580 164 409 476 -47 509 110 -324 -172 56
2965 56 -462 -45 359 501 203 156 292 -281 -437 74 -786 -275 69 340 13 124 395 -85 -200 -106 8
2986 8 -366 432 116 285 107 460 249 -606 -159 -249 -584 -84 301 159 168 193 454 -275 -295 186 -579 -411
3008 -411 103 352 122 366 707 55 -183 -295 -121 -669 31 64 153 113 408 632 -200 -79 120 -721 -611
3029 -611 -53 -185 9 430 249 8 -104 112 -183 -430 -89 65 30 142 433 269 -315 225 -312 -466
3049 -466 -358 -183 52 -18 618 441 70 124 -272 -151 -272 206 -341 -109 349 605 110 102 443 -336 -470
3070 -470 0 -303 18 85 594 164 68 91 -177 -582 -318 93 -519 -157 107 168 383 226 199 -425 -183 -380
3092 -380 -129 -38 150 460 357 250 295 -133 -484 -261 -153 -341 -33 89 692 6 403 6 -545 -15 -527
3113 -527 -452 -79 -77 203 147 538 113 -358 -444 -250 -203 -325 -113 244 105 616 422 101 -338 -157 -310 -266
3135 -266 -28 -3 458 251 489 21 -144 -290 -245 -284 -280 119 458 -23 271 438 -144 -161 -31 -224 -166 -118 236
3158 236 283 182 364 181 -214 -75 -156 -199 -607 17 26 91 433 385 6 -92 -12 -344 -371 -118 182 -66 321
3181 321 285 273 -44 -116 -276 -494 56 -40 25 44 321 97 36 -255 66 -461 -182 -66 20 -15 137 377 -31
3204 -31 -146 -189 -254 -421 -168 -83 -7 129 745 384 19 205 -227 -196 -191 -83 -256 58 266 324 146 297 73
3227 73 -70 -619 -214 -88 -164 358 565 213 130 61 -273 -340 -501 -313 -231 -89 312 -30 -10 92 -187 -114 -259
3250 -259 -76 -339 -306 459 47 71 124 333 -255 -216 -426 -220 -451 196 465 76 291 555 63 -312 94
3271 94 -247 -405 -158 417 -44 -52 131 -25 -326 -124 12 -419 -183 186 352 17 211 332 -110 -288 -313
3292 -313 -31 -690 -199 156 -141 362 325 138 -318 -119 -450 -312 -226 91 -43 121 559 208 254 -457 -47
3313 -47 -308 -643 -197 -137 282 146 379 205 148 -77 -299 -256 -291 29 -344 386 235 18 -256 -150 -74 -291
3335 -291 -361 38 -51 -66 170 338 151 -55 -110 -147 -362 97 -104 81 137 387 264 -90 208 -30 -430 -389
3357 -389 105 -148 374 257 270 70 38 -5 -510 -363 322 -302 -238 361 598 10 322 115 -37 -524 -284
3378 -284 -196 28 -29 430 247 -12 394 80 -182 -216 94 -347 13 305 168 142 214 360 -150 19 -138 -129
3400 -129 -198 60 195 287 167 239 -238 -481 -49 -64 -37 -216 219 417 279 667 150 -472 -277 34 -271 -53
3422 -53 344 353 362 148 468 -274 25 -22 -293 -162 69 576 -117 380 498 159 -206 30 -47 -415 -22 -13 14
3445 14 191 518 -32 20 -57 -208 -247 -425 86 397 67 374 315 -76 83 -89 -458 -24 -136 477 355 289
3467 289 302 200 7 -137 -297 -412 -412 -66 125 79 654 222 119 61 -162 -419 -363 -207 -157 115 77 590 -65
3490 -65 -14 1 -623 -470 -47 76 165 58 665 343 -211 153 -168 -505 -330 -116 -74 7 343 468 350 -19
3512 -19 74 -310 -566 74 -93 -114 -83 475 225 -104 17 -462 -323 -304 -38 -64 -200 499 293 192 226 -9
3534 -9 -135 -493 -170 -337 5 148 168 174 88 175 -146 -484 -190 -126 -220 -122 226 361 237 413 -214 -358 -422 154
3558 154 -76 -159 545 525 32 220 -76 -421 -182 -52 -335 -338 8 282 -114 6 278 -14 -211 -167 109 -490
3580 -490 -177 37 283 247 269 39 -333 -239 -113 -282 -211 406 -152 27 453 391 -39 -487 -224 -359 -353 226
3602 226 235 74 283 401 -152 -184 -198 -360 -361 -11 32 -95 124 580 342 -357 22 -128 -682 -589 55 24 52
3625 52 276 200 -47 -212 203 -123 -323 -158 125 -15 107 282 146 -82 37 51 -455 -146 22 -163 64
3646 64 359 476 42 230 -96 -377 -539 -43 30 -46 485 152 -15 50 131 -330 -549 -227 42 -410 291 313
3668 313 -9 -37 240 -41 -593 -317 -137 -102 -203 271 437 113 108 -17 -231 -384 -23 -164 -192 282 171 -28
3690 -28 260 461 -43 -313 -105 -117 -296 229 279 116 62 323 118 -124 -60 -98 -232 -322 267 318 59 86 570
3713 570 -177 -146 -185 -435 -287 -70 145 147 214 299 153 -237 -30 -242 -298 135 37 256 193 376 82 -242 -395
3736 -395 -244 -430 -55 222 233 -88 91 184 211 -175 -410 -209 -302 27 -78 16 321 149 227 -321 -91 -4
3758 -4 -414 -66 42 138 125 472 235 -311 -34 -232 -295 -363 34 212 -5 268 333 190 -62 53 -184 -200 -103
3781 -103 213 -109 319 618 285 59 387 -13 -408 -174 15 116 83 141 413 -94 150 256 -144 -308 26
3802 26 -329 105 194 390 247 -6 -106 -296 -289 -197 113 -70 250 339 327 110 99 113 -294 -256 -100 -382 -114
3825 -114 99 292 176 234 259 69 -302 -202 -166 -142 173 509 434 113 229 -80 -552 -164 7 -256 -22 259
3847 259 456 106 339 -40 47 -127 -169 -448 -258 145 79 245 545 192 -149 -476 -37 -116 -37 380 291 344
3869 344 148 239 131 -334 -442 -43 -453 -159 41 9 236 155 180 -273 -100 -105 -262 -310 148 226 174 196 441
3892 441 -35 -265 78 -267 -299 -213 -18 140 119 138 313 -164 -414 -212 -269 -118 -22 30 284 212 463 9 -76
3915 -76 -215 -113 -378 -96 207 -46 428 244 149 32 -84 -182 -418 -209 25 -64 26 342 247 -42 4 -52 -346
3938 -346 -333 -77 -26 -55 -227 199 162 251 196 -153 -187 -332 -179 137 414 561 183 228 227 -132 -326 -183 240
3961 240 22 -65 80 150 -70 91 14 -100 -58 63 -379 -95 399 179 29 60 109 -140 -233 -230 28 -391 -104
3984 -104 404 303 207 122 47 -334 -371 -51 -64 167 302 604 -36 360 155 10 -121 17 -200 -436 -5 -56
4006 -56 -100 67 144 -141 -150 -310 -229 -179 -94 128 205 29 378 269 0 -71 -128 71 -239 173 265 -22 371 168
4030 168 190 -186 -18 -226 -331 138 -48 73 32 497 334 -224 -260 119 138 -307 -289 75 136 128 220 0 -187
4053 -187 -273 -196 -289 54 -53 265 374 93 74 -169 154 -214 -430 -253 -145 133 -43 536 -9 -58 -31 -101
4075 -101 -121 -490 43 -269 190 460 199 208 144 -49 -32 -499 -183 -95 -115 357 363 108 -33 83 -125 -365 -55
4098 -55 1 -120 -201 439 352 81 26 27 -473 -320 -88 -269 388 -90 500 367 266 -19 42 -360 37 22 -229
4121 -229 229 28 187 194 379 -286 -121 -436 -72 -260 41 122 226 111 178 150 -123 -106 -151 35 -255 171
4143 171 439 293 194 224 75 -246 -124 159 -375 -137 96 -181 358 380 47 -351 -189 80 -298 -67 56
4164 56 228 143 276 271 -5 -360 13 -168 -541 70 -63 169 298 236 90 -90 133 -122 -301 -154 14 247
4186 247 133 9 384 -156 -31 -113 -169 -137 107 56 169 462 19 31 -160 52 -76 -292 240 127 -62 -97
4208 -97 236 -114 -163 63 -380 -453 -144 -97 -218 -167 322 111 132 208 -32 -103 -407 17 -193 -225 355 292 148
4231 148 156 -11 -243 -514 -391 -174 -74 184 556 151 64 153 35 -405 -288 -18 -97 16 104 344 120 -63
4253 -63 270 -378 -356 -181 -145 -24 64 386 262 58 124 -122 -471 -201 -185 -175 -85 468 22 247 162 120 -213
4276 -213 43 -350 -85 54 159 209 211 236 18 -393 -312 -185 -275 -243 -57 173 230 100 47 115 -312 -170 78
4299 78 45 -436 -99 242 337 105 230 -211 -107 -240 -28 -189 119 362 54 124 250 86 -239 -112 -214
4320 -214 -145 81 108 -101 185 301 -162 -129 -44 89 -255 -175 17 52 28 290 119 -211 -21 18 -77 -230 -174
4343 -174 126 270 476 303 -120 183 -63 41 -56 -44 261 242 142 115 -50 -150 -93 123 -446 -229 -218 193
4365 193 -52 281 245 121 251 -216 -33 -171 -119 -85 100 209 332 68 -62 -165 -97 -286 -167 60 -169
4386 -169 -77 333 285 314 -32 -107 -114 -396 -424 108 172 136 307 146 162 -126 43 -357 57 -73 35 244 270 295
4410 295 96 -6 17 -402 -114 -226 -73 -58 201 42 -107 132 190 -100 -241 35 -347 -104 197 306 396
4431 396 249 196 -69 -56 153 -291 -331 -63 235 229 55 118 3 -136 -206 -191 -279 -150 135 145 170 169 20 -65 -39
4456 -39 -143 -193 -335 20 65 78 450 178 -24 -315 -345 -72 -283 33 -21 197 148 170 -34 -124 60 -273 -230
4479 -230 -8 -82 18 335 396 109 122 -229 -5 -398 -470 -141 -69 23 211 381 24 -189 -152 13 -137 -203 190
4502 190 60 -10 -78 303 31 -323 182 -293 4 -66 -157 156 126 176 -94 101 -149 -230 -38 -239 60 -36 145
4525 145 103 172 -270 89 -211 -81 -80 217 21 -322 115 300 86 -21 292 -224 -364 -143 -70 391 -138 475
4547 475 12 -107 304 10 -383 -230 -107 -130 62 8 368 230 133 87 -299 -249 -73 -30 -107 355 373 12 38
4570 38 95 -468 -222 -40 -246 -137 110 97 -215 204 104 -89 -41 -170 -205 -109 -30 277 226 356 -129 122 25
4593 25 -250 -93 -1 -216 -74 347 219 47 365 93 -113 -264 4 -95 -167 235 -5 289 24 179 -67
4614 -67 -265 -225 -171 -203 55 310 102 191 184 -25 -162 -262 -159 208 75 232 60 51 233 32 -258 -82 63
4637 63 -118 -95 93 15 209 420 169 13 -166 -102 -117 -402 -7 147 68 131 87 81 110 132 -69 -337 -251 13
4661 13 29 265 306 207 -20 -191 -148 -168 -346 43 246 70 315 276 173 -27 -68 -96 -200 -13 -223 -82 59
4684 59 175 -34 195 23 -293 -121 -181 -58 214 275 416 134 217 223 105 -322 -104 -7 -314 82 38 281 382
4707 382 171 -9 -227 -407 -118 -114 -23 252 499 390 52 26 -49 -185 -44 267 -1 91 153 308 261 499 -28
4730 -28 -237 122 -18 -44 -73 -127 218 40 119 153 -189 -291 -35 -22 -141 -81 151 6 55 127 162 -395 126 -123
4754 -123 -111 -42 -182 134 -25 280 10 -122 -19 -294 -478 -42 -5 230 236 231 -12 23 85 55 -287 57 2 2
4778 2 154 36 157 142 -364 222 -96 -50 -164 57 -129 344 47 262 -36 -80 -181 -384 -126 -32 264 66
4800 66 328 299 51 98 -64 131 -150 -85 -264 -206 -17 -188 75 -9 0 -55 -122 23 12 55 -278 242 275 -59
4824 -59 161 -82 -120 -474 19 19 104 350 561 206 -148 -134 -153 -61 -108 -87 -62 7 157 103 28 269 -69 -155 -181
4849 -181 -90 -196 -129 14 427 107 180 127 -180 -358 -43 -216 -295 240 227 188 -30 -14 -90 -295 -94 -213 -186
4872 -186 -183 193 -106 417 -11 90 -257 -320 84 -56 -251 13 238 -143 201 23 -178 -214 -146 -410 -285 -122
4894 -122 26 116 170 64 -90 85 -341 -61 19 -17 -31 -23 201 195 219 -101 -319 -77 -165 -180 87 96 158 65 119 -216
4920 -216 2 -202 -348 -126 123 267 48 33 117 287 31 -12 19 -290 -203 -110 -138 -102 181 228 -29 -34 -91 -332
4944 -332 -237 -150 100 122 78 112 -95 17 160 -162 -351 49 267 233 -52 145 211 -71 122 -105 92 -91
4966 -91 -78 47 -99 -43 346 221 100 54 -149 -489 -139 -102 -85 196 45 290 225 -45 -378 -62 -117 25 90
4989 90 61 132 287 195 138 233 -218 -93 -51 214 -59 1 251 126 -102 -16 -244 -337 -208 -66 -98 -30 288 150
5013 150 -87 -7 117 -227 -246 -94 -146 -286 134 -65 -102 154 226 26 -52 -8 -272 377 162 322 85 246
5035 246 328 -15 -195 -318 -153 -168 -104 498 60 323 288 -255 -279 -241 51 -288 -18 -29 186 -53 226 288 -74
5058 -74 28 134 60 -168 -60 465 -77 246 127 47 -98 -251 -186 -258 4 140 3 129 -78 149 -70 -203
5080 -203 -130 95 -212 -100 -32 97 364 125 69 -239 -233 -49 -136 25 266 118 -9 48 51 215 -257 -274 -313 111
5104 111 -178 -174 8 284 569 -172 23 -90 -244 -78 87 69 113 307 181 -7 -122 64 -52 -275 -46
5125 -46 -156 -45 60 92 84 42 -45 17 -281 -162 18 -43 -96 -140 280 -180 11 -319 -33 -320 -123 55 -22 211
5149 211 145 124 -34 92 -30 -184 -372 -79 -283 339 168 3 125 -11 -86 -198 -116 -3 -99 121 149 -26
5171 -26 138 -100 -185 -242 -239 -264 58 -16 123 389 266 205 123 -3 -330 -216 -177 -128 193 69 228 -127 -9 98
5195 98 -6 -89 -6 -417 -39 98 -54 258 -126 241 -45 -212 -51 -294 -151 -301 172 356 69 -143 -1
5216 -1 -225 -427 -55 -138 -222 66 151 36 73 413 28 -85 -12 -104 -110 148 209 167 215 215 48 4 -156 -118 -258 189
5242 189 112 38 356 211 194 112 -116 -177 -319 104 168 95 -124 198 258 198 301 -153 -205 -406 49 126 -74 37
5266 37 445 271 83 74 -203 -395 360 -49 15 69 380 189 146 -139 -74 -225 0 -166 -125 171 11 373 158
5289 158 -3 -114 -282 -373 -272 -158 66 146 208 222 -51 113 22 -326 110 -70 -155 111 150 457 360 362 58
5312 58 -217 -329 -103 -388 -105 26 291 -382 -172 474 14 -5 17 -41 -3 182 148 179 302 141 -3 -130
5334 -130 -20 -278 -39 88 58 0 111 35 232 -204 -202 -143 -137 -226 36 18 139 -238 295 -36 -267 -59 -85 -144
5358 -144 -125 110 195 23 -33 71 -185 -183 -192 47 -14 -67 173 70 -117 264 160 -73 61 -32 -251 219 -87
5381 -87 -32 96 106 134 17 -8 -156 -233 123 -120 54 -82 57 121 -86 -239 -2 155 184 -135 324 155 11
5404 11 352 20 -338 40 -214 -337 -231 -44 11 76 251 22 15 61 143 124 -55 -329 36 258 352 305 -217
5427 -217 -227 27 -94 -196 -55 -239 114 42 -29 163 168 -1 -59 -418 -134 1 10 112 75 158 64 79 -104 -215
5451 -215 -336 -23 153 -128 146 150 35 318 -159 168 -307 101 -55 48 12 -34 235 300 55 -102 84 -138
5473 -138 3 -107 23 310 237 166 1 -21 -415 -82 65 -111 -120 -14 112 14 42 -57 291 -93 -236 -152 -225
5496 -225 -22 141 -314 129 307 -104 -154 140 253 -90 -69 -166 80 187 202 21 -272 -82 -179 -329 -129 -86
5518 -86 163 185 94 83 -45 -306 -62 -113 -228 18 114 26 163 125 -68 247 153 -193 169 -239 121 150 315
5541 315 171 359 -24 -239 97 -97 -2 62 -87 52 153 44 312 -216 -181 -244 73 -30 68 14 -49 247
5563 247 82 -170 -201 54 -136 -154 -90 5 -64 43 344 -35 -49 135 -44 144 -223 141 -113 65 168 26
5585 26 -162 81 45 -325 -293 224 -224 -95 156 186 290 -228 -202 -42 -298 -100 97 51 16 209 384 -98
5607 -98 223 -76 -305 250 -205 -121 -50 222 159 17 164 -80 -64 -251 -110 -202 -3 33 165 72 189 100 116
5630 116 -258 97 -41 -160 -11 7 72 -298 147 -118 -248 -41 -117 -191 -403 99 -162 23 182 73 116 -342
5652 -342 94 12 87 -203 203 -88 -62 320 66 -272 130 -178 -67 -56 15 235 -172 1 44 -16 -209 -164 -196
5675 -196 47 135 202 455 -118 129 -122 -187 -273 -158 91 -4 221 16 224 193 166 -39 -279 162 -154 -290
5697 -290 74 -152 -84 283 96 -120 -81 -305 86 -16 -146 -171 340 107 -67 65 -168 213 -119 -181 -336
5718 -336 86 -118 52 304 -37 239 62 -215 -219 -21 52 285 225 251 132 139 -88 -103 29 -32 -99 -296 122
5741 122 365 376 177 92 95 76 -106 -60 -42 71 151 -105 258 124 30 113 -22 -153 -112 -76 11 -124 157 -63
5765 -63 73 191 -374 -198 -101 -201 -112 -53 385 -171 70 102 -158 -132 125 -9 13 54 58 159 -214 -1 53 -102
5789 -102 -89 -136 -455 -56 84 270 20 -73 -8 -91 79 -103 -332 -229 232 -69 -57 293 85 -162 255 -92
5811 -92 -228 -127 -22 17 89 32 172 69 -163 -90 192 -157 -75 60 -102 341 -60 264 9 78 -290 -111
5833 -111 -141 41 103 196 -40 96 111 -102 -136 -187 -245 88 -61 64 11 338 -79 -242 211 -198 -174 -59 4
5856 4 -117 -147 -37 24 16 -11 217 -106 -8 -50 -13 15 53 158 -180 42 -15 21 -272 104 -214 236 145 178 10
5881 10 -46 159 36 -165 -36 -173 -153 -377 -257 38 113 138 -161 -308 -34 46 -43 125 -89 145 149 62 33 -2
5905 -2 -152 -212 -16 20 81 -38 137 266 155 122 10 -109 77 19 -71 220 -195 -227 112 108 77 -355 -141 12
5929 12 32 -172 57 48 -89 301 155 171 -156 -79 -53 -25 -45 190 -270 210 94 -144 -190 -2 -40 -172 41 111
5953 111 246 58 135 -148 121 -152 -53 -203 -157 69 210 99 -211 7 -187 -290 101 186 211 -188 -99 78
5975 78 125 239 230 -217 133 -190 -140 -79 -73 187 80 118 63 192 3 -50 -84 -100 -107 103 -36 47 224 -169 -211 14
6001 14 42 -29 61 -130 97 244 199 212 85 -134 -153 -213 -188 88 -168 -155 435 123 -79 16 50 -197 -28 -28 -50
6026 -50 -10 -153 209 -253 59 -45 -348 -240 -181 106 176 -13 115 -156 -56 11 -132 -211 -32 73 100 235
6048 235 49 -89 -204 -52 -5 -153 -107 -367 109 76 -9 148 146 180 176 -80 -75 -95 -127 -130 109 208 51 -115 152
6073 152 340 -179 68 -232 116 159 15 209 -175 168 -7 52 -159 -103 -197 66 -97 172 133 69 -2 -177
6095 -177 -42 -98 -246 -75 0 189 97 54 70 -60 42 -177 175 -29 -254 -75 90 289 -1 -7 179 -110
6117 -110 282 -214 -326 3 58 227 -128 114 240 -99 -141 -135 -151 -78 -133 146 62 175 186 -154 -364 -39 -391
6140 -391 -376 -53 231 113 263 274 -72 -21 134 109 -217 -165 -377 38 -52 313 157 -7 85 -22 -39 -244 -24
6163 -24 34 -5 15 202 -44 48 256 -140 18 -10 -89 -3 5 -159 184 97 170 -134 -26 -35 -100 -243 93 152 -46
6188 -46 -31 -88 -221 -51 -7 -72 -7 140 51 107 -66 80 301 -27 -195 -4 -268 -124 -158 83 -13 88 9 -28
6212 -28 -87 -361 -221 113 144 197 -17 -123 -158 -23 -162 121 44 -315 -41 80 -140 192 366 7 6 -44 -167
6235 -167 -245 68 -51 23 168 26 176 12 -233 -227 -174 -29 19 185 -41 282 144 -52 -22 -71 -67 -29 80 338
6259 338 19 43 -19 -64 -97 -146 -153 -99 -7 -94 33 67 147 -86 15 134 31 -114 -184 257 58 62 89 390 131
6284 131 -61 180 16 -185 -216 -166 110 -42 161 237 228 166 39 -123 -103 -227 -166 -15 297 139 -191 95 -58
6307 -58 -111 126 -31 -55 217 202 -73 46 -88 109 -162 -80 -156 227 194 3 -17 262 98 0 86 100 -49 59
6331 59 -46 88 17 379 143 37 103 -62 91 -238 -107 200 215 185 99 129 48 -294 -96 183 21 -177 -14
6354 -14 -9 10 -48 -130 -270 -35 -70 -263 -95 -100 -4 75 25 81 37 211 -137 -295 -6 -29 -3 -22 98 -53 73 52
6380 52 -117 -115 -139 17 -116 44 48 -130 19 96 128 110 -434 -5 43 -28 179 232 131 154 102 76 -257 -123 -71
6405 -71 -307 220 -178 223 96 -138 37 20 -2 109 -130 -121 24 -213 300 -207 141 -1 -183 122 -218 -175
6427 -175 -133 3 44 -88 -17 -90 -8 -184 -9 266 -91 -62 -194 56 237 -77 -40 -65 -78 -211 -242 208 163 97
6451 97 -70 -36 -128 -58 -40 -131 -261 -107 117 26 20 100 31 -153 67 53 -140 -41 110 225 29 325 146 -229
6475 -229 -264 -117 -328 -115 190 17 -213 66 33 193 -119 198 -112 -163 -1 -45 21 128 206 48 66 -56
6497 -56 24 67 -69 105 -42 -413 138 173 -212 64 -110 -403 -259 255 -50 88 238 -170 137 -170 -7
6518 -7 94 -130 -216 -48 252 70 52 -285 -5 176 48 -74 -227 11 3 -55 -249 159 178 340 -125 -159 -24
6541 -24 -121 -185 -174 80 302 97 34 182 -200 69 -176 -204 -108 -69 100 -150 61 22 -139 -386 -151 84 -145
6564 -145 -81 38 268 168 -337 84 -427 -223 -160 60 -113 -2 1 154 214 118 -49 -174 -110 82 -204 -233 102
6587 102 75 139 53 329 -15 74 123 -112 -14 312 -105 381 171 -97 -1 -60 125 7 25 140 107 192 190 177 -227
6612 -227 -68 -169 -30 -59 275 103 73 128 -108 14 -146 99 -355 -139 -128 399 -17 -50 153 45 -169 -89
6634 -89 -149 -45 -250 -177 -186 313 90 415 211 365 92 -164 -7 -264 -49 -21 -138 51 35 37 133 -265 -124
6657 -124 -243 -58 -231 -3 -27 42 72 143 -114 -42 -115 -99 -97 -26 -280 -47 -3 180 146 324 -163 -99 -29 -169 200
6682 200 8 197 159 -192 134 107 -86 69 -40 -545 105 161 94 -3 362 -92 -19 -44 -178 134 67 -23 10
6705 10 231 128 276 -210 198 -133 -145 11 -99 -112 -67 158 -114 -97 86 70 -189 70 -11 186 -5 70 -8
6728 -8 1 91 -66 21 -97 -146 12 105 -43 117 314 -44 67 152 9 -31 82 107 -146 152 109 245 186 -241
6752 -241 -40 -213 -15 32 28 -14 -12 183 -201 -102 -61 -98 142 -124 -29 -79 332 135 -342 76 -136 57 -266 -86
6776 -86 -40 97 93 138 154 -19 -150 69 -3 1 26 110 182 299 178 136 -225 -2 39 20 86 -101 189 278 19 50
6802 50 -96 -39 -142 -195 132 -146 -131 -124 445 24 -182 77 230 36 -155 69 56 -32 -1 175 238 367 -277
6825 -277 24 25 -79 -200 -16 38 -63 -13 -60 22 -62 -97 -327 105 -212 -10 22 49 32 62 180 -184 -274 -158
6849 -158 35 31 95 106 181 -213 140 -109 459 -85 -123 -50 34 141 154 104 -349 143 -139 107 -249 -184 37 61
6873 61 -133 -3 159 167 58 93 -104 -65 168 244 217 104 131 2 146 3 51 -159 159 -371 91 260 -43
6896 -43 15 44 -84 -14 77 46 -280 51 -106 36 -214 -55 109 -113 -13 -333 8 -68 -20 -243 -52 -310 -201
6919 -201 -98 -199 -234 37 -48 20 -6 343 49 25 78 15 -101 -191 -38 106 164 22 304 26 24 26 155 -100
6943 -100 -144 -152 98 37 138 278 -46 96 -203 -148 5 210 -36 13 206 90 156 -70 -203 -284 -359 -199 -122
6966 -122 87 -81 212 -20 99 -137 -177 84 -114 9 -185 155 -215 -30 29 63 119 34 -81 -46 -144 20
6988 20 -316 174 -203 193 -179 -6 93 -174 -63 71 -37 -174 -22 55 -192 -220 -131 -196 -27 82 77 86 -54
7011 -54 47 -156 -106 99 65 136 -174 -182 -173 -21 58 77 59 143 -129 -207 -46 -23 -69 237 114 70 -42 107 -96
7036 -96 -267 -9 -84 -281 -137 -303 -19 159 -40 -86 159 -178 150 -129 25 -72 -207 107 -2 -25 215 49
7058 49 170 156 -65 87 273 -142 144 245 366 -40 78 38 -194 -130 -366 -230 25 175 -21 -123 90
7079 90 -22 -69 36 -127 -17 134 63 200 103 -237 114 207 -52 147 -14 80 -28 290 20 -7 12 118 254
7102 254 -153 -30 114 167 -62 -192 168 -18 294 -135 -204 38 13 -112 96 95 143 -11 -31 199 -193 -128 125
7125 125 -96 -204 261 -116 -263 132 -250 -36 -164 60 -170 173 -4 234 86 144 -118 -149 -147 -34 -98 1
7147 1 -178 106 214 247 164 164 247 129 -99 -375 78 43 68 -109 44 -98 67 -9 -65 105 -153 310 -36 -9
7171 -9 52 -106 -111 -104 148 -19 -101 -226 76 -14 -7 8 105 -62 -58 -118 -43 22 35 -33 154 205 132 -23 107 -76 -152 53
7199 53 -119 62 43 404 47 -162 -166 -126 -292 72 240 -104 -144 -7 220 -111 -155 121 203 -132 138 53 -119
7222 -119 213 120 -168 -102 -10 4 -1 -57 119 1 53 9 204 128 3 -32 -17 150 -182 212 -249 150 76 -65
7246 -65 52 -102 -63 -27 11 201 -77 -50 213 -126 317 -86 -141 -233 173 -35 -74 -154 -14 -132 47 -21 188
7269 188 183 -22 -147 129 -111 -147 90 123 -117 -108 -150 69 -184 -9 -6 246 73 -128 52 -105 106 48 -83
7292 -83 -123 -222 -34 21 -29 129 145 -129 36 54 -60 -285 -205 62 48 -55 39 -82 45 -219 -63 10 -432 93
7316 93 126 -217 40 78 -179 166 -317 -127 144 -28 -151 32 56 170 117 -105 36 -157 -122 -41 -156 82
7338 82 151 -356 347 199 195 -146 65 -7 -238 49 -146 -234 -28 49 -150 78 -50 -3 141 -137 52 3 -15
7361 -15 8 -70 -333 -53 -47 -177 -113 22 -65 208 205 189 -5 -99 -8 81 -128 -192 214 -79 114 -181 195 -29 476
7386 476 129 -84 -155 -66 37 -143 105 225 -141 45 121 40 -90 -138 155 108 -3 72 -228 -39 -223 92
7408 92 -60 228 -188 19 -94 134 10 187 -209 -160 -94 -257 -146 57 -23 -230 -144 94 -6 -22 25 -58 -44
7431 -44 -16 -227 151 12 -93 49 9 -65 164 151 -102 99 -51 109 -125 128 -37 187 83 -176 121 -224
7453 -224 -58 200 86 216 -74 -32 -132 31 23 -3 -138 255 -160 144 82 87 -135 278 -45 44 -421 18 287
7476 287 -74 287 248 264 -110 174 -117 -155 142 243 -161 32 25 -45 46 66 71 -39 225 -183 128 363 9
7499 9 169 -25 119 31 7 3 -168 99 238 130 -97 80 -46 -106 -72 251 -107 86 23 -30 58 23 63 277
7523 277 -85 -37 110 -227 -79 -104 -175 47 62 -38 68 -188 18 -168 -197 256 -105 87 134 -102 105 115
7545 115 -180 6 101 97 120 184 94 28 -180 -65 39 -74 103 -37 55 -207 111 44 -19 24 29 279 -171 -98 -142
7570 -142 -194 227 -112 76 -68 51 -155 -137 -56 -93 7 130 -134 19 113 -7 -30 44 -24 0 282 58 -91
7593 -91 -41 216 198 -258 -182 -224 -102 -25 161 538 3 -181 96 -15 -41 66 81 -78 193 -30 -23 -68 13 217
7617 217 -72 -112 -225 -151 32 63 -129 -115 -41 -129 126 87 6 50 -151 13 275 119 -13 -151 -93 -136 -241 5
7641 5 132 54 199 105 -121 77 169 97 71 237 22 -235 -192 227 110 93 41 15 -103 99 -81 -133 -172 29
7665 29 50 -143 363 124 93 43 113 -120 -255 -127 108 -53 -125 268 56 -6 96 16 -71 22 35 154 -112 176
7689 176 -134 -107 64 -91 229 -141 217 -199 111 -17 219 -168 4 -112 82 131 186 45 -223 76 12
7710 12 61 29 148 109 -214 -165 9 -120 -47 -184 -104 77 319 55 -118 -85 2 275 35 -186 71 23 -164
7733 -164 209 -67 61 154 -156 -68 87 169 -87 -226 104 -10 -105 7 138 -179 134 -23 156 -24 369
7754 369 6 174 -11 64 -199 -119 113 -165 32 165 55 134 -72 35 -204 -175 -164 -29 115 26 81 142 25
7777 25 60 82 -126 102 -109 14 -333 -45 73 391 60 30 33 211 -158 -53 156 -6 -205 -25 135 145
7799 145 6 -204 -90 11 -252 97 340 173 188 -82 -107 -98 -15 35 -96 -327 106 161 -31 204 -304 -193
7821 -193 -249 -26 -16 -1 151 281 259 -50 -82 -223 102 -110 82 -250 -123 154 97 -129 230 102 -7 -137
7843 -137 84 -135 88 44 159 166 -29 97 -79 -153 33 -99 -78 -49 256 -278 -1 384 82 -117 -81 49
7865 49 -269 230 141 -56 51 55 124 -56 -152 -290 -20 -332 -126 116 221 172 36 -26 137 -6 38 -328 -100
7888 -100 146 -9 137 90 -140 101 111 144 -46 -150 143 52 -135 128 218 -135 -101 3 -407 -69 -31 58 26
7911 26 308 277 -5 -69 -31 7 -168 -141 -206 147 70 -87 39 181 11 28 -11 123 -165 -157 147 -53 -430 28
7935 28 -47 56 -15 102 219 -118 -139 154 224 -62 -69 30 217 84 -12 -32 -191 80 4 -72 220 -111 36 -128
7959 -128 -315 -109 -146 190 7 132 27 -93 20 -235 -80 -52 96 -111 29 164 151 0 42 -217 13
7980 13 138 -162 -102 33 159 87 121 109 163 -56 150 -186 -169 -247 -107 -11 -220 77 -304 151 71 150 -107 -127
8004 -127 131 -46 -234 -84 -66 142 -176 -170 -178 277 -251 -11 145 -75 112 -152 -84 143 46 -312 53 -102
8026 -102 -6 -210 -53 14 130 109 114 51 -248 -135 167 -37 -39 -23 181 -93 -17 -121 -117 -88 -84 -17 -246 213 -174
8051 -174 20 -140 73 12 -35 7 -16 312 -135 57 248 84 130 -7 -119 -187 38 -67 170 -211 75 -200
8073 -200 290 -80 -67 12 -135 -3 270 35 139 -277 28 108 -157 -29 -113 128 68 276 87 97 -54 -173
8095 -173 -243 -98 75 100 223 -261 130 272 145 -82 61 -64 123 40 -108 -307 -58 -5 -16 -18 -229 -194 170
8118 170 -48 -158 -72 123 -102 -33 79 -67 113 -98 -94 -137 552 -285 -52 -109 -22 67 193 62 -32 -54 344
8141 344 -72 -90 50 78 82 -278 189 152 -30 108 87 75 101 318 121 154 110 237 15 -95 1 -29 -171 -107
8165 -107 53 -148 -18 -209 62 -223 103 29 -113 -108 59 -88 100 371 186 -248 -136 29 92 22 298 189
8187 189 57 -77 -86 93
8191I3
$$ Imaginary data points
##PAGE= N=2
##DATA TABLE= (X++(I..I)), XYDATA
0 0 0 0 0 0 0 0 0 -8 8 -8 16 -18 24 -32 40 -48 64 -72 88 -104 127 -148 172 -202 236 -271 312 -356 406 -464
30 -464 525 -593 667 -752 839 -939 1043 -1160 1288 -1426 1576 -1738 1915 -2108 2319 -2549
46 -2549 2798 -3074 3373 -3704 4069 -4476 4926 -5434 6009 -6663 7416 -8295 9332 -10574
60 -10574 12091 -13985 16414 -19631 24075 -30572 40874 -59471 102678 -363842 -358988 294490
72 294490 -363309 108311 -480679 416182 -209853 -54266 158369 97835 -22197 -41284
82 -41284 336306 -230710 145731 -102130 310576 -378315 99429 119683 -266272 67119
92 67119 -215794 273121 -327510 170685 15902 58155 -8392 95942 79471 -153164 190607
103 190607 -164607 113884 -248615 255670 -171777 -17517 86340 -101645 140919 -242257
113 -242257 253139 -215998 156764 -76270 76070 -6155 8339 144891 -244911 243807
123 243807 -215635 140755 -218119 129586 -1519 -133529 190998 -135565 165974 -179201
133 -179201 197131 -131961 3489 29650 17929 -31709 -65187 219042 -193341 99225 -99762
144 -99762 148614 -169751 -19178 134214 -125347 73828 -56211 170771 -154162 80090
154 80090 17986 -22695 -83776 55064 47032 -152673 125964 -40585 102283 -182128 151909
165 151909 -6624 -118660 66434 -32875 80623 -147339 158283 -29396 -11108 -11799 63183
176 63183 -53373 -76667 95729 -71684 35804 -88257 177990 -104380 -1661 71098
186 71098 -44714 18462 -97724 128204 -95444 23539 16397 35744 -34832 6518 45169
197 45169 -76492 24634 -43113 68547 -100526 75456 19207 -25079 36476 -26990 55157
208 55157 -88299 40587 -22835 -7433 -2571 25168 -1940 -4151 38127 -34226 10453 -40364
220 -40364 49093 -61707 19219 31306 -17767 26919 -10682 40677 -53542 13901 -4871 -23178
232 -23178 -20865 36654 741 -23183 45743 2391 2531 -49836 57074 -33429 -37232 35893 4391
245 4391 2249 -23050 65863 -25090 -32690 19983 6310 -49689 -6041 51825 -21319 -11580 32264
258 32264 44378 -59588 2656 38613 -41683 -28924 18755 34201 -47402 15289 54238 -28047
270 -28047 -28939 29264 3276 -51180 2625 44484 -15419 -26486 58185 10334 -39532 6145
282 6145 18591 -25803 -42660 37281 9394 -35450 29385 31945 -15866 -17542 22526 -617 -43542
295 -43542 8817 27633 -23981 1433 34129 126 -16404 531 12751 -33243 -15591 26574
307 26574 -14078 -172 21985 15943 -6887 -3613 14635 -21753 -18006 10774 -6099 -10246 18829
320 18829 11576 -3897 474 12404 -13802 -24337 15162 -5192 -13147 14647 21910 -4991 -2989
333 -2989 21975 -10912 -27301 3866 6589 -27708 2315 31490 -1524 -12130 23220 14059 -35215
346 -35215 -5625 19229 -15756 -21862 27918 20012 -24619 12108 26008 -21049 -28086 16958 3558
359 3558 -37248 11897 37179 -12349 -10224 32848 7039 -36237 -2051 20323 -25120 -21259 33736
372 33736 7007 -20077 17835 20610 -18588 -25138 22704 -5328 -33065 20068 22848 -9590 -3692
385 -3692 27263 2262 -31053 2601 10382 -29154 -4024 20435 1932 -5151 13722 21120 -25160
398 -25160 -3425 11570 -15864 -15211 11782 14482 -12048 8852 16498 -3145 -20188 10262 -9811
411 -9811 -17163 6781 4981 7668 -6453 31373 -6822 -9846 6629 -6676 -12004 -14859 20852
424 20852 -9392 1213 13326 10862 -11457 182 7366 -21802 -2830 3528 9386 -14706 19809
437 19809 17343 -13874 -1918 7228 -6837 -25434 4286 8344 -8531 -1730 30322 -6620 -1363
450 -1363 5404 1182 -17308 -14697 28059 -23976 5301 12245 17084 -15621 -2973 21407 -27739
463 -27739 -7683 -2118 16329 -25802 22083 14600 -3959 1354 2948 13162 -46935 23603 -5141
476 -5141 -9048 -3789 17880 17634 -28093 22012 1142 -12380 -18713 16940 -9343 -5997 13029
489 13029 15212 -4099 -7156 28497 -27219 -9006 -1199 7473 -20672 3500 23140 -1520 -4289
502 -4289 10297 12898 -34636 16933 -13737 4958 -16003 19624 14473 -29156 36865 -15411 4095
515 4095 -28840 20431 -11151 -16320 17534 4464 12035 -17662 39440 -31775 8304 -10940 808
528 808 -10441 -11923 38245 -32046 24428 -2789 15008 -23873 2408 7721 -20871 3525 4255
541 4255 17402 -23530 36280 -11766 -345 -13214 9587 -7965 -30465 33734 -11519 8098
553 8098 -9064 34818 -15675 -8311 6020 -1411 -15145 -8787 30947 -29343 25912 -9110 26340
566 26340 -31440 8053 13469 -38245 19917 -19432 36200 -36722 34239 5038 -9156 3069
578 3069 -6939 9498 -39278 33921 -24147 19089 -16728 31877 -5850 -21028 32149 -30997
590 -30997 14851 -34614 38613 -21106 4180 17195 -214 3953 -16318 24229 -36129 12410
602 12410 -15576 18655 -19710 14826 19987 -18221 16153 -12846 17246 -36872 19674 -11212
614 -11212 6660 -5650 13689 9303 -20041 28737 -31347 18475 -34035 28632 -18034 -2613
626 -2613 25817 -11120 20981 -25738 35454 -36426 10550 -15006 8592 -6969 -5054 33128
638 33128 -32621 36061 -26366 25303 -34073 9951 8182 -26513 25073 -12656 31090 -29371
650 -29371 26668 -10005 -5358 -10275 1789 -255 -19035 31014 -16139 20645 -17256 32068 -23257
663 -23257 -8718 13227 -15650 6113 -19231 37385 -22034 11863 -5 8483 -17400 -2862
675 -2862 10231 -24051 16012 -9529 29445 -29562 30741 -1767 -12388 1406 -12017 18136
687 18136 -39582 32132 -10669 11078 -5047 12876 286 -18963 19436 -22552 9143 -18926
699 -18926 32610 -19800 7405 15523 -6558 1706 -21158 25678 -32968 9270 -1846 10010
711 10010 -5653 8148 15955 -19841 11892 -10731 8217 -29725 21661 -498 -7607 9842
723 9842 4741 10418 -25794 18789 -12825 -4164 -8201 14589 -5209 -1106 20473 -6781 3901
736 3901 -12852 21061 -29691 328 7316 -2641 -569 -1870 25672 -19145 6968 -2133 1907
749 1907 -18136 7509 5318 -11244 13511 2213 12369 -22164 19500 -7618 -14616 -1001 2073
762 2073 5702 -14800 23579 -1241 1385 -3385 8798 -11864 -9067 9579 -8463 1559 -561
775 -561 20007 -13383 2720 7142 -6187 -10004 -3300 10208 -13626 8136 6989 6236 -5874 8944
789 8944 -46 -14696 1250 -914 -2063 -10830 18730 545 -3221 4393 5859 -5919 -13319 10803
803 10803 -8326 -3029 4292 10847 -4358 1127 11036 -8071 -9464 -412 5275 -16391 5407 10145
817 10145 1314 -2477 6988 8551 -16187 1389 1679 -7314 -5873 9571 4576 -5872 7246 7312
831 7312 -8056 -10612 9174 -6647 -9156 5378 9358 -1171 -2090 14356 -3055 -9615 1578
844 1578 86 -11789 -1133 9149 -167 -2957 9761 7788 -12818 401 3880 -7819 -6605
857 -6605 5789 7418 -6108 6307 9031 -5690 -5811 3321 -4814 -10850 2938 6822 -2999 814
871 814 13313 -68 -7327 2771 342 -9660 -4555 7672 -1427 -2164 9160 4644 -6669 -748
885 -748 4320 -9206 -7298 6338 2317 -4178 6108 10751 -3894 -3830 4721 -4003 -11027 677 3750
900 3750 -5319 2364 10349 1045 -5866 5090 1483 -12284 -1817 5633 -2347 -3225 8863 6996
914 6996 -6458 1122 4623 -8401 -7946 3841 -123 -5970 5794 10749 -2311 -2837 8790 -3099
928 -3099 -10973 795 2271 -4874 -1829 10697 2579 -5097 6279 711 -8944 -4058 3739 -2314
942 -2314 -5706 10016 6536 -3944 3213 5363 -4664 -8940 2010 -697 -6709 2767 8590 -752
956 -752 -1204 8705 -2804 -7039 -1503 2524 -5248 -4410 12472 -612 -153 3432 3249 -5577 -7659 4726
972 4726 -7265 -2101 3492 6588 -2133 2876 8343 -5999 -3048 -1882 1183 -9127 1616 6905
986 6905 -2455 3286 3401 2734 -8022 622 312 -7862 -747 5600 2295 -1958 6852 4734 -6400
1001 -6400 -3242 2647 -6213 -5356 1919 5759 -4053 4405 8247 -4667 -1474 -1227 1729 -11346 3108
1016 3108 5196 -2313 1518 5624 5971 -11724 5377 -3157 -4780 -5614 4199 4874 -9008 14199 385
1031 385 -142 -4869 5406 -3578 -12168 7327 681 -1305 -2446 13952 -3643 -4017 2639 -372 -6370
1046 -6370 -6428 11159 -6462 1950 6623 5585 -5295 -277 4376 -8194 -6180 2146 3427 -7794
1060 -7794 8943 2705 1768 -3753 4318 -1643 -11078 6367 -3202 184 -1775 12347 -3331 -1707
1074 -1707 4243 -1890 -5328 -7709 10346 -10874 4994 3335 5808 -2513 680 8106 -13688 2653
1088 2653 -3684 3459 -10081 8839 5365 -5318 4599 -188 3388 -14621 8998 -5525 -1857
1101 -1857 1269 6396 2551 -5546 12995 -7881 -2045 -5665 5890 -9183 -2682 10307 -1229
1114 -1229 1138 -66 10234 -11483 1368 -784 -1209 -6047 4134 7575 -7983 8735 403 2101
1128 2101 -11740 5783 -2605 -7269 1874 4713 3684 -5780 13498 -6337 1913 -6279 4650 -6938
1142 -6938 -5925 12237 -7826 6642 -3092 12251 -9901 -1060 3437 -5821 -1218 -3632 12392
1155 12392 -9945 10432 -360 3444 -5668 -595 3307 -14276 7403 -3559 5808 -5690 9284
1168 9284 2416 -4911 2249 -2525 -430 -8642 7995 -4479 4032 1001 6088 -2904 -2789 5089 -8997
1183 -8997 -178 -3823 7744 -7370 6310 3927 893 -1018 -1302 4312 -12880 6174 -5193 3753
1197 3753 -4110 7725 3518 -7158 7198 -5168 1947 -11399 8901 -4277 207 4241 2881
1210 2881 3483 -7168 9892 -10589 743 -4426 2722 -3586 -331 10231 -4566 3853 -2086 5737
1224 5737 -10173 931 799 -2100 -150 2298 7063 -6407 6406 -2429 -720 -7236 3177 -1412
1238 -1412 -5146 6609 1726 4279 -4988 8900 -4834 -3362 -1202 -24 -1790 -2766 8642 -3359
1252 -3359 3814 -944 4892 -7902 -985 2357 -5505 1915 -473 8720 -5445 5353 1523 -2518
1266 -2518 -3349 -1262 945 -6975 5345 288 3838 -2312 6645 -918 -5202 2476 -3295 -339 -4710
1281 -4710 7199 -1063 828 2890 1669 -2887 -2727 2134 -6294 416 68 4895 -2343 4214 4534
1296 4534 -3758 -344 -1363 244 -6665 2726 1436 198 746 4786 598 -4424 2963 -3174 -2339
1311 -2339 -3194 5112 -469 -577 5733 1467 -1693 -2812 2825 -5577 -2453 512 2085 -1572 1969
1326 1969 6129 -2864 -84 322 -374 -6293 700 2689 -1825 625 4123 2690 -4126 2009 -558
1341 -558 -3792 -2775 1531 586 -1359 4965 3266 -1038 -622 2621 -3689 -3909 387 1078 -1439 521
1357 521 5434 -301 -839 1296 -752 -4026 -1224 1024 -1018 130 4443 2443 -1886 2420 94
1372 94 -3670 -3236 169 -81 -1854 2955 2837 158 598 1738 -2207 -2978 -203 -389 -1832 1211 4552
1389 4552 -124 -38 2476 -1069 -3540 -1918 537 -1771 -666 4113 1545 129 2428 974 -2781
1404 -2781 -2896 881 -2101 -2540 2410 3060 -398 880 3030 -1357 -3069 -774 -72 -2755 398 3823
1420 3823 287 1111 2746 511 -3615 -1171 501 -3193 -1788 2527 2161 -633 2469 2375 -1851 -2084
1436 -2084 -49 -1560 -2632 1192 2358 -677 1543 3271 -713 -3248 -441 -167 -3836 -436 2987
1451 2987 983 169 3017 1903 -2201 -550 -509 -2443 -2790 1685 1513 -1095 3037 2529 -659 -2195
1467 -2195 410 -1137 -3689 497 1675 199 679 3181 696 -1778 -238 -494 -3353 -2096 2426
1482 2426 -301 -187 3309 2337 -695 -1424 1453 -2463 -3140 1127 456 -114 1623 2980 -351 -1082 949
1499 949 -1305 -3819 -357 2049 -1580 1433 3658 1728 -758 36 904 -4256 -1595 983 -1307 -342
1515 -342 2586 2971 -1773 356 1828 -2473 -3366 876 985 -2208 1890 3707 468 -750 1089 70
1531 70 -4599 -491 597 -2084 165 3139 2246 -1727 2266 1022 -3192 -1767 612 -441 -2470 3112
1547 3112 2004 -111 1026 1031 -885 -3981 1495 -1296 -2078 1820 2814 998 -867 3911 -878 -3026
1563 -3026 -945 71 -1910 -1279 3571 363 66 1685 1347 -2275 -2190 1606 -2382 -1439 2103 1929 411
1580 411 303 3047 -1427 -2400 228 -2054 -1740 -17 2541 -365 1383 2670 -99 -1686 -1028 774
1596 774 -4108 196 1527 384 1008 1011 2705 -2723 27 -874 -2288 -1393 615 1854 -630 2741 1938
1613 1938 38 -1870 411 -1121 -3153 416 237 681 232 2830 731 -1682 655 -707 -2574 -1385
1629 -1385 953 267 -308 2079 2436 -1210 -261 -181 -1357 -3081 18 526 -475 1596 1716 1831 -2099
1646 -2099 1275 -1515 -2215 -1186 -80 988 -1542 3365 585 923 -1087 264 -1289 -3089 1440
1661 1440 -1264 1627 -214 3622 -182 -204 1443 -2056 -1153 -2306 1401 -2065 815 2221 1054 -156
1677 -156 375 951 -2920 -764 -681 292 -1539 2654 1780 -460 649 1099 -1388 -3162 561 -862 -98
1694 -98 -222 3741 -250 258 1962 -1351 -1046 -2050 2144 -3384 1056 1659 1214 -30 306 2277 -4546
1711 -4546 484 -2093 781 -2443 1968 2663 -1443 3206 -298 936 -3840 1381 -1475 -2053 514
1726 514 1675 1252 -1580 3962 -1644 -320 -1819 828 -2074 -994 2951 -439 925 803 2183 -3013
1742 -3013 15 -545 -1393 -2234 1016 2562 -1609 3183 460 1280 -2853 1186 -1784 -2667 1065 228
1758 228 1620 -1696 4831 -1804 -262 -988 -107 -1460 -2801 3373 -1495 1843 645 2948 -2230 -273
1774 -273 433 -2916 -629 -1194 2955 -3073 2989 1490 -90 -755 -332 237 -3900 1295 -258 1211
1790 1211 -991 3534 46 -906 871 -1352 -984 -3142 2788 -1788 659 1789 2271 -399 -788 1678
1806 1678 -2749 -375 -1318 1664 -2414 1955 2072 -718 590 -258 1087 -4329 865 -413 119 -115
1822 -115 2572 1605 -1518 2262 -1216 -217 -3207 1524 -1315 -654 2552 690 1086 -681 2761 -2441
1838 -2441 -957 -547 445 -1579 478 3220 -893 1417 -450 993 -3097 -55 -85 -1968 46 1293
1854 1293 2443 -1359 2451 -42 -715 -1972 818 -640 -1957 2361 149 841 -462 2279 -1362
1869 -1362 -1377 -132 -559 -1239 -617 3540 -574 1401 1275 939 -1727 -809 280 -2733 111 861 1288
1886 1288 -975 2525 996 -1198 -694 14 -262 -2839 1808 525 144 554 1901 -137 -1917 687
1902 687 -1304 -1389 -561 1858 -278 517 1953 484 -862 -856 795 -2481 -547 662 536 -101 1717
1919 1717 1595 -902 -143 111 -810 -2377 904 386 -434 892 1758 718 -1345 775 -1007 -1869 -878
1936 -878 1085 -603 72 2038 774 -351 -223 993 -2168 -1165 721 -84 -189 988 2292 -689
1952 -689 -415 692 -937 -2217 44 213 -907 942 2032 586 -280 1065 -141 -2450 -615 164
1968 164 -702 -315 1887 1347 -336 558 458 -1627 -1329 141 -557 -649 1188 1745 -243 406 1109 -660
1986 -660 -1872 -141 -192 -1158 335 1493 746 -174 1160 148 -1525 -676 -59 -1056 -672 1602 1112 33
2004 33 687 1068 -1162 -1365 246 -851 -700 468 1614 476 95 1735 -318 -1273 -123 -538 -1350
2021 -1350 -147 1322 381 177 1103 1067 -1164 -1023 126 -1343 -374 683 1067 -140 895 1361 -1136
2038 -1136 -606 -336 -909 -1523 186 1029 -480 883 1587 347 -1277 -184 -674 -1655 -40 650 516
2055 516 -287 1450 1127 -1346 110 -519 -826 -1515 477 713 -235 1310 1246 571 -837 219 -665 -1767
2073 -1767 224 154 160 -60 1712 270 -1009 823 -885 -983 -1019 693 314 -165 1592 623 -220 -124 348
2092 348 -1380 -1388 308 -403 -24 506 1320 192 -439 886 -1007 -945 -709 249 -213 -177 2119 -242 126
2111 126 197 280 -1515 -938 406 -801 300 679 2166 -454 89 915 -1523 -749 -941 367 -920 209
2129 209 1988 -283 604 230 297 -1635 -676 49 -656 -145 672 1139 -233 745 426 -1113 -761 -509 -225
2148 -225 -803 860 1221 -302 962 820 -204 -1067 -475 368 -1415 406 837 502 108 694 603 -1681
2166 -1681 -1 -482 -711 -1062 1003 728 -441 1178 3 -177 -1476 225 -1013 -1089 996 458 685
2183 685 -40 1396 -455 -537 -120 -440 -849 -313 1150 45 420 1187 511 -759 -417 -224 -1189 -917 775
2202 775 231 -31 1372 776 -70 -820 392 -867 -1074 263 572 278 229 1815 -362 -205 -304 -434 -1436
2221 -1436 -517 892 -632 642 837 1127 -447 114 348 -1277 -864 -335 519 -518 1389 602 -22
2238 -22 57 -46 -280 -1467 419 -359 -89 218 1621 345 -188 413 -157 -934 -808 429 -185 167 786
2257 786 730 -49 331 226 -935 -1010 -55 230 -820 1090 570 225 -58 247 -82 -1524 350 -475 -143
2276 -143 160 1520 237 395 664 -110 -454 -998 359 -820 212 541 575 218 214 864 -1012 -720 -493
2295 -493 -238 -811 688 994 322 394 117 248 -987 -264 -652 -521 -40 810 601 294 773 145 -293 -824
2315 -824 259 -1111 -395 539 768 273 79 794 -735 -590 -505 -76 -564 171 651 9 755 419 558
2334 558 -1134 120 -364 -795 -325 350 579 -182 1205 213 -183 -643 33 -865 -530 693 57 505 327
2353 327 1199 -500 -284 -151 -578 -852 -288 517 -112 616 675 863 -346 159 -378 -1059 -261 -288 391 -360
2373 -360 1125 598 250 -384 184 -823 -1029 174 -9 413 249 1391 249 -189 377 -188 -866 -890 145
2392 145 -388 413 897 758 -206 54 356 -1128 -481 -314 355 -480 699 741 242 303 182 -362 -1135 170
2412 170 -629 -340 24 1051 493 -316 579 -519 -472 -827 244 -601 -129 778 435 318 375 550 -914
2431 -914 -608 -393 43 -403 409 803 -73 616 253 -271 -1114 -170 -447 -454 131 717 482 -136 690 -190 -224
2452 -224 -779 159 -419 -312 682 263 397 280 716 -380 -236 -64 -463 -318 130 1180 53 574 598
2471 598 295 -651 -382 -151 -623 -144 422 558 267 831 349 -312 -430 -220 -540 -543 480 680 143 504
2491 504 854 -453 -162 -337 -275 -946 -262 688 -58 388 633 205 -227 -18 33 -866 -219 49 651 -76
2511 -76 929 734 -245 20 -638 -306 -995 -213 311 128 681 690 316 -394 154 -276 -775 -221 46 21 -235
2532 -235 793 383 -211 44 -196 -723 -613 164 -125 -215 1060 741 -24 -176 444 -439 -1044 -277 93 -127
2552 -127 353 871 176 136 266 -597 -369 -774 298 -329 178 998 451 23 -9 277 -681 -661 42 -472 -146
2573 -146 309 663 74 113 221 -304 -618 -274 -26 -512 62 937 94 489 353 55 -773 -445 213 -740
2593 -740 -89 697 476 -97 789 440 -333 -744 -213 -167 -498 561 407 48 317 267 144 -854 195 -258
2613 -258 -892 79 463 447 319 654 1 -514 -162 -304 -613 -410 557 -123 140 543 338 -80 -565 43
2633 43 -665 -750 136 294 82 388 819 -225 -162 75 -512 -455 -129 465 54 522 614 265 -294 -175 -79 -733
2655 -733 -780 298 62 164 423 721 68 -271 200 -400 -259 -417 402 -79 396 520 -99 -99 -218 -117 -512
2676 -512 82 190 -114 206 642 638 -28 164 89 -736 -499 -41 88 -226 502 786 44 -153 86 -83 -636
2697 -636 21 66 -291 19 557 499 37 85 -34 -1009 -381 -4 -79 221 528 535 -37 122 48 -136 -816 26
2719 26 -101 -17 327 429 501 -181 389 -206 -692 -116 -135 -132 -557 859 254 310 190 200 -393 -520 -151 -584
2741 -584 -285 95 601 130 259 371 -409 -607 42 -542 -647 227 372 522 155 219 37 -515 -46 -421
2761 -421 -391 -169 556 -31 54 758 364 -194 -314 -41 -855 -321 210 649 25 372 619 -466 -251 -99
2781 -99 -486 -906 135 263 304 270 777 190 -437 166 -305 -546 -464 28 241 208 505 335 35 -375 -44
2802 -44 -730 -441 -27 151 381 358 762 178 -163 201 -366 -927 -109 293 154 97 511 651 -307 -156 -69
2823 -69 -561 -427 -3 29 -120 634 529 108 -87 347 -545 -709 -147 -54 196 62 960 -29 69 127 -318 -515
2845 -515 -520 87 -505 334 260 409 -105 -47 58 -545 -131 -387 52 -205 518 562 244 249 308 -221 -758 -124 -18
2868 -18 95 70 730 405 42 196 -113 -407 -515 -145 -348 14 301 391 59 131 271 -706 -280 -230 -145 -424
2890 -424 376 687 201 309 382 -200 -841 -53 -533 -523 87 108 219 -162 344 -145 -277 -503 118 -711 -222
2911 -222 304 398 17 313 402 -540 31 -330 -415 -697 33 426 -25 568 388 453 -624 -253 -194 -512 -100
2932 -100 69 78 70 577 373 -272 -387 40 -348 -381 371 147 -10 409 469 -158 120 -266 -386 -236 -278 389
2954 389 113 308 520 253 -369 -213 -344 -641 -227 325 198 -314 517 168 34 68 -339 -259 -766 332
2974 332 -59 152 387 498 -3 -282 126 -33 -673 -231 103 -116 180 657 -71 184 -49 -82 -512 -669
2994 -669 -106 -78 155 355 218 159 270 -202 -445 -455 12 -76 -168 205 379 301 71 240 -322 -263 -232 -142 -368
3017 -368 230 597 147 405 -45 354 -711 -231 -281 -239 -197 307 423 67 310 346 -154 -572 48 -241 -700
3038 -700 236 500 196 57 293 117 -764 -90 -151 -456 -121 55 308 193 355 126 -253 -277 23 -295 -455
3059 -455 283 448 142 562 193 -18 -295 -135 -378 -407 -140 286 145 248 408 -107 -377 118 -135 -420
3079 -420 -169 385 102 238 672 357 222 -246 214 -232 -387 -182 137 331 228 480 233 -210 -102 -247
3099 -247 -346 11 197 75 215 210 118 -43 -42 -91 -402 -186 -148 -139 58 567 459 -30 77 9 -511 -488 7 -8
3123 -8 37 301 551 37 13 108 -210 -449 -284 33 -239 -16 435 258 -12 -14 52 -371 -481 -260 -39 -172 137
3146 137 463 444 288 63 -204 -584 -37 -126 -323 75 408 455 362 300 -86 -491 -310 -77 17 -48 65 270
3168 270 309 385 338 97 -319 -497 -136 -200 60 440 178 214 129 -309 -257 40 -152 -184 60 313 25 151 358
3191 358 76 -290 -267 -110 -622 -79 394 440 395 193 589 -82 -101 -69 -391 -230 -156 186 174 298 480 147
3213 147 -107 -31 -166 -550 -356 51 -2 45 177 198 -373 -141 -412 -217 -581 0 280 -239 275 492 194
3234 194 -37 62 -246 -536 -130 10 -147 549 734 -31 -36 336 -272 -363 -140 94 128 52 553 388 -233 -37
3256 -37 131 -376 -485 -127 292 -90 301 462 175 133 219 -165 -384 -6 16 -208 79 406 96 -32 131
3277 131 -197 -437 -88 160 147 86 401 385 274 112 80 -299 -413 -151 238 -6 386 546 -3 18 146 -196
3299 -196 -120 -201 89 -189 316 450 18 -39 -4 -106 -152 -421 -158 -38 -256 331 502 -63 276 276 31 -404
3321 -404 -218 -14 -256 261 174 190 227 84 28 -262 -295 -71 -116 300 354 458 -153 260 36 -143 -161 -102 -383
3344 -383 -671 251 235 41 326 377 -199 -371 41 -204 -29 -137 379 68 273 288 108 -76 -275 -322 -342 -172
3366 -172 137 108 21 169 152 83 -266 -18 -140 -468 88 136 179 206 300 76 -350 -468 -4 -284 -302 426 -98
3389 -98 -53 314 393 54 -281 -162 -430 -440 29 40 289 298 393 84 54 -200 -200 -522 -282 114 192 419 485 183
3413 183 -306 106 -175 -563 -278 -315 -4 321 285 259 106 102 -78 -489 -1 -70 59 -32 130 373 69 20 96
3436 96 -118 -320 -554 -44 -110 4 422 342 247 82 152 -478 -600 11 -183 -235 400 123 380 55 156 -129
3458 -129 -641 -49 -115 -289 169 422 164 248 260 -93 -302 -227 -148 -174 82 334 233 219 339 220 -345 -291 -188
3481 -188 -118 -323 318 14 259 87 128 -100 -343 31 -210 -427 -322 479 277 272 415 103 -150 -177 -200 -502
3503 -502 -15 91 177 -104 303 284 -329 -250 -136 -104 -95 119 494 -19 244 407 -53 -247 74 -297 -172 -93
3525 -93 -6 56 335 174 282 -134 -179 -275 -592 -328 274 80 359 194 291 33 -275 81 -504 -335 -227 77
3547 77 -89 539 522 172 23 178 -119 -338 9 299 189 242 452 341 -140 -195 -241 -306 -147 132 -218 112
3569 112 92 373 59 -60 150 -368 -331 -28 5 74 76 277 175 16 -65 -317 -352 -212 -15 114 118 132 548 -205
3593 -205 167 243 -218 -73 -56 -79 -89 37 534 15 145 323 15 -368 -215 -206 -87 -183 229 546 -69 45
3615 45 -49 -430 -189 -203 -106 -194 210 61 135 87 318 -37 -256 112 21 -140 53 296 261 2 168 123 28 -103
3639 -103 -190 -161 -111 378 117 162 161 -209 -83 -143 41 -225 -246 256 180 134 245 364 35 -299 -92 -296 -561
3662 -561 -130 205 -79 166 469 99 -365 -25 -29 -305 -228 -153 36 178 224 504 -403 31 -169 -166 -280 102
3684 102 -105 100 305 361 -31 162 47 -184 -486 -354 68 31 284 388 17 -113 285 -220 -88 -54 104
3705 104 -176 349 151 264 -48 -151 92 -144 -311 -94 37 -178 403 140 276 167 -139 -361 -377 -376 141
3726 141 -89 332 524 136 30 -77 8 -374 -319 -204 77 -236 132 477 62 -34 108 -52 -203 -132 -134 -369
3748 -369 408 116 211 8 -12 104 -379 -316 129 -500 22 256 252 237 348 113 -207 -115 -378 -169 -219 372 131
3771 131 -80 225 2 90 149 -140 19 -267 31 369 281 179 534 69 -521 -322 -144 -325 -306 185 205 23
3793 23 575 -74 -376 -157 -44 -340 -207 99 257 523 -44 432 3 -203 113 -132 -279 -3 65 167 148
3814 148 391 101 -188 -320 -136 -124 -105 -93 -93 316 250 356 -13 -78 -17 -262 -166 7 -136 -101 327 491 392 181
3838 181 35 -103 -319 -27 -318 -103 517 544 231 6 -207 59 -531 -60 -99 235 177 325 232 195 106 -30
3860 -30 -24 -353 70 22 -75 306 298 448 87 -65 -158 -643 -70 110 -232 81 398 400 70 116 276 -264 -310 74
3884 74 -45 -228 381 71 68 -31 214 -102 15 -367 24 12 131 424 162 95 36 21 -385 -288 -403 -151 -170
3907 -170 308 300 146 276 170 -345 -193 -194 -289 -91 198 304 216 95 427 -158 -282 24 -110 -65 -66 300 98
3930 98 -48 369 119 -222 -443 -263 -305 -395 -115 192 15 13 526 77 -318 -177 -121 -342 -283 253 183 284 308
3953 308 9 -230 -114 -34 -332 -154 271 272 140 209 144 -254 142 -287 200 -244 176 211 61 361 274 293 -88
3976 -88 10 -240 -386 24 15 57 110 654 62 -137 57 -205 -178 -359 -240 305 285 137 286 -108 67 -97 -240
3999 -240 -173 41 -8 -18 201 183 -85 38 -104 -68 -434 -420 -55 41 -27 438 319 8 -84 82 -256 -448 -11
4022 -11 -207 -30 -39 514 351 96 127 -591 -237 -250 -109 -317 110 478 1 -75 16 135 -455 -25 202 -213
4044 -213 -34 290 -273 -99 318 43 -149 -109 -365 -489 -164 189 493 101 203 293 -149 -230 -296 68 13 239
4066 239 423 -128 -75 234 56 -173 -31 -168 -340 -335 37 38 181 463 239 -170 9 -205 -666 -92 343 321
4088 321 205 210 362 -273 -66 -220 -198 -255 -138 164 162 -75 368 78 -76 -169 -86 -251 -4 -37 236 310 328 395
4112 395 -140 92 81 -258 -127 34 147 58 108 339 -116 -227 -2 -200 -572 -263 264 240 157 233 -82 110
4134 110 65 -90 -52 -167 88 238 176 235 117 -37 -29 8 -303 -206 -247 -183 154 236 207 302 160 39 -353 -356 -344
4159 -344 272 157 261 247 500 157 132 -89 -429 -255 -57 -173 109 50 233 320 -2 57 241 -163 -121 148
4181 148 -233 0 194 121 98 -134 41 -237 -248 -457 -148 92 245 268 12 -31 133 -17 -461 -349 -220 22
4203 22 -66 179 88 134 208 -135 -169 -305 -7 -439 283 -4 236 224 249 159 -435 -165 -171 -357 -37 302 184 134
4227 134 243 115 -114 -357 -69 -57 -136 344 86 142 228 454 136 -481 -73 -385 -187 -54 -183 -69 330
4248 330 401 240 -183 -283 -6 -280 -553 -175 -183 169 168 344 129 -14 -196 -101 -374 -195 113 209 -36 240
4270 240 113 34 -49 -68 -191 -83 101 -58 138 -80 302 89 151 57 -122 -144 -125 79 -43 101 40 55 -121
4293 -121 4 -179 -191 -24 -192 2 111 257 251 -77 275 -101 -553 -67 -8 -204 -86 145 177 -13 118 -69
4315 -69 -137 -211 -296 -434 -109 26 453 137 -114 64 -76 -140 -195 -180 208 -77 191 286 -47 152 -154 133 -175
4338 -175 -60 -206 -6 309 357 95 -160 129 -274 -152 -75 -200 -235 175 405 45 -12 283 38 -84 -437
4359 -437 34 -29 -188 123 -102 45 337 315 -107 -171 -30 -146 95 -104 355 287 5 221 -105 -281 -122
4380 -122 -70 -219 -139 100 439 29 189 323 18 -157 -332 -284 -43 258 136 31 379 53 -203 -36 179
4401 179 -151 -203 14 320 170 214 257 9 -45 -62 -159 -380 -327 -115 17 14 142 -7 15 -157 -114 66 -196 380
4425 380 84 -17 325 293 307 -128 -138 -213 -111 -131 -115 -107 -64 231 204 29 -54 -328 -372 -144 -95 -213 -147 192 286
4450 286 -69 197 140 -141 -270 221 128 81 486 220 246 255 -208 -344 -395 -358 64 -41 -129 111 127 176 141 -111
4474 -111 -421 -163 -165 -15 328 299 -8 -55 93 38 -84 -323 199 10 21 247 260 23 199 59 185 -387
4496 -387 -214 121 -119 -203 432 269 -110 41 217 -205 -65 -165 -449 -244 -19 98 134 305 41 206 -85
4517 -85 -370 -32 -223 84 440 209 -13 42 45 -298 -410 -85 -151 -94 140 107 232 113 -106 56 10 -297 -294
4540 -294 -172 121 123 -40 147 372 -13 -161 -199 -299 -225 192 193 249 122 240 564 -119 -266 10 -21 37 24
4563 24 52 52 422 204 110 -150 188 -381 -162 -54 12 29 -144 286 147 14 -177 -220 -153 -383 -114 16 -57
4586 -57 425 158 -102 -16 -190 -101 -303 -52 89 -56 115 148 -230 -51 151 -128 -239 -176 -89 -147 -57 108 187
4609 187 22 150 -218 -174 -172 129 -186 -94 32 180 113 140 51 -307 -45 62 4 -171 42 377 -148 -4 99
4632 99 -75 -154 -221 -39 83 67 471 306 139 263 20 -384 270 -83 6 -39 340 318 236 167 -121 -4 -312
4655 -312 -9 -37 -385 -13 42 160 74 187 132 -227 -75 39 -143 17 82 436 26 256 -34 -193 -83 -60
4677 -60 -91 -46 160 76 343 190 62 188 -372 -50 -331 -113 219 379 206 297 505 -200 -413 -237 -138 -170
4699 -170 23 107 247 132 266 304 -41 -205 -216 -173 -86 29 -142 284 111 151 -96 -207 24 -256 -231 -153 -12
4722 -12 -79 217 484 41 -160 114 -286 -124 -74 160 23 55 346 154 -325 -103 43 -477 -252 -198 -25 -113
4744 -113 412 110 256 33 -202 -276 -342 -195 -106 69 139 -96 -35 128 75 48 -412 39 73 -38 -44 366 71
4767 71 160 22 -47 -215 -436 -177 -173 -53 186 14 -129 -327 399 112 -301 -188 -75 -74 -12 36 24 215 51
4790 51 -58 -308 -330 -40 8 -115 285 294 -125 223 213 75 -83 -213 229 -46 -97 393 405 185 236 -179 -279
4813 -279 -244 -112 -92 -227 171 -16 70 22 120 -233 -296 -522 -108 -230 141 340 -87 65 88 22 -212 -91 -118
4836 -118 -182 -261 196 261 43 -63 -95 -34 -326 -106 -104 -387 23 262 113 187 96 49 -188 -2 -149 104 -47
4859 -47 176 -11 12 358 -174 199 -342 -58 -220 -123 -6 -4 258 169 138 77 21 74 -394 -193 -73 16 175 219
4883 219 158 -105 -243 113 -235 -19 24 -142 82 55 362 -19 93 -100 -164 -326 -240 240 -42 -240 170 153
4905 153 -85 236 -137 -332 -447 -41 -11 155 270 140 51 -167 38 -84 -194 -98 -121 62 261 122 124 47
4927 47 -162 -167 -223 -236 220 -402 -95 274 220 83 36 -181 -322 -438 -11 -238 -208 460 171 143 -87 -295 -199
4950 -199 -216 -180 -218 -166 -79 33 368 306 359 -64 -114 -193 -241 -203 -3 333 204 236 182 93 12 -362 -257 -288 -92
4975 -92 -56 -26 272 0 201 107 -42 -237 -330 -32 104 -89 263 45 -8 253 168 -180 -25 -18 -71 -92 74 199
4999 199 99 405 -82 -67 -32 -294 -340 -149 97 199 289 269 287 80 79 16 -181 -167 -57 -1 117 184 -44 -36 35
5024 35 7 -75 -207 -124 87 232 278 -91 132 129 60 -248 -316 -6 22 120 183 429 130 -29 81 -2 -203 81
5048 81 165 -188 177 292 184 161 156 -95 -141 -74 144 -105 17 58 108 52 -147 161 -41 -204 -348 -221 -217 196
5072 196 104 -138 73 110 171 -145 -182 -183 -43 212 71 150 106 45 53 20 -206 48 70 -6 101 239 202 62 67 12
5098 12 -121 -167 -160 -107 59 446 129 205 -89 74 -327 -338 19 -208 -53 57 130 245 330 111 47 -281 274
5121 274 -2 -235 -93 149 -122 39 -42 2 -28 -82 81 -212 -181 146 158 33 185 60 -251 -474 -301 -6
5143 -6 96 172 72 314 362 227 -15 -206 169 -259 -51 13 49 203 227 318 -32 39 -190 65 -207 -199 87 32
5167 32 -21 144 206 31 -51 11 -270 -17 38 440 80 147 272 129 1 88 -34 -433 106 91 98 -40 171 84
5191 84 -65 -163 73 -329 -268 -167 51 144 345 87 -151 157 -319 -148 -362 59 -24 -211 122 214 124 99 -135
5214 -135 -20 -283 -119 -101 -139 101 100 60 94 150 91 179 -193 -128 -314 25 -15 223 -55 17 68 -175 0 -55 -204
5239 -204 -228 230 89 292 -43 86 305 -158 -291 100 -216 -134 279 25 372 130 55 -242 -246 -9 92 -367
5261 -367 372 305 47 224 142 90 -84 189 -206 -25 -31 137 104 340 63 252 -172 -242 -61 -74 -163 177 209
5284 209 109 176 -272 -20 79 -207 -60 -323 -9 -90 197 274 11 191 -74 -137 -80 67 14 333 256 142 257
5307 257 120 74 -166 -53 -210 -268 91 138 -134 -10 266 -16 -89 -94 -214 -83 74 -308 89 179 -48 -42 -61
5330 -61 -94 47 -103 -320 -85 23 58 36 151 72 239 103 -146 -349 -46 -78 -227 81 356 58 130 140 -168
5353 -168 -124 -191 99 158 266 36 10 -2 -71 235 -258 -360 -129 -355 34 323 307 183 1 -80 -289 -264 1
5376 1 -144 -135 33 84 164 -55 47 126 -101 -58 -112 -189 105 322 93 -27 -43 307 153 -207 81 -70 -26 52
5400 52 -28 73 64 408 44 -286 -172 -128 59 115 108 226 154 -46 -267 -151 -185 -225 -237 246 -37 191 108 -162
5424 -162 150 25 -55 -113 26 1 50 48 13 219 -20 -179 3 142 -120 -216 86 23 166 281 79 359 -234
5447 -234 59 -10 -130 -112 15 99 179 195 91 -289 -273 -140 -179 -217 -122 -49 147 128 -29 90 -314 -85 -210 -357
5471 -357 0 -126 -29 167 103 51 46 198 -69 -128 -316 -202 98 50 186 -75 72 -82 185 -78 -244 -252 319
5494 319 159 156 323 -92 107 -125 -111 -189 -84 115 -124 78 229 291 199 -99 -33 -366 -281 132 -124 -120 19
5517 19 38 103 159 12 -211 -416 -256 -238 -55 -183 102 132 136 193 -206 -280 -330 -48 280 -40 51 294 131 -42
5541 -42 188 -1 -301 112 -66 237 189 -55 94 21 -52 -155 -200 -22 -299 -11 -36 115 80 78 -22 164 -95
5564 -95 -188 -20 -108 74 247 465 84 93 134 -66 -137 -57 -75 -200 75 120 -37 269 210 -231 -49 -129 119 -83
5588 -83 138 -79 -56 40 158 11 -59 40 25 -81 -238 170 167 82 7 75 196 -91 -182 -22 -494 24 172 114
5612 114 -24 36 -124 -220 -104 -81 -73 -63 356 216 192 -43 27 -99 -169 38 172 37 -232 -173 50 232 -31
5635 -31 12 -235 122 -68 -223 -81 -44 -22 -11 496 93 20 155 -135 -284 -374 80 -179 168 218 120 16 -5
5658 -5 40 -463 -207 -266 -130 -147 -32 205 -136 30 198 -166 -243 -192 25 3 8 285 -97 -41 -130 -52 -157 -103 -227
5683 -227 -131 180 80 136 204 -166 -104 -193 -203 86 -74 -13 -131 218 7 53 -173 -157 -291 -278 -142 -53 57 96
5707 96 114 330 -1 -19 15 -98 10 -262 181 152 452 49 218 198 -83 -297 -197 -134 -40 72 198 -143 -29
5730 -29 362 125 134 145 77 -238 -266 -164 117 213 14 322 -131 -142 34 1 -344 -115 -150 -205 -85 125 -24 -94
5754 -94 -107 -200 -252 -260 6 -136 170 142 -104 155 141 -84 -304 -111 83 91 -10 81 292 180 -128 162 -168 -391
5778 -391 -105 -75 -12 61 97 94 -307 65 -169 -140 -24 -224 126 -209 255 46 -107 -165 -154 18 -188 -140 20
5801 20 60 469 225 243 122 -42 -25 -133 -107 63 56 195 265 253 161 68 168 -85 26 -26 -104 150 39 183
5825 183 373 -94 -14 49 228 250 48 48 -241 -53 381 108 -3 -196 -93 -192 202 -14 -203 98 95 168 99
5848 99 -135 -47 0 -171 -65 -224 -129 344 137 350 226 -123 -269 -221 -72 70 401 -62 117 -24 -53 61
5870 61 -108 -177 -141 -186 -120 -67 74 124 -178 144 -26 -153 24 -289 -185 -33 121 -159 -47 234 10 46 -25
5893 -25 -390 -68 -236 -63 -57 126 170 -234 -10 121 -64 162 35 55 77 144 237 104 -115 16 -378 -80 -28
5916 -28 -267 25 -49 229 235 -37 33 58 -193 -285 -98 45 179 224 153 62 -54 -96 -92 -209 -129 172 1 118 154
5941 154 72 -40 -25 80 -140 36 -93 154 -125 85 205 154 65 4 217 -100 -206 -53 113 113 180 35 -51
5964 -51 26 -137 -331 -179 243 54 -163 112 248 -42 -41 -178 68 -89 -38 105 42 -9 -21 -106 165 74 -49
5987 -49 -181 -96 -86 75 23 -251 -13 65 288 147 -94 -340 -175 -61 -104 16 271 225 -75 59 -134 -108 75
6010 75 -258 -14 -81 143 -102 -106 114 34 -164 -29 25 -43 -118 -119 104 -221 113 -112 -134 -88 138 -130 193 62
6034 62 286 -201 33 -13 -241 -32 -160 -255 -73 -69 20 -92 149 6 -113 -199 18 -212 -234 -325 -147 211 63
6057 63 115 117 -233 132 -109 280 1 -233 189 -167 173 -19 -116 262 43 -74 118 16 -160 -58 89 -201
6079 -201 245 -4 -32 58 -97 -16 -19 73 75 263 -47 157 -188 -217 -2 -300 298 69 -143 75 28 355 43
6102 43 -142 -291 -84 -286 -104 -101 -10 38 147 85 169 -126 -182 214 -43 -109 -254 270 129 220 194 -10 26 -147
6126 -147 -196 -46 -30 143 10 -2 29 91 -33 -8 -112 -41 -172 -76 22 -65 184 46 -203 -134 -359 -69 -53 -93
6150 -93 246 163 102 -26 135 -95 27 -66 -448 -87 229 16 -61 8 332 26 213 8 6 -197 135 162 -36
6173 -36 259 211 83 41 8 -105 -70 -186 48 64 -122 19 -8 -149 33 -42 -271 270 -276 -100 40 -89 357
6196 357 -45 268 -44 -240 -28 106 -111 -44 -125 100 121 -151 -141 12 -93 74 -111 -123 -80 -82 169 44 177
6219 177 89 11 -10 108 -152 56 100 166 102 -81 211 -50 -191 -3 -45 296 14 9 356 -79 -163 -176 -239 54
6243 54 -262 132 -268 2 73 9 50 -307 -212 -142 -308 -26 -107 284 7 -11 105 -52 -35 -332 -60 105 -32
6266 -32 114 147 121 -256 -43 -30 -74 -214 70 -77 -38 153 37 115 -14 42 -90 116 153 52 -50 61 76
6289 76 351 38 117 -28 -100 -95 16 1 52 45 265 -73 -31 -20 -139 -130 -37 -273 -67 365 397 326 -122 165 -162
6314 -162 -199 -261 -16 -29 141 49 -6 115 303 -95 -179 63 -273 -93 44 -177 -217 94 254 167 -144 37 205
6337 205 8 237 196 124 44 106 -230 81 -287 -80 -196 -2 171 164 121 -109 71 43 -93 -259 -91 -189 -169
6360 -169 -143 -112 -75 -11 88 286 62 -167 80 -72 8 -162 -112 271 -245 -98 3 169 -47 -97 -58 292 -288
6383 -288 -41 188 237 244 175 19 73 16 106 1 317 130 305 -61 54 131 -123 -237 113 -136 -40 -140 -1
6406 -1 195 36 126 -11 -192 -88 -106 -16 219 -63 231 35 -124 -192 -160 -116 -34 12 -87 -43 189 -127 -68 223
6430 223 55 9 -26 353 133 48 67 271 108 -155 -32 139 -471 -132 -236 -69 155 49 87 -41 133 41
6452 41 -323 94 -202 38 -29 141 198 215 -217 67 -177 -137 53 -54 -84 -90 58 -24 211 203 -222 -318 78 10
6476 10 201 122 6 143 -49 161 115 -407 -350 -123 -340 106 -35 -8 -8 205 100 -119 73 -381 -214 -133 275
6499 275 25 59 37 304 65 -133 -132 -174 135 -153 -108 191 111 83 1 61 219 -128 -68 17 -46 76 97 -77 301
6524 301 89 -72 -78 -45 -137 -141 68 83 119 201 -9 15 265 189 -254 45 -129 18 41 152 -31 -6 -23 -33 -92
6549 -92 -108 138 197 -29 89 112 83 272 64 -88 -29 50 -73 255 74 390 155 205 271 46 42 120 -17 -260
6573 -260 87 136 131 204 -156 56 -68 -76 -48 115 -269 163 12 85 123 23 21 -15 -173 -23 -43 -48 249 -92 -156
6598 -156 1 29 -177 266 123 -19 -249 66 77 195 266 63 -151 23 -171 -218 -50 116 205 -203 145 361
6620 361 -179 138 135 3 -165 -6 -102 -217 94 -64 -200 -41 -130 -326 -32 -150 223 125 89 570 48 121
6642 121 16 -269 -255 63 -34 -174 -167 76 88 -79 -39 -281 139 -98 -13 129 -83 243 64 19 -468 92 -96
6665 -96 -265 -33 -136 410 -112 224 -69 328 -59 -176 167 -156 -62 -149 86 12 -65 132 -29 -85 3 -17 -269
6688 -269 -50 -46 68 174 -18 -48 -212 21 12 19 -7 102 94 -70 204 -76 160 -87 -16 72 -227 -73 -80 -59 91
6713 91 138 -14 -192 -49 -196 -66 8 69 -115 -6 -46 154 -40 -118 -176 -193 32 -114 -127 31 87 -285 132
6736 132 -83 101 74 -98 -88 187 22 -56 95 261 183 -31 -96 -178 -162 -205 25 -319 -11 13 106 12 -25 11
6760 11 -14 -102 -87 -44 173 156 213 200 64 -205 -56 -34 -179 154 -19 96 -31 145 70 -285 -70 54 -171
6783 -171 93 -28 114 -192 113 -125 47 -122 -173 -138 -164 220 -309 -127 19 59 197 -126 36 -203 -5
6804 -5 -109 -210 -94 26 135 61 -1 -7 -184 -129 -50 6 -22 -249 182 -58 -195 60 132 -71 125 -154 231 125
6828 125 226 198 40 33 -180 141 -37 -209 -152 12 259 37 -223 -129 -200 -289 198 107 -175 -485 143 87 11
6851 11 -20 80 -106 71 -45 137 -28 166 -38 264 114 -38 34 106 -226 -76 -12 -190 -5 264 174 179 12
6874 12 26 -140 -115 -95 -378 -208 109 -137 -339 75 -73 -32 -107 -52 154 -92 -33 142 -31 150 -38 157 -210
6897 -210 -143 -37 -101 25 -148 -86 68 32 -257 -132 -182 99 253 -432 101 194 87 -12 -43 208 -44 -302 203
6920 203 -245 -11 -40 292 -24 -160 2 -33 125 -184 -68 -29 57 -169 190 238 238 58 -76 -71 -74 28 -130 301
6944 301 155 -176 -51 335 -72 -47 -203 -198 -252 -223 231 241 -78 254 58 78 40 -193 65 -59 184 135 -15
6967 -15 -17 199 35 -313 44 -127 -98 -30 -99 215 -50 5 152 -165 -103 -142 11 -52 243 -148 -245 214 86 -11
6991 -11 -135 -165 97 -128 -144 -76 -116 326 8 -300 33 -57 -216 -42 -85 139 17 90 134 192 -42 -177 -120 -35
7015 -35 17 24 94 -183 188 115 89 86 53 -127 -23 -377 264 177 61 -66 124 -67 27 0 23 109 -422 192 108
7040 108 61 293 171 -24 137 189 15 35 -68 123 -177 13 70 162 -22 -275 -185 -212 -105 165 87 -46 -26
7063 -26 -152 -214 -124 -172 -127 -123 12 282 70 73 -91 156 348 245 -26 207 -183 11 137 -117 -62 44 137 -84
7087 -84 -9 -10 -99 -229 -46 261 20 32 -15 -148 228 -439 71 185 60 -179 77 224 -163 25 -183 -24
7109 -24 304 -167 -308 -144 66 -43 152 247 -177 -263 -438 119 -71 159 -126 178 140 79 161 -160 248 -118
7131 -118 -27 -120 62 154 -99 121 66 5 -188 -134 -160 -44 -82 56 74 -20 120 -207 -59 158 -158 -380 -223
7154 -223 -139 195 111 70 -23 29 -22 143 139 -118 -163 -81 144 128 183 13 80 -94 -46 -74 -105 -45 -132 109 97 180 121
7181 121 -40 188 1 7 72 -209 -55 -70 -114 337 -137 -137 -51 33 122 113 180 434 89 261 -51 -108 -132 -95 -137 -91
7207 -91 -355 -224 -30 168 -171 53 -25 36 144 27 -91 -156 356 -61 58 33 214 -84 -165 -232 24 131
7229 131 -89 -159 245 -42 142 -99 -61 -123 -15 -1 42 160 240 151 -42 -8 50 59 -161 -408 -40 119 113 -70
7253 -70 400 35 -126 -280 -11 -240 -93 -53 364 13 17 -232 77 139 -114 25 125 -45 300 23 -115 -131
7275 -131 -10 -110 -37 -121 -14 -145 220 419 -311 107 -14 -14 9 85 -53 -39 81 271 17 282 -74 -69 -43
7298 -43 -95 -346 -83 59 -1 80 35 -117 111 228 -47 124 148 -24 43 -57 -251 45 26 103 23 88 -235 -244
7322 -244 47 121 -413 -10 260 -227 -57 135 192 -43 -110 -195 88 188 49 55 284 100 120 69 -261 -176 -43
7345 -43 -227 -280 147 -111 -82 9 -96 -58 -88 -212 -232 118 137 188 -9 -145 -261 68 23 -120 121 -17 193
7368 193 64 14 136 68 172 -72 -200 -55 -39 189 -58 186 87 -22 -148 -123 3 -17 55 153 210 157 91 64
7392 64 0 -130 -100 140 -80 -57 269 -69 190 90 43 -70 37 67 -74 -77 89 -36 13 148 266 -69 146
7415 146 32 -283 157 -70 263 -35 122 200 -68 -192 112 -161 -222 -86 -159 -168 -278 32 282 -27 -133 -227
7437 -227 -39 42 87 191 69 7 149 -137 93 -97 124 76 -74 -33 -36 -78 152 24 25 57 312 36 -65 85
7461 85 63 9 193 314 -117 138 37 -156 -91 -220 -103 -3 382 6 12 -28 -112 24 -245 -66 -34 -4 -218
7484 -218 114 182 276 210 -30 -232 -167 105 -47 44 -72 7 -266 70 47 -43 -157 -132 -64 83 -30 168 20
7507 20 125 248 -138 105 -115 -102 -54 35 49 -50 34 -8 -6 -278 -115 -101 -291 30 -54 -306 -148 389 38 184
7531 184 -55 -117 -74 -277 -43 213 327 52 -91 -35 -61 95 162 -118 -53 -14 289 -70 72 -223 -6 -72 -14
7554 -14 -290 41 -41 106 -145 -75 -29 17 31 7 -265 -241 120 37 -62 80 -113 -208 65 -79 -137 15 -106 -70
7578 -70 157 -369 191 -131 57 -145 200 44 -256 -151 89 355 6 -96 -27 228 110 57 170 114 77 -216
7600 -216 -32 107 -98 -11 233 -104 -179 -68 -56 119 170 181 67 -75 -170 41 -7 40 -114 300 -247 283 30
7623 30 49 4 200 98 -156 154 -139 141 75 -31 38 5 -222 -5 -32 164 1 -6 -79 66 -186 -22 -106 -90
7647 -90 -197 -95 -248 28 -68 -140 -9 -320 -37 124 41 255 -138 -308 -52 -70 -67 -38 61 135 -64 -98 2 -207
7671 -207 137 -57 -44 164 155 246 -238 203 116 171 35 -134 92 -238 13 251 -143 14 -71 -110 -166 -155 -329
7694 -329 -222 -1 211 57 215 -140 -288 -92 93 -178 -252 -25 -24 198 -68 -52 -209 -41 -167 -184 21 -100
7716 -100 72 -46 -33 -227 46 -47 108 -284 44 -190 -104 151 61 90 -183 -126 46 293 -311 61 101 -200
7738 -200 -177 -29 5 83 -93 -107 97 82 -128 -188 122 106 -77 326 -166 216 -42 -41 -87 103 -83 25 3 197
7762 197 -1 90 -247 -145 15 -278 49 -44 -21 -217 -132 -113 64 -51 -15 -89 32 74 54 444 -167 38 -68
7785 -68 -91 2 -34 4 109 -178 133 -232 43 1 -31 43 -57 -50 103 183 313 -105 -40 375 -106 -8 -218 -149 46
7810 46 68 47 -146 -133 117 -166 339 -249 -23 -84 115 231 16 48 171 214 -108 -88 -90 140 -109 16 23 -158
7834 -158 -42 386 265 119 -212 -237 -43 248 86 153 189 49 199 -34 68 82 3 -292 -143 -38 134 8
7856 8 -110 -92 153 -287 146 27 30 -54 -44 -129 -32 25 -160 164 30 -190 38 5 0 -19 -26 43 -140 -103 210 37
7882 37 -72 -27 -195 -89 -38 20 156 156 82 -248 56 -155 -332 -52 -109 16 48 -3 56 26 -1 -78 150 -1 14
7907 14 160 8 -216 97 -89 95 -226 -28 -53 -159 200 244 286 -25 68 -114 -31 158 41 -134 -139 11 -14
7930 -14 45 -6 39 -67 -27 181 -129 56 79 32 -145 -129 -113 -105 77 -37 -149 -30 -130 117 -266 133 -126 -204
7954 -204 -6 12 210 17 -169 -295 30 -300 51 72 149 -30 144 -107 169 89 123 -227 25 -18 290 -156
7976 -156 114 -66 49 -19 4 -83 16 39 -44 139 100 -159 -187 -61 87 -150 112 154 28 40 37 -173 -190 92
8000 92 92 -48 -9 107 -27 183 -74 -24 2 93 -234 103 -178 -92 -107 199 171 -238 -115 106 75 -205 -224 17
8024 17 -61 -70 1 86 51 -60 -190 -145 -19 28 -16 -165 146 85 -202 144 -248 5 69 -59 -82 397 59 331
8048 331 -100 10 -133 -196 -91 19 -17 14 -3 40 -18 -91 0 -205 -81 -196 -17 4 -60 119 -130 141 -3
8071 -3 79 -161 -16 97 63 110 97 90 141 -216 35 42 -43 -252 118 -67 259 -18 -23 -95 -22 -27 -259 38 -84 -270
8097 -270 -68 191 -321 56 163 -34 -119 -51 12 142 105 -116 124 62 11 158 47 -152 27 -201 86 -213
8119 -213 34 -97 120 96 -38 64 73 118 -147 26 -76 117 -89 152 -237 -255 -174 90 116 -118 -47 -118 15
8142 15 45 -45 239 1 122 -50 33 40 -6 -66 10 272 -143 -87 155 -79 -71 -28 300 -244 255 54 -139 17
8166 17 88 69 51 -214 -87 -83 2 -15 -82 269 -172 -74 -12 -62 175 114 -33 31 -123 235 157 -77 271 -178 -98
8191i8
##END NTUPLES=NMR FID
##END=
