##TITLE=1H_LR-757-R2-EtOAc1
 CCl4
 8 sc, 
 27.1.2023
##JCAMPDX= 6.0         $$ Bruker NMR JCAMP-DX V2.0
##DATA TYPE= NMR FID
##DATA CLASS= NTUPLES
##ORIGIN= UXNMR, Bruker Analytische Messtechnik GmbH
##OWNER= root
$$ XWIN-NMR		Version 3.5
$$ Fri Jan 27 14:49:59 2023 Russian Standard Time (UT+4h)  she@DPX200
##.OBSERVE FREQUENCY= 200.13135
##.OBSERVE NUCLEUS= ^1H
##.DELAY= (6, 6)
##.ACQUISITION MODE= SIMULTANEOUS
##.ACQUISITION SCHEME= undefined
##.AVERAGES= 8
##.DIGITISER RES= 18
##SPECTROMETER/DATA SYSTEM= spect
##.PULSE SEQUENCE= zg30
##.SOLVENT NAME= CDCl3
##.SHIFT REFERENCE= (INTERNAL, CDCl3, 0, 15.7039)
##AUDIT TRAIL= $$ (NUMBER, WHEN, WHO, WHERE, WHAT)
$$ ##TITLE= Audit trail, XWIN-NMR		Version 3.5
$$ ##JCAMPDX= 5.01
$$ ##ORIGIN= Bruker BioSpin GmbH
$$ ##OWNER= she
$$ F:/spectra/data/she/nmr/H-F/1/audita.txt
$$ ##AUDIT TRAIL=  $$ (NUMBER, WHEN, WHO, WHERE, WHAT)
(   1,<2023-01-27 14:48:14.73 +0400>,<she>,<DPX200>,
      <created by zg, POWCHK disabled, PULCHK disabled
       configuration hash MD5:
       00 E9 B6 7A A2 85 ED C7 34 08 36 98 17 FE 4E 26
       data hash MD5: 16K
       6C D2 13 5D 78 CD 5B D7 65 39 42 DF 0D 4F A6 F5>)
$$ ##END=
$$ 
$$ hash MD5
$$ 0C D9 77 8F F3 16 F8 2A 8C 7C 3B 98 18 72 8D 89
##$RELAX= 
##$RELAX= 
##$RELAX= 
##$RELAX= 
##$RELAX= 
##$RELAX= 
$$ Bruker specific parameters
$$ --------------------------
##$DU= <F:/spectra>
##$EXPNO= 1
##$NAME= <H-F>
##$PROCNO= 1
##$TYPE= <nmr>
##$USER= <she>
##$AMP= (0..31)
100 100 100 100 100 100 100 100 100 100 100 100 100 100 100 100 100 100 
100 100 100 100 100 100 100 100 100 100 100 100 100 100 
##$AQSEQ= 0
##$AQ_mod= 1
##$AUNM= <au_zg>
##$AUTOPOS= <>
##$BF1= 200.13
##$BF2= 200.13
##$BF3= 200.13
##$BF4= 200.13
##$BF5= 200.13
##$BF6= 200.13
##$BF7= 200.13
##$BF8= 200.13
##$BYTORDA= 1
##$CFDGTYP= 0
##$CFRGTYP= 5
##$CHEMSTR= <none>
##$CNST= (0..31)
1 1 145 1 1 1 1 1 1 1 1 1 1 1 1 1 1 1 1 1 1 1 1 1 1 1 1 1 1 1 1 1 
##$CPDPRG= <>
##$CPDPRG1= <>
##$CPDPRG2= <>
##$CPDPRG3= <>
##$CPDPRG4= <mlev>
##$CPDPRG5= <mlev>
##$CPDPRG6= <mlev>
##$CPDPRG7= <mlev>
##$CPDPRG8= <mlev>
##$CPDPRGB= <>
##$CPDPRGT= <>
##$D= (0..31)
0 1.2 0 0 0 0 0 0 0 0.06 0 0.03 0 0 0 0 0.0002 0 0 0 0 0 0 0 0 0 0 0 0 
0 0 0 
##$DATE= 1674816494
##$DBL= (0..7)
120 120 120 120 120 120 120 120 
##$DBP= (0..7)
150 150 150 150 150 150 150 150 
##$DBP07= 0
##$DBPNAM0= <>
##$DBPNAM1= <>
##$DBPNAM2= <>
##$DBPNAM3= <>
##$DBPNAM4= <>
##$DBPNAM5= <>
##$DBPNAM6= <>
##$DBPNAM7= <>
##$DBPOAL= (0..7)
0.5 0.5 0.5 0.5 0.5 0.5 0.5 0.5 
##$DBPOFFS= (0..7)
0 0 0 0 0 0 0 0 
##$DE= 6
##$DECBNUC= <off>
##$DECIM= 32
##$DECNUC= <off>
##$DECSTAT= 4
##$DIGMOD= 1
##$DIGTYP= 9
##$DL= (0..7)
0 120 120 120 120 120 120 120 
##$DP= (0..7)
150 150 150 150 150 150 150 150 
##$DP07= 0
##$DPNAME0= <>
##$DPNAME1= <>
##$DPNAME2= <>
##$DPNAME3= <>
##$DPNAME4= <>
##$DPNAME5= <>
##$DPNAME6= <>
##$DPNAME7= <>
##$DPOAL= (0..7)
0.5 0.5 0.5 0.5 0.5 0.5 0.5 0.5 
##$DPOFFS= (0..7)
0 0 0 0 0 0 0 0 
##$DQDMODE= 0
##$DR= 18
##$DS= 0
##$DSLIST= <SSSSSSSSSSSSSSS>
$$ [...]
##$SUBNAM2= <"">
##$SUBNAM3= <"">
##$SUBNAM4= <"">
##$SUBNAM5= <"">
##$SUBNAM6= <"">
##$SUBNAM7= <"">
##$SUBNAM8= <"">
##$SUBNAM9= <"">
##$SW= 18.05172834244
##$SWIBOX= (0..15)
0 0 2 0 0 0 0 0 0 0 0 0 0 0 0 0 
##$SW_h= 3612.71676300578
##$TD= 16384
##$TD0= 1
##$TE= 0
##$TE2= 300
##$TE3= 300
##$TEG= 300
##$TL= (0..7)
0 120 120 120 120 120 120 120 
##$TP= (0..7)
150 150 150 150 150 150 150 150 
##$TP07= 0
##$TPNAME0= <>
##$TPNAME1= <>
##$TPNAME2= <>
##$TPNAME3= <>
##$TPNAME4= <>
##$TPNAME5= <>
##$TPNAME6= <>
##$TPNAME7= <>
##$TPOAL= (0..7)
0.5 0.5 0.5 0.5 0.5 0.5 0.5 0.5 
##$TPOFFS= (0..7)
0 0 0 0 0 0 0 0 
##$TUNHIN= 0
##$TUNHOUT= 0
##$TUNXOUT= 0
##$USERA1= <user>
##$USERA2= <user>
##$USERA3= <user>
##$USERA4= <user>
##$USERA5= <user>
##$V9= 5
##$VALIST= <valist>
##$VCLIST= <CCCCCCCCCCCCCCC>
##$VD= 0
##$VDLIST= <DDDDDDDDDDDDDDD>
##$VPLIST= <PPPPPPPPPPPPPPP>
##$VTLIST= <TTTTTTTTTTTTTTT>
##$WBST= 1024
##$WBSW= 4
##$XGAIN= (0..3)
0 0 0 0 
##$XL= 0
##$YL= 0
##$YMAX_a= 325403
##$YMIN_a= -390047
##$ZGOPTNS= <>
##$ZL1= 120
##$ZL2= 120
##$ZL3= 120
##$ZL4= 120
##$ABSF1= 10
##$ABSF2= 0
##$ABSG= 5
##$ABSL= 3
##$ALPHA= 0
##$AQORDER= 0
##$ASSFAC= 0
##$ASSFACI= 0
##$ASSFACX= 0
##$ASSWID= 0
##$AUNMP= <proc_1d>
##$AZFE= 0.1
##$AZFW= 0.1
##$BCFW= 1
##$BC_mod= 2
##$BYTORDP= 1
##$COROFFS= 0
##$CY= 11.3945322036743
##$DATMOD= 1
##$DC= 2
##$DFILT= <>
##$DTYPP= 0
##$F1P= 2.36226072786647
##$F2P= -0.459571619588291
##$FCOR= 0.5
##$FTSIZE= 0
##$FT_mod= 4
##$GAMMA= 1
##$GB= 0.15
##$INTBC= 1
##$INTSCL= 1
##$ISEN= 128
##$LB= 0.24
##$LEV0= 0
##$LPBIN= 0
##$MAXI= 10000
##$MC2= 0
##$MEAN= 0
##$ME_mod= 0
##$MI= 1.114404
##$NCOEF= 0
##$NC_proc= 0
##$NLEV= 6
##$NOISF1= 3.799351
##$NOISF2= 2.8
##$NSP= 1
##$NTH_PI= 0
##$NZP= 0
##$OFFSET= 15.70392
##$PC= 1
##$PHC0= -19123.9
##$PHC1= 26.40079
##$PH_mod= 1
##$PKNL= yes
##$PPARMOD= 0
##$PSCAL= 0
##$PSIGN= 0
##$REVERSE= no
##$SF= 200.130013532006
##$SI= 16384
##$SIGF1= 3
##$SIGF2= 2
##$SINO= 400
##$SIOLD= 16384
##$SREGLST= <1H.CDCl3>
##$SSB= 0
##$STSI= 0
##$STSR= 0
##$SW_p= 3612.71676300578
##$SYMM= 0
##$S_DEV= 0
##$TDeff= 0
##$TDoff= 0
##$TI= <>
##$TILT= no
##$TM1= 0
##$TM2= 0
##$TOPLEV= 0
##$USERP1= <user>
##$USERP2= <user>
##$USERP3= <user>
##$USERP4= <user>
##$USERP5= <user>
##$WDW= 1
##$XDIM= 8192
##$YMAX_p= 0
##$YMIN_p= 0
$$ End of Bruker specific parameters
$$ ---------------------------------
##NTUPLES= NMR FID
##VAR_NAME=  TIME,          FID/REAL,        FID/IMAG
##SYMBOL=    X,             R,               I
##VAR_TYPE=  INDEPENDENT,   DEPENDENT,       DEPENDENT
##VAR_FORM=  AFFN,          ASDF,            ASDF
##VAR_DIM=   8192,          8192,            8192
##UNITS=     SECONDS,       ARBITRARY UNITS, ARBITRARY UNITS
##FACTOR=    0.0002768,     1,               1
##FIRST=     0,             0,               0
##LAST=      2.2672688,     0,               0
##MIN=       0,             -390047,         0
##MAX=       2.2672688,     325403,          0
$$ Real data points
##PAGE= N=1
##DATA TABLE= (X++(R..R)), XYDATA
$$ [...]
1943c14M53L20L48k191K464m94r10K68j06J004j878R52M84k12n62l38K496k239
1961d55k94J723q87O41j859J418R75k572J876l28m65N2j67J058j029m9R03k43
1979B98o91L96J59N4r86R29j4o03M79K83M74j596k57K646j395l36m80J316O99
1998A375l109K073O23j238L40p34K064j783q83K636j717M12m24L83R91k511J856
2015C54K81j195J148j027J291j170l70K044k008M47k69J229r34j724L252j182
2031A67o75Q3L69J830k907L27K733k105k74k07J489Nk830K150J175j458l75J5
2049d88J783r99j589K005p35J97q89N83J330k777K154n73p47J379j649K496k402
2066i21n3K809k589J207j213J566J80l708L855n33j264K59l0K594l101K2K202
$$ plain form
1943 -314 139 459 807 -1384 1080 586 -324 -56 -162 842 -1036 -84 400 188 -374 -712 1784 -455
1961 -455 -749 974 87 728 -1131 287 1262 -1310 566 238 -227 -175 -342 716 -313 -362 541 298
1979 298 -393 3 162 216 -770 159 145 -458 21 304 778 -818 -1075 1571 176 -160 -640 676 1375
1998 1375 -1734 339 962 -276 64 -670 1394 -389 -1272 1364 -353 59 -365 18 1009 -1502 354
2015 354 635 -560 588 -439 852 -318 -688 1356 -652 -205 -474 755 -179 -1903 1349 167
2031 167 -508 -425 -56 1774 -1133 -806 1927 -178 -452 -659 830 835 -1995 155 1330 -128 -503 -488
2049 -488 1295 296 -1293 712 -23 174 -715 -132 1198 -1579 575 2 -745 634 -1015 1481 -921
2066 -921 -974 1835 -754 453 -760 806 986 -2722 1133 600 -664 -405 -435 2159 -942 -920 1282
2083A282r11m47j012K053K71k696J176Q46l72l64n81J968r87j251K058j507R00
2100D26o27K7J070k831K525j42j296J385j473K604k633K77K531k715J329j456
2116i99K144n92k879L714r76o53r22J110K315l706J137J108l58l49j494K323r7
2133H26k203J532M70p71m41J51J541r97j165K068r46J67m58j17J363k426K114
2150G08l31j001J046j414K709k943M68K551k105O63j723K319k87k438K584j078
2166b72O83j486J008J680k865J368M8L61m91j494K554n24j409L85R03l23o27P1
2184d30R44n1q05Q37m57P8O2j44L59j168J218k12n99M08p14J798k092P10J085
2203H27j320Q55j050J602j162q29J785j089Q65j323O68P99j261J086r40P49l97
$$ plain form
2083 1282 371 -76 -1088 965 1236 -1460 -284 562 190 -174 -755 1213 226 -1025 1033 -474 426
2100 426 -201 -174 896 -1935 590 448 -848 537 -936 1668 -965 -688 1843 -872 457 -999
2116 -999 1145 553 -2326 1388 412 -241 -1163 -53 2262 -1444 -307 801 443 94 -1400 923 826
2133 826 -1377 155 625 -146 -587 -436 1105 108 -1057 1011 65 232 -226 -343 1020 -1406 708
2150 708 377 -624 422 -992 1717 -1226 -758 1793 -312 351 -1372 947 660 -1778 806 -272
2166 -272 411 -1075 -67 1613 -1252 116 164 525 34 -1460 1094 570 -839 -454 449 126 -501 -430
2184 -430 514 463 -342 495 38 116 178 34 393 -775 443 231 -368 40 -674 1124 -968 -258 827
2203 827 -493 362 -688 914 -248 -1077 708 -381 484 -839 -171 628 -633 453 -487 262 -135
2220a35q9Q73j185M96j40M94o56j74J032o46L06k13L77k48l62O00j91j13l60J055
2240G21j005j00P96n21P57j738J423K16r19R57j072J123o90n97J364q97J80o19
2258f21J112l10r24J033l41P30j215O64M78j290O43k54O30n13q9N78o69J38Q3
2277a37N06n40k00O78n5l5p53Q44o1r75Q82p5L15q93Q93K89r28K58k69P92q60
2298c24L23M73n93L72j018J410q97j66J082r16O55j146J126J62q12J92j39L94
2316A78q14R96n55J11J23k60Q80j210K80P08n00K60p70J253q95j49L56J99r7j037
2336i43J542n02m81N09k35R55j675M37P87k49j91p89J735r70m82O96K5J43j200
2355h88J558o75m56L28J17Q40j863R91N72m71k02m71J462q67lK49ok85n09J527
$$ plain form
2220 -135 -224 649 -536 -40 -180 314 -342 -516 516 -130 176 -37 340 92 -270 330 139 26 -334 721
2240 721 -284 -384 412 -109 648 -1090 333 549 -370 587 -485 638 -52 -649 715 -182 -2 -621
2258 -621 491 181 -743 290 -51 679 -536 128 606 -684 -41 -295 335 -178 -267 311 -358 -220 -137
2277 -137 369 -171 -371 307 252 217 -536 308 247 -728 154 79 394 -499 394 683 -245 13 -256 536 -324
2298 -324 -1 472 -121 251 -767 643 -254 -420 662 -254 401 -745 381 543 -269 -77 -216 178
2316 178 -636 360 -195 -84 39 -221 659 -551 -271 437 -63 197 -573 680 -215 -364 -8 191 94 -943
2336 -943 599 97 -384 125 -110 845 -830 -393 394 145 -46 -835 900 -70 -552 144 169 312 -888
2355 -888 670 -5 -461 -133 -16 824 -1039 -48 524 53 -149 -620 842 -25 -28 221 215 -70 -579 948
2375I48j270m23N88N76L27j895J502J83n84K24n36J076j137J79O51o02J19n36
2393f10J487j238n6M77L5O93j995J527J78r30O84m54O38p27M07J53m01n3K47N68
2413F30j043J02N65L5j0j177J230n90K28J58k99K25n17Q17l22m00J73J4J055j666
2433g92Q33P9j06J4o29J284p32l86P64j55K5q64R64P7j140Q07j07O22q79J26M79
2454B84j20k22l32N92l26Q8N74l83j37k3K36j46j58j9K44j76o25J325n43P2l39
2475a34O3R27j680Q69R6l61K14m76Q92l37j89J15J16K56q95K87N47l29M9n17J240
2496G53p87n75J100m11K01o50K38R94q07J7J41l13M08m44N1L09o46O41l03L19
2516B36L7n86O64o33N58J43o43L37n52O22l03n53J250o57M50p75J61R61j019K02
$$ plain form
2375 948 -322 -745 -157 419 746 -1149 353 536 -48 176 -360 716 -421 -242 409 -193 -74 -610
2393 -610 877 -361 -417 60 95 788 -1207 320 498 -432 252 -202 436 -291 116 269 -132 -185 62 630
2413 630 -413 -311 254 289 279 -898 332 -258 -30 128 -171 54 -463 354 32 -368 -195 -181 874 -792
2433 -792 41 120 14 28 -601 683 -49 -435 329 174 199 -665 299 376 -764 43 -64 558 -321 -195 284
2454 284 164 -58 -390 202 -124 -36 538 155 18 -5 231 85 -73 -92 152 -24 -649 676 133 205 -134
2475 -134 -71 856 -824 45 141 -220 -6 -482 410 73 -116 -1 115 371 -524 -237 310 -19 30 -487 753
2496 753 -34 -609 491 80 281 -369 -131 863 56 73 214 -99 309 -135 -84 225 -421 220 -83 236
2516 236 273 -313 351 -282 276 419 -224 113 -439 183 -120 -673 577 -80 370 -405 -244 717 -302 -100
2536a00K39l45P16r67Q72J7j088J033l65L34n90j31Q56o50J79k61J71Q19j030
2555b91K84J06n6J55q28R52k24k69O55j013Q06j67l42P50p71N38l48l11P19m63
2575a18R4o6k07O03l40j43P66n99J93n80N52N7n77L76j08N30p23l11J131p12Q9
2596i3K0j21O20q36L87k4P9L56r85J000l99P6L13p22O98l31q1M0r2J93k31J60
2618B7j32J82J8l38J96K78l56j77M41p7K16p22N83J23n11J48m61Q48q6j077J075
2639A98j54L23o25o9J212j101L07l90N73J54r87J005o14J42K2m69J195j060M97
2658A59M5j42K79p14Q11p49M42m17J59R4m32N82M3k5l80O64j62n72N26l14K00
2679I7n01N23L44r76Q76p53Q43m24m08R02n29K8m76M31L11q78O47o5K58n63k15
$$ plain form
2536 -100 139 -206 510 -457 415 432 -656 377 12 346 -244 -375 481 -169 10 -251 -80 739 -291
2555 -291 -7 99 43 198 -630 322 98 -171 484 -529 277 110 -232 518 -253 285 -63 -374 345 -118
2575 -118 -24 -90 -297 306 -34 -177 589 -10 183 -397 155 212 -365 11 -97 433 -290 -601 530 -182 -93
2596 -93 -73 -194 426 -410 -23 -47 32 388 -597 403 4 80 393 -329 369 38 -43 -3 -95 98 -133 27
2618 27 -105 77 95 -243 -47 231 -125 -302 139 62 278 -444 139 262 -249 -101 -562 286 200 -877 198
2639 198 44 367 -258 -327 885 -216 91 -299 274 428 -559 446 -168 -26 -4 -473 722 -338 159
2658 159 204 62 341 -373 438 -311 131 -286 -127 -33 -465 117 160 135 -245 419 257 -315 211 -103 97
2679 97 -404 119 463 -513 363 -390 453 29 -379 523 -6 22 -454 -23 288 -590 57 -8 250 -313 -528
2700e28J222q82L60m63K9M93o64P51j58K9m68L46L59r02P92m90O27n15L4L72n17
2721a73N17o88N02l65L13M97q35N66l78K95l54n5O96n89L32o50K63M33o59M62
2741A30q22J051j19o71O99o60N58m91L03O2j63L80o72O44k79N7j37J48L27o74
2761c29Q71l62l40N15p13Q46n83L30r9k29L21l48M90n35L20J31n46M38l37L93
2781B34l65J62M24p45M66o30N64j25l25J051p02L38p17N44M13j297Q95m40O34
2800C79q31M74M06p03K03j85Q55o27k42O52l90k40%L19J31o25L94P0K17n79J02
2821b20M95l57K60k79M72m96l32Q64m43j87l11R62l21m44M06P8K39p06M84O0n35
2842c11J63R4M12p28l8N57j26j07l62Q09k78l70L46r0K94p79P91l0o95M38L22
$$ plain form
2700 -528 694 -188 172 -291 -262 231 -433 318 160 189 -279 67 426 -476 316 -174 453 -62 -28 344 -173
2721 -173 344 -344 158 -207 106 603 -232 334 -44 251 -103 -158 538 -51 281 -369 -106 327 -332 130
2741 130 -692 359 240 -431 268 -392 166 -325 -22 40 -123 257 -415 229 -50 7 -130 18 345 -329
2761 -329 542 180 -160 355 -358 488 -95 235 136 -93 228 -120 370 -165 155 286 -260 178 -159 234
2781 234 -131 31 455 -290 176 -454 110 -15 -340 711 9 347 -370 174 587 -710 185 -255 379
2800 379 -452 22 428 -275 -72 -257 598 -29 -271 381 -9 -249 -249 70 201 -424 -30 40 257 -322 -220
2821 -220 275 -82 178 -101 371 -125 -457 407 -36 -223 -534 428 107 -337 69 147 386 -320 164 224 -311
2842 -311 -148 -54 358 -370 -408 149 23 -84 -446 363 85 -285 61 -29 265 -514 277 247 -448 -10 312
2863C12Lq47N46M73k83j82l41N95l46j09L37j89L08p39Q58o20p1J93r6P44p90
2884b44L89K83o86K43j78P64o61n5M16l18K74p37P88j51q7j8O4J14n18O04n0l21
2906h5j83L60K38p43M97n3K40l62k43J067j082O7L90l79L42o17Q43Q5n64L9M89
2927C46l7o78N53k9l36K44l48R42r75QN89l60Q8m97R66l58m28K08N31j55q60K75
2949c11N37j69j1Q2K52m77J34k7L80m38k27P11n49l3P0L69j0q62R10l24k84M06
2971A29j88O20r96O45j63J57j49m31O78n38k15M79P2J67n75P14r9m62P8J43N30
2992E96o90o3K50k93O5J33K65n11O9P4M68n87N7O69p19J82M0K04p2k14L28l41
3014i0q2L87m5L49j047Q49j8l66K77k74N24o04j36O97l82J65l31L99k62m16N85
$$ plain form
2863 312 315 -532 14 487 204 22 -319 276 -70 -179 158 -31 277 -462 396 -224 -295 -102 -198 546 -244
2884 -244 145 428 -258 -15 -193 571 -90 -145 271 -47 227 -510 278 127 40 22 86 200 -318 286 236 -85
2906 -85 -268 92 330 -413 84 31 271 -91 -334 733 -349 -282 108 -271 71 -546 297 382 -182 -143 346
2927 346 309 -369 184 155 -181 63 -285 657 -318 -310 279 -81 7 -490 476 118 -310 -102 429 274 -586 -311
2949 -311 226 57 46 128 380 -97 37 10 390 -48 -275 436 -113 -146 -76 293 283 -579 331 7 -277 129
2971 129 -59 561 -435 210 47 204 55 -376 302 -236 -451 28 100 267 -308 406 307 -155 -77 66 596
2992 596 -94 -157 93 -200 -135 -2 263 -248 -179 -105 363 -224 -167 502 -217 -35 5 209 137 -77 251 -90
3014 -90 -172 215 170 519 -528 321 303 -63 214 -60 464 -140 -276 421 39 204 -127 272 10 -406 179
3035A79l42K89j33j39N73n96Q0J86k56K38j3l5k66M22j4r5m72N16M9O4p06J89
3057b82M97k71j40L4K24P6o32Q28j01n25L39k11N95n29k61Q93p10L48l60L54K96
3078D62q36O01k63J33O2l66Q64r51K19K27l86L18j56K57j59l29R26r80N30M7m02
3099a82K63m53L53K63n58L03P0O8l49M8M64j52m95L51L7J3q2n7O86p25j0j5L45
3122A86k60j41M43j76j85J99l22P61p39L00J45k61r3L04m4k08n2O22m86m73N65
3143H5J53k10o13R57jl98j95J5N89n95k31P29j65k10p6M10J7n87L83L58m01n6
3165d2k19M50J81m73M41k95k31J29L23o3p21M50L51o79K68p5K40k94j00P59n05
3186a05k77K13L86j47m06L51O2l45m6K81N43m08l16J21K87k23j99M52R2n69J75
$$ plain form
3035 179 -163 126 -7 -146 427 -169 -89 97 -159 79 66 31 -235 187 173 78 -394 122 171 235 -471 -282
3057 -282 215 -56 -196 -162 62 138 -494 334 233 -292 47 -164 431 -98 -359 534 -176 172 -188 166 462
3078 462 -374 227 -36 97 159 -207 657 -294 -75 152 -234 84 -72 185 26 -303 623 -357 173 220 -182
3099 -182 81 -372 -19 244 -314 -11 59 127 -222 -174 290 138 -357 -6 31 44 -38 -95 591 -134 -144 -159 186
3122 186 -74 -215 228 52 -133 66 -256 505 -234 66 211 -50 -143 161 117 -91 -143 479 -7 -480 85
3143 85 238 28 -585 372 371 -27 -222 -207 382 -213 -444 285 120 -90 -166 244 261 -326 57 415 14 -42
3165 -42 -261 189 370 -103 338 43 -188 -59 264 201 -520 -70 281 -398 -130 -205 35 -259 -359 400 -105
3186 -105 -382 -169 217 70 -336 15 77 -268 -314 -33 510 102 -214 -93 194 -29 -228 224 316 -253 -78
3207g8L05j05k44k00N85l39n22O93j04k91J38J85J33o94N10M32q43M08L9L14l82
3228f0j16K10N4Rm15P51j92m69N25j1l02l72K42N48k94q5K83j81k73m40Q42j46
3250A08k99OL39k28Q4K86m7j11k84M38l87j58J94J83r1o13N72M48n57K23k24M98
3272C80o97J48M78j98k5l64K50L63n71K62j05N38o49K09M26n56K8O0K63l48k06
3293c14M25k5j06k29L96J05n22K34J78k3m59L80j08k38K37K23Mm35J8K13N6O0
3315G0j39K90o5l25J08J37K69n27K78Q6l91L53k03K58n19K45L01k89J27n4J00
3336A10k17n3O0J51j92m3O27k21n23N71k72k20K39M7q4r9K08j14L62l11N3K16
3358B95m98K37J06L36l42j53L9N2O1k11L85j12r0k77j85O19n25K25M4p0K07k87
$$ plain form
3207 -78 227 122 -122 -322 263 -76 -598 95 -9 -300 -162 23 156 -538 -28 404 -439 -31 8 322 -60
3228 -60 -176 34 88 97 -318 433 241 -228 297 286 -16 -388 -146 402 108 23 306 125 -148 -588 254 108
3250 108 -191 -185 154 -74 10 296 249 138 -146 292 -95 -253 -59 124 33 -580 -8 440 -117 106 -118 380
3272 380 -317 -169 309 111 86 -278 -28 335 -236 26 -79 459 -190 19 445 -111 -83 -23 240 -108 -314
3293 -314 111 86 -20 -249 147 252 -270 -36 142 119 -340 40 -68 -306 -69 154 158 -277 -259 -46 10 70
3315 70 -69 221 156 -169 -61 76 345 -182 96 182 -209 144 -59 199 -320 -75 226 -63 64 10 110
3336 110 -107 -160 -100 51 -141 -184 443 222 -301 270 -2 -222 17 64 -20 -119 89 -25 337 26 79 295
3358 295 -203 34 140 476 134 -19 20 72 133 -78 307 195 105 -172 -357 262 -263 -38 6 -64 143 -144
3380a44J71Mj38r8Q4J40j79K93j9j86j3q5K07j02J86K12l74K1o8J71j6m2J6J11
3404A52m8k93M38l76l6J75J32J57m45j4J34j10K56n23N01j72O4OQ3J16n73N99
3426B23r5j9l64J44l9J95j08n2j51J84P6J39l8l44K38P4O6j13j93K6J02j87L45
3449A09l7r1j05O2J79l64J36J19j78L06k75K14O3m74M06k41P8P5K25L3n68K84
3471d4Q0K33k65j59L67j90k4J03p8O4r1j32M4j1k6L31k67J73l4L5rj45j17K3L8
3496a01R6m01N70l50R8J36J03J4n78M61k9j00J4l84N35j13k07N07l23J46j9j25
3518e0J03q9M8r5L5K02m57J99L56m60L11j91K1J97j39k16J34J57rl3k37m8M24
3541A63N1o54P71l01r1J17j66N03n28J52K15J6k5j27l8p1m75O42j95L02o64M72
$$ plain form
3380 -144 27 31 -107 -205 -121 19 -160 133 114 -72 -85 -170 37 -65 121 333 -41 -20 -88 83 67 25 41 152
3404 152 104 -189 249 -127 -163 12 144 301 -144 -158 -24 -134 122 -401 100 -72 -8 -2 81 197 -376 223
3426 223 128 109 -255 -111 -150 45 -63 -115 -266 -82 -6 133 95 -249 -11 63 129 16 -177 -151 -49 -236 109
3449 109 72 -19 -124 -62 117 -247 -111 8 -170 136 -139 75 138 -336 70 -171 -93 -18 207 240 -328 -44
3471 -44 36 269 4 -155 212 22 -2 101 23 87 -4 -136 -92 -103 -129 202 -65 108 74 109 100 -45 -162 -139 -101
3496 -101 -5 -406 164 -186 -88 48 151 165 -413 48 19 -81 -67 -451 84 -29 -236 271 -52 94 75 -50
3518 -50 53 -36 12 -83 -48 154 -303 -104 252 -208 103 -88 -67 130 -9 -225 -91 66 57 24 -213 -261 163
3541 163 214 -440 331 30 -61 56 -110 393 -135 17 232 248 223 96 58 -13 -488 154 -41 261 -403 69
3563F9J86l84L8o9K98L8k60J83n8p3nK97k27J4M9K9k71J21J68l71M21l78J80o1
3587f6j70K93m6Q3j46L6N66j046K97L61q0j19k76L55K37n18K17j41L07n09K09
3608a56L23k72K21l31J68L72m74R3J74l52J86q4R0M1l9R3J09L5m66J46J26m2L17
3631B78m12J31L01k99J54k57j40N85l31m4l51L48L4j73M31p0k88P8k57N53l74
3652a03j12L39J7k55k06L51R4l78J05P8R4J7j65L50k65J22J37r3j53p6K9L88l80
3675f5o2M7N5J56j0P2k55M6L18k34M0k58L45N1j87k12K38k47r0J92K29q7l24L12
3699G0p9J31m51J04J63j38k5L09K0m1n04O19j5n1n6N0k80K46p7j43J70j93k5K42
3723D6J21k63J21j66j56M09M7k74o4J38J32m5R4r9O7l17m2L54j84k1N4MN9lM8
$$ plain form
3563 69 255 -129 -91 -160 138 176 -84 99 41 -32 -37 260 33 47 96 125 -146 -25 143 -228 193 -185 -5 -66
3587 -66 -236 57 11 94 -52 -16 550 -496 -199 162 82 -37 -313 42 279 -239 -22 -163 144 -365 -156
3608 -156 167 -105 116 -215 -47 325 -149 -56 118 -234 -48 -132 -42 -1 -40 53 162 197 -269 -123 3 -39 278
3631 278 -134 -3 298 -1 153 -104 -244 341 10 -34 -385 -37 -3 -176 255 185 -103 -25 -282 271 -103
3652 -103 -215 124 141 -114 -320 31 125 -253 -148 -70 24 41 -124 226 -39 83 220 127 -26 -102 -73 315 -65
3675 -65 -127 -80 -25 131 121 193 -62 -16 302 68 108 -150 195 246 59 -153 85 -162 -252 -60 169 82 -242 70
3699 70 -9 122 -329 -225 -62 -200 -225 84 104 63 -441 178 163 112 56 106 -174 72 -5 -148 22 -171 -196 46
3723 46 167 -96 25 -141 -297 112 159 -115 -179 -41 91 46 140 41 108 -209 -251 103 -81 -102 -48 -44 15 12 60
3748F0J74m55Q1J78P5K41q62P18j74M5o9L1M8l53N9J71n1O1o8N08m19k75M64j04
3772H4J1n11M88K05l36j4J51k04oK31o8J04k75N4M28r6l74K09K95m08Q3J85r2
3795A44k50K5O4j2j48J44J59k27K5r7L89k03N8J8j86r5j46N47l10m2NJ64L23p85
3819d36N53m6O4l83L27j24K19l99J39K57p9q0n4j83l6K46J8j56K9R8J12l60J83
3842i1P6J44j19j52K44j03M2p4L35n15J23M35n93N82j96M4k5m9l41M20j45k72
3864b30L33Jj66j90M44r5m25K82K5R4j15j33J25j34J75j19K24l0l46N10j9j44
3886F7j34L8K73m17J61J26k24J39j89L17Q6l43K94l15O9M2j16L6J88j75j84M89
3908B28r5k35K94o0j98l8K98m44K53j94L14j87KJ82j3r4j05J39J03j66r6K99j05
$$ plain form
3748 60 234 -221 -140 38 113 354 -508 210 36 81 12 43 91 -262 -203 -32 -83 -22 -90 418 -1 -276 188 84
3772 84 95 -416 72 277 -59 -73 78 -126 -132 99 31 135 -140 -86 342 246 -128 81 376 -32 51 236 144
3795 144 -106 -81 -17 -29 -177 -33 126 -101 -76 -173 216 13 71 89 -97 -192 -338 209 -101 -143 -138 26 349 -436
3819 -436 117 71 135 -248 79 -45 174 -225 -86 171 92 12 -42 -225 -261 -15 3 -153 -124 -26 86 -274 -91
3842 -91 -15 129 10 -142 102 -1 41 -33 302 -213 -90 345 -248 334 138 182 157 108 -233 187 42 -230
3864 -230 103 104 -62 -252 192 97 -328 -46 -21 73 -42 -175 -50 -184 -9 -128 96 66 -280 230 211 67
3886 67 -67 -29 244 -173 -12 114 -110 29 -160 157 243 -100 194 -121 -52 -10 -126 -90 98 -77 -261 228
3908 228 133 -102 192 132 -66 -104 194 -250 3 -191 123 -64 -62 120 107 13 -92 47 150 -16 -112 187 82
3931H2l38K09k6J16QL3J56k58k43J80j3K46n9Q9j04k16l11L72L48n39M15j70o2
3954h5K31l54M04j81k71J56Q0k58K75pL82m21j46K74j5k99K58J81k96L48m35L55
3976A76p3j42NP9p6k32K98J27l20%j23M49k31k2L56n31K73M5J83o6l37l7K35k99
4000b63K08J64J90o72K06L6N93m18k52M17k93K52l37N51m63n7K84m8l4L6j09L30
4022C21j73m25K52K81m00K9M88m35J43k56L61m49J43M58k57k9j45L29L0p76P63
4043B53j95n5LJ11O8k81k34K57M99m90m48P80j00l39k7L30j8M4j94J25J83l78
4065a06J65J87j90j98K96n0j77j9J25J40k34k09L94k45J15J52l43L59q5J0m8j17
4087g8L61q4j65j63q1L97j46k41J53L08m18l6J58O9j25J30j54K33m31J46K83J
$$ plain form
3931 82 -256 -47 -73 43 51 84 240 -18 -261 -81 -94 152 93 182 78 -138 -449 -77 271 -268 147 -23 -85
3954 -85 146 -208 196 15 -256 -100 -20 -278 -3 -10 372 -49 -195 79 64 -235 23 204 -92 256 -179 176
3976 176 103 -39 -34 45 -31 -263 35 162 -158 -158 -281 168 -63 -85 271 -260 13 58 241 175 -162 -199 36 -263
4000 -263 -55 109 299 -373 -167 -131 462 44 -208 209 -84 168 -169 382 -81 -138 146 98 64 100 -9 321
4022 321 148 -277 -25 256 -144 -115 373 -62 81 -175 186 -263 -120 338 81 52 -93 236 266 -510 253
4043 253 58 3 6 117 185 -96 -330 -73 426 -64 -512 268 168 -171 -198 132 114 158 -36 89 272 -106
4065 -106 59 246 56 -142 154 104 -73 -92 33 173 -61 -270 124 -121 -6 146 -197 162 77 87 39 -78
4087 -78 283 199 34 -129 -210 187 41 -200 -47 261 -157 -193 -35 34 -91 39 -115 118 -313 -167 116 117
4109A17k80j85L85q8J3K17k35N4j73L25J63l21J49Kj64J01k12J00M5j09K10j9
4131I5q5j61K97k7l96L12J38k87n1J9N22m57k93N89k02p6J90k76K30m78L59L22
4153B84j44k67J3Q9n7K2M6r6j2L95l47k2j04J41Q7O5Pq4M8j40l8J37j69J00k37
4178b83M29N5m42kJ59L22l12P4J60J86m81L14p1j57lj12M09k19l0L17j09J26l55
4201b5L4N5k4q4l20N04k65k3J88k39K88j37j9M6k6J98j13J66l72J15P6K79l87
4224h5n0J78J22J1k6k64J42Qj31K65m18M99r9k80j14N02j4r6j56J36mk30Q1J21
4248I8k96L62m73K48R5M9J22j52J73m24L32k19R0j09o9L73j46k25J59J39k90K66
4270A03J33m7j64r1J40k55L01n9J30j17k88L58r0N2k21J31K93l68L3J06L5j46
$$ plain form
4109 117 -163 -348 37 -51 -38 179 -56 -2 -175 150 313 -8 141 143 -21 80 -132 -32 13 -96 114 95
4131 95 10 -151 146 119 -277 35 173 -114 -165 -146 376 -81 -374 215 13 -63 127 -149 81 -397 -38 284
4153 284 140 -127 -114 -25 -82 -60 -14 -110 -122 273 -74 -96 -200 -59 28 93 100 16 64 -76 -114 23 -146 -46 -283
4178 -283 146 201 -241 -243 -84 238 -74 0 160 346 -135 179 108 -49 -52 -164 245 26 -4 313 204 330 -25
4201 -25 9 64 40 -44 -364 140 -125 -148 40 -199 89 -48 -67 -21 -47 151 38 204 -168 -53 23 302 -85
4224 -85 -135 43 165 176 150 -114 28 36 -95 170 -248 251 152 -128 -242 260 246 150 -6 130 126 -104 -23 98
4248 98 -198 164 -309 -61 34 83 205 53 226 -198 134 -85 5 -104 -173 200 54 -171 -12 127 -163 103
4270 103 236 189 25 -66 74 -181 120 61 191 74 -214 144 54 106 -115 16 309 -59 -26 80 115 -31
4292c1q5L17j59l14L27m8n4M2N2K10l08K63j52k22l5K2L94l37J90j33O9J65l48
4315a75J00J19J26q7q4J70j16PJ75j18l00n8M75j04l90J59M40j80k79J89Q7k09
4337e3J3K38k21j73L39j11J38j45M3K63k12j01J51O8m23j21K31K43K6l07J81M08
4359D75o41L77k78L9r5K16n4j38r5j49O63n27J31K05k1k20R4L17j0o02K88O6M7
4382H8k95M9K02l53L62N9j88k73O7M39j76j07K22J92m02J89k8o5n0l7l5K94l10
4405a56j34K81j59j8k68O33m02M01r2K3J82m42Q5J18J06j26qj75l9M74l35M2J19
4428A10k08J15j65J53oM3j30j7L23j47M0k6J32k88k01L70K1j22p6l32O42m26M2
4451a53K80j39m8K5J39mJ49j07J0nk8l23M57k59J0L7K54m11K45j76M35n38q2L10
$$ plain form
4292 -31 -116 201 42 -272 55 7 -47 -5 47 257 -51 212 60 -162 -197 -175 219 -118 72 -61 8 173 -175
4315 -175 -75 44 170 83 -1 169 53 60 235 117 -183 -241 234 130 -260 -101 339 159 -120 69 156 -53
4337 -53 -40 198 -23 -196 143 32 170 25 68 331 119 18 169 237 -186 -307 -76 167 193 -114 67 475
4359 475 -166 211 -67 -28 -123 93 39 -99 -194 -343 320 -207 -76 129 108 -112 -18 299 289 -313 -25 41 88
4382 88 -207 -158 44 -309 53 112 -76 -349 -282 157 -19 -126 96 288 -114 75 47 -18 -68 -105 -140 154 -156
4405 -156 -290 -9 -168 -186 -454 179 -223 178 86 109 291 -151 -66 52 158 32 24 -151 -190 284 -51 -9 110
4428 110 -98 17 -148 5 -1 42 -88 -105 218 71 111 85 217 -71 -272 98 119 -3 -79 -411 231 -195 -153
4451 -153 127 -12 -60 -35 104 100 249 142 152 147 119 -204 253 -6 4 41 295 -116 129 -47 388 -150 -232 78
4475G8P0j47q5L49m66J8N04l99q5J01Q3K41j67K42l31K29l79K60R1m46L15k00
4497a24K17%j30K21l0k39K72k29J97l68K55j2o3J5j05J93r0p8K76K58p14K74j02
4520a06OJ05J04J04j75J3K35l69M72o23M21l90o6M22J20j57k78J24J42j40L6L11
4542C11l21K86l48K9J22Q8k17Q1J10Rk19K13k73J63qj76J88J1L5j24J09o0j00
4565i1J83P1k34J22p3J70p6j80J03j11K90j27j71K36J54l17J77j98J41j07J3m9
4587g4K51j99kj66L17j85J11J85k62p9j88K53N8J73m98L20K53j96j29n9J1J18
4609A3k0M1j2k4J14j69J6pj10K60k0k40o0M05L5l24P3M9P6n7j77K91p4J26j86
4634A9j07J59k66M52m97J67J60n6j9j00J31L0k30M7L34j64m07K69K31k25q4j44
$$ plain form
4475 78 148 1 -84 265 -201 -183 321 -78 -163 -62 21 262 95 337 6 235 -144 116 207 -239 76 -124
4497 -124 93 93 -37 184 154 -85 187 -42 155 -213 42 30 -33 -18 -123 70 -20 -98 178 436 -278 -4 -106
4520 -106 -100 5 109 213 38 51 286 -83 389 -234 187 -203 -269 153 273 116 -162 -38 104 -36 0 311
4542 311 -10 276 -72 -43 79 167 -50 31 141 150 -69 144 -129 34 26 -150 38 49 84 -40 69 9 -91
4565 -91 92 163 -71 51 -22 148 72 -108 -5 -116 174 47 -124 112 266 -51 126 -72 69 -38 -25 -74
4587 -74 177 -22 -24 -190 127 -58 53 238 -24 -103 -291 -38 20 193 -305 15 268 72 -57 -116 -105 13
4609 13 -7 34 22 -2 112 -57 -41 -48 -158 102 82 -158 -218 187 222 -102 -29 20 96 39 -138 153 79 205 19
4634 19 -88 71 -195 257 -240 -73 87 31 12 -88 43 73 -157 -110 224 60 -347 -78 153 -72 -156 -300
4656c00L70j10K3O4l5J00k85R0N9J18l33O6J85L6R7m85M43r8j25MJ05J30J8k32
4680i5Q7%P7O5j60M3l05K80l4L6m6J52j88M2k19N2M48l68L49k64o4J90j97M46
4704C27o28L30j45Q8j24O2K36l0o7K86k44K12k18j7k16K54r1k09L17k15L40l87
4726a39J92RJ35j61j62K9J28N8j32J28j25kO5j35K09k36J08rmJ70j29k01P8K74
4750A48j1j16j94M1K37l07M68L1l87J39q4j8j38J56n9M1P0o9no6NK82j44k15L59
4775A64k28M5M15j73k54J71k74M10k15j36K13j23k00J22J01p0j06n3K99k39K61
4796A30l08K78k46n3K32Lk5P0N7j13J3j07l8J00o6J81j50NK4O8Q8j06m61L83j6
4821e7j48N0L68j60L19k48j22K59j55k07J56J0M7n4o4J66m6k29J85R7k03M7j38
$$ plain form
4656 -300 70 -40 -17 47 12 112 -173 -83 -24 94 -239 -173 12 48 145 -340 103 5 -120 -116 -11 119 137 -95
4680 -95 -8 -8 69 134 -26 17 -288 -8 -42 -6 -52 100 -88 -46 -265 -213 235 -133 216 -48 -112 78 -119 327
4704 327 -301 29 -116 -28 -152 -90 146 116 49 335 91 303 85 68 -148 106 15 -194 123 -92 248 -139
4726 -139 53 62 197 36 -126 -97 31 89 -43 85 -40 -42 23 -112 97 -139 -31 -40 -44 126 -3 -204 -126 148
4750 148 137 21 -173 -132 105 -202 266 297 -90 49 -35 -53 -191 -35 -94 -53 17 -52 -57 -123 -118 164 20 -195 164
4775 164 -64 -19 396 223 -31 140 -134 276 61 -75 138 15 -185 -63 38 -32 -138 -191 108 -131 130
4796 130 -178 100 -146 -199 33 36 11 81 138 25 38 -69 -107 -7 -73 108 -42 -37 -13 55 143 37 -424 -41 -57
4821 -57 -205 -155 213 53 372 124 2 261 106 -101 55 65 112 58 -6 160 114 -115 70 167 -36 11 -127
4844a27O6L26j14m39OO59n00K22j13J75k07j44L66m27K65k31L47J5q4j60O6J52
4866A19k53m1K35R1j87j46M44m71K16K23j85j45k52K84K49l56R1P9J57m13j80
4887d41O87m7j17r2L69l65j87J34L73k10l1l18M25k61mJP6k11J51o1J29o4m9J48
4911C5N2j73J98o3l22P9K82N7k55K76j43R1p3j09K06j60k2J47j49l6j61L27j06
4934b2q3m21N59m2Q4k23J52P6j36p9M37k60j18J87n4j88J17K99j59j43N7O6o7
4957C9k16J36J37m9N8k16J39r5L77j17r1n3p5K43l22j86J31J51j93J61J93M0k92
4980a00q8L05qj49jM76n49J24KJ88j95plM1J81k86K6q9j2n4N15j86O7q8J40j3
5006B37m05R9K6j9j34K50O3j40rK78j27L2k11K32l04J05l6P1k55K73J11k13n5
$$ plain form
4844 -127 -61 265 151 -288 -282 377 -123 99 -14 161 -46 -190 176 -251 14 -217 130 145 61 -99 -33 119
4866 119 -134 -175 60 151 -36 -182 262 -209 7 230 45 -100 -352 -68 181 -175 -84 -5 152 -261 -441
4887 -441 246 199 82 -10 359 -6 -193 -59 314 104 73 -245 180 -81 -85 -84 -8 -219 -68 -129 0 -64 -113 35
4911 35 87 -86 112 49 -273 -194 88 145 -110 166 23 114 41 -68 138 -22 -44 103 -46 -82 -243 84 -22
4934 -22 -105 -526 33 -9 75 -148 4 80 -56 -135 302 42 -76 111 57 -131 -14 285 126 -17 40 106 39
4957 39 -177 -41 96 47 105 -111 28 -67 310 193 102 49 -26 217 -105 -291 -160 -9 -202 -41 152 192 -100
4980 -100 -188 117 109 -40 -41 435 -114 10 12 200 5 -2 -5 36 217 -69 -43 -132 -144 -198 317 131 198 110 250 237
5006 237 -168 -69 -43 -62 -196 54 117 -23 -32 246 119 151 -60 172 -132 -27 -63 8 -247 26 137 -76 -131
5029a31J95j58K83l72K05R6J61o07M95j0l60J79k01P8OK90l12K1N2L23k49J52
5051A36k54M27m39R4K16l30L01n1o2l00Q9K44l0k8O4l68L92j33R5j67M93p24K89
5074d6K96k97K38k50K2J55j01L3K5j58k26K62J49l0m37L95j79M3K49l39K48L3
5096H5j39K7p7k26K97j95L04O8J14l56k3O7k2j96M88j5j29k37K65l1j51M2n1L48
5120B57m25j13L21j14k1J48j04k4n5J78n6j50K61k68J23K46k19j04J25k3L2m7
5142c2L53m21j6O4J51k9q0J51k41K50j60m2Q6k50R8J05n1K10k26P8K16j15k6l6
5166C7Q8J34l33R3j30K23k30J05L2m8J97m29K18J53j0n3k8Jj47K48J11j07m05
5189b80L14j70K84o8m2j35P5R2O3P3k71O8K39j62j49J7k34L52ok16L63k93j65
$$ plain form
5029 -131 64 -94 189 -183 22 118 279 -328 167 157 -203 -24 -225 -147 -141 149 -163 -142 -90 233 -16 136
5051 136 -118 309 -130 -36 180 -150 151 100 38 -262 -173 71 41 13 77 -291 101 -32 63 -104 389 -335 -46
5074 -46 250 -47 191 -59 -37 118 17 50 75 -83 -309 -47 102 72 -365 30 -149 -106 143 -196 52 85
5096 85 -54 -27 -104 -330 -33 -228 76 144 258 -98 -121 -54 -76 -272 216 201 72 -165 100 69 -82 -40 -91 257
5120 257 -168 -281 40 -74 -95 53 -51 -75 -130 48 -8 -158 103 -165 -42 204 -15 -119 6 -17 15 -32
5142 -32 321 -100 -116 -52 99 70 -10 141 -100 150 -10 -52 34 -216 -118 -13 -64 146 -80 -2 214 99 73 37
5166 37 125 259 -74 19 -111 112 -118 -13 19 -29 168 -261 -43 110 100 47 19 20 -127 121 232 125 -280
5189 -280 34 -136 148 80 38 -97 -22 70 133 206 -65 3 242 80 -69 -52 -286 66 60 -156 207 -86 -251
5212b51M84j19k49r7K76J32j31o8K5n4mR3R2j81J1l8J27j34Kr2L64m41L07l6Q7
5237A05m30K76K04k01M6k31L01M9j85J00o2%m3QJ87j37K1k39L57p%j30J04l89
5261b96K84K72j66k08J3M21l46MK3kj62Q9j62K33O8J27L02n07j0k30J74J47k16
5284a48N9K51k96l2Q9R0j26K60j66j19l5MQ0J16l06J52K04j54Oj13M80l39R5j65
5308a13J23N5%K73l03j90K88k30J48j3K98m9n36M12K15m06l03N15n09M31j61K78
5330B23k1k13j82l6K02j77L58j95j42j2K36R0j88k25J77J05J37l10J98J14k12
5351g3L1K46k14q5l2JK09l26L44j15j8Q4l8m4n7J65K31k76l22K58R4L7k64J27
5375c7J74m05M87k27L2ok17K64O5P2k10L9q4r6K60N9o7k95K26O8l8l5j47K8q5
$$ plain form
5212 -251 233 114 -135 -232 44 176 45 -23 2 -52 -56 37 129 -52 -41 -79 48 -86 -84 -176 188 -253 54 18 105
5237 105 -325 -49 155 -46 0 -231 70 119 -66 34 -28 -28 -71 -63 124 -13 8 -231 126 119 119 -11 93 -296
5261 -296 -12 260 94 -114 -101 320 -26 -22 1 -1 -163 -74 -236 -3 65 192 494 -13 -23 -253 -79 68 -148
5284 -148 -89 162 -134 -166 -77 13 -113 147 -19 -138 -173 -169 -89 27 -279 -127 77 -77 -71 -184 296 -43 52 -113
5308 -113 10 65 65 338 35 -155 133 -97 51 38 336 287 -249 163 378 -28 -331 184 -325 106 -55 223
5330 223 202 -11 -193 -229 -27 -204 154 -41 -183 -195 41 131 -57 -282 -105 0 137 -173 25 139 -73
5351 -73 -42 204 -10 -95 -127 -126 83 -243 101 -14 -32 52 14 -30 -87 78 309 33 -289 -31 63 100 -164 -37
5375 -37 137 -268 219 -8 24 18 -199 65 130 202 -8 31 -53 -149 111 170 103 -192 34 102 64 29 -118 -90 -175
5400a75L39k2j25j21k1L89j80k08J36q6R3j15nK52K8k14l5j9K58J19l73P9j95
5423b01oK58%J05j71N6J91m32J6L59jn57J84L71j72K2J1M7k70J81o4J56k0k18
5447a55K04K38l50P1j45L0o1R2J49j43L16j96Q4k21l5MQ1k67J93J38p0K7J3J37
5471A34j23J8k39N04k89l4m8N8M6k8J25n8j04j3K0L4k96N30o4j45M5q0qLj72J84
5497@J53l14K32j88L28j61K6k41J79j38J84l2p6K7Q5J57L7q5p4K64m09J03o0k0
5521b3J51o1rj63n1K22L2n0k6L4J79k65J34R6k15J06l82L91l25O7L63m14K72j90
5545a27J00J71j71j24K98j72k05K23P0j64M0K71j42j76P3q6L2R1j12L13J0k08
5567Ek56K04j17K62k45L70l78L76j19p2jk55J02N0M7J40Mn1l4K14j13Q5k98rJ25
$$ plain form
5400 -175 164 142 17 -104 -125 264 84 -124 12 -74 19 -96 -101 151 179 -35 -70 -89 169 288 -85 -6 -201
5423 -201 -207 51 51 156 -15 41 232 -200 -184 175 174 -383 -199 172 0 22 33 80 -190 -9 -73 83 63 -155
5447 -155 49 287 -63 8 -137 -107 -168 -76 73 -70 246 50 134 -87 -122 -118 -37 -304 -111 27 -43 -16 -3 134
5471 134 11 29 -210 294 5 -29 -77 -19 27 -1 124 66 -38 -51 -31 3 -293 237 173 28 73 -7 -15 -12 -184 0
5497 0 153 -161 71 -117 211 50 76 -165 14 -124 60 28 -48 -21 64 221 258 173 99 363 -46 57 -3 -23
5521 -23 128 67 58 -105 -156 66 98 48 22 56 235 -30 104 200 -15 91 -291 100 -225 -158 205 -209 63 -127
5545 -127 -27 144 -27 -151 147 -25 -230 -7 63 -101 -61 210 68 -108 -35 -121 -89 2 -110 203 213 5
5567 5 -251 -47 -164 98 -147 223 -155 221 102 30 29 -226 -124 -74 -27 113 117 66 32 246 133 218 -80 -89 36
5592C6j46J6J42q2M08l31J27l35K13j08O9K32k63k8J10J99j53j11NJ0Jn5M7j05
5616a02K67l87R4R7R8k18K10R3k94K64p8K32l10j61J82K31m62K13M1O1j98L5P4
5639a8J3oJ85o1j3n9j24K73K8j22j24j26K31m8J07k50K67L3k47O1J32l53J50P2
5663AK0J9K50o07N12p8J36n04J65O4k7j8k6K03j39Q5l33M25l4j19o7P2J73j09
5687F4m00M36k1k05Q0kj87K3J70q1J26O2j94J62q9j53O2p7L46j46l2j20M23j76
5711G1J27k01Mk12P3N51k70n9oO6q9j79L18k68J19k02J26K85l55l8J09R4l4Q3
5735A13k58r0K19O7R2j40j2L7L4L7k48J06J54k3K9l17P4K77k06j22O6J45K9Ml28
5760b61L34l51L38k10J7J43m9j14Qj0J44Jj51L86j04L4o4j02j42L3L27P4k38l7
$$ plain form
5592 36 -110 -94 48 -34 374 43 170 -165 48 -60 9 241 -22 -50 60 259 106 -5 0 10 11 -44 3 -102
5616 -102 165 -222 -128 -31 67 -151 59 152 -142 122 44 276 -34 -195 -13 218 -244 -31 10 71 -127 -92 -18
5639 -18 -5 -11 174 113 100 41 -83 190 218 96 -28 -154 77 29 136 -114 153 186 -61 0 132 -221 -71 1
5663 1 21 40 290 -317 195 117 253 -251 -86 -22 -49 -67 -93 110 -29 56 -277 148 114 -5 -72 0 173 64
5687 64 -336 100 79 -126 -46 -48 -235 -212 -42 -123 3 65 -129 33 -56 -209 -147 -224 122 -24 -56 -176 247 71
5711 71 198 -3 1 -211 -138 413 143 84 78 144 55 -124 194 -74 45 -157 -31 254 -101 -139 -30 64 30 113
5735 113 -145 -235 -16 51 143 3 -9 28 62 99 -149 -43 111 88 117 -200 -126 151 -55 -177 -111 34 63 67 -261
5760 -261 73 -278 60 -150 -133 10 -39 -153 -145 -155 -11 -10 -161 225 121 155 91 -11 -153 -120 207 281 43 6
5784Fj0o6n7qJ54j83K45j50k9L99n74J00Q7O9K18m17J24O8Q7k0j64M6J08J2j82
5809a37K49q7K3j85R5J9M03k82j53k0O1M2K7m2On3J42Q6j77k01K64k6j46J52R4
5834A54l74J69J93M1k26j4L25k64L43j35r2j21l8k70M73M0l27m5J66l3O3K17k36
5857IJ5k75K40L0j31J92M7n7r3P3J1o8O5K8K59l27j79M7J98m8j38J55p8o1J85
5882I9j20P8l92N89p3l84J09m7J28m6j00J60J0j65J81k06K19P5j76J98m6q3j2
5905dm4J76j9j45M4j03K2J05ll7K0j68N7N8K60j40p3N4J12j91m2J63j10J45j61
5930b4K04k16J11j3k2m7j37J46p7J9Q5j66L71j79j64L73j30r7J52j58j82L23n1
5953A21l31R2K05r6L53l21K9k69K63n7r7k7R6N8k70M0K62j32P0j56K84kRk00l5
$$ plain form
5784 6 -4 -70 -127 -135 19 -164 81 -69 -98 301 -273 -173 -86 -17 201 -216 -92 -24 63 43 -121 -75 33 45 -137
5809 -137 112 25 48 -137 -42 -23 380 98 -55 -75 -14 28 55 13 19 -34 108 194 17 -184 80 54 -92 60 154
5834 154 -220 -51 142 183 -43 -57 268 4 347 212 120 -1 -39 -309 164 204 -123 -168 -2 -35 28 245 9
5857 9 24 -251 -11 19 -112 80 127 70 -23 50 61 -7 58 86 345 18 -161 -114 84 36 -102 53 -25 -86 99
5882 99 -21 57 -335 254 181 -203 -94 -141 -13 -59 -159 1 11 -154 27 -179 40 115 -61 137 91 8 -4
5905 -4 -48 128 109 -36 8 -95 -73 32 29 -8 12 -156 -99 -41 219 79 6 60 172 -19 -61 102 -8 137 -24
5930 -24 180 -36 75 62 40 -7 -144 2 -75 -56 29 -137 234 55 -109 264 134 37 189 31 -151 172 121
5953 121 -210 -118 87 -9 344 23 52 -217 46 -11 -108 -135 -39 19 -251 -211 51 -81 -11 -167 117 115 124 -76 -111
5978a11K92m54K64J28k25K11p9P0j71J87k43K33kl47J99j30L15j83j65L14j0k72
6000a79J33l0j5Q0R4r4k67M86J22m85L11N5l76L62k87R8O0J0j8J76j70j41J86
6023A11k69M21n00L27j07Q5l20L04n7j77k0K70j03l8J34L2k8l01L60j30j60K43
6045G7k17K89j78k30N49k48o4O3J90j89Pl00K42k7k12L96j00J34j95J15j34j67
6067a99L08J48k20J05j27j1J31j18j05K23Q0k08j39J50j09k05N62j34k54k4L91
6088B45l57m8L63k52L76m71M2L03P6l46K9J86P1k02PO4k4R5j3l14K73O2Q3m18
6112a70M4J56N1k53R3P7M9n7K79j53j92K52k33L17m77K91K31j54j31k43M11m07
6134b19L38j8l6Q8k36M2p1M2j92L47R6p2m0j75Q7m5J72N9J2k50P0K28l8j24n8
$$ plain form
5978 -111 181 -273 -9 119 -106 105 26 96 -75 112 -131 102 100 -247 -48 -178 137 -46 -211 103 93 -179
6000 -179 -46 -76 -91 -11 83 -11 -278 208 330 -155 156 211 -165 197 -90 8 68 78 60 236 66 -75 111
6023 111 -158 263 -237 90 -17 68 -252 52 -5 -182 -202 68 -35 -73 61 93 65 -236 124 -6 -166 77
6045 77 -140 149 -29 -259 290 42 -22 41 231 42 49 -251 -9 -36 -248 148 48 182 -13 102 -32 -199
6067 -199 109 257 37 142 15 4 135 17 -88 135 215 7 -132 18 -91 -296 266 132 -122 -146 245
6088 245 -112 -160 203 -49 327 -144 -102 201 277 -69 -40 146 217 15 22 86 62 157 144 -170 103 165 248 -170
6112 -170 -126 30 81 -172 -79 -2 47 -10 269 116 -76 176 -57 260 -217 74 305 151 20 -223 188 -219
6134 -219 119 101 65 153 -83 -41 -112 -70 -262 85 181 109 69 -106 -19 -64 108 167 179 -71 -1 227 189 65 7
6159Gj71KQ3J89k98K40j41N6K72k39k2K81l6l45Q3j16L64j22j46J2P3L55m28J24
6183G7k11OK26m1P8r2l3n35P26k82k5j63K81L36m41J74k7K2J52j68J13j75J89
6206A87j35j1o2L2j6L0l63K82N9r8N8k9K84l62J49j47J12K91m6k37J24j35k7N0
6230a0j4J2J78j42Q3k53K66j96rK24Q3K0m24K85Qj73J86m5n06K57J58K03k0k06
6254c5J39k10J53J39l28K50r9j66M0J90J3k71j41R8J11J67j74j7K72J1K0j83k13
6277b34J51j39J86k04K35o8J44K8l93L34j51J40oJ30j22j31j61NJ47L30k67k03
6299b49K33j01K94o0m4k7ln1k6j8o0j6j1J65nJ98l92J95J39j15Oj84J63j32K44
6324A43j89Mk51J09K25j59Q2J70j01j46N9p7j18J78j15L00j49J27K6k42O1L7J1
$$ plain form
6159 7 -164 -162 -79 110 -188 52 -89 -33 239 0 -22 259 223 -122 -39 -155 209 87 -59 -47 26 381 -47 77
6183 77 -134 -128 98 57 135 43 10 -525 201 -81 -106 -269 12 348 -93 81 54 76 228 60 173 -2 187
6206 187 52 41 -21 11 -5 25 -338 -56 3 -95 -37 -66 218 -144 5 -142 -30 261 215 -22 102 -33 -60 -10
6230 -10 -24 -12 166 24 107 -146 120 -76 -85 139 222 242 -182 103 111 -62 124 79 -427 -170 -12 191 171 -35
6254 -35 104 -106 47 186 -142 108 9 -157 -117 73 86 -185 -326 -228 -117 50 -124 -141 131 142 162 -21 -234
6277 -234 -83 -222 -36 -240 -5 -73 71 99 -294 40 -111 29 23 153 31 -100 -261 -256 -109 221 -46 -249
6299 -249 -16 -117 177 117 73 46 43 -8 -34 -52 -112 -128 -139 26 21 219 -173 22 161 46 52 -132 31 -101 143
6324 143 -46 -42 -293 -184 41 -118 -36 134 33 -113 -54 -131 -249 -71 -186 114 -35 92 118 -124 -63 -26 -15
6347a5m5j36J67J09j00n2n3Q6K16l1R3o3p5J4j39J43j53NJ42j22J57k29P1k0P6
6372D6J17k03J88j76J52J91l27m2Q5Q7L3j89J7m8O6qm2Q9l6J34k22l2q1K05k58
6397b54M35l79K54Q0J14N4j95k59K3jK35J18m0k77M6J28J56k23J17j26J2j15k9
6420a26J53k11M8R4J1J26k55M3J15k22o3K06M3L16l01%p1J43J01R3k63M0l0K02
6444A92o6l12j8L46l19K46Q6j32r4L7p4k24M11k78M08j16j52J03k60K8L12k74
6466a50L72l24M7L22n8p4j72L3K30n28O56j83k05l2j00m0L74l23J51j28J82L84
6488D34n09K68k08k25o7K07rL18k36j49P2RM34l36L0N0k50L80L4k39N1O5j63o5
6512a04K22k32J82R9n0J41m11J3N2K46j61K48k19q8l0L80m71J74J29J53j73j87
$$ plain form
6347 -15 -60 -196 -29 80 -20 -72 -125 -39 177 146 239 176 101 115 -24 119 -34 -29 113 -9 148 -81 -10 -30 46
6372 46 163 -40 148 -28 124 315 -12 -54 31 118 151 -38 -21 -69 -3 -11 -53 36 0 134 -88 -120 -201 4 -254
6397 -254 181 -198 56 136 250 304 109 -150 -127 -128 107 225 185 -92 -46 82 238 15 132 6 18 -97 -126
6420 -126 27 -184 -136 -42 -31 95 -160 -117 -2 -224 -287 -81 -38 278 -23 -23 -94 49 150 243 -20 20 -10 192
6444 192 126 -186 -204 142 -177 69 155 23 -71 -34 -108 -332 79 -199 209 93 -59 44 -216 -188 124 -150
6466 -150 222 -102 -55 267 209 135 -37 -4 226 -302 354 171 -34 -66 -166 -206 168 -155 -4 -132 50 434
6488 434 -75 193 -15 -240 -307 -100 -109 209 -27 -176 -104 -95 339 3 33 83 -167 213 247 8 59 124 -39 -104
6512 -104 118 -114 68 167 117 258 -153 -140 -88 158 -3 245 26 -62 -92 288 -183 -9 120 273 100 -87
6534h7K45j23N0m5J47n13J36J35L4j45K36J8j15N2m2m4K11k47n7L72j92j44J26
6557Hk2R8j42O3P9j44p0J67j34k5J84j09j1l9J31L1k33K77l6j6k69K14k2l8J28
6582G0j2J84o9l04j20K37J54j52j6k9j41J65J59k4k99M3J60q9P9O2K22k35K00
6605B45k05j96K90j85J8p3J45l7j45O7j21p8j9L60o5q2R0n4k37L45l6l35K67K44
6629B03r2r0Q6k33M0o9L3K39n0j31O4J50k5n8R8l02K8q4K15O8j7k19K21j61L68
6654B82k88K13l80J91J4j55K38k74P7K69n4j81m7j43K53k8K85l71K05j53J26k00
6676a21J46k06J99P8l6M8o9k0q5j49L42N0k21Q8j82J62j74J16j08J34J08k59K24
6699F5Q8N0k71o3L65j73l0l02L59j63J09K14m22K12J58rk91nK95j1j91r5K30q7
$$ plain form
6534 -87 158 35 85 40 187 -326 -190 -55 -21 -166 70 88 -27 25 -17 -61 150 -97 -154 218 26 -118 8
6557 8 -14 84 -58 5 84 -60 -130 37 -97 -122 62 -47 -58 -97 34 65 -168 109 73 57 -212 2 -20 -58 70
6582 70 58 242 173 -131 -251 -14 140 -12 -28 -57 -198 -33 126 102 -197 -154 6 -83 -4 58 280 45 245
6605 245 40 -156 134 -51 -33 -106 39 2 -143 -76 -197 -275 -294 66 1 -81 9 -45 -282 63 27 -308 -41 203
6629 203 111 21 107 -126 -86 -155 -122 117 67 -64 0 150 125 67 165 -137 -109 -193 22 90 73 -146 75 -86 282
6654 282 -6 207 -173 18 32 -123 115 -159 -82 187 133 -48 -95 -238 15 -13 272 -99 106 -47 79 -121
6676 -121 25 -181 18 96 60 108 39 19 -66 -215 127 177 -44 44 -138 24 -150 -34 -142 -8 100 -159 65
6699 65 153 203 -68 -131 234 61 31 -271 88 -75 34 248 -174 38 196 187 -104 -109 186 175 -16 -111 119 32
6723C2j71L62k42j60K78k10R2%k49M44n4ok53K42l11L34K6j69p7P7k17K03J05
6746G6k24j08L01ko7J42j37P5J39k59j91J46J25O3j84r9L06j68o7L50pk65o8J69
6770D6Mj82J78k04J32J46m0j0qR7k45N1r4L12j82r4J21o1m8K35l03R7J19j21o5
6795a19R6k77K69J7J77l81K32L78m04K38k71p7Q2Q5l55L2K56J80j59j38K8N8J5
6818c8q3J53p4L9O0j26l09M10M7j64J54l6r0J31q3j31K74m42O7L76R0k91K03J18
6842B55l29j2j19k1K90J00J27n6k10o2L3j90K35k71L08K10n33L28j41p4Rj36J91
6865f8k4j82L57j78K36k01N2N0l8k23J84m6K49j69M3n8J7n7N8L7j73PPK60j62
6890b2k6j64J98rj87K85j73l8M70k41o2R8j04r5M6n1O0Q7N7m63J03J75N9p2On7
$$ plain form
6723 32 -139 223 -19 -179 99 -111 -19 -19 -268 176 122 116 -137 105 -206 128 154 -15 -92 -15 -232 -29 76
6746 76 -148 -256 45 43 -24 118 -19 56 195 -64 -255 -109 16 79 -105 -204 102 -66 -133 217 210 -55 -123 46
6770 46 50 -132 46 -158 -26 120 80 70 62 159 -86 -35 -129 183 1 -93 28 -33 -81 154 -149 -52 67 -54 -119
6795 -119 -23 -300 -31 -14 163 -218 14 392 -12 226 -45 -122 -40 45 -310 -278 -22 158 -1 -139 -111 -53 -38
6818 -38 -121 32 -42 -3 57 -69 -378 32 79 -85 69 33 -57 74 -9 -140 134 -308 -241 135 225 -66 137 255
6842 255 -74 -86 -205 -226 64 164 291 235 25 -37 -4 -194 41 -230 78 288 -245 83 -58 -132 -123 -259 -68
6865 -68 -92 -274 83 -95 141 -60 -8 42 4 -219 -35 -81 168 -1 42 -16 1 -56 2 39 -134 -127 -120 140 -22
6890 -22 -48 -212 -14 -23 -210 75 -98 -136 334 93 31 129 25 -70 -24 -75 -15 72 129 -334 -231 -56 3 -69 -63 -120
6916a20k16K72r0k3J11K2j09j57M81j4k89N6OJ23l3j4o8M6k74M25Nk84J95R5j20
6941B6J0k4j43K98l28N23k25m66L28K7q0L0N5j49J40q3r7J56K9J73j86J20l24
6964a90K27q4K24k98K78r0j31Q3M8l54L65k53J51n9J13K58o2Pm87K64N0m7m7j48
6988a82K31j65O6M7o2L1j66K68J38p2j86Q8J14j81K49j80l37K52J89P6j92k03
7010a77L21j66J4o4J29k6r9l8K6q0M8j07M4k0K45j89P1Q3j93o9J83j4J83j68K76
7035B13nq9k01P5J55k11J70j46K0k13l3L41j4l4J22n1k96K63m6l1O1J35j99k32
7059b46K88J50o8k90K20K0j8j50L01k18q5m0n4J21o4J77o3r7N8k6N1L31k13J01
7083A86l37K0k5K08j94K55mj15J50K95m56J09ok17K20o7m2q3q7K01J21k88K83
$$ plain form
6916 -120 -336 -64 -154 -177 -66 -44 -153 -310 171 157 -132 -76 -70 53 20 6 -62 -16 -290 135 140 -144 51 146 26
6941 26 36 12 -131 167 -161 362 137 -329 -1 26 -54 -24 31 -118 22 -61 -158 -2 27 200 14 134 -190
6964 -190 37 -47 177 -121 157 67 -64 19 67 -287 78 -175 -24 -83 30 288 226 233 -254 10 60 13 -34 -182
6988 -182 49 -116 -50 -3 -65 -34 -200 68 206 134 -52 36 150 -31 218 38 -299 -47 142 218 26 -177
7010 -177 144 -22 -8 -72 57 31 -68 -106 -80 -160 -112 -219 -175 -195 50 -139 -68 15 -178 -247 -64 -78 105 -63 213
7035 213 208 119 -82 -7 148 -63 107 -39 -19 -232 -265 76 62 28 150 99 -197 66 20 -11 50 185 -14 -246
7059 -246 42 192 124 -166 54 74 56 -94 207 -11 -96 -136 -190 -69 -133 44 -19 -116 -58 -84 -33 298 85 186
7083 186 -151 -131 -156 52 -142 113 109 -6 144 439 -17 92 86 -131 89 22 -20 -103 -190 11 132 -156 127
7106A27q2J4J00j0q6k27Q6L39l25P6J06l09L04J26l72L1Q0J83J5j06j27K8r9J23
7130ej39R5j74N42l73L4J33k86K55o7M6k72N7J65l1K33k32j45K17k3k07J58K72
7153B53n16M39m20L50k50L9Q7K28j87j39L8j62K82J50k27j02QJ37J30k39J71j28
7175e8L9M00l91j99L04j80L63k82j50m4J01l3J70j3Q7l49K72k81L39M9j0k6j69
7198f1K68k79j11J75k48K7K80R0k22K42m03K43K45j80K7k82M1J57k6J33k71l7
7220a92O1k2K07Kp9k54L79l8o5k17P6K47J26l74L90j94R2r7m9k81L45k04R2N0
7244Aj95K96o8J38l25K14o1m0J97k83K07J65l62N9k0J89r8k3K2J34l6n4j80o4
7268a87J32J63l07K15N1J4j94K83k52K8j00M05j81P0k41M6J97O0k01k5J38l55
$$ plain form
7106 127 45 59 159 149 63 -164 -78 261 -64 12 118 -191 113 239 -133 -102 -22 161 176 70 -57 -29 -128 -5
7130 -5 -144 -49 -223 319 -54 -20 113 -173 82 15 61 -211 -154 11 -20 213 -19 -164 53 30 -177 -19 253
7153 253 -263 176 -244 106 -144 -105 -18 210 23 -116 -78 -240 42 192 -35 -137 -129 8 138 -101 70 -58
7175 -58 -19 381 -10 -209 95 -85 278 -4 -154 -198 -97 -130 40 27 114 -235 37 -244 95 144 134 108 -61
7198 -61 207 -72 -183 -8 -256 -229 51 141 -81 161 -242 1 246 66 93 -189 -148 9 -17 116 -155 -192
7220 -192 -131 -153 54 56 -23 -277 102 64 -1 -218 -142 105 231 -143 247 53 145 48 -1 -282 63 -141 -49 1
7244 1 -194 102 34 172 -153 61 0 -40 157 -126 81 246 -116 -57 -77 112 14 -9 13 147 111 57 -123 -187
7268 -187 -55 108 -199 16 67 81 -113 170 -82 -54 -154 251 70 140 -101 -55 142 202 1 -24 114 -241
7290b41L48o8m79O75m43K10r5P6j98N5L30l13J2J11K16k24K29k52JL6K23p9j48
7313a8m0n8k3K22j48m4j08J77j86K72J19j29j30J44n3q1J41q4r2K49l65J65J39
7336F9O2k43J53J05j14k41R1R5K38j11Jq9r9K55R7m61M05k59J04j88J86k85L22
7359I3P0j06j44n1M38k22l14K12O2PJ61m4m5R5l42L9p2J89Q5k71M40m16J51k57
7383b42Q6P6N3n5J74k70j61L39n8K29k89j59K82q4J84q8k56L46l77J09M3K59k16
7406g5K93j67r2K75l06J40m5R6j76Q6o7MJ81m7l45J0L64j21o8R9J52q0m4J49m67
7431b51n7J50K38L27m12j47K65r3N5p5K52j60j79K4%M1K6o1K91l11J67m01M08
7454I7p3j3O2L4n0l85M23j53J50j34L4J09j19r5L11l10J38Q3k44J74j28Om3P0
$$ plain form
7290 -241 107 39 -440 235 -208 2 -93 -17 -215 -160 170 -143 -131 -20 196 -28 201 -51 -50 -14 209 130 -18
7313 -18 -58 -116 -139 83 -65 -109 -217 -40 -226 46 165 36 -94 50 -3 -84 57 -27 -119 130 -235 -70 69
7336 69 131 -112 41 146 32 -209 -118 -23 215 104 105 16 -83 172 269 -192 213 -46 58 -130 56 -229 93
7359 93 163 57 -87 -138 300 78 -236 -24 38 45 206 162 117 212 -130 -91 -163 26 111 -160 280 -136 15 -242
7383 -242 -156 -80 -27 -82 92 -178 -339 0 -58 171 -118 -277 5 -79 105 17 -239 107 -270 -161 -118 141 -75
7406 -75 218 51 -41 234 -72 68 23 119 -57 29 -38 -34 147 100 -245 -235 129 8 -60 39 191 111 67 216 -251
7431 -251 -308 -158 80 407 -5 -152 113 20 75 0 252 92 -87 -63 -63 -22 4 -57 234 -77 90 -311 97
7454 97 24 11 73 107 57 -328 95 -58 92 -42 -8 101 -18 -113 198 -112 26 109 -135 39 -89 -83 -126 -56
7478e6K04k79K37o2n1k8Q1L5j91L2o0J37J39o9k33m2J68K4R2o0J91l64R2j84Q8
7503a59K61k75K79j03J2K7j85M05k79Qj57K45J02k62%K02j51J86k18J07K40k79
7525Fk48K75j91P9J02j99M6K04m8j63N3kJ07k5J91m64L00l5j71L53j43J17l03
7548a59J3K22j56L03j65K5R3j06m84M68L4m5m25L45j20o0L32j47J26j53N9R0J34
7571B24m92K59kJ61j65M36l62k8J02j49p7q8m8J39m9L0%K06j14p5J07k95L96j70
7595e4J35nO2P5K9m14K47k42J38m3J25k57J96j29J77K08k34NK38j99l2q3M1Lj53
7620a66J55Mr0L5J53j39J61j58J1k47L22m1O5q6L4p2J95k46K5J63L6K2k28L28
7644B36j4l02N2J36l9M8j5k66J3L02j78K2j98J13J03L3Qj19J14J37l88J94o1Q7
$$ plain form
7478 -56 148 -131 106 44 -7 -35 46 81 -110 -78 -138 -1 138 69 -164 -206 -38 -14 78 18 209 -155 -63 -247 -159
7503 -159 102 -173 106 3 15 42 -143 262 -17 -9 -166 79 181 -81 -81 121 -30 156 -62 45 285 6
7525 6 -242 33 -158 -79 23 -176 -130 74 26 -137 -84 -86 21 -4 187 -277 23 -12 -183 170 27 144 -159
7548 -159 -146 76 -80 223 58 83 176 70 -414 54 88 43 -382 -37 -157 -217 115 -32 94 -59 0 90 224
7571 224 -268 -9 -11 150 -15 421 59 31 133 -16 -93 -181 -229 -90 -139 -109 -109 97 -17 -92 15 -280 116 -54
7595 -54 81 76 138 213 242 -172 75 -167 -29 -72 53 -204 -8 -137 40 248 14 19 257 58 26 -57 -16 -13 -166
7620 -166 -11 -7 -97 -62 91 -48 113 -45 -34 -281 41 0 65 -21 13 -59 136 -110 -85 78 114 136 -92 236
7644 236 222 -80 -28 108 69 117 102 -164 -151 151 -27 -5 -203 -90 13 46 54 -65 49 186 -202 -8 -69 18
7668A8M6k35K65L5l57J56J45p1l26q5K67K48j73j8O9M8M2j90J12j42J76M3j44
7691g1L27m40L70k15K96j97lJ78k97K49n2j92J11R6k10q4P2K23j66J89N0m31j7
7714b14K38k8q6J38l09J98n0p9K50J76j87k2j92kK19l24K81N9k90P2N4K5O1Lk56
7739b65M24k29J0p7J63Q3k30L18m56L03K52k06L1j16J09k22J31n4m64M71k0o1
7761a05qr5K97J09o5n28N55k66J50N0j6n6k22L20J40l38J7L02k97j47K52O0k05
7784i6k0J19L3j62K52k18J72k86N2k3L52l2P8Q0m02L60j44j16J34Rn1k26Q8N6
7808IK11j54j74J16J2j25Q6J36m76L75KJ83j24l9Lj08p2K15r5j6j24J45p2J41
7832E5J2k23l64N22k5O4p3K82m28K90n7R0n8k56M54k46j24lL57k15J17J34l90
$$ plain form
7668 18 64 -171 94 129 -228 -72 73 2 -324 -409 -142 106 -67 -85 -16 32 74 -116 -4 -146 30 73 -71
7691 -71 256 -184 186 -29 267 70 67 245 -52 197 145 -47 64 160 -50 -134 -62 161 -5 184 234 -197 -214
7714 -214 24 -4 -90 48 -261 -63 -113 -192 58 234 47 25 -167 -169 50 -274 7 66 -224 -152 -98 -73 -12 -9 -265
7739 -265 159 -70 -60 -137 26 109 -121 197 -259 44 296 90 121 5 114 -108 23 -31 -495 -24 -44 -105
7761 -105 -113 -208 89 198 133 -395 160 -106 44 94 78 22 -200 120 260 -78 -61 241 -56 -203 49 109 -96
7784 -96 -116 3 36 -126 126 -92 80 -206 -154 -177 175 143 221 301 -101 259 115 -1 133 142 91 -135 -47 9
7808 9 220 66 -108 8 20 -105 -19 117 -359 16 18 201 77 38 41 -67 -139 76 -19 -35 -159 -14 -86 55
7832 55 67 -156 -520 2 -23 41 -32 250 -178 112 55 145 87 -169 285 39 -85 -88 269 54 171 305 -85
7855h5k12M86j36M7J45Jl42N6n0kl8J08m0J25J71k86j42J04J56k12K21J32l65
7878a58K29K1M6m1n6k27j7M14n2J1j60k00k1M4L28j29J3K02l43L79k12k77k0K83
7902E7M3k96l07P04j30k33J46q6J90k39Q6J49l9lk8M9M2k63L03k60K59o6j76p3
7926a71P2n9R5p9J3N5j82L81j03k01O4p1L68k45K40j7p6j29J46j35J64j95q0J27
7950a8j3m7K17k23J52J37j02l8q2j62J01N5j98J12l3J82l7j20l6L90m85K08J82
7973A42j46N5J07Q4l26N4qn3O1J00jJ34k44K06j22N5j64K4J32k95J52K28r1q5
7997aJ42l50j94L68k91L55j6Kp0Kk24M57l47l2J82m9K07l51M04m83J52r1L20k42
8021a50J30m0k27J51Q1j25QK64k90K33j07o6J32J2k0j52L55oj23n9j27K21j09
$$ plain form
7855 -85 -297 189 53 100 245 246 -96 -40 -90 -92 -130 -22 -62 63 234 -52 -194 -90 66 -146 75 207 -158
7878 -158 71 92 138 97 41 -186 -203 211 159 170 10 -190 -211 -167 161 32 45 247 -96 283 71 -206 -226 57
7902 57 100 -196 -503 201 71 -162 -16 -102 88 -151 -65 84 45 42 14 63 105 -158 145 -115 144 78 -98 -171
7926 -171 -99 -158 -63 -142 -129 -74 -256 125 22 -179 -115 -186 182 -63 177 160 84 -45 101 -34 130 -65 -145 -18
7950 -18 -31 -78 139 -84 68 205 103 65 -17 -179 -78 -23 -221 -109 -142 40 3 -117 -153 237 -248 -40 142
7973 142 -4 51 158 242 -84 -30 -38 -91 -30 70 69 203 -41 165 43 98 -66 -42 90 -205 -53 175 84 -1
7997 -1 141 -209 -403 -35 -326 29 13 15 -55 -53 -277 180 -167 -199 -17 -66 141 -210 194 -289 -137 -228 92 -150
8021 -150 -20 -60 -287 -136 -55 -180 -172 92 -198 35 -72 -138 -6 6 -14 -166 189 183 60 1 -126 95 -14
8044a4O0K1n8r9L3J09r3o1K70n2P1m14Q6J05J46p1J0L5j9J59j35n1r2n1J67K6
8070H8oJ83m14L4j35K04lN9L1m5M4m7j47J79P3O3Q6q0j15j8J71k57K62q6k11J4
8096g3J12j71K45l6J17j45j3NK69j74k03k2J77l85L42J47l33J85k39K66j24k2
8118g5L44j24j18j43N9K94k58K02j66k74K06R9m4k28M06m07L62l45K44j12l7K82
8140A67m49M43n7j57m1J18mj01J17j60K19j40p8p0K32q4N7K94l28J05J5Lk47j24
8164b70K97K1J82j56k93J49J33j36J95j32K9n7Q1q4P2M5Q9Rj59m52M03K00l43
8187a77J43M9J5j50
$$ plain form
8044 -14 46 67 9 -90 -57 52 -41 -102 168 116 187 -227 -141 -36 110 39 49 84 65 224 89 38 -54 -105 62 88
8070 88 82 265 -149 -115 -250 -46 -49 10 41 -4 40 -7 -154 25 98 161 247 167 52 34 205 -52 210 124 -87 -73
8096 -73 39 -132 113 77 194 49 36 41 310 136 -67 -89 88 -297 45 192 -141 44 -195 71 -53 -75
8118 -75 269 145 27 -116 -57 237 -21 181 15 -259 -53 46 2 -226 180 -227 135 -210 34 -78 -115 167
8140 167 -282 161 104 -53 -94 24 20 -81 36 -124 95 -45 -123 -193 39 -45 12 306 -22 83 98 101 -146 -270
8164 -270 27 48 230 74 -219 -70 63 -73 122 -10 19 -38 43 -41 31 76 165 174 15 -437 -34 166 -177
8187 -177 -34 15 30 -120
8191a20
$$ Imaginary data points
##PAGE= N=2
##DATA TABLE= (X++(I..I)), XYDATA
0@%%%%%%%%Qj6J6j6J6k4L2m0M8n6P2q8J04j20J42j66J92k24K57k94L37l85M36
31B31m92N55o26P04p88Q80r80J090j208J338j480J633j803J987k184K403k647
48a387K911l200L520l874M268m712N214n786O444p209Q112r193J0511j2157J4268
63G730j7066K0939k6609L5603n1753Q8354k85103q5444O38752m64361L35591m59010
75b62377K85611K08626m63736L52911k00781J79216j81608N5925J83341k97504
85a40376J79680j26711K67935k54980n9010K97707k47000J73928k04427J66301
95E3047r747j38792J97373j61355J24884j98066K23972j8634k18138K11954j42010
106g5512K57770l21881Q1856K17613k81514K34002k58141K53618q7604j54589
$$ plain form
0 0 0 0 0 0 0 0 0 0 8 -8 8 -8 8 -16 16 -24 24 -32 40 -48 56 -64 78 -88 104 -120 137 -157 180 -205 231
31 231 -261 294 -332 372 -416 464 -516 574 -634 704 -776 857 -946 1041 -1143 1260 -1387
48 -1387 1524 -1676 1844 -2030 2238 -2474 2740 -3046 3398 -3811 4301 -4892 5619 -6538 7730
63 7730 -9336 11603 -15006 20597 -31156 57198 -227905 -313349 325403 -138958 196633 -262377
75 -262377 23234 231860 -231876 121035 -79746 99470 -82138 -26213 157128 -140376
85 -140376 39304 -87407 180528 -74452 -133462 164245 -82755 91173 -113254 53047
95 53047 43300 -95492 101881 -59474 65410 -132656 91316 72682 -145456 66498 -75512
106 -75512 182258 -139623 -57767 159846 -121668 112334 -145807 107811 20207 -134382
116a34382K78873k47495K04690k32496J80485O2500k90791L12938k43338K20391
126A11375j36335p9357K75400l20230K45210j29858J0846Q3044j59601K10204
136A10698j66817M9744J401L7433r573j11906J66355j11650P8419j00698M5739
147a0855J00777j90720J50623q1982P1953m9558n0994J51693j41060P7636p7580
158e0067J02565k6885j22644J79107j29611J03351j07469K3991J33412k05036
168i9286J50546p8112M3832R322r4346J44961j22689N9256k2128J1975K0222r0310
180f6757J29225q6137K8143j5635l468P5171j19076Q0922k0737k685R085l6501
192b8450O3692n7217K1851j273J9756k5196k4810P3479n2034J8648l4984L8978
$$ plain form
116 -134382 144491 -103004 101686 -130810 49675 112175 -178616 134322 -109016 111375
126 111375 -24960 -104317 171083 -149147 96063 -33795 -22949 60095 -99506 110698
136 110698 -56119 -6375 -4974 32459 22886 -89020 77335 -34315 44104 -56594 -10855
147 -10855 89922 -100798 49825 -32157 39796 -9762 -60756 90937 -50123 27513 -50067
158 -50067 52498 25613 -97031 82076 -47535 55816 -51653 -27662 105750 -99286
168 -99286 51260 -26852 16980 26302 -68044 76917 -45772 13484 -8644 3331 23553 -66757
180 -66757 62468 -23669 4474 -11161 -14629 60542 -58534 22388 1651 -1034 8051 -28450
192 -28450 35242 -21975 -124 -1397 18359 -6837 -31647 41832 -10202 8446 -26538 12440
204A2440K5207q3300O0536k5406K8637k2951k2237O2281n7119K5734n229J0756
216I349p445k6785N3770l5267P335j7829K0448K2601n8030L9908j0335P816J035
229F571k5011L5361k1551L780R977j1047k146J605R274p120k493o598J7000q03
243F799j5856Q036K140O370p757l057M6O639Rq761N709q164J3823m961o596Q879
259C298p754J0328o150K328p73o697J1176m251k152q397J1489P738j4214n522
273i553R243J4575j7966q01N675N627m850j4175K2356j2100n327Q959J4J368j7225
288a4180J8915L640j0412o169Q055J8782k8910O405M359J789L212j9664K3952
301I774j1297m192J1596o826M551j0946J4557j417r811Q59K479J0528j9042P163
$$ plain form
204 12440 37647 -45653 14883 -10523 18114 -4837 -27074 35207 -21912 3822 -1407 9349
216 9349 1904 -24881 28889 -6378 957 -16872 3576 26177 -31853 8055 -2280 5536 6571
229 6571 -18440 16921 -4630 -850 9127 -1920 -4066 -2461 6813 -307 -2800 -9398 7602 6799
243 6799 -9057 -1021 1119 7489 -268 -3325 -3279 3360 3369 -5392 317 -7847 5976 1015 -5581 3298
259 3298 -4456 5872 -278 2050 1277 -5420 5756 1505 -647 -9044 2445 10183 -4031 -9553
273 -9553 -310 14265 -3701 -4502 1173 6800 1950 -12225 10131 -1969 -7296 1663 1677 3045 -14180
288 -14180 4735 8375 -2037 -8206 -151 18631 -10279 -3874 485 2274 5486 -14178 9774
301 9774 -1523 -5715 5881 -945 3606 -7340 7217 5800 -4011 -3152 -673 9855 -9187 -2024
315b024L900l052M695r416R669p054M216N794q993K58j234J2004j1589n218J0829
330B785o64j312p623R755K28o700N510K722l299r529J4762n3j3761K036O752Q848
346A0457j8047j711J9187p485p645L495Q502m146j0439J0057M697j2622j622J2192
360D870K383j7307L037J8011q177r229J298J5052k878k0307J6614L897q881m351
374e968N710J1008k0378M464J3563m469j0386j007K3536j4081j4089J1340J0549
387I792o223j9959J8904O216j1955n415R430J1665k4020Q781J3112q072r380Q94
401f230K1957j5899j3555J3133J5285j6075j4858K3007k453j25j5220J3588J3832
414A6387l4533K4515j416n756l060p745L4286l0544n476J6257O460m032k7161
$$ plain form
315 -2024 1876 -1176 3519 -5897 3772 -3282 934 6728 -2265 -2007 -3241 8763 -2826 -8044 2785
330 2785 2121 809 -6814 2941 3169 -3531 1979 4701 1402 -8127 6635 6582 -7179 -5143 1609 10457
346 10457 -7590 -9301 9886 2401 -5244 -1749 6753 2607 -7832 2225 6922 -5700 -7322 4870
360 4870 7253 -10054 -7017 10994 2817 -6412 -5114 9938 7060 -13247 3367 7264 -1617 -5968
374 -5968 -258 10750 -9628 -5164 8399 3930 -6456 -7463 16073 1992 -12097 -757 9792
387 9792 3569 -16390 2514 8730 -3225 -8640 790 12455 -11565 -2784 10328 2256 -7124 -6230
401 -6230 15727 -172 -13727 -594 14691 -1384 -16242 6765 4312 4187 -11033 2555 16387
414 16387 -18146 6369 4953 -803 -3863 -11608 22678 -7866 -13342 2915 9375 5343 -21818
427b1818L2873l963q666l193m73K2940l4795J7652J0239j7886O296r012K7004
440A7198j7062j6158K2312L185o481j5478J5003M823q193m548M217P245j4576
453h513J2158m91o880O51M536R354j7948K633O895N902j4015k707K0651k0184
467g958R553n615P862L263k9305M2168j6250j3329J0864p707L2412m2447K435
480a4054L2753k1284K554j3091K1917Q40k3826J7578K162k234j3220J1791J0233
493A2119k3479R723M414m6l296j2554K5201q714j8249K6666j1284m483N937o007
507d052J9725k7669J86L3330k6093m912N288J4407n08l0336K2008J5483j6590
520B67j4248J1966K1668k5672p496J7660N867j0060k0446K9630M740k8324J5002
$$ plain form
427 -21818 11055 7092 -1574 -4767 -5240 17700 -17095 557 10796 -7090 -794 -9806 17198
440 17198 136 -16022 6290 9475 2994 -12484 2519 7342 -851 -5399 -1182 6063 -8513
453 -8513 3645 3154 -3726 -3075 1461 10815 -7133 -4500 2395 8297 -5718 -8425 12226 -7958
467 -7958 1595 -4020 3842 7105 -22200 19968 3718 -9611 1253 -6454 25958 -16489 -14054
480 -14054 18699 -2585 -31 -13122 8795 9635 -14191 3387 5549 3315 -9905 1886 12119
493 12119 -11360 -1637 2777 2731 -565 -13119 12082 3368 -14881 11785 501 -3982 1955 -4052
507 -4052 15673 -11996 -11810 21520 -4573 -9485 -4197 10210 9702 -20634 1374 16857 267
520 267 -13981 -2015 19653 -6019 -13515 4145 10012 -48 -20494 9136 13876 -14448 554
533E54j36Q418r041j7079L5853k2225m207J5990j7550K1185k2920J0429J2928
546A2199k7800K7094j3327K021Q90o394J9397k6128J3053j6K650j092k3348L9662
560A8861j8774q248J0300q408K6851l2220M07K7047j7501j234j948M818J1422
573A1373k0182l168L0649k3411j762J2130j0980K2612l2633J2487J8099k3594
585h380J3808j9241K4024p705j1160J4161j5438K6530k7326J3531J872j6401L1751
598B0026l8572K7608q663j1713K9820l7254K7072q850l313J0195j4234J7898j6062
611f042P360j493N273n785j0960K3805j6230P801j3968J1051J4645l0125J8928
624D260o154R182j0470j158J2308j5999J6478k0002K2516j6002o053L0601l7405
$$ plain form
533 554 418 8836 -205 -17284 18569 -3656 -7863 8127 -9423 11762 -11158 -729 12199
546 12199 -15601 11493 -1834 187 1077 -5317 14080 -12048 1005 989 3639 2547 -20801 18861
560 18861 87 -8161 2139 -6269 20582 -11638 -11231 15816 -1685 -2919 -4867 -49 11373
573 11373 -8809 -11977 18672 -4739 -6501 5629 -5351 17261 -15372 -2885 15214 -8380
585 -8380 5428 -13813 10211 2506 -8654 5507 -9931 16599 -10727 2804 4676 -11725 20026
598 20026 -18546 9062 399 -11314 18506 -18748 8324 -526 -3839 6356 -7878 10020 -6042
611 -6042 1318 -175 5098 -687 -11647 12158 -4072 3729 -10239 812 15457 -14668 4260
624 4260 -1894 7288 -3182 -4340 7968 -8031 8447 -11555 10961 -5041 -11094 19507 -17898
637a7898L2228k5584J2432J6136m3688M8690l2074R281O983j8822L0080l5888
649a8124K2546q3m649j317q958L1989l0570P383o26Q283L567l1254L4588j1635
663A140k952m196M873J5496k7490J4425q43J0435k0392K041K6499l0888J6520
676D668j4902J9527l242k6226L5500k3053J5528j4749N204J6615l2701L2271k2187
689g747J2603n087r782K9610l8969K7719j0680J819R312k7054L6380k5699Q230
702F55J920q392J6927k4614K2026j0414n6J052j984J3095k1762J7576r632R478
716E875m472j2997K5475k2877J5663j0188r24J1655j5977J8314j7752J1604l776
729c77r1P733k0084K5657k0858J2156q61j4242K3404k5931K3394j2000n249J5407
$$ plain form
637 -17898 14330 -11254 1178 17314 -26374 22316 -9758 -477 6506 -12316 17764 -18124
649 -18124 4422 4339 -310 -1627 -10585 21404 -9166 -1783 -2409 5874 9441 -21813 12775 1140
663 1140 -1812 -6008 -1135 14361 -13129 1296 453 10888 -9504 -7463 19036 -11852 4668
676 4668 -10234 9293 6051 -20175 15325 -7728 7800 -6949 -1745 14870 -17831 14440 -7747
689 -7747 4856 -231 -10013 19597 -19372 8347 -2333 -514 8798 -18256 18124 -7575 655
702 655 2575 -5817 11110 -13504 8522 -1892 -1948 -896 -2880 10215 -11547 6029 -3603 5875
716 5875 1403 -11594 13881 -8996 6667 -3521 -4445 7210 -8767 9547 -8205 3399 -377
729 -377 -468 7265 -12819 12838 -8020 4136 3275 -10967 12437 -13494 9900 -2100 -7349 8058
743H058j5736J9088k0933J1951O5n782J1074j8751J9866j5696R576J704j5363
756a0879J9022j5130J6312j2727j885J3329j3206J2432j4058J0252l666l208Q819
769E407j1680J0028j1109J4527n752q468J2406j0977J6195j7302N180P240j2592
782f897J4759j5437J0680m775p03R366j2834R384r153J3363p313o951J3060j2076
796e527J3512j3643M424O355j3319J4520r336M627m511K175P786j1278M331m249
810d133J3040j1279m019J2255r798Q606j0796P675K946j2649J3351m761J648p113
824e027M311Q593j1268L53L52J1252j1878l215J1267m697K178q594J1370r54j1593
839g550J0434j264K066j1754O276J1319j3184j341L354J0115j0620n210J2944
$$ plain form
743 8058 -7678 11410 -9523 2428 2493 -3289 7785 -10966 8900 -6796 2780 4484 -10879
756 -10879 8143 -6987 9325 -3402 -5287 8042 -5164 7268 -6790 3462 -204 -3412 5407
769 5407 -6273 3755 -7354 7173 1421 -7047 5359 -5618 10577 -6725 -1545 5695 -6897
782 -6897 7862 -7575 3105 -1670 -2373 6993 -5841 3543 -5610 7753 440 -6511 6549 -5527
796 -5527 7985 -5658 -1234 5121 -8198 6322 -3014 1613 -2898 -723 7063 -4215 116 -4133
810 -4133 8907 -2372 -6391 5864 -3934 4672 -6124 1551 4497 -8152 5199 438 2086 -5027
824 -5027 -716 7877 -3391 -3038 -2686 8566 -3312 -6527 4740 43 2221 -6373 4997 4043 -7550
839 -7550 2884 1620 3686 -8068 -1792 9527 -3657 -4998 -1644 8471 -2149 -7359 5585
852E585k922l254n474J1629j107j3383R681M029l325r161O697J0497j1512m764
866f784R428N160j2115n9Q799j993n057k919J1811m555j0288J0332L191n440n450
881e939O793P013j1118k409R771O42j0143J976Q206l798m986J408Q616n082q404
896g454J0806K250p893k076O595M292j2364J408R885m398n299R55R449n482p683
911g009R980J805n702m326Q131L650j3141L123Q200k022q507K622J1153p923n664
926e630O492N320o142p168J0229L136j0406j387J0396j134r196J985Q252j1j2671
941g935P424Q189r061j495J247Q598q796m729J1375l358l589l012J0726l216r641
956g273J0363r87k58p120N542Q323j5953N435M429J45n999k610J4479p760o815
$$ plain form
852 5585 2663 -591 -6065 5564 4457 -8926 755 4784 1459 -7702 -1005 9492 -2020 -6784
866 -6784 2644 7804 -4311 -4370 4429 2436 -2621 -5540 6271 1716 -8572 1760 4951 -489 -5939
881 -5939 854 7867 -3251 -5660 4111 4753 -5390 -3414 4792 994 -3992 -2584 6032 950 -7454
896 -7454 3352 5602 -2291 -4367 2228 6520 -5844 -4436 5449 1051 -4248 -3293 6156 674 -7009
911 -7009 2971 4776 -926 -5252 2879 6529 -6612 -3489 4711 2689 -5818 -3196 7957 34 -5630
926 -5630 862 6182 40 -7128 3101 6237 -4169 -5556 4840 3706 -5490 -3505 4747 4736 -7935
941 -7935 -511 7678 -1383 -2878 -1631 6967 -1829 -6558 4817 1459 -2130 -5142 5584 2368 -7273
956 -7273 3090 2103 1845 -5275 267 8590 -7363 -1928 2501 2646 -3353 -5963 8516 756 -6059
971f059O373N766m983q152Q630M933q453n462J1589p57o720m42M647O261j4525
986g354O383O210o333J332n037J2207r015l340R249o445N350j0064J1101j433
1000B811j0111J3399q570O298p538J899J1095j7103P709J712L34l035n174J2439
1014F165m895n000J718O615k539o974N105K856j631o843O237J342j955l209Q49
1029b159Q367j1079P289l648J007N951j3896J5378j1236M593L925j4354J8635
1042H773j5129J0069l098q047J8619j8844J1456n706J215Q622j8452J5791o174
1055i05J722j591n283J3980j1703L152k71K630J362p891P077r93q98k957L585
1070A016j043J57p97k108Q126j1147J0663o086k120J1322j6127J5318j2067M941
$$ plain form
971 -6059 314 6080 1097 -7055 1575 6508 -1945 -7407 4182 3425 -3295 -3737 910 7171 -7354
986 -7354 -971 5239 -1094 238 -4799 7408 -1607 -4947 4302 -2143 3207 -6857 4244 2811
1000 2811 -7300 6099 -2471 3827 -3711 -1812 9283 -7820 -111 1601 1935 -1100 -6274 6165
1014 6165 1270 -3730 -2012 4603 2064 -4910 195 3051 1420 -5423 814 2156 201 -3008 -2159
1029 -2159 6208 -4871 2418 -1230 -223 5728 -8168 7210 -4026 567 4492 -9862 8773
1042 8773 -6356 3713 615 -7432 11187 -7657 3799 -1907 -692 7930 -10522 5269 -905
1055 -905 817 -774 -6057 7923 -3780 -628 -899 1731 3093 -4798 2279 1286 388 -2569 1016
1070 1016 -27 130 -667 -2775 5351 -5796 4867 -1219 -3339 7983 -8144 7174 -4893 48
1084D8P205j8436J9162j3965J0055m219p827J9599j9997J3696r102L706Q294k0258
1098a2039K0692j2628N529n44q544J7562j6481P783j153p47M702r279Q554m447
1112a040K442k689J263L34k127M821p180O994n692O036k779n646J2735j1855P944
1127C561q216N887N204j6961J6550j0286R114o981m905K0160k2647J3729p073
1140b864L764O833k1611K4115j1969O11K182o958J5439j6598P824J20q86J623
1154A625n931J0887j1258O165m81j733K880q009J1791p014j822L360J609p52n819
1169d502Q225l550J465o947Q365L407j6130J3427m731N384p487m620J9526j6341
1183d509L932j076M109K247j4105J5365o549K17j621J230Q048j6707J1984j041
$$ plain form
1084 48 7253 -11183 7979 -5986 4069 -150 -7977 11622 -8375 5321 -3781 -75 8219 -12039
1098 -12039 8653 -3975 1554 1010 -7534 10028 -6453 1330 177 -570 4132 -5147 3407 -1040
1112 -1040 1402 -1287 -24 310 -1817 3004 -4176 2818 -2874 3162 383 -5263 7472 -4383 3561
1127 3561 -4655 1232 6436 -10525 6025 -4261 4853 -2128 -7033 13127 -9520 4209 -2864
1140 -2864 900 7733 -13878 10237 -1732 -1121 1061 -5897 9542 -7056 768 888 2 1625
1154 1625 -4306 6581 -4677 1488 1007 -726 2154 -5855 5936 -1078 -2900 460 2069 1317 -4502
1169 -4502 3723 173 1638 -5309 3056 6463 -9667 3760 -971 4413 -3074 -7694 11832 -4509
1183 -4509 -577 -1653 2456 4703 -9402 5963 -586 -369 -1990 -760 7288 -9419 2565 1524
1197A524j097n23n497J4525j2128R99M640k733J440n620Q278l372m201L362N176
1212D773l818p874J0555j103j532n486M093P659j2201L003L646K56m733j33Q567
1227E672o954o37O9P817o133p477J3587n928M41l844K791O846j2713O843K260
1242B640l030j733J896N338q213J225L301L189p864j712J0998o259j929k46M938
1257B539L69q273O876K473m702l349O846Q01p386J706K984M148j0659K752Q685
1272E810o729L37k866Q224l749o762R051j527k522k954O473J39p068L093K768
1287A718K064r257M903N426o495J239j665O392n368l411Q295l246k390j055O566
1302C716k860m041L274J109K403r059O995K135o332K843k341N903n337j585O772
$$ plain form
1197 1524 427 -96 -5593 8932 -3196 -2197 2443 -290 1150 -4470 3808 436 -3765 -403 4773
1212 4773 955 -6919 3636 2533 1001 -4485 -392 7267 -4934 -1931 1715 1971 -2762 -2895 5672
1227 5672 -1282 -1919 -1850 5967 -166 -7643 5944 16 457 -3387 -596 6250 -6463 380 2640
1242 2640 -390 -2123 -227 5111 -3102 -1877 1424 4613 -3251 -4963 6035 -224 -2153 -2399 2539
1257 2539 2908 -5365 1511 3984 -718 -4067 2779 3580 -3806 -2100 884 5032 -5627 -2875 5810
1272 5810 -919 -582 -3448 4776 1027 -5735 3316 1789 -733 -3687 2786 2925 -4143 -1050 1718
1287 1718 3782 -5475 -572 4854 -1641 -402 -2067 4325 -1043 -4454 3841 595 -1795 -2850 3716
1302 3716 856 -3185 89 1198 3601 -5458 1537 3672 -2660 183 -2158 3745 -1592 -3177 3595
1317C595l767j132q20O142l930k562L048O2K207q408P606J85n636M541k822N535
1333C844o355O55N595m430qp40M871l991j665L393q10O56m962O357r70l380K956
1350A016j957M309n963K171L265m397J943k061L917l279p04K876j197J381m466
1365c146O011k446j980K730k841M630n724J979L131m524K744j441K369k531J57
1380h82K325j185K75l051N220k726j943L230k642L059l328J398K153l596K429
1395G36l35j28q66N33N92l44l49j547L566k669j8J439j695K520k607J968l22j741
1413a267K438j262J077k299R90J489j657Q08j860K968j061j313K204k339K377
1428A293j280n7J252k931K315j165L61Q60k251K324k52o84P68j626J847M28k059
$$ plain form
1317 3595 -172 -1304 -2124 4018 88 -2474 574 636 2843 -5565 2041 2226 -3410 1131 -1691 3844
1333 3844 -2511 -1856 3739 -691 -699 -1439 3432 -559 -2224 1169 359 1015 -3947 2410 1440 -1940 1016
1350 1016 -941 3368 -2595 -424 2841 -1556 387 -1674 2243 -1036 -1740 1136 -61 1320 -3146
1365 -3146 2865 419 -1561 1169 -1672 2958 -2766 -787 2344 -2180 564 -877 1492 -1039 -882
1380 -882 1443 258 533 -2518 2702 -24 -1967 1263 -1379 1680 -1648 -250 1903 -1693 736
1395 736 401 273 -593 -60 532 188 -161 -1708 1858 -811 -829 610 -1085 1435 -1172 796 474 -1267
1413 -1267 1171 -91 986 -1313 -323 1166 -491 317 -1543 1425 364 -949 1255 -1084 1293
1428 1293 13 -44 1208 -1723 592 -573 -212 648 -1603 721 469 -215 553 -1073 774 1202 -857
1445h57M12N71O86j423n66J619m83k00n67J486j4j775K087l17q05J33q08K413
1463A592j825j435K833j750Q04o1j499K937k838J922L94k778K816j384J342j866
1479g96j197M523l521J134r99Q83K367n494M903j268j247J484k348M887m760o60
1495b109M062k500J620l861L676J472m984L235q48J269o73j924L444k779K05K079
1511A384k525J278m66L93J284l351K854J70k208K556k159K222k803k62M983n561
1527b211K854j809K466J545p637P142k003r5j74l475Q051o618L52L138k439L042
1543B129n774N049M58m367L067j016K757l238q32L763k258j59N14m01Q75j374
1559h07P35Q57k711L222R2k783K076j874L698l669r13N263n184K762l030L189
$$ plain form
1445 -857 -445 126 812 -611 -1177 442 -41 -241 -808 678 664 -1111 976 659 -146 -13 -821 1592
1463 1592 -233 -1668 1165 -585 219 158 -1341 1596 -1242 680 1074 -1704 1112 -272 1070 -796
1479 -796 -1993 2530 -991 143 -856 27 2394 -3100 1803 535 -712 772 -1576 3311 -1449 -2109
1495 -2109 1953 -547 1073 -2788 888 2360 -2624 611 -237 1032 359 -1565 1879 -900 -695 1384
1511 1384 -1141 137 -329 64 1348 -2003 851 1021 -1187 1369 -790 1432 -1371 -1633 3350 -2211
1527 -2211 643 -1166 1300 2845 -4792 2350 347 252 78 -3397 4654 -1964 -1612 1526 -913 2129
1543 2129 -3645 1404 1862 -2505 562 -454 2303 -935 -1767 1996 -262 -421 93 -308 567 -807
1559 -807 -72 785 -1926 1296 1388 -1395 681 -1193 2505 -1164 -2077 3186 -1998 764 -2266 923
1575I23J837p941P933k564M72r27k843Q434p326L68K150j00K028o804N919o33
1591I26j181l12n21M048m535J346J267j286j25n57K036r72p26K85J589k818J844
1608C08J308l450L325l033L401k192l024O701m868K372l029J990L899q144O009
1623A573k186K391j896l422Q071o172J889j929K085K312p365O573j699K74j079
1638e80j648O002m796L43N53Q68m78j957K131o55R22k738L861k429p09L612l628
1655a326K991l382K702O61m952N295k684K318l860J958L350o412M920l301M825
1670C103l076m492R470o905K527k486J423M455q548N495p68N96j850m75M962n071
1686a640J581r95K926j739k980N191l031Q98k109K901N15l657L680j759J719l501
$$ plain form
1575 923 2760 -5181 2752 188 660 -267 -3110 5324 -2002 -1634 516 416 2444 -4360 1559 926
1591 926 -255 -567 -1088 2960 -1575 -229 1038 -248 -373 -930 1106 134 -592 -307 1282 -1536 308
1608 308 1616 -1834 1491 -1542 1859 -333 -3357 3344 -1524 848 -2181 -191 3708 -4436 1573
1623 1573 -613 1778 -118 -3540 4531 -1641 248 -1681 404 2716 -4649 1924 225 499 -580
1638 -580 -2228 3774 -1022 -679 -126 742 264 -1693 438 -217 705 -2033 1828 -601 -1310 2302 -1326
1655 -1326 1665 -1717 985 1646 -3306 1989 -695 1623 -2237 -279 3071 -3341 1579 -1722 3103
1670 3103 27 -4465 5005 -1900 627 -1859 -436 4019 -4529 966 198 794 -1056 -1531 3431 -1640
1686 -1640 -59 -1054 1872 133 -2847 2344 -687 211 -1898 1003 1518 -2139 1541 -218 1501 -2000
1702b000K716J552m939L951k689M474n216j08O143o352L818l296M029m94n618
1717d029O552l087J681l027K018L105o069L332j642L873m322j180O532m866K287
1732A158k882L077M77n297N200j998O02j842J858J274l387K262r33L475n280J592
1748f44L230m624L216l345M413k108k909N013l353K157l180L801k48m127M128
1763A420k215L169n073J616M051n317L178k400L401j386k612M832l131J244k569
1778a792L116l29l384L129q64K015m350K134K505l785K475k315L498k658j087
1793a692M036l251J272j674L293j903k057L117j031J353m361M102O66l889L045
1808A026k331L379l545J14L918l994J583j398L110k143j439L310j888J312l270
$$ plain form
1702 -2000 716 2268 -2671 1280 -1409 3065 -2151 -2259 3884 -2468 1350 -1946 2083 1589 -4029
1717 -4029 2523 -564 1117 -1910 108 3213 -2856 476 -1166 2707 -1615 -2795 3737 -1129 1158
1732 1158 -1724 1353 1830 -3467 1733 -265 337 -1505 353 1627 -1760 502 -431 3044 -2236 -644
1748 -644 2586 -2038 1178 -2167 2246 138 -2771 2242 -1111 1046 -2134 1667 1419 -2708 1420
1763 1420 -795 2374 -2699 -1083 2968 -2349 829 -1571 1830 444 -2168 2664 -467 777 -1792
1778 -1792 1324 995 -2389 740 -124 1891 -2459 -325 2180 -1605 870 -1445 2053 -605 -1692
1793 -1692 2344 -907 365 -1309 1984 81 -1976 1141 110 1463 -2898 1204 1870 -2019 1026
1808 1026 -1305 2074 -1471 -1357 2561 -1433 150 -1248 1862 -281 -1720 1590 -298 1014 -2256
1823b256L534o0l435K922j480K620l166N33K957l446J427o05K216k867o0K693
1839A527j995R45k621L909j081k620K795j256J885l372K336J400l566K602j378
1854d90K048k888L08K758k383P83j845L577k006r01K155j374J149j995J754K63
1870I13k532K481j170P06j302O30J428j527M61j034K682k256J37J251j966J723
1886F25j633J890j116j364K653j286N42j149J283J28j130J018q95J509k235J417
1902B57P23k665K542j502J276r80p71K971k374N25l46Q38j55j211J490p90J65
1919gp95J294N75k396J828k0J9q57M4J634j535m7J93N37p78P4N09l70j80m03J912
1940A231j052j059J595q79Q49j722J169Q05k148J356j81N81j058p3J823j829O32
$$ plain form
1823 -2256 1278 1218 -2217 705 -775 1845 -1321 -788 2169 -1277 150 -455 1761 -1106 -1166 1527
1839 1527 -468 477 -2144 1765 684 -1936 859 -397 1488 -1884 452 1852 -1714 888 -490
1854 -490 1558 -1330 -1022 1736 -647 136 -1709 1868 -138 -1039 1116 -258 891 -1104 650 913
1870 913 -1619 862 -308 398 -904 -274 1154 -373 88 -946 1736 -520 -383 868 -1098 625
1886 625 -1008 882 -234 -1598 1055 -231 311 -838 445 573 -557 461 -434 1075 -1160 257
1902 257 980 -1685 857 -645 631 -349 -1120 1851 -523 2 -344 494 339 -872 618 -172 -7
1919 -7 -802 492 1067 -1329 499 479 498 -359 -315 1319 -216 -263 -70 467 -311 -237 272 -98 -278 -681 1231
1940 1231 179 -880 715 -164 685 -1037 132 937 -1211 145 -36 545 -513 -586 1237 -592 40
1957D0k77J333j086j699L182j395p3n72p8J957k556J319R73j599R22m24R6kr92
1976i31J424j04q80L73J04J45p42N71M83j104M99O22L26j086n40K265j075j170
1994h20L41M42J236k397Q39J584j879R98n33R36k39k096K913q38j181Q34o13J364
2012H91j607J75K003k302J247m85j5N26j431K297j665m57J340k35O6k203K342
2029D87O39k157J040k27J269j695o51L132j624j515J148P85N92k842J169K384
2045A934k044p11R47P17K56k864K183O22j714L18k64J703j855L57K034k405J292
2062E06r48P37J62k049L452k533l99J373q17J897l204J887J864l072J064l41J652
2079A231j686j343L216j169p81k1P53R04k449O89J946r94o28k90J136R4j614J586
$$ plain form
1957 40 -237 1096 10 -1689 1493 98 25 -547 -625 1332 -1224 95 1068 -531 391 -33 63 61 -931
1976 -931 493 389 -491 -118 -14 131 -611 -40 443 -661 -162 460 786 -300 -840 1425 350 -820
1994 -820 -479 -37 1199 -1198 -359 1225 -654 344 -189 747 508 -1588 1325 487 -694 140 -473 891
2012 891 -716 -541 1462 -840 407 -78 -93 433 -998 1299 -366 -823 517 282 348 -1855 487
2029 487 1126 -1031 9 -218 1051 -644 -1295 1837 213 -1302 -154 631 1223 -1619 -450 1934
2045 1934 -110 -821 126 843 1099 -1765 418 1040 -674 -356 -620 1083 -772 -415 1619 -786 506
2062 506 -442 295 457 -1592 1860 -673 -1072 301 -516 1381 -1823 64 1928 -1144 -80 -421 1231
2079 1231 -455 -1798 1418 249 -532 -553 200 1104 -1345 -656 1290 296 -332 -622 514 608 -1006 580
2097E80j22j061Q88q25J757k210N36J844k558J706j199J289k25k254L902k459
2113d11k90J232n37J249l490K649J019k309P14n53K808k781p00K834j262l04q95
2130a027J481N46k323J242Q91r29n51M27J083m45j734K103k17r45M65o49J745
2147A163j870N68J431k580J803r14J021o83j609L410j837k16k88O50J425l620
2163b146K452M06r08L39j172L241k826k11J749p84l1j171J917J38k148P95J007
2180F47m6r44J67P42o1j075P08J07m90M06m52O74r34K29J231j482J063q10P94
2199D74p5j279J857j869Q51l3k75J015j983K232o21l32P9n85J649j833O55L25
2217B52m18O06j341J461n83j85K05K06k33m15Q96n61K08L97n76L45m35L34k70
$$ plain form
2097 580 458 -603 285 -540 1217 -993 -457 1387 -1171 535 -664 625 400 -1854 2048 -411
2113 -411 -701 531 -6 1243 -2247 402 1421 -888 -174 -727 2081 -700 -1400 1434 172 -132 -1027
2130 -1027 454 1000 -1323 -81 810 -119 -670 -243 840 395 -1339 764 547 -398 67 -582 1163
2147 1163 -707 -139 1292 -1288 515 -399 622 -61 -1670 1740 -97 -313 -601 49 1474 -2146
2163 -2146 306 712 -196 143 -1029 2212 -614 -825 924 140 109 -1062 855 993 -1155 -360 647
2180 647 601 -343 -176 566 505 -570 138 245 -245 161 -291 383 -551 -322 909 -573 490 -320 474
2199 474 399 -880 977 -892 -41 -74 -349 666 -1317 915 294 -38 41 -544 1105 -728 -73 252
2217 252 -166 440 -901 560 -23 -208 -3 203 -30 -445 451 -110 98 495 -81 264 -171 163 -107
2236a07p9j06Q01k77j088J439k93M8p87N7J691k036Q50j78O4N13j621J889r08
2255a28j03k5M20J54j159J166m22M03n01k24J323j542M57K69q3Q6l17Q75m86o6
2275I7n02O13k00o81J230r81M29p0J79K40r05P79k3J03n40q7J066j400Q22nn3
2296A11o2m65J023j166Q25n43M85P9j049J731p88k05j4k01R72j385O21k8O3l8
2316c4jP59j039O73n51O03p91m03J389o99o6l31O47L32r68P29j09R1p25N00N07
2337E13j339Q60j72N74q10n76J720p12l03r1R80j56j105Q40j25m8p87J027L60
2356F50j664R72K00M33j267l3J732q60l70r4P68k30r20J166n99J52n02P49k5j189
2376i31Q73N33J42j664R31J216j251l1k86R07l20n70J027p62k8j96J004m16j023
$$ plain form
2236 -107 -186 -292 509 232 -856 583 290 338 -449 -392 1299 -737 113 -65 -1 512 -1109 780 -128
2255 -128 -231 -256 164 318 -841 325 -97 306 -195 -419 904 -638 -181 88 5 91 -226 649 163 97
2275 97 -405 208 8 -673 557 -424 5 -65 114 354 -551 228 205 308 -232 -319 747 -653 169 164 111
2296 111 49 -416 607 -559 266 -277 208 287 -762 969 181 -24 -38 -239 733 -652 -31 -59 4 -34
2316 -34 -35 724 -315 358 -193 410 -381 -784 605 -94 -160 -491 156 488 -480 249 140 231 -494 6 513
2337 513 -826 34 -138 436 -374 -950 770 58 -245 -336 644 488 -617 223 98 50 -737 290 650
2356 650 -1014 -42 158 591 -676 -709 1023 163 -207 -301 467 237 -683 483 -116 36 -466 283 258 -931
2376 -931 -58 475 617 -1047 -116 1100 -151 -182 -468 439 119 -451 576 -186 -214 -410 594 178 -845
2395h45J259k02J28j268O14J525j775O62m12N36k75k0N62q44K89J77N12r17j44
2414d38P09l25L68q57M26N25q64R50l65J08k79J6N55r55M85p5Q47j155j57J002
2434E21q11P32q57Q00P7j168J308o06J9k56K25Q22j305L95K35J60o49j54J091
2453E79o20j77j06O98j50n64P67m92j20K47P1M1n34K32M69l76m61R39l04j56K48
2474B31p97J330j246k16J395r53L37m52N99R2q44O67R6L21p98N0Q47j148N35k49
2494b03L24L41j216Q08J57j54K49o15R27q33k42R19p29K40r2j88M64l12J30K73
2514B48k77J56l77K40k8o6P06r12L37L9QJ10q77J120j66n50Q3P8Q50o90m48R22
2536E06m44J07p70N88O96j416P47pk64N61r73R39N1p05K95R6M82q02p5O21l47
$$ plain form
2395 -845 414 212 340 -928 -314 1211 -564 98 -314 222 -53 -73 489 -355 -66 111 623 -294 -438
2414 -438 271 -54 314 -543 -117 408 -456 494 129 237 -42 -26 529 -426 59 -16 831 -324 -481 521
2434 521 -290 442 -415 385 462 -706 602 -4 15 -241 -16 806 -499 -104 131 291 -358 -512 579
2453 579 -41 -218 -324 374 224 -340 427 -65 -185 62 133 174 -360 -128 341 -35 -496 443 139 -17 231
2474 231 -566 764 -482 -698 697 -256 81 -371 228 320 -524 143 239 560 -238 -188 659 -489 46 -203
2494 -203 121 462 -754 54 211 57 306 -309 618 -215 -457 462 -267 -27 -119 -307 157 -155 -25 248
2514 248 -29 127 -250 -10 -38 -104 602 -310 27 66 74 184 -693 427 261 -289 -206 -128 722 32 -416 506
2536 506 62 169 -601 -13 683 -733 14 7 -257 304 -669 270 321 -384 -89 7 489 -313 -388 233 -114
2557a14M21n81L85L32r81R77n02k21Q39j251R46m60K8M69n88P93l47l22O7q6O19
2578D23m08k36L97L6l31j63K10K52o93K70M02k00K25q23Q35j03j71N20j052J214
2598F04p46M1L94p36J016p25R6N59q14N74o39L61K38o72O58k92K92j61j84J36
2618@J04k22j08q8O53m71j75L76o6K05n94j88J118j004L64m7L08L34j340J012
2638A71L58p13K42m90J127q27m75Q16n23O21o75N73K47r01N07m64Q55l50m47Q55
2658E07r72O65o55P82kk33q7R8k69J08M02o72K69K30j41ok09mL73l49K09k22P83
2681F05r66K22L67l41M85j099J303l65l55o8OO22r78L00M84m64L61o63J091n17
2701C0q7J77l62N75q20O66o8k9O6l51O13m47J95J3k39j22OL83l20K1j22K25J63
$$ plain form
2557 -114 307 -274 111 443 -538 439 -63 -284 555 -696 250 -210 -182 287 -301 492 145 -177 -110 -196 423
2578 423 15 -221 176 212 -119 -282 -72 180 -513 -243 159 -41 184 -639 196 93 -78 442 -610 604
2598 604 -142 -101 293 -443 573 -152 -56 503 -311 263 -376 -15 223 -449 209 -83 209 48 -136 0
2618 0 104 -118 -226 -314 339 -132 -307 69 3 208 -386 -574 544 -460 -96 -143 165 499 -841 171
2638 171 529 -184 58 -432 695 -132 -607 209 -314 307 -368 205 452 -449 58 -406 449 99 -348 507
2658 507 -465 200 -455 327 325 92 5 103 -166 -58 344 -328 -59 171 30 24 -185 -189 184 -165 44 -178 605
2681 605 -361 -139 228 -113 372 -727 576 211 -144 -212 -206 416 -562 -262 222 -242 119 -544 547 30
2701 30 -57 120 -242 333 -487 179 111 82 148 -203 410 -37 158 171 -68 -190 -184 199 -121 -100 -222 3 166
2724A66k46P85q16o0J12J48J13p18R01j90k84K2j27R62j223M53J16j16O40j317
2744f79J053l96j04L44o92Q01o33L61L8j08K89p84R50p75O03n81M18M86j029P11
2764B73l75j34K54l27M83l21O20n52LK48l93R21j149O01l89J59K54o53R21o59
2784b15M53m95K40P6m30N85j67l1M9k51Q84j045K60J97j85m7k23O68m88m3K13
2805EK10L6j036J071K2m93q9J20O85r81N35k8j47K27m49R20o38j66P9N36k48p48
2827e77R60k14k82M6M06J98j244Q50N4Q1m21J94O76j201L34l3K38k70Q9M78k06
2848A56l16R5O35l08o32N05N9j85k20k6P89j027N46N9K58k11n02R45p67J65k96
2869b78N93k02n56O74j03J6m12M14J94n74L55k85L22k60M3O23o70r3n0N26m22
$$ plain form
2724 166 -80 705 -111 -171 -59 89 202 -516 385 195 -89 -67 -194 768 -455 -2 114 -2 638 -679
2744 -679 374 -22 -126 218 -474 327 -306 55 93 -15 274 -510 440 -335 268 -313 105 591 -438 273
2764 273 -102 -236 18 -309 174 -147 473 -79 -76 172 -221 700 -449 152 -237 -78 176 -477 444 -215
2784 -215 238 -257 -17 59 -371 214 47 16 65 -186 698 -347 -87 110 -75 -122 -345 323 -165 -208 5
2805 5 215 251 -785 286 308 -185 -274 -154 531 -450 85 57 -90 137 -312 608 -30 -196 -117 419 171 -577
2827 -577 383 169 -113 -67 339 537 -707 143 197 278 -143 51 727 -474 -140 -173 65 -205 -116 362 156
2848 156 -160 -65 570 262 -370 135 194 9 -211 -237 552 -475 71 130 388 177 -325 620 -147 18 -278
2869 -278 315 113 -443 231 128 144 -268 146 340 -234 121 -164 158 -102 -59 564 -106 -199 -249 277 -145
2890a45l49O94j20j0n73L49N46p23K11J05K56o58N03K90p43k6K57M65l76J26K65
2911C44l16J1k03P19n58k96M26k66J39k50N15J46p53P19m86N93p62K95M89q37
2931c31L88j18M37o20k14Q80j67l70j40O18J77j079O86r7L87o88J55M28n82J49
2951a01J46M22o71q5O65k95k15k90Q02k13k47L79o8K21r44R24k32l51M0pN62l73
2973F9l21Q79j117O23k18M76k77m71N67J3m6k77K81J87o12L97o5M4R6n45O25n33
2995b25K22R7L4j01k91K70n6Q5k17K80k07J30l4r0L69m11J89q1j56P65n31P0J58
3018B69m10P48j033N86k09l4K49n02R28p38K50Jp3M70j007O57K06o10L03k11N08
3039C48j53n38O15q4k48M6J37K6l95M04l9l41N8J66j2k26k41P56n80K04K79q5
$$ plain form
2890 -145 -494 200 80 70 -503 -154 392 -331 -120 -15 241 -417 86 376 -367 -393 -136 329 -47 79 344
2911 344 28 39 -164 555 -3 -299 127 -139 0 -250 265 411 -342 377 -109 484 -278 17 506 -331
2931 -331 57 -61 376 -244 -458 422 255 -115 -255 363 540 -539 147 50 437 -251 -96 332 -250 -101
2951 -101 45 467 -204 -289 376 81 -134 -424 378 165 -82 297 229 450 -494 430 198 -153 -113 -120 442 69
2973 69 -252 627 -490 133 -85 391 114 -357 210 223 177 -100 181 368 -244 153 88 132 228 -317 308 -225
2995 -225 -3 94 128 27 -264 6 -50 35 -182 98 -109 21 -13 -103 266 -145 44 -37 -193 572 41 111 269
3018 269 -141 607 -426 160 -49 -83 166 -336 592 -146 104 105 32 502 -505 152 358 -252 51 -160 348
3039 348 195 -343 272 188 -60 -14 123 149 -246 158 119 -222 -164 2 -10 -236 -477 279 -301 -97 182 97
3061I7N8o58M11M53o80M34k49J23j11o12J460p96j79N12j38L61q85M12M22o61
3081b26L97o20N61q6l24M00l28J86K80l50K09l3K23j78p88Q52j04l72J27J15N99
3102E40r37L43M10k78p6l70O50J31q67K03M28m05L77m52Q14n56l48O98j02j54
3122D9l33L83J25o35N98k96L18j97j12M20q50N39K95l75n1j91R09m53o08O73O6
3143B74k61l34R8Q59j246j1Q13j47j33N6K72J31q17O19Q7j22o41K86O76o06j85
3164c32M83j56p6R9J81o1l88M90j14j5k41K42L96p06j1K91J72k61l07N31K8o32
3186c87L84j59P22q46J51O86q29n9M10J97k46k29N98j10m68Q5K25K76n70j65Q47
3207E13l87k97K47j28K92n41N78k96k46J94rM33n96M4N68l61L2n8L81k95n40R84
$$ plain form
3061 97 155 -503 -92 361 -319 115 -134 -11 -122 -734 726 -70 -249 263 125 486 -399 13 435 -226
3081 -226 171 -449 112 26 -298 102 -226 -40 240 -110 99 66 289 111 -677 175 71 -301 -174 -59 540
3102 540 -397 -54 356 78 2 -368 282 413 -454 -251 177 -228 149 -303 511 -45 -393 305 203 49
3122 49 -284 99 224 -411 187 -109 209 12 -100 320 -530 9 304 -71 -122 -313 596 143 -465 208 274
3143 274 13 -321 -223 636 -610 -621 192 45 -88 -32 240 371 -446 173 260 138 -503 -217 459 -147 -332
3164 -332 151 -5 -81 18 199 138 -250 240 126 111 -130 112 508 -198 -209 82 254 -7 -314 217 245 -387
3186 -387 -3 -162 560 -286 -135 551 -278 -337 73 270 24 -205 393 283 -185 -100 125 401 -169 -334 513
3207 513 126 -171 76 -52 240 -301 277 -19 -265 -71 -80 353 -243 -199 369 8 40 -18 363 68 -472 512
3229E12o56j21J48K91O4p19L91N56m46k36K49M61n29k31M90N3m41k25N55J04o45
3250c75L43L56k43m61M63pl11Q7m6L64j41O8J58Q4n24k4N37j84l59J58M68n12
3272a01l70Q75m85L96n27K24J88m89L51l8p0j57J17L88m24q6J07N06o06n3N59
3293C05l3k38jj26J46k62K37k4N0l25L69L34p14O0QK01j76j46N01k91L45l05J21
3316C6m0l73O11k54rk4K58m9k23o0J9K67m92L03K14j54P7m0j6j50k34M94J6j66
3340A1k29M25j6k98J73o9k6J9M0K33n55M49j79J10J12l60L81k49k53L10k22M20
3362B27j39M0l62M1K87k83M10n08L57j39R9Qk66N49p54M99l28K37j05j3L36l02
3384a09p0J2R2J14j40j45J98K01j39n6M29n41K25N2O6jn99M87L3l08J4J46K1J07
$$ plain form
3229 512 -144 -265 -117 174 238 -481 -90 466 20 -216 33 494 -35 -266 224 277 -164 -389 166 270 -375
3250 -375 -32 324 81 -380 83 76 -235 -148 -194 170 29 97 255 339 -185 -209 328 144 -215 -57 411 -101
3272 -101 -471 404 -81 315 -212 12 200 -289 62 24 -46 -203 -86 302 -122 -208 -101 405 -201 -254 305
3293 305 272 34 33 -93 53 -209 28 4 54 -271 98 432 -282 -222 -214 -13 -189 -335 166 -125 220 -85 36
3316 36 -4 -377 234 -20 -29 -53 205 156 -67 -127 -108 159 -333 -30 184 30 107 67 51 -99 -333 161 177 11
3340 11 -218 207 191 -107 66 -3 -29 -10 30 263 -292 157 -22 88 200 -160 221 -28 -281 29 -193 227
3362 227 88 128 -234 -193 94 -189 221 -287 70 -69 30 38 -228 321 -433 66 -262 -25 -130 -143 193 -109
3384 -109 -179 -167 -75 39 -101 -246 -48 153 14 -42 387 -154 71 123 189 188 -411 76 109 -199 -185 -39 -18 89
3408H9J25m05N32j89o8n8J3Q6j66m7K65j12j92Q4K9%K34j30j30o9R8L36m88J91
3432B8J21j39j55K48Q0N9k68j55J19M2O1J22m04K66l17L96K9k47l3QK99M3l73
3455a70L55k00NJ92k66J40k00K04J24l21lk81O12j73O4k83P2K84o69L99J56k21
3477a80J20j36J74J48j39Rn2K6j02K02j4n6l06O65m45j93K99n5j55J9K00j78m4
3500a93L15k3J70l09l01O76n75O8Q9M3K92p26N46n1j6K14m94J55n8Q4K25K8j57
3523BK4N3q5o6J56k92J76J33K1n3J7j42J25m03R4L93l94M42m15L54j34j10J70
3546F6p6J61j06j50L72m07K77k85K31N4n78Q20l00J5pj65J3J15L8J85k75j64m6
3569b12K09j22o5L92r9n8J06k75K84m26J17J42L7m7J48j82R1j12J20J47q8j8m87
$$ plain form
3408 89 214 -191 341 152 84 26 39 125 -41 -88 177 65 -127 -43 -14 -14 220 90 -40 -109 -11 325 -163 28
3432 28 149 10 -145 103 183 242 -26 -181 -62 -20 41 163 -241 25 -292 104 133 -114 -147 -139 160 203 -170
3455 -170 185 -15 -10 182 -84 56 -144 60 184 -137 -140 -421 191 18 82 -201 -129 155 -514 -115 41 -180
3477 -180 -60 -196 -22 126 -13 -4 -56 -30 -132 70 56 0 -306 359 -86 -279 20 -35 -190 -171 29 -149 -193
3500 -193 122 99 269 -40 -341 335 -240 -172 -83 -40 252 -474 72 21 5 219 -275 -120 -178 -94 131 159 2
3523 2 26 79 -6 -72 84 -208 -32 101 122 69 86 -56 69 -334 -240 153 -241 201 -214 140 6 -104 66
3546 66 -10 151 45 -105 267 -140 137 -148 83 137 -441 379 79 94 87 -78 -65 50 88 273 -2 -166 -212
3569 -212 -3 -125 -190 202 103 45 151 -124 160 -266 -149 -7 30 -17 131 -51 40 -72 48 195 107 89 -398
3592c98O83k67r5L70n56Q4p9J85L42l45J28J24q4j04l00N28k99P6M5j64K24k13
3614a15L62p7j85ON1L46j60m46L87k52Q0mp9J2K54j72n6o9l9K57l04K75m04M90
3638A58m6j93j96L69n6j16JJ29j56K06j38L61l30j65K41J17k48k41n4N16l50K6
3660a65N13j67k89k19K83L30j89j11L82l38p5o7L42k14J88k57j7J17N9K3M1j37
3682C3p0l8k02K38q3L50j73l73O86k46jl29L06J16j36j85Q4O6k55K87J53l10j85
3705b67N16l62L77m56J05J25k66Q1Q7L4j89Q1K64J43k52J01l1Q8j51K74r3k93
3727h4R0J78J20n34L99J17l33M4k34M2J91k98M60j62K56m29L11l45K60j56N4J56
3749A03j25L02J4l32j98L36K5k36J35K3R3m15J67L74l28j56J69L78k80l9M6j15
$$ plain form
3592 -398 285 18 -77 293 -263 -179 -258 -73 269 -76 52 176 92 -12 -312 216 -83 -7 38 -126 98 -115
3614 -115 247 170 -15 -9 42 388 228 -218 169 -83 -3 -7 -86 -74 180 8 -48 -117 -156 101 -203 72 -332 158
3638 158 112 -81 -277 92 36 -80 -79 50 -106 100 -38 323 -7 -172 69 186 -62 -303 -357 159 -191 -165
3660 -165 348 181 -108 -327 -44 286 97 -14 368 30 -45 -112 230 16 204 -53 -70 47 106 129 170 33
3682 33 -37 -75 -277 -39 -122 228 55 -318 368 122 121 -208 98 214 78 -107 -23 43 -212 75 228 -82 -267
3705 -267 249 -113 264 -192 -87 38 -228 -147 -60 -26 -215 -134 130 273 21 122 91 179 28 302 209 -84
3727 -84 6 184 304 -230 169 286 -47 -3 -237 -195 -4 -302 158 -4 252 -177 134 -211 49 -107 -53 103
3749 103 -22 280 294 -38 -236 100 125 -111 24 47 140 -275 -108 266 -62 -218 -49 329 49 10 56 -59
3771e9K31m73L15O3l99L57J36Mm50K70L68n38j06L20J41m49N3K69M2q5o6J5J11
3794G0j68M2j6j17P3R6L09j83j71Q7L99m44j49O89o01mn1K05k00m40M87J8M57
3817C88p49M84L3m67J98p8K87k89RL19k81j0L14L0j20j08L00l19R6j03J22K3j26
3840d7J5k60L74j15K04j7l05K25p9M7j24J22j70R0J25l37M76l24K9J72j79K46
3862A68j61N1k28k88N50M2j46j01K3M26m17p3oK33l68L66K76l00J80m28k5J92
3884c4k65K07q3K03j15P7J78j57J01k51J53k09q0K41j38J72m5K53L0j39J34l85
3906a52K76k77j6M02l82pJ42j86J69J85k88J71j16k15J70K90j82K6k78N58l70
3927h0R5m2M2J69j12k43j7J85M0r4J70N9j90K79j23j01m51P70n58L56l31J45R4
$$ plain form
3771 -59 172 -301 14 77 -322 35 171 175 -275 -5 363 -175 -281 39 180 -269 -216 53 95 10 -56 -41 70
3794 70 -98 -56 -72 -189 -116 -20 289 106 -65 22 421 -23 -172 517 -84 -88 -139 66 -134 -574 -87 -69 388
3817 388 -361 123 156 -311 -113 -191 96 -193 -184 135 -146 -156 158 188 68 -40 260 -59 37 -66 56 79 -47
3840 -47 -32 -292 82 -33 171 154 -151 74 -5 42 -82 40 -130 -40 85 -252 224 -100 -71 101 -78 168
3862 168 7 58 -170 -458 92 134 -12 -113 -90 336 -81 -154 -160 73 -295 71 347 47 227 -201 -226 -34
3884 -34 -299 -92 -175 28 -87 -10 168 11 112 -139 14 -195 -275 -34 -172 0 -45 208 238 99 233 -152
3906 -152 124 -153 -169 233 -149 -156 -14 -200 -31 154 -134 37 -79 -294 -124 166 -16 10 -268 290 -80
3927 -80 15 -27 15 184 72 -171 -188 -3 37 -57 113 172 -18 261 138 37 -414 356 -202 154 -177 -32 62
3950F2l83N55k51lk64M93k59k31M49R4j42j86j29M38m0k02j61J16k27J79L91k94
3972Ej50j18M82j17n16M99j65P6jm1K19l00K46k84L13j62q5J90Qk37n4N2L31m15
3996b24L46k95J05J09J57J72o54K62K8K8R9k48J67nl19M85o9n0j35k6L60l32k08
4019b47J91M78m44L6k3K25m00J42K28l66J37ll2L42k57j67K14m2j69J11Q0j86
4041a52J72J81j65j28J15M11p20P5M05k24P9m12O92k83j04J3j1L19l29PL50m24
4063a33r0M1K15j90J42J01qk55qK5J95o6j75M10l96n5L70j43m03K15L36M1n95
4086d26K40O6P3J7Q9K24j47l00M70l46K13o62L30M74o88M08r4J67m53N3N48k57
4108aQ8k82N1K77k43O2K26k77j6J74J25k05P2K01k87j9K02m14L90j62L46m22j69
$$ plain form
3950 62 -321 234 -17 -20 -284 209 -50 -281 168 262 120 -66 -195 243 203 1 -160 -44 -271 -92 299 5
3972 5 -145 -263 219 102 -414 85 -80 -4 -5 -46 173 -127 119 -165 148 -14 -99 91 99 -138 -192 -140 191 -224
3996 -224 122 -173 -68 41 198 370 -284 -22 6 34 133 -115 52 47 -272 213 144 94 -41 -67 293 -39 -247
4019 -247 -56 422 -22 14 -9 216 -184 -42 186 -180 -43 -46 -78 264 7 -160 54 12 -157 -46 34 -152
4041 -152 20 201 36 -92 23 434 -286 -211 194 -30 49 -363 329 46 -58 -45 -56 263 -66 -59 291 -133
4063 -133 -223 -182 33 -157 -15 86 78 -177 -185 -160 35 -31 -206 204 -192 -247 123 -20 -423 -208 128 169 -426
4086 -426 -186 -120 -47 -30 59 283 136 -164 306 -40 173 -489 -159 315 -373 35 -59 108 -345 -292 256 -1
4108 -1 87 -195 -144 133 -110 -48 178 -99 -115 59 184 -21 51 252 -35 -54 148 -266 124 -38 308 -114 -283
4131b83M05l1QK8p9K55m58k5N4P6K32l05n2M55k56q0L5K51j01j55J80kj07j09
4155f4L59j26l25J00qj63J96k18J44R6J25k8j7k68J07J88l6l57J72O3r1R6J49
4178I4M8l33RN09m80O2K8O2M39q08M37N1k24J15k03L31l6N0p3j44n1K9l4J39j4
4203CM5q5J11m29O46j08j98J30j49kL33k67m6P5j19J31l22L58j32j68j4M30k75
4226e2J38j2j1j99R4J41o4q9o4M82k68j59n0J78p5q9K39k24J38k23J82j05O3J61
4250A32j00Kj42L67l73P5o0J59L4N8r2k08J64L6k34k59M85j2j44n1J87J03j01
4273B6r1K59j02J8j66J46j23J58J9j51j63J09J13K45o36L32k87L03j9K06m81n
4295b90J1L81k8k59K71k44P0NK85k55k6k6K95j82k06M27l7l99J38L76k55r1l5
$$ plain form
4131 -283 122 91 99 127 48 303 -155 -180 -126 -50 182 -123 -175 280 24 -56 -21 230 129 -26 154 152 45 -64
4155 -64 295 169 -156 -56 -64 -227 -31 -249 -105 -9 116 88 71 -197 -90 98 62 -295 -123 -60 -151 -55 94
4178 94 142 -191 -182 327 -153 -91 -63 -1 438 -370 67 118 -106 9 -194 137 101 151 78 -66 -117 -88 -122 17 3
4203 3 48 -37 74 -355 291 183 -15 115 -34 -36 297 30 -16 59 -60 71 -251 107 -25 -193 -207 223 -52
4226 -52 86 74 63 -136 -42 99 35 -54 -118 364 96 -63 -113 65 -10 -99 140 -84 54 -169 13 -92 -29 132
4250 132 32 34 -108 259 -114 -39 -99 60 94 152 60 -148 16 52 -182 -441 44 32 -112 -163 24 127 26
4273 26 -65 194 92 110 -56 90 -33 125 144 -7 -170 -61 52 297 -339 -7 -294 9 -10 196 -285 -290
4295 -290 -279 102 74 -185 86 -158 -88 -83 202 -53 -79 -105 190 8 -198 229 192 -207 -69 307 52 -39 -74
4318g4l2K21j28O6K7N7J29m13M83k09P5l76K98j13l81P26l72l4mK87Lm78J67K15
4342A40k8l22J1M71k80j58L8K43j09J3O5Kj64L7J13J52l32k45N90m36R1J29r0
4365f9P9j64J90m4k02J27L49n27K05o4J50p6j13L10pk67J55K2j72K53l00J52Q7
4388G4l21J33J51R8p5J4q1k6R9K16m41J59j80K34j7Jr8k8M50n80J44L00k91L1
4412c4r7L29k87J01j8m33L50J36Rk4j77L70l51K14j59J10l9o3J65N0j67J0j68
4435a73oJ19J51J1Q7k09j63J79K3Rn0J58O1o7j10P1J36k57oK79j28k70o8P5K06
4460E8np2K7k41J00J61mk04K68J5J57l99j8J09KJ45k02J35p2k29K55o4o0J80p
4485C5J58k77J18n8J95l2m34M18j11JJ57J34k90o3L8n3J88n0j01J7J34k06J3J88
$$ plain form
4318 -74 -106 115 -13 53 80 137 266 -147 336 127 202 -174 124 11 -370 356 -16 -50 -54 233 236 -242 -75 140
4342 140 112 -210 -199 272 -8 -166 -128 115 6 19 84 86 -78 -41 72 224 -108 -353 237 -199 -108 21 -69
4365 -69 10 -154 36 -8 -210 -83 266 -261 -56 -120 30 -46 -159 151 144 -123 32 54 -118 135 -165 -13 74
4388 74 -247 -114 37 135 60 74 -7 -33 66 282 -159 0 -180 54 37 38 -60 -88 362 -218 -74 226 -65 -34
4412 -34 -131 198 -89 12 -6 -439 -89 47 56 32 -145 225 -126 88 -71 39 0 -63 102 152 -15 -5 -173
4435 -173 -179 -60 91 102 189 -20 -183 -4 19 28 -22 136 197 130 20 91 227 -30 -36 243 115 -155 -223 -148 58
4460 58 53 -19 8 -233 -133 28 24 -180 88 103 260 -139 -157 -48 -46 99 -103 32 -40 -269 -14 -78 -138 42 35
4485 35 193 -84 34 -24 171 139 -295 123 12 13 170 304 14 -49 -11 -64 124 74 -27 -10 124 -82 -69 119
4509A19k48L7J92j15K52l43L26j31l27L03k25J99n5J71qm89M45Q1R1j99jO3k05
4532f7R5j00M2j98J42L26k74p7J36p4J64j14j66M62l19r2J01L2K01k53j06J32
4554gQ5o5j87PL6m9K13k5j11l2L79k86J45k47M25l30j49K45n9J28j02L01m14Q6
4578a3j46o9K09m50L90K37j41L32l29J80k08N8q0k5K87m18L95K2k42m8K29r1r5
4601a6J33K6k50P4P5k0k5Q5k25M66l38o5j07J02nJ59j11J76j62K85j51o8j62M5
4625g9N2J1J49k99J21O8j17rK74k34K23k77K37j80J37k44J8J51p7j5K3j66K74
4648D1K11j51k38K64Kk13N0K49j75n8q0J66l5r2J69r7J26n2j41J69k25R2J3j54
4672a59L24k56J29j6n1K13J80k31q2q3j90J38K05l01K24p4n7R5M8j67J03O12o49
$$ plain form
4509 119 -129 -92 100 -15 237 -106 220 89 -238 65 -160 39 -16 155 147 -342 103 184 275 76 75 138 -67
4532 -67 28 -72 -30 -228 -86 240 -34 -111 25 -49 115 1 -165 297 -22 -114 -13 19 220 -33 -139 -7
4554 -7 78 13 -174 -167 -131 -180 33 8 -103 -135 244 -42 103 -144 281 -49 -198 47 -12 116 14 315 -99 -13
4578 -13 -159 -228 -19 -469 -79 158 17 349 20 200 -8 50 -30 -55 232 -186 209 231 -11 -59 170 79 -16
4601 -16 117 143 -107 -33 42 22 -3 82 -143 323 -15 -80 -187 -85 -90 69 -42 134 -28 257 106 38 -124 -79
4625 -79 -27 -16 133 -166 -45 23 -94 -103 171 -63 160 -117 120 -60 77 -167 -149 2 -75 -90 -67 -233 41
4648 41 252 101 -137 127 129 -84 -34 215 40 -18 -98 68 33 -59 110 13 139 87 -54 115 -110 -18 -5 -159
4672 -159 165 -91 38 22 -29 184 364 133 51 -32 -222 -84 121 -180 44 -30 -87 8 56 -111 -8 604 -45
4695d5J4L3l7l0Oj56K70m2J50rk30K11j01J19p5j15M9J93l41q2J55j3j9R7j15
4720a13O1J72rj29k6M2J03Q9k45N8J01j86Mj2L42K91q30L12l06L88j94j94M27
4743A46j44p2j35J01J65KN4Q1m03R9L70j9l66P7J8M36m88KK27j39m6nR8K9Jj89
4769a00L05l97J79K38k67m0j37J53P0o9J97j77M7L93n58J01J13Q9j90R8j31j31
4791b14J89Jj05M71l06j7P3k77L2K05M4j76L46l91j44K02J48Kk13J17L12j79M4
4814A64j00l9j74J65j54J7J03J42N9j81J84j02P6r7j75K72j53M5K8j73J58j16
4836e1n9r1J28k09J09M02k17j64J16M5R8j99N7O2j46m5k3M66k37l0J97n1k65o3
4860a70k4J50J23j36Q2l3n93R54k16k19P4l4J56j89r8K28k03K01j43K72k04j12
$$ plain form
4695 -45 -31 2 -35 -65 -59 -215 55 13 163 154 -76 135 34 153 78 -37 12 205 -136 -218 -63 -76 -95 2 -113
4720 -113 -52 120 111 -18 -44 -2 101 190 -55 3 104 -82 -78 -90 252 543 -287 25 -281 107 -87 -281 146
4743 146 2 -70 -205 -104 61 63 117 198 -205 -106 264 245 -121 -44 -26 410 -78 -76 151 12 -34 -39 59 88 89 -100
4769 -100 205 -192 -13 225 -42 -82 -219 -66 4 -65 132 -45 2 395 -163 -62 51 140 -50 48 -83 -214
4791 -214 -25 -24 -129 342 36 19 92 -185 -153 52 96 -80 266 -125 -269 -67 81 83 -130 -13 299 120 164
4814 164 64 25 -149 16 -138 -121 -18 124 183 2 186 84 160 63 -112 160 7 52 80 -93 65 -51
4836 -51 -110 -201 -73 -282 -173 229 12 -152 -36 9 107 -92 -35 27 -119 -164 -187 279 42 12 209 158 -107 -170
4860 -170 -194 -44 79 -57 25 -8 -601 353 137 -82 -8 -42 114 -75 -173 55 -148 53 -90 182 -22 -134
4882a34L66k64m9K69N6m05K48n3k5M3l07L63K3n9q5J48l86L10j28J17r3k39K43
4905d1O0m4J25p5k4K6l54M16jJ8k60J23Q5j52r3M72k67K09k76K4K6j0J39Q4l17
4930a07k57O60j01k16QK23k51q0j71L06p2J51o2o1O1p6j5L09m68L06J00j56k97
4953b66K32J63k94Q8L01l15J46j11J75J58k12Q3l50M05k58J21J2k35m9N57k23
4974A28O4l99K39k24J83J22m2m5k66K73K36l63K4r5L43l71j51O42m21j6J07q7
4996a19K03o4p3M46n52j07N4N22l38q7J27N6p9O8j50J13k12K23K97m14N9l6l3
5019i6R1l49M74j03m89N63l3J55k43M9j01J58K94k90j36K09k37K4j28P2J31n9
5041d4J32Ok10L73l60J3j67M52j59o6N3J05J8Q4j88P1M2l91Q0N0L08k69k1K04
$$ plain form
4882 -134 232 -32 -81 188 244 -161 87 34 9 52 -255 108 131 72 -13 135 -251 59 -69 48 -45 -284 -41
4905 -41 19 -25 100 25 1 27 -327 89 88 106 -154 -31 54 -98 -191 281 14 223 -53 -29 -3 -13 126 210 -107
4930 -107 -364 296 195 -21 -13 210 -41 -121 -292 14 -58 93 31 -30 31 -45 -60 249 -219 87 187 31 -266
4953 -266 -34 129 -165 -77 224 -91 55 -56 119 277 65 148 -202 203 -55 66 78 -157 -206 351 128
4974 128 192 -207 32 -192 -9 113 71 26 -240 33 269 -94 -70 -165 178 -193 -344 298 -123 -139 -32 -119
4996 -119 84 20 -53 393 -159 -266 -212 310 -28 -115 12 68 -11 57 -93 20 -192 31 328 -86 -27 -63 -96
5019 -96 -5 -354 120 17 -472 91 58 213 -30 19 -82 76 370 80 -56 153 -84 -60 -188 -116 15 -44
5041 -44 88 94 -116 257 -103 -90 -257 195 36 -30 23 128 146 230 42 113 155 -236 -156 -106 202 -67 -88 116
5065A16m91L71k18J37J59k26J94J68k03J74j4J42l23j18O0r6K18R2j25j23p3L28
5087A49K28m06j11L85k89J35k65L19k94K08k02O8k8p7L81j28k6L2j85M54k46k15
5109a13L42n4j07k25Q0J19j53N6J92k08K4j45K97J41n27K38j6J8k6m6K80l26L04
5132A45j74j33L03k36L70k45k77K62O7Q4k58M9l7r6J83J65j23M0j77K16k14m5
5154a31K01J84k75J26l6K58n30j3Q3L31n7m78L45j48l7J66m1M57m29k7K30p04
5176e25N72j09J9J4J8J75k30N9J8m7K2j03j59Q5K02n6j73K89P6j02K70l88L03
5199B30q8n9o3k09J71J95n0Q6K1k12R0k17N2j8K51j80n1K51k56O7j23L02p8k09
5223i7L30q8l33K5L18k38P9j3K47l42k2K21J44l48j3o0J84J11j7J20l46M6kJ2
$$ plain form
5065 116 -375 -4 -222 -85 74 -152 42 210 7 181 167 309 -14 -132 -72 -168 50 142 17 -106 -179 149
5087 149 377 -29 -140 245 -44 91 -174 145 -149 59 -143 -75 -103 -180 201 73 47 79 -106 348 102 -113
5109 -113 229 175 68 -157 -77 42 -111 -55 137 -71 -47 -192 105 246 -281 -43 -59 -41 -67 -113 167 -159 145
5132 145 -29 -162 141 -95 275 30 -247 15 82 166 -92 -43 -80 -176 7 172 49 89 -88 128 -86 -131
5154 -131 70 254 -21 105 69 327 -203 -216 -133 198 141 -337 8 -140 -177 -11 -52 405 -24 -51 179 -525
5176 -525 47 -62 -43 -29 -11 164 -66 -7 11 -36 -14 -117 -276 -191 11 -45 -218 71 147 45 315 -73 230
5199 230 142 83 20 -189 -18 177 127 213 234 22 112 -105 -53 -71 180 0 -51 200 -56 11 -112 190 112 -97
5223 -97 233 145 -188 -163 155 -83 -4 -17 230 -112 -134 87 231 -117 -130 -190 -6 105 88 208 -138 -92 -94 -82
5247h2n9O3k6J51J79l40R6L32m86N4L3K38j43m5N7k50j26M12R3l51K86n0j6p1
5271e1l4L48q1l54L89j39j45j31M99k94o7L0K75j45l99L62j01Q3j22J39N6r7j20
5294i9J72j54J6K23p8m2J1J89k86L98n38RJ23j42K5J80K20k02j78K92m6m0j44
5317i1J30K96m38J12J37j08J72k22Q2q6P9R2j7l41L93N2o1k07N2j48rJ1m1J74
$$ plain form
5247 -82 -141 -78 -104 47 226 -114 -18 314 -172 -118 -85 153 10 -35 22 -228 -354 58 151 -200 86 36 20 -51
5271 -51 -85 263 182 -172 217 78 -67 -198 301 7 -60 -30 245 100 -299 63 -38 45 -77 62 118 21 -99
5294 -99 73 -81 -65 158 80 38 49 238 -48 350 -188 -179 -56 -198 -173 7 227 25 -153 139 93 53 -91
5317 -91 39 335 -103 9 146 38 210 -12 70 -16 63 155 138 -203 190 242 181 -26 26 -122 -131 -120 -161 13
$$ [...]
8191D1
##END NTUPLES=NMR FID
##END=
