##TITLE=1H_LR-757-R2-CH2Cl2
 CCl4
 8 sc, 
 27.1.2023
##JCAMPDX= 6.0         $$ Bruker NMR JCAMP-DX V2.0
##DATA TYPE= NMR FID
##DATA CLASS= NTUPLES
##ORIGIN= UXNMR, Bruker Analytische Messtechnik GmbH
##OWNER= root
$$ XWIN-NMR		Version 3.5
$$ Fri Jan 27 14:13:50 2023 Russian Standard Time (UT+4h)  she@DPX200
##.OBSERVE FREQUENCY= 200.13135
##.OBSERVE NUCLEUS= ^1H
##.DELAY= (6, 6)
##.ACQUISITION MODE= SIMULTANEOUS
##.ACQUISITION SCHEME= undefined
##.AVERAGES= 8
##.DIGITISER RES= 18
##SPECTROMETER/DATA SYSTEM= spect
##.PULSE SEQUENCE= zg30
##.SOLVENT NAME= CDCl3
##.SHIFT REFERENCE= (INTERNAL, CDCl3, 0, 15.7039)
##AUDIT TRAIL= $$ (NUMBER, WHEN, WHO, WHERE, WHAT)
$$ ##TITLE= Audit trail, XWIN-NMR		Version 3.5
$$ ##JCAMPDX= 5.01
$$ ##ORIGIN= Bruker BioSpin GmbH
$$ ##OWNER= she
$$ F:/spectra/data/she/nmr/H-F/1/audita.txt
$$ ##AUDIT TRAIL=  $$ (NUMBER, WHEN, WHO, WHERE, WHAT)
(   1,<2023-01-27 14:12:16.20 +0400>,<she>,<DPX200>,
      <created by zg, POWCHK disabled, PULCHK disabled
       configuration hash MD5:
       00 E9 B6 7A A2 85 ED C7 34 08 36 98 17 FE 4E 26
       data hash MD5: 16K
       A6 31 93 A1 1B 30 92 68 64 17 52 28 B6 DC 73 98>)
$$ ##END=
$$ 
$$ hash MD5
$$ ED F2 9F 57 16 30 03 D1 18 66 83 E5 19 3C D4 E2
##$RELAX= 
##$RELAX= 
##$RELAX= 
##$RELAX= 
##$RELAX= 
##$RELAX= 
$$ Bruker specific parameters
$$ --------------------------
##$DU= <F:/spectra>
##$EXPNO= 1
##$NAME= <H-F>
##$PROCNO= 1
##$TYPE= <nmr>
##$USER= <she>
##$AMP= (0..31)
100 100 100 100 100 100 100 100 100 100 100 100 100 100 100 100 100 100 
100 100 100 100 100 100 100 100 100 100 100 100 100 100 
##$AQSEQ= 0
##$AQ_mod= 1
##$AUNM= <au_zg>
##$AUTOPOS= <>
##$BF1= 200.13
##$BF2= 200.13
##$BF3= 200.13
##$BF4= 200.13
##$BF5= 200.13
##$BF6= 200.13
##$BF7= 200.13
##$BF8= 200.13
##$BYTORDA= 1
##$CFDGTYP= 0
##$CFRGTYP= 5
##$CHEMSTR= <none>
##$CNST= (0..31)
1 1 145 1 1 1 1 1 1 1 1 1 1 1 1 1 1 1 1 1 1 1 1 1 1 1 1 1 1 1 1 1 
##$CPDPRG= <>
##$CPDPRG1= <>
##$CPDPRG2= <>
##$CPDPRG3= <>
##$CPDPRG4= <mlev>
##$CPDPRG5= <mlev>
##$CPDPRG6= <mlev>
##$CPDPRG7= <mlev>
##$CPDPRG8= <mlev>
##$CPDPRGB= <>
##$CPDPRGT= <>
##$D= (0..31)
0 1.2 0 0 0 0 0 0 0 0.06 0 0.03 0 0 0 0 0.0002 0 0 0 0 0 0 0 0 0 0 0 0 
0 0 0 
##$DATE= 1674814335
##$DBL= (0..7)
120 120 120 120 120 120 120 120 
##$DBP= (0..7)
150 150 150 150 150 150 150 150 
##$DBP07= 0
##$DBPNAM0= <>
##$DBPNAM1= <>
##$DBPNAM2= <>
##$DBPNAM3= <>
##$DBPNAM4= <>
##$DBPNAM5= <>
##$DBPNAM6= <>
##$DBPNAM7= <>
##$DBPOAL= (0..7)
0.5 0.5 0.5 0.5 0.5 0.5 0.5 0.5 
##$DBPOFFS= (0..7)
0 0 0 0 0 0 0 0 
##$DE= 6
##$DECBNUC= <off>
##$DECIM= 32
##$DECNUC= <off>
##$DECSTAT= 4
##$DIGMOD= 1
##$DIGTYP= 9
##$DL= (0..7)
0 120 120 120 120 120 120 120 
##$DP= (0..7)
150 150 150 150 150 150 150 150 
##$DP07= 0
##$DPNAME0= <>
##$DPNAME1= <>
##$DPNAME2= <>
##$DPNAME3= <>
##$DPNAME4= <>
##$DPNAME5= <>
##$DPNAME6= <>
##$DPNAME7= <>
##$DPOAL= (0..7)
0.5 0.5 0.5 0.5 0.5 0.5 0.5 0.5 
##$DPOFFS= (0..7)
0 0 0 0 0 0 0 0 
##$DQDMODE= 0
##$DR= 18
##$DS= 0
##$DSLIST= <SSSSSSSSSSSSSSS>
$$ [...]
##$SUBNAM2= <"">
##$SUBNAM3= <"">
##$SUBNAM4= <"">
##$SUBNAM5= <"">
##$SUBNAM6= <"">
##$SUBNAM7= <"">
##$SUBNAM8= <"">
##$SUBNAM9= <"">
##$SW= 18.05172834244
##$SWIBOX= (0..15)
0 0 2 0 0 0 0 0 0 0 0 0 0 0 0 0 
##$SW_h= 3612.71676300578
##$TD= 16384
##$TD0= 1
##$TE= 0
##$TE2= 300
##$TE3= 300
##$TEG= 300
##$TL= (0..7)
0 120 120 120 120 120 120 120 
##$TP= (0..7)
150 150 150 150 150 150 150 150 
##$TP07= 0
##$TPNAME0= <>
##$TPNAME1= <>
##$TPNAME2= <>
##$TPNAME3= <>
##$TPNAME4= <>
##$TPNAME5= <>
##$TPNAME6= <>
##$TPNAME7= <>
##$TPOAL= (0..7)
0.5 0.5 0.5 0.5 0.5 0.5 0.5 0.5 
##$TPOFFS= (0..7)
0 0 0 0 0 0 0 0 
##$TUNHIN= 0
##$TUNHOUT= 0
##$TUNXOUT= 0
##$USERA1= <user>
##$USERA2= <user>
##$USERA3= <user>
##$USERA4= <user>
##$USERA5= <user>
##$V9= 5
##$VALIST= <valist>
##$VCLIST= <CCCCCCCCCCCCCCC>
##$VD= 0
##$VDLIST= <DDDDDDDDDDDDDDD>
##$VPLIST= <PPPPPPPPPPPPPPP>
##$VTLIST= <TTTTTTTTTTTTTTT>
##$WBST= 1024
##$WBSW= 4
##$XGAIN= (0..3)
0 0 0 0 
##$XL= 0
##$YL= 0
##$YMAX_a= 275850
##$YMIN_a= -411564
##$ZGOPTNS= <>
##$ZL1= 120
##$ZL2= 120
##$ZL3= 120
##$ZL4= 120
##$ABSF1= 10
##$ABSF2= 0
##$ABSG= 5
##$ABSL= 3
##$ALPHA= 0
##$AQORDER= 0
##$ASSFAC= 0
##$ASSFACI= 0
##$ASSFACX= 0
##$ASSWID= 0
##$AUNMP= <proc_1d>
##$AZFE= 0.1
##$AZFW= 0.1
##$BCFW= 1
##$BC_mod= 2
##$BYTORDP= 1
##$COROFFS= 0
##$CY= 11.3945322036743
##$DATMOD= 1
##$DC= 2
##$DFILT= <>
##$DTYPP= 0
##$F1P= 2.36226072786647
##$F2P= -0.459571619588291
##$FCOR= 0.5
##$FTSIZE= 0
##$FT_mod= 4
##$GAMMA= 1
##$GB= 0.15
##$INTBC= 1
##$INTSCL= 1
##$ISEN= 128
##$LB= 0.24
##$LEV0= 0
##$LPBIN= 0
##$MAXI= 10000
##$MC2= 0
##$MEAN= 0
##$ME_mod= 0
##$MI= 1.114404
##$NCOEF= 0
##$NC_proc= 0
##$NLEV= 6
##$NOISF1= 3.799351
##$NOISF2= 2.8
##$NSP= 1
##$NTH_PI= 0
##$NZP= 0
##$OFFSET= 15.70392
##$PC= 1
##$PHC0= -19109.92
##$PHC1= 9.600789
##$PH_mod= 1
##$PKNL= yes
##$PPARMOD= 0
##$PSCAL= 0
##$PSIGN= 0
##$REVERSE= no
##$SF= 200.130013532006
##$SI= 16384
##$SIGF1= 3
##$SIGF2= 2
##$SINO= 400
##$SIOLD= 16384
##$SREGLST= <1H.CDCl3>
##$SSB= 0
##$STSI= 0
##$STSR= 0
##$SW_p= 3612.71676300578
##$SYMM= 0
##$S_DEV= 0
##$TDeff= 0
##$TDoff= 0
##$TI= <>
##$TILT= no
##$TM1= 0
##$TM2= 0
##$TOPLEV= 0
##$USERP1= <user>
##$USERP2= <user>
##$USERP3= <user>
##$USERP4= <user>
##$USERP5= <user>
##$WDW= 1
##$XDIM= 8192
##$YMAX_p= 0
##$YMIN_p= 0
$$ End of Bruker specific parameters
$$ ---------------------------------
##NTUPLES= NMR FID
##VAR_NAME=  TIME,          FID/REAL,        FID/IMAG
##SYMBOL=    X,             R,               I
##VAR_TYPE=  INDEPENDENT,   DEPENDENT,       DEPENDENT
##VAR_FORM=  AFFN,          ASDF,            ASDF
##VAR_DIM=   8192,          8192,            8192
##UNITS=     SECONDS,       ARBITRARY UNITS, ARBITRARY UNITS
##FACTOR=    0.0002768,     1,               1
##FIRST=     0,             0,               0
##LAST=      2.2672688,     0,               0
##MIN=       0,             -411564,         0
##MAX=       2.2672688,     275850,          0
$$ Real data points
##PAGE= N=1
##DATA TABLE= (X++(R..R)), XYDATA
$$ plain form
0 0 0 0 0 0 0 0 0 0 0 8 -8 8 -8 16 -16 24 -32 40 -48 56 -64 80 -96 112 -130 152 -177 208 -239 274 -314
31 -314 358 -406 461 -521 587 -662 742 -827 923 -1028 1144 -1269 1407 -1556 1719 -1897 2091
48 2091 -2304 2539 -2797 3081 -3395 3743 -4136 4575 -5074 5645 -6304 7078 -8002 9125
62 9125 -10528 12327 -14745 18164 -23411 32560 -53093 196542 -143284 -221160 206015 -196441
74 -196441 86188 141106 -254805 3290 105245 -28089 183395 -143209 -131919 251998
84 251998 -33731 -44536 127712 -193703 55900 213216 -136748 -20322 -35602 -133541 187839
95 187839 -17018 -139475 178105 9435 26108 171747 -188061 -74088 131306 -59698
105 -59698 70353 -50004 -200769 207682 73291 -125964 143723 -109019 -107658 275850
$$ packed form
0@%%%%%%%%%Qj6J6j6K4l2M0n6P2q8J04j20J44j76K08k42K82l29L85m47N13n88
31c14O72p64Q67r82J108j249J404j569J750j951K172k413K676k963L275l616L988
48B091m395M843n336N878o476P138p879Q711r649J0719j1949J3382j5080J7127
62I125j9653K2855k7072L2909m1575N5971q5653K49635l39826p7876M27175m02456
74a96441K82629N4918l95911K58095J01955j33334K11484l26604J1290L83917
84B51998k85729j0805J72248l21415K49603J57316l49964J16426j5280r7939L21380
95A87839k04857j22457L17580j68670J6673J45639l59808J13973K05394j91004
105e9698J30051j20357j50765M08451j34391j99255K69687k52742J361L83508
$$ plain form
115 275850 -37509 -117329 106808 -58124 76701 71979 -213833 19694 23248 -86239 206417
126 206417 -28287 -166489 226712 39556 -97496 105698 -105599 -55759 131131 -71153
136 -71153 -11940 15487 -73925 150441 22211 -155892 82271 6433 -16193 157915 -70286
147 -70286 -72421 102114 -39388 24620 -5767 -179831 76787 98482 -71380 95266 -7532
158 -7532 -72853 165960 7998 -101908 20870 -67760 47835 99007 -124389 8290 56829
169 56829 -77781 103767 18201 -149459 91900 79346 -27636 60724 -55780 -29910 80674
180 80674 -63963 -23045 -565 -94483 108504 99520 -93448 38801 35177 -32228 80297
191 80297 -31331 -80992 39658 -6775 39271 31852 -116311 23742 78983 -54887 29049
$$ packed form
115B75850l13359p9820K24137j64932J34825m722k85812K33527L554j09487K92656
126B06417k34704j38202L93201j87156j37052K03194k11297M9840J86890k02284
136g1153N9213K7427q9412K24366j28230j78103K38163p5838k2626J74108k28201
147g0286k135J74535j41502O4008l0387j74064K56618K1695j69862J66646j02798
158g532o5321K38813j57962j09906J22778q8630J15595N1172k23396J32679M8539
169E6829j34610J81548q5566j67660K41359j2554j06982Q8360j16504K5870J10584
180H0674j44637M0918K2480r3918K02987q984j92968J32249l624o7405J12525
191H0297j11628m9661J20650m6433M6046p419j48163J40053N5241j33870Q3936
$$ plain form
202 29049 856 -57450 106249 58046 -41067 2242 -59692 4360 64698 -85760 -29885 49660
214 49660 -19830 76264 49662 -85782 21524 48149 -8002 21197 -58907 -31065 77439
225 77439 -7105 -8004 7030 -83165 28162 80484 -45292 -3475 30216 9025 67337 -4619
237 -4619 -61871 -1096 -23664 14108 34879 -74829 -8869 78761 9428 22382 3270 -52084
249 -52084 31039 35988 -16629 -987 -34362 5865 62815 -33972 -45327 6266 -16759 38142
261 38142 45443 -35211 4346 37748 18283 22546 -44153 -53174 23490 1857 -6009 12687 -29488
274 -29488 17302 63698 -3999 -20596 -8617 -3151 40881 10819 -31796 -2897 -5441 8489
286 8489 23073 -43668 -37157 28629 23036 21652 12202 -15237 19504 30581 -6920 -23720 -42101
$$ packed form
202B9049k8193n8306J63699m8203r9113M3309o1934O4052O0338j50458N5875P9545
214D9660o9490R6094k6602j35444J07306K6625n6151K9199q0104K7842J08504
225G7439q4544q99J5034r0195J11327N2322j25776M1817L3691k1191N8312p1956
237d619n7252O0775k2568L7772K0771j09708O5960Q7630o9333J2954j9112n5354
249e2084Q3123M949n2617J5642l3375M0227N6950r6787j1355N1593k3025N4901
261C8142P301q0654L9557L3402j9465M263o6699r021P6664k1633p866J8696m2175
274b9488M6790M6396o7697j6597J1979N466M4032l0062m2615K8899k544J3930
286H489J4584o6741O511O5786n593j384r450k7439L4741J1077l7501j6800j8381
$$ plain form
299 -42101 -13568 37934 7081 -19355 -153 3650 28242 28350 -23683 -22798 11007 23282 22693
312 22693 -13745 -32635 3288 13363 -3311 -18081 -32357 1414 46952 30375 -1684 -10724
324 -10724 -1570 20563 9699 -28270 -34384 -9233 19951 24446 -8015 -22910 5048 25870 16164
337 16164 -7337 -22000 -3172 31803 27497 -14337 -33468 -15266 7050 8763 -13045 -24397
349 -24397 1905 33672 35981 5909 -25575 -8756 22048 6242 -20099 -26744 -17203 20041 31833
362 31833 -6599 -26285 -9686 19040 29182 -5396 -21424 5286 16389 19650 1899 -42671
374 -42671 -27933 16679 10641 -6960 -18025 -6815 34984 32061 811 -11178 -26119 674
386 674 31821 -14973 -34868 -921 7989 18771 6438 -29947 -10371 14621 19512 20986 -23483
$$ packed form
299d2101K8533N1502l0853k6436J9202L803K4592J08n2033Q85L3805J2275n89
312B2693l6438j8890L5923J0075j6674j4770j4276L3771M5538j6577l2059r040
324a0724R154K2133j0864l7969o114K5151K9184M495l2461j4895K7958K0822r706
337A6164k3501j4663J8828L4975m306m1834j9131J8202K2316J713k1808j1352
349b4397K6302L1767K309l0072l1484J6819L0804j5806k6341o645R541L7244J1792
362C1833l8432j9686J6599K8726J0142l4578j6028K6710J1103L261j7751m4570
374d2671J4738M4612o038j7601j1065J1210M1799k923l1250j1989j4941K6793
386F74L1147m6794j9895L3947Q910J0782j2333l6385J9576K4992M891J474m4469
$$ plain form
399 -23483 -22266 36891 14244 -18903 -12714 -35471 -9110 32255 -2530 -15441 -1078 11772
411 11772 41181 3789 -37755 -1546 1576 1398 20958 -28111 -33684 22525 16720 1500 -14221
424 -14221 -29173 19603 26727 -4373 10324 -13721 -13740 38569 -7091 -48039 -9931 -5076 14416
437 14416 20575 -23454 228 17176 1421 29645 -14521 -50560 26723 19665 -23818 3782
449 3782 -18169 -11183 32620 -6491 -19518 -9033 -12691 46392 27293 -42903 3426 9728 -18390
462 -18390 20738 -18996 -49893 13911 18319 9344 2640 -31735 17071 34982 -18485 1710 -13015
475 -13015 -33279 38390 16843 -35243 -5456 -13214 6381 24525 -36393 -5777 27368 -11602
487 -11602 33292 12114 -60254 13184 27031 -28294 -2198 -25804 -18706 42946 -1409 -6990
$$ packed form
399b3483J217N9157k2647l3147O189k2757K6361M1365l4785j2911J4363J2850
411A1772K9409l7392m1544L6209L122j78J9560m9069n573N6209n805j5220j5721
424a4221j4952M8776P124l1100J4697k4045j9N2309m5660m0948L8108M855J9492
437A4416O159m4029K3682J6948j5755K8224m4166l6039P7283p058m3483K7600
449C782k1951O986M3803l9111j3027J0485l658N9083j9099p0196M6329O302k8118
462a8390L9128l9734l0897O3804M408q975o704l4375M8806J7911n3467K0195j4725
475a3015k0264P1669k1547n2086K9787p758J9595J8144o0918L0616L3145l8970
487a1602M4894k1178p2368P3438J3847n5325K6096k3606P098O1652m4355n581
$$ plain form
499 -6990 10268 -37032 27258 45802 -55850 -13936 25230 -16893 24317 -56 -51431 2891
511 2891 8073 9125 15247 -45465 3683 52531 -17410 2661 4407 -49255 19467 22037 -40298
524 -40298 -4135 -9619 3629 45328 -27749 -21741 29210 -21473 15536 26358 -54232 2213
536 2213 30830 -17961 9591 -28111 -33490 45758 -7946 -18473 30248 -37229 7518 66165
548 66165 -39923 -31085 15027 -22938 18651 2935 -43356 14871 845 2736 40939 -48218
560 -48218 -26397 59230 -16695 -12081 22863 -41560 5975 31663 -30113 -6468 -17749 -12921
572 -12921 48081 -17521 -24939 37519 -19023 5599 35055 -53784 -12670 24851 -24643 20554
584 20554 -9669 -45076 47504 6819 -32292 30681 -29539 -16695 59759 -20259 -25508 13267
$$ packed form
499f990J7258m7300O4290J8544j01652M1914L9166m2123M1210k4373n1375N4322
511B891N182J052O122o0712M9148M8848o9941K0071J746n3662O8722K570o2335
524d0298L6163n484J3248M1699p3077O008N0951n0683L7009J0822q0590N6445
536B213K8617m8791K7552l7702n379P9248n3704j0527M8721o7477M4747N8647
548F6165j06088Q838M6112l7965M1589j5716m6291N8227j4026J891L8203q9157
560d8218K1821Q5627p5925M614L4944o4423M7535K5688o1776K3645j1281M828
572a2921O1002o5602p418O2458n6542K4622K9456q8839M1114L7521m9494M5197
584B0554l0223l5407R2580m0685l9111O2973o0220J2844P6454q0018n249L8775
$$ plain form
596 13267 -24137 25080 5583 -57248 18633 2612 -19442 56696 -23042 -47978 56735 1310
608 1310 -25839 14425 -38856 -2036 32459 -23620 5443 -11113 -29601 53340 -1219 -48063
620 -48063 29774 -6366 -8584 43357 -32051 -25746 22659 -16900 12516 -5539 -50039 32913
632 32913 20219 -23468 27626 -22005 -22277 50501 -16444 -26041 8608 -32099 28131 27016 -58224
645 -58224 9901 15501 -28607 44072 -6472 -53863 37962 13482 -11236 14169 -42917 -2536
657 -2536 35031 -32731 4756 1242 -44061 48513 27047 -49903 15000 2523 -16646 33679
669 33679 -22717 -28329 21346 -11945 14172 8543 -51785 17260 29681 -25500 15199 -9302
681 -9302 -25079 41853 527 -23732 4552 -30035 13488 29806 -47068 -2317 21422 -18249
$$ packed form
596A3267l7404M9217j9497o2831P5881j6021k2054P6138p9738k4936J04713n5425
608A310k7149M0264n3281L6820L4495n6079K9063j6556j8488Q2941n4559m6844
620d8063P7837l6140k218N1941p5408O305M8405l9559K9416j8055m4500Q2952
632C2913j2694m3687N1094m9631k72P2778o6945r597L4649m0707O0230j115q5240
645e8224O8125N600m4108P2679n0544m7391R1825k4480k4718K5405n7086M0381
657b536L7567o7762L7487l514m5303R2574k1466p6950O4903j2477j9169N0325
669C3679n6396n612M9675l3291K6117n629o0328O9045J2421n5181M0699k4501
681i302j5777O6932m1326k4259K8284l4587M3523J6318p6874M4751K3739l9671
$$ plain form
693 -18249 33672 2430 -47927 20373 9603 -8382 16788 -38044 -9547 40744 -22094 -3493
705 -3493 9896 -39479 24897 29967 -35850 4584 4257 -7732 31631 -19800 -29584 17707 -15841
718 -15841 6201 20703 -41260 4110 33983 -16916 5255 -4516 -24540 26875 3966 -18641
730 -18641 6653 -22604 5102 32811 -31060 -12439 16540 -15257 19606 11053 -31578 12028
742 12028 9737 -7827 12996 -28326 -17257 31109 -9983 -6140 11470 -25722 12299 25557
754 25557 -23257 -987 112 -9368 25991 -9295 -26051 15172 -5983 439 17369 -29489 -7981
767 -7981 25278 -3894 6266 -2048 -20600 18394 6212 -16784 3663 -17162 -3175 29957
779 29957 -12898 -16022 9255 -6284 13879 10874 -24602 -193 7179 -1993 13906 -15737 -19068
$$ packed form
693a8249N1921l1242n0357O8300j0770j7985K5170n4832K8497N0291o2838J8601
705c493J3389m9375O4376N070o5817M0434l27j1989L9363n1431r784M7291l3548
718a5841K2042J4502o1963M5370K9873n0899K2171r771k0024N1415k2909k2607
730a8641K5294k9257K7706K7709o3871J8621K8979l1797L4863q553m2631M3606
742A2028k291j7564K0823m1322J1069M8366m1092L843J7610l7192L8021J3258
754B5557m8814K2270J099r480L5359l5286j6756M1223k1155O422J6930m6858K1508
767g981L3259k9172J0160q314j8552L8994j2182k2996K0447k0825J3987L3132
779B9957m2855l124K5277j5539K0163l005l5476K4409P372r172J5899k9643l331
$$ plain form
792 -19068 20307 401 -7078 3817 -18532 6158 25505 -8307 -5596 -3714 -8561 18664 656
805 656 -21588 2166 -1254 2568 14815 -16037 -10143 15484 2090 4423 -3534 -19388 10299
818 10299 13918 -6686 -199 -11596 -7537 18243 -1267 -11618 2601 -1737 10332 10555 -14965
831 -14965 -6126 5390 1806 8059 -9288 -16843 8723 7659 226 2029 -11853 -1388 15020
844 15020 -818 -5831 -2960 -2439 11750 4670 -13220 -6145 -1086 5282 11192 -7351 -10741 6599
858 6599 6836 4617 -193 -11205 -1539 8650 1664 -4443 -8649 -1758 12131 4956 -7194 -6084
872 -6084 -2069 7282 10568 -3282 -9131 -874 5938 5855 -4150 -9658 -635 6837 5420 -802 -7450
887 -7450 -2720 10126 9144 -4663 -9788 -1749 5554 5892 -656 -7923 -4371 5832 7835 -924 -9318
$$ packed form
792a9068L9375j9906p479J0895k2349K4690J9347l3812K711J882m847K7225j8008
805F56k2244K3754l420L822J2247l0852N894K5627j3394K333p957j5854K9687
818A0299L619k0604O487j1397M059K5780j9510j0351J4219m338J2069K23k5520
831a4965Q839J1516l584O253j7347p555K5566j064p433J803j3882J0465J6408
844A5020j5838n013K871N21J4189p080j7890P075N059O368N910j8543l390J7340
858F599K37k219m810j1012R666J0189o986o107m206O891J3889p175j2150J110
872f084M015R351L286j3850n849Q257O812q3j0005n508R023P472j417o222o648
887g450M730J2846r82j3807n125Q039P303L38o548p267L552J0203K003q759q394
$$ plain form
902 -9318 -2031 10626 5966 -3165 -4557 -4990 4244 11631 -2638 -11312 -2711 5571 9203 596 -8864
917 -8864 -38 5576 4694 4237 -9354 -9056 11430 7618 -4566 -5063 -6034 5154 11899 -1873 -5402
932 -5402 -4018 368 14954 2425 -14622 660 6348 2882 4953 -9024 -8451 9111 7978 3634
946 3634 -5950 -12193 10431 13345 -5550 -2828 -4961 -3366 15735 3909 -12373 -3227 2434 10837
960 10837 6261 -14080 -3045 8113 2434 10125 -4127 -17158 9217 11787 -2668 -1475 -9254
973 -9254 1456 15930 -2822 -4138 -199 -7240 14578 10242 -18767 -1907 8366 1604 10046
986 10046 -7098 -13019 10106 5413 4286 2292 -17826 4729 20834 -6495 -4289 -439 -7486
999 -7486 14658 9237 -12511 -3219 -946 8946 14496 -14063 -8035 10915 -1345 8068 3913 -18077
$$ packed form
902i318P287J2657m660r131j392m33R234P387j4269q674Q601Q282L632q607r460
917h864Q826N614q82m57j3591K98K0486l812j2184m97r71J1188O745j3772l529
932e402J384M386J4586j2529j7047J5282N688l466K071j3977N73J7562j133m344
946C634r584o243K2624K914j8895K722k133J595J9101j1826j6282R146N661Q403
960A0837m576k0341J1035J1158n679P691j4252j3031K6375K570j4455J193p779
973i254J0710J4474j8752j316L939p041K1818m336k9009J6860J0273o762Q442
986A0046j7144n921K3125m693j127j994k0118K2555J6105k7329K206L850p047
999g486K2144n421k1748R292K273R892N550k8559O028J8950j2260R413m155k1990
$$ plain form
1013 -18077 4805 13300 -2465 1428 -9136 -2014 19595 -3212 -6665 4983 -10396 10232 17758
1026 17758 -18042 -5207 9584 -915 12754 -3607 -17580 12359 5843 -138 9776 -18736
1038 -18736 -5378 26856 -2314 -8000 2066 -10476 11778 14966 -11720 -2349 -2037 1869 19985
1051 19985 -8714 -15023 12577 986 3212 8401 -15863 280 14105 -987 3946 -8489 -8102
1064 -8102 20835 727 -10339 7185 -9815 3964 20695 -14039 -7802 8738 -2039 15908
1076 15908 -11 -22527 12448 7803 -4543 14703 -15248 -14557 26717 2814 -8430 3804
1088 3804 -12413 9502 17745 -13289 -605 -13 -5842 22645 -2049 -21912 11929 4041 -748
1101 -748 11707 -13741 -4430 15650 -1412 4641 -3536 -14014 18525 7053 -13308 5986 -6624
$$ packed form
1013a8077K2882Q495j5765L893j0564P122K1609k2807l453J1648j5379K0628P526
1026A7758l5800J2835J4791j0499J3669j6361j3973K9939o516n981R914k8512
1038a8736J3358L2234k9170n686J0066j2542K2254L188k6686R371L12L906J8116
1051A9985k8699o309K7600j1591K226N189k4264J6143J3825j5092M933j2435L87
1064h102K8937k0108j1066J7524j7000J3779J6731l4734O237J6540j0777J7947
1076A5908j5919k2516L4975m645j2346J9246k9951O91M1274k3903j1244J2234
1088C804j6217K1915Q243l1034J2684N92n829K8487k4694j9863L3841p888m789
1101g48J2455k5448R311K0080j7062O053q177j0478L2539j1472k0361J9294j2610
$$ plain form
1114 -6624 -250 22060 -9730 -9661 8294 -5192 15592 7668 -25031 7377 11552 -7674 14269
1127 14269 -7904 -18250 21033 5493 -6537 5013 -14132 7075 21048 -13679 -621 3996
1139 3996 -12692 18942 6659 -22600 7498 6154 -2154 12411 -11007 -6227 14976 -2736 5123
1152 5123 1340 -18783 13798 12754 -13855 5150 -4061 -6198 20829 -4142 -10637 8889 -6221
1165 -6221 10688 13194 -22598 1365 12066 -7916 12712 -3112 -19047 16865 5582 -5556
1177 -5556 9203 -14792 726 23253 -11700 -3566 7515 -13369 13389 10957 -20055 2979
1189 2979 4492 -2136 15444 -8910 -9510 15701 -3283 2417 7568 -19209 5395 16333 -10223
1202 -10223 2557 -2260 -8857 18477 1065 -10358 7502 -7494 5359 17708 -17026 -4285
$$ packed form
1114f624O374K2310l1790O9J7955j3486K0784p924l2699L2408M175j9226K1943
1127A4269k2173j0346L9283j5540j2030J1550j9145K1207J3973l4727J3058M617
1139C996j6688L1634j2283k9259L0098j344q308J4565k3418M780K1203j7712P859
1152E123l783k0123L2581j044k6609J9005r211k137K7027k4971o495J9526j5110
1165f221J6909K506l5792K3963J0701j9982K0628j5824j5935L5912j1283j1138
1177e556J4759k3995J5518K2527l4953Q134J1081k0884K6758k432l1012K3034
1189B979J513o628J7580k4354o00K5211j8984N700N151k6777K4604J0938k6556
1202a0223J2780m817o597K7334j7412j1423J7860j4996J2853J2349l4734J2741
$$ plain form
1214 -4285 11465 -7298 9379 1328 -18436 10968 7448 -3600 10183 -12767 -4610 21619 -6090
1227 -6090 -4446 5837 -13607 9579 12953 -15846 1347 2342 -3288 16937 -5978 -13497 12818
1240 12818 -1039 2177 9770 -18131 -1026 14915 -6471 2968 -1907 -11700 16460 5435 -10404
1253 -10404 6352 -6033 908 18246 -10859 -9319 7411 -4748 8851 3962 -17209 5622
1265 5622 7209 -2874 10206 -9242 -8825 18162 -498 -5466 3632 -12253 5281 13754 -10871
1278 -10871 -1715 395 -3697 16199 -1143 -13176 8306 -49 1011 9796 -14566 -4741 12877
1291 12877 -3165 2037 -1155 -12682 11547 8635 -7614 3237 -5141 -1210 15697 -5875 -9407
1304 -9407 4106 -4312 6953 5901 -14859 1473 8023 -1193 8399 -5488 -10697 11907 3463
$$ packed form
1214d285J5750j8763J6677q051j9764K9404l520j1048J3783k2950Q157K6229k7709
1227f090J644J0283j9444K3186L374k8799J7193R95n630K0225k2915p519K6315
1240A2818j3857L216P593k7901J7105J5941k1386R439m875r793K8160j1025j5839
1253a0404J6756j2385O941J7338k9105J540J6730j2159J3599m889k1171K2831
1265E622J587j0083J3080j9448M17K6987j8660m968R098j5885J7534Q473k4625
1278a0871R156K110m092J9896j7342j2033K1482q355J060Q785k4362R825J7618
1291A2877j6042N202l192j1527K4229k912j6249J0851q378L931J6907k1572l532
1304i407J3513q418J1265j052k0760J6332O550r216R592j3887n209K2604q444
$$ plain form
1317 3463 -3741 1491 -10137 2398 12006 -7139 -3047 -95 -3995 13026 3064 -11891 3121
1330 3121 1499 1149 8214 -10270 -7856 8510 269 2145 -602 -10479 6879 8934 -4167 1083
1344 1083 -4944 -2638 13039 -1114 -9009 391 -3404 4820 6973 -10152 -3434 5501 1604 6519
1358 6519 -3043 -9511 6106 4472 -1365 -57 -9299 -1273 10244 -1434 -3612 -1705 -3031 8800
1372 8800 5633 -7567 -1993 633 1943 6471 -5909 -8554 3109 2422 2672 -626 -8805 1917
1386 1917 8499 770 -397 -4708 -3741 7944 2821 -6456 -3706 -2596 3273 6079 -4530 -5257 1440
1401 1440 4000 5867 -1634 -8234 844 5221 1539 -1539 -7237 -3828 5926 3564 -2998 -4463 -1557
1416 -1557 6161 5629 -2864 -5038 -1620 3217 4919 -3222 -8354 -1921 4194 4252 -934 -6084 -1797 5316
$$ packed form
1317C463p204N232j1628J2535R608j9145M092K952l900J7021r962j4955J5012
1330C121j622l50P065j8484K414J6366q241J876k747r877J7358K055j3101N250
1344A083o027K306J5677j4153p895R400l795Q224K153j7125O718Q935l897M915
1358F519r562o468J5617j634n837J308r242Q026J1517j1678k178J907j326J1831
1372H800l167j3200N574K626J310M528j2380k645J1663o87K50l298q179J0722
1386A917O582p729j167m311R67J1685n123r277K750J110N869K806j0609p27O697
1401A440K560J867p501o600R078M377l682l078n698L409R754k362o562j465K906
1416a557P718n32q493k174L418M837J702q141n132O433O115N8n186n150M287P113
$$ plain form
1432 5316 4855 -526 -5065 -3340 3968 4653 -3256 -7384 -2614 2991 4447 -223 -5783 -2359 5075
1447 5075 5180 -144 -5234 -4338 3462 3920 -3897 -5011 -2598 1241 5949 -454 -7673 -866 4900 4485
1463 4485 1339 -5865 -4429 3806 2925 -1460 -5137 -5979 3199 6081 -2026 -4199 -2004 2355 7208
1478 7208 402 -6254 -3623 481 4849 964 -8182 -3943 2603 2595 2611 -4111 -5135 5076 4563 -300
1494 -300 -2351 -7191 1186 7409 -3700 -5012 -2430 -3023 6688 3589 -8211 -919 3039 2198 5003
1509 5003 -5995 -7413 5030 1810 -859 -1574 -9826 306 9302 -1571 -2750 -2425 -2470 8003 3142
1524 3142 -7076 -2690 -1870 2400 4916 -7643 -7001 3044 1860 4228 -1245 -8030 3432 5529
1538 5529 -33 145 -7620 -3141 8431 -1971 -5450 -994 -4874 5460 6677 -7898 -2080 2452
$$ packed form
1432E316m61n381m539J725P308O85p909m128M770N605J456m670n560L424P434
1447E075J05n324n090Q96P800M58p817j114K413L839M708o403p219O807N766m15
1463D485l146p204J436Q235q81m385l677q42R178K882q107k173K195M359M853
1478G208o806o656K631M104M368l885r146M239O546qJ6o722j024J0211n13m863
1494c00k051m840Q377O223j1109j312K582n93R711l099j1800P292L958q41K805
1509E003j0998j418J2443l220k669p15q252J0132Q996j0873j179L25m5J0473m861
1524C142j0218M386Q20M270K516j2559O42J0045j184K368n473o785J1462K097
1538E529n562J78p765M479J1572j0402l479M456l880J0334J217j4575N818M532
$$ plain form
1552 2452 255 7188 -3666 -10597 4052 1667 -1718 1585 -9580 -2913 10328 -626 -2203 -1228
1566 -1228 -5169 7508 5551 -7953 -2486 -2288 -167 7450 -5693 -8965 3081 1096 3918 1789
1580 1789 -9285 951 6861 -632 1153 -6471 -7107 7991 640 -5807 -361 -5334 3023 9119
1594 9119 -6403 -3237 2491 -1741 7633 -336 -12066 2121 2413 -1960 3409 -8220 -5603 10112
1608 10112 349 -1935 482 -7259 6039 7865 -8472 -2843 -1796 -3284 8822 -2456 -11008 2568
1622 2568 1139 2760 5492 -8999 -2159 7799 -1224 1204 -3685 -9613 6299 3834 -6384 -154
1636 -154 -4892 -140 10480 -3504 -5024 2684 -2374 5417 2379 -11369 -263 3047 -2373 3555
1650 3555 -6856 -7086 9562 1836 -1604 1688 -8039 3023 9681 -6929 -3398 -1145 -5010 7863
$$ packed form
1552B452k197O933j0854o931J4649k385l385L303j1165O667J3241j0954j577R75
1566a228l941J2677j957j3504N467J98K121P617j3143l272J2046j985K822k129
1580A789j1074J0236N910p493J785p624o36J5098p351o447N446m973Q357O096
1594I119j5522L166N728m232R374p969j1730J4187K92m373N369j1629K617J5715
1608A0112r763k284K417p741J3298J826j6337N629J047j488J2106j1278q552J3576
1622B568j429J621K732j4491O840R958r023K428m889n928J5912k465j0218O230
1636a54m738M752J0620j3984j520P708n058P791l038j3748J1106L310n420N928
1650C555j0411k30J6648p726l440L292r727J1062O658j6610L531K253l865J2873
$$ plain form
1664 7863 508 -10909 1980 1123 1664 7447 -8188 -4732 8191 -1230 1137 -758 -11546 3694
1678 3694 6078 -5955 654 -3055 -3040 10626 -772 -6197 2894 -2379 3440 4926 -10647 -2447
1692 -2447 3779 -2918 4379 -3528 -9169 7828 3542 -2384 3160 -6768 -370 9908 -5003 -4344
1706 -4344 -335 -5620 6658 2914 -10158 1340 1444 -31 8487 -5377 -6583 7353 -1072 -276
1720 -276 1855 -10401 903 6765 -5397 57 -1462 -4241 9615 1444 -6505 2758 -2467 1640
1734 1640 6720 -8794 -4075 3972 -3362 3698 -407 -9314 5492 4785 -2675 3304 -5165 -2563 9156
1749 9156 -2969 -4347 136 -6497 4457 5137 -8523 665 1952 -1864 8261 -2192 -7289 5947
1763 5947 -52 -1033 2590 -9201 -1204 6968 -3667 653 -210 -5698 7640 3512 -5595 2403 -2258
$$ packed form
1664G863p355j1417J2889q57N41N783j5635L456J2923r421K367j895j0788J5240
1678C694K384j2033O609l709J5J3666j1398n425R091n273N819J486j5573Q200
1692b447O226o697P297p907n641J6997m286n926N544r928O398J0278j4911O59
1706d344M009n285J2278l744j3072J1498J04j475Q518j3864j206J3936q425P96
1720b76K131j2256J1304N862j2162N454j519k779J3856q171p949R263n225M107
1734A640N080j5514M719Q047p334P060m105q907J4806p07p460N979q469K602J1719
1749I156j2125j378M483o633J0954O80j3660R188J287l816J0125j0453n097J3236
1763E947n999r81L623j1791P997Q172j0635M320q63n488J3338m128r107P998m661
$$ plain form
1778 -2258 -965 7159 -5880 -5504 3755 -2946 2887 2411 -8289 2588 4915 -1547 3922 -3681 -4702
1793 -4702 7189 -1127 -3500 1309 -6225 1756 6291 -6271 -392 2237 -2245 6915 485 -7025
1807 -7025 3339 158 -1078 3716 -7042 -3206 5535 -2268 1080 1054 -5750 5180 4713 -4219 1768
1822 1768 -2135 -2201 6748 -3042 -5447 1885 -2713 2371 4085 -6425 518 4289 -1104 4212 -1415
1837 -1415 -5700 4933 625 -3042 1115 -5403 -328 6787 -2816 -1251 1155 -2335 5826 2572 -5675
1852 -5675 959 -177 -911 4192 -4566 -4409 4374 -477 927 1789 -5085 2853 5741 -1717 429 -2051
1868 -2051 -3149 5239 -404 -4324 517 -2248 1838 4765 -4279 -1029 3641 209 3434 -383 -5758
1883 -5758 2394 2270 -1389 594 -4597 -1515 5505 -88 -1082 825 -1689 4240 3728 -4214 -882 234
$$ packed form
1778b258J293Q124j3039L76R259o701N833m76j0700J0877K327o462N469p603j021
1793d702J1891q316k373M809p534P981M535j2562N879K629m482R160o430p510
1807g025J0364l181j236M794j0758L836Q741p803L348k6o804J0930m67q932N987
1822A768l903o6Q949r790k405P332m598N084J714j0510O943L771n393N316n627
1837a415m285J0633m308l667M157o518N075P115r603J565K406l490Q161l254q247
1852e675O634j136p34N103q758J57Q783m851J404Q62o874P938K888p458K146k480
1868b051j098Q388n643l920M841k765M086K927r044L250M670l432L225l817n375
1883e758Q152j24l659J983n191L082P020n593r94J907k514N929n12p942L332J116
$$ plain form
1899 234 -159 3758 -3003 -5010 2079 1508 1629 1557 -4076 576 4863 156 -9 -2085 -2914 3782 1309
1916 1309 -3671 -1050 -1441 1781 4862 -1675 -2375 1887 1414 3137 285 -4607 -295 2042 224 144
1932 144 -3358 -1643 4267 1818 -831 -599 -1271 2892 3899 -1553 -2311 -846 583 2547 -1165 -3880
1948 -3880 100 2042 2344 1408 -2294 -429 3503 2054 -221 -2441 -2338 2031 2258 -1553 -2269 -1271
1964 -1271 1464 3725 323 -2457 -212 2355 3014 487 -2919 -1899 1324 1911 -61 -2529 -1915 2344
1980 2344 3497 584 -1379 -491 1777 2819 413 -2712 -2111 1403 2093 -99 -2439 -1602 2045 3058
1996 3058 413 -1114 -701 1723 3432 247 -2972 -1834 817 2184 268 -2691 -1441 1823 3037
2011 3037 2119 -1362 -2213 2308 2959 279 -1817 -2678 514 3120 108 -1798 -1656 118 4212 1922
$$ packed form
1899B34l93L917o761k007P089n71J21p2n633M652M287m707j65k076q29O696k473
1916A309m980K621l91L222L081o537p00M262m73J723k852m892M312K337j818q0
1932A44l502J715N910k449k649K32o72M163J007n452p58J465J429J964l712k715
1948c880L980J942L02r36l702J865L932j449k275k220J03M369K27l811p16R98
1964a271K735K261l402k780K245K567O59k527l406J020L223N87j972k468O14M259
1980B344J153k913j963Q88K268J042k406l125O01L514O90k192k340Q37L647J013
1996C058k645j527M13K424J709l185l219J138K651J367j916k959J250L264J214
2011C037r18l481q51M521O51k680k096q61L192K606l012j906J42J774M094k290
$$ plain form
2027 1922 -2471 7 1356 1456 2019 -2371 -3084 1684 1115 -35 -892 -3005 2012 4464 -346 -321 -472
2044 -472 -497 4027 1184 -3888 -1107 306 1604 2152 -3051 -2370 2435 2070 2300 -32 -3407 1761 3713
2061 3713 48 -1164 -2791 -991 3107 532 -1219 -750 -726 3667 3097 -2526 -392 1244 675 2632
2077 2632 -1696 -3554 1718 699 484 565 -3902 1012 4932 -678 -21 381 -1867 3876 2229 -4020
2093 -4020 -937 -548 688 3788 -2315 -2887 2851 1087 2023 1800 -4132 288 3909 -169 166 -1904
2109 -1904 -2374 3359 791 -1812 247 -1211 2239 4298 -1889 -990 1268 29 2345 -825 -3737
2124 -3737 1368 838 311 1892 -3262 -491 5156 -220 -375 865 -2533 2656 3086 -3273 -649 -884
2140 -884 -630 4284 -1305 -3458 2685 629 1335 3148 -3433 -683 3527 -413 246 -1187 -3284 2910
$$ packed form
2027A922m393K478J349J00N63m390p13M768n69j150q57k113N017K452m810K5j51
2044d72k5M524k843n072K781J413J298N48n203O81M805l65K30k332l375N168J952
2061C713l665j212j627J800M098k575j751M69K4M393n70n623K134J636n69J957
2077B632m328j858N272j019k15Q1m467M914L920n610O57M02k248N743j647o249
2093d020L083L89J236L100o103n72N738j764R36k23n932M420L621m078L35k070
2109a904m70N733k568k603K059j458L450K059o187Q99K258j239K316l170k912
2124c737N105n30n27J581n154K771N647n376j55J240l398N189M30o359K624k35
2140h84K54M914n589k153O143k056P06J813o581K750M210l940O59j433k097O194
$$ plain form
2156 2910 1946 -1829 944 -1298 370 4603 -1193 -1548 1380 -325 2184 447 -4086 670 1038 -521
2172 -521 2467 -2333 -2304 4667 1147 -159 878 -2960 1442 3121 -2946 -403 -398 -1502 4588 104
2188 104 -4091 2345 657 516 3599 -2795 -1996 3339 -163 519 -293 -4274 2197 2622 -1974 979
2204 979 -584 -350 5003 -59 -2729 872 -1246 1755 2192 -4192 -426 1762 -698 2618 -705 -3313
2220 -3313 3310 1596 -421 1164 -2806 417 4056 -2071 -1115 -216 -2547 3683 2171 -3706 1322
2235 1322 1334 206 3334 -2236 -2715 2637 -247 535 479 -4217 1139 3580 -1946 655 -444 -1836
2251 -1836 4342 1074 -2303 843 -1205 538 2478 -3809 -1555 1964 -619 2317 420 -3416 2040
2266 2040 2091 -660 1208 -2637 -1303 3821 -1025 -1480 551 -2569 2089 2790 -3183 98 1267 -77
$$ packed form
2156B910r64l775K773k242J668M233n796l55K928j705K509j737m533M756L68j559
2172e21K988m800K9O971l520j306J037l838M402J679o067K543Nj104O090m484
2188A04m195O436j688j41L083o394P99N335l502O82q12l981O471M25m596K953
2204I79j563K34N353n062k670L601k118L001M37o384L766K188k460L316l323k608
2220c313O623j714k017J585l970L223L639o127R56Q99k331O230j512n877N028
2235A322J2j128L128n570m79N352k884P82n6m696N356K441n526K601j099j392
2251a836O178l268l377L146k048J743J940o287K254L519k583K936j897l836N456
2266B040N1k751J868l845J334N124m846m55K031l120M658P01n973L281J169j344
$$ plain form
2282 -77 3347 -1015 -3060 2164 -250 -139 1178 -4015 -126 3787 -751 391 180 -2080 3205 1616
2298 1616 -2571 368 -1230 -40 3176 -2498 -2161 1842 -653 1367 1356 -3533 1206 2691 -523 1428
2314 1428 -1779 -2208 3165 -60 -1725 483 -2204 1349 3475 -2228 -564 948 -758 2720 -58
2329 -58 -3412 1280 659 -339 1622 -3083 -1326 2986 -494 16 375 -2062 2365 2098 -2157 6 -1265
2346 -1265 -841 3104 -1234 -2349 1667 -111 1271 1867 -2986 -278 2138 -396 962 -963 -2641
2361 -2641 2471 656 -1729 235 -2018 264 3305 -1232 -959 952 -702 2154 740 -3259 87
2376 87 409 -365 1437 -1945 -1708 2592 421 -24 206 -2336 1063 2424 -1385 -309 -765 -1128 2400
2393 2400 -418 -2720 497 -10 769 2006 -2083 -745 1732 -175 839 -562 -2649 1077 1049 -926
$$ packed form
2282g7L424m362k045N224k414J11J317n193L889L913m538J142k11k260N285j589
2298A616m187K939j598J190L216n674L37M003k495K020j1m889M739J485l214J951
2314A428l207m29N373l225j665K208k687L553K126n703J664J512j706L478k778
2329e8l354M692o21r98J961m705J757M312l480N10L59k437M427k67m255K163j271
2346a265M24L945m338j115M016j778J382N96m853K708K416k534J358j925j678
2361b641N112j815k385J964k253K282L041m537K73J911j654K856j414l999L346
2376H7L22p74J802l382K37M300k171m45K30k542L399J361l809J076m56l63L528
2393B400k818k302L217n07P79J237m089J338K477j907J014j401k087L726k8j975
$$ plain form
2409 -926 477 -1507 -692 2745 -181 -1330 141 -738 1380 1341 -2226 -661 115 -383 1344 -1152 -2104
2426 -2104 1524 936 178 592 -1696 292 1901 -831 -659 -913 -1301 1897 538 -1778 77 -233 352
2443 352 1828 -1280 -1380 907 251 729 -232 -2328 188 1159 -674 -29 -1104 -1084 2160 1061 -971
2460 -971 -356 -798 829 1009 -1273 -1178 -158 116 1557 -364 -1973 401 1093 348 173 -1325 -357 1284
2478 1284 334 -470 -1452 -1325 745 748 -1276 -569 -286 587 1717 -456 -1702 -203 261 886 15 -1972
2496 -1972 -557 1068 293 -15 -931 -1427 899 1332 -350 -955 -473 675 1060 -507 -1395 -946 162
2513 162 928 343 -1448 -845 1321 1265 -451 -1342 -782 111 965 -36 -1490 -1055 755 1105 -270 -1339
2531 -1339 -853 644 1300 393 -989 -760 350 1232 -22 -1744 -1297 545 787 -26 -660 -983 42
$$ packed form
2409i26J403j984Q15L437k926j149J471q79K118l9l567J565P76m98J727k496r52
2426b104L628n88p58M14k288J988J609k732J72k54l88L198j359k316J855l10N85
2443C52J476l108j00K287o56M78r61k096K516R71j833O45j075K0L244j099k032
2460i71O15m42J627J80k282R5J020K74J441j921j609K374O92p45j75j498R68J641
2478A284r50q04r82J27K070Lk024P07K83Q73J130k173j246J499M64O25q71j987
2496a972J415J625p75l08r16m96K326M33j682o05M82J148L85j567q88M49J108
2513A62P66n85j791O03K166n6j716q91N60Q93Q54j001j454M35J810L50j375j069
2531a339M86J497O56r07j382K29J110Q82j254j722M47J842K42q13o34l23J025
$$ plain form
2548 42 1572 252 -1468 -789 210 869 364 -1383 -1177 350 461 254 -595 -1793 616 1868 -378
2565 -378 -760 -341 -445 891 344 -1618 -940 228 816 745 -1239 -1113 1139 645 303 -380 -1477 -127
2583 -127 1445 253 -1059 -1201 203 1183 -170 -858 -650 -477 1340 1170 -1282 -1020 43 417 660
2600 660 -1220 -1574 736 406 464 248 -1892 -225 1969 -353 -926 -583 -704 1309 769 -1595 -613 -384
2618 -384 156 1597 -1015 -1728 1243 735 240 145 -1711 -218 1392 97 -514 -1258 -868 1980 435
2635 435 -1114 -362 -685 539 1814 -1085 -1374 137 391 1183 -776 -1974 237 566 -20 622 -1552
2652 -1552 -739 1859 233 -520 -501 -1205 1062 1116 -1519 -362 -293 -58 1852 -682 -2220 748 662 368
2670 368 627 -1972 -439 1551 -246 43 -1083 -1555 1778 935 -1328 -101 -626 25 2000 -706 -1441
$$ packed form
2548D2J530j320j720O79R99O59n05j747K06J527J11k07q49j198K409J252k246
2565c78l82M19j04J336n47j962O78J168N88p1j984J26K252m94l42o83j097J350
2583a27J572j192j312j42J404R80j353o88K08J73J817j70k452K62J063L74K43
2600F60j880l54K310l30N8k16k140J667K194k322n73L43j21K013n40k364R82K29
2618c84N40J441k612p13K971n08m95r5j856J493J610j295o11p44L90K848j545
2635D35j549P52l23J224J275k899k89J511K54P92j959j198K211L29n86O42k174
2652a552Q13K598j626p53J9p04K267N4k635J157O9K35J910k534j538K968q6k94
2670C68K59k599J533J990j797K89j126m72L333q43k263J227n25O51J975k706p35
$$ plain form
2687 -1441 -96 -285 982 375 -2155 344 782 -414 826 -1144 -1460 1680 574 -462 -137 -1249
2703 -1249 793 1391 -1315 -310 -148 -912 1630 219 -1953 470 463 125 561 -1646 -689 1140 -356
2720 -356 257 -347 -1995 1061 1387 -1168 -201 -498 -526 1746 -212 -1206 214 -654 709 828 -1861 -199
2738 -199 1056 -330 983 -344 -1578 976 681 -490 290 -1247 -11 1725 -874 -516 121 -973
2754 -973 1308 726 -1753 139 426 226 1412 -1118 -1213 1226 -218 153 166 -1814 512 1649 -684
2771 -684 -23 -324 -908 1618 79 -1144 216 -594 482 1367 -1411 -813 871 -333 833 168 -1801
2788 -1801 806 779 -382 486 -1210 -563 1872 -485 -616 333 -1331 809 1391 -1331 -334 158 -202
2805 -202 1346 -507 -1477 917 -31 -5 741 -1436 -207 1495 -239 -51 -8 -1002 1304 683 -1269 390
$$ packed form
2687a441J345j89J267o07k530K499M38j196J240j970l16L140j106j036L25j112
2703a249K042N98k706J005J62p64K542j411k172K423pl38M36k207R57J829j496
2720c56O13o04j648L056L26k555R67k97k8K272j958r94J420q68J363J19k689J662
2738a99J255j386J313j327j234K554k95j171P80j537J236J736k599L58O37j094
2754i73K281n82k479J892K87k00J186k530r5K439j444L71J3j980K326J137k333
2771f84O61l01n84K526j539j223J360q10J076Q85k778N98J684j204J166o65j969
2788a801K607k7j161Q68j696O47K435k357j31R49j664K140N82k722R97M92l60
2805b02J548j853r70K394r48K6P46k177J229J702j734J88M3r94K306o21j952J659
$$ plain form
2823 390 -584 -233 1550 -906 -965 693 -224 702 611 -1482 181 803 -239 756 -845 -1028 1409 148
2841 148 -579 317 -1215 397 1627 -809 -509 226 -378 1207 131 -1417 517 62 91 1005 -1173
2858 -1173 -750 1384 19 146 164 -1109 660 1247 -782 -25 -299 -479 1575 -199 -1287 522 -33
2875 -33 516 1039 -1245 -166 868 -216 670 -348 -1503 1038 768 -535 217 -854 -167 1548 -371
2892 -371 -616 138 -508 1202 624 -1449 5 193 -48 996 -817 -1079 1044 593 157 150 -1247 199
2910 199 1206 -469 13 -309 -383 1486 520 -1213 136 -203 318 1220 -935 -822 648 203 619 133
2928 133 -1272 507 959 -232 218 -779 -509 1494 30 -763 -129 -362 781 969 -860 -433 253 -70
2946 -70 952 -307 -1092 500 533 196 217 -1156 -196 1118 62 -171 -472 -580 1103 819 -806 -150
$$ packed form
2823C90r74L51J783k456n9J658r17R26r1k093J663O22j042R95j601j83K437j261
2841A48p27Q96j532J612J230k436L00P35o04J585j076j548J934m55K9R14k178
2858a173M23K134j365J27J8j273J769N87k029P57k74j80K054j774j088J809n55
2875c3N49N23k284J079J034j084Q86j018j155K541k70j303P52j071O87J715j919
2892c71k45P54o46J710n78k073J454J88k41J044j813k62K123m51m36pj397J446
2910A99J007j675M82l22p4J869r66j733J349l39N21R02k155J13J470m45M16m86
2928A33j405J779M52j191M50r97K70K003j464p93O34k33J143J88j829M27O86l23
2946g0J022j259p85J592L3l37K1j373R60J314j056k33l01j08J683k84j625O56
$$ plain form
2964 -150 -34 206 1012 -377 -796 581 278 848 226 -1175 173 1063 75 232 -400 -753 1049 573
2982 573 -534 -246 -478 430 956 -483 -431 163 -43 775 165 -1119 14 522 422 166 -686 -426 868
3001 868 320 43 -28 -549 622 893 -465 -388 10 168 841 -209 -842 -2 268 669 542 -882 -277
3020 -277 841 462 75 -250 -634 573 1007 -88 -195 -424 396 970 -172 -666 -38 1 585 290 -682
3039 -682 -481 571 438 306 -286 -375 551 623 57 -32 -306 215 941 69 -457 -312 449 742 251 -416 -175
3060 -175 198 557 454 -687 -563 475 732 95 -348 -568 83 718 207 -320 -635 354 735 349 -572
3079 -572 -336 132 428 395 -299 -597 105 786 226 -261 -463 243 611 196 -282 -189 83 568 475 -640 -590
3100 -590 279 528 207 -302 -452 297 763 301 -210 -693 42 740 244 -454 -215 -4 564 536 -165 -649
$$ packed form
2964a50J16K40Q06j389m19J377l03N70o22j401J348Q90r88J57o32l53J802m76
2982E73j107K88k32R08N26j439N2N94k06Q18o10j284J133N08j00k56q52K60J294
3001H68n48k77p1n21J171K71j358P7L98J58O73j050o33Q40K70M01j27j424O05
3020b77J118l79l87l25l84J207M34j095j07k29Q20N74j142m94O28L9N84k95r72
3039f82K01J052j33j32n92q9R26P2n66q9k74N21P26q72n26J45P61K93m91o67K41
3060a75L73L59j03j141J24J038K57o37m43k20O51O35n11n27l15R89L81l86r21
3079e72K36M68K96l3o94k98P02O81n60m87k02P06L68m15m78R3K72M85r3j115N0
3100e90Q69K49l21n09j50P49M66m62n11m83P35O98m96o98K39K11N68k8p01m84
$$ plain form
3120 -649 45 600 596 -110 -410 224 413 349 180 -712 -415 615 300 -200 -251 -146 738 412 -393 -129 -94
3141 -94 64 678 -368 -702 478 290 142 53 -823 -61 834 162 202 -340 -694 763 520 -660 -295 -40
3161 -40 284 712 -50 -620 -29 175 727 174 -898 -26 523 239 114 -249 -491 553 461 -26 -451 -370
3181 -370 421 723 -522 62 66 -97 778 -91 -1006 255 518 157 393 -836 -169 777 -8 129 -133 -824
3201 -824 726 974 -441 -196 -102 -64 806 -123 -522 198 -105 667 503 -939 -263 580 -126 246 -363 -617
3221 -617 692 384 5 81 -684 177 1032 -355 -140 -119 -278 596 277 -950 -131 165 368 612 -660
3240 -660 -464 705 17 237 81 -1032 168 868 -390 -206 -195 -306 1064 145 -746 120 -239 442 741
3259 741 -747 -343 685 7 162 -144 -779 478 568 -80 248 -532 -186 975 -42 -497 -163 -422 473
$$ packed form
3120f49O94N55mp06l00O34J89o4j69q92K97J030l15n00n1J05Q84l26q05K64L5
3141i4J58O14j046l34J180j88j48q9q76P62Q95o72M0n42l54J457k43j180L65K55
3161d0L24M28p62n70N91K04N52n53j072Q72N49k84j25l63k42J044r2m87m25Q1
3181c70P91L02j245N84Mj63Q75q69r15J261K63l61K36j229O67R46p85J37k62o91
3201h24J550K48j415K45R4L8Q70r29l99P20l03P72j64j442O76Q43p06L72o09k54
3221f17J309l08l79P6p65Q61Q55j387K15K1j59Q74l19j227Q19K96K03K44j272
3240f60J96J169o88K20j56j113J200P00j258J84J1j11J370r19q91Q66l59O81K99
3259G41j488M04J028o78J55l06o35J257R0o48L28p80L46J161j017m55L34k59Q95
$$ plain form
3278 473 349 -625 -48 256 162 897 -334 -629 726 -194 102 391 -752 -29 885 -338 -359 -236 -470
3297 -470 809 298 -557 208 -233 160 740 -579 -584 362 -13 596 82 -842 137 422 -294 84 -604 -424
3317 -424 956 30 -381 92 -442 137 505 -745 -303 -11 114 578 -34 -808 441 115 -225 295 -653
3336 -653 -356 737 -166 -130 -133 -704 335 416 -745 65 -58 -67 786 -294 -603 381 -35 14 132 -862 219
3357 219 588 -217 161 -263 -585 661 172 -434 33 -443 231 811 -350 -286 177 -479 694 87 -721
3376 -721 312 161 29 449 -427 -482 491 -154 -199 11 -543 252 627 -370 166 -216 -157 684 8 -652 323
3397 323 29 197 391 -618 -427 277 -76 194 70 -506 525 440 -233 -145 -405 -237 581 -160 -374 -2
3417 -2 -263 356 353 -732 -99 215 -120 408 -224 -670 193 90 -36 36 -587 -86 435 -308 45 17 -314 511
$$ packed form
3278D73j24r74N77L04r4P35j231k95J355r20K96K89j143P23R14j223k1J23k34
3297d70J279n11q55P65m41L93N80j319nR46l75O09n14r24R79K85p16L78o88J80
3317d24J380r26m11M73n34N79L68j250M42K92J25M64o12p74J249l26l40N20r48
3336f53K97J093r03L6ln71J039Q1j161Q10j23rQ53j080l09R84m16M9J18r94J081
3357B19L69q05L78m24l22J246m89o06M67m76O74N80j161O4M63o56J173o07q08
3376g21J033j51j32M20q76n5R73o45m5K10n54P95L75r97N36l82N9Q41o76o60R75
3397C23k94J68J94j009J91P04l53K70j24n76J031q5o73Q8k60J68Q18p41k14L72
3417bk61O19lj085O33L14l35N28o32m46Q63j03j26P2o23N01N21p43L53k8l31Q25
$$ plain form
3439 511 147 -576 -74 -167 86 373 -352 -370 345 -53 258 88 -812 32 424 -203 140 -331 -457 544
3459 544 5 -403 130 -381 205 481 -400 -57 207 -68 334 -11 -559 20 230 128 123 -576 -174 462 -75
3480 -75 -73 -202 -494 412 437 -230 -127 -187 45 123 -147 -560 20 93 403 326 -725 -310 464 -103 -114 -304 -457
3503 -457 280 296 -218 -302 -281 152 440 -380 -148 106 -29 341 131 -436 -175 42 62 40 -435 -182 455 403
3525 403 -162 -107 -303 -42 342 -167 -314 -167 -67 530 160 -481 -73 111 -5 114 -423 -421 395 205 27
3546 27 -423 -510 165 330 -97 10 -268 -6 526 74 -361 -172 -13 97 128 -406 -231 260 165 161 -323 -472
3568 -472 108 502 -92 -138 -232 -100 289 133 -257 -422 160 295 72 -459 -97 104 169 48 -404 -416 34
3589 34 134 84 -296 -233 114 103 -95 -208 -528 -57 553 287 -371 -158 110 325 164 -467 -644 161 365
$$ packed form
3439E11l64p23N02r3K53K87p25j8P15l98L11j70r00Q44L92o27L43m71j26J001
3459E44n39m08N33n11N86K76q81L43K64k75M02l45n48N79K10j02no99M02O36n37
3480g5Kj29k92R06K5o67J03o0K32P8k70m13N80P3L10p7j051M15P74n67j1j90j53
3503d57P37J6n14q4K1M33K88q20K32K54j35L70k10n67K61K17K0k2m75K53O37n2
3525D03n65N5j96K61L84n09j47J47J00N97l70o41M08J84j16J19n37KQ16j90j78
3546B7m50q7O75J65m27J07k78K62N32m52m35J89J59J10L1n34J75M91r5mm84j49
3568d72N80L94n94m6r4J32L89j56l90j65N82J35k23n31L62K01O5j21m52j2M50
3589C4J00n0l80O3L47j1j98j13l20M71O10k66o58K13K68K15j61o31j77Q05K04
$$ plain form
3610 365 75 -65 -562 -117 418 216 -263 -351 -110 180 357 -152 -446 20 320 27 -390 -379 -62 355 366
3631 366 -127 -176 -33 212 164 -371 -553 -75 329 225 -172 -366 -173 231 354 -154 -395 -72 364 319 -175
3652 -175 -294 -264 416 200 -158 -358 -142 416 311 -129 -194 -21 79 387 -174 -360 -156 291 369 15 -387
3673 -387 -60 262 -35 -39 -185 -177 426 201 -106 -324 -95 108 247 -138 -261 -113 77 351 70 -337 -82
3694 -82 129 155 -181 -279 -205 245 305 -53 -31 -401 180 397 -151 -245 12 120 173 -66 -571 69 122 123 169 -358
3718 -358 -156 401 -131 -197 -191 -533 241 392 -168 -296 -276 -47 366 62 -322 73 -124 316 167 -303 -163
3739 -163 298 -77 100 -140 -616 233 351 -37 -46 -334 -32 530 -10 -464 -147 -286 179 300 -523 10 175
3760 175 15 319 -197 -533 304 135 -129 101 -347 72 438 -72 -252 -9 -74 453 145 -195 32 0 129
$$ packed form
3610C65k90j40m97M45N35k02m79q8K41K90J77n09k94M66L00k93m17J1L17M17J1
3631C66m93m9J43K45m8n35j82M78M04j04l97j94J93M04J23n08k41L23M36m5m94
3652a75j19L0O80k16l58k00K16N58j05m40o5J73J00L08n61j86K04M47P8l54m02
3673c87L27L22k97mj46QO03k25l07k18K29K03J39l85j23J48J90K74k81m07K55
3694h2K11K6l36r8P4M50O0l58K2l70N81K17n48r4K57J08N3k39n05O40N3JM6n27
3718c58K02N57n32o6Ol42P74J51n60j28K0K29M13l04l84L95j97M40j49m70J40
3739a63M61l75J77k40m76Q49J18l88rk88L02N62n40m54L17j39M65J21q23N33J65
3760A75j60L04n16l36Q37j69k64K30m48M19L66n10j80K43o5N27l08l40K27l2J29
$$ plain form
3781 129 478 -187 -448 224 84 169 99 -515 105 211 -160 62 -240 -185 451 54 -295 -2 23 213 376
3802 376 -318 -269 220 64 249 144 -477 218 208 -59 130 -337 -244 571 90 46 -153 -351 363 455 -282 7
3824 7 -114 4 460 -135 -411 240 -155 127 -49 -510 45 438 113 310 -98 -337 426 51 -269 -55 -336
3845 -336 108 417 -340 -307 1 -92 359 259 -474 229 301 120 270 -286 -295 318 -47 -38 -83 -307 505 512 -377
3868 -377 -53 17 5 457 -39 -424 112 81 335 274 -459 -102 299 -10 158 6 -319 617 304 -189 -41
3889 -41 -386 -72 424 -105 -205 174 -176 233 234 -508 -70 249 98 326 -204 -297 422 213 -163 149 -294
3910 -294 117 454 -54 36 -128 -69 496 44 -582 -22 -114 173 442 -253 -164 379 149 39 -76 -295 86
3931 86 485 -153 -90 -315 25 420 74 -286 140 -102 342 578 -396 -50 266 88 323 -214 -471 223 377
$$ packed form
3781A29L49o65k61O72j40Q5p0o14O20J06l71K22l02N5O36l97l49K93K5J90J63
3802C76o94M9M89j56J85j05o21O95j0k67J89m67R3Q15m81m4j99j98P14R2p37K89
3824Gj21J18M56n95k76O51l95K82j76m61N55L93l25J97m08k39P63l75l20K14k81
3845c36M44L09p57L3L08r3M51j00p33P03P2j81J50n56rO13l65Rm5k24Q12Pq89
3868c77L24P0j2M52m96l85N36l1K54o1p33L57M01l09J68j52l25R36l13m93J48
3889d1l45L14M96n29j00L79l50M09Jp42M38L19j51K28n30r3P19k09l76L12m43
3910b94M11L37n08R0j64N9N65m52o26N60r2K87K69o95Q9N43k30j10j15k19L81
3931H6L99o38O3k25L40L95l46l60M26k42M44K36r74L46L16j78K35n37k57O94J54
$$ plain form
3952 377 66 219 -275 65 508 -104 -163 -92 -101 230 268 -207 20 -76 -35 230 -298 -220 -6 53 295 155 -479
3975 -479 2 358 -108 -25 -280 -243 564 305 -168 -22 -178 180 475 -271 -221 303 161 240 53 -325 -112
3996 -112 234 -66 138 -220 -66 334 0 96 -100 -46 241 307 -41 -125 -100 26 278 -134 -338 34 116 169
4018 169 182 -440 -155 253 -120 109 -47 -266 182 164 -98 78 -224 78 393 -36 -218 31 178 256 37
4039 37 -223 -3 249 64 99 -179 -246 158 212 -22 29 -225 60 331 -26 -350 -115 -15 362 57 -89 282
4061 282 9 225 126 -106 -162 -39 21 25 -126 -378 241 184 -67 4 -100 -49 254 251 -239 6 58 337 94 -36
4085 -36 -346 206 144 141 -41 -300 22 266 212 -65 -182 -93 345 209 75 -64 -131 287 146 -122 31 107 149
4108 149 209 -6 -209 -69 44 155 34 -253 92 314 196 -66 -160 -99 227 112 -154 -268 -26 -38 196
$$ packed form
3952C77l11J53m94L40M43o12n9P1rL31L8m75K27r6M1K65n28P8K14N9K42j40o34
3975d79M81L56m66Q3k55L7Q07k59m73J46j56L58K95p46N0N24j42P9j87l78K13
3996a12L46l00K04l58J54M00l34R6j96N4K87O6l48q4K5J26K52m12k04L72Q2N3
4018A69J3o22K85M08l73K29j56k19M48j8k62J76l02L02L15m29j82K49J47P8k19
4039C7k60K20K52j85L5k78o7M04N4k34N1k54K85K71l57l24K35J00L77l05j46L71
4061B82k73K16r9k32n6J23O0Mj51k52O19n7k51P1j04N1L03lm90K45N2K79k43j30
4085c6l10N52o2lj82k59L22K44n4k77j17Q9M38j36j34j39o7M18j41k68J53P6M2
4108A49O0k15k03J40J13J11j21k87L45K22j18k62r4O1L26j15k66j14K42j2K34
$$ plain form
4129 196 -151 -122 94 48 159 142 -325 139 77 62 22 -217 -78 129 209 -32 -134 -38 270 360 -157 -200 22
4152 22 46 3 -135 -347 -240 241 255 -54 -214 -360 418 132 9 -286 -23 226 453 79 -223 -152 175 111
4174 111 17 -321 -89 183 226 2 -335 -169 122 219 -62 -236 -197 51 159 -157 -243 -97 291 275 96 -246
4196 -246 -9 257 239 81 -86 -169 235 215 -28 -109 -192 146 258 -125 -73 -68 68 133 317 -171 -68 140 260
4219 260 -70 -195 -237 91 327 39 -143 -237 196 96 108 -237 -171 -104 252 74 -280 -237 3 188 234 -376
4241 -376 -386 -37 261 7 -247 -81 131 286 -60 -113 -139 41 258 128 -280 20 70 144 117 -167 -310 -37
4263 -37 184 132 -63 -344 -60 171 54 -180 -297 -30 237 187 -263 14 -90 171 127 -201 -181 -88 173 277
4285 277 -128 -119 74 192 30 108 -235 -68 227 126 -92 -230 -149 41 182 -253 7 35 128 348 -70 -397
$$ packed form
4129A96l47K9K16m6J11j7m67M64o2j5m0k39J39K07Q0k41j02R6L08R0n17m3K22
4152B2K4m3j38k12J07M81J4l09j60j46P78k86j23k95K63K49K27l74l02P1L27o4
4174A11r4l38K32K72M3k24l37J66K91R7k81j74L9K48J08l16q6J46L88j6j79l42
4196b46K37K66j8j58j67q3M04k0k43q1q3L38J12l83N2NJ36O5J84m88J03K08J20
4219B60l30j25m2L28K36k88j82r4M33j00J2l45O6O7L56j78l54M3K40J85M6o10
4241c76j0L49K98k54k54J66K12J55l46n3k6J80K17j30m08L00N0P4k7k84j43K73
4263c7K21n2j95k81K84K31j17k34j17K67K67n0m50K77j04K61m4l28K0R3K61J04
4285B77m05RJ93J18j62P8l43J67K95j01k18j38Q1J90J41m35K60K8R3K20m18l27
$$ plain form
4307 -397 135 243 36 -42 -264 -26 90 -19 -24 -87 -301 254 -44 -191 -188 -247 -37 216 -132 -182 50 53 252
4330 252 137 -300 98 107 51 120 -251 -139 272 35 -179 -20 -242 203 198 -355 -144 72 -78 257 -65 -365
4352 -365 26 9 158 38 -243 17 219 -141 -14 -53 -210 152 195 -214 55 -174 7 319 -67 -102 -51 -1
4374 -1 132 145 -341 15 65 -22 93 -269 -194 329 242 -160 19 -186 65 230 25 -146 -153 -96 123 73 -322 -37
4398 -37 -4 135 210 -337 -168 308 7 51 -75 -412 13 221 0 -8 -176 -75 280 -52 -169 -145 -155 181 221
4421 221 -334 -87 -2 34 153 -87 -355 4 27 -130 52 -110 19 489 -55 -53 62 -38 349 197 -249 -97
4443 -97 -40 168 218 -119 -310 4 -102 26 101 -259 -99 187 -159 4 -201 -224 269 44 -352 -96 9 -1
4465 -1 439 -158 -142 20 -175 296 -15 -218 -54 -31 131 69 -193 -93 365 120 38 -129 -199 181 240 -217 -233
$$ packed form
4307c97N32J08k07p8k22K38J16j09no3k14N55k98j47Ln9K10K53l48n0K32LJ99
4330B52j15m37L98Rn6O9l71J12M11k37k14J59k22M45nn53K11K16j50L35l22l00
4352c65L91j7J49j20k81K60K02l60J27l9j57L62M3m09K69k29J81L12l86l5N1N0
4374aJ33J3m86L56N0q7J15l62P5N23q7m02J79k05K51J65k05j71pN7K19n0l95K85
4398c7L3J39P5n47J69M76l01M4j26l37M25K08k21qj68J01L55l32j17K4j0L36M0
4421B21n55K47Q5L6J19k40k68L59K3j57J82j62J29M70n44KJ15j00L87j52m46J52
4443i7N7K08N0l37j91L14j06J28P5l60J60K86l46J63k05k3M93k25l96K56J05j0
4465aM40n97J6J62j95M71l11k03J64K3J62o2k62J00M58k45q2j67p0L80N9m57j6
$$ plain form
4488 -233 56 -7 181 -256 -309 92 -23 52 -65 -249 -28 116 92 -126 -208 -300 109 158 -80 -34 -118 -44 300
4511 300 -111 -222 148 74 203 106 -500 20 226 129 212 -78 -330 309 70 -369 78 -116 193 180 -239 -60
4533 -60 -101 -158 222 -2 -400 6 200 190 40 -458 -6 97 58 -44 -34 -268 177 311 35 -5 -43 4 190
4556 190 12 -159 -61 102 102 61 -241 123 134 -7 176 -223 -337 186 139 -142 -14 -254 -135 325 88 -226
4578 -226 -293 -106 292 15 -49 -81 16 134 49 -195 23 227 108 -68 -127 -144 56 205 -52 94 -31 105
4600 105 156 41 -149 66 -11 200 153 -189 -43 23 38 79 -11 -135 -4 287 62 -61 -247 -152 254 132 -117
4623 -117 -90 -8 131 220 -9 -40 -137 107 214 -19 -134 -37 177 254 5 15 -207 98 -105 -124 -71 -130 100 21
4647 21 -60 -47 -62 14 195 35 -145 39 -122 140 105 -154 87 26 46 -142 -136 -111 305 108 -166 -3 -113 -23
$$ packed form
4488b33K89o3J88m37n3M01j15P5j17j84K21J44k4k18q2r2M09M9k38M6q4P4L44
4511C00m11j11L70p4J29r7o06N20K06r7Q3k90k52O39k39m39M47j94L09j3m19J79
4533f0m1n7L80k24l98M06J94j0j50m98M52J03l9j02J0k34M45J34k76m0l8M7J86
4556A90j78j71R8J63%m1l02L64J1j41J83l99j14N23m7k81J28k40J19M60k37l14
4578b26o7J87L98k77o4l2R7J18q5k44K18K04j19j76n9j7K00J49k57J46j25J36
4600A05N1j15j90K15p7K11m7l42J46O6J5M1r0j24J31K91k25j23j86R5M06j22k49
4623a17K7Q2J39Q9k29l1r7K44J07k33j15R7K14P7k49J0k22L05k03j9N3n9K30p9
4647B1q1J3j5P6J81j60j80J84j61K62l5k59K41o1K0j88OK5M16j97k74J63j10R0
$$ plain form
4671 -23 32 52 -101 -80 109 133 54 -131 -95 185 63 63 -178 -17 -25 171 34 -227 -90 -33 167 -132 -152 -80 34
4696 34 331 -112 -260 -133 77 151 -126 -191 -49 86 74 67 5 -104 204 -24 53 -214 -41 114 232 192 -102
4719 -102 -46 -58 105 7 -187 -317 146 202 -9 92 -133 72 264 90 -171 -62 23 162 -37 -131 -55 115
4741 115 80 -128 -133 -159 -48 38 169 -234 -102 28 130 -71 -120 -130 92 218 82 116 -52 -50 170 27 -113
4764 -113 -79 103 126 -45 -32 -50 27 131 34 -205 -127 -100 72 -36 -138 -1 84 180 147 -269 -246 205 45 -59
4788 -59 -231 -136 43 -48 -52 -157 -245 -18 221 146 -9 -121 25 208 163 -170 -35 217 131 91 25 -192 149 139
4812 139 -70 -51 -142 143 264 -12 -28 -65 -127 89 109 -39 -102 -62 37 232 51 -139 174 -71 61 14 -280
4835 -280 55 203 31 125 -114 -179 186 -60 -141 62 -30 -7 78 -13 120 178 36 8 -55 38 -42 188 -37 89
$$ packed form
4671b3N5K0j53K1J89K4p9j85L6K80j22%k41J61qJ96j37k61J37N7K00k99k0P2J14
4696C4K97m43j48J27K10P4k77o5J42J35j2po2j09L08k28P7k67J73J55J18m0k94
4719a02N6j2J63r8j94j30M63N6k11J01k25K05J92j74k61J09Q5J39j99r4P6J70
4741A15l5k08nk6J11Q6J31m03J32J30J02k01m9j0K22J26j36L4j68KK20j43j40
4764a13L4J82K3j71J3j8P7J04r7k39P8K7J72j08j02J37Q5R6l3m16K3M51j60j04
4788e9j72R5J79r1mj05q8K27K39p5j55j12J46J83m5l33J35K52q6m0o6k17L41j0
4812A39k09J9r1K85J21k76j6l7o2K16K0j48o3M0R9J95j81j90L13k45J32m7k94
4835b80L35J48j72R4k39o5L65k46q1K03r2K3Q5r1J33N8j42k8o3R3q0K30k25J26
$$ plain form
4859 89 -163 -127 206 73 -128 -88 -55 -20 46 -176 -17 -71 -38 181 -49 -127 114 157 261 21 -189 -70 146
4882 146 -119 65 -240 -216 142 157 143 46 -218 39 172 -64 -124 62 2 146 47 -142 75 230 100 71 -118
4905 -118 -205 216 120 -48 19 -107 54 116 45 -217 -5 -76 38 -159 -116 1 -26 55 39 -284 59 -4 -9 15 72
4930 72 -70 60 98 31 -65 -88 93 381 25 10 -55 58 244 9 -120 -161 188 238 91 -148 -249 50 161
4953 161 -120 -12 -152 -21 256 -56 -31 -148 2 150 107 -283 95 154 147 207 10 24 105 14 21 -110 -202 19
4977 19 150 -183 73 80 -96 175 100 -205 -124 154 -2 190 -95 29 87 88 159 -122 -147 30 144 127 -12 -181
5001 -181 2 62 72 -82 -31 -27 258 36 -172 11 -46 -5 41 24 -282 173 104 -88 121 0 72 326 66 2
5025 2 15 19 221 205 -202 2 -105 -27 290 -125 86 245 -68 80 18 -171 93 68 13 58 -86 -13 437 187
$$ packed form
4859H9k52L6L33j33k01M0L3L5O6k22J59n4L3K19k30p8K41M3J04k40k10J19K16
4882A46k65J84l05K4L58J5j4r7k64K57J33k36o0J86o0J44r9j89K17J55j30k9j89
4905a18q7M21r6j68O7j26J61O2p1k62K12p1J14j97M3J17k7Q1j6l23L43o3nK4N7
4930G2j42J30L8o7r6k3J81K88l56j5o5J13J86k35j29m1L49N0j47k39j01K99J11
4953A61k81J08j40J31K77l12K5j17J50J48m3l90L78N9pO0j97J4Q1r1Pj31r2K21
4977A9J31l33K56Pj76K71p5l05Q1K78j56J92k85J24N8JP1k81k5J77J14j7j39j69
5001a81J83O0J0j54N1MK85k22k08J83n7M1M6j7l06M55o9j92K09j21P2K54k60o4
5025BJ3MK02j6m07K04j07P8L17m15K11J59l13J48o2j89K64k5n5M5j44P3M50k50
$$ plain form
5049 187 79 60 16 -67 348 -197 -38 -90 -32 201 49 -135 -57 -9 -49 78 -106 -121 254 14 18 -87 10 142
5073 142 51 -24 56 0 104 326 107 -145 69 -11 266 87 -133 -161 22 145 78 6 -139 250 -3 17 46
5096 46 -123 46 126 32 -17 -76 63 272 125 -27 -53 55 63 48 -53 -129 94 35 20 62 -148 169 -31 -8 6
5121 6 -124 107 196 -30 -196 -72 18 41 146 -100 -185 41 -46 4 -29 -62 21 169 7 -65 -51 37 180 80 27
5146 27 -145 -108 256 202 -73 -61 250 11 90 -209 -158 30 66 127 -70 -161 -18 133 86 3 38 296 165 -118
5170 -118 -11 -98 1 -62 259 -200 -220 63 -33 60 -61 -42 77 280 43 -6 -83 -23 221 55 3 -45 -78 -14 124
5195 124 -89 -187 -50 248 112 62 -68 17 77 124 56 -220 -55 30 90 -181 -63 -165 130 162 8 40 -23 30
5219 30 2 41 -241 -117 74 112 -203 -149 -111 -51 52 -156 -115 201 -11 102 -188 -62 23 -29 148 -108 -67 -57
$$ packed form
5049A87j08j9m4q3M15n45J59n2N8K33j52j84P8M8m0J27j84j5L75k40Mj05R7J32
5073A42r1p5Q0n6J04K22k19k52K14q0K77j79k20k8J83J23o7p2j45L89k53K0K9
5096D6j69J69Q0r4m9n9J39K09j47j52k6J08Qj5j01p6K23n9j5M2k10L17k00K3J4
5121Fj30K31Q9k26j66J24R0K3J05k46q5K26q7N0l3l3Q3J48j62p2J4Q8J43j00n3
5146B7j72L7L64n4k75J2L11k39P9k99N1J88L6O1j97r1J43J51m7q3L5K58j31k83
5170a18J07q7R9o3L21m59k0K83r6R3j21J9J19K03k37m9p7O0K44j66n2m8l3O4J38
5195A24k13r8J37K98j36n0j30Q5O0M7o8k76J65Q5O0k71J18j02K95L2j54L2o3N3
5219C0k8L9k82J24J91L8l15N4L8O0J03k08M1L16k12J13k90J26Q5n2J77k56M1J0
$$ plain form
5243 -57 -111 -17 37 -101 -21 116 50 58 -316 -147 21 187 55 -126 90 -20 209 41 -58 -38 104 18 99 -160
5267 -160 -163 193 112 77 -74 -37 145 -38 -196 -78 -19 0 205 -12 -261 145 198 217 19 -156 13 157 162 -265
5291 -265 -225 -131 73 164 -135 -99 5 -33 157 63 -218 -53 -3 192 87 -57 -99 -42 -78 75 -46 -155 138
5314 138 26 -52 -84 -182 -115 -36 42 -88 -123 75 -111 -25 -118 -150 150 105 55 -99 -33 31 121 64 4 -74 22 101 -91
5341 -91 -124 1 -128 -17 143 -191 -36 -42 90 135 -240 -213 8 25 118 -50 -213 -17 99 -39 -135 11 120
5364 120 -24 -105 -112 -42 -39 105 31 -62 -254 -101 144 51 -102 59 14 123 163 -75 -172 -58 108 5 21 -57 -119
5389 -119 134 203 -295 59 19 59 84 -220 65 60 -55 40 84 -138 -106 178 17 -198 -197 -36 -11 92 5 138
5413 138 -307 -66 233 -240 -100 -22 9 164 9 29 -40 -189 34 1 -38 -31 82 -40 106 129 -199 33 104
$$ packed form
5243e7n4R4N4j38Q0J37o6Ql74J69J68J66j32j81K16j10K29j68r9K0J42q6Q1k59
5267a60lL56q1l5j51L7J82j83j58J18N9J9K05k17k49M06N3J9j98j75J69J44Nm27
5291b65M0R4K04R1k99L6J04l8J90r4k81J65N0J95j05j44m2N7l6J53j21j09K93
5314A38j12p8l2r8O7P9P8j30l5J98j86Q6r3l2L00m5n0j54O6O4R0n7o0p8R6P9j92
5341i1l3J25j29J11J60l34J55oJ32M5l75K7K21J7R3j68j63J96J16j38r6J46J09
5364A20j44q1pP0LJ44p4r3j92J53K45r3j53J61m5J09M0k38r7J14J66j03J6p8o2
5389a19K53O9m98L54m0M0K5l04K85nj15R5M4k22L2K84j61k15JJ61K5J03q7J33
5413A38m45K41K99m73J40P8L1J55j55K0o9j49K23l3l9PJ13j22J46K3l28K32P1
$$ plain form
5436 104 -216 -148 -103 164 -61 24 -282 -73 -96 72 70 -103 9 24 -9 -89 -118 -82 168 -73 -121 -73 10 -25 96
5461 96 -5 -158 -149 -12 47 -4 -111 79 79 141 115 -270 -242 213 31 47 -148 -29 112 49 5 -1 -19 -110 97 33
5487 33 -3 -48 124 -34 -33 -182 -61 46 -133 169 30 -77 78 228 129 -62 -105 23 104 67 -150 -4 25
5510 25 -99 41 -268 -141 149 70 353 -73 -98 53 85 -36 -92 25 -124 42 -27 19 -189 -103 79 100 -81
5533 -81 147 -26 90 84 -185 -117 -2 -120 -30 -46 -13 2 50 -164 -136 -123 -77 47 0 -114 27 36 102 -35 -99 -206
5559 -206 -1 -46 153 -170 -187 15 35 -10 -68 -69 -87 90 51 -90 66 -141 95 110 -304 -134 36 44 -35 -84 -131
5584 -131 90 -11 -115 170 -199 -45 122 86 44 -17 152 221 25 -22 -8 -90 63 17 -10 -84 107 -189 79
5607 79 148 -34 -48 23 95 188 -245 -66 12 -72 -42 91 -4 70 31 -136 -151 -40 -1 82 -193 -166 -138 83 35 -151
$$ packed form
5436A04l20O8M5K67k25Q5l06K09k3J68kj73J12J5l3q0k9L6K50k41m8M8Q3l5J21
5461I6j01j53RJ37N9n1j07J90%O2k6l85K8M55j82J6j95J19J41o3m4oj8r1K07o4
5487C3l6m5J72j58Jj49J21J07j79L02j39j07J55J50r9j91m3J28Q1l7k17J46K9
5510B5j24J40l09J27K90p9K83m26k5J51L2j21n6J17j49J66o9M6k08Q6J82K1j81
5533h1K28j73J16ok69O8J15j18R0j6L3J5M8k14K8J3M6J24m7j14J41RO6j37o4j07
5559b06K05m5J99l23j7K02K0m5n8jj8J77l9j41J56k07K36J5m14J70J70Qp9m9m7
5584a31K21j01j04K85l69J54J67l6m2o1J69O9j96m7J4q2J53m6k7p4J91k96K68
5607G9O9j82j4P1P2R3m33J79P8q4L0J33r5P4l9j67j5J11L9Q3k75K7K8K21m8j86
$$ plain form
5633 -151 -242 -144 3 54 84 -121 38 270 10 -69 -69 -56 42 116 -26 -146 -132 -52 329 42 -228 -41 15 76 144
5658 144 -82 -66 77 92 56 -89 -34 151 73 0 -111 113 116 298 123 -93 -36 129 152 183 -107 -86 79 219
5682 219 -119 -103 -121 9 43 -41 -126 -118 29 174 90 -207 1 53 -7 -56 -159 -94 82 30 -33 -96 -252 23 133
5707 133 -29 -2 -122 257 69 -55 -93 -211 48 215 95 -111 87 33 -37 102 -55 -58 47 29 34 -63 -120 30
5731 30 47 2 -231 -226 31 208 -121 54 52 -46 60 140 52 -92 -10 -107 71 -96 -249 -4 101 93 48 -85 63
5756 63 33 115 -102 -156 3 52 68 -6 73 70 -4 316 154 -155 -89 -105 164 -97 -169 52 116 -24 122 -173 48
5781 48 -130 -23 -50 -236 15 102 95 -191 -6 -39 120 60 -21 -196 -112 95 -47 -120 -26 105 -111 189 -9 -96
5805 -96 60 266 97 -56 -30 2 27 -56 23 -86 -63 223 -29 -2 -218 62 114 1 26 -114 -60 154 -4 47
$$ packed form
5633a51r1R8J47N1L0k05J59K32k60p9%J3R8P4j42j20J4Q0L81k87k70J87N6O1O8
5658A44k26J6J43J5l6j45N5J85p8p3j11K24LJ82j75k16N7J65K3L1k90K1J65J40
5682B19l38J6j8J30L4q4q5QJ47J45q4k97K08N2o0m9j03O5J76n2o3o3j56K75J10
5707A33j62K7j20L79j88j24l8j18K59J67j20k06J98n4p0J39j57lJ05j8Nr7n7J50
5731C0J7m5k33NK57J77l29J75kr8J06Q0q8j44Q2r7J78j67j53K45J05qm5j33J48
5756F3l0Q2k17n4J59M9J6p4P9lp4L20j62l09O6j6K69k61p2K21O4j40J46k95K21
5781D8j78J07k7j86K51Q7pk86J85l3J59o0q1j75Q4K07j42p3R4J31k16L00j98q7
5805i6J56K06j69j53K6L2K5q3P9j09K3K86k52K7k16K80N2j13K5j40N4K14j58N1
$$ plain form
5829 47 -222 -20 38 93 -64 38 -79 54 200 -41 -12 -32 66 99 -74 140 57 70 52 32 -126 54 -33 26
5853 26 -65 -240 27 -12 230 61 -112 -129 203 250 50 -41 67 96 30 -34 -136 -70 -82 184 -144 -130 19 118
5877 118 39 -38 -111 -81 174 150 -15 -66 -42 127 143 -82 -42 -78 65 210 127 -224 -72 55 100 83 22 47 -70
5902 -70 45 -11 -161 -50 40 61 -220 -42 27 -49 -55 34 11 -69 -154 56 100 -84 51 -8 116 10 -47 -112 57
5927 57 44 174 -101 -94 213 90 93 -9 -8 -125 9 -25 -254 94 -146 -36 67 -116 -185 15 33 -110 11 -130
5951 -130 22 68 -69 -207 -113 -147 40 207 -73 -147 86 77 67 43 -287 37 -60 117 21 -69 -60 152 53 122 -128
5976 -128 -39 100 15 28 88 5 259 -9 -17 12 21 177 83 174 -185 -52 -35 18 5 37 18 192 83 61 -3 -187
6002 -187 126 168 -25 18 -64 62 347 158 -163 50 54 4 5 1 53 -37 84 -33 -131 -55 85 -161 14 -36 -47
$$ packed form
5829D7k69K02N8N5j57J02j17J33J46k41K9k0R8L3j73K14q3J3j8k0j58J80q7N9
5853B6r1j75K67l9K42j69j73j7L32M7k00r1J08K9o6o4j02O6j2K66l28J4J49R9
5877A18p9p7p3L0K55k4j65n1K4J69J6k25M0l6J43J45q3l51J52J27M5j7o1K5j17
5902g0J15n6j50J11R0K1k81J78O9p6oQ9k3q0q5K10M4j84J35n9J24j06n7o5J69
5927E7j3J30k75PL07j23Lj02Jj17J34l4k29L48k40J10J03j83o9K00J8j43J21j41
5951a30J52M6j37j38R4l4J87J67k80p4K33rj0k4l30L24r7J77r6r0RK12r9O9k50
5976a28Q9J39q5J3O0q3K54k68qK9RJ56r4R1l59J33J7N3j3L2j9J74j09k2o4j84
6002a87L13M2j93M3q2J26K85j89l21K13Mn0JmN2r0J21j17r8P6J40k46J75n0j1
$$ plain form
6027 -47 132 208 -21 16 52 45 42 191 14 -28 4 -87 -86 -80 -152 -27 -79 -11 -144 21 43 306 121 -98 118 -116
6053 -116 39 111 -130 -69 164 220 -75 32 -193 -4 194 43 -6 -51 15 268 29 -96 -89 -77 234 160 -36
6076 -36 -206 -31 81 247 -125 -148 173 -149 99 55 -143 -46 77 -27 148 -177 73 164 6 -158 -8 68
6098 68 30 -80 46 -38 90 -101 93 27 -77 74 -30 203 -25 -259 121 34 32 -80 44 60 82 50 -156
6121 -156 21 -100 200 177 129 147 -19 206 62 3 -144 40 -195 75 29 135 -32 123 -42 -120 -115 -38 56
6144 56 25 -52 -120 2 -189 41 -81 -175 -153 133 -24 257 20 0 138 125 18 -118 -43 167 198 -22 53 -110
6168 -110 -101 218 -38 -65 -142 75 149 43 -183 136 88 46 115 -91 260 -8 -33 52 -27 -95 92 222 -10 -106
6192 -106 39 25 177 -16 -86 88 69 -46 102 41 -114 70 64 -50 -29 -169 1 86 -48 -45 47 122 158 49
$$ packed form
6027d7J79P6k29L7L6plJ49j77m2L2r1JOp2J25n2O8j33J65K2K63j85k19K16k34
6053a16J55P2k41O1K33N6k95J07k25J89J98j51m9m5O6K53k39j25PJ2L11p4j96
6076c6j70J75J12J66l72k3L21l22K48m4j98R7J23j04J75l25K50R1j58j64J50P6
6098F8l8j10J26q4J28j91J94o6j04J51j04K33k28k34L80q7kj12J24J6K2l2k06
6121a56J77j21L00k3m8J8j66K25j44n9j47J84k35K70m6J06j67J55j65p8NP7R4
6144E6l1p7o8J22j91K30j22r4K2K86j57K81k37k0J38j3j07j36P5K10L1k20P5j63
6168a10RL19k56k7p7K17P4j06k26L19m8m2O9k06L51k68k5Q5p9o8J87J30k32r6
6192a06J45j4J52j93p0J74j9j15J48o1j55J84oj14K1j40J70Q5j34LR2P5L6j09
$$ plain form
6216 49 -72 113 -51 31 -31 -19 -230 56 101 139 -46 -216 -36 206 -44 -83 113 -62 233 88 -84 -23 -67
6239 -67 76 139 -93 125 54 -93 -102 -145 -108 -52 77 -53 -39 -128 -92 43 91 41 -28 -25 67 -159 -24 -10 20 138
6265 138 85 -163 -175 164 322 134 -64 38 126 330 62 -21 59 -71 168 98 -4 -77 -110 53 -49 -162 -50
6288 -50 95 -76 2 -12 -42 -36 68 -34 -120 -42 -43 106 1 -29 35 29 -150 96 -87 -67 273 39 41 -105 -73 -88
6314 -88 34 0 -106 15 76 -35 104 -66 -181 -104 123 -14 41 -71 17 134 -171 -200 -28 96 81 10 -100
6337 -100 -51 -36 17 -138 77 -106 -68 15 168 -65 -120 0 27 86 -116 57 39 140 15 49 82 -34 55 106
6361 106 -120 35 31 27 154 85 -114 55 78 66 13 -11 56 -42 67 -93 9 6 93 101 76 -247 42 -85 -10 -36
6387 -36 -40 -52 83 129 159 -98 120 73 27 64 47 11 -9 59 -33 -156 -176 110 -67 -114 -117 -212 -112 -215 38 -119
$$ packed form
6216D9j21J85j64Q2o2J2k11K86M5L8j85j70J80K42k50l9J96j75K95j45j72O1m4
6239f7J43O3k32K18p1j47rm3L7N6J29j30J4q9L6J35M8n0o9LR2k26J35J4L0J18
6265A38n3k48j2L39J58j88j98J02Q8K04k68q3Q0j30K39p0j02p3l3J63j02j13J12
6288e0J45j71P8j4l0OJ04j02q6P8jJ49j05l0O4oj79K46j83K0L40k34Kj46L2j5
6314h8J22l4j06J21O1j11J39j70j15P7K27j37N5j12Q8J17l05k9J72J24j5p1j10
6337a00M9J5N3j55K15j83L8Q3J53k33n5J20K7N9k02J73j8J01j25L4L3j16Q9N1
6361A06k26J55mmJ27o9j99J69K3j2n3k4O7r8J09j60J02lQ7Qk5l23K89j27P5k6
6387c6mj2J35M6L0k57K18m7m6L7j7l6k0O8r2j23k0K86j77m7lr5J00j03K53j57
$$ plain form
6413 -119 187 -1 -71 -88 71 26 48 192 -28 -253 123 40 -15 -29 -35 -229 -87 180 -21 -75 -96 79 -39 -89
6437 -89 -167 -134 -126 120 0 86 -216 53 -72 70 -29 21 95 54 -81 -80 -130 72 127 -40 -66 -185 -36 -27 5 -116
6463 -116 -13 -121 -192 -39 -246 -56 29 85 -49 -29 -274 -38 1 183 122 -186 98 157 71 30 39 92 172 -70
6487 -70 -164 -128 56 139 62 -27 -7 66 36 59 -248 -55 -67 123 156 -116 -50 134 20 -50 -147 -56 108 76 299 -159
6513 -159 -103 72 117 -43 -107 -51 -31 8 32 104 -39 -44 57 -76 139 7 -100 -51 77 -13 -186 22 114 -4
6537 -4 -246 -151 -96 67 -158 89 -150 -87 133 88 -91 -172 31 50 167 -166 -145 -177 45 78 -80 -149 -57 31 108
6562 108 -14 -159 152 174 43 -39 0 -89 -16 65 63 -107 -91 -216 18 -65 -71 -175 14 125 -40 -11 -111 128
6586 128 -127 13 23 -111 96 65 82 -66 60 -160 -9 -18 -137 -122 1 3 -35 47 -48 133 51 104 -85 -209
$$ packed form
6413a19L06j88p0j7J59m5K2J44k20k25L76q3n5j4oj94J42K67k01n4k1J75j18n0
6437h9p8L3QK46j20Q6l02K69j25J42r9N0P4m1j35Jn0K02N5j67k6j19J49RL2j21
6463a16J03j08p1J53k07J90Q5N6j34K0k45K36L9J82o1l08K84N9q6m1RN3Q0k42
6487g0r4L6J84Q3p7q9K0P3l0K3l07J93j2J90L3k72O6J84j14p0r7R1J64l2K23m58
6513a59N6J75M5j60o4N6K0L9K4P2j43nJ01j33K15j32j07M9J28r0j73K08R2j18
6537dk42R5N5J63k25K47k39O3K20m5j79q1K03J9J17l33K1l2K22L3j58o9R2Q8P7
6562A08j22j45L11K2j31q2L9q9P3Q1kj70J6j25K34q3oj04J89J11j65K9j00K39
6586A28k55J40J0j34K07l1J7j48J26k20J51rj19J5J23Kl8Q2r5J81q2N3j89j24
$$ plain form
6610 -209 -45 37 60 81 -217 -2 106 -93 -115 -112 -51 -12 112 -147 122 191 -13 125 -167 -45 88 87 87 9 -162
6635 -162 72 147 -42 -165 -6 -33 179 164 -183 94 58 166 -26 -34 -150 -50 -22 -152 -31 -216 -42 -40 -33 -8
6659 -8 -128 -133 54 -22 -53 -99 192 69 166 -48 -178 -34 119 121 -136 -89 40 71 9 95 -129 -30 328 88 -30
6684 -30 -155 -12 160 245 -41 9 -75 -87 45 -98 -148 -95 -39 103 -100 -102 -20 -119 -23 -96 73 59 -43 46 -77
6709 -77 -212 -102 -5 99 -252 -114 6 129 57 -24 -134 -62 57 104 153 -185 -57 173 103 10 -58 -53 262 -44
6733 -44 -53 0 21 -71 286 -73 -143 26 108 189 -62 -81 -142 4 -97 117 27 -24 130 185 -50 -78 15 -79 54 -16
6759 -16 -22 69 -49 247 175 -53 27 -25 -60 214 -87 -119 -12 63 75 -62 35 52 130 -163 -132 -221 6 50 119 -95
6785 -95 -68 39 -77 86 1 -115 171 84 -24 -6 -17 32 161 121 -221 18 156 -113 217 -35 16 119 98
$$ packed form
6610b09J64Q2K3K1k98K15J08j99k2LO1L9J24k59K69O9k04J38k92J22J33j%p8j71
6635a62K34P5j89j23J59k7K12j5l47K77l6J08j92qj16J00K8j30J21j85J74KPK5
6659hj20nJ87p6l1m6K91j23R7k14j30J44J53Kk57M7J29L1o2Q6k24R9L58k40j18
6684c0j25J43J72Q5k86N0q4j2J32j43n0N3N6J42k03kQ2r9R6p3J69j4j02Q9j23
6709g7j35J10R7J04l51J38J20J23p2q1j10P2J19M7M9l38J28K30p0r3o8NL15l06
6733d4rN3K1r2L57l59p0J69Q2Q1k51j9o1J46j01K14r0n1J54N5k35k8R3r4J33p0
6759a6oR1j18K96p2k28Q0n2l5K74l01l2J07P5J2j37R7J7P8k93L1q9K27M4O9k14
6785i5K7J07j16J63q5j16K86q7j08J8j1M9J29m0l42K39J38k69L30k52N1J03k1
$$ plain form
6808 98 83 -8 -152 25 153 43 -44 -197 -10 -70 -118 -90 -14 186 32 102 -19 101 207 121 164 -194 -67 7
6832 7 90 119 -69 129 114 75 24 3 -16 142 95 -46 20 19 59 81 -62 -27 -3 -43 -17 165 -165 -60 -20 -39 219
6859 219 -95 -137 6 26 -106 18 -157 -63 148 -20 -60 -19 87 -95 40 -94 61 40 -144 73 23 -116
6881 -116 -61 51 29 -191 -116 -30 77 61 29 -204 -25 36 -23 112 42 24 19 163 -152 -16 -160 77 270 88
6905 88 -58 -54 76 61 -96 -38 50 71 20 5 -112 -9 43 70 -85 -167 52 166 79 61 -91 9 95 -94 -99 -121
6931 -121 -10 164 -14 78 2 9 57 81 -215 20 105 1 66 10 -167 -6 -147 48 18 -194 -41 118 111 37
6955 37 -93 -272 35 116 12 -179 -11 -77 153 5 5 -12 -156 221 -144 -38 -215 -52 219 -15 -74 28
6977 28 -65 172 110 -106 -29 148 90 106 -87 -123 -33 127 5 125 -123 -96 -103 -34 59 -40 139 130 49 -3 -268 120
$$ packed form
6808I8j5r1j44J77J28j10q7j53J87o0m8K8P6K00j54P0j21J20J06q6M3l58J27P4
6832GQ3K9j88J98j5l9n1k1j9J58m7j41O6jM0K2j43L5K4m0K6J82l30J05M0j9K58
6859B19l14m2J43K0j32J24j75R4K11j68m0M1J06j82J35j34J55k1j84K17n0j39
6881a16N5J12k2k20P5Q6J07j6l2k33J79O1n9J35p0j8nJ44l15J36j44K37J93j82
6905H8j46MJ30j5j57N8Q8K1n1j5j17J03N2K7j55q2K19J14q7j8j52J00Q6j89nk2
6931a21J11J74j78R2p6PM8K4k96K35Q5j04O5n6j77J61j41J95l0k12J53J59pp4
6955C7j30j79L07Q1j04j91J68o6K30j48%j7j44L77l65J06j77J63K71k34n9J02
6977B8r3K37o2k16P7J77n8J6j93l6R0J60j22J20k48K7pO9R3r9J79rq1n2k65L88
$$ plain form
7003 120 160 70 -69 -74 57 -64 145 -27 -95 136 131 7 -53 -20 -107 -46 -40 -49 61 9 -115 10 -63 -72 102 119 -54
7030 -54 -39 -155 -55 124 -31 81 -135 51 78 100 71 -204 -7 283 3 -101 77 -171 120 139 -92 -206
7052 -206 -2 154 0 -98 -45 -67 33 131 34 84 -14 33 62 -44 -66 60 165 18 -182 -35 -106 95 68 -138
7076 -138 30 -99 39 37 62 -66 -146 146 178 7 -81 -124 -28 159 -29 -125 14 -35 89 -50 -156 84 -87
7099 -87 158 -137 -188 84 94 -95 81 -109 60 68 47 -98 -85 91 -6 199 -32 -87 -111 115 -116 43 -163
7122 -163 41 -43 84 85 -23 -15 -76 179 54 -29 -161 37 -106 64 -8 68 12 28 51 -249 -179 71 129 -78 65
7147 65 -239 -22 129 -36 61 43 -26 -53 -5 -83 -292 40 146 69 65 -172 -190 154 140 72 59 195 2 256 -61
7172 -61 -145 -184 43 33 115 -160 -7 22 185 -134 -144 -3 186 -17 -177 88 2 72 148 -33 -149 128 6
$$ packed form
7003A20M0r0j39nJ31j21K09j72o8K31nj24o0L3q7O1OrJ10n2j24J25p3rJ74J7j73
7030e4J5j16J00J79j55J12k16J86K7K2k9k75J97K90k80j04J78k48K91J9k31j14
7052b06K04J56j54r8N3k2J00R8r7N0r8M7K9j06k2J26J05j47k00J47p1K01k7k06
7076a38J68j29J38kK5j28q0K92L2j71q8m3R6J87j88r6J39m9J24j39j06K40j71
7099h7K45k95n1K72J0j89J76j90J69Qk1j45J3J76r7K05k31n5k4K26k31J59k06
7122a63K04q4J27Jj08Qo1K55j25q3j32J98j43J70p2P6n6J6K3l00P0K50N8k07J43
7147F5l04K17J51j65R7j8o9k7M8p8k09L32J06p7mk37j8L44j4o8j3J36j93K54l17
7172f1q4l9K27j0Q2k75J53K9J63l19j0J41J89k03j60K65q6P0P6j81j16K77j22
$$ plain form
7195 6 7 -57 -68 -124 -45 86 143 -55 -100 67 -60 -43 137 -77 48 61 -115 -125 -2 -65 90 -57 -109 161 211
7220 211 82 5 -63 -208 120 91 -75 -169 -28 61 5 59 65 -130 64 40 -120 12 -18 25 11 -135 -206 109 119
7245 119 -35 -65 62 -124 -49 49 126 -151 -141 -127 53 -74 -49 13 -35 155 -47 -143 56 -92 -42 14 40 -8 -7
7270 -7 -16 -49 -58 73 40 160 7 -3 -27 62 86 -170 -65 21 38 169 58 -152 -51 35 54 154 38 -90 -141 77
7296 77 -109 10 60 116 186 3 105 -154 12 32 73 -22 -54 148 39 33 -24 -179 -93 35 -34 -111 -56 42 -16 199
7322 199 18 -43 -134 -28 -157 -100 3 -51 47 11 -5 7 -11 85 131 -5 49 109 165 10 -64 -115 113 95 64 -5
7348 -5 2 125 285 158 -78 -129 -14 43 -46 -19 -239 18 224 33 -85 29 -225 -8 12 -159 -39 69 73 43
7372 43 -121 -174 -199 57 183 -200 -55 169 -5 17 79 -56 29 94 156 72 -248 0 -52 75 -101 -118 -10 -80
$$ packed form
7195FJo4j1n6P9J31N7j98m5J67j27J7J80k14J25J3j76j0J23o3J55j47n2K70N0
7220B11j29p7o8j45L28k9j66r4J41Q9n6N4Oj95J94k4j60J32l0M3j4j46p1L15J0
7245A19j54l0J27j86P5R8P7k77J0J4J80j27K5O2m8J90k02r6J99j48N0N6K6m8J
7270grl3rJ31l3J20j53j0k4Q9K4k56J05Q6J7J31j11k10J01Q6J9J00j16j28n1K18
7296G7j86J19N0N6P0j83J02k59J66K0M1r5l2K02j09on7j55Q6J28o9p7N5R8n8K15
7322A99j81o1r1J06j29N7J03n4R8l6j6J2j8R6M6j36N4O0N6j55p4n1K28j8l1o9
7348ePJ23J60j27k36n1J15N7q9K7k20K57K06j91j18J14k54K17K0j71J20J08Ml0
7372D3j64n3k5K56J26l83J45K24j74K2O2j35Q5O5O2q4l20K48n2J27j76j7J08p0
$$ plain form
7396 -80 -69 45 81 -34 14 -121 -43 -40 49 61 4 54 108 119 -81 50 -11 33 -103 99 30 -28 -93 -70 21 49 -91
7423 -91 40 26 -202 18 107 -99 -8 -74 -53 71 -84 -94 16 53 -94 139 -35 -14 -31 -79 -137 -52 168 127 -83
7448 -83 -141 -241 -169 48 10 -48 -105 51 198 -133 -46 126 84 90 53 -131 75 209 216 95 -23 126 86 -127 24
7473 24 -75 13 -28 63 154 -59 0 130 108 17 -138 -174 -97 -30 -82 69 -1 -68 34 -29 -29 -149 114 -84 39 -225
7499 -225 -16 14 57 -108 13 -183 97 66 -143 -148 46 42 41 116 -154 -36 30 58 -149 -51 -60 29 -171 -31 -141
7524 -141 -169 17 -154 -105 -114 -34 44 34 2 -41 -200 18 94 -33 27 -68 -67 34 -88 -48 67 -39 75 98 146 -211
7550 -211 170 205 31 -67 -208 92 -5 48 -82 72 -139 5 -107 -84 -100 85 103 -9 -38 -68 0 63 -3 -4 -60
7575 -60 -26 162 71 22 -67 131 -19 75 5 7 33 156 220 81 -188 119 138 -18 113 -110 -171 51 -7 -168 -129
$$ packed form
7396h0J1J14L6j15M8j35P8LQ9J2n7N0N4J1k00J31o1M4j36K02o9n8o5K3R1K8j40
7423i1J31j4k28K20Q9k06R1o6K1J24j55j0J10L7j47K33j74K1j7m8n8Q5K20m1k10
7448h3n8j00P2K17l8n8n7J56J47l31Q7J72m2Ol7j84K06J34Pj21j18J49m0k13J51
7473B4r9Q8m1R1R1k13N9J30k2r1j55l6P7O7n2J51p0o7J02o3%j20K63j98J23k64
7499b25K09L0M3j65J21j96K80l1k09nJ94mjP5k70J18O6K8k07R8rQ9k00J40j10
7524a41k8J86j71M9rQ0P8j0l2m3j59K18P6j27O0r5JJ01j22M0J15j06J14K3M8l57
7550b11L81L5j74r8j41L00r7N3j30J54k11J44j12K3j6J85J8j12k9l0O8O3o6jn6
7575f0L4J88r1m9q9J98j50R4p0KK6J23O4j39k69L07J9j56J31k23o1K22n8j61L9
$$ plain form
7600 -129 -6 239 -85 -71 -45 235 3 84 76 -148 24 -67 -9 -101 -121 22 42 129 -257 -22 -130 36 46 65
7624 65 -124 51 -17 -73 77 11 57 140 76 56 -43 70 15 61 31 -27 -1 -61 -105 -16 -174 141 -38 -121 2 -199
7650 -199 35 46 63 -21 -58 -89 204 22 -21 0 -112 -102 -40 21 11 -235 88 87 -38 -35 215 111 81 41 -75 -29
7676 -29 -90 124 10 12 -38 -70 88 -55 -44 -137 75 -26 58 -30 -151 43 193 24 8 -95 -34 178 115 -114
7700 -114 -84 90 -14 -137 22 -218 -142 -94 -214 -34 -38 -149 6 22 109 -71 45 106 -22 -51 -27 45 -155 28
7724 28 -66 -111 71 18 -192 23 51 -89 165 36 -165 83 -98 57 -28 -176 -41 -96 62 -13 47 -102 -152
7747 -152 135 -38 -97 -33 -17 80 55 61 42 -17 -2 149 70 -69 -90 30 -10 21 1 -95 27 79 99 113 -252 46
7773 46 -16 -16 -28 -78 132 -6 136 -11 -62 39 167 -36 -104 1 100 -69 36 -241 -113 86 150 -42 -127 28
$$ packed form
7600a29J23K45l24J4K6K80k32Q1qk24J72r1N8r2k0J43K0Q7l86K35j08J66J0J9
7624F5j89J75o8n6J50o6M6Q3o4k0r9J13n5M6l0n8K6o0m4Q9j58L15j79q3J23k01
7650a99K34J1J7q4l7l1K93j82m3K1j12J0O2O1j0k46L23jj25LK50j04l0m0j16M6
7676b9o1K14j14Kn0l2J58j43J1r3K12j01Q4q8j21J94J50j69j6j03O1K12o3k29
7700a14L0J74j04j23J59k40P6M8j20J80mj11J55J6Q7j80J16O1j28k9K4P2k00J83
7724B8r4m5J82n3k10K15K8j40K54j29k01K48j81J55q5j48J35n5J58p5O0j49n0
7747a52K87j73n9O4J6R7k5Oj9n9J5J51p9j39k1J20m0L1k0r6J22N2K0J4l65K98
7773D6o2%j2n0K10j38J42j47n1J01J28k03o8J05R9j69J05k77J28J99O4j92q5J55
$$ plain form
7797 28 -44 106 -17 -91 -2 -48 8 -69 -191 -26 56 94 80 29 -66 109 -42 56 -107 -22 53 81 -59 -92 -39 63
7823 63 168 -32 136 22 128 144 46 3 79 -28 76 -15 -124 -84 140 89 9 72 -39 125 -50 63 -48
7846 -48 -10 78 66 140 22 119 -9 24 -118 74 78 74 -19 -22 13 48 34 231 37 126 -71 -33 108 74 -90 -165 104
7873 104 -24 114 -46 81 56 107 -99 -187 75 -26 -124 78 -126 -9 -53 149 73 -14 58 26 126 32 -9 -5
7897 -5 -95 178 -4 9 10 -9 112 59 -114 23 44 48 -46 -149 -21 13 3 59 21 -223 -4 -50 -8 10 -83 12 -1
7924 -1 113 -14 -149 -48 -29 142 -230 36 28 58 -123 -14 53 -27 55 105 140 143 39 -83 27 -69 4 -90 -76 -116
7950 -116 -212 -104 -34 273 -182 5 -86 83 82 -70 -208 -48 -17 -3 -31 -148 40 16 82 1 -208 -208 105 -37
7974 -37 -50 80 -151 60 -157 68 -53 -34 44 -158 72 -168 -108 -69 -13 18 68 -125 66 -3 20 -26 2 -8 -142
$$ packed form
7797B8p2J50j23p4Q9m6N6p7j22J65Q2L8j4n1r5J75j51R8j63Q5P5K8j40l3N3J02
7823F3J05k00J68j14J06J6r8m3P6j07J04r1j09M0K24n1q0O3j11J64j75J13j11
7846d8L8Q8j2P4j18R7j28L3j42J92Mmr3lL5L5j4J97j94Q9j97L8J41l4j64p5K69
7873A04j28J38j60J27k5N1k06q8K62j01r8K02k04J17m4K02p6q7P2l2J00r4m1M
7897er0K73j82J3Jj9J21n3j73J37K1Mr4j03J28L4j0N6l8k44K19m6M2J8r3R5j3
7924aJ14j27j35J01J9J71l72K66qL0j81J09O7q0Q2N0L5Lj04j22J10r6P3r4J4m0
7950a16r6J08P0L07m55J87r1J69jj52j38J60L1J4k8j17J88k4O6q1k09%L13j42
7974c7j3J30k31K11k17K25j21J9P8k02K30k40O0L9N6L1N0j93J91o9K3m6K8j0j34
$$ plain form
7999 -142 120 -121 -156 -104 -118 68 83 -107 182 6 56 -135 -113 -18 52 74 -79 -66 -55 -58 -5 -126 -63 -97 5
8024 5 86 -146 -46 -204 57 14 -61 -219 -69 179 16 66 34 142 31 -4 -34 -47 -298 26 75 -24 -21 -51 -25
8049 -25 54 79 47 -83 127 112 7 -28 -145 99 158 17 -65 -151 -300 21 -50 102 -8 175 211 -35 -110 182
8073 182 72 247 190 -5 -98 -58 195 -96 30 220 14 -75 18 169 -117 75 54 -51 32 139 76 79 103 55
8097 55 -39 69 218 -3 89 -144 129 27 -77 14 -57 -13 33 -35 -19 112 -120 -100 -48 53 100 70 -18 60 125
8122 125 -95 25 102 93 -183 -54 143 -18 -33 81 -8 58 4 -80 -22 -201 38 -19 18 8 -123 10 23 51 87
8147 87 53 -65 52 10 -17 -40 29 -35 -151 2 103 18 33 0 -104 -103 -1 -78 18 127 103 133 32 77 110 94
8173 94 112 -199 -30 -57 6 183 16 55 -85 -148 -17 -176 104 -75 -34 -101 -57 29
$$ packed form
7999a42K62k41l5N2j4J86J5j90K89j76N0j91K2R5P0K2j53J3J1lN3j21O3l4J02
8024EQ1k32J00j58K61m3p5j58J50K48j63N0l2J08j11l5l0j3k51L24M9r9Ll0K6
8049b5P9K5l2j30K10j5j05l5j17K44N9j41q2q6j49L21p1J52j10J83L6k46p5K92
8073A82j10J75n7j95r3M0K53k91J26J90k06q9R3J51k86J92k1j05Q3J07o3LK4m8
8097E5r4J08J49k21R2k33K73j02j04R1p1M4M6o8J6J31k32K0N2J01M7l0q8P8O5
8122A25k20J20P7rk76J29J97j61j5J14q9O6n4q4N8j79K39n7L7j0j31J33J3K8L6
8147H7l4j18J17m2k7k3O9o4j16J53J01q5J5l3j04JJ02p7R6J09k4L0j01M5L3j6
8173I4J8l11J69k7O3J77j67L9j40o3J31j59K80j79M1o7M4Q6
8191B9
$$ Imaginary data points
##PAGE= N=2
##DATA TABLE= (X++(I..I)), XYDATA
$$ plain form
0 0 0 0 0 0 0 0 0 0 0 0 0 -8 8 -8 8 -13 16 -16 24 -24 32 -37 40 -48 56 -65 79 -88 102 -117 133 -149 171 -191
34 -191 214 -242 270 -300 336 -372 414 -459 508 -560 619 -681 751 -827 910 -1003 1104 -1216
52 -1216 1343 -1484 1644 -1826 2036 -2277 2568 -2916 3340 -3880 4578 -5526 6871 -8930 12417
67 12417 -19321 37753 -177747 -411564 218297 -45489 -75757 202854 -202177 -66960 228410
78 228410 -43594 66615 -43747 -192687 228333 51928 -183463 110131 -98247 -58070
88 -58070 230805 -135174 -137650 69292 -88225 136036 92845 -179293 134877 87904 -107817
99 -107817 96142 -138302 -159574 182695 -17553 -39276 33715 -160381 149252 171979 -195427
110 -195427 54507 19344 -156065 226177 36080 -227930 96520 9000 -41541 82335
$$ packed form
0@%%%%%%%%%%%qJ6j6J6k1K9l2M0m8N6o9P7q8J04j21J44j67J90k19K50k82L20l62
34a91M05m56N12n70O36p08P86q73R67j068J179j300J432j578J737j913K107k320
52a216K559k827L128l470L862m313M845n484O256p220Q458j0104J2397j5801K1347
67A2417l1738N7074k15500k33817O29861k63786l0268K78611m05031J35217K95370
78B28410k72004J10209j10362j48940M21020j76405k35391K93594k08378M0177
88e8070K88875l65979k476K06942j57517K24261m3191k72138L14170m6973j95721
99a07817K03959k34444k1272L42269k00248k1723P2991j94096L09633K2727l67406
110a95427K49934l5163j75409L82242j90097k64010L24450q7520n0541J23876
$$ plain form
120 82335 -181379 -33052 154013 -65100 119551 60572 -211545 150066 108829 -201855
130 -201855 43162 -19836 -109199 144016 -18021 -78108 73955 -42394 76353 69856 -176134
141 -176134 44583 98156 -65496 96146 -32094 -143783 98754 -2111 -59769 32332
151 32332 -117838 50921 176365 -79403 15064 49780 -106170 96594 36604 -166391 15271
162 15271 11163 2763 108806 -94717 -49804 115653 -53234 30258 68824 -141803 51174
173 51174 131264 -77514 -2157 -21790 -71092 76069 -28328 -63220 54096 -34171 68709
184 68709 126421 -109544 -26275 73201 -55267 25371 -1892 -99777 47703 39206 -6299 35463
196 35463 -83929 -4637 118229 -43711 -18217 45095 -49341 64179 64207 -94672 -30746 -18716
$$ packed form
120H2335k63714J48327J87065k19113J84651n8979k72117L61611m1237l10684
130b01855K45017o2998q9363K53215j62037o0087J52063j16349J18747o497k45990
141a76134K20717N3573j63652J61642j28240j11689K42537j00865n7658R2101
151C2332j50170J68759J25444k55768R4467L4716j55950K02764n9990k02995J81662
162A5271m108q400J06043k03523M4913J65457j68887Q3492L8566k10627J92977
173E1174Q0090k08778P5357j9633m9302J47161j04397l4892J17316q8267J02880
184F8709N7712k35965Q3269R9476j28468Q0638k7263r7885J47480q497m5505M1762
196C5463j19392P9292J22866j61940K5494O3312r4436J13520K8j58879O3926J2030
$$ plain form
208 -18716 -14859 73708 -45678 -46206 93061 11268 21778 50313 -92304 -14237 72804 -28609
220 -28609 -11246 -24835 -35109 80754 14254 -49238 17554 -39180 14155 101854 -35258 -35764
232 -35764 50770 -55 18927 -10489 -83705 158 18064 3893 43499 -38745 -15766 97344
244 97344 13091 -26807 2776 -46174 14189 49400 -31073 -15532 -6666 -1305 55994 -19812
256 -19812 -57323 31838 20703 24332 46805 -35649 -18261 41540 -1615 -12804 -37045 -48804
268 -48804 37960 33625 -11120 19308 -3913 7972 58003 -10858 -44083 1342 6472 27263
280 27263 10380 -41393 -6003 14895 3473 19428 -23040 -26951 49825 40252 3723 2861 -19524
293 -19524 1399 21144 -22483 -32889 -18888 5220 49125 19365 -23187 5868 17924 18401
$$ packed form
208a8716L857Q8567j19386n28J39267q1793J0510K8535j42617P8067Q7041j01413
220b8609J7363j3589j0274J15863o6500o3492O6792n6734N3335Q7699j37112n06
232c5764Q6534n0825J8982k9416p3216Q3863J7906j4171L9606q2244K2979J13110
244I7344q4253l9898K9583m8950O0363L5211q0473J5541Q866N361N7299p5806
256a9812l7511Q9161j1135L629K2473q2454J7388N9801m3155j1189k4241j1759
268d8804Q6764m335m4745L0428k3221J1885N0031o8861l3225M5425N130K0791
280B7263j6883n1773L5390K0898j1422J5955m2468l911P6776r573l6529q62k2385
293a9524K0923J9745m3627j0406J4001K4108M3905k9760m2552K9055J2056M77
$$ plain form
305 18401 17678 -26359 -25618 21693 24261 7009 -18460 -31487 8506 25008 -2038 -10127 -7132
318 -7132 19302 52330 22017 -22295 -20760 -3542 11719 2431 -28826 -22864 13860 33813 25058
331 25058 -7428 -19166 12130 29751 9089 -14240 -17130 4582 29778 15937 -25832 -34180
343 -34180 -1719 22396 16922 -3204 -8735 17161 38615 22763 -12344 -33169 -11405 21898
355 21898 5231 -23358 -14777 5357 29825 32152 -9235 -25780 3666 26966 25098 -8222 -24479
368 -24479 8073 20628 5068 -9079 -34873 -16405 35241 24847 -5400 -5342 6976 34477 25406
381 25406 -19096 -24045 -16104 2075 30712 -7122 -33970 12747 26416 14093 5604 -22500 -4487
394 -4487 30240 18367 7485 -18329 -23993 32166 18044 -33914 -13898 -8287 3328 44016 9816
$$ packed form
305A8401p23m4037P41M7311K568j7252k5469j3027L9993J6502k7046q089K995
318g132K6434L3028l0313m4312J535J7218J5261r288l1257N962L6724J9953q755
331B5058l2486j1738L1296J7621k0662k3329k890K1712K5196j3841m1769q348
343c4180L2461K4115n474k0126n531K5896K1454j5852l5107k0825K1764L3303
355B1898j6667k8589Q581K0134K4468K327m1387j6545K9446K3300j868l3320j6257
368b4479L2552J2555j5560j4147k5794J8468N1646j0394l0247N8J2318K7501r071
381B5406m4502m949P941J8179K8637l7834k6848M6717J3669j2323q489k8104J8013
394d487L4727j1873j0882k5814n664N6159j4122n1958K0016N611J1615M0688l4200
$$ plain form
407 9816 -18425 9885 16959 23789 -2213 -45633 -4043 20919 -921 12996 -12922 -27828 32660
420 32660 29782 -8642 -8962 -13404 21679 36672 -11362 -6376 -2626 -17545 25916 1919 -48909
433 -48909 2991 26373 16579 23833 -15138 -7635 27639 -853 5637 -6522 -46491 21938 39228
446 39228 -28877 -4018 6286 -8583 33196 5164 -26217 7861 7164 32059 27690 -49366 -14463
459 -14463 27825 -17648 5795 1718 -38585 24918 41778 -51 594 -19243 6949 39584 -21776
472 -21776 -19274 5560 -21924 28832 29823 -41735 -7489 14097 4599 28196 -18301 -14051 42953
485 42953 -2057 2421 16267 -55282 -2011 47226 -27814 -12123 6381 -9569 45160 14386
497 14386 -27488 13345 -16052 5629 48314 -46924 -32690 47238 -6039 320 12383 -44199
$$ packed form
407I816k8241K8310P074O830k6002m3420M1590K4962k1840J3917k5918j4906O0488
420C2660k878l8424l20m442L5083J4993m8034M986L750j4919M3461k3997n0828
433d8909N1900K3382r794P254l8971P503L5274k8492O490j2159l9969O8429J7290
446C9228o8105K4859J0304j4869M1779k8032l1381L4078o97K4895m369p7056L4903
459a4463M2288m5473K3443m077m0303O3503J6860m1829O45j9837K6192L2635o1360
472b1776K502K4834k7484N0756R91p1558L4246K1586r498K3597m6497M250N7004
485D2953m5010M478J3846p1549N3271M9237p5040J5691J8504j5950N4729l0774
497A4386m1874M0833k9397K1681M2685r5238J4234P9928n3277O359J2063n6582
$$ plain form
509 -44199 6375 36688 2347 12594 -24280 -6907 58414 -12857 -30003 13871 -33961 5873
521 5873 41391 -35224 -8492 22557 2402 36279 -13269 -38942 35588 -975 -10465 30491
533 30491 -40791 -14231 49426 -16531 -9824 -490 -26868 45338 19555 -35742 28846 -7320
545 -7320 -15644 59343 -29950 -56445 32233 -1739 2045 20504 -35736 11192 29576 -10127 26764
558 26764 -24600 -40147 62005 3828 -41399 25856 -20466 -11753 43281 -24489 -18617 13090
570 13090 -6211 41479 3597 -41342 34993 2683 -23116 31690 -37091 -29609 46994 -11179
582 -11179 -1103 15531 -39012 33784 32284 -47547 17510 3294 -30265 52736 -4197 -50070
594 -50070 22545 -5003 3162 21624 -48081 9214 39511 -23085 34085 2535 -61059 45696
$$ packed form
509d4199N0574L0313l4341J0247l6874J7373O5321p1271j7146M3874m7832L9834
521E873L5518p6615K6732L1049k0155L3877m9548k5673P4530l6563r490M0956
533C0491p1282K6560O3657o5957O707R334k6378P2206k5783n5297O4588l6166
545g320q324P4987q9293k6495Q8678l3972L784J8459n6240M6928J8384l9703L6891
558B6764n1364j5547J02152n8177m5227O7255m6322Q713N5034o7770N872L1707
570A3090j9301M7690l7882m4939P6335l2310k5799N4806o8781P482P6603n8173
582a1179J0076J6634n4543P2796j500p9831O5057j4216l3559Q3001n6933m5873
594e0070P2615k7548Q165J8462o9705N7295L0297o2596N7170l1550o3594J06755
$$ plain form
606 45696 23640 -51280 10724 -10999 -12489 44431 -14785 -14131 13147 -22911 36307 19613 -58547
619 -58547 20330 23415 -26210 30310 -15608 -42688 33077 166 -7398 12793 -35917 23203
631 23203 43921 -33782 7416 2139 -33829 40782 118 -47234 18112 -6505 7165 37849
643 37849 -49723 -9434 45015 -25250 17468 15773 -57716 26890 35505 -33289 3827 -19953
655 -19953 -15167 46347 -18913 -17269 25301 -28518 26449 42749 -57803 -5284 27995 -24650
667 -24650 18751 -4520 -38862 27716 6459 -7364 16101 -38053 3770 47764 -26694 -5970
679 -5970 11432 -27162 28822 12439 -41850 4393 -6088 -145 36786 -33452 -17206 42055
691 42055 -11842 6652 13616 -50054 9808 30106 -22467 6192 -16766 -19637 45702 -8775
$$ packed form
606D5696k2056p4920O2004k1723j490N6920n9216O54K7278l6058N9218j6694p8160
619e8547P8877L085m9625N6520m5918k7080P5765l2911p564K0191m8710N9120
631B3203K0718p7703M1198n277l5968P4611m0664m7352O5346k4617J3670L0684
643C7849q7572M0289N4449p0265M2718j695p3489Q4606Q615o8794L7116k3780
655a9953M786O1514o5260J644M2570n3819N4967J6300j00552N2519L3279n2645
667b4650M3401k3271l4342O6578k1257j3823K3465n4154M1823M3994p4458K0724
679e970J7402l8594N5984j6383n4289M6243j0481N943L6931p0238J6246N9261
691D2055n3897J8494O964o3670N9862K0298n2573K8659k2958k871O5339n4477
$$ plain form
703 -8775 -26335 21700 -22470 7362 41191 -36721 -12608 23025 -13531 14969 -7562 -38988
715 -38988 22083 6128 -9161 24450 -26321 -10093 43618 -15520 -16532 7826 -21889 16366
727 16366 15002 -29988 3032 -2874 -5414 32041 -20992 -26097 28804 -4129 1230 16805 -31820
740 -31820 -147 21811 -17419 1566 -11779 -20855 34091 3326 -22237 14916 -12545 -1422
752 -1422 29239 -23349 -15518 13209 -9900 12835 -222 -32546 14000 9741 -11778 14514 -17108
765 -17108 -15247 31942 -120 -11280 2244 -19139 9037 13538 -23654 -1336 -420 -6824 26754
778 26754 -5797 -26696 13913 2757 373 10130 -24381 -7780 16618 -5289 2738 -7609 -21355
791 -21355 19377 9387 -17109 3525 -6820 -258 24971 -10198 -18632 2080 -5925 10032 4354
$$ packed form
703h775j7560M8035m4170K9832L3829p7912K4113L5633l6556K8500k2531l1426
715c8988O1071j5955j5289L3611n0771J6228N3711n9138j012K4358k9715L8255
727A6366j364m4990L3020n906k540L7455n3033n105N4901l2933N359J5575m8625
740c1820L1673K1958l9230J8985j3345r076N4946l0765k5563L7153k7461J1123
752a422L0661n2588P831K8727k3109K2735j3057l2324M6546m259k1519K6292l1622
765a7108J861M7189l2062j1160J3524k1383K8176M501l7192K2318R16o404L3578
778B6754l2551k0899M0609j1156k384R757l4511J6601K4398k1907Q027j0347j3746
791b1355M0732r990k6496K0634j0345O562K5229l5169q434K0712q005J5957n678
$$ plain form
804 4354 -24516 769 10716 -2359 9506 -10419 -15290 17346 4031 -8056 -3029 -15754 5550
817 5550 17313 -12301 -8764 -3612 -7001 15883 2990 -17326 3277 4438 2057 6401 -16221
830 -16221 -11009 9988 813 -331 -6357 -15589 9326 12586 -5999 -2964 -7646 -3897 13705 -1556
844 -1556 -12518 -1504 -798 5839 2465 -15977 -6854 5889 4433 6583 -7197 -12899 7170 7993
858 7993 -3062 -4745 -10627 -2744 9222 -412 -8038 -5999 37 10056 2638 -11746 -6756 1493
872 1493 5759 5795 -7318 -12485 -565 5840 1877 -6514 -9624 1043 7981 2382 -4379 -7204 -1979
887 -1979 8084 4746 -9526 -11619 -125 6723 2828 -4369 -8453 -3084 6148 5220 -4467 -9690 -1662
902 -1662 9283 2881 -9046 -7085 -2414 2935 7490 -4964 -13322 -460 7862 5512 -2710 -10662
$$ packed form
804D354k8870K5285R947j3075J1865j9925m871L2636j3315j2087N027j2725K1304
817E550J1763k9614L537N152l389K2884j2893k0316K0603J161k381M344k2622
830a6221N212K0997r175j144o026r232K4915L260j8585L035m682L749J7602j5261
844a556j0962J1014P06O637l374j8442R123J2743j456K150j3780n702K0069Q23
858G993j1055j683n882P883J1966r634p626K039O036J0019p418j4384M990Q249
872A493M266L6j3113n167J1920O405l963q391l110J0667O938n599o761k825N225
887a979J0063l338j4272k093J1494O848l895p197m084N369R232r28r687n223Q028
902a662J0945o402j1927J961M671N349M555j2454q358J2862Q322k350q222p952
$$ plain form
916 -10662 -1437 6861 685 -1938 -8524 -8937 9989 7735 -10318 -7223 -1726 3963 9393 -5164
930 -5164 -10386 -1215 1414 8658 497 -17676 -2190 10086 -915 -1474 -7091 -8463 9854 7978
944 7978 -4342 -7228 -9702 7394 13487 -10510 -9782 -4 -2197 10412 3468 -16809 -3690 7069
958 7069 5654 2170 -14350 -6267 11924 979 -233 -3661 -16546 6394 14870 -8348 -6691 -3909
972 -3909 -376 14066 -2927 -12170 2139 -3069 6160 9497 -19363 -7214 14485 -229 650 -4804
986 -4804 -14564 9450 9298 -5214 -1084 -12668 -670 21284 -7540 -14660 3767 -3819 7617
999 7617 9154 -16564 -6266 6114 4334 8758 -12769 -13712 13849 2352 -2752 3692 -15480 -352
1013 -352 17238 -6104 -6170 -3231 -4155 15560 -915 -15744 5176 -2886 1149 16068 -16357 -12886
$$ packed form
916a0662R225Q298o176k623o586m13J8926k254j8053L095N497N689N430j4557
930e164n222R171K629P244q161j8173J5486J2276j1001n59n617j372J8317j876
944G978j2320k886k474J7096O093k3997P28R778k193J2609o944k0277J3119J0759
958G069j415l484j6520Q083J8191j0945j212l428j2885K2940Q476k3218J657K782
972c909L533J4442j6993r243J4309n208R229L337k8860J2149K1699j4714Q79n454
986d804r760K4014j52j4512M130j1584J1998K1954k8824p120J8427p586J1436
999G617J537k5718J0298J2380j780M424k1527r43K7561j1497n104O444j9172J5128
1013c52J7590k3342o6K939r24J9715j6475j4829K0920q062M035J4919l2425L471
$$ plain form
1027 -12886 15809 101 1520 -331 -18513 8882 13005 -9170 2941 -9741 -10147 25357 469
1040 469 -19939 3731 -2961 4223 14962 -14416 -9272 5972 -314 12130 -5059 -20522 12326
1053 12326 7994 -6401 5670 -11213 -5492 17413 -2519 -5449 -2577 -8539 15937 5265 -18572
1066 -18572 4598 74 -3590 17820 -10564 -16141 14037 1215 3168 2623 -22753 6718 17421
1079 17421 -11392 4390 -5174 -17587 24139 9046 -20265 2819 -3351 1523 18187 -13835
1091 -13835 -10179 8731 -5259 12124 3543 -25906 8642 14015 -8512 6276 -7170 -9968 17653
1104 17653 316 -6677 642 -11832 11819 12433 -18929 906 4491 -5176 17452 -5136 -18434
1117 -18434 12008 1440 2886 9105 -23249 -324 21336 -10114 2157 1242 -19360 17239 13443
$$ packed form
1027a2886K8695j5708J419j851j8182K7395M123k2175J2111j2682m06L5504k4888
1040D69k0408K3670o692P184J0739k9378N144J5244o286J2444j7189j5463L2848
1053A2326m332j4395J2071j6883N721K2905j9932k930K872n962K4476j0672k3837
1066a8572K3170m524l664K1410k8384n577L0178j2822J953n45k5376K9471J0703
1079A7421k8813J5782r564j2413M1726j5093k9311K3084o170M874J6664l2022
1091a3835L656J8910j3990J7383q581k9449L4548N373k2527J4788j3446k798K7621
1104A7653j7337o993P319j2474K3651O14l1362J9835L585r667K2628k2588j3298
1117a8434L0442j0568J446O219l2354K2925K1660l1450J2271r15k0602L6599l796
$$ plain form
1130 13443 -16454 2257 -4319 -613 21280 -12192 -12464 11425 -8402 7953 12053 -23833 1792
1143 1792 16683 -6814 5422 -4355 -11315 16136 1260 -6260 4577 -13937 6339 18578 -16644
1156 -16644 -3047 6611 -8058 15262 2164 -18234 9523 2082 -611 12456 -18890 -6970
1168 -6970 20500 -6729 1084 4803 -18578 12371 14565 -13573 4409 -4384 -6101 22865 -7110
1181 -7110 -15282 12572 -6745 2874 15199 -19354 -3203 15142 -4330 7957 -2170 -14911
1193 -14911 15207 3226 -8401 8062 -12385 -1437 21172 -9627 -6620 6754 -7294 13040
1205 13040 6936 -16711 5825 2134 -2464 15662 -12457 -12561 17244 -3035 -654 6877 -16115
1218 -16115 6657 15824 -9131 3442 -3772 -9385 20501 -727 -14931 8717 -5690 1650 16500
$$ packed form
1130A3443k9897J8711o576L706K1893l3472k72K3889j9827J6355M100l5886K5625
1143A792J4891k3497J2236r777o960K7451j4876p520J0837j8514K0276J2239l5222
1156a6644J3597R658j4669K3320j3098k0398K7757p441k693J3067l1346J1920
1168f970K7470k7229P813L719k3381L0949K194k8138J7982q793j717K8966k9975
1181g110q172K7854j9317R619J2325l4553J6151J8345j9472J2287j0127j2741
1193a4911L0118j1981j1627J6463k0447J0948K2609l0799L007J3374j4048K0334
1205A3040o104k3647K2536l691m598J8126k8119j04K9805k0279K381P531k2992
1218a6115K2772R167k4955J2573p214n613K9886k1228j4204K3648j4407P340J4850
$$ plain form
1231 16500 -14398 -5011 12106 -3755 9438 502 -17343 12156 6955 -7193 7780 -11381
1243 -11381 -6400 19938 -3836 -5856 5070 -8715 11152 11387 -15316 2358 3196 -4212 14760
1256 14760 -6331 -15430 11840 1867 810 7116 -14648 1971 15274 -5549 3433 -1818 -11359
1269 -11359 16193 4876 -13731 4079 -3930 473 15932 -8869 -7078 8564 -1727 9862
1281 9862 3251 -16654 6607 7545 -5097 7190 -8065 -8011 16792 417 -5260 3526 -8123 7940
1295 7940 13387 -10803 -1270 2339 -3630 12577 -2419 -14257 7186 2520 1748 7702 -11414 -1013
1309 -1013 14381 -1829 1207 -886 -10958 10560 8175 -9012 611 -3252 331 13729 -4934
1322 -4934 -7219 6070 -484 7914 5611 -13706 1253 7863 -2135 4683 -5916 -9070 11786 4581
$$ packed form
1231A6500l0898R387J7117j5861J3193q936j7845K9499n201j4148J4973j9161
1243a1381M981K6338k3774k020J0926j3785J9867K35k6703J7674Q38p408J8972
1256A4760k1091r099K7270r973j057O306k1764J6619J3303k0823Q982n251r541
1269a1359K7552j1317j8607J7810q009M403J5459k4801J791J5642j0291J1589
1281I862o611j9905K3261R38j2642J2287j5255N4K4803j6375n677Q786j1649J6063
1295G940N447k4190R533L609n969J6207j4996j1838K1443m666p72N954j9116J0401
1309a013J5394j6210L036k093j0072K1518k385j7187R623l863L583J3398j8663
1322d934k285J3289o554Q398k303j9317J4959O610r998O818j0599l154K0856p205
$$ plain form
1336 4581 -2823 1833 -6321 4893 12145 -5991 -3230 677 -2680 10600 1302 -12048 2177 3394
1350 3394 2389 7284 -7230 -4604 10325 2804 1500 -1214 -8948 5412 7620 -4555 -1531 -3652
1364 -3652 -582 12040 691 -6764 1718 933 6303 5949 -8636 -3243 5003 1498 3689 -3733 -7924
1379 -7924 6218 6405 515 272 -5185 2057 10617 -216 -4030 -2215 -2225 7124 3914 -7995 -2545
1394 -2545 3032 4316 6013 -3125 -5103 4691 5298 2839 -2298 -7457 1499 7561 45 -3049 -3975
1409 -3975 -823 8150 4951 -3811 -2757 1637 6147 4562 -4416 -5360 958 4195 3418 -3020 -6700
1424 -6700 1462 7335 4237 -1595 -4504 288 6889 4044 -2870 -4860 -1159 4645 4323 -3698 -6069
1439 -6069 740 6567 4790 -562 -4442 -560 6604 4466 -2601 -5281 -2287 4278 4669 -3574 -4516
$$ packed form
1336D581p404M656q154J1214P252j8136K761L907l357J3280r298j3350J4225J217
1350C394j005M895j4514K626J4929p521j304k714p734J4360K208j2175L024k121
1364c652L070J2622j1349p455Q482p85N370l54j4585N393Q246l505K191p422m191
1379g924J4142J87n890k43n457P242Q560j0833l814J815j0R349l210j1909N450
1394b545N577J284J697r138j978R794O07k459n137n159Q956O062p516l094r26
1409c975L152Q973l199q762J054M394M510j585q978r44O318L237p77o438l680
1424f700Q162N873l098n832k909M792O601k845o914j990L701N804l22q021k371
1439f069O809N827j777n352l880L882P164k138p067k680K994O565L91q243r42
$$ plain form
1454 -4516 1322 4039 5493 354 -6338 595 7428 3059 -1410 -5282 -3337 5373 3764 -2741 -3454
1469 -3454 -1837 5083 7773 -1978 -4629 860 3784 5480 -890 -7615 -1968 3434 4181 969 -6714
1484 -6714 -2421 6828 3970 965 -2066 -3538 5522 5595 -3031 -3577 -3694 1585 8098 -2759 -6549 1944
1500 1944 1548 5532 4922 -7726 -1639 6794 1139 1400 -4189 -7307 5977 4963 -3565 -901 -4165
1515 -4165 1250 11549 -310 -5826 679 -127 5654 3514 -8819 -2987 2663 1974 3977 -5100 -6139
1530 -6139 6901 5058 1110 -294 -6489 2891 7722 -2705 -2759 -3966 -2641 8861 621 -7485 1708
1545 1708 674 3769 7583 -6770 -4442 6638 458 2523 -1734 -10618 4420 6429 -3894 1027
1559 1027 -3567 -2136 12118 1413 -6467 857 -2167 4221 5983 -9236 -4465 3021 97 5402
$$ packed form
1454d516N838K717J454n139o692O933O833m369m469l872J945Q710j609o505p13
1469c454J617O920K690r751k651N489K924J696o370o725N647N402P47l212p683
1484f714M293R249k858l005l031j472R060P3q626n46j17N279O513j0857l790Q493
1500A944l96L984o10j2648O087Q433n655K61n589l118J3284j014q528K664l264
1515d165N415J0299j1859n516O505q06N781k140j2333N832N650o89K003r077j039
1530f139J3040j843l948j404o195R380M831j0427n4j207J325J1502q240q106R193
1545A708j034L095L814j4353K328J1080o180K065m257q884J5038K009j0323M921
1559A027m594J431J4254j0705p880P324l024O388J762j5219M771P486k924N305
$$ plain form
1573 5402 -2530 -8983 5841 5899 534 1793 -7148 -504 9108 -1939 -3401 -2987 -5618 7675 4402
1588 4402 -7848 682 684 1615 9021 -4894 -6576 5710 -95 2020 960 -11876 1252 8061 -3499
1603 -3499 1370 -2491 -4951 11035 3437 -6622 1188 -3322 2271 8497 -8872 -6322 3806 -1344
1617 -1344 5963 1079 -11135 3610 6844 -145 3571 -6068 -4788 9363 -732 -4401 -1055 -7032
1631 -7032 5236 7565 -7458 -1013 1635 -535 9467 -1621 -9130 4042 308 347 3046 -10229
1645 -10229 -1923 8021 -2334 900 -1423 -6278 9802 5024 -6670 843 -3853 -273 9876 -6693
1659 -6693 -7882 3485 -2049 4851 3763 -10740 1796 7002 -907 4251 -5378 -7405 8971 760
1673 760 -4996 474 -7958 1859 10146 -5810 -2287 2543 -2767 8045 1740 -9856 2436 1250
$$ packed form
1573E402p932o453J4824N8n365J259q941O644R612j1047j462M14k631J3293l273
1588D402j2250Q530KR31P406j3915j682J2286n805K115j060j2836J3128O809j1560
1603c499M869l861k460J5986p598j0059P810m510N593O226j7369K550J0128n150
1617a344P307m884j2214J4745L234o989L716r639J280J4151j0095l669L346n977
1631g032J2268K329j5023O445K648k170J0002j1088p509J3172l734L9K699j3275
1645a0229Q306R944j0355L234k323m855J6080m778j1694P513m696L580J0149j6569
1659f693j189J1367n534O900j088j4503J2536N206p909N158r629k027J6376q211
1673G60n756N470q432R817Q287j5956L523M830n310J0812o305j1596J2292j186
$$ plain form
1687 1250 -1000 4043 -8811 -4698 8185 -1333 410 680 -7824 6802 7332 -6255 418 -2647
1701 -2647 -3346 8912 -3607 -8810 2899 -1817 3469 5371 -9619 -383 6906 -1547 4282 -2835
1715 -2835 -9692 7132 2111 -5583 1673 -6462 -1154 9985 -4131 -3227 3193 -3179 6237 3396
1729 3396 -9913 683 1556 -2206 4835 -6417 -6784 7280 -627 -332 2704 -7619 3558 8048
1743 8048 -5602 -675 -1683 -4692 7439 -1150 -8451 2085 -2199 1844 7248 -7444 -2168 6252
1757 6252 -2318 3700 -238 -9702 4436 3051 -5539 1720 -4992 -2764 9277 -1905 -3395 2885
1771 2885 -4234 4259 5378 -8266 -555 1270 -3513 4960 -3354 -7785 5697 698 -904 3747
1785 3747 -6197 265 7746 -3406 -675 -1138 -6258 5368 1323 -6979 1779 -2146 -226 7593 -4779
$$ packed form
1687A250k250N043j2854M113J2883r518J743K70q504J4626N30j3587O673l065
1701b647o99J2258j2519n203J1709m716N286J902j4990R236P289q453N829p117
1715b835o857J6824n021p694P256q135N308J1139j4116R04O420o372R416k841
1729C396j3309J0596Q73l762P041j1252l67J4064p907K95L036j0323J1177M490
1743H048j3650M927j008l009J2131q589p301J0536m284M043N404j4692N276Q420
1757F252q570O018l938r464J4138j385q590P259o712K228J2041j1182j490O280
1771B885p119Q493J119j3644P711J825m783Q473q314m431J3482m999j602M651
1785C747r944O462P481j1152K731m63n120J1626m045q302Q758l925J920P819j2372
$$ plain form
1800 -4779 -3557 5401 -1819 2351 1533 -8966 1167 3321 -3792 1714 -3763 -4569 7372 214 -2625
1815 -2625 2698 -4188 1998 5825 -6431 -2095 914 -3590 4385 -810 -7580 3084 1150 -221
1829 -221 4386 -5100 -2181 6010 -1662 -244 -497 -6843 2936 2754 -5561 696 -1283 -1243 7143 -1608
1845 -1608 -4454 2639 -1242 1903 2703 -7297 -1424 2293 -2343 2123 -2349 -5314 5331 1790 -2163
1860 -2163 1850 -3581 426 5868 -3590 -3334 -714 -3340 3538 1183 -5992 908 1175 321 4308 -3591
1876 -3591 -3303 4456 -202 -506 -660 -6177 771 3690 -3026 -814 -1846 -1547 5936 713 -3659 869
1892 869 -832 1350 2640 -5565 -3066 1905 -597 1388 -1502 -4944 3086 3661 -588 391 -3124 -950
1908 -950 4669 -1234 -3163 -1472 -2557 2605 1801 -4536 -1054 1224 1295 3736 -1823 -4029 2038 1383
$$ packed form
1800d779J222Q958p220M170q18j0499J0133K154p113N506n477q06J1941p158k839
1815b625N323o886O186L827j2256M336L009m504P975n195o770J0664j934j371
1829b21M607r486K919Q191p672J418k53o346R779j82q315O257j979M0Q386q751
1845a608k846P093l881L145Q00j0000N873L717m636M466m472k965J0645l541l953
1860b163M013n431M007N442r458K56K620k626O878k355p175O900K67q54L987p899
1876c591K88P759m658l04j54n517O948K919o716K212j032K99P483n223m372M528
1892H69j701K182J290q205K499M971k502J985k890l442Q030N75m249R79l515K174
1908i50N619n903j929J691j085N162q04o337L482K278P1K441n559k206O067o55
$$ plain form
1924 1383 43 -1021 -5088 -925 2955 -471 -1137 -1774 -1088 4231 2053 -2826 -1010 -424 1505 2457
1940 2457 -3313 -4002 -11 727 1280 -1017 -3842 766 3237 1127 -173 -2509 -1012 2756 630 -2758
1956 -2758 -2827 -1712 1923 2347 -2212 -2033 267 1800 2806 -343 -3404 -324 2258 1108 -1524 -3757
1972 -3757 -1799 1872 1485 -1031 -2223 -867 2876 3194 -759 -2740 -954 1209 1270 -1099 -3430 -1807
1988 -1807 1821 1855 -923 -2488 -541 2344 2430 -784 -2166 -992 1064 1812 -1366 -4155 -1629 1569
2004 1569 1737 -89 -2600 -826 2732 2381 347 -2174 -2408 1613 2357 -1735 -3002 -1858 875 2895
$$ packed form
1924A383j340j064m067M163L880l426o66o37O86N319k178m879J816N86J929R52
1940B457n770o89L991P38N53k297k825M608K471k110j300k336J497L768k126l388
1956b758o9J115L635M24m559J79K300J533J006l149l061L080K582j150k632k233
1972c757J958L671l87k516j192J356L743L18l953j981J786K163O1k369k331J623
1988a807L628L4k778j565J947K885Q6l214j382J174K056P48l178k789K526L198
2004A569J68j826k511J774L558l51k034k521k34M021P44m092j267J144K733K020
$$ [...]
8191a2
##END NTUPLES=NMR FID
##END=
