##TITLE=1H_LR-757-R2-CH2Cl2-2
 CCl4
 8 sc, 
 27.1.2023
##JCAMPDX= 6.0         $$ Bruker NMR JCAMP-DX V2.0
##DATA TYPE= NMR FID
##DATA CLASS= NTUPLES
##ORIGIN= UXNMR, Bruker Analytische Messtechnik GmbH
##OWNER= root
$$ XWIN-NMR		Version 3.5
$$ Fri Jan 27 14:09:13 2023 Russian Standard Time (UT+4h)  she@DPX200
##.OBSERVE FREQUENCY= 200.13135
##.OBSERVE NUCLEUS= ^1H
##.DELAY= (6, 6)
##.ACQUISITION MODE= SIMULTANEOUS
##.ACQUISITION SCHEME= undefined
##.AVERAGES= 8
##.DIGITISER RES= 18
##SPECTROMETER/DATA SYSTEM= spect
##.PULSE SEQUENCE= zg30
##.SOLVENT NAME= CDCl3
##.SHIFT REFERENCE= (INTERNAL, CDCl3, 0, 15.7039)
##AUDIT TRAIL= $$ (NUMBER, WHEN, WHO, WHERE, WHAT)
$$ ##TITLE= Audit trail, XWIN-NMR		Version 3.5
$$ ##JCAMPDX= 5.01
$$ ##ORIGIN= Bruker BioSpin GmbH
$$ ##OWNER= she
$$ F:/spectra/data/she/nmr/H-F/1/audita.txt
$$ ##AUDIT TRAIL=  $$ (NUMBER, WHEN, WHO, WHERE, WHAT)
(   1,<2023-01-27 14:07:55.85 +0400>,<she>,<DPX200>,
      <created by zg, POWCHK disabled, PULCHK disabled
       configuration hash MD5:
       00 E9 B6 7A A2 85 ED C7 34 08 36 98 17 FE 4E 26
       data hash MD5: 16K
       0A 68 41 70 D7 47 43 EE D4 CF 81 6E 1F A9 8A A8>)
$$ ##END=
$$ 
$$ hash MD5
$$ 90 A5 45 C5 E9 80 B6 4B 23 BB BD 2B 68 DE 89 14
##$RELAX= 
##$RELAX= 
##$RELAX= 
##$RELAX= 
##$RELAX= 
##$RELAX= 
$$ Bruker specific parameters
$$ --------------------------
##$DU= <F:/spectra>
##$EXPNO= 1
##$NAME= <H-F>
##$PROCNO= 1
##$TYPE= <nmr>
##$USER= <she>
##$AMP= (0..31)
100 100 100 100 100 100 100 100 100 100 100 100 100 100 100 100 100 100 
100 100 100 100 100 100 100 100 100 100 100 100 100 100 
##$AQSEQ= 0
##$AQ_mod= 1
##$AUNM= <au_zg>
##$AUTOPOS= <>
##$BF1= 200.13
##$BF2= 200.13
##$BF3= 200.13
##$BF4= 200.13
##$BF5= 200.13
##$BF6= 200.13
##$BF7= 200.13
##$BF8= 200.13
##$BYTORDA= 1
##$CFDGTYP= 0
##$CFRGTYP= 5
##$CHEMSTR= <none>
##$CNST= (0..31)
1 1 145 1 1 1 1 1 1 1 1 1 1 1 1 1 1 1 1 1 1 1 1 1 1 1 1 1 1 1 1 1 
##$CPDPRG= <>
##$CPDPRG1= <>
##$CPDPRG2= <>
##$CPDPRG3= <>
##$CPDPRG4= <mlev>
##$CPDPRG5= <mlev>
##$CPDPRG6= <mlev>
##$CPDPRG7= <mlev>
##$CPDPRG8= <mlev>
##$CPDPRGB= <>
##$CPDPRGT= <>
##$D= (0..31)
0 1.2 0 0 0 0 0 0 0 0.06 0 0.03 0 0 0 0 0.0002 0 0 0 0 0 0 0 0 0 0 0 0 
0 0 0 
##$DATE= 1674814075
##$DBL= (0..7)
120 120 120 120 120 120 120 120 
##$DBP= (0..7)
150 150 150 150 150 150 150 150 
##$DBP07= 0
##$DBPNAM0= <>
##$DBPNAM1= <>
##$DBPNAM2= <>
##$DBPNAM3= <>
##$DBPNAM4= <>
##$DBPNAM5= <>
##$DBPNAM6= <>
##$DBPNAM7= <>
##$DBPOAL= (0..7)
0.5 0.5 0.5 0.5 0.5 0.5 0.5 0.5 
##$DBPOFFS= (0..7)
0 0 0 0 0 0 0 0 
##$DE= 6
##$DECBNUC= <off>
##$DECIM= 32
##$DECNUC= <off>
##$DECSTAT= 4
##$DIGMOD= 1
##$DIGTYP= 9
##$DL= (0..7)
0 120 120 120 120 120 120 120 
##$DP= (0..7)
150 150 150 150 150 150 150 150 
##$DP07= 0
##$DPNAME0= <>
##$DPNAME1= <>
##$DPNAME2= <>
##$DPNAME3= <>
##$DPNAME4= <>
##$DPNAME5= <>
##$DPNAME6= <>
##$DPNAME7= <>
##$DPOAL= (0..7)
0.5 0.5 0.5 0.5 0.5 0.5 0.5 0.5 
##$DPOFFS= (0..7)
0 0 0 0 0 0 0 0 
##$DQDMODE= 0
##$DR= 18
##$DS= 0
##$DSLIST= <SSSSSSSSSSSSSSS>
$$ [...]
##$SUBNAM2= <"">
##$SUBNAM3= <"">
##$SUBNAM4= <"">
##$SUBNAM5= <"">
##$SUBNAM6= <"">
##$SUBNAM7= <"">
##$SUBNAM8= <"">
##$SUBNAM9= <"">
##$SW= 18.05172834244
##$SWIBOX= (0..15)
0 0 2 0 0 0 0 0 0 0 0 0 0 0 0 0 
##$SW_h= 3612.71676300578
##$TD= 16384
##$TD0= 1
##$TE= 0
##$TE2= 300
##$TE3= 300
##$TEG= 300
##$TL= (0..7)
0 120 120 120 120 120 120 120 
##$TP= (0..7)
150 150 150 150 150 150 150 150 
##$TP07= 0
##$TPNAME0= <>
##$TPNAME1= <>
##$TPNAME2= <>
##$TPNAME3= <>
##$TPNAME4= <>
##$TPNAME5= <>
##$TPNAME6= <>
##$TPNAME7= <>
##$TPOAL= (0..7)
0.5 0.5 0.5 0.5 0.5 0.5 0.5 0.5 
##$TPOFFS= (0..7)
0 0 0 0 0 0 0 0 
##$TUNHIN= 0
##$TUNHOUT= 0
##$TUNXOUT= 0
##$USERA1= <user>
##$USERA2= <user>
##$USERA3= <user>
##$USERA4= <user>
##$USERA5= <user>
##$V9= 5
##$VALIST= <valist>
##$VCLIST= <CCCCCCCCCCCCCCC>
##$VD= 0
##$VDLIST= <DDDDDDDDDDDDDDD>
##$VPLIST= <PPPPPPPPPPPPPPP>
##$VTLIST= <TTTTTTTTTTTTTTT>
##$WBST= 1024
##$WBSW= 4
##$XGAIN= (0..3)
0 0 0 0 
##$XL= 0
##$YL= 0
##$YMAX_a= 369849
##$YMIN_a= -438328
##$ZGOPTNS= <>
##$ZL1= 120
##$ZL2= 120
##$ZL3= 120
##$ZL4= 120
##$ABSF1= 10
##$ABSF2= 0
##$ABSG= 5
##$ABSL= 3
##$ALPHA= 0
##$AQORDER= 0
##$ASSFAC= 0
##$ASSFACI= 0
##$ASSFACX= 0
##$ASSWID= 0
##$AUNMP= <proc_1d>
##$AZFE= 0.1
##$AZFW= 0.1
##$BCFW= 1
##$BC_mod= 2
##$BYTORDP= 1
##$COROFFS= 0
##$CY= 11.3945322036743
##$DATMOD= 1
##$DC= 2
##$DFILT= <>
##$DTYPP= 0
##$F1P= 2.36226072786647
##$F2P= -0.459571619588291
##$FCOR= 0.5
##$FTSIZE= 0
##$FT_mod= 4
##$GAMMA= 1
##$GB= 0.15
##$INTBC= 1
##$INTSCL= 1
##$ISEN= 128
##$LB= 0.24
##$LEV0= 0
##$LPBIN= 0
##$MAXI= 10000
##$MC2= 0
##$MEAN= 0
##$ME_mod= 0
##$MI= 1.114404
##$NCOEF= 0
##$NC_proc= 0
##$NLEV= 6
##$NOISF1= 3.799351
##$NOISF2= 2.8
##$NSP= 1
##$NTH_PI= 0
##$NZP= 0
##$OFFSET= 15.70392
##$PC= 1
##$PHC0= -19107.08
##$PHC1= 6.400789
##$PH_mod= 1
##$PKNL= yes
##$PPARMOD= 0
##$PSCAL= 0
##$PSIGN= 0
##$REVERSE= no
##$SF= 200.130013532006
##$SI= 16384
##$SIGF1= 3
##$SIGF2= 2
##$SINO= 400
##$SIOLD= 16384
##$SREGLST= <1H.CDCl3>
##$SSB= 0
##$STSI= 0
##$STSR= 0
##$SW_p= 3612.71676300578
##$SYMM= 0
##$S_DEV= 0
##$TDeff= 0
##$TDoff= 0
##$TI= <>
##$TILT= no
##$TM1= 0
##$TM2= 0
##$TOPLEV= 0
##$USERP1= <user>
##$USERP2= <user>
##$USERP3= <user>
##$USERP4= <user>
##$USERP5= <user>
##$WDW= 1
##$XDIM= 8192
##$YMAX_p= 0
##$YMIN_p= 0
$$ End of Bruker specific parameters
$$ ---------------------------------
##NTUPLES= NMR FID
##VAR_NAME=  TIME,          FID/REAL,        FID/IMAG
##SYMBOL=    X,             R,               I
##VAR_TYPE=  INDEPENDENT,   DEPENDENT,       DEPENDENT
##VAR_FORM=  AFFN,          ASDF,            ASDF
##VAR_DIM=   8192,          8192,            8192
##UNITS=     SECONDS,       ARBITRARY UNITS, ARBITRARY UNITS
##FACTOR=    0.0002768,     1,               1
##FIRST=     0,             0,               0
##LAST=      2.2672688,     0,               0
##MIN=       0,             -438328,         0
##MAX=       2.2672688,     369849,          0
$$ Real data points
##PAGE= N=1
##DATA TABLE= (X++(R..R)), XYDATA
0@%%%%%%%%qJ6j6J6j7K5m0M8n6P2q8J04j28J60j92K24k63L07l56M16m81N54o35
31c38P23q24R34j056J192j342J507j686J884k101K338k597K881l190L525l892
47b042M293m733N217n748O330o972P687q485R380j0390J1540j2865J4410j6237
61h615J8438k1154K4600k9136L5409m4724O0188r2044K68174l61525o8452M51824
73B32983m60697K74076M4082l66992K86812O2360m9519K34007m98345Q8910M87847
84C35524m27131L8416K46870m36478L06571J92268m47217J35054l5579p1180M33163
95B70281l16319j50776M46324k42643K4203K31791m99165Q2738K87200k21267
105h7633J51001j27742j67765M93351j84303k40478L43664l31352N600N15506
$$ y = [0, 0, 0, 0, 0, 0, 0, 0, 0, -8, 8, -8, 8, -9, 16, -24, 24, -32, 40, -48, 56, -72, 88, -104, 120, -143, 164, -192, 224, -257, 297, -338, 385, -439, 495, -561, 631, -711, 796, -890, 994, -1107, 1231, -1366, 1515, -1675, 1850, -2042, 2251, -2482, 2735, -3013, 3317, -3655, 4032, -4453, 4927, -5463, 6077, -6788, 7622, -8615, 9823, -11331, 13269, -15867, 19542, -25182, 35006, -57038, 211136, -150389, -218841, 232983, -227714, 46362, 90444, -276548, 10264, 72624, 23105, 257112, -241233, -152323, 335524, -91607, -53191, 193679, -242799, 63772, 256040, -191177, -56123, -91702, -162882, 270281, -46038, -196814, 249510, 6867, 31070, 262861, -236304, -153566, 133634, -87633, 63368, -64374, -232139, 261212, 76909, -163569, 180095, -151257, -145657, 369849]
115C69849l96821j47025K94471j71038J21699k2693l06317K59396j9857n6230
125g4566L55376l54479j15761N11423k74649j64135K13110k88237J28677K33809
135A70568k65681R4073j9037r5755L56697k19652k55231L51618j13431k3660K49374
146B29883l28785j6854K35546j78916Q6993p5019k20335L92668J4205k37401K48254
157A50239j58560j04858L40326k20216j75041J67600q3303J60303L3471k87688
167a77727J99072L7061j60283K63035j68677k12879L77042l2970j58653J02022
177F7043j75911O2615J47199k06048P2613M549j06875L34399o0557k91188K15722
188F3561k3603q8166J63851j97158m9733J95628p6434Q1272l5951k35187K48426
$$ y = [369849, -26972, -173997, 120474, -50564, 71135, 48442, -257875, 1521, -18336, -74566, 280810, -73669, -189430, 321993, 47344, -116791, 96319, -191918, -63241, 170568, -95113, -1040, -20077, -115832, 240865, 21213, -234018, 117600, 4169, -19491, 229883, -98902, -115756, 119790, -59126, 27867, -47152, -267487, 125181, 139386, -98015, 150239, -8321, -113179, 227147, 6931, -168110, -510, -83813, 76490, 109961, -177727, 21345, 58406, -101877, 161158, -7519, -220398, 156644, 123674, -34979, 67043, -108868, -46253, 100946, -105102, -32489, -27940, -134815, 199584, 139027, -152161, 63561, 39958, -48208, 115643, -81515, -131248, 64380, -12054, 69218, 33267, -201920, 46506]
199D6506P8201k18618J42827m3658q6569K50904r4457j61235O7326q0146J15919
210A7000O4816k39266J24489J22422j12794J56269p2417k16120J93877L5678j00505
221b6551L9490j15942P3646J55348j57880R369J7326j24101K09401M4827k21742
232i6809R8448N3319l5403Q5125j51068p5215J25347m5098O4595K2123j78659
243a33295J51990J33904j56502J8775k9421p1019J58810k4080j05110M2963m2668
254e5653Q4537P4899j96817R209J16246m4419Q6638j3298j40323J02432N4382
265G7833o3738j4633j10854L0873J50823o7728k1648L2704o2284J09467N1503
276A12318j58624p098M4926J6224O9037q6301p0519Q5665j334J2867J985j21802
$$ y = [46506, 124707, -93911, 48916, 5258, -81311, 169593, 75136, -86099, -18773, -98919, 17000, 81816, -157450, -32961, 89461, -23333, 132936, 60519, -155601, 38276, 73954, -26551, 12939, -103003, -29357, 125991, -31889, -22520, -5194, -129295, 80106, 124933, -96809, 1639, 54958, 19555, 104680, -46388, -121603, 3744, -41354, 23241, 45364, -133295, 18695, 152599, -3903, 14872, -14549, -85568, 73242, 49162, -55948, -12985, -55653, 28884, 103783, -93034, -83825, 32421, -11998, 74640, 61342, -78981, 23451, 77833, 14095, -538, -111392, -80519, 70304, 2576, -19072, 13632, -48652, 60815, 112318, -46306, -53404, -8478, 7746, 76783, -9518, -80037, 5628, 4294, 17161, 19146, -102656]
288a02656O0721J33315m4441k0751k6266l6765Q7154p365r4996r254n709P1118
300D105Q0961r4515l9713O6246P978K7442k9245r5984M3570P6265m383k6930p2089
313e6292k175Q9214p348m8843j2797n66Q1853N6550p7701n4272J5457K7016K2846
326C2942m9287o3179L3477O6710L2000k6332o5493P343P0374J0381m4703l7978
338c3745J703N6474L7492n2105p0342O160N6374K5864k8828l9307J8502O7028
350D5270K9211l7045o5190k4631N9114L3247o1514l5242K4090L8996N0265k4308
362C2263p5788P924N3799L1464j9463p2528J0263P2997q327k6768l7881n0110
374h2155P0397O7026n4639k7332J3793M0111N3998n7349o6079J5597M26M6969
$$ y = [-102656, -41935, 91380, 46939, 26188, -78, -36843, 50311, 42946, -52050, -61304, -67013, 4105, 85066, -9449, -49162, 17084, 25062, 52504, 23259, -72725, -29155, 47110, 42727, 15797, -56292, -58467, 30747, 23399, -25444, -38241, -38807, 43046, 99596, 21895, -32377, -16920, 10096, 32942, -16345, -79524, -46047, 20663, 52663, 26331, -39162, -31819, 38555, 48936, 4233, -33745, -32042, 24432, 61924, 9819, -60523, -54363, 2011, 27875, -953, -40260, -21758, 45270, 74481, 37436, -27754, -52385, 6729, 39976, -21538, -56780, -32690, 6306, 56571, 32263, -43525, -35601, 18198, 49662, 30199, -42329, -32066, 40931, 32604, 5836, -32045, -82155, -11758, 55268, 629, -26703, -12910, 27201, 81199, 23850, -42229, -26632, -26206, 20763]
386B0763J7651j04484J3878R3999j1560j0624l6151m0531P7491K9647l3411q701
398G967n7153M2861Q9258r8587n5166M8200j0896O1948K7848r1982K0297M6514
410C1109P487J9302j04846l3474J16356k3265k3360K7597q1714M6677R7899p6251
422C517l2512J473R019R8492m6280q0094N9716l1879J2065O9994j28437k4731
434h9657J23276j2171Q863j3094o8718Q5684J6452o4053L1641p8491m07J53996
446I3321q0596p9547P5046l1969L8884M4072j08466K3151M3999r037P8418r5475
458h199q9643J42293k3938o3462O2224q1481J9129J26238o1385k0741p008l8956
470d4929J18885l5528j22940R3388j7046k2874J16625j05904o6689J15371k0294
$$ y = [20763, 38414, -66070, -52192, 41807, 30247, 19623, -16528, -57059, 20432, 50079, 16668, 7967, -49186, -6325, 82933, -15654, -70820, -22620, -33516, 28432, 56280, -35702, -15405, 31109, 38596, 57898, -46948, -80422, 35934, 12669, -10691, 16906, -64808, -18131, 79768, 3517, -28995, -27522, -18503, 79989, 33709, -46385, 13331, -18548, -6483, 63511, -64926, -89657, 33619, 21448, 30311, 17217, -51501, 34183, 50635, -13418, 18223, -60268, -60675, 93321, 12725, -66822, 8224, -23745, 15139, 59211, -49255, -26104, 17895, 8858, 87276, -8199, -97842, 44451, 20513, -42949, 19275, -62206, -43077, 83161, 21776, 1035, -5973, -44929, 73956, 38428, -84512, 8876, -8170, -31044, 85581, -20323, -87012, 28359, 8065]
481H065J4545l292r7660J09896M0003r6995O7814o7482p3005J68743m3612j06955
493g9935Q0434k0704M2048O1719j23038K4037L7150o1304J11136n1179j42464
504a22100J52203K2968q8212O4404p0705j4010J16161n6075N01N532p6169J38658
516G3156N359j66898Q6796K273o2779J28978o9365q0435J17426k2474K1258J9277
528E2572j46391R0628Q1314j23569P0550j6527j05165J54034m983j12816N8898
539a455m2870M4233R6180j41762K4906P8665j06627R7761J1437j82807J05006
550a7333O7586p8738N5314n5210j1933J12929p4378M940K7769j27002J25508P5602
562A05054j84123O0874M7617q2380J06229l9334r8011R8150j5800K7105N1883
$$ y = [8065, 22610, 19318, -78342, 31554, 71557, -25438, 42376, -25106, -98111, 70632, 27020, -79935, 499, -20205, 21843, 83562, -39476, -15439, 21711, -39593, 71543, 20364, -122100, 30103, 53071, -35141, 29263, -41442, -55452, 60709, 4634, 5135, 10667, -65502, 73156, 78515, -88383, -1587, 686, -62093, 66885, -2480, -82915, 34511, 12037, 33295, 52572, -93819, -3191, 78123, -45446, 25104, 8577, -96588, 57446, 52463, -60353, -1455, -44325, -92, 96088, -45674, -20768, 57897, -48730, 49031, 60468, -122339, -17333, 50253, -28485, 26829, -28381, -40314, 72615, -1763, 3177, 30946, -96056, 29452, 105054, -79069, -18195, 29422, -52958, 53271, 13937, -84074, 14076, -1724, 25381, 77264]
573G7264j55623N8685J09669j28919M5883O359j20603J40633K5775j06772P0643
584B2994n4648Q005J32814j40639k8389J15134r4933N6935N8418j57586N5299
595b6596O4525n7289N4093p6372k1342J48841q2576j7970Q2205j44321N9042J28084
607A10324j63924P16O9973n5040Q7692k4113q8290Q6853l6225J4167Q7302j62337
619g2902J5896J50629j12139J4205M0490j25978R5443N2940j03318N7134l4539
630b2139j3578J40755j02694o3169J04464p5235K9199O5761j35663M2161O7352
641C7214n6169P1648o4544p3473J54961m4852o6165R3969r6427P138J30146j06375
653a2929k9218M0593m3006R2546k1455r7968J02758k5668k5167J15187j26879
$$ y = [77264, -78359, -19674, 89995, -38924, 6959, 13318, -107285, 33348, 59123, -47649, 22994, -31654, -23649, 109165, -31474, -59863, 55271, -39662, 17273, 75691, -81895, -26596, 37929, -19360, 34733, -41639, -62981, 85860, 3284, -14686, 67519, -76802, -17760, 110324, -53600, -52884, 17089, -37951, 49741, 25628, -62662, 24191, -12034, 2133, 89435, -72902, -57006, 93623, -18516, -4311, 36179, -89799, 5644, 58584, -44734, 12400, -22139, -35717, 105038, 2344, -60825, 43639, -31596, -2397, 63364, -72299, -30138, 37214, -18955, 52693, -11851, -85324, 69637, 24785, -41380, 52589, -43838, -36700, 93446, -12929, -42147, -1554, -44560, 47986, 26531, -71437, 31321, 5653, -19514, 95673, -31206]
664c1206n3356J47791o1831j9888M5087r2050O7423N6076q6319M5845l4970l8420
676e5818J40920o4577q5719R8581m5738N343P1046j15966Q773O9910m8620O3625
688D1760l0091r1010J26144k32p8257O5457o6681j4655J13880o8508k6718L3948
700E037n0454Q6769Q100j18639P5008J1393m7280R9295o6914p5325J09257k1163
712A5084k2623K5874q3155N4972O4709p7542L8811j1888n9947J16219j9314r9872
724e8672O2669j3801L15O4591q4528q486O1009l8837M7983j0161r6210Q9257L4248
737D9377o5572M0620m2118k5722R1592m1528l4180K7606m3584O6538L7263j02858
749d2566L2692K9896m0068O4558l5755p1870P4958L841j2420K1247p4617K9412
$$ y = [-31206, -84562, 63229, 1398, -18490, 26597, -65453, 1970, 58046, -28273, 17572, -17398, -55818, 85102, 20525, -65194, 33387, -12351, -7008, 64038, -51928, -43155, 26755, -21865, 41760, 11669, -79341, 46803, 46571, -31686, 33771, -32910, -47565, 66315, -2193, -28911, 5037, -45417, 41352, 49452, -69187, 5821, 17214, -30066, 69229, 2315, -73010, 36247, 15084, -7539, 18335, -64820, -9848, 54861, -22681, 16130, 4242, -55705, 60514, 41200, -58672, 3997, -9804, -9489, 55102, -29426, -37912, 23097, -15740, 32243, 22082, -74128, 15129, 49377, -16195, 24425, -17693, -43415, 48177, 6649, -27531, 75, -43509, 23029, 60292, -42566, -9874, 20022, -20046, 44512, 8757, -63113, 11845, 15686, 3266, 24513, -50104, -20692]
761b0692P1122o0487J0857M218n1423Q2409J3017q2027K5980m672K759N4234o4658
774a9363k1696N6338k0940L1599N535q4345M6228M6272m3934J5795k8139k2273
786c8923P4051j6312l5859J5567l2489M0264M5199p3022j37L2565j6636M1001
798C5269k0152o2475M2695J6396p368J4513n3456P972O5769k7688j1137r23l4689
811c5274N1542K3455n6550K690K434P145M3301m0765l4883L6110J539J7939N676
824B4359n7631J8309M3492j8054j289k4243k0780N2308O713l1129j5j3768K5730
837D002L6271m1989k0609J7271K923K7682r873m7460J7137K6406P87n05l4099
850b2056m858M3784L756j4437j2953j7240L2071K4657l4287j8512M020J3805K6742
$$ y = [-20692, 50430, -10057, 800, 5018, -46405, 36004, 49021, -33006, -7026, -11698, -8939, 45295, -19363, -41059, 15279, -5661, 25938, 31473, -52872, -6644, 39628, -4306, 11489, -16650, -38923, 35128, 18816, -17043, -1476, -33965, 6299, 51498, -21524, -21661, 10904, -5732, 35269, 15117, -47358, -4663, 11733, 4365, 18878, -34578, -26606, 39163, 11475, 338, -585, -35274, 16268, 39723, -16827, -14137, -11703, -4558, 38743, -2022, -36905, -795, 744, 18683, 24359, -33272, -14963, 28529, 10475, 9186, -15057, -35837, 16471, 23184, -7945, -7960, -21728, 4002, 40273, -1716, -22325, -5054, -2131, 25551, 15678, -31782, -14645, 11761, 12548, 12043, -22056, -26914, 16870, 20626, 6189, -6764, -24004, 8067, 32724, -1563, -20075, -16055, -2250, 24492]
863B4492j4475l2199P801J9821J6811o589l6784M47L3053O419j1024j9314j2184
876b3725K5369K2148j6729k5070k552K5191K1627j5626k4777o71J6802J6870n216
889A3641l0403r740L0391K0128j6939k1091k458J7281K0868q173k6697o211J9243
902a60K4004p895l6445q00K7847O495k872j6589j9479K6389K7067j6111k1842
915a0391j0137J8748K8074j9261k3230M507K600K5522R019m3951n365L1314P965
928A5414l58k3128j6272K9781J0193o729p114l1270J9498M3383k7716k1125P414
941h029j042K9036J200l7628L547P859J4365K0159m6230j5241M7167m608m756
954E799J919l6942K1789L6896k2567r565j5066J078M9520j9626l6186K1349r517
$$ y = [24492, 10017, -22182, -14381, 5440, 22251, 15662, -21122, -20675, 12378, 18797, 7773, -11541, -23725, 1644, 23792, 7063, -18007, -20559, 4632, 26259, 10633, -14144, -14815, 1987, 18857, 13641, -16762, -26502, 3889, 24017, 7078, -14013, -16471, 810, 21678, 13505, -13192, -19403, -160, 23844, 15949, -20496, -21296, 6551, 13046, 10174, -6415, -25894, 495, 27562, 11451, -10391, -20528, -1780, 26294, 7033, -16197, -11690, -9090, 16432, 25451, -18500, -23865, 7449, 15414, 15056, -8072, -24344, 5437, 15630, 8901, 1787, -29483, -9985, 33398, 5682, -15443, -8029, -9071, 19965, 21165, -16463, -12916, -5057, 9308, 29467, -16763, -32004, 15163, 10555, 5799, 7718, -29224, -7435, 29461, 6894, -2671, -17737, -16659, 32861, 13235, -22951, -1602, -11119]
967a1119J3872L2431m8913j4387L6618m13J0869j8964l3765M0878R249j8377J6246
980A4225l7007j240O1164k6298k7842J4175j3274L1755J1097m7576J3402M920
992b499l362M3706m2457l8703N9150l543j2023J6194m4715J4535M3919k8786K416
1005C832j3290k3065O4438q024n3421L2730r607k362M7217m4896k3465L8223q966
1018f56J9960p861n2317M5289J8668l3542K8248k9205k2708O6695j6384l2012
1030a5825J6207k2702L3336K3380n9016J7471J2023k4276N5990k4497o0066N7678
1042I703N899j8500K4266m6700O071M9805l4331R859l230m5418O6731J1112o6144
1055c0877L3207l987j4569N3744l8975k8813M0441j8290K3845Q958o8548M0052
$$ y = [-11119, 2753, 35184, -13729, -28116, 8502, 8089, 18958, -6, -33771, 7107, 16356, -2021, 14225, -22782, -24022, 37142, 10844, -16998, -2823, -16097, 15658, 26755, -20821, -7419, -2499, -5861, 37845, -4612, -43315, 15835, 12292, 269, 16463, -28252, -13717, 30202, 1416, 3832, -9458, -32523, 31915, 23891, -29530, 3200, -6407, -8769, 38448, -6448, -29913, 8310, -656, 19304, 11443, -40874, 4415, 23083, -10459, 17789, -11416, -34124, 32571, 16187, -15825, 382, -22320, 11016, 34396, -24620, -7149, 4874, -19402, 36588, 12091, -47975, 9703, 15602, -2898, 21368, -25332, -19261, 30544, -3787, 6072, 2842, -42576, 24155, 35267, -30877, 2330, -1657, -16226, 37518, -1457, -30270, 10171, -8119, 15726, 24684, -43864, -3812]
1067c812L3786m3536L0259j9090l5945O6303r684l2568K1590l6028K9341M4541
1079D5157o9026R792K8614l8715N0705n15o9549M4171J3227j6919K8720m9857
1091b4195q51N8713m0776Q779J5748o2877N4488L6088p0938K2299O805k2578N3358
1104C4063k9818l5281M1313k1634K0309K5501p4841K7227M6232m5006K7187j0810
1116D442m7165O5118j749l6889K9588l9576J3168O2087o2923p027L6569l8010
1128b2367M1508J0856o6950L5887J0968j8135M1043n1969j7845P2785l7618o908
1140h745L4020o1492L0574N1268o0546P209Q217k0913N2868k5116l9352M4751
1152A2743k4480J0550M3243p3672O356N8516m0532J7532J631n2540N3753J0188
$$ y = [-3812, 29974, -13562, 16697, -2393, -38338, 27965, 18281, -14287, 7303, -28725, 616, 45157, -23869, -14077, 14537, -24178, 26527, 26012, -43537, 634, 13861, -3058, 25662, -24195, -25046, 33667, -7109, 1670, 17418, -45459, 9029, 45117, -25821, -3522, 3283, -19295, 34063, 4245, -31036, 10277, -11357, 8952, 34453, -40388, -13161, 33071, -11935, 15252, 4442, -42723, 22395, 20646, -16243, 13345, -26231, -13063, 49024, -13899, -20926, 15643, -22367, 19141, 29997, -36953, -1066, 9902, -8233, 32810, -19159, -37004, 35781, -1837, -8745, 25275, -36217, -5643, 45625, -14921, -7712, 505, -20408, 32460, 7344, -32008, 12743, -11737, -1187, 42056, -31616, -25260, 33256, -7276, 10256, 11887, -40653, 13100, 23288]
1164B3288l9308K8964l4153o15O7562n0202j7636L7712l6609L4042K0925o8326
1176c4356K9689J6712k6628M6116l7511l7147P0396j9498j9869L4010m9241J6273
1188a1054N0994m7993M013M454k7250N6552j4404n1363M5741j4154o078N1353
1200D0811n6119j5412N5669k6216R175N174n0264M3671J7163l8915K8773k7505
1212a3995j5540O8465l2838k9879L6990k9029K1651K9833o1250J4686K2412k6575
1224a5069M0152k2184m5089N9259m212k1688K9457m2376N777N1325l9329n76Q352
1237C799l2839M9227L779n5206L2486j631j1794M6095l8896k3615M5957j6744
1249F18P171Q570n1170L2064K7214l7129K1104j4025k4373N8170j3061l4638K6449
$$ y = [23288, -16020, 12944, -21209, -21824, 45738, -4464, -22100, 15612, -20997, 13045, 33970, -34356, -4667, 12045, -14583, 31533, -5978, -43125, 27271, 7773, -12096, 21914, -27327, -11054, 39940, -8053, -4040, 414, -26836, 29716, 15312, -36051, 9690, -4464, -10542, 40811, -15308, -30720, 24949, -1267, 7908, 13082, -37182, 6489, 23652, -15263, 13510, -13995, -29535, 38930, 6092, -23787, 13203, -15826, 5825, 35658, -25592, -10906, 11506, -15069, 25083, 2899, -42190, 17069, 12857, -8831, 20626, -21750, -15973, 35352, -3977, -4553, 3799, -29040, 20187, 23966, -31240, 1246, -385, -12179, 33916, -4980, -28595, 17362, 618, 7789, 16359, -34811, -2747, 24467, -12662, 8442, -5583, -29956, 28214, 15153, -19485, 6964]
1262F964j9502J3547L2615n0751K128K4805k2461L1385r007m7316M3150R591k0400
1275e252K2887l2419m033M7826k6665q061R333l0300L6706J6239m8079J7115N160
1288D57j0815L8666k6105k8670L6545p991L914J1942m5306J6480L2547k7576R873
1301C961p205k3709M5363P97l1775J5413j2849P878L1852l8419r922K3276j3458
1314h797K1964n20m1507K6264J6690j4396J4626k4163r770M0467j2373j3195O077
1327A367k3275K4043K1609l5874L000P690n842L0001j4403k9560K3564J460J082
1340D862R720l4233M024L0625j3748J764n658j9358L2309R216k5435M886p302
1353h328N020K6772k3861j7060J5040k957J4874K246l1913J2301J9017n867O217
$$ y = [6964, -12538, 1009, 33624, -17127, -14999, 9806, -12655, 18730, 9723, -37593, 5557, 15148, -5252, 17635, -14784, -18817, 29009, 2344, -5717, 3616, -26684, 10022, 26261, -21818, -4703, 457, -10358, 28308, 2203, -26467, 10078, 2087, 6001, 17943, -27363, -10883, 21664, -5912, 3961, -3244, -26953, 18410, 19207, -12568, 2845, -10004, -2126, 29726, -8693, -18615, 4661, -8797, 13167, 12647, -28860, -2596, 14094, -302, 14324, -9839, -19609, 20858, 8485, -4710, 1367, -21908, 2135, 23744, -12130, -9130, -1440, -7282, 22719, 8316, -21244, 2320, 3780, 4862, 14582, -19651, -15627, 14998, 1250, 3014, -2644, -22002, 10307, 19523, -5912, -1026, -8328, -3308, 23464, -397, -17457, -2417, -5374, 9500, 11746, -20167, -7866, 11151, 5284, 11501]
1366A1501j6955j2473K8772R12j3560j424j3613J5045K0553k1166p184N184J95
1379d213K0709n317k5477R061R032L177L438k2984l953K2218M67k268p097j2871
1393a6078J9830J4472j5831o962l456N198J7771j0031j7830L795O047J1854J161
1406I940k1560J56J7243M215j049j2081r987J5093R929q220j1090p058J1169J5698
1420A2398p416j2835l24P938J2428r48j7070n557J1661R731l658j4370n622J1367
1434b277J1286k694j1386n594R492J4693k662j6599m243R945Q167j331j3638q080
1448a4921J1811J2172j965j0373q557J1059J5836p538j2034k895J866J4366J236
1461A0063j9974l145J0254Q435N130j4840q996J5868P054j466n672j6452Q097
$$ y = [11501, -5454, -17927, 10845, 11757, -1803, -3227, -16840, -1795, 18758, -2408, -9592, -4408, -4213, 16496, 11179, -14298, -5237, 3795, 6972, 10410, -12574, -16527, 5691, 6158, 3890, -3207, -16078, 3752, 18224, 2393, -4569, -8025, -2827, 14944, 4913, -12917, -9122, -3075, 8779, 9940, -11620, -11464, 5779, 9994, 8945, -3136, -13123, 1970, 11899, 3679, -7411, -14469, -3300, 12398, 4982, -7853, -8177, -239, 12189, 11241, -5829, -11386, 275, 10006, 6348, -8022, -13644, -2277, 9009, 6315, -5071, -10665, -1173, 13520, 10858, -5741, -9984, -39, 8128, 6797, -6841, -14921, -3110, 9062, 7097, -3276, -11833, -774, 15062, 7524, -4510, -7405, -5539, 8827, 10063, -9911, -13056, -2802, 5633, 10763, -4077, -13073, 2795, 9849, 8383, 2711, -13741, -5644]
1474e644J8599r217j0036l728P93J8957O82j6836P15K968R379J0045k1219r493
1488a4035J6012J813K308o215j8254J4149J4804o924j127j1845J289K5922q402
1501I495j6207L856o515J3034J1602k5774k437J2084Q17J4172j1934j9867K1788
1514D114N496o104N419k1949J329K6483j1964q265O61r713K2807O762k3885O263
1528b546J573P13K0468k1024j7011K0918k244K901K262k5657J3217J9476j2460
1541E86N669j0633j0608L2279m772k1577R453j1047Q287K1463k8150m795J5795
1554A950p120J8720l776k9824K2772Q657j1917J2090k1281p624L1578j1802q233
1567e810O123j7324K2034J4836k9266P502L466p763K6264j6325k3814K2738l452
$$ y = [-5644, 12955, 3738, -6298, -10026, -9233, 9724, 10406, -6430, -5715, -2747, 6632, 16677, -4542, -14035, 1977, 3790, 6098, -117, -18371, -4222, 10582, 3658, 2531, -9314, -8025, 17897, 9495, -6712, -2856, -9371, 3663, 15265, -10509, -12946, -862, -45, 14127, 2193, -17674, 4114, 9610, 3506, 8925, -13024, -11695, 14788, 2824, -5441, -4780, -14493, 8314, 15076, -8809, -2546, -973, -260, 20208, -816, -17827, 3091, 847, 3748, 6010, -19647, -6430, 13046, 586, 6255, -4378, -14986, 17293, 12521, -9056, 397, -10650, -2363, 19100, -9050, -13845, 1950, -5170, 13550, 9774, -20050, 2722, 11379, -538, 11552, -9729, -17353, 14225, 2423, -5810, 313, -17011, 5023, 19859, -9407, -1905, 1561, -6202, 20062, 3737, -20077, 2661, -791]
1580g91J795J0448l0571R070K5229j6421Q946o021k1258L3489J629k6026J2897
1593B415j2693J547K9724k6463r675K0087j2712J8489N271l5346J8839J2683j5763
1606c597J6331j9033j5271L5319j0284j0883J2593k2522J6923K4552l1297L623
1618c546P309j3482K7512r659k9241K2666l188m20J8478l2579K064L0925j8686
1631a847Q377J428k9592L0051R887k8937J3075j0634n643L4287k1878j4230K1893
1644F237j4429J5894J2803l8501J4272J6746j9277J8428j3920k3594L6188l725
1656G122j5711J5747k1596R061L0075k7999j198Q962j6648K7089k951l3333K1547
1669A67j040n367K4913k8960p947L4598j5453K959P493l1396K2383J6098k7874
$$ y = [-791, 1004, 11452, -19119, -10049, 15180, -1241, 7705, 1684, -19574, 13915, 15544, -10482, 2415, -10278, -8731, 20993, -5470, -15145, 4942, -7770, 10719, 15990, -19356, -517, 12166, -3597, 12734, -6299, -21570, 13749, 3465, -7418, 5175, -17347, -424, 24128, -7169, -3546, 3763, -9719, 17793, 8134, -21107, 1559, -1629, -2049, 16429, -16150, -14086, 16839, -1847, 6530, 7958, -21634, 8417, 18304, -10633, 2442, -8192, -13835, 20452, -1426, -15656, 6237, -8192, 7702, 20505, -17996, -3724, 13022, -6255, 12173, -1747, -25341, 10847, 7122, -8589, 7158, -14438, -5377, 24698, -3301, -4499, 4463, -12185, 14904, 11953, -21380, 167, -873, -6240, 18673, -10287, -18234, 16364, 911, 3870, 11363, -20033, 2350, 18448, -9426]
1682i426J1453q243j0718L6070j6412j9020K3584j4382J0443K0425l8218O353
1694h091K1309j9486J6075p118k8255L1821K763j6702J6066k0342L330L2820k4681
1707d91m609J1278k0540K4232N940l5887J6931M779j0274K5803k0670j5642L1859
1720A2709r471n69J0242l0704J5412K0641k6460Q809l455j6476L4633o777k4003
1733a5469K1014r734L829K3676l2234k309K1803j6138J3007j861k9526K5914Q114
1746A0086j7141J6186j6991m107L3741j8161r892J2486j9584J7622J2871l3217
1758a6101R932Q035j0285K3928j4076j9845K8228n339l206J2530k8516P023K4635
1771A6943k1934L609Q19j7910K8328K129k4029J5176n852L97K3874k5497q895
$$ y = [-9426, 2027, -6216, -16934, 19136, 2724, -16296, 7288, -7094, 3349, 23774, -14444, -8091, 13218, -6268, 9807, 2689, -25566, 6255, 9018, -7684, 8382, -11960, -8630, 24190, -491, -5100, 6178, -14362, 9870, 15810, -20077, -3146, 1633, -8641, 17162, -3508, -19150, 12709, 3238, 2669, 12911, -17793, -2381, 18260, -8200, 609, -2846, -19322, 15311, 8534, -15469, 5545, -4189, -360, 23316, -8918, -11227, 10576, -5562, 7445, 5584, -23942, 1972, 10086, -7055, 9131, -7860, -11967, 21774, 3613, -6279, 6207, -13377, 4245, 17116, -16101, -6169, 1866, -8419, 15509, 1433, -18412, 9816, 4477, 1271, 13801, -14715, -7692, 16943, -4991, -1382, -563, -18473, 9855, 11984, -12045, 3131, -2721, -2324, 21550, -3947, -12842]
1784a2842K0541j2397R235L776k9327J8077J3821j5194J2447j2151r184L0295
1796A7097r926j2953J0592j6593J1909J6758k8105K859R830r128K0490p159k2011
1809a6340K1787O60n100J1687k3534m00K4306j4675n03K331j6785K2535P801k1863
1823h093R277k786k078K1959j7617j3657J6929p018N859O129k5264R807J5956
1836I403j0605Q201q166j1591K4983k630j4061O915j2359O866J7604k0425l353
1849i218R636n958J5734j901k1177J3707N307m644R019j7651n080K0990p244l608
1863b088K011j3513J5536J1833j6911K570o46k299J7834j0475j5327J0833j730
1876b372M163O479j9539K656J5550n023L807n318j1288J7480L657j1905J645q229
$$ y = [-12842, 7699, -4698, 4537, 8313, -21014, -2937, 10884, -4310, 8137, -4014, -13198, 17097, 7171, -5782, 4810, -11783, 126, 16884, -11221, -8362, 1468, -7660, 12830, 5671, -16340, 5447, 6107, 1007, 12694, -10840, -11240, 13066, -1609, -2112, 219, -16566, 5969, 13770, -8093, 1184, -1602, -3680, 18279, 662, -12995, 3934, -3084, 2775, 8904, -16360, -6553, 9403, -1202, 6999, -1167, -12758, 12225, 9595, -4466, 2449, -9910, -3044, 14560, -5865, -9218, 418, -5540, 10194, 8293, -12884, 823, 6130, 1486, 10505, -7146, -12226, 8764, 1520, -2088, -77, -13590, 1946, 13779, -3132, -562, -1208, -3507, 14327, 3852, -11475, -642, -2372, 1791, 8270, -11269, -8613, 6937, 1914, 5721, 403, -10885, 6595, 10252, -1653, -8, -8237]
1890h237L545J5929j2459p468O872j637J1502J311j7415N660P127j842M994j2671
1904d789p139J5796j16m419M2r459R288J2476j0299k943l86o95J3043m625j4140
1919h365M205J985L582N044j3024k436J2562J509P27n131q606J0060O597p344
1933A365k991n671K330J2477m762r010J833K699P937J943j1520j063O420K524
1947D511J670r217p454R553N292l150l125n017N141J0279k698p251k564K279Q465
1962F714q06j0881k019N073M549K065p194n324O733Q004m41o494m991M511O664
1977F163j586p496m498K737P898J913p685m221O160P042r4o087n115L292O881
1992E304j96p121n646K956R034K3p754j750L475O323L679p892o007M858N212N20
$$ y = [-8237, -4692, 11237, -1222, -8690, -1818, -3455, 8047, 9358, -8057, -2397, 4730, 2888, 7882, -4789, -11928, 3868, 3752, -667, -625, -10084, -796, 11680, 1381, -1562, -1948, -2643, 10400, 5775, -8365, -4160, -2175, 1407, 6451, -6573, -9009, 3553, 5062, 5789, 658, -7948, 2112, 8709, 1365, -1626, -7297, -4967, 7510, 2748, -6262, -4429, -1730, 6207, 8150, -3370, -4433, 1987, 4511, 6181, -3036, -10490, -937, 4355, 1205, -1920, -6937, -1796, 8483, 5785, -1466, -4030, -1751, 6714, 5908, -4973, -6992, -1919, 2630, 4695, -2499, -7823, -1090, 6914, 6473, -21, -5012, -501, 6163, 4577, -2919, -7417, -4680, 3218, 5131, -2554, -6775, -615, 6427, 6333, 246, -4869, -1577, 5304, 5108, -2013, -7659, -4703, 4331, 4354, -3400, -5150, -1675, 4648, 8327, 435, -5572, -714, 4498, 5018]
2008E018o495p989N506Q112j554k371n054k3J1780J224r623j928N42N817M214
2023G176r687m877M698K491N383l667j0391P680Q298k515j635o788p86J0248j819
2038C809o410k258k582J0262N268j1739n40L977J697P438o570r721O512L444J244
2053C831r70j2734L863J1799m864j61k150n802J3110M086j1775r0j656K732R212
2068H431j0963o210Q467j573O014J841j4781N930J0482n092J383o509m909J3365
2082E876j783p018J378p215Q044J1148j3256j908O355k200R310l602j3666P427
2096a110J968J6M827j4314J91J5861o294o11J623j0761J1710P346j2589J675k516
2111b978p41J3647j0486r486J0710l264M531O985j6238L223J1887n825K769o205
$$ y = [5018, -1477, -9466, -3960, 4152, 2598, 227, -4827, -4850, 6930, 8154, -1469, -3397, -2855, 2962, 7176, -2511, -7388, -2690, -199, 5184, 1517, -8874, -1194, 7104, 4589, 2954, -3834, -4620, 5628, 3809, -2601, -4859, -7441, 2821, 8089, -3650, -4190, -213, 1484, 8922, 2352, -7369, -857, 2587, 3831, 2861, -9873, -6010, 5789, 925, 764, -1386, -7188, 5922, 10008, -1767, -1857, -3513, -781, 8431, -2532, -8742, -275, -1848, 4166, 6007, -8774, -2844, 7638, 2546, 3929, -2580, -7489, 5876, 4093, -2925, -1547, -8762, -718, 10430, -2826, -4734, 1621, -579, 8731, 5129, -8537, -1110, 858, 874, 5701, -8613, -8422, 7439, 1145, 534, 2157, -8604, 3106, 10452, -2137, -462, -2978, -3719, 9928, -558, -10044, 666, -2598, 1933, 8918, -7320, -4097, 7790, 1965, 4734, -1471]
2125a471r110J5271m29q317N227q601L754J5968j2792m759O752m475J0403m84
2139F937j5518P936J638k915R479j3900n242J8811n236k164M838j2717R171R824
2153A0942j3643K007j834m711J6757p187j2931J2093l288K003J0301j6443j65
2166f099J3025o097M407l683j3477J5051K577j0951P109q057l56J8472r835o365
2180d279O735o783R931K902j8135P392M273o315J2503r868j1098J8551k166m710
2194a067O109j2519O334J2655j3618J722m74q886J7265k701j6036J1693p36q68
2208a127J2678j4609m022J2985o201M212o29j5947J3565O386j1915P080o403m336
2222h283J8420p070q053Q033p742Q194P262j8930L805O728p756J1626n234j3192
$$ y = [-1471, -10581, 4690, 4261, -4056, 1171, -7430, -3676, 12292, -500, -5259, 1493, -2982, 7421, 6937, -8581, -645, 993, -1922, 7557, -6343, -11585, 7226, 1990, -174, 4664, -8053, 1118, 10942, -2701, -694, -2528, -7239, 9518, 2331, -10600, 1493, -1795, 208, 10509, -5934, -6099, 6926, 829, 5236, 1553, -11924, 3127, 5704, -5247, 1862, -6195, -6551, 11921, 2086, -4279, 2456, -4327, 5604, 8506, -9629, -2237, 2036, -4279, 8224, -1644, -12742, 5809, 3643, -1067, 5042, -7477, -1143, 11512, -2106, -384, -858, -9744, 7521, 4820, -11216, 477, -259, -1127, 11551, -3058, -7080, 5905, -296, 3916, 3287, -12660, 905, 7291, -4624, 2456, -3947, -8283, 10137, 3067, -4986, 3047, -4695, 3499, 10761, -8169, -4364, 2364, -5392, 6234, 1000, -12192]
2236a2192J6314P17n204O602j3010K693J4892j2663K80K712j1032J4875K962j7543
2250i597Q491R36k179J2883j1738o329J3429o230L279K550j7791R782J0113j1825
2264d226O363l587o864J7233l701r683O890p441N507J0548j7030P91Q121p760
2278d839J0098k175j4662J3009L321n277P307j1443q55J5341j0034k500L927j0730
2292i512J1461O674j5040N302J710l289J2400r062q993J2180m127J456N785j6098
2306i153M557J1628r502L565j721q137J5311j61r887O199o802K120J2170j4035
2320c848k988Q925n950P899J347j4431Q824M754n182O378r003l810J4759n760
2334A914m059M089j0192P963Q670j3261K580K899l733J1890n452j0863R356j829
$$ y = [-12192, 4122, 4839, -365, 6237, -6773, -4080, 10812, -1851, -1571, 1141, -9891, 4984, 7946, -9597, -1106, -170, -2349, 10534, -1204, -7533, 5896, -334, 2945, 5495, -12296, -2514, 7599, -4226, 2137, -1450, -8314, 8919, 5218, -4465, 2425, -5016, 491, 11039, -5991, -5200, 2921, -4839, 5259, 3084, -11578, 1431, 4752, -525, 6782, -4661, -5516, 9825, -209, -2709, 1218, -9512, 1949, 8623, -6417, -1115, 595, -2694, 9706, 644, -8349, 3831, -296, 1160, 6945, -9153, -4596, 7032, -2470, 1095, -626, -8763, 6548, 6387, -3500, 2699, -4103, -1983, 10187, -3848, -6836, 2089, -3861, 4038, 5385, -9046, -222, 4532, -650, 5728, -3275, -7085, 7674, 1914, -2145, 1944, -8248, -285, 8385, -4876, -2296, 603, -3130, 8760, 3308, -7555, 1801, -28]
2348b8q5N858j3097J236J2125o392K046q13q760J1640K915r506L961m165J87J1866
2364H988r631n870P162m080N846L300j2934N513O425m155M736o820o172J2134
2378D442k021m605L176p589N424R379r971q06K717l319R378j898j0542O247O44
2393F56n02N221j0382j897J0629k954M01K63p697Q196M946p763Q15l016p87J0415
2409F544n517o481N187j631L931L932j0860J143O760j888L168m468o119Q656Q04
2424C161m370J299n643K609R577n823l127K176j763O433q1q994K191K005O11M470
2440D731p283l574Q348j57r49l92n753M730N768m328j159k692n85P751k430o675
2456d649K727L17L145L881p016k045M967M70J354l818n273O135L116k978J30m034
$$ y = [-28, -113, 5745, -7352, -6116, 6009, -383, 1663, 850, -7910, 3730, 6645, -2861, 1100, -3065, -2878, 8988, -643, -6513, 649, -3431, 2415, 5715, -7219, -1706, 4719, 564, 5300, -1520, -7692, 4442, 2421, -2184, 992, -6597, -1173, 8206, -1765, -2571, 146, -3173, 6205, 4307, -6235, 12, 656, 154, 5375, -5007, -6904, 3725, 771, 1172, 1435, -6262, 1934, 6880, -883, -68, -3084, -3871, 6544, 1027, -5454, -267, -1898, 2033, 5965, -4895, -3752, 3008, 1120, 4288, -180, -6299, 2357, 3161, -1209, 90, -5553, -2944, 6633, 810, -2317, -141, -1904, 4529, 4448, -4546, -2355, -350, 261, 4731, -2552, -6126, 2222, 2065, 1116, 724, -5029, -299, 5469, 1141, -18, -2710, -3295, 4456, 2026, -4649, -1922, -1605, 1540, 5421, -1595, -3640, 1327, 1797, 3151, -667, -5940, 195, 3311, 333, 463, -3571]
2472c571M30P552j848m599J79N21M709Q48o193p72J536J254L284m562m244N318
2488a58L346p91j810l781J909M657j254k555k668Q5O345j49n606n98J830K509
2504A311K165l558l301K668L409R00l674m494K581M262r08k132j936J63M967J875
2520D298m383l285J886L829N57l666k377J505K959J306k358m083R94N363P54l779
2536d80j521J196K568J332k909l612N45M009J997l635l370K907L505j93j335l327
2552b323n42M915J494l536k824K93M358J243m119j557Q85J771M149k160n774K337
2568a390L701j37j600l992L99M730m2q55k056k609N741L048o160j203J618J135
2584C28L250k550m201J652J607K465o97o460K366N486j448l97k004l002N139J994
$$ y = [-3571, -3141, 4411, 2563, -2036, -1857, -1336, 3373, 4221, -1972, -2744, -1208, 46, 3330, -1232, -5476, -158, 3188, 2397, 587, -3194, -1285, 3372, 2118, -437, -3105, -3020, 3325, 3176, -2430, -3028, -1198, 1311, 3476, -82, -3383, -715, 2694, 3594, -80, -4574, -1993, 2269, 1361, -771, -2707, -2544, 2423, 4298, -85, -3370, -1484, 2345, 2902, -764, -3141, -1636, 1323, 2629, 271, -3812, -2818, 2545, 3299, -480, -2001, -805, 1763, 3095, 186, -3426, -2881, 1128, 3125, -510, -3880, -973, 2532, 2339, 1004, -2323, -2865, 2050, 3544, 8, -2816, -2523, 1835, 3078, -1041, -2598, -1713, 58, 4207, 2047, -3727, -1390, 2311, 2174, 574, -3418, -3019, 1711, 1669, 814, -1242, -3851, 1890, 4938, -1222, -2425, -807, 328, 3578, 1028, -3173, -1521, 86, 2551, 1854, -4606, -2240, 3246, 1798, 1401, -603, -3605, 1534, 3528]
2600C528l942j505j772L932M560n472j807K484j259M287J55p341K228L929l28
2615A677O05m951j104O352j514j230O13m762M464N855o334j860J651m98M337k271
2631A030n222L546K42J666K944p853j48P177k379j61o17m439N159K704l836L3
2647a54l070J198P268n210l568M550k238L185K542p978J029L864j178K786m712
2662a686l345Q082r31k770K621n872J999P632n697j842J466j652N599j112o905
2677d413M010j89L15N165p066k412P789j732m79K17o031M862L405m497J956l066
2693b166j162Q873m157n388M767k247K094M248p662L26M290k204L725l415o302
2708f380Q377O84l962L661n127J46Q223m915k609J649k992O266R12q323M017O72
$$ y = [3528, -414, -1919, -3691, 241, 4801, -671, -2478, 6, -1253, 3034, 3189, -4152, -1924, 2005, 1677, 2282, -2669, -3773, 2579, 1065, -165, 448, -4314, 150, 6005, -329, -2189, -538, -1036, 3301, 1030, -4192, -646, -404, 1262, 4206, -3647, -3795, 3382, 1003, 842, 225, -4214, 945, 3649, -187, -154, -3224, -2026, 5242, 32, -3536, 1014, -1224, 1961, 4503, -3475, -2446, 1418, 240, 3026, -1686, -5031, 3051, 2120, -650, 1971, -3901, -1902, 5730, 33, -1809, -343, -1995, 3604, 2492, -4413, -403, -592, -277, 4888, -2178, -4590, 3199, 1467, 988, 1205, -4826, 36, 3441, -1056, 900, -2166, -3328, 5545, 1388, -4000, 767, -1480, 614, 4862, -2800, -2474, 1816, -388, 3337, -78, -6380, 1997, 2681, -1281, 2380, -2747, -2601, 5622, 707, -1902, -253, -3245, 3021, 3933, -4390, -373, 299]
2724B99j634O399n734m708P416p93j13R88o763M276M385n582K322j896l658R310
2740D514j583o617M423j847J061M995p495n74M666k775M521j536q067P289K185
2755C160m539L622m234j604Q387l654k573J927m122N288L000q635K704K086k669
2770a856O591l891n991O809p64n73K436p407K840O258n461J390q9n236Q024N21
2786C601o873L467j346N84N777o822j636M954l236L552Q55q686N379M023m573
2801i80L044l304k909P933k299l078K526m609M285M611q087J288K600l191N803
2816C633j881o707N780K78r87K923o458O10O836m346M43N50n272O716J958o857
2832b781K924j192o33O677n355l305N136k649K608J855p862L131M438l504K458
$$ y = [299, -1335, 5064, -670, -5378, 2038, 1245, 1132, 2120, -4643, -367, 4018, -1564, 758, -1138, -4796, 4514, 2931, -3686, 737, -1110, -49, 4946, -2549, -3123, 1543, -1232, 3289, 1753, -6314, 975, 3160, -1379, 2243, -1991, -3595, 4792, 1138, -1435, 492, -3630, 1658, 4658, -3977, -1273, 813, -1856, 4735, 844, -5147, 1662, 898, 325, 2761, -4646, -1806, 4452, -1009, 381, 292, -4944, 3080, 3601, -3272, 195, -1151, -567, 5210, -1612, -3248, 1706, -1530, 2022, 2877, -5809, -430, 3593, -980, 2064, -1240, -4149, 3784, 1485, -1593, 933, -3676, 609, 5220, -2867, -1579, 1021, -2170, 3633, 1752, -4955, 825, 1103, 116, 3039, -3419, -2809, 4027, -319, 124, 674, -4598, 2118, 4076, -2781, 143, -1049, -1682, 4995, -360, -3665, 1471, -1178, 1430, 3285, -4577, -1446, 2992, -512, 1946]
2847A946k612l479P376j237l396K583m509K871N701o788m67K942k959M983o70
2862B285o591M287J053j233L452n779q69O678k924l53J108n301N077L276n805
2877a639J250l87j352O459l683m232M251j429J740K479o808J279M839k941J854
2892A680j783m245O193O07l622K014l295J198N762m818j856K662k400M142O41
2907B880o314K622J899j025K869m393j991N803j386q82J152m769L096M272m688
2922h55J8K87j504N282j704m359K859m97J098K885n803l15M467j592R36p24m144
2939c665M327J898k978Q52k599O99N091l129k359J843j258K734J369n354R02K068
2955D41j68K158l126k628M693N8j110P98l983J651M353k813j141k21o57M223p64
$$ y = [1946, -666, -4145, 3231, 1994, -1402, 1181, -3328, -457, 5244, -1544, -2011, 931, -2028, 2955, 2285, -4306, -19, 1034, -199, 3253, -2526, -3395, 3283, 359, 6, 1114, -4187, 890, 4166, -1639, -389, -776, -2128, 4331, 648, -3584, 667, -762, 978, 3457, -3351, -2072, 2767, -174, 1680, -103, -4348, 1845, 2452, -1170, 844, -2451, -1253, 4509, -309, -2165, 497, -1903, 2239, 2880, -3434, -812, 1087, 62, 2931, -1462, -3453, 2350, 964, 82, 1234, -3535, -439, 3833, -855, -837, -550, -2054, 3228, 1524, -2835, 24, -473, 625, 3510, -2293, -2608, 1859, 267, 1203, 479, -3665, 662, 2560, -418, 434, -2165, -1466, 3625, 496, -1863, -20, -1278, 1456, 2825, -2529, -1627, 441, 273, 2431, -695, -3323, 1370, 1428, 318, 1116, -2867, -1216, 3137, 324, -817, -1038, -1695, 2528, 1764]
2972A764l850J459J88O94K821m233j632L850j90K12p33l377K789K470j805o2j901
2989a536k39M469j326l167J138l69J695J851l609o85J723P09J442k413k667L391
3005D07R80r66K48k402J32L774j055j892n46r8L078L14l146K97L41Q47K176k585
3023i6k608K394J485J29q95k400J334K280p05o54j444n85L712J56k804o66O33
3040g34J296J063j927j453J238J258J468j858k592J654J862l34r60j406M7K444
3056A066Q71j828j699L81K429Q13k549r40Q83R90J403j023k676K78K508N09j391
3073B5j688O56K043N70j121j610j93J728J625j885k125J182J902L3p50j465l15
3090a388J835J190j273j791P6K524P56k119j137K81R03J788p81k383M14K097R39
$$ y = [1764, -2086, -627, -439, 255, 3076, -1157, -2789, 1061, 871, 1083, 350, -3027, -238, 2232, 427, 365, -1536, -1775, 2694, 1368, -1799, -661, -1030, 665, 2516, -1093, -1778, -55, 654, 2096, -317, -2984, 407, 1387, 421, 669, -1733, -1601, 2173, 1118, -774, -1320, -1418, 1660, 1974, -1172, -875, -534, 313, 2489, -96, -2704, -310, 1175, 1304, 409, -1991, -657, 1623, 918, 264, -1180, -1765, 1947, 2103, -701, -1367, -734, 562, 1625, -302, -1755, -517, 741, 2209, 351, -2241, -587, 1275, 941, -19, -1425, -1378, 1066, 1937, 109, -1590, -1209, 1220, 2033, -516, -1456, -573, 417, 1820, 797, -1879, -1601, 907, 1416, 25, -1663, -1007, 1036, 1606, 485, -1125, -1318, 410, 2035, 150, -1975, -793, 1109, 1142, 392, -1073, -1388, 447, 1637, 364, -1427, -1351, 1173, 1929, -190, -1327, -1046, -143, 1645, 864, -1519, -1105, 992, 1931]
3107A931j466k197N40J791K23k66j301j158K500J438k116j081j99J446J775j577
3123B83j287L40N11J891n50l585Q32K533q6j88j442q26K367R60j369r99j580K254
3141E9K454k583j175R97k69J810J7l018N74J450J024K67k907l77K888o84j68m86
3159a27k379K376K508k256p48l32M38K450j375k119J127k89J662J163l829j27
3175a857L192j150L74j025j958L221Q03j301Nk207Q59L571k672j585J288l91K041
3192A208P91l358L59J284Q4J597k857j480L600m44n36M18k928J560K881k276l47
3209d44m41j59L663j232l008J584q09O99K403l501j054L284m13N78o98k973K947
3226D26J103j855J069k080k88M346j898k365J252j156K046J513l570O69J317l64
$$ y = [1931, 465, -1732, -1192, 599, 822, 556, -745, -1903, 597, 2035, -81, -1162, -1361, 85, 1860, 283, -1004, -664, -153, 1738, 1188, -2397, -1565, 968, 882, 694, -748, -1574, 793, 1753, 384, -615, -2195, 59, 2513, -70, -1245, -248, -517, 1293, 1310, -1708, -1134, 316, 1340, 1607, -1300, -1677, 1211, 527, 359, -127, -2506, -130, 2378, 122, -626, -958, -520, 1930, 555, -1564, -437, -726, 936, 2099, -1730, -1857, 1335, 185, 559, -466, -2424, 797, 1600, 299, 304, -1903, -1044, 2527, -145, -1730, -442, -833, 1208, 1999, -1359, -1000, 284, 368, 1965, -892, -2372, 1228, 784, 248, 666, -2262, -702, 2179, -97, -444, -885, -1044, 2619, 1387, -1621, -37, -846, -147, 2256, -1245, -2299, 985, 572, 1150, 452, -2521, 426, 1529, -326, 743, -1337, -1625, 2721, 823, -1542, -290, -1446, 600, 2113, -1457, -788, 529, 165]
3242A65K193k537k959L838p0j001J284k851J002L383k182n46j55j462L667J10
3258A879l764J813k77o3K942l329j855L055l05J081q3l454K718J686k315R56j721
3275a036j434M495q60k510J409j202J642J924l859J55J596r18K836j429l810L500
3291D99N61j446J395k901K40L979j814l44Mk282L451Q40m136J454L2l63L288k331
3309A26k364K823o15O02P11l794J778K761k168J088j210k192L840j90k701J528
3325B3j192J267K961l652n55J836j652K386l48m018K606J569j198J313k453q82
3341a989L988j734o57Q01k701L133J972m127P11K82j077L296j613k686K782N6
3357D37N62R38l954R80K538j718O81n73k655L978O20k754J103j362M19L279k744
$$ y = [165, 2358, -179, -3138, 700, 630, -371, 913, -1938, -936, 2447, 265, -281, -436, -1898, 1769, 1879, -1885, -72, -349, -412, 2530, -799, -2654, 401, 96, 1177, 1094, -2360, 358, 2044, -271, 685, -1036, -2470, 2025, 1165, -1345, 64, -1138, 504, 2428, -1431, -1276, 320, -598, 2238, 809, -3001, 499, 1060, -386, 1009, -1892, -1652, 2327, 513, 169, 173, -2109, 1342, 2182, -1954, -500, -468, -831, 2457, 126, -2238, 585, -30, 572, 1283, -2511, -733, 2028, -140, 948, -262, -2454, 1386, 1196, -1505, 23, -1169, 98, 3059, -593, -1148, 688, -964, 1422, 1074, -2944, -338, 1231, 33, 1346, -1107, -1989, 1999, 265, -392, 409, -2292, 841, 2813, -1314, -603, -321, -1398, 1898, 285, -2401, 381, 437, 999, 1937, -2017, -1037, 1501, -217, 464, -109, -2764, 1214, 1834, -920, 183, -1179, -760, 2519, -225]
3374b25j230J988j157J907M10m248J731J494j055J854k322j082L812r24j209P29
3390D73k502J755K765l306R8Q51j274K920p44l395K214K9N35J598l335j3K970
3407A639j646K69k14k598K802J483k499R07o17j79L027j953j861J426q96J724
3423H14R26l477R81J734r93J061j481k025L416J89j136P88k260J039K736k897
3439e85n01O76r68K923r4k969J350L57L9J572k836r15L010p64K98N1k720J623
3457d53K046j909J10o68j07L220j184k159J358j054J105J298l207J46J916j92
3473B66J025j132j978K372N47j158M79j774L88K974j443j397N13q28J786O41k461
3490a180N02P71K58J466k033j725K354j05k64K98k085J294K050j132m50p02l52
$$ y = [-225, -1455, 533, -624, 1283, 1693, -2555, -824, 670, -385, 1469, -853, -1935, 1877, 953, -256, 473, -2029, -274, 2491, -815, -717, 134, -1140, 1780, 1036, -2359, -145, -116, 419, 2017, -1318, -1331, 1639, -7, 262, 48, -2550, 252, 1735, -764, 143, -474, -653, 2374, 421, -1440, -14, -910, 814, 1740, -1737, -756, 978, -15, 1046, -435, -2460, 956, 1145, 9, 797, -1463, -424, 2312, -585, -1086, -410, -1378, 1545, 1451, -1518, -168, 189, 228, 1800, -1036, -1951, 1059, 295, 593, 644, -2076, -453, 1593, -316, -206, -874, -981, 2239, 1055, -1104, 254, -800, 305, 1603, -1604, -1458, 458, 266, 1291, 159, -1819, 553, 1100, -58, 421, -1353, -965, 2009, 566, -831, -318, -1146, 640, 1281, -1180, -678, 93, 351, 1817, -216, -1941, 413, 308, 44, 342, -1743, -449, 1601, 469, 19, -683, -1035]
3507a035K595n95j889N76j27P79J314k362r28J626K45O13o36j657J733J104r91
3524C65K00j854j62K681p15j439M95l16J417O59j977k61N06N41J333j360j657
3541a544J827M16l01j85j530K20J799O3o86p88N8J879N0j978K7nO16J366j251
3560E3j201J106N85M45r23j628J148J185j60oj222l81J839K11j494m80R7J301
3578D75P45r63p82M18M69Q55j053j729Q80J256J82m58q43k2J049L58n77j119j14
3597i73J765N71j368p56J68Q23O17o75j545K98J438P72n66j410L04J050K20n63
3615A70r03n42J540J064r78j239K09R61N46o63r76K71R76P42k64j792j48J257
3633B31O11r44q40J90R51J129o71j188j87P97R12p14j423M73J229K61m20j000
$$ y = [-1035, 1560, 965, -924, -348, -475, 304, 1618, -744, -1672, -46, 199, 812, 176, -1481, 252, 1356, 365, 565, -1289, -1451, 1230, 515, -924, -429, -745, 672, 1331, -646, -907, -401, 140, 1473, 113, -1544, 283, 699, 398, 213, -1317, -1097, 702, 765, 79, -709, -651, 1228, 1278, -700, -673, -678, -62, 1304, 53, -1148, -42, 543, 988, 65, -1563, -415, 770, 610, 604, -618, -999, 840, 1051, -443, -923, -826, 475, 1220, 257, -525, -107, 362, 1217, 164, -1565, -685, 571, 753, 295, -548, -570, 479, 837, 260, -859, -973, 792, 1363, -5, -761, -593, 230, 847, 172, -1373, -1075, 363, 1135, 569, -841, -537, 513, 733, 170, -733, -1275, 265, 1329, 351, -888, -679, 282, 828, 165, -811, -540, 436, 1178, 914, -878, -1026, 231, 842, -102, -942, -752, 199, 1328, 657, -531, -718, 79, 991, 277, -1146, -673, 556, 817, 397, -603]
3651f03o29J402Q38n56j188P3J069P42q81r56l48M90J270l35j322K78J186N56
3669A086j80j436k39J087K87k02o34j104J426J360j319q47j50L99J530l03j475
3686g14K70N94P00j03j659n48J711Q7M8m89j002J154J213q73o04q51Q36J553q72
3705D51j192M45j23R38N78k114P2J076M71L84j087j116J620K73n47k35j398Q77
3723f27K087j190n59K4k00J301O1j724L85J59M71J147j880q43J659L17l73j98
3741A7j410J188J485o65l24r82j79K110q06j410O14k28R16J236j979l54J116j11
3759B34O78j042j305J529O64o76L80j473M0K334j000j000M48n24J789M55k106
3776e75K04J63r6J534j467j520K071K00j37K70j961O98J899j199J18n41p02K299
$$ y = [-603, -1232, 170, 1008, 452, -736, -663, 406, 1148, 267, -689, -1037, -547, 723, 388, -934, -656, 530, 1086, 906, -530, -769, 318, 605, 403, -231, -1335, 91, 1451, 132, -715, -865, -466, 1064, 761, -714, -444, 150, 850, 747, -912, -1460, 251, 338, 386, -103, -1105, 49, 1262, 389, -215, -1066, -230, 1323, 451, -741, -296, -419, 519, 1097, -1017, -945, 131, 602, 986, -101, -1217, 403, 676, 129, -106, -1504, -627, 1460, 270, -289, -265, -465, 836, 897, -827, -442, -283, 188, 1335, -545, -1388, 271, 588, 215, 17, -1393, -205, 1280, 615, 291, -691, -870, 1240, 434, -976, -362, -590, 326, 1562, -417, -771, 345, 234, 912, -130, -1435, 94, 758, 82, 462, -1011, -971, 1363, 363, -637, -189, -713, 1076, 1531, -575, -371, -208, -304, 1230, -237, -1757, 314, 514, 377, 647, -1314, -616, 1283, 84, 202, -339, -1041, 1258]
3794A258j79j958O53n86Q08J444j701p07J486k13P40l56k274J513O43p46P69j439
3812h45k56K260m98j077K82q29J405J109k341L31M95k93J521j266j892J854K17
3829A77J29N15j710L96J681q50j26n78j317K280L85j644P41m38J12J893j556j336
3847a246J349l50J053K21k513J110J263j056O43j333q52K792k98q25K86r85Q56
3864A15J386j986l10O31o51J951l21k286J412M80k32N59j681j59K207q41l6K7
3882B65j857J831R03j906L99j21j52K118j047j322R80p2N02M36k594R53J601r21
3900dN94q35j258K175K46j323N18r70O02J778j610n16O88q49J599j15k129J137
3918b72N46j03R98j659p75K028n11k38J95j524J376J270j687J05j46m32K000p10
$$ y = [1258, 1079, -879, -226, -812, -4, 1440, -261, -968, 518, 305, 1045, 689, -1585, -72, 571, -175, 594, -845, -1101, 1159, 661, -416, -134, -963, 442, 1551, -790, -459, 36, -257, 1264, -2, -1894, -40, 177, 306, 821, -889, -493, 1188, 338, 212, -366, -1683, 597, 982, -662, 79, -359, -247, 1646, 90, -1246, 103, -247, 806, 1027, -1486, -376, 887, -169, 474, -859, -1711, 1081, 783, -42, 244, -741, 115, 1501, -485, -795, -164, -815, 1136, 815, -1471, -59, 421, 189, 748, -933, -1092, 1115, 274, 238, 265, -1592, 239, 1142, -764, -365, -486, -638, 1480, 433, -889, 91, 19, 521, 957, -1637, -684, 917, -4, 590, -245, -1503, 672, 918, -405, 113, -857, -255, 1523, -87, -603, 85, -764, 835, 720, -1409, -272, 274, 171, 1169, -490, -1265, 763, 252, 14, 209, -1315, 61, 1331, -356, -251, -397, -829, 1171, 461]
3936D61j529R98j20Q75P33k395J0J445o71P42l13j613J697Q01r51P5r08K6K079
3955A442j450p11O79m47J236L50k213N85P90l36R96j299p71J860po94K58j469
3973a201O63J592j136J17k04m40J779k31j825P63j88M39J060j880k26J494m63
3990A13K14r6j677J416R85q91K03p13j29J712o53j171M36m69J100O54j718J70
4008e14P84jO87j075j100J363L64k73J16j357N58J411r65l12n7m49J730Nj405
4027d90L45l4L70Q77j599o91J357P7K44k70j232R41R93n70o1r31l9J706l64j195
4047e66K81l60P88Q97j467l70P66L32O98o92j332J013M18k02K8r94M8J560l45
4066E01p00ol85R91L05j005r9J26L61Q49q52j212Q63N18J37P9j408M72J299k92
$$ y = [461, -1068, -70, -190, 685, 1418, -977, -967, 478, -193, 549, 236, -1377, 320, 1121, 170, 245, -663, -637, 1442, -8, -719, -40, -487, 749, 1099, -1114, -529, 261, -75, 921, -378, -1149, 711, 704, 10, 268, -1201, -538, 1054, -82, 35, -169, -609, 1170, 939, -886, -123, -311, 128, 1188, -692, -918, 576, 113, 327, 231, -1446, -30, 955, 64, 267, -446, -575, 1137, 484, -687, -251, -720, 380, 1034, -684, -514, 270, 269, 956, -119, -1219, 144, 508, 235, 351, -1006, -448, 963, -2, -314, -371, -820, 910, 915, -490, -145, -179, 191, 1068, -531, -1222, 135, 212, 456, 186, -1046, -105, 888, 318, 257, -674, -713, 993, 629, -566, -285, -645, 143, 1040, -427, -797, -31, 301, 999, 307, -1025, -12, 406, 204, 232, -762, -714, 846, 501, -199, -205, -590, 401, 706, -299, -398, -272, 89, 938, 86, -1126, -263, 255, 392, 471, -937, -465, 834, 542]
4086E42j21p24n93J379K39r75k80J41N20P77q77o46M63J63P69m03j184L86P98
4105C74N0mj101k26J216L54m80o49Q8O87N20q28n26N6K59Q53m64r48K59P18K50
4126D58j56r16J73P07M05m44n87k32P24P02r94l56j0N79M35j60q61J91M00O36
4146F94m45p74j86Q78M11l11p64j91R83K86k34r56L0P07P09n16p23o3K96N94n5
4167C70r37j02N73P26j24p89k97P90K29k17n24m36P19P13l10r45K78K26N16l2
4187D27p24l78R33N22k69q83l58P49N53l74o41j57L94P32mr87j62P03M15j05p67
4208c81j55O63L75j5p45m99O32Q47o03l55k51M55P87j83j000r4J57P43K8j019
4228f13j53Q92K95J32o44p90Q92N27l07k10o41L07R69l82o44p5K4R86J76j289
$$ y = [542, 421, -303, -896, 483, 722, -253, -533, -392, 128, 905, 28, -618, -155, 8, 777, 374, -810, -424, 374, 424, 420, -681, -907, 309, 663, 183, -466, -378, 309, 829, 1, -525, -469, -210, 643, 179, -769, -510, 208, 458, 302, -614, -441, 266, 671, 227, -360, -592, 132, 834, -160, -516, -526, 53, 488, 328, -533, -342, 58, 694, 249, -525, -711, 167, 578, 267, -497, -688, 295, 581, 347, -609, -579, 128, 837, 321, -402, -465, -169, 425, 370, -567, -669, -96, 630, 506, -283, -580, 210, 439, 222, -302, -738, -19, 694, 384, -561, -283, -57, 459, 427, -297, -675, 258, 780, 511, -372, -730, 19, 572, 198, -443, -600, -206, 526, 522, -465, -627, 76, 491, 386, -381, -536, 127, 502, 487, -258, -757, -125, 722, 119, -236, -487, -32, 755, 572, -428, -522, -365, 378, 406, -613, -766, 126, 421, 553, -91, -881, 11, 538, 231, 21, -620, -313, 656, 274, -370, -445, -421, 565, 741, -548]
4248e48O6N05K03L91q87o48R75K53n0r4j009P28J082o21k96m57P5Q33j64p02J69
4269a96q9N30N24j120o73J278n6L61l11j217J040N92m17j44p57K11J309m67o18
4288b20p2k48Q89O70j456k5L50L63N72o97j046Q96L57k37K64j048K61J226n11
4307B88l31j66l72J014M80j446J32J53K61Q50r05p79Q92m1M39L0j477O73P54l03
4327A46L58j012l60J585j85q66K29n46P48R01j174l47O31l29R04m62j414J044
4345a49O59l19K50r89L6J142k01l64j66q74J406L97j167j5PK44J004o50j127R08
4365C2jM04J82j490L54J184l98j33m53q09J632J09r04K66o29N58J123j141l93
4384e07M77j24P45j75j398Q00M51j51M84r21n33J563k89k55P7r83Q25R59j405
$$ y = [-548, -482, 23, 226, 617, -270, -918, 57, 310, 260, 166, -843, -115, 967, 346, 50, -407, -332, 501, 337, -365, -196, -285, 245, 769, -351, -1024, 254, 198, 559, 248, -969, 71, 663, 246, 102, -655, -444, 865, 398, -220, -292, -540, 349, 1019, -437, -462, -112, 251, 823, 126, -920, -24, 333, 96, 360, -688, -427, 799, 288, -43, -209, -581, 433, 913, -533, -401, -248, 13, 863, -42, -821, 71, 30, 469, 499, -978, -305, 449, 146, 504, -508, -868, 717, 532, -334, -105, -651, 97, 998, -176, -523, 108, -221, 683, 221, -1193, -149, 510, 191, 441, -548, -512, 630, 429, 65, -101, -975, 431, 828, -339, -354, -347, -103, 901, 251, -876, 32, 31, 435, 617, -873, -519, 665, 267, 134, -319, -1128, 504, 613, -291, -25, -654, -96, 1027, -114, -507, -30, -154, 591, 416, -982, -182, 269, 118, 602, -319, -852, 711, 422, 167, 244, -739, 86, 1045, -360]
4403c60R2%j28J274n62j185Q65mK14O58j466k9J195n79M17o29p35J124N69r67
4423b36J46l52K41J101q08o87L71k7Q39Nj401M76P35k56L39o73q03J522K6n60
4443bJ09r42P43J156j202k50J40j57J301l02j352P71j36L79L33j221j65J214l29
4462H8J66j49j155J032P48p59k12p9p4J403o81r18L99q9O51M17j499K07Q62j99
4482A59M05o31q33R57M34k89J1r46M01J202q49l82K68l60J225j46j360N01K56
4501B3j9Q54j151n48J148j92N5P2j166P08J118p60k10k55j90J163j97r23L52j41
4521b59O18L76j254j83R01k39L55k66r17R15L81k51R9r27J47J153l05o45K82l99
4541d18O80M81j226q1N19j9Q58q55o45O58K41R2q5r85M03R20n22j06k71k09R36
$$ y = [-360, -268, -268, -396, 878, 316, -869, -4, -8, 206, 864, -602, -631, 564, -15, 402, -227, -962, 162, 731, -236, -90, -442, -201, 900, 92, -595, -224, -251, 588, 593, -808, -332, 403, 147, 486, -187, -990, 532, 558, -2, 107, -835, -92, 1064, -138, -388, -248, -405, 896, 594, -758, 13, -123, 256, 589, -632, -797, 417, 88, 254, 105, -1050, -18, 730, -29, -241, -320, -394, 1009, 328, -590, -191, -280, 371, 788, -711, -504, 358, 159, 564, -67, -900, 57, 491, 202, 213, -733, -332, 870, 21, -361, -93, -453, 772, 626, -734, -233, 23, 4, 858, -293, -841, 307, 115, 170, 242, -924, -216, 902, 142, -68, -323, -513, 650, 453, -470, -118, -259, 359, 735, -519, -702, 199, -40, 315, 49, -868, 47, 428, 177, 276, -651, -504, 649, 344, -301, -19, -418, 262, 743, -483, -564, -45, -64, 794, -61, -706, -48, 193, 285, 200, -785, -382, 538, 16, -90, -361, -570, 366]
4562C66K25q22j20m7M71P89j026m68N50K38M12l51r78P01M90l68J26o27r5J126
4582E92k10n08On81R84M48r08m00K45L95O55n81q82N67M43Q4n9q37O0J063k24
4603C52l15j72m76Q27M33q56k43o3O03P16q12n54M18J75M03l2j214N57N84k1o1
4624B49m62m17J012K85p24j02k70L39Q35n47o51K62J12N71k50q63K42P06j07J72
4644C92r06o4J116j72o3n32j08O92J95m75l47r9M18N41m02q51M17L44K70m7q10
4665d91J1R19J5o7q41j72Q05K80n00k16n6M60M58m92m38K4K64N62L8j024J39M10
4687H8M91l09m82k48O03L51k34o53k86P79N35l53n78n0K67P26k79o04k47N54M74
4708E45k44m46k81N31K88k71k19k08K55M51J5p59j39N23L92r2n62k14M63L88M9
$$ y = [366, 591, -231, -351, -398, 73, 862, -164, -632, -82, 156, 568, 217, -761, -60, 430, 62, 188, -439, -534, 592, 382, -126, -120, -701, 283, 731, -177, -577, -332, 63, 718, 137, -745, -178, 265, 349, 290, -547, -487, 576, 352, 37, -135, -611, 216, 649, -207, -450, -513, 90, 806, -6, -560, -142, 33, 436, 404, -810, -253, 331, 310, 249, -213, -630, 382, 667, -57, -159, -429, -90, 745, 198, -453, -191, -79, 492, 242, -621, -379, 327, 220, 392, -514, -578, 538, 366, 303, -229, -337, 355, 550, 75, -272, -371, 47, 588, 186, -665, -248, 96, 366, 319, -491, -480, 439, 454, 387, -454, -626, 179, 459, -41, -257, -313, 147, 605, 113, -325, -301, -37, 525, 563, -461, -322, 88, 579, 270, -212, -460, 143, 494, 260, -393, -679, 100, 635, 282, -296, -346, -79, 647, 368, -236, -483, 71, 545, 301, -145, -426, 105, 393, 122, -97, -305, -50, 401, 416, -343, -482, 41, 433, 341, -221, -435, 28, 416, 465]
4729D65p69k41P08L71k44m97m00O07O20j67p16j58L54M16J93q25l07N15M75j2
4749C88m42m51N15N34k86m61k51K62P35j12n44j14J17M67r2l93k66J88L58J89
4769C41m69l69M48L93%l97m81K49Q33l15k82l75O0Q73j04m51m33L33M22M22q96
4790a98l50N37K28K58m71p12N78M87p5k31m88%R21r1n56j21n8O90L28p95l41M47
4812a3J88M98o32q56O55N63l3k12o18J81R15k88l67k97k79R88O6o97p2J73P7O24
4834E64n70n47N81J60J85k44p72K83Q02k14j20k31m13Q62K86p46n7k80N56N03
4854E88p06l79N39%N08k07j248N22P82k29K88r84Q3R63Mo32r9l84P47N32p84k39
4876c35J46J05Q22o29p80M91L07K16P1j044R2J082j79j51m94k87P37O26q69q1
$$ y = [465, -304, -545, 163, 534, 290, -207, -607, 0, 620, 453, -263, -421, -67, 349, 542, -283, -590, -75, 400, 388, -54, -505, 10, 544, 258, -203, -454, -192, 543, 431, -113, -227, -110, 357, 265, -128, -394, -206, 152, 341, -128, -497, -49, 344, 344, -53, -534, -285, 548, 233, -49, -424, -364, 509, 405, -46, -479, -146, 276, 698, -198, -548, -11, 217, 475, 4, -708, -130, 357, 282, 51, -437, -437, 484, 393, -163, -284, -342, 348, 676, -119, -460, -13, 175, 673, 41, -815, -160, 403, 370, 158, -460, -279, 636, 348, -19, -316, -595, 393, 459, -238, -310, -137, -60, 564, -6, -553, 28, 188, 373, 129, -643, -360, 442, 228, 108, -123, -536, 326, 612, -134, -191, -471, 85, 588, -118, -497, 42, 42, 550, 343, -905, -383, 399, 170, 458, -526, -443, 520, 524, -108, -207, -591, 156, 688, -96, -335, -189, -84, 738, 109, -671, -180, 127, 343, 414, -630, -538, 544, 365, 214, -280, -567, 170, 796, -73, -154]
4896a54l35L33R32p13o98L51J05N04M9j001K96O09n9N3o68l24J026L4m71M9m50
4917e32M25Q60p62k84J29j1P83j15j042M15l2O53r5q23j72R69J3j51o8p77N68
4938d9P70j089K01m7K7R36n49q61M60Q6O15K50j314N7R88l75L00m99n78Q76K85
4959D90m30ln61K76J241j006l87M5R5O90Q5j201M44L79j13N67r57l57J002J6j87
4980A28k9p82P25N60n80k20p3j13J151l07q60J70l5M78N17j093o4O78nL42o20
5001c2q17R54M47m26P1o53J14J079n56m64K31j33N23L51j209K10M51k29N54o27
5021a61m65P61K19j11j41o86K86Q68l78j46k59l75J106q2q63K27JK68N05p75l49
5042e50P09j09L49j47j004N47O97m29J19m03k32R63k42n19J66l09O15N58j143
$$ y = [-154, -489, -156, 776, 63, -635, -284, -179, 325, 374, -627, -331, 278, 219, 272, -396, -720, 306, 340, -131, -82, -532, -107, 753, -9, -293, -164, -175, 608, 493, -549, -134, -166, 487, 392, -431, -603, 366, 379, 228, 160, -617, -49, 721, -368, -167, -214, -187, 749, 200, -661, -201, -115, 500, 750, -564, -507, 481, 106, 406, -93, -671, 205, 490, 60, 57, -504, -228, 1013, 7, -380, -335, -240, 450, 535, -666, -222, 157, 44, 611, -346, -703, 299, 315, 128, 99, -683, 42, 602, 22, -198, -271, -384, 767, 460, -400, -230, -265, 213, 730, -363, -427, 251, 246, 588, -32, -849, 105, 552, 126, 197, -456, -342, 737, 181, -283, -52, -185, 338, 689, -520, -310, 141, -88, 466, -161, -626, 135, 354, 243, 102, -584, -298, 570, 192, 46, -213, -588, 518, 436, -427, -200, -199, 69, 574, -201, -550, 159, 50, 399, 252, -752, -205, 492, 63, 182, -221, -453, 510, 268, -251, -85, -394, 221, 779, -364]
5061c64r6L87J65M22n36p36P82L26j26P1q98K91R80m98l0l48k21O76K60q82J87
5082a88k01L56O08n56o68O08K59J18j1j061N48N39k49J95o01o6P77N3n49r9l55
5103e43N40P18q89l79M09J11N70l18p36L79N42j45j28n57n2P56K40m19k86m63
5123f50Q07L44p62j3j30M93M25k66o68K42J72L54o9r40L14N52p3J37o14k63R93
5144C85J49n63Q4l54L01N87m92m28M2K14M74p3r19J90N04M7N8n11j42Q75R6m69
5166E5k14k19M83M86l98m93LJ25P74j49j083L12L70J55J88o86j44M52K63K6n81
5187b75l15O24N35o23j93j11K40O83l86n60ML55L88j68m45j94N88J48o5m91m57
5208g18P01N08l90l20k04M33N63k90m48k94M66L48j86l62j02K00L62M2o81m7M09
$$ y = [-364, -460, -73, 92, 514, -22, -758, 24, 350, 224, 295, -603, -312, 668, 170, 140, -208, -429, 247, 507, -375, -188, -389, -33, 575, 19, -649, -41, 218, 336, 325, -736, -188, 351, 102, 297, -304, -370, 407, 460, -89, -188, -543, -3, 715, -174, -553, -144, -33, 537, 219, -517, -138, 404, 259, 131, -426, -478, 278, 518, 99, -187, -650, 157, 501, -261, -274, -404, 89, 514, 248, -420, -178, -6, 348, 279, -661, -347, 205, 132, 269, -345, -608, 385, 534, -29, 55, -299, 2, 589, 97, -331, -289, -75, 399, 326, -593, -403, 101, 148, 206, -305, -447, 428, 524, 55, -159, -378, 105, 591, 193, -300, -297, -172, 602, 453, -630, -318, 52, 207, 395, -291, -435, 17, 280, 306, -275, -590, 34, 569, -54, -247, -358, -118, 565, 179, -381, -377, -22, 366, 198, -247, -441, 147, 295, 230, -261, -718, -17, 491, 101, -219, -423, 10, 573, 283, -165, -459, 7, 355, 169, -193, -295, -95, 267, 309, -372, -419, -10]
5229a0K62N0m16k96L17N60k52o11M2K59M15J15p55J9K33M81k02n79j22M31O29
5250E70k23o85k11L08N60j7k95n37L59O37r7n54j67L14N17j90n73k86L57N94r
5271C72n14l51M14L64%l22m98K33O43J08o20k71K55M66Q1n81k22K04O13k04k63
5292i3m05M08N72j26l10m84Q1O32K07m45l78Q8N83P6n00l76M15K62O7n7p81L61
5314b03O32j27k58m62J86O32j75l73j82J49K96K77m54m12L43L72K44l65n53J56
5334b77O30n2o2n69N5N97R0n73k48Q1N48K19m66l56K29L97L86n04o12K83N04J09
5356D09k58o11K71N40j42j16m05j35N30M01m79j81O1K69K22m83k79J77K6N25m1
5377C01j014K94Q18k3j79o05j13Q01J63l56k58j98N24L10m78l87K23R5O44l99
$$ y = [-10, 252, 302, -114, -410, -93, 467, 215, -396, -354, -95, 320, 435, -320, -301, -68, 413, 211, -368, -490, -59, 570, 347, -338, -549, -241, 319, 302, 7, -530, -171, 466, 369, -185, -352, -38, 479, 289, -284, -570, -213, 381, 372, -142, -493, -79, 285, 285, -37, -535, -302, 341, 449, -171, -442, -187, 279, 360, -221, -443, -239, 374, 170, -93, -498, -90, 482, 356, 46, -438, -357, 275, 482, 37, -341, -253, 330, 406, -94, -470, -55, 207, 274, 217, -564, -203, 429, 302, 44, -418, -232, 400, 225, -148, -330, -181, 115, 392, -62, -474, -131, 241, 485, 120, -433, -277, 353, 301, 239, -330, -275, 322, 412, -161, -409, -328, 220, 439, -27, -383, -154, 243, 629, 125, -487, -204, 300, 409, 151, -460, -189, 351, 209, 93, -312, -447, 83, 484, 5, -176, -115, 154, 376, -107, -386, -209, -183, 342, 301, -713, -419, 399, 376, 197, -408, -521, 280, 443, 87, -171, -369, 155, 465, -13, -400, -177, -82, 562, 163]
5397A63p03L28L42Q7P0o94m6P48n6j31j94m80Q12J47l83k44q1K45N22k39o86M15
5419e8J2M05%o53l8N72J1j16j66m77P59K62n98K0m01L26Q54p97p3J3p3N96j4p54
5443c88M3M49J27K67p25l60Q76j4j51k78j57K87O34n66k22J38nM40k28o27J95
5464b65K42J94J71o86k21P71%N7l40m87O85K68j73k98m37L32O98l89m68K1J43
5485a82P15r9o62j93L30K8L43k67p12P66J92k07L8n29J75R10n91k67J53k43P27
5506D25r2o39l4K61R2N20m90n67Q20p1J53l19o92O84N76n95m7l56m3J021l63o22
5528c78L35j71M61J85n11k94L71J02K83k35q91P86K80l09P5n63J95P37j46n80
5548b68J50l74Q29K32q65K37J75Q4J49m92m43O23L5J93p1p36L35Q77n21P1n08
$$ y = [163, -540, -212, 130, 217, 287, -407, -453, 295, 239, 108, -86, -566, 246, 393, 10, -234, -315, -70, 452, 213, -473, -58, -46, 359, 359, -294, -332, 240, 251, 135, -31, -508, 251, 513, -85, -65, -466, -140, 714, -83, -156, -143, -216, 380, 366, -388, -345, 104, 231, 498, -227, -587, 289, 275, 124, -154, -311, -24, 610, 44, -178, -40, -45, 395, 167, -460, -265, -23, 171, 342, -344, -565, 206, 206, 263, -77, -564, 121, 389, 216, -82, -519, -187, 511, 122, -346, -325, -182, 533, 434, -228, -421, -91, -63, 280, 13, -699, 67, 259, 52, 90, -439, -264, 646, 55, -212, -59, -302, 425, 333, -306, -340, -79, 13, 533, 43, -524, 296, 225, 378, 59, -633, 51, 627, 32, -15, -371, -414, 607, 244, -378, -43, -214, 247, 432, -79, -373, -2, 100, 383, 148, -743, 43, 323, 14, 89, -474, -279, 458, 312, -268, -118, -492, 337, 569, -296, -59, 116, 200, 349, -143, -586, 37, 72, 265, 194, -542, -207, 670, 149, 220, -288]
5569b88j56Q88k4o81Q3K8M08L88o99m35M11J39J88j45o01M31M97j51j4o37q7J148
5591F91l61l41j3l96O13M51p18k63J31J64N34l26o13N91n0J54j5p90J83R15k02
5612C39j95l60j72Q10O6p12N9j23K93O06m58n89K52M4L92j05p88N58K79K58k36
5633B18m29l47P92K78l34l13k47L90O84o98l74K68j2N15m1p10K92K35N0N0n83
5654c16j43P57p3j62q7l81N36N56o65k29j52K72P13n30m59J41L10K37J38q90O4
5675c63N00J24P3l91m26Q67J98l80l54m57O95K74k52l23p9K21O22l21o29Q0L04
5696a7J69L93o95k41L50M03k63l00k25L69O98m50k55k40k6P07k6o82K9K71K91
5717B60J71o86j08N83oJ57n69k64N22M50k44k71l12K59M71l48k03o5Q2O57j84
$$ y = [-288, -444, 444, 420, -261, -178, -150, 258, 646, -53, -488, -77, 62, 250, 105, -496, -65, 432, 281, 267, -370, -457, 691, 330, -11, -24, -420, 193, 644, -74, -337, -206, -42, 492, 166, -447, 144, 94, 248, 233, -557, -374, 541, 339, 144, -216, -388, 422, 488, -224, -165, -288, 5, 611, 153, -436, -184, -140, 252, 147, -641, -83, 196, 454, 218, -211, -558, 234, 512, 178, -135, -382, 8, 692, -6, -380, -112, -124, 391, 350, -360, -68, 167, 217, 267, -316, -459, 298, 225, 63, -24, -405, 131, 687, 22, -207, -359, -87, 626, 96, -363, -222, 88, 325, 463, -427, -363, 137, 261, 334, -57, -483, 384, 582, 202, -152, -609, 86, 360, 108, -215, -294, -73, 549, 228, -401, -321, -17, 152, 545, -150, -391, -41, 362, 99, -201, -426, -57, 641, 191, -64, -304, -330, 377, 351, -331, -302, -31, 260, 431, -255, -363, 220, 214, 371, -198, -462, 60, 510, 266, -5, -317, -58, 413, 65, -138, -203, -121, 536, 352]
5738C52n38j1J94K82p8l94l61O16J03J43k74m16L53O01m29k88k75J51O31o1l34
5759c3k70K31K96K8m46k06M84L11j43l41k16J72K36K8l19k10K38M64K9m29k26
5780c22K33M78l5m09l14K31M69K1l24n78L78M16j39j43l34K07N30rl72m11K19
5801b08L84K65n71k64L18M02p1k39m36L17K84M0l15k64K06M46J1m28l89K64M54
5822B06k5k59j94L0N37J33m70l63O9N93j9j13o04L71M65j18k50k45j54N48J12
5843B50j55l36J36J92J72k42l04M8M30K29m65k71J12M57J86m82j58p1K67M93l36
5864A52m33Q5L68k9Om49J37K15K34q4l25j15L34M67o55k55l6M56L38l40k08J3
5886a24L82J46l86l94K80K40J94k15l89r9O35M4l0m85j9N79Q7m12j64j33K04L68
$$ y = [352, -186, -197, -3, 279, 201, -193, -554, 62, 165, 308, 34, -382, -29, 572, 143, -145, -420, -269, 362, 301, -33, -303, -72, 224, 252, -194, -400, 84, 395, 252, -89, -305, -133, 103, 131, -188, -398, -160, 304, 333, -96, -322, -89, 389, 354, -55, -369, -138, 331, 352, 28, -550, -172, 244, 105, -38, -372, -165, 365, 356, -16, -427, -208, 176, 441, -130, -394, -76, 326, 255, 16, -420, -103, 181, 221, -94, -358, -152, 294, 305, -123, -512, -248, 206, 181, -78, -272, -242, 295, 428, -42, -405, -336, 257, 238, 125, -479, -108, 357, 239, -11, -256, -410, 138, 250, 95, -241, -105, 87, 259, 17, -287, -239, 191, 420, -45, -316, -204, 253, 439, -43, -201, -272, -5, 488, 152, -281, -196, 172, 143, 149, -300, -163, 52, 286, 202, -123, -238, 96, 563, -92, -347, -383, 73, 411, 71, -137, -124, 258, 404, 18, -376, -96, 144, 338, 123, -266, -365, 270, 314, 284, -201, -220, 359, 446, 34, -130, -263, -59, 309]
5908C09j69m71L1M00L65j28n30q8N21r8L7l09k38O85J64l61k22k48M62K43m36
5929h1l2k24L43M25k44n23P0K40J70K78q46m0Q51j01q7l14l93N39K99l10j17l9
5951a36l7N36j16o12J40J66L12J18p51Q0N77M9N2o45j21L25L22j56k97q7J77O20
5973E16k48m42j02P1P40k94n99l9N33%J52m81k87N21K31nl48j74K12N67l26l41
5995a43j19j8P54j70o96K22J78M20L3p22l23N31J02L47l89m16L67J93l5j46l52
6016c82J70O82j67m37o8j35O65P8o70j06J65L52K83m58m27O96p6j96J3m17K63
6037a72M13N1k40j95k34R15j17q28L01k38N52J90m30l43J66L83N0k71m77N09L40
6058C25k16M1n81K45L66q5j42m2r9L44M14q28ML65k24M71l09o26N86L18k26J55
$$ y = [309, 140, -331, -300, 100, 465, 337, -193, -281, 240, 142, 179, -130, -368, 317, 481, 120, -102, -350, 112, 355, -81, -113, -337, 6, 431, 187, -336, -266, -26, 144, 422, -424, -464, 387, 286, 199, -115, -508, 31, 330, 20, -97, -136, -173, 363, 247, -365, -225, -59, 253, 371, -380, -300, 277, 326, 378, -267, -388, -63, 259, 103, -194, -281, -104, 516, 268, -174, -276, -205, 535, 241, -358, -397, 136, 136, 288, -193, -480, 41, 272, 267, -81, -255, -43, 524, 198, -143, -262, -280, 474, 304, -392, -170, 8, 428, 461, -261, -584, -53, 49, 396, 7, -409, -42, 151, 116, -30, -382, -212, 470, 303, -134, -202, -337, 328, 406, -264, -370, -205, 147, 430, -28, -455, 241, 165, -31, -18, -435, -172, 241, 292, 52, -143, -377, 538, 421, -407, -106, -344, 208, 398, -32, -375, -209, 174, 224, -47, -524, -15, 325, 109, 150, -431, -186, 180, 95, -47, -89, -188, 156, 570, -258, -254, 111, -113, 358, 49, -577, 9, 327, 101, 256]
6080B56o25J40O55k93r8j76k81P10J13l03l45J11K71L19m73k15K32K53K16j95
6100B72p16L08L46K2j51j23l22P44J32m20k10m35N54N23o17k15K88J11L61k01
6120B51p77M75J28J99j54m94J11N08p9j87j74k16Q58N7o12k1j06L74K67m24n37
6141e53L44K78J09J42p17K15M07m5j89j63k44N53J25k51p2l90M42M68m93k86P
6162c13K61L33j5o45K13K11J62l8n07k31Q26P5k15k89k22N07L31m65j48m9K04
6183a4N23k76m33R9K14O0P6n85R1L67K49j39m13j97M53K23l03L1m06L21N58m33
6205F6k54n8O4L86O0o65m3N80K60Q0o93l09O69K50k27k52j47K30L75l57j70j38
6227b93L1O54j53n13J41J37J50K88n16k82L27K92L8k75m95M28K97j97p8l62J43
$$ y = [256, -369, -229, 426, 133, 35, -141, -422, 288, 401, 98, -247, -136, 135, 454, -19, -234, -2, 251, 467, 272, -444, -136, 210, 232, 81, -42, -364, 380, 512, 92, -118, -553, 1, 524, -93, -308, -20, 91, 452, 251, -526, -51, 77, 276, 122, -372, -261, 247, 168, -19, -193, -409, 449, 506, -106, -127, -233, 141, 408, -16, -553, -209, 69, 178, 320, -397, -182, 225, 180, -9, -172, -416, 137, 262, 11, -61, -451, -9, 459, -34, -320, -313, -52, 281, 266, -379, -166, 45, 207, 169, -338, -569, 257, 332, 117, -172, -394, 113, 444, -21, -169, -218, -14, 509, 233, -200, -101, 113, 173, 249, -336, -245, 122, 371, 232, -181, -378, 75, 298, -5, 26, -380, -59, 499, 66, -188, -246, -182, 204, 264, -401, -444, 136, 396, 476, -217, -526, 143, 393, 166, -86, -233, -3, 372, 15, -155, -293, -262, 392, 239, -274, -133, 4, 154, 442, -74, -356, -29, 263, 301, 26, -469, -41, 256, 59, -19, -381, -238]
6248b38N13Jm09j18J20M00J21p24%M03n6K69l19l34K79L53p4l23m53M24N78l07
6270A06j85j39J15L63J17o33kL01K4L91l78l80K26K08K37l19m30K86N08j39l38
6291f1j27k0M56r6l64o0K81K40K07o38k7P4J56K62m55j92K62K12J51j33m72J57
6313a87M59j44j47j38n6M36J65m34m00L67K21J70l50k72J03M54N6j76n01O6N36
6334B28M0l70k99R1O35Q5m38k66K9K59K75k21m32J53L99Q6j91l11O2M63R2l39
6356C0k98Q8K51L74m94j16p4N00J12m81l08K91L31l3j56l76L9M38K66k21k97k1
6378a55M41K4j90l99j15M65K19j79m16n6N72K9k04l40OK82K01l8l05q2L22K71
6400C53k24m02m6N16J36j39m19j03N32np6m50J09K44K94j66l97mL56K75k44l94
$$ y = [-238, 275, 276, -133, -251, -131, 269, 390, -334, -334, 69, 13, 282, -37, -371, -92, 261, 187, -136, -589, -165, 413, 106, -79, -218, -103, 260, 377, -256, -258, 43, 67, 458, 80, -300, -74, 134, 371, 52, -378, -92, 416, 277, -61, -188, -208, 248, 152, -212, -272, 9, 249, 456, -182, -209, -135, 21, 283, -172, -364, -102, 110, 261, 128, -344, -187, 272, 128, -19, -157, -213, 223, 388, -46, -446, -79, 142, 312, -38, -310, -207, 247, 303, 127, -374, -308, 228, 268, -102, -401, -310, 325, 410, -28, -294, -265, -6, 269, 48, -384, -231, 168, 254, 63, -248, -186, 277, 369, 30, -268, -180, 71, 445, -49, -165, -239, 261, 373, -108, -416, -125, 206, 173, 17, -359, -320, 118, 384, 163, -134, -155, 286, 310, 120, -279, -394, 71, 290, 111, -305, -361, 211, 240, 36, -304, -298, -16, 185, 147, -158, -240, 82, 353, 129, -273, -319, 197, 333, 194, -225, -328, 204, 199, 123, -327, -218, 26, 320, 154, -243, -247, 109, 384, 140, -254]
6422b54M3J93L25jl79k72L91J92n6l83k6J97J33O7l34j64M68K27k54l69j55K65
6444a46N07k31k32k44K84L30p0o07Q0L37K04o7k86j18L93J03J4j85l67M51L07
6465D57k47l22l4J04M10qn25L0pM90Q6n84l71O05J10j37k43k45M23L22j82m1k80
6488a89N3L63k6k64k49J97K80K34o46o4K77K31K86o86j65L79J67l8l60J23P7K81
6510B61L6m70M8n5M83o9n19O7l3M64J02l27m41N23J32P6k06l17L7M09j8j28k79
6533b24O7N81j16l68o6k06M91L33p64q3L74pJ87k78l95M90J57J85l23m68M7N89
6555B03j05j47j47k23P28K41o87j65J28L70K96o55k65K42K44K29k13m18J82M02
6575B40%l15k00m9N25Q2l66r4k2L85K33m53m48L84J07L39k39n26K09N96k05j21
$$ y = [-254, -211, -18, 307, 306, -73, -345, 46, 238, 182, -201, -227, -30, 103, 170, -164, -328, 140, 367, 113, -256, -411, -146, 361, 130, -102, -346, -62, 268, 198, -409, -329, 8, 212, 145, -141, -259, 134, 237, 251, 66, -301, 150, 457, 210, -112, -146, -42, 368, 360, -165, -135, -142, 348, 434, -150, -521, 84, 194, 57, -186, -431, -8, 314, 132, 91, -189, -136, 227, 201, -63, -312, -115, 165, 399, -247, -311, -34, 197, 483, -203, -368, 11, 178, 140, -220, -97, -20, 261, 297, -173, -125, -180, 303, 234, -285, -218, -251, 213, 315, -12, -453, 70, 202, 278, 72, -245, -208, 201, 183, 55, -224, -157, 424, 308, -60, -126, -332, 159, 492, -272, -355, 19, 12, 199, -79, -474, 16, 173, 358, 35, -433, -386, 203, 98, -49, -196, -419, 309, 550, -137, -302, -174, 196, 492, -163, -428, -186, 58, 287, 74, -344, -162, 240, 240, -75, -275, -324, 201, 283, -83, -177, -199, 186, 419, -34, -482, -98, 9, 348, 109, -417, -208, 388, 183, 62]
6597F2j73k49O61j17j35j98j91N42J94m86k04J71K01L36k94m73J44J78L28p0n20
6618b93N3L79J09j34l82L9N65j20j83k58m8J97M97k87n77L61M5K35j17l53n9N40
6640B09K6j34l45k2N26p4j34j78j55M46J38j85j87k03Q1O58l53m77K14J32J97
6661A80J72n27j60L78K0%n4l63M19M03l18j48l19J33N58k16m90J45K59J62qm12
6683a86k39M13J84K1m96k4L81L22k81j35k12J30N83m52k07N4J00K31k2m04J06
6704a33Q7J33L54o31j49M57J45om88j97N65K03l73K2j66m0M61Nn74K29j1K12K06
6727C11l48k92K50J78J02o6m42M17J60l8j83l35K05M19j8n15J06L1M03L7n10j1
6749a39K70J86M8m07m29N78J69j75r8m21N19L68m84M8j49J6L73M8m53j90K79J26
$$ y = [62, -111, -360, 301, 184, 49, -149, -340, 202, 396, -90, -294, -123, 78, 414, 120, -353, -209, -31, 297, 227, -293, -240, 139, 248, 114, -268, -229, 336, 216, 33, -225, -273, -76, 421, 134, -443, -82, -37, 198, 81, -272, -331, 209, 235, 101, -244, -266, 260, 186, 52, -126, -281, 165, 303, 118, -69, -272, -191, 467, 114, -363, -149, -17, 180, 352, -175, -335, 43, 63, 63, 9, -354, 65, 468, 150, 2, -317, -184, 374, 158, -332, -187, 72, 234, 226, -186, -425, -12, 172, 193, -303, -327, 54, 376, 95, -40, -252, -122, 461, 9, -198, -144, -44, 187, 165, -239, -133, -46, 87, 441, -190, -339, 118, 263, 257, -231, -428, 137, 340, -33, -11, -177, -217, 244, 249, -325, -96, -107, 105, 311, -37, -329, -79, 99, 201, 135, -307, 110, 270, 232, 49, -286, -81, 338, 320, -195, -89, -58, 345, 382, -128, -139, 131, 317, 365, -42, -471, 107, 276, 101, 3, -418, 101, 469, -15, 33, -116, -100, 273, 321, -132, -322, -43, 83]
6771H3K88m79k38L53p6N11l54n20L78K96l7j34k86n2O95m2m45r1q6M24K79m33
6793C4k44J68K10K28m82n03N24L40J67o27l2J50K81J04l71k36K64J89K31o74Q9
6814a90R7K89P4j98l98K17L56J9j97k95J64L92m4l12l03J47L48O4k94k63Q1L60
6836A14J83l99j11J59L7L07j60m98K09M49j42j83k17O7M11o4k6l94J22J10M27
6857D01l95j42J00J54L31l65l44k1N26O5r6n95K24L60J21k79l20J08K22M17l07
6878A65l23j10K42L93l00l56J50J26L74k28l48j61N12J84n14R6l1J43J95j26k95
6899b12r3L25J48L0m96J16L20J04J38n93j25L47L08j89m05m2M05L10l03q5l09
6920c01L18K37j04n44K98O3L61j85l01qJ24L39j35j82m31M80K71J8l41k41L76
$$ y = [83, 371, -108, -346, 7, -69, 442, 88, -432, -54, 242, 205, 71, -215, -267, 428, 386, -59, -150, -236, 188, 467, 34, -210, -42, 168, 396, -86, -589, -65, 275, 442, -185, -217, -67, 214, 318, -53, -289, -25, 164, 395, -279, -190, -93, 196, 270, 72, -326, -109, 247, 266, 69, -226, -62, 330, 286, -26, -329, -182, 166, 230, -64, -327, -246, 114, 297, -102, -213, -54, -17, 290, 130, -368, -159, 290, 148, -35, -252, -185, 226, 162, 136, -258, -136, -26, 401, 6, -136, -36, 118, 449, 84, -260, -281, 245, 310, 214, -381, -157, 203, 324, 45, -275, -167, 55, 472, 165, -158, -268, -26, 367, 67, -289, -139, -13, 361, 133, -215, -376, 136, 320, -194, -98, -129, 14, 209, 83, -212, -305, 20, 168, 198, -298, -182, 138, 242, 380, -213, -338, 9, 317, 128, -277, -319, 86, 396, 93, 8, -301, 17, 254, 150, -394, -96, -33, 328, 143, -158, -166, -42, 297, 162, -20, -451, 29, 300, 318, -23, -264, 112]
6941A12Q8L4k52j36J72J23M5l26k20L87J92Q8m15r4J37J17l9r4n2Q7K25j94L1
6964A6l26L67K17L8n85O2J36K56M6m01k18M68K24j31j46k13Q4L96n4l70m2J57
6986a9K32J98m28m6J8J96J10k06l12K85K17q6k55l19L11L22r7j02k65J8N69P1
7008D12n35p5K01J87N1j52j64L3K01j53O8m48J45L93J32l38k04K6M35q7m53L09
7030a6j10L93O6l95j74J04L55J07l98k69L27K20K06l60k62J14M26j70k98n4L1
7051a57M39n6j60k51J44J40J75k48m35M33M6M2kl48P1K78j3q3k37K0K62K81l39
7074Bk77J23K15K72l58l89K24K99L03m94j60J46K27O1M9o27N3N72q4k5k35k54
7096c57L85K75m80Q2R1R2K21m11j13K6K20K34j43n75L59L02r4m2m42J70K31K94
$$ y = [112, 200, 234, -18, -154, 18, 141, 186, -140, -360, 27, 219, 307, -108, -202, -65, 52, 13, -81, -133, -46, 179, -15, 16, -310, 57, 274, 312, -273, -211, -75, 181, 227, -174, -392, 76, 300, 169, 23, -190, -106, 290, 236, -134, -176, -19, 213, 411, -17, -63, -45, 151, 261, 55, -257, 28, 245, 159, -96, -415, -104, 218, 121, 19, -246, -228, 341, 412, -123, -198, 3, 190, 241, 89, -75, -42, 159, 6, 74, -374, -229, 164, 296, -42, -246, -220, 215, 128, -325, -16, -126, 267, 333, -62, -236, -132, 223, 330, -68, -337, -10, 210, 416, 56, -206, -92, 334, 164, -134, -188, -157, 282, 226, 66, -185, -41, 99, 274, 26, -409, 24, 70, 112, 110, -238, -167, 111, 98, 15, -222, -202, 60, 341, 2, -275, -152, 63, 335, -23, -412, -188, 111, 414, -80, -240, -94, 133, 194, 243, -384, -331, 241, 157, 132, -103, -357, 28, 303, -177, -95, -4, 88, 309, -102, -215, -189, 31, 265, 122, -453, -94, 208, 114, 72, -370, -200, 31, 325]
7118C25k67k05mK77J70n23P0R0jK57j67m42L23J48J72l3l90j13N55j3k71j27k1
7141a90K40J89j28k69l1K07L25k58l63J49J57J18J09m12j79N45n8Qo4k68K13L69
7163D09m55n6j96J24P18n21k32O5J41L48r7n28J45J93K03L8l12k01L68J30j83
7184A01j68l10L15K46o9k79K0R9L70p7n12Q4J35L17k04l44K3L01J41J22l66m04
7206d59M19L22p6k59j52J82K36j45l78J72k4M11J20n54j13K94K16Nl43l24N93
7227A43O7j31j48l16K53M44j34l15j14J7M72J75n88m2R5L10J37l91k27L86J85
7248B78j39j14k52P7L11J18m44m6kM03P0m80J0R6K00O1l33o5K74J35R1j67m50
7271c68L20K45j2k28l48J31O06j59l26j31J68K72j4l79q6K95J2J67j09l07P2L48
$$ y = [325, 58, -147, -151, 126, 296, -227, -157, -67, -68, 189, 22, -420, -97, 51, 223, 190, -200, -313, 242, 229, -42, -169, -190, 50, 239, 111, -158, -189, 18, 343, 85, -278, -129, 28, 146, 255, -157, -336, 209, 151, 159, 95, -173, 40, 409, -46, -102, -298, -174, 544, 23, -209, -144, -3, 345, 248, -280, -135, 58, 261, 299, -13, -214, 154, 284, 101, -67, -377, -62, 184, 115, -164, -144, -45, 325, 248, -264, -180, -45, 272, 68, -276, -253, 48, 189, 311, -55, -459, -40, 282, 206, -53, -205, -23, 213, 68, -310, -138, -162, 249, 369, -185, -298, -4, 212, 217, -126, -450, 143, 210, 79, -69, -385, -132, 312, 178, -137, -251, -234, 238, 413, -175, -217, -122, 188, 325, -66, -293, 93, 278, 139, 25, -227, -150, 161, 279, -165, -211, -213, 190, 260, -220, -210, -114, 86, 147, -186, -251, 23, 158, 249, 82, -368, -48, 197, 185, -43, -391, -260, 346, 187, -139, -270, -102, 170, 156, -223, -309, -14, -2, 165, 56, -251, -179, 169]
7293A69J24k75q3n0L30j44l72o7J75L08K6j27k79j9L37J56r8l64J27J99K39k47
7315F5l12J45K75r3l6k79j51O26j05j02k55o0J82N11n29N4j29M29J81l99k94n0
7337c26M69K02l72o5k69M68K71l85k32o5L88L2j59j4j87L55J30l80k4j35L28J95
7359B25k84k35P9K06K65j73k40q5M27K01l96j62o0M90J73m78j88M7J78K35o6l80
7381b21P8K92J25j90m81k4N71L5q0j13k58J94M51k53k73J6Q8K92k96j48N9J1M71
7404C46k14l62j0K95R0L3l22k74N20J6Nl81J50O3L53j75l04Q6J58J92j45j42k48
7427b70K91K65k42k64q0L68J86j98j84j70L99K50k72j82j01J70L27r9l43n3KL61
7449A61o0j95M9O0P1K7j42l63L63o3J61k65M6J61J93J26n63M6K38K41j31l02j99
$$ y = [169, 293, 18, -65, -115, 215, 71, -301, -368, -193, 115, 141, 14, -265, -284, 53, 209, 111, -253, -126, 73, 312, 65, -247, -102, 173, 80, 44, -235, -386, 240, 135, 33, -222, -282, -100, 411, -118, -64, -193, 236, 417, 18, -276, -326, 143, 345, -27, -92, -361, 107, 378, -7, -239, -304, 84, 116, -43, -57, -244, 111, 241, -139, -163, -298, 30, 225, -59, -294, -215, -9, 256, 83, -157, -242, 185, 386, -10, -172, -232, 258, 431, -47, -235, -188, -10, 225, 159, -221, -143, 149, 274, 84, -397, -421, 150, 185, 105, -8, -266, -72, 379, 126, -147, -131, -43, 249, -47, -195, -136, -125, 346, 132, -230, -240, 55, 145, 178, -144, -418, 102, 118, 123, -258, -108, -45, 308, 133, -171, -85, 73, 265, 120, -22, -270, 21, 286, 44, -220, -300, 68, 254, 56, -128, -298, 101, 351, 79, -103, -204, -34, 293, 194, -149, -202, -200, 161, 101, -94, -45, 15, 86, 113, -29, -392, -29, -92, 69, -196, -150, 11, 204, 330, -233, -187, 51, 292, 161, -141, -340]
7472c40K92J05Om0k05k8L21q2j97r4J63M46j42k33m01M82J83J23m91L1j33L75
7494A41Q1k68k07J26J47K30l71l05M16K35Q4n10J79KJ48J04j29l77K33L16r9j82
7516fl10J51N00k75j9l41J81L04J17k78k84J47L45J45m82j94K38J85J58k43k80
7537b41J57K16l2q8l22N0M32o1j61j20O5K89L6l49m9P3J54J49k60p4N3J53L08
7560C78m37j63J11J15Q2j04j61J58K88M6m40j07j29M29J52j2l77M3K72K13k22
7581A35k36o7K49J61j36k02j32M25nk21o1j13J87J74n6k09n5K72J75k20k15K0
7603a30R7K38Q1m33K1K53Q6j92j46j45L00K11l15J35k44J04L47k31l52K34L22
7624B41r1j6k33L8K62J30k01l8l43K89K14m05P3q8J75M37m76j77J85m7K90k1m81
$$ y = [-340, -48, 57, 63, 23, -182, -210, 111, 29, -168, -262, -99, 347, 205, -28, -429, 53, 236, 359, -132, -101, -234, 141, 222, -46, -253, -127, 20, 250, -121, -426, -10, 225, 309, -201, -22, -20, 128, 232, 103, -274, -41, 275, 176, -6, -316, -165, 335, 60, 41, -300, -119, 185, 302, 24, -260, -113, 232, 377, -105, -299, -61, 124, 282, 39, -241, -84, 132, 100, 12, -310, -260, 172, 111, -50, -170, -105, 184, 220, -129, -178, -105, 49, 198, -62, -136, -83, 70, 378, -59, -222, -111, 4, 86, -18, -179, -21, 267, 313, -127, -234, -363, 66, 218, 206, -171, -128, 144, 357, 135, -101, -168, 81, 242, 106, -96, -228, 197, 192, -29, -90, -203, -16, 158, 102, -107, -162, 110, 285, 65, -150, -130, -33, 205, 286, -147, -126, 127, 213, 21, -125, -270, 30, 241, -74, 61, -183, -79, 268, 37, -315, -81, 241, 150, 134, -99, -61, 201, 331, 130, 92, -251, 38, 252, -153, -80, -168, 7, 444, -32, -209, -24, -71, 219, 198, -283]
7647b83Q2M85j30m3k73O6K31J10j77Ll10K01M35m84q9R5j35N35Jm83n1Q0K13P8
7671A57m38o5M01J81j59j95p4J90K20k21n3k78K36M06k55k86J23J70K01j92j77
7692a08k9N9J57J74k22m56M23L38l52o9j75L14K33o6j93k38J13K71Q6l27j87K68
7714A4K75j53j96l28K99J30M7j59k44L66J94j37k35j08K46Q8K7k81K8n9L35J59
7736C08l82j80J41J48Q0k95k9J87J44R2j79j67L5L85j5n11M3K03K55j15k92O9
7758g5J02M8Q2j80k36L74O1M3k68l92L29J93K6Kk77J32K88Ln64P3K31O9J39q6
7782A17k74O3L04J9k57k13J96J01L14l13k10j23M13j3l75J74j2J90Q4k44j90J72
7804g7J66M7q5j19N0QR7j37q0j0J47J50j97j70L4L31j8p5j85M1M1K89q5k76j13
$$ y = [-283, -201, 284, 154, 111, -162, -96, 135, 245, 68, 71, -239, -38, 397, -87, -176, -81, -216, 319, 320, -163, -214, -134, 79, 157, -281, -346, 55, 236, 77, -118, -192, -2, 218, -3, -56, -334, -98, 308, 53, -233, -110, 60, 261, 69, -108, -137, -78, 79, 253, 31, -425, -2, 336, -16, -85, -260, 54, 287, 221, 28, -210, -97, 174, 260, -67, -254, 14, 289, 136, -60, -388, -89, 41, 88, -71, -315, 51, 245, 108, -127, -235, 11, 99, 126, -155, -127, -186, 149, 308, -74, -254, -113, 35, 115, -180, -209, -22, 122, 214, 35, -132, -97, 288, 273, -238, -195, 8, 263, 148, -144, -75, 27, 75, 157, -23, -259, 115, 176, 219, -49, -441, -112, 81, 107, 109, -168, -36, 252, 255, -309, -236, -5, 64, 203, 117, -157, -94, 210, 229, -28, -241, -45, 56, 370, 57, -153, -276, 137, 124, -251, -77, -89, 101, 185, -59, -249, -77, 89, 136, 51, -68, -18, -10, 87, -50, -130, -140, 7, 157, -40, -210, -176, 155, 137, 62, -123, -82, -41, 248, 163, -113, -226]
7829b26L83n9N6l83P9L11J0j87j18r6K83K40k59k71J17K04K66l23k64K51l1L35
7851C18k43l72K34K53j48L7k58j1M72o7j49j88j86M87n8m5j99J4J95nl0k05k5
7874a79K60J60k22j37LJ56Q3j0r3l27L21K45k36l2j65K94K11j97k07R9j8K20K9
7897B58m68J10K8K05j25j58k26L70K87l14n4o4M0M05k99j78J07oK24Nj72j46L3
7920a38K08M6k58J0K58q2r7K3j15L19m5j03n4P0j25K60O1m10M9M8K25k01l9j41
7944b31J65L84k15k35j6J59J40q7k6k08J83K98j45j69k53J77K87l5k82k50M64
7965A05jL6k63k4O2K23j12j06p5J56O0J94k76l9j04J84J57l13j71K61K00o0j28
7988c4j27Q2L13M4k85k27J76K26n1l34J92o8K74o6k00j15J51J29N7j73j63K7M79
$$ y = [-226, 157, 98, 154, -229, -150, 161, 171, -16, -134, -230, 53, 293, 34, -237, -120, 84, 350, 27, -237, 14, -17, 318, 75, -297, -63, 190, 42, 79, -179, -190, 282, 215, 66, -122, -308, 179, 121, 76, -123, -109, 86, 81, 51, -154, -179, 81, 241, 19, -118, -115, 41, 124, 114, 21, -306, 15, 260, 24, -8, -173, 121, 332, 135, -72, 27, 9, 229, 258, -210, -100, -72, 133, 8, -150, -376, -6, 281, -33, -87, -151, -111, 294, -5, -183, -76, -82, 142, 147, -25, -171, -138, 70, 116, -142, -132, 126, 44, -53, -30, -145, 174, 129, 26, -28, 42, -83, 177, 238, -172, -123, -75, 150, -51, -90, -231, -66, 318, 103, -132, -148, 11, 151, 64, 38, -170, 13, 311, 166, -3, -256, -79, 208, 173, -109, -359, 105, 104, 140, -123, -147, -85, 138, 26, -80, -155, 1, 61, 255, -21, -60, -164, 20, 177, -136, -307, -46, 154, 94, -34, -161, -79, 234, 278, -7, -234, -58, 168, 117, -217, -25, -93, 181, 115, -85, -200, -49, 80, 137, -36, -199, -172, 307]
8011C07k5l36j46J64K99l1k96r3O1R0L68m89j82L89K6J18l71j48K38J66R4j62
8033D1l06K53J57J19l51N2q2L37j40k17J25r6N6K27j04l30K58O3M9j56q5J98J55
8056B23k18k8q6r2K62L18m71Jo0K04K22l31l06M24l3R8j62P8k28K73R8j76j95
8079a85P2J88J03j57j53L5R2J94l21L0j61K31J35j4k34k53M22K04j50j50o0J46
8101A4J38Jj99k6J37M4j64j15J06L6J02R8l18K7MK47R8l78QK50J41k76o0k21L29
8126B3O4j61O4j79K89J58k31k50J23Q6K56k11k25Q1K48M2Pl86J07R3P9n2j91N3
8150a13J72K04j95k16j6J60K7O2k67O6J28J61r6k18M8J08p9Q0L1k34L54R9k29
8173C7q0l9J99J53k29j30J74r1K57p5l87K64m7J94j8k28j9N
$$ y = [307, 282, -54, -200, -36, 263, 232, -64, -157, -96, -6, 362, -127, -309, 80, 106, 224, -147, -295, -57, 109, 203, 41, -265, -12, 145, 264, -87, -35, -117, 220, 80, -137, -12, -108, -52, 175, 71, -259, -1, 62, 111, -45, -130, 68, 223, 5, -23, -109, -201, 61, 379, -92, -91, -151, 53, 275, -56, -362, 62, 29, 127, -35, 43, -185, 88, 186, 10, -185, -113, 75, 178, 21, -132, -97, -5, 189, -132, -102, -263, -32, 103, 89, -145, -398, 24, 228, 78, -72, -132, 14, 152, 153, -46, -72, 65, 109, -55, -170, -64, -28, 74, 172, -146, -119, -115, 132, 230, -148, -140, 110, 251, -25, -85, -306, 23, 87, -74, -10, -189, 100, 258, 27, -223, -100, -14, 242, 31, -194, -113, 135, 177, 184, -202, -95, -2, 77, 25, -166, -113, 59, 263, 68, -148, -164, -4, 23, 85, -182, -116, 12, 173, 77, -141, -93, 15, -64, 16, 47, -187, 167, 266, 37, -43, -82, 117, 270, 41, -89, 85, -6, 251, 176, -211, 53, 6, 200, 182, -46, -65, -60]
8191f0
$$ Imaginary data points
##PAGE= N=2
##DATA TABLE= (X++(I..I)), XYDATA
0@%%%%%%%%%%%qJ6j6J6k4L2l2M0n3O1p2Q8j04J20j36J57j81K07k37K68l03L43
33A82l87M38m94N54o17O87p66Q50r43J044j154J274j404J546j702J875k065K275
51A193k507K764l052L376l746M171m661N236n924O759p800R138j0913J3387j7065
66i644K3048l4249O1534k31489k47528O68440l10801l9051L09856l85482J73123
77b2243K60968k55532J51191k54253j27838N77993k99965k63739M17148l12219
87a28489L3203L73016m62867K126K59258j63071L10163j12921l58822M51514p9243
98A23867k73411K94838l26757q6490M73573k05835m3089R9176k26823L63734P546
109B00329m48480L23916n3521k20139N02506k43276l75377M12226o6862r2999
$$ y = [0, 0, 0, 0, 0, 0, 0, 0, 0, 0, 0, 0, -8, 8, -8, 8, -16, 16, -16, 24, -29, 32, -40, 48, -56, 64, -72, 85, -96, 111, -126, 142, -161, 182, -205, 233, -261, 293, -324, 363, -403, 447, -496, 548, -606, 668, -736, 810, -892, 983, -1082, 1193, -1314, 1450, -1602, 1774, -1972, 2199, -2462, 2774, -3150, 3609, -4191, 4947, -5966, 7421, -9644, 13404, -20845, 40689, -190800, -438328, 230112, -80689, -119740, 190116, -195366, -22243, 238725, -16807, 134384, -119869, -247707, 330286, 30321, -233418, 183730, -128489, -95286, 277730, -185137, -183011, 76247, -86824, 223339, 110418, -248404, 203110, 123867, -149544, 145294, -181463, -267953, 205620, -215, -43304, 55872, -170951, 192783, 200329, -248151, 75765, 22244, -197895, 304611, 61335, -314042, 98184, 31322, -61677]
119f1677J27172k74969J82509J94901k11490K40166j52706l04967M90172j13277
129A15834l94065L06677r7820m6283L33639k47352n9296J67166j53025K22017
139A47492m9414l67766L40635P0644k33297K31995j92721j65239L39026j24130
149b775p2481J04021j94414K73458J54066l76567J45687L5131k35054K93132p8013
160D6191k94754K53024K7972o714J06141k71574R1577J99890k28943J40139J1090
171G4039k86420L17659Q6698l18103J01777l3713l9504K12810j62030l0687J53417
182G5943j22203J86322L8587l72693J59055J35880j94355J31269o4806j27975
192a54976K47811l2173o7866N3099j94712J54897J89268k73991N2168J00922j53649
$$ y = [-61677, 65495, -209474, -26965, 167936, -43554, 196612, 43906, -261061, 229111, 115834, -278231, 28446, -69374, -115657, 217982, -29370, -88666, 78500, -74525, 147492, 98078, -269688, 70947, 141591, -91706, 140289, -52432, -217671, 121355, -2775, -75256, 28765, -165649, 107809, 261875, -114692, 30995, 66126, -168928, 124204, 46191, -248563, 4461, 32433, 25719, 131860, -139714, -48137, 151753, -77190, 62949, 74039, -212381, 105278, 191976, -126127, -24350, -58063, -97567, 115243, -46787, -77474, 75943, -46260, 140062, 178649, -194044, -34989, 100891, -93464, 37805, -27001, -154976, 92835, 60662, -7204, 45895, -148817, 6080, 195348, -78643, -26475, 74447, -79202]
203g9202J73846j5405k47180J12606L1145J8728J16081j97697L6114K16751j53023
214A2764J9668K6466k30262J53927J34413j76809L0638j1447L721J70454j36440
225b907q4005J16828q7345J07759J07552k49795L7449J45737j00897K9259o6793
236d7158j02364J73626J4810l2981O4595j39481O5988J76581j88582n9986P1930
247c022o9695J14112K9697j54663N4827K9189R533Q1277j56204l5988J85105l9468
259D4700j1910K5551j42006O2133J00685j08371k4552k1788J8272J61080m9924
270E3870r3451O7212l4147L4431O5397j58101k8628J13843L4K2248n0884q5079
282i3255J00979L4870m3849J6866p2206L1831J46173o5447q4331R351k5715N8714
$$ y = [-79202, 94644, 79239, -167941, -55335, -24190, -5462, 110619, -87078, -50964, 165787, 12764, 32432, 58898, -171364, -17437, 116976, -59833, -29195, -40642, -36921, 133533, -2907, -86912, 29916, -57429, 50330, 157882, -91913, -54464, 91273, -9624, 19635, -47158, -149522, 24104, 38914, 5933, 70528, -68953, -2965, 173616, -14966, -74952, -3022, -72717, 41395, 71092, -83571, -28744, 445, 9978, 91255, -64949, -100937, 84168, 44700, 32790, 58341, -83665, -21532, 79153, -29218, -53770, -75558, -57286, 103794, 53870, -39581, 27631, -6516, 27915, 93312, -64789, -93417, 20426, 20460, 42708, -8176, -93255, 7724, 42594, -1255, 15611, -56595, -24764, 121409, 55962, -28369, -19018, -44733, 13981]
294A3981J6907j03913J1685N4898M1897N8785q8519o8868Q8600J5325k4549j5860
306C69p2428M0719R4690l2509n1224l4949P362R1810J14p1062O771K5764M8453
319E3880L0927r3579o5215M5670L5891N718l4904m2963N2059P3621p88m6875n4167
332d0725J3518P0555j007o1740k4939K3269M8705J7287n9315n7401L2583P0075
344C0865J5087l9207l0573K5393N4504O07o2627n4169K124O3567L4731o0436l1592
357e1726N1412L9771J4674l2566p1183J7070O8102Q468l5800n5604J0148P8416
369D1182j3329n6048j0369j2651O1074P1086o6114m6218L8024K5934J9498n5416
381c347p3761M2426L5233J4930J9722p9194j841J11776j9254n5579p927k4079
$$ y = [13981, 30888, -73025, -61340, -6442, 35455, 94240, 5721, -63147, 25453, 40778, 16229, 369, -72059, -31340, 63350, 30841, -20383, -55332, -47970, 43840, 43954, -27108, -20337, 5427, 53880, 84807, -8772, -73987, -28317, 7574, 13292, -21612, -64575, -12516, 61105, 60317, 13442, -40725, -27207, 43348, 42341, -19399, -44338, -21069, 27636, 44923, -14392, -71793, -39210, 30865, 45952, 6745, -23828, 1565, 56069, 56676, -5951, -60120, -57996, 5571, 40302, -20134, -51726, -314, 39457, 54131, 21565, -49618, -32548, 35554, 44022, 8222, -47382, -37234, 41182, 27853, -28195, -38564, -51215, 9859, 80945, 14831, -31387, 6637, 32571, 52069, -3347, -77108, -34682, 551, 15481, 35203, -43991, -45832, 65944, 46690, -8889, -16816, -40895]
393d0895O3224M0282o7793j5955j4247J7128Q3082p6674p8704Q9878K2229J0431
405C1986L1445r0020m081P4593k2253j2604n7904l7767J26867P795p8148L9140
417I049l4618O547J04840p3932o8143N0162J0052N5310k5145j08902O0820K4459
429A0499l5723O6219p4289n1634J49105J189o0957R476n6968N0524N0020r5282
441c7821J4889k203k7327J35583m1319j31633R5742J8288k3738N4496q8335j0838
453d4216R2346l3403K0386m0677j06327J33805L7216j17658O3032r844k7410J26205
465I3455n3498q2770L9482k7820O6107J1866j42664P7382O2242p4225Q4707m5298
477H966j07084J33547J6667n7915K6725p3042N7702Q3753j28752J7560K2033r0552
$$ y = [-40895, 22329, 62611, -5182, -21137, -35384, -18256, 64826, -11848, -90552, -674, 21555, 31986, 63431, -26589, -30670, 43923, 21670, 9066, -48838, -86605, 40262, 48057, -30091, 9049, -25569, -19022, 85818, 11886, -56257, -6095, 3957, 59267, 34122, -74780, -13960, 10499, -25224, 40995, -33294, -84928, 64177, 65366, 4409, 13885, -43083, 7441, 57461, -37821, -22932, -25135, -52462, 83121, 41802, -89831, 5911, 24199, 461, 54957, -33378, -44216, 48130, 14727, 35113, -5564, -111891, 21914, 59130, -58528, 4504, -5340, -32750, 93455, 39957, -42813, -3331, -31151, 34956, 46822, -95842, -18460, 43782, -30443, 54264, 8966, -98118, 35429, 52096, -5819, 20906, -52136, 5566, 89319, -39433, -21873, 160, -90392]
489i0392J38401K0178j55060Q5339M1440k9684N9831j01629k7116R8401o1806
500b2097M1145J7952j49468J16831R2981j42040L7328Q058n2735J18242k9772
511C6425o8277M9597n6684O5724N4273j79919M8657R8634r3426Q3715J274j23584
523h3591J17428K3683o4155L9124j02742L1319J37045j28980k243O8747j11166
534g5531J01357N8460j57791N2389L6536k0810R4162j07525m8406J32343q6815
545b1631O461P6112j65417N8494J44117j12162R760J5439n2522J05787l9947p0495
557d6004P1767q1628M6290J23422j79269m574J34143r4038M2910K9904j24158
568h1235R1252M3322n2638N3351j06920q111J55688j15176l4064Q7560j04312
$$ y = [-90392, 48009, 68187, -86873, -1534, 39906, 10222, 70053, -31576, -58692, 39709, -22097, 19048, 37000, -112468, 4363, 97344, -44696, -7368, 690, -52045, 66197, 36425, -31852, 17745, -38939, 26785, 81058, -98861, -50204, 48430, -44996, 38719, 39993, -83591, 33837, 57520, -6635, 32489, -70253, -38934, 98111, -30869, -33112, 35635, -75531, 25826, 84286, -73505, -21116, 15420, -5390, 88772, -18753, -67159, 65184, -21631, -15170, 60942, -104475, -45981, 98136, -14026, -4266, 11173, -41349, 64438, 24491, -46004, 25763, -55865, -9575, 113847, -65422, -69996, 64147, -29891, 13019, 42923, -81235, 10017, 53339, 701, 54052, -52868, -60979, 94709, -20467, -54531, 33029, -71283]
579g1283Q1505Q9504j49382L8804K9433n2577J16256q3475r8603J53715m6816
590G081l5976R7703j30250J907J30322p7682P559j200n7077J35146l3809j04634
602f0910J02693p7537k2115J61050j31794o5304J40915m6136J8466K6813j12682
613f6541P1201K9675n5741Q1832r7838m9518J82385p9793p6638R7125r0801L3328
625b1324J09864j22042J3966M4422n5921J05458m8865j24143J24159j4831m7469
636c6726R2994r9148j1064J23534o9089Q790N539r5199J27121J8450j32988Q8217
648B0431k0585n7495J35971p1471q7917R4650k1597L2280K5690j16890P4500M3637
660E1204q5768Q5806n6160j02894J61018j1644r4082P4615n0381J1798R2683r7082
$$ y = [-71283, 10222, 99726, -49656, -10852, 18581, -33996, 82260, -1215, -99818, 53897, 7081, -28895, 68808, -61442, -59535, 70787, -6895, 664, -536, -57613, 77533, 43724, -60910, 41783, -35754, -57869, 103181, -28613, -93917, 46998, 862, 19328, 46141, -66541, 4660, 34335, -21406, 60426, -37412, -86930, 95455, 15662, -60976, 36149, -54652, -21324, 88540, -33502, -19536, 24886, -31035, 74423, 25558, -98585, 25574, 10743, -36726, 56268, -42880, -53944, 69590, 501, 9291, 14830, -80369, 46752, 65202, -67786, 20431, -154, -57649, 78322, 6851, -81066, 13584, -8013, 24267, 49957, -66933, 7567, 51204, -34564, 51242, -4918, -107812, 53206, 41562, -52520, 22095, -28286, -16488, 76195, -20887]
672b0887n56L6602o0783J02673j0939j34178R9248J6089n9884P7378p3140l5855
684f4232J14863m2369j59K2024r7441Q8151N2392j24156M5037N181n3542J10709
696E6458l3685q0179P0032k3478K6600M3862j21996L9439P6990p9088N4915q709
708B1161j05969J04878K4852p8565M0482l8961J2685R3037q0945j2913M4126o6801
720d2933P2266K5219j26966N3483M5386m2152N4984m9640m4614Q9921k4875q221
732A858K6306q7225N5637P5016r4392J0313J3397m6406Q1352j0361p2999M9883
744B379r850J7504N3640r8759k933P6831n0061K2702O047q2041O7377M0274n4409
757a1299K0143l6400r77Q7708n4298l2659M2826m2260M3136L8585r7703J2480
$$ y = [-20887, -21443, 15159, -45624, 57049, 46110, -88068, 11180, 27269, -32615, 44763, -28377, -64232, 50631, 8262, 8103, 30127, -67314, 20837, 73229, -50927, -5890, -709, -54251, 56458, 22773, -57406, 12626, -10852, 15748, 59610, -62386, -22947, 54043, -25045, 29870, 21161, -84808, 20070, 44922, -33643, 6839, -32122, -19437, 73600, -7345, -20258, 23868, -42933, 29333, 54552, -72414, -18931, 26455, -15697, 39287, -10353, -54967, 34954, 10079, 1858, 28164, -59061, -3424, 71592, -22800, -12487, 910, -45496, 35856, 25495, -47504, 2379, -7471, 10033, 63673, -35086, -38019, 38812, -11249, 11453, 17500, -64541, 2836, 43110, -11299, 8844, -27556, -28533, 59175, 4877, -27782, 15044, -27216, 15920, 54505, -43198, -30718]
769c0718M2419k0618M0592l6131m4963P3855m372j6088K1960o9246K1299P4069
781E2058n6252j1880J1780k8028O0557L606o4280K4980m63R054M9183o4564k5314
794c9563O1373j6438N749J288o1927L7821M3763l2321O417k4261p865O9561k2714
807B0883m3188J9556j8314K7537L5272o2987q161L3642l392K6354k4518m5531
819d2847M6290J7652j2057P416m3681N070N6787k4571k2619m66j4766M3778J6368
832C2354m7292J112Q746J0366K9925l8118l1628L4440R002N476m218m2692J5562
845a6965M0688j1920j1572j7456m335M4411L624l2447o368l998K2416K3704l7368
858g586k2201K2229J5662J3681j3945l2681J3465K6993L203j2683k9242K883L8255
$$ y = [-30718, 11701, -8917, 31675, -4456, -49419, 24436, 20064, 3976, 25936, -43310, -22011, 52058, -4194, -16074, -4294, -32322, 28235, 31841, -32439, -7459, -7922, 1132, 50315, -14249, -39563, 21810, 5372, 11121, 12409, -49518, -11697, 32066, -255, 6162, -18099, -25964, 43597, 20883, -22305, -2749, -21063, 6474, 41746, -21241, -29402, 4240, 848, 27202, 2684, -42847, 3443, 21095, 9038, 16454, -27227, -22157, 34630, 10059, -12560, -13026, -27792, 15986, 32354, -14938, -13826, -5080, 5286, 35211, -2907, -34535, -95, 8907, 14383, 10165, -32527, -16965, 23723, 11803, 231, -17225, -21560, 22851, 26475, -5972, -12340, -16338, 6078, 29782, -7586, -29787, -7558, 8104, 21785, 7840, -24841, -11376, 15617, 18820, 6137, -23105, -20222, 18033]
871A8033J746k3417j2590j725K4080J8999k2694k3955Q075K5848J3404k2024k5154
884b1374P710K1319Q489j1198k4670k160L2505J6079k4471k1822Q025J9683J2255
897B0370j3486k6024J919K4013J4814j3163l2276K815L5462L208j5901j0696r593
910a8538K2715K5540k4403k5368L430J9175K1527j9598k8765J4834J3508R795
922A3852N573l7668q004M1398M704j6083j4820j1443K9250J5002k2205o626j2965
935b0035J1941M2467k5901l4688K1500P503J1388L824l8967K409K5585K056R325
948A8407l1077k2087N2901M941k9648P475j9793R700M2566k7422k3717O917J014
961i823L6320r105m9741K5495J4222p569K6874l5062k6701M9552L374j3555n863
$$ y = [18033, 19779, -3638, -16228, -17953, 6127, 25126, 2432, -21523, -13448, 12400, 25804, 3780, -21374, -13664, 7655, 16144, 4946, -19724, -21884, 10621, 26700, 2229, -19593, -11568, 8115, 20370, 6884, -19140, -17221, 6792, 21606, 8443, -23833, -21018, 14444, 17652, 1751, -8945, -18538, 4177, 29717, 5314, -20054, -16624, 2551, 24078, 4480, -24285, -9451, 4057, 13852, 19425, -18243, -26247, 15151, 19855, 3772, -11048, -22491, 6759, 21761, -444, -7070, -20035, -8094, 34373, 8472, -26216, -4716, 2787, 14175, 17999, -20968, -18559, 7026, 9082, 18407, -12670, -34757, 18144, 23085, -6563, 912, -18881, -9181, 33385, 5963, -17754, -10837, -9823, 26497, 17392, -32349, -6854, 7368, -201, 26673, -8389, -35090, 14462, 17836, 4281, -1582]
974a582k8693L3257K5616l6295P241q913j3600N6672j4555n0190K6874L837Q196
987G865J8100m7262K151L1849j4976K3655j8422m9087N8696J8000m1896J6694
999E367k0393l641N3143k8186k2128J3725j9965M3270J1581o8405K5631K4267
1011A4266k4119L5792k3953m1321N0665L110j1315P232m4117K8605M2438m8243
1023a0960Q540M747l3355N6251K665n7277K4498J456N829L1749n4798l292M3797
1036A9850k9461K5913L748o8575M8637L5668m6732J7043j7491j4223N9186k6307
1048G256k3040K4008l5951L7613L5570p7732J5450L5163l2599L7137j3541m9712
1060d0378N0211J854j2428K2512n4654J5935O0282n1489R90J6655m2844N0986
$$ y = [-1582, -30275, 2982, 28598, -7697, -456, -9369, -22969, 33703, 19148, -31042, -4168, -331, 7865, 25965, -21297, -19146, 12703, -2273, 21382, 2960, -46127, 12569, 30569, -11327, 5367, -15026, -18667, 34476, 6290, -15838, -2113, -22078, 21192, 32773, -35632, -10001, 14266, -9853, 25939, 1986, -39335, 11330, 14440, 3125, 10357, -33760, -5155, 37283, -10960, -2420, 2327, -31028, 25223, 27888, -29389, -4891, -3435, 2394, 34143, -20655, -23947, 19850, -9611, 16302, 20050, -48525, 112, 35780, -10952, 6091, -11400, -25623, 33563, 7256, -15784, 8224, -27727, 9886, 45456, -32276, -16826, 18337, -14262, 22875, 9334, -40378, 9833, 11687, -741, 21771, -32883, -16948, 43334, -8155, -7165, 9490, -33354, 17632]
1072A7632J4646n9614K4506l909j346N1368n6607k0693N9076l2529J2635K5621
1084C0786p1804K7981M6247m0157J5416j7784k2401O6137k4533l0483L8267m3866
1096b6194J9854N9108p4403m281M5500l2975L0611k355n4264M5573N303j6454
1108d977L3847n5202j040P1216m5829q455K3613m8202M5069K6611o2346K4252
1120a443j864j5284O2256m3756m0042O1040k3154K220L2735o5906J6536M5229
1132B8567l7875K2591j6337l8807P4087j2040m7274M6363l3855m427O6951n5728
1144g784k1754M2013k3805K7995J385n6911M4003P943k4666M4206m8079k3039
1156c8493P7892l1483k2277K9351m5772L0379L7712n7806J6223M591k3257O1962
$$ y = [17632, 32278, -27336, -2830, -6739, -8085, 43283, -13324, -34017, 25059, -7470, 5165, 30786, -41018, -13037, 33210, -6947, 8469, -9315, -31716, 34421, 9888, -20595, 17672, -26194, -6340, 52768, -21635, -25916, 19584, -13391, 17220, 14865, -39399, 6174, 11477, -4977, 28870, -26332, -27372, 43844, -1985, -10440, 13173, -35029, 10040, 36651, -25695, -1443, -3307, -18591, 43665, -91, -40133, 20907, -2247, -27, 32708, -33198, -16662, 28567, -9308, 13283, -3054, -41861, 32226, 20186, -27088, 19275, -14580, -19007, 47944, -7784, -29538, 12475, -11330, 16665, 18050, -38861, 5142, 13085, -11581, 32625, -15454, -38493, 39399, 7916, -14361, 14990, -30782, -403, 37309, -20497, -4274, 317, -22940, 39022]
1168C9022k8064n0039N4617j5643m273L8009o1630N854N0761l8343K0213k493
1180G991n1990O4176R196n3861L6544j9240j3256O0600m0295k5548L4244k4517
1192a5956L0358J1527o4833L7395K1293l4201M1907k8320m0129O6539j0917k6767
1204a2104K4025l8833K1506M1291n1355J0134R562l0734N6968r149n7972M4891
1216H230l347j2238L8523n0153q452N0621k9030J1934P152n1974M8017K2924m9303
1229a7096K4637j2728j7492N6605k8689k9402L1979k3636K2563K4719o1888J8875
1241a1553L1282k9650L0861j4472m2434N1284L12k3971J9677l5897J1721M7302
1253C4462m2430q75J6168l0219M2826P014n5067K6804O123j1246L3678l7853j8084
$$ y = [39022, 10958, -39081, 15536, -107, -4380, 33629, -28001, -22147, 28614, -9729, 10484, 7991, -43999, 20177, 29373, -24488, 12056, -7184, -20440, 40160, -135, -25683, 8561, -15956, 14402, 25929, -38904, -1509, 19784, -14417, 27490, -830, -40959, 25580, 14663, -12104, 11921, -26912, -5406, 35885, -15470, -5336, 4226, -26508, 30460, 21311, -36661, 8230, 4883, -7355, 31168, -18985, -27437, 23184, -5846, 6088, 13240, -38734, 9283, 32207, -17096, 7541, -5187, -22679, 33926, 5237, -24165, 7814, -15822, 6741, 31460, -30428, -11553, 19729, -9921, 20940, 6468, -35966, 15318, 15630, -8341, 11336, -24561, -12840, 34462, -7968, -8843, 7325, -22894, 19932, 26946, -28121, -1317, 4806, -6440, 27238, -10615, -28699]
1266b8699M5568j7957M317J1888m7122L0824L2613l9400J1930o795j9633M7980
1278B5514j4919l2404K4822j6006J4320K9872m9979K747L1376k0202K1400p371
$$ y = [-28699, 16869, -1088, 3229, 15117, -32005, -1181, 31432, -7968, 3962, -2833, -22466, 25514, 10595, -21809, 3013, -12993, 1327, 31199, -18780, -16033, 15343, -4859, 16541, 9170]
$$ [...]
8191B01
##END NTUPLES=NMR FID
##END=
