##TITLE=1H_LR-757-CR4
 CCl4
 8 sc, 
 18.11.2022
##JCAMPDX= 6.0         $$ Bruker NMR JCAMP-DX V2.0
##DATA TYPE= NMR FID
##DATA CLASS= NTUPLES
##ORIGIN= UXNMR, Bruker Analytische Messtechnik GmbH
##OWNER= root
$$ XWIN-NMR		Version 3.5
$$ Fri Nov 18 17:06:06 2022 Russian Standard Time (UT+4h)  she@DPX200
##.OBSERVE FREQUENCY= 200.1313499994
##.OBSERVE NUCLEUS= ^1H
##.DELAY= (6, 6)
##.ACQUISITION MODE= SIMULTANEOUS
##.ACQUISITION SCHEME= undefined
##.AVERAGES= 8
##.DIGITISER RES= 18
##SPECTROMETER/DATA SYSTEM= spect
##.PULSE SEQUENCE= zg30
##.SOLVENT NAME= CDCl3
##.SHIFT REFERENCE= (INTERNAL, CDCl3, 0, 15.7039)
##AUDIT TRAIL= $$ (NUMBER, WHEN, WHO, WHERE, WHAT)
$$ ##TITLE= Audit trail, XWIN-NMR		Version 3.5
$$ ##JCAMPDX= 5.01
$$ ##ORIGIN= Bruker BioSpin GmbH
$$ ##OWNER= she
$$ F:/spectra/data/she/nmr/H-F/1/audita.txt
$$ ##AUDIT TRAIL=  $$ (NUMBER, WHEN, WHO, WHERE, WHAT)
(   1,<2022-11-18 17:04:19.82 +0400>,<she>,<DPX200>,
      <created by zg, POWCHK disabled, PULCHK disabled
       configuration hash MD5:
       00 E9 B6 7A A2 85 ED C7 34 08 36 98 17 FE 4E 26
       data hash MD5: 16K
       0A AC 4C 21 60 7E AE 98 ED 50 73 42 52 4F E0 B9>)
$$ ##END=
$$ 
$$ hash MD5
$$ 35 E6 D1 CB C4 D3 76 AA C3 C1 D2 07 31 38 2E A8
##$RELAX= 
##$RELAX= 
##$RELAX= 
##$RELAX= 
##$RELAX= 
##$RELAX= 
$$ Bruker specific parameters
$$ --------------------------
##$DU= <F:/spectra>
##$EXPNO= 1
##$NAME= <H-F>
##$PROCNO= 1
##$TYPE= <nmr>
##$USER= <she>
##$AMP= (0..31)
100 100 100 100 100 100 100 100 100 100 100 100 100 100 100 100 100 100 
100 100 100 100 100 100 100 100 100 100 100 100 100 100 
##$AQSEQ= 0
##$AQ_mod= 1
##$AUNM= <au_zg>
##$AUTOPOS= <>
##$BF1= 200.13
##$BF2= 200.13
##$BF3= 200.13
##$BF4= 200.13
##$BF5= 200.13
##$BF6= 200.13
##$BF7= 200.13
##$BF8= 200.13
##$BYTORDA= 1
##$CFDGTYP= 0
##$CFRGTYP= 5
##$CHEMSTR= <none>
##$CNST= (0..31)
1 1 145 1 1 1 1 1 1 1 1 1 1 1 1 1 1 1 1 1 1 1 1 1 1 1 1 1 1 1 1 1 
##$CPDPRG= <>
##$CPDPRG1= <>
##$CPDPRG2= <>
##$CPDPRG3= <>
##$CPDPRG4= <mlev>
##$CPDPRG5= <mlev>
##$CPDPRG6= <mlev>
##$CPDPRG7= <mlev>
##$CPDPRG8= <mlev>
##$CPDPRGB= <>
##$CPDPRGT= <>
##$D= (0..31)
0 1.2 0 0 0 0 0 0 0 0.06 0 0.03 0 0 0 0 0.0002 0 0 0 0 0 0 0 0 0 0 0 0 
0 0 0 
##$DATE= 1668776659
##$DBL= (0..7)
120 120 120 120 120 120 120 120 
##$DBP= (0..7)
150 150 150 150 150 150 150 150 
##$DBP07= 0
##$DBPNAM0= <>
##$DBPNAM1= <>
##$DBPNAM2= <>
##$DBPNAM3= <>
##$DBPNAM4= <>
##$DBPNAM5= <>
##$DBPNAM6= <>
##$DBPNAM7= <>
##$DBPOAL= (0..7)
0.5 0.5 0.5 0.5 0.5 0.5 0.5 0.5 
##$DBPOFFS= (0..7)
0 0 0 0 0 0 0 0 
##$DE= 6
##$DECBNUC= <off>
##$DECIM= 32
##$DECNUC= <off>
##$DECSTAT= 4
##$DIGMOD= 1
##$DIGTYP= 9
##$DL= (0..7)
0 120 120 120 120 120 120 120 
##$DP= (0..7)
150 150 150 150 150 150 150 150 
##$DP07= 0
##$DPNAME0= <>
##$DPNAME1= <>
##$DPNAME2= <>
##$DPNAME3= <>
##$DPNAME4= <>
##$DPNAME5= <>
##$DPNAME6= <>
##$DPNAME7= <>
##$DPOAL= (0..7)
0.5 0.5 0.5 0.5 0.5 0.5 0.5 0.5 
##$DPOFFS= (0..7)
0 0 0 0 0 0 0 0 
##$DQDMODE= 0
##$DR= 18
##$DS= 0
##$DSLIST= <SSSSSSSSSSSSSSS>
$$ [...]
##$SUBNAM2= <"">
##$SUBNAM3= <"">
##$SUBNAM4= <"">
##$SUBNAM5= <"">
##$SUBNAM6= <"">
##$SUBNAM7= <"">
##$SUBNAM8= <"">
##$SUBNAM9= <"">
##$SW= 18.0517283424941
##$SWIBOX= (0..15)
0 0 2 0 0 0 0 0 0 0 0 0 0 0 0 0 
##$SW_h= 3612.71676300578
##$TD= 16384
##$TD0= 1
##$TE= 0
##$TE2= 300
##$TE3= 300
##$TEG= 300
##$TL= (0..7)
0 120 120 120 120 120 120 120 
##$TP= (0..7)
150 150 150 150 150 150 150 150 
##$TP07= 0
##$TPNAME0= <>
##$TPNAME1= <>
##$TPNAME2= <>
##$TPNAME3= <>
##$TPNAME4= <>
##$TPNAME5= <>
##$TPNAME6= <>
##$TPNAME7= <>
##$TPOAL= (0..7)
0.5 0.5 0.5 0.5 0.5 0.5 0.5 0.5 
##$TPOFFS= (0..7)
0 0 0 0 0 0 0 0 
##$TUNHIN= 0
##$TUNHOUT= 0
##$TUNXOUT= 0
##$USERA1= <user>
##$USERA2= <user>
##$USERA3= <user>
##$USERA4= <user>
##$USERA5= <user>
##$V9= 5
##$VALIST= <valist>
##$VCLIST= <CCCCCCCCCCCCCCC>
##$VD= 0
##$VDLIST= <DDDDDDDDDDDDDDD>
##$VPLIST= <PPPPPPPPPPPPPPP>
##$VTLIST= <TTTTTTTTTTTTTTT>
##$WBST= 1024
##$WBSW= 4
##$XGAIN= (0..3)
0 0 0 0 
##$XL= 0
##$YL= 0
##$YMAX_a= 329462
##$YMIN_a= -313257
##$ZGOPTNS= <>
##$ZL1= 120
##$ZL2= 120
##$ZL3= 120
##$ZL4= 120
##$ABSF1= 10
##$ABSF2= 0
##$ABSG= 5
##$ABSL= 3
##$ALPHA= 0
##$AQORDER= 0
##$ASSFAC= 0
##$ASSFACI= 0
##$ASSFACX= 0
##$ASSWID= 0
##$AUNMP= <proc_1d>
##$AZFE= 0.1
##$AZFW= 0.1
##$BCFW= 1
##$BC_mod= 2
##$BYTORDP= 1
##$COROFFS= 0
##$CY= 11.3945322036743
##$DATMOD= 1
##$DC= 2
##$DFILT= <>
##$DTYPP= 0
##$F1P= 2.36226072786647
##$F2P= -0.459571619588291
##$FCOR= 0.5
##$FTSIZE= 0
##$FT_mod= 4
##$GAMMA= 1
##$GB= 0.15
##$INTBC= 1
##$INTSCL= 1
##$ISEN= 128
##$LB= 0.24
##$LEV0= 0
##$LPBIN= 0
##$MAXI= 10000
##$MC2= 0
##$MEAN= 0
##$ME_mod= 0
##$MI= 1.114404
##$NCOEF= 0
##$NC_proc= 0
##$NLEV= 6
##$NOISF1= 3.799351
##$NOISF2= 2.8
##$NSP= 1
##$NTH_PI= 0
##$NZP= 0
##$OFFSET= 15.70392
##$PC= 1
##$PHC0= -18038.61
##$PHC1= 22.2007
##$PH_mod= 1
##$PKNL= yes
##$PPARMOD= 0
##$PSCAL= 0
##$PSIGN= 0
##$REVERSE= no
##$SF= 200.130013532006
##$SI= 16384
##$SIGF1= 3
##$SIGF2= 2
##$SINO= 400
##$SIOLD= 16384
##$SREGLST= <1H.CDCl3>
##$SSB= 0
##$STSI= 0
##$STSR= 0
##$SW_p= 3612.71676300578
##$SYMM= 0
##$S_DEV= 0
##$TDeff= 0
##$TDoff= 0
##$TI= <>
##$TILT= no
##$TM1= 0
##$TM2= 0
##$TOPLEV= 0
##$USERP1= <user>
##$USERP2= <user>
##$USERP3= <user>
##$USERP4= <user>
##$USERP5= <user>
##$WDW= 1
##$XDIM= 8192
##$YMAX_p= 0
##$YMIN_p= 0
$$ End of Bruker specific parameters
$$ ---------------------------------
##NTUPLES= NMR FID
##VAR_NAME=  TIME,          FID/REAL,        FID/IMAG
##SYMBOL=    X,             R,               I
##VAR_TYPE=  INDEPENDENT,   DEPENDENT,       DEPENDENT
##VAR_FORM=  AFFN,          ASDF,            ASDF
##VAR_DIM=   8192,          8192,            8192
##UNITS=     SECONDS,       ARBITRARY UNITS, ARBITRARY UNITS
##FACTOR=    0.0002768,     1,               1
##FIRST=     0,             0,               0
##LAST=      2.2672688,     0,               0
##MIN=       0,             -313257,         0
##MAX=       2.2672688,     329462,          0
$$ Real data points
##PAGE= N=1
##DATA TABLE= (X++(R..R)), XYDATA
0@%%%%%%%%kJ0j6J6k4L2m0N6p2Q8j04J28j60J92k30K76l26L82m46N18n98O89p91
$$ 0 0 0 0 0 0 0 0 0 -2 8 -8 8 -16 16 -24 32 -40 48 -56 72 -88 104 -126 150 -176 206 -240 278 -320 369 -422
31d22R06j034J175j333J506j696J907k138K388k662K965l295L654m048M477m945
$$ -422 484 -550 625 -708 798 -898 1009 -1129 1259 -1403 1562 -1733 1921 -2127 2350 -2595
47b595N455o015O630p301Q038q851R752j0754J1874j3133J4562j6196J8086k0307
$$ -2595 2860 -3155 3475 -3826 4212 -4639 5113 -5641 6233 -6900 7662 -8534 9552 -10755
61a0755K2954k6175L0196l5378M2356n2350O8122r8261K48632m60578J92302K45620
$$ -10755 12199 -13976 16220 -19158 23198 -29152 38970 -59291 189341 -271237 -78935 166685
73A66685j96628J13904l97218N96312l04594j07654J53853k1069J58008l84397
$$ 166685 -29943 83961 -313257 283055 -21539 -129193 24660 3591 161599 -222798
83b22798K62278Q3372j38987o5144o345L73923m87285J46115J55962j06563L4812
$$ -222798 39480 122852 -16135 -81279 -87624 286299 -200986 -54871 101091 -5472 29340
94B9340k18756L90080k11845q9564J47905n4880J46904l46372K86755Q68j43273
$$ 29340 -189416 200664 -11181 -100745 47160 -7720 139184 -207188 79567 80435 -62838
105f2838P6870j30706L36472l37508L5557J98100j50813Q7152k24445L33875j51114
$$ -62838 14032 -116674 219798 -117710 -82153 115947 -34866 52286 -172159 161716 10602
116A0602j40878K23365j35235J41293k49023K16226K198j96773K40988k37851
$$ 10602 -130276 93089 -42146 99147 -149876 66350 68548 -128225 112763 -125088
126a25088K43955j52389o9834K52366k36622J42090j24312J34829j5363j82512
$$ -125088 118867 -33522 -103356 149010 -87612 54478 -69834 64995 49632 -132880
136a32880K46056j49150N5327o6567O2675L5344j49509J82525j58534J36901n9194
$$ -132880 113176 -35974 19353 -47214 15461 50805 -98704 83821 -74713 62188 2994
147B994r2577K05168j72445Q7933q3649Q5324J9268j70805K00246j18665O5071
$$ 2994 -89583 115585 -56860 31073 -52576 32748 52016 -118789 81457 -37208 27863
158B7863o4176J6541J17751k06590J72759q6152M5478P355j35676K23537j61682
$$ 27863 -36313 -19772 97979 -108611 64148 -22004 23474 30829 -104847 118690 -42992
169d2992L3398P357j1703R0959j80643J39722j4533k4734k0425j602J26030j84777
$$ -42992 -9594 -2237 -13940 77019 -103624 36098 21565 -3169 -23594 -25196 100834 -83943
181h3943R3956P141j5935K6740j22185J70543p7011l0302K4147n442R0234j59424
$$ -83943 10013 17154 1219 27959 -94226 76317 -694 -30996 -6849 -12291 77943 -81481
193h1481Q1364M9747m7080l1331J7J29139j55766L0682N5072k5375J8612j11581
$$ -81481 -117 49630 2550 -28781 -28764 100375 -55391 -24709 30363 4988 23600 -87981
205h7981J45569l0896p5416M9988n505P0150j26061L9810Q3707o9702k4695M631
$$ -87981 57588 26692 -48724 1264 -4241 65909 -60152 -20342 63365 -6337 -31032 -26401
217b6401J00688j06148j4093P8844k9998R964p2286R3205K021p8344N0190o513
$$ -26401 74287 -31861 -45954 32890 2892 12856 -59430 33775 35796 -42548 7642 1129
229A129L9292p0984R490O4245m9104p009j1957O8008m9680l1436O6721l2725J7490
$$ 1129 40421 -30563 -21073 43172 -5932 -12941 -24898 43110 -6570 -38006 28715 -4010 13480
242A3480m0657L7037J9738o3774M8511j9900J2808o295k5039L9794j6626k826
$$ 13480 -27177 9860 29598 -34176 14335 -5565 7243 948 -24091 15703 -923 -3749
254c749j0950K5627l717k3568L2232k4207J8265p589r440J9906k5183K6749k2624
$$ -3749 -14699 10928 7211 -16357 15875 -8332 9933 2344 -7096 12810 -12373 14376 -8248
267h248j605K8849l0866O061P256R644j3665j0298K5164n684o853j3597K1654
$$ -8248 -9853 18996 -11870 -5809 1447 11091 -2574 -12872 12292 6608 -245 -13842 7812
280G812N162l0567J5338K378P971j9489n608M2573k7954j7255K7721J0570k1673
$$ 7812 12974 -17593 -2255 123 8094 -11395 -17003 25570 -2384 -19639 8082 18652 -3021
293c021j5086L2867j224k4247l5J9740L503l2442J7544J5284j2960p589J606K8309
$$ -3021 -18107 14760 13536 -10711 -10746 8994 12497 -19945 -2401 12883 -77 -7666 -6060 22249
307B2249k4148j6501L1560k608j8855n777K4869k006k9097J5741J6955j2439j8456
$$ 22249 -1899 -18400 13160 10552 -8303 -14080 10789 8783 -20314 -4573 12382 -57 -18513
320a8513K4466J0630k7666O581J0916P509k1435p371L5280j4985k3692J4289K0699
$$ -18513 5953 16583 -11083 -4502 6414 13923 -7512 -14883 20397 5412 -18280 -3991 16708
333A6708j3988k6309K8787J6778l0013j0783L3868N131l9403Q533K8577o863l4051
$$ 16708 2720 -23589 5198 21976 -8037 -18820 15048 20179 -19224 -10691 17886 11023 -23028
346b3028R757M1155k9817k6741K9864K2545k5337k7947L9240K2740m7072j1139
$$ -23028 -13271 27884 -1933 -28674 1190 23735 -1602 -29549 9691 32431 -14641 -25780
358b5780M8451J203m8748N976M5618j1664m8152K1396M5662k8813l7439L0093
$$ -25780 22671 23874 -24874 -18898 26720 15056 -33096 -11700 33962 5149 -32290 -2197
370b197M0599l9007l4854M4378K6986m7448k6140N6851R620n5727j794N2661K681
$$ -2197 38402 -605 -35459 8919 35905 -11543 -37683 19168 28788 -26939 -28733 23928 26609
383B6609o3153J7087N9657k7560m9442K8712N2609m3949l9594M1997L5433m3281
$$ 26609 -36544 -19457 40200 12640 -36802 -8090 44519 570 -39024 2973 38406 -4875
395d875m4534P1679J3434o2635j3M8781J7440p7116J4277O9673l5323m5065J8062
$$ -4875 -49409 22270 35704 -26931 -26944 21837 39277 -37839 -23562 46111 10788 -34277 -16215
408a6215O1281m2554m9618N2258K8986l7176m7077P1260J6572o6598R176L3821
$$ -16215 45066 2512 -47106 5152 34138 -3038 -50115 21145 37717 -28881 -19705 14116
420A4116K6035p3985N778P7142m6538l2108J6064N1985l4270n0823O1077J4271
$$ 14116 40151 -33834 -28056 49086 2548 -29560 -13496 38489 4219 -46604 14473 28744
432B8744l2877l3135N6550J8063o8563J8496L0127J0007o0163J1068O5497n1192
$$ 28744 -4133 -37268 19282 37345 -31218 -12722 17405 27412 -32751 -21683 43814 -7378
444g378j9386J8242M5193m1389l7278O8728j0171k0831k8493N5069J1848q1718
$$ -7378 -26764 -8522 36671 -4718 -41996 26732 16561 -4270 -32763 22306 34154 -47564
456d7564N4782M780k16l3774j918P7997p5360j129L4698J0227k3127l9545P6334
$$ -47564 7218 11998 11782 -21992 -23910 54087 -21273 -22402 12296 22523 -604 -40149 36185
469C6185k3868l0690K276L3159J0446p8669O0988R288k0932j6346M01P1792q0657
$$ 36185 12317 -18373 -16097 17062 27508 -51161 9827 19115 -1817 -18163 -17762 54030 -26627
482b6627N461L9769m058j2273m6797Q2242k6208l5999J5400J7930K7146q9843
$$ -26627 -21166 18603 14545 2272 -44525 37717 11509 -24490 -9090 8840 35986 -53857
494e3857O0930K5029m4871P607j6214P2033o3512j9921N7646j4493p197m5644
$$ -53857 7073 32102 -12769 -5162 -21376 50657 -12855 -32776 24870 10377 3180 -42464
506d2464P0072q071n0948K3761J6011K5410q0630M6943L5480m6928P411k0725
$$ -42464 27608 19537 -31411 -7650 8361 33771 -46859 84 35564 -11364 -3953 -24678
518b4678P1094n1899l3577O0105j2790p64n0355O3417N905n1723J9786N634M4356
$$ -24678 46416 -5483 -39060 21045 8255 7491 -42864 20553 26458 -25265 -5479 155 44511
531D4511q0677K3489M8989m3803Q775l8327P7459l3655n2302O5138j5168J2119
$$ 44511 -36166 -12677 36312 -7491 1284 -37043 40416 6761 -45541 19597 4429 16548
543A6548n7615N2525K5374o8221L2794r354M7725o4099p219P8607o1734J1025
$$ 16548 -41067 11458 36832 -31389 1405 -7949 39776 -24323 -31542 47065 -14669 -3644
555c644j8263M7274p999o5763P3261j3678j0723k1404K6364K4978n3316J9441
$$ -3644 -21907 25367 17368 -48395 24866 11188 465 -20939 5425 30403 -22913 -3472
567c472K96L4492n3107l089O4870n7516J8108j6707L3859m942n2322O6935k9065
$$ -3472 -3176 31316 -21791 -24880 39990 -17526 582 -16125 17734 12792 -39530 27405 -1660
580a660O356j9301J2673L4763o6001M0021q366J4481k2367j7290P3617p4183K4208
$$ -1660 4696 -14605 -1932 32831 -33170 6851 -1515 12966 -9401 -26691 46926 -27257 -3049
593c049J3650j1398J8416n2898O2045j6074l2008K3066J725J0704m0852K9967
$$ -3049 10601 -797 17619 -35279 26766 10692 -21316 1750 3475 14179 -26673 3294
605C294R452j6463q234J1370K8055n2352K7284O869q061M00k5532N1405l4845
$$ 3294 12746 -3717 -11951 -581 27474 -24878 2406 9275 1214 1614 -23918 27487 -7358
618g358n615J6933k641J0972m0838M8429j3304j7790J7167j3594L3702m7709K0730
$$ -7358 -12973 3960 1319 12291 -28547 19882 6578 -11212 5955 -7639 26063 -21646 -916
631i16J4414k2043J6921l1942M5364k3251j4457K6922j5979J9558l7728L5577
$$ -916 13498 -8545 8376 -23566 21798 -1453 -15910 11012 -4967 14591 -23137 12440
643A2440k291k8543L3700l0732L0940k0126r884L2844l1122J7520q314M199L429
$$ 12440 10149 -18394 15306 -15426 15514 -4612 -14496 18348 -12774 4746 -3568 631 4060
656D060r627J1534p884N816p335J1326j4605P530J0923l1039L0755j4879K607
$$ 4060 -5567 5967 -1917 3899 -3436 7890 -6715 815 11738 -19301 11454 -3425 -818
669h18L174j7836L6076k8246O79J2386O4k517k0894L4285j5602q152K080P283
$$ -818 2356 -15480 20596 -7650 -6971 5415 5479 2962 -17932 16353 751 -7401 -5321 1962
683A962J4686m2629K9727Q202j4592J91r565L6759k7869j2155K3944N72j0608
$$ 1962 16648 -25981 3746 11948 -2644 -2453 -12018 24741 -3128 -15283 8661 9233 -1375
696a375j7470L2480p507j5621O79J4039J3690m2135K1913J6434j3678q624m379
$$ -1375 -18845 13635 6128 -9493 -8814 5225 18915 -23220 -1307 15127 1449 -7175 -11554
709a1554L4345k6179j3134K0097Q212j3587k0694L8337r263j5228J678R889J9980
$$ -11554 22791 -3388 -16522 3575 11787 -1800 -22494 15843 6580 -8648 -6970 2919 22899
722B2899m4548J8836J9861j8820j369q923K9809j7509j6332K0217L108o173j6996
$$ 22899 -21649 -2813 17048 -1772 -3141 -12064 17745 236 -16096 4121 7229 1056 -15940
735a5940K4244J09j3285p89N500J7693l1218Q609J4282r883l61j1543K3919r395
$$ -15940 8304 8413 -4872 -5661 -161 17532 -13686 -5077 9205 -678 -1039 -12582 11337 1942
749A942j2635J0467O605K26k2072K2827J408j1799p0j497K1729k7258J676J7782
$$ 1942 -10693 -226 6379 6605 -15467 7360 8768 -3031 -3101 -4598 17131 -10127 -8451 9331
763I331r234j283j0654K3995p565j6129J2643O165o77k2272K0393M715j5219P25
$$ 9331 97 -1186 -11840 12155 4590 -11539 1104 7269 6592 -15680 4713 9428 -5791 -5066
777e066P01K0553k7748P37K5261j4759m283l247K1916r058j9754J7849P443p489
$$ -5066 -4365 16188 -11560 -10823 14438 -321 -4604 -7851 14065 5007 -14747 3102 10545 3056
791C056k0842K3527Q132k5163L769J1368J1623l0384M149L1917j9838j3338O240
$$ 3056 -17786 5741 13873 -11290 -7521 3847 15470 -14914 -10765 21152 1314 -12024 -5784
804e784K5430j7354k4461K7159R713j7552j9954L3117P954l7198J0368K0034M746
$$ -5784 19646 2292 -22169 4990 14703 -2849 -22803 10314 18268 -18930 -8562 11472 16218
817A6218l4732O214M1484k8282k0846J8078K3510k1384k6980L4547J2058k9157
$$ 16218 -18514 -12300 29184 902 -19944 -1866 21644 260 -26720 7827 19885 -9272
829i272j2045L5325O134m0344R564K8814m331l5612J1032L8155k7534k2600K0838
$$ -9272 -21317 14008 20142 -20202 -10638 18176 13845 -21767 -10735 27420 -114 -22714 -1876
842a876K3869k4320k4484L6792R973l0093q822L3444N781m0782J0085K9216q755
$$ -1876 21993 -2327 -26811 9981 19954 -10139 -18961 14483 20264 -20518 -10433 18783 10028
855A0028k8961P895L5571k2935k4837K4483J9374k3339j8705L0597R548k7996
$$ 10028 -18933 -11038 24533 1598 -23239 1244 20618 -2721 -21426 9171 18719 -9277
867i277o895K8650L701l3842P547K5316q683k2414O781K8886j8860k0054K2904
$$ -9277 -16172 12478 16179 -17663 -10116 15200 6517 -15897 -9116 19770 910 -19144 3760
880C760J1133j6617j3394K0776J0950k5935l134K3318j836k0794L624J9769n971
$$ 3760 14893 -1724 -15118 5658 16608 -9327 -12461 10857 9021 -11773 -8149 11620 5649
893E649j8921J0009J7818j3598j3553J4926J0993j6091j0430J9104M984j9875
$$ 5649 -13272 -3263 14555 957 -12596 2330 13323 -2768 -13198 5906 10890 -8985
905h985r24J7342K7j8091L842J8935q765j4255R667J3772j1440j4912J8054P717
$$ -8985 -9909 7433 7460 -10631 -6789 12146 3381 -10874 -1207 12565 1125 -13787 4267 11984
919A1984j8577l240J4666N306j8769j077K1510o040j6374P394J5943j0053j5267
$$ 11984 -6593 -9833 4833 10139 -8630 -9707 11803 5763 -10611 -3217 12726 2673 -12594
932a2594J3829J0942j4621j1465J8310P351k0620j057J6812K797j9304O13K2804
$$ -12594 1235 12177 -2444 -13909 4401 11752 -8868 -9925 6887 9684 -9620 -9007 13797
945A3797q911j7140J0256J4551j0086j6552J4168J4659j8747j1034K1917M962
$$ 13797 4886 -12254 -1998 12553 2467 -14085 83 14742 -4005 -15039 6878 11840
957A1840j9921k092J8487M219k4455M246K2836j1394j5384O746J9475j3648j8586
$$ 11840 -8081 -10173 8314 12533 -11922 -7676 15160 3766 -11618 -4872 14603 955 -17631
970a7631K1235P857j5349r265J8318R256k4813K777J7091j673j5797q90K2049
$$ -17631 3604 11461 -3888 -13153 5165 14421 -10392 -7615 9476 7803 -7994 -8884 13165
983A3165j0050j5888J1619J0557q873j1441J2247R183j2489p144J4531L673j5163
$$ 13165 3115 -12773 -1154 9403 530 -10911 1336 10519 -1970 -9114 5417 9090 -6073
996f073Q47J0143O85j1967j00J3898n496r567N744Q825o831n940O866M416n136
$$ -6073 -5226 4917 5602 -6365 -6465 7433 1937 -7630 -1886 6939 108 -5832 1034 5450 314
1011C14p673J1603j01q893M205k7N313q304j49R550q195K837j430L045q29l768
$$ 314 -7359 4244 4143 -4750 -545 -572 4741 -3563 -3712 5838 -2357 480 -950 2095 1266 -2502
1027b502O269o385M954l698K92L508o971Q230p281K885L184n171M728m972O917
$$ -2502 3767 -2618 2336 -1362 -1070 2438 -4533 3697 -3584 -699 2485 -2686 2042 -2930 3987
1042C987m414j732M705l496L361p576Q720l462m001O604o373Q943r319L586O799
$$ 3987 -427 -2159 2546 -950 2411 -5165 3555 93 -3908 2696 -3677 5266 -4053 -467 6332
1057F332j0289O343m285N593m258l399O722m034K723p381R247k121n502P641o315
$$ 6332 -3957 2386 -1899 3694 -564 -3963 2759 -1275 1448 -5933 3314 1193 -4309 3332 -2983
1072b983Q532r635L820N651j0238P642o440P516o135j400Q652q946P837r467J0709
$$ -2983 5549 -4086 -266 5385 -4853 2789 -3651 3865 -2270 -3670 4982 -3964 3873 -5594 5115
1087E115l129r359J6730j4778J0393q260J304J1283k0669J6216o388K850j865
$$ 5115 1986 -7373 9357 -5421 4972 -3288 -1984 9299 -11370 4846 -1542 1308 -557
1100e57o573J7705j6862P951l464L984L112j6578K0998j2511K587m91l279J4441
$$ -557 -7130 10575 -6287 1664 -1800 2184 5296 -11282 9716 -2795 -208 -699 -3978 10463
1114A0463k1531J3522p89j276L07q149J9028j5971M663j350L355M132k0208K3335
$$ 10463 -11068 2454 1665 389 696 -7453 11575 -4396 267 -1083 2272 6404 -13804 9531
1128I531j1007L84l44m914K1543k7711J2265M843l532J437j6032K8834j7292l468
$$ 9531 -1476 -1092 -1436 -6350 15193 -12518 -253 4590 1058 2495 -13537 15297 -1995 -5463
1142e463N643o04J2253l0665K4156K174j2724M784p189K6145k6803O68J6979p631
$$ -5463 180 -424 11829 -18836 5320 7494 -5230 -446 -7635 18510 -8293 -7625 9354 1723
1156A723M11j7018K8146j0208j3072R623J628J1425l1767K1781R457j7893M550
$$ 1723 2134 -14884 13262 3054 -10018 -395 1233 12658 -19109 2672 12129 -5764 -1214
1169a214o493K6443k5288n218K1543p298k029j6964L0207q696j7191J2582J031
$$ -1214 -7707 18736 -6552 -11770 9773 2475 446 -16518 13689 4993 -12198 384 1415
1182A415J4368l6304K2081J4802k5223R434j0513K9830k5162j2132L3778j8260
$$ 1415 15783 -20521 1560 16362 -8861 573 -9940 19890 -5272 -17404 16374 -1886
1194a886K811j5114K4304Q95l0058K4401k540O722k3889J1312K2988l2885J1552
$$ -1886 925 -14189 10115 11010 -19048 5353 2813 9535 -14354 -3042 19946 -12939 -1387
1207a387j510J4111j4228j3617L3436j8193j765m240J6332O27k7533K5006k986
$$ -1387 -2897 11214 -3014 -16631 16805 -1388 -3153 -7393 8939 9566 -17967 7039 4053
1220D053L94j5464Q697K0180l2413J3800J216P187j0163j2220L3035k0951k079
$$ 4053 4447 -11017 -2320 17860 -14553 -753 463 7650 -2513 -14733 18302 -2649 -4728
1233d728J328J0424J868k8656K9041n143n776m867K899K2264l4545J4115R444
$$ -4728 -3400 7024 8892 -19764 9277 4134 -1642 -6509 -3610 18654 -15891 -1776 7668
1246G668n874k386j2429L1096j8645r770J2528L157N27k3605K5517r79j2779J849
$$ 7668 1794 -592 -13021 18075 -570 -10340 2188 5345 5872 -17733 7784 6805 -5974 -4125
1260d125K202J8271k9995R913J3877r917j042j1729K8381j5082j3678J6721n68
$$ -4125 -1923 16348 -13647 -3734 10143 226 -816 -12545 15836 754 -12924 3797 3229
1273C229K440k1432K0407N506j7240M382M65J7952k5265J247K0859j2333k268
$$ 3229 5669 -15763 4644 10150 -7090 -2708 -2243 15709 -9556 -8309 12550 217 -2051
1286b051r079K3561q810j7707J7526O99J449j9373J5941J1150k1076M232K293
$$ -2051 -11130 12431 3621 -14086 3440 4139 5588 -13785 2156 13306 -7770 -3538 -1245
1299a245J5028k0821m660K4828j3489l067m905J6155o28k1295J6237M450l144
$$ -1245 13783 -7038 -11698 13130 -359 -3426 -8331 7824 7196 -14099 2138 6588 3444
1312C444j3421R758J3520j9149N50N388J0455j5346o183K1608r680m224l086J2777
$$ 3444 -9977 -219 13301 -5848 -5298 90 10545 -4801 -10984 10624 944 -3280 -6366 6411
1326F411J190k0500J5136M123m422r817N899J4738j9866J767P611L292p819p735
$$ 6411 7601 -12899 2237 6360 1938 -7879 -1980 12758 -7108 -5341 2270 5562 -2257 -9992
1340i992J9981q251p395M574N581Q06j5600J1931N955j0093l211O289P691j4608
$$ -9992 9989 1738 -5657 -1083 4498 5304 -10296 1635 7590 -2503 -5714 575 8266 -6342
1354f342K662P685j397m683l736J4549q286o604Q498N43r23r847J0080L775j1420
$$ -6342 -3680 4005 2608 -2075 -5811 8738 452 -6152 2346 2889 1966 -7881 2199 5974 -5446
1369e446L049M039K967r236K013Q356n516k816P58Q045o702n703R849j418l253
$$ -5446 -2397 1642 4609 -4627 -2614 5742 226 -2590 -1832 6213 -489 -6192 3657 2239 -1014
1384a014l839P122K508j0048M184L962m12o091J868Q005p777j362K766L671l458
$$ -1014 -4853 2269 4777 -5271 -1087 2875 2463 -3628 -1760 6245 -1532 -2894 -128 3543 85
1399H5o241R682j613m911J416K526K843p135J913N452l644k268J251L337k584
$$ 85 -6156 3526 1913 -2998 -1582 944 3787 -3348 -1435 4017 373 -1895 -644 2693 109
1414A09k469J946K440k287k638M239k69j333m64M10L190m066M93J442r1k99l210
$$ 109 -2360 -414 2026 -261 -2899 1340 1071 -262 -726 -316 2874 -1192 -699 743 652 353 -2857
1431b857M171o44j548l28L11M211n208J000K345p61L15l849M970o60m346L225
$$ -2857 1314 670 -878 -1206 -895 3316 -1892 -892 1453 692 1007 -2842 2128 1468 -2878 347
1447C47n9J044l369P77M221k966j267M13L756k418k595K500R52o11l551K821K368
$$ 347 288 1332 -2037 -1260 2961 -5 -1272 -859 2897 479 -2116 384 1336 725 -2826 -5 2363
1464B363l914k80K311J768l412j131M208M57m117l94N126j489l657N83L425j65
$$ 2363 -1551 -1831 480 2248 -1164 -2295 1913 2370 -1747 -2141 2985 1496 -2161 -1578 1847 1682
1480A682n666L973K488l184p11J080L525l737j665L534Q22k471k302L971K89l094
$$ 1682 -3984 -11 2477 -707 -1418 -338 3187 -550 -2215 1319 2141 -330 -2632 1339 1628 -1466
1496a466m37K051J912l665j60L615J03l619K82L760j048l455K89N365l022m492
$$ -1466 -1903 148 2060 -1605 -1765 1850 1953 -1666 -1384 2376 1328 -2127 -1838 3527 505 -3987
1512c987M550J335j187m702M388M612q143J453L645J066n017j521Q074m237l463
$$ -3987 563 1898 711 -3991 397 5009 -3134 -1681 1964 3030 -1987 -3508 4566 329 -3134
1527c134J377M846j751p206Q183K25l174k007K728N547r604K101M885j899k748
$$ -3134 -1757 3089 1338 -5868 2315 2540 -634 -2641 87 5634 -3970 -1869 3016 1117 -1631
1542a631k220Q902m753m704M599L046j952p283Q733J606o706n88M519M381j1704
$$ -1631 -3851 5051 298 -4406 193 3239 1287 -5996 2737 4343 -2363 -2951 1568 5949 -5755
1557e755K723Q223m070n658J386J0654q486m934P790L403n979p335J4323k118
$$ -5755 -3032 5191 1121 -4537 -3151 7503 -983 -5917 1873 5276 -703 -8038 6285 4167
1571D167r663K949N726K842j5088Q040Q584r289k650K467J1272j2511l465J2119
$$ 4167 -5496 -2547 3179 6021 -9067 -1027 7557 -1732 -4382 -1915 9357 -3154 -6619 5500
1585E500j961n029o872J5750l106j3073Q717K783L001j4930P279J2342j4059l69
$$ 5500 3539 -1490 -8362 7388 4282 -8791 -74 2709 5710 -9220 -1941 10401 -3658 -4027
1599d027K815J0438j1255p329J6617m107n544n618J4266M15j7458J1200L817K68
$$ -4027 -1212 9226 -2029 -9358 7259 3152 -2392 -8010 6256 6671 -10787 413 4230 4498
1613D498j2309M904J5065j6570j41N048O627q803q087J7538n526n653k153J0583
$$ 4498 -7811 -2907 12158 -4412 -4553 495 7122 -1681 -9768 7770 2244 -3409 -5562 5021
1627E021J204j6417J1829K532j709q026K618J3480j5178Q73M404M438n896p876
$$ 5021 6225 -10192 1637 4169 2460 -5566 -2948 10532 -4646 -3773 631 5069 -827 -8703
1641h703J5511n478l235k221P148L994j6464J1549J151j602m832j528J4906j4967
$$ -8703 6808 1330 -1905 -4126 3022 7016 -9448 2101 3252 1650 -3182 -4710 10196 -4771
1655d771J233N041P48o45j0244J5293m793n175J860K597N592j5284R711K779n201
$$ -4771 -3538 1503 2251 1606 -8638 6655 1862 -3313 -1453 1144 6736 -8548 1163 3942 -1259
1670a259k56k863J3030j2321l90P463k178M15q947J3370l837o584M568O7N475
$$ -1259 -1515 -4378 8652 -3669 -4059 3404 1226 1641 -7306 6064 2227 -4357 211 278 5753
1685E753j3841Q833M268p977K513l499J2053j0655k631J0328m434N7p291J1751
$$ 5753 -8088 745 5013 -2964 -451 -3950 8103 -2552 -5183 5145 711 768 -6523 5228
1699E228k080r032O431P9M530j3003P890O797j0751L431k434J0849r596n372J3937
$$ 5228 3148 -5884 547 626 5156 -7847 43 6840 -3911 -480 -2914 7935 -1661 -7033 6904
1714F904o560p06n402R895O84j3049R367J222O50q982M624R716j2144J378K005
$$ 6904 344 -362 -5764 4131 4815 -8234 1133 2355 3005 -5977 -1353 8363 -3781 -2403 -398
1729c98O499p616n586J3191m833l428k619R109l69j1449R007J111L43q516M100
$$ -398 6101 -1515 -7101 6090 1257 -2171 -4790 4319 3950 -7499 1508 2619 2962 -5554 -1454
1744a454J0063j3106K679J830M247m543p260J3645n108l582k1M995K152j1179
$$ -1454 8609 -4497 -1818 12 4259 -284 -7544 6101 993 -2589 -2610 2385 4537 -6642
1758f642P557J926j674m704J594Q967j0667J281L190J582k165o140J0660l690
$$ -6642 915 2841 1167 -3537 -1943 7024 -3643 -2362 828 2410 245 -5895 4765 1075
1772A075l420J428K347K124q686O145J331k693r62p49O951p607J085L642j911
$$ 1075 -2345 -917 1430 3554 -5132 1013 2344 -349 -1311 -2060 4891 -2716 -1631 2011 100
1787A00P81m421O413j786l169K522r1J160m008L173q4j154K74j186M264n147K163
$$ 100 881 -3540 2873 1087 -2082 440 349 1509 -2499 674 590 -564 -290 -1476 2788 -2359 -196
1804a96K003k887K399l478M054j396k283L178k263J780k210J330R39k389K039
$$ -196 1807 -1080 1319 -2159 1895 499 -1784 1394 -869 911 -1299 31 970 -1419 620
1819F20q79J543k192N07K070k811J400m61Q23n93j245J919j124L34n44J579p53
$$ 620 -259 1284 -908 -401 1669 -1142 258 -203 620 27 -1218 701 -423 -89 -633 946 193
1836A93j370K260j316J090j926R68J689k991J742l70J2M19j489J676m71n25L47
$$ 193 -1177 1083 -233 857 -1069 -101 1588 -1403 339 -31 -19 400 -1089 587 116 -409 -62
1853f2M76j41p44R88n20J57m87n1R62j243P41l19j59Q17n67K55J85j92K03O5o88
$$ -62 414 273 -471 517 -3 154 -333 -384 578 -665 76 -243 -402 415 -152 103 288 96 299 364 -324
1874c24N85J18r91M02L49j78l74J69R63m94r53Q86J255j899m04J459L48j171j375
$$ -324 261 379 -612 -210 139 -39 -413 -244 719 225 -728 158 1413 -486 -890 569 917 -254 -1629
1893a629K664R9l158J619J757q09j965Q68K685j779k694K651K114l332j010K889
$$ -1629 1035 1134 -2024 -405 1352 543 -1422 -554 2131 352 -2342 309 2423 -909 -1919 970
1909I70R23k883j429M621o01m007J290L415p44m498K194L837k838k976K393L935
$$ 970 1893 -990 -2419 2202 1601 -2406 -1116 2299 1555 -2943 -749 3088 250 -2726 -333 3602
1925C602m553k464M968P90l859j762N766N10o204J496N243j834m967K184M662
$$ 3602 -951 -3415 1553 2343 -1516 -3278 2488 2998 -3206 -1710 3533 1699 -3268 -1084 3578
1940C578l055m752M394M066n785j911N292J350m828j937O921n18o380K060M660
$$ 3578 523 -4229 165 4231 -1554 -3465 1827 3177 -1651 -3588 3333 2815 -3565 -1505 3155
1955C155j303n964L557M450m278k946L134M350n479k388O525n95m000q31N059
$$ 3155 1852 -4112 -555 3895 -383 -3329 -195 4155 -1324 -3712 2813 2218 -1782 -2613 2446
1970B446L45o656L027L930k522l577K238M335m007k924M483K019m346j644N022
$$ 2446 2791 -3865 -838 3092 570 -3007 -769 3566 -441 -3365 1118 3137 -1209 -2853 2169
1985B169J96m992O18M581r42m720J943M512l266l297L882K200l677j903L925K159
$$ 2169 2365 -2627 -2009 2572 1630 -3090 -1147 3365 99 -3198 684 2884 -793 -2696 1229 3388
2001C388n719K44M856j385l733M94M800j976m594L876K596k984k868M084K054
$$ 3388 -2331 -2087 2769 1384 -2349 -1855 2945 969 -3625 251 2847 -137 -3005 1079 3133
2016C133m564q80L835R02m791K47N121j772m060J846L916j847m151K753L860l753
$$ 3133 -1431 -2311 1524 2426 -2365 -2118 3003 1231 -2829 -983 2933 1086 -3065 -312 3548 -205
2032b05l142M489J867m204k056M662K018o234L70N581j191m751R60N755k634n346
$$ -205 -3347 1142 3009 -1195 -3251 1411 3429 -2805 -2435 3146 1955 -2796 -1836 3919 1285 -4061
2048d061L848M101l942m407N513K773n830j427N233J755o470K08O324j523n279
$$ -4061 -213 3888 -54 -4461 1052 3825 -2005 -3432 1801 3556 -2914 -2706 3618 2095 -3184
2063c184J402N659k851n000L420M576m044m444N647K559n218j985N237K335p088
$$ -3184 -1782 3877 1026 -3974 -554 4022 -22 -4466 1181 3740 -1478 -3463 1774 4109 -2979
2078b979L03N974j015n548P21P018l682n037L755M435l708n249O802K171o072
$$ -2979 -2676 3298 2283 -3265 -2544 4474 792 -4245 -490 3945 237 -5012 1790 3961 -2111
2093b111l82M069K163p128J034O582l406l890J368N843m023m305N382J754l530
$$ -2111 -2493 1576 3739 -3389 -2355 4227 821 -3069 -1701 4142 119 -4186 1196 2950 -580
2108e80k965N562R20n745J592K931M28n203J394M979l430k598K354L394l465k539
$$ -580 -3545 2017 2937 -2808 -1216 1715 2143 -3060 -1666 3313 -117 -2715 -361 3033 -432 -2971
2124b971M379O99l064j578M620j34m563J912K390n72m187K763L608m335j042K588
$$ -2971 1408 2107 -957 -2535 2085 1951 -2612 -700 1690 1118 -3069 -306 3302 -1033 -2075 513
2140E13K235m238p54M594j334k305p07M344j507m069L778R97j148l138L115K838
$$ 513 2748 -1490 -2244 2350 1016 -1289 -1996 2348 841 -3228 550 1547 399 -2739 376 3214
2156C214n127Q90J709J105k859p19M473k745p92k45K648l96m291M335q4j110j165
$$ 3214 -1913 -1023 686 1791 -1068 -1787 2686 -59 -851 -1096 1552 1156 -3135 1200 1116 6 -1159
2173a159R10K948m108N57J519L16j533j213L427j254j178j57K042j18l258L018
$$ -1159 -249 2699 -1409 -852 667 983 -550 -1763 1664 410 -768 -925 1117 999 -2259 759
2189G59k28k21j072K49K317k870P09M78O29o76j773L021j306R9p90R11J037k753
$$ 759 531 310 -762 -513 1804 -1066 -357 121 750 74 -1699 1322 16 115 -675 236 1273 -1480
2207a480K032q06Q06o73j212K591j682M45p11J244L03k543K774j482R37q32p70
$$ -1480 552 -254 552 -121 -1333 1258 -424 21 -690 554 857 -1686 1088 -394 543 -289 -1059
2224a059K847k847J276p15Q21L91k587L021j298R1r6o8J373k188J264n99J076
$$ -1059 1788 -1059 217 -498 323 714 -1873 1148 -150 -59 -155 -223 1150 -1038 226 -373 703
2241G03q13j039K554k038J073j387J033J065k694K550j531J282o47j361K552k127
$$ 703 -110 -1149 1405 -633 440 -947 86 1151 -1543 1007 -524 758 111 -1250 1302 -825
2257h25J364j196J136K75k444K556j141Q68r48l31K290k512J111n96J240p82j560
$$ -825 539 -657 479 754 -1690 866 -275 593 -355 -686 1604 -908 203 -393 847 65 -1495
2274a495K885j766P03j305J193J202l072K555j282J263j221j004L727l523R29
$$ -1495 1390 -376 327 -978 215 1417 -1655 900 -382 881 -340 -1344 2383 -1140 -211
2289b11N8O91j9k418L190j212m0r76J148J486l553K209j58N05j344p47L825l589
$$ -211 -153 538 519 -1899 1291 79 39 -937 211 1697 -1856 353 195 700 -644 -1391 2434 -1155
2307a155L81J155K93m00k629M054j491q45J29P94J582m210K879M33j358k44j84
$$ -1155 -774 381 674 274 -2355 1699 208 -637 -508 286 1868 -2342 537 970 -388 -632 -816
2324h16L490m159M56K174p32m67j956M296j993j981J614Q64L49m097L879R40l070
$$ -816 2674 -1485 -1029 1145 413 -54 -2010 2286 293 -1688 -74 790 1139 -2958 921 1861 -1209
2341a209K74Q05K901m665L66L593j517j218j189M468k079k982K882Q97p78l777
$$ -1209 -935 -130 2771 -1894 -1528 2065 548 -670 -1859 2609 530 -2452 430 1327 549 -3228
2357c228M129J652m547R52J448K541n003L6M861k244k089j76M499k389l664L914
$$ -3228 901 2553 -1994 -1042 406 2947 -2056 -2020 2841 597 -1492 -1668 2831 442 -3222 692
2373F92J069j545l458M416J849n219R24K122J692m460k49N388l060j914M80L734
$$ 692 1761 216 -3242 1174 3023 -2196 -1272 850 2542 -1918 -2167 3221 161 -1753 -1273 2461
2389B461j785l874L890J463k049l000L642K268n001N72K494J145m024n84N474
$$ 2461 676 -3198 692 2155 106 -2894 748 3016 -1985 -1413 1081 2226 -1798 -2382 3092
2404C092k777k249R72L398j345m216L746J401k261k229L022K259m814M98K728
$$ 3092 315 -1934 -962 2436 1091 -3125 621 2022 -239 -2468 554 2813 -2001 -1503 1225
2419A225K45k875n47M660j949k956J924K296j480l123L254J210k558j222K669
$$ 1225 1470 -1405 -1952 2708 759 -2197 -273 2023 543 -2580 674 1884 -674 -1896 773
2434G73J540m324Q86K620m12k289j71L898k146k413K162J478j412k547L262R23
$$ 773 2313 -2011 -1125 1495 1083 -1206 -1377 2521 375 -2038 124 1602 190 -2357 905 1828
2450A828k822n43K535R09l866R34K886j207k231N48L478k262k591K923J258k208
$$ 1828 -994 -1537 998 1907 -1959 -1025 1861 654 -1577 -1029 2449 187 -2404 519 1777 -431
2466d31j476K836P44l114J05K945j55l439J350K734j863k199J571K803k645k143
$$ -431 -1907 929 1673 -1441 -1336 1609 1454 -1985 -635 2099 236 -1963 -392 2411 -234 -2377
2482b377L186R37k742j049L389K56l415R15K598m59l391J467L293k533k049J745
$$ -2377 809 1746 -996 -2045 1344 1600 -1815 -900 1698 1239 -2152 -685 2608 75 -1974 -229
2498b29K109j914k494L543R97l183j65K143P52k956P4L409j362k367J222K309
$$ -229 1880 -34 -2528 1015 2012 -1171 -1336 807 1559 -1397 -1323 2086 724 -1643 -421 1888
2514A888j695k325K323J787k165j688K556J296k972m35K734l19k024j74K565n51
$$ 1888 193 -2132 191 1978 -187 -1875 681 1977 -995 -1430 1304 985 -1039 -1213 1352 801
2530H01k743J791J741j498j351J031J920j905j135J815O37j788m06J739K05j794
$$ 801 -1942 -151 1590 92 -1259 -228 1692 -213 -1348 467 1104 -684 -1090 649 854 -940
2546i40J68J633l97j218J95J909j224j129J120N12m71j122Q41J222j907N4J059
$$ -940 -772 861 464 -754 -559 1350 126 -1003 117 629 158 -964 -123 1099 -808 -754 305
2563C05Lm77n91J542l66j047O04M99l41r87R24N44q77j26M23L57q46K9Q91k57
$$ 305 308 -169 -760 782 416 -631 -27 472 131 -856 68 612 -265 -391 32 389 -457 -428 463 206
2583B06n57K78L93j89m17J87N63p38j8O79m81k74lM40L24r26N24M11m47q3J7N13
$$ 206 -351 -73 320 131 -286 -99 464 -274 -292 387 -94 -368 -371 69 393 -533 -9 402 -45 -128 -111 402
2605D02o12k59P20K1n22k65R62l03o22L05N17K2q88M17P54p97m63P88J47p12j8
$$ 402 -210 -469 251 272 -250 -515 447 144 -478 -173 344 366 -522 -105 649 -148 -611 177 324 -388 -406
2626d06O29J87q66J46R24n42n56M98L86k64p10Q57m4m10R6L4M16r06N42J41l52
$$ -406 223 410 -456 -310 614 72 -484 14 400 136 -574 283 239 -171 -75 -41 375 -531 11 152 -200
2647b00L99m68Q76q25O7M11o21P50n78L25l12j93P72m67K07m26N10j82n45J036
$$ -200 199 -269 607 -218 -151 260 -361 389 -189 136 -176 -369 403 -64 143 -283 227 45 -500 536
2667E36p94L49n16M79N28j397Q42J90J45q62J02J516j256m51L04J104q78j135
$$ 536 -258 91 -425 54 582 -815 27 217 362 -500 -398 1118 -138 -589 -285 819 -59 -1194
2685a194K004m87o46o05J454N77k674J453J037l94j649P83K080k259l36J135R44
$$ -1194 810 323 -323 -928 526 1103 -1571 -118 919 525 -1124 -341 1739 -520 -856 279 1223
2702A223j611j282L075q80j061l95J679M05k994J720J189q35j219N90K400k874
$$ 1223 -388 -1670 1405 525 -536 -931 748 1153 -1841 -121 1068 233 -986 -396 2004 -870
2718h70k32J395Q95j286j792L286q81j480K63J270J040l857K320J430j698o03
$$ -870 -1102 293 1188 -98 -1890 1396 515 -965 -702 568 1608 -2249 71 1501 -197 -800
2734h00J51K576k579p55K199r4q55j741L334n17k106R27P49N04k785J710J395
$$ -800 -649 1927 -652 -1407 792 698 -157 -1898 1436 919 -1187 -260 489 993 -1792 -82 1313
2751A313j881j42N26J910k529m68K356n66o45j437K845n86k223J785L9N95k599
$$ 1313 -568 -710 -184 1726 -803 -1271 1085 519 -126 -1563 1282 696 -1527 258 297 892 -1707
2768a707J805J328k430N58L15J488j950m17K502j382j95r54K252m26k404J894
$$ -1707 98 1426 -1004 -446 -131 1357 -593 -1010 1492 110 -85 -1039 1213 787 -1617 277
2784B77L7M05k149J286J907k818M83O54J151j720r53L192j842l37l35J893m93
$$ 277 314 719 -1430 -144 1763 -1055 -572 82 1233 -487 -1440 1752 -90 -427 -762 1131 638
2801F38k735K700j3m03j324R59K360l344N89J068N20j700r21L340j667q92M2J880
$$ 638 -2097 603 590 187 -1137 -178 2182 -1162 -573 495 1015 -685 -1606 1734 67 -825 -783 1097
2819A097j00l454K825N78q65j303Q64K503l336J72J665K07j375j455L809j326
$$ 1097 997 -2457 368 946 81 -1222 -358 2145 -1191 -1019 646 853 -522 -1977 1832 506
2835E06j737O46J775l5l469K487J134j468j125J131K365l268j90K139O5j516j161
$$ 506 -1231 -585 1190 1155 -2314 173 1307 -161 -1286 -155 2210 -1058 -1248 891 956 -560 -1721
2852a721L420r42k233J385J121J23l221K034J425j929m73P90J941k585l92K382
$$ -1721 1699 757 -1476 -91 1030 1153 -2068 -34 1391 -538 -1011 -221 1720 -865 -1257 1125
2868A125m23j095j013K687n38k140J318R61j56k502J771J450j961j32O87J474
$$ 1125 702 -393 -1406 1281 743 -1397 -79 882 726 -1776 -5 1445 -516 -648 39 1513
2884A513k287m85K547j011o60m81J958n49k136J763N96n88j362J342J247k269
$$ 1513 -774 -1259 1288 277 -383 -864 1094 545 -1591 172 768 180 -1182 160 1407 -862
2900h62M61P96O61j742j43K099j242n82K00J294n22j653J750K13j043m10J117
$$ -862 -401 395 1056 -686 -829 1270 28 -554 -354 940 418 -1235 515 728 -315 -725 392
2917C92Q38k107O53R49j59j219k2J663j109o72P23Q47o51j273J830r1q28l13Q81
$$ 392 1230 -877 -224 725 566 -653 -675 988 -121 -793 -70 777 126 -1147 683 592 -236 -549 332
2936C32O14j636K22J181m47q95q6J735j010q33R01N75o11r24J348L44j253j59
$$ 332 946 -690 -468 713 266 -629 -715 1020 10 -823 78 653 42 -882 466 810 -443 -602
2954f02R86K82j258N8J147l92p85O2J244n88p87P20M53m91j007R89Q67j232k74
$$ -602 384 666 -592 -534 613 221 -564 -502 742 154 -633 87 540 49 -958 31 898 -334 -608
2973f08O46N48q98k96J044j09m25k96R26j91r07O13M24m13o07K47Q65n44m79N70
$$ -608 38 586 -312 -608 436 327 -98 -394 532 341 -566 47 471 58 -549 -302 563 19 -460 110
2993A10K90p48q1M41M12o41l3N46j54l93K92J43r8k01q8M27k21k50J61K34P6k57
$$ 110 400 -348 -429 12 424 -217 -250 296 142 -251 41 184 86 -115 -203 224 3 -247 -86 148 224 -33
3015c3RK72l31J41r4K10k52r8J61j65M93m18j46N28l46J96k87J30L50o31J89J80
$$ -33 -24 248 -83 58 -36 174 -78 -176 -15 -180 313 -105 -251 277 -69 127 -160 -30 320 -311 -122 58
3037E8Ml00P4M91k61l00J00O51l89m83P16J0l13l16L17L71o21j93O97j67l96K2
$$ 58 62 -238 -164 327 66 -234 -134 517 128 -355 361 371 58 -258 59 430 -191 -384 313 146 -250 -228
3059b28O76l22n01L86O82p04l02N18J19m21n59J084M6j009M31L50J44j004N36
$$ -228 448 126 -375 11 693 -11 -313 205 324 -97 -656 428 474 -535 -104 246 390 -614 -78
3078g8Q40r75J26L3M47l83q87J523o07l67K79J61L94r81L67N82o48k42O58L98
$$ -78 762 -213 -87 -54 393 10 -877 646 39 -328 -49 112 506 -475 -108 474 -174 -416 242 640
3098F40p71m99R70J68r55k1Q98j58q47N23O66m97o59L85P75p13q32J326J99j109
$$ 640 -131 -630 340 508 -447 -468 430 272 -575 -52 614 117 -542 -157 618 -95 -927 399 598 -511
3118e11K21N09K14j061J71J421j042n82P23N81p47q96J406K51j126l25J158J59
$$ -511 -290 219 433 -628 -457 964 -78 -660 63 644 -103 -999 407 658 -468 -793 365 524
3136E24j200J40J224j27j201K4J425n98j112Q64R90j157n74Q07R57j323o12J471
$$ 524 -676 -536 688 561 -640 -616 809 211 -901 -37 953 -204 -778 29 986 -337 -949 522
3154E22J60j315N3J063K90j619L12J485p10j176P77J201j129r76J332P99j423
$$ 522 682 -633 -580 483 773 -846 -534 951 241 -935 -158 1043 -86 -1062 270 1069 -354
3171c54o62J581M77j913M11J237k64j417L14J602q37j262Q53J218j033q97J188
$$ -354 -1016 565 1042 -871 -460 777 513 -904 -590 1012 175 -1087 -234 984 -49 -946 242
3188B42O49j159o39J283N12j685K15J140Q0j427J83J388n76r47N45J221j114r25
$$ 242 891 -268 -907 376 888 -797 -582 558 638 -789 -606 782 206 -741 -196 1025 -89 -1014
3206a014J338M89q44r08J512L64j979O16J195m88j048J99J768j085r55R46R41
$$ -1014 324 813 -31 -939 573 937 -1042 -426 769 281 -767 -568 1200 115 -840 106 1047
3223A047j171j009J778P0j081l79J273J95j798P69J143o46j084P77J200j237p24
$$ 1047 -124 -1133 645 715 -366 -745 528 723 -1075 -306 837 191 -893 -116 1084 -153 -877
3240h77J111N44j074p11J611r8j279L27J028l4j641Q75J158r65o61N95J398j752
$$ -877 234 778 -296 -1007 604 506 -773 -446 582 548 -1093 -218 940 -25 -686 -91 1307 -445
3258d45n28J377L40j116k99J432l04j414P22J086m07j439R96J095j345m23P66
$$ -445 -973 404 744 -372 -671 761 457 -957 -235 851 444 -995 1 1096 -249 -672 94
3275I4J131j796k14J332j03r12k97J600m12j323N19J176k62j506Q75J073j215
$$ 94 1225 -571 -785 547 444 -468 -765 835 423 -900 -381 795 533 -973 -98 975 -240
3292b40m63P20Q34j178m59J446j17p91m33J337m4j589O64Q40j88j109O63R29r44
$$ -240 -703 17 851 -327 -786 660 543 -248 -681 656 612 -977 -313 527 339 -770 -107 822 -122
3311a22l53L48Q90j046m23J199k7p22m01J247j31j247P11M50j23p62K98Q03n84
$$ -122 -475 -127 763 -283 -706 493 466 -256 -657 590 459 -788 -77 373 250 -512 -214 589 5
3330El97L84O34p87m35R51j46l93k13N54J24q29O13K31j67n17K86P51p87M0J50
$$ 5 -392 -8 626 -161 -596 355 209 -184 -397 157 281 -548 65 296 129 -388 -102 649 -138 -98 52
3351E2K71l86l45P07k84r6k34N94j11n42N13P6k09k21R6N93p51P0K47K00l02l95
$$ 52 323 -63 -408 299 15 -81 -315 279 168 -374 139 215 6 -215 -119 474 -277 -207 40 240 -62 -457
3373d57O57k58j07J39J79q8m84O48l03q3R5L9K45o33L19L56j86j69j09N36m56
$$ -457 200 -58 -165 -26 153 65 -419 229 -74 -157 -62 -23 222 -411 -92 264 78 -91 -200 336 -120
3394a20N9K43Nnn17O19p7m39N5K68K02p10M13J82j32L0k66O60o00R6P3Nm2p6K70
$$ -120 -61 182 187 182 -335 284 207 -232 -177 91 293 -417 -4 178 46 76 -190 470 -130 -34 39 44 2 -74 196
3419A96j82k31J93N3L07m81N0O5o8J48o8J91m10M53l00j85L25p5K3k56K34K32
$$ 196 14 -217 -24 29 336 -145 -95 -30 -98 50 -18 173 -237 216 -84 -269 56 -19 4 -252 -18 214
3441B14k73K34l19K76k16o7L83m74J54k30L96Om28P49k7m57j90M30J43m26L6K86
$$ 214 -59 175 -144 132 -84 -151 232 -242 -88 -318 78 84 -344 405 378 -79 -269 161 304 -122 -86 200
3463B00Mm85J20L76k27l56J48P13n68o03P77M37p65k05P54K08r17J84O34j17o02
$$ 200 204 -281 -161 215 -12 -368 -220 493 -75 -678 99 536 -229 -434 320 528 -389 -205 429 312 -290
3484b90J79N59m81n67M70P85o15q31Q98L18q23m7O71L82j139K64O53Kq15P5R96
$$ -290 -111 448 -33 -600 -130 655 40 -791 107 425 -398 -445 226 608 -531 -267 386 388 -427 -352 644
3505F44o62n34N68O67p17n31Q48J12n53k77N74K73j002M87N52r9o80J23Q66m87
$$ 644 -18 -552 16 683 -34 -565 283 395 -158 -435 139 412 -590 -103 449 350 -330 -207 659 172
3525A72n86M70N84q21m27O37L20m89m15Q95P2r08J75P96k89n99Q9J039p54n53
$$ 172 -414 56 640 -181 -608 29 349 -140 -555 340 412 -496 -321 475 186 -413 -324 715 -39 -592
3545e92N00O09o46n23R20J93q38n2Q43O3j115M01Q43l75o79L53P38r27m70Q53
$$ -592 -92 517 -129 -652 268 461 -377 -429 414 477 -638 -237 606 231 -448 -95 643 -284 -754 99
3565I9M89q71k78J065p8o83l0O38K4j039M29Q32n84q41O53R13p55o70Q67M08r10
$$ 99 588 -283 -561 504 426 -257 -287 351 375 -664 -235 597 13 -828 -175 738 -17 -687 180 588 -322
3586c22l27J212q2j007qJ249m02j149O02J023p83q27Q85Q04j091m53J176O1j163
$$ -322 -649 563 481 -526 -534 715 313 -836 -234 789 6 -821 64 868 -223 -676 500 561 -602
3605f02j63J387j71j218M82Q56l47j036O26J049r81m44M86Q73q08n96J045L09
$$ -602 -765 622 451 -767 -285 571 224 -812 -186 863 -118 -562 -76 797 -11 -607 438 747
3623G47j338p2J341k42j112K63J209o55j070R60P52p03q26R94N16j042k00R66
$$ 747 -591 -663 678 436 -676 -413 796 141 -929 31 783 80 -746 248 764 -278 -478 488
3641D88o4r62p1J274l51j011N92N18j12j166R59N47o90l28N66M77j116k81J024
$$ 488 424 -538 -609 665 314 -697 -105 413 301 -865 94 641 -49 -377 189 666 -450 -731 293
3660B93j48o15K11P31k8j029N20O33n68l92N54L20o10m33Q41J52p39R2N05K28
$$ 293 145 -470 -259 472 444 -585 -65 568 0 -392 162 482 -128 -561 280 432 -307 -215 290 518
3680E18r17J73Q67m16n34K30N49n26l82O20K42q09n9N86K45p01O4Q41o00l24r2
$$ 518 -399 -226 641 225 -309 -79 470 -56 -438 182 424 -385 -444 142 387 -314 -250 591 -9 -333 -425
3701d25Q43m37m09M69K39l89l53N49K52n91n9O13kn06J41M97m53m92L00O51n31
$$ -425 418 -19 -428 41 280 -109 -462 87 339 -252 -311 302 300 -206 -65 432 -21 -513 -213 438 -93
3722i3m44M50M75o99L3M17J74m66n1N83j75m97Q5N14l48l86J79N86k57o30O62
$$ -93 -537 -87 388 -311 -278 139 313 -153 -204 379 204 -293 -208 306 -42 -428 -249 337 80 -550 112
3743A12L63m14k67K44K76n64n1N34p5n90J78O80l01m20K31L60j36k87J04M17m35
$$ 112 475 61 -206 38 314 -250 -301 233 158 -432 -254 426 125 -295 -64 296 160 -127 -23 394 -41
3764d1j40L04L6l89j52N00J88m55l8M48j3l25j71M87j40j47J0J97p1l56L52j71
$$ -41 -181 123 159 -230 -382 118 306 -149 -187 261 248 -77 -248 239 99 -48 -38 159 88 -268 84 -87
3786h7Q5q7J55J13m11J47J00nj89K18J00k72R9m7N6K1M4J15k25J64N8j55Qn4Q0
$$ -87 -2 -89 66 179 -232 -85 15 10 -179 39 139 -133 -34 -81 -25 -4 40 155 -70 94 152 -3 5 -49 31
3811C1l4p4Q1j30R8r5J70j49k0M24k96L6l00M60J3k60J39k8K6m07K12K53l18J14
$$ 31 -3 -77 4 -126 -28 -123 47 -102 -122 302 6 42 -258 202 215 -45 94 66 92 -315 -103 150 -168 -54
3835e4L4K96m43p7M72j66L0l60M16N4l24J19L5J12l96J94L74l30m6n6L96n09r5
$$ -54 -20 276 -167 -244 228 62 92 -268 148 202 -122 -3 32 144 -252 -58 316 -14 -60 -116 280 -229 -324
3858c24N75l60L9k34M72j33m50M31J22Nm17P4N39l73p8K06J81m41j76N72j59l41
$$ -324 251 -109 -70 -304 168 35 -415 16 138 143 -274 -200 339 -34 -112 94 275 -166 -342 230 71 -270
3880b70Q6L67j9n54N59J63n77p7M47K30n77J79L33J55o61k04P05l53j30J52J85
$$ -270 -184 183 164 -390 169 332 -245 -322 125 355 -222 -43 290 445 -216 -420 285 -68 -198 -46 139
3901A39qp24Q30J56o28l6M16K00p16J62M82j6n01K6O93n19m69M29L97m7p79P32
$$ 139 131 -593 237 393 -235 -271 145 345 -371 -209 273 257 -244 -218 475 -44 -513 -84 313 266 -513 219
3923B19J86o58k21O66L60j029O8P70j18o33J12Q95n66n94N84L14j94o88N73L29
$$ 219 405 -253 -474 192 552 -477 -409 361 243 -390 -278 617 51 -543 41 355 161 -527 46 375
3943C75n76r7N70K43r24PJ021m97m00j2Q62m25p19O57K37l27o31O34N69q81K5
$$ 375 -201 -298 272 515 -409 -402 619 122 -278 -290 572 147 -572 85 322 -5 -636 -2 567 -314 -289
3964b89N79J82p94O9P26l20m55L6N92l25o21Q65K60m95n46O43L64p75n1M92L11
$$ -289 290 472 -322 -253 473 153 -302 -266 326 1 -620 245 505 10 -536 107 471 -304 -355 137 448
3985D48p69N6Q39n18k53j09P07q8p70P58J30m84m58P28K56p24J4M84kp60J67Q16
$$ 448 -321 -265 574 56 -197 -306 401 313 -457 301 431 -53 -511 217 473 -251 -237 247 245 -515 -348 468
4007D68o48k43L43N25l93n62Q54M2n96k6M61K52q75J07O03j71n93J63O72k44n53
$$ 468 -180 -423 -80 445 52 -510 344 386 -210 -236 225 477 -398 -291 312 141 -452 -289 383 139 -414
4028d14O69K7k78n60Q82J96q58l1O70j16n65J35O39l48m12J76P89o19k55M13K87
$$ -414 255 282 4 -556 326 522 -336 -367 303 187 -378 -243 396 48 -364 -188 601 -18 -273 140 427
4049D27o17k59O52K47p58L7N73L8p68K8Q98m59l74J56Q02n30n40M76N53o81l61
$$ 427 -190 -449 203 450 -308 -271 302 340 -428 -400 498 39 -335 -179 623 93 -447 29 582 -99 -460
4070d60O62M2n55m7O29J03r08K52P52m14l33K62M03l90m61M68M56n70m27P89J2
$$ -460 202 244 -311 -358 271 374 -534 -282 470 56 -277 -15 388 -2 -463 5 461 -109 -536 253 265
4091B65l45k50P84l51l78J86M76k78l22R5M96k25n38K39O95p86k38O25J59l40
$$ 265 -80 -330 454 103 -275 -89 387 109 -213 -118 378 153 -385 -146 549 -237 -475 150 309 -31
4111c1k29M99o8m64K38L80l12l85K05L90l39j89M07K03n48q0L56J36k91J26K98
$$ -31 -260 239 171 -293 -55 325 13 -372 -167 223 -116 -305 102 305 -243 -323 33 169 -122 4 302
4132C02l56l33K85K77k70j56L31Mk83J12K10K42m79L5J84m3l12R9K10n6m35M44
$$ 302 -54 -387 -102 175 -95 -251 80 84 -199 -87 123 365 -114 -79 105 62 -250 -151 59 3 -432 12
4154A2K49l40j82K66K71k90j66L28j23r9p0M08k88j70K11J4Nj52K55j6j97j31
$$ 12 261 -79 -261 5 276 -14 -180 148 25 -74 -144 264 -24 -194 17 31 36 -116 139 123 -74 -205
4176b05M27l01N4j24K75k87P8p3J76m2k5l4J23j53K3J06j7J4r7K04j3k84K36j11
$$ -205 222 -79 -25 -149 126 -161 -83 -156 20 -22 -47 -81 42 -111 -88 18 1 15 -82 122 109 -175 61 -50
4200e0N8j36N7J13o7K6J31j65N4k5J25o4M5j85R2m8r4m6M5J87j4j08%J76m4j66
$$ -50 8 -128 -71 42 -25 1 132 -33 21 -4 121 57 102 -83 9 -39 -133 -179 -134 53 39 -69 -69 107 63 -103
4226a03j00K42P4j74j53J45K8J8j83L89k08p3l2J08J00k42O0M35m66J15Q4J1j68
$$ -103 -203 39 113 -61 -214 -69 -41 -23 -206 183 -25 -98 -130 -22 78 -164 -104 331 -135 -20 64 75 -93
4249i3j26K68O6k80O1K38n5m24K69K85j35m07L33L33n54q5L77Q3m35K41J52n7
$$ -93 -219 49 115 -165 -104 134 79 -345 -76 209 74 -333 0 333 -221 -306 71 154 -281 -40 112 55
4271E5k51QN99l10l60L04J73l21k5J55J25l01K3K25P4l08M1K46O4l19p9M46n6
$$ 55 -196 -188 411 101 -259 45 218 -103 -128 27 152 -149 -126 99 173 -135 -94 152 216 -103 -182 264 208
4294B08n61L86J53m2m25J02L76l25j11L80o7j20j17L47J0m02N4J93j05k53M19
$$ 208 -353 33 186 144 -281 -179 197 -128 -239 141 74 -46 -163 184 194 -208 -154 39 -66 -319 100
4315A00J12l10k54M07K64n56LL53j4k95m6O47k86l00P9J55J22n84M76K75l36j87
$$ 100 212 -98 -352 55 319 -237 -234 119 105 -190 -236 411 125 -175 -96 59 181 -403 73 348 12 -175
4337a75J87L21m99j02M01K11o71j0O38k87k89K18L58j59m68L87K12m46j44M56
$$ -175 12 333 -166 -268 133 344 -327 -337 301 14 -275 -57 301 142 -326 61 273 -173 -317 139
4357A39L0n08J53L05l9m22N5Q02m28l41K75L13m25k54M85J73n30L9K96J47p17
$$ 139 169 -339 -186 119 80 -342 -287 515 87 -254 21 334 -91 -345 140 313 -217 -178 118 265 -452
4378d52J11O47j57l68j13O72j29p37O74K98m98l54N65L55q20N7M46L11q39K9O47
$$ -452 -341 306 149 -219 -332 340 211 -526 148 446 -52 -406 159 514 -306 -249 197 508 -331 -302 345
4399C45j14n86J70O46l68p21P72L35m35m28M66K82o13Q1N89j88m98q0O49l22l89
$$ 345 231 -355 -185 461 93 -628 144 479 44 -384 82 364 -249 -168 421 233 -265 -345 304 -18 -407
4420d07L85L40m24l98O05J39l54j65L62K53m79k2L37J40m86JN03l38l21K67L74
$$ -407 -22 318 -106 -504 101 240 -114 -279 83 336 -143 -165 172 312 -174 -173 330 -8 -329 -62 312
4441C12j11o29N67J44l32j06K12L24n54K9L28J52o63J37O32l03l58J88K95k97
$$ 312 201 -428 139 283 -49 -155 57 381 -173 -144 184 336 -327 -190 442 139 -219 -31 264 -33
4461c3j57L49J79m79l2L26j01k72J01J57J48m02R9M68k68m12L21R9j30l37N68
$$ -33 -190 159 338 -141 -173 153 52 -220 -119 38 186 -216 -117 351 83 -329 -8 91 -39 -376 192
4482A92L2l71j0J70J61l98M0M04k29k42J65L77l51q5K78j27m4j72L17P4k95q7
$$ 192 224 -147 -157 13 174 -224 -184 220 -9 -251 -86 291 -60 -145 133 6 -38 -210 107 181 -114 -201
4504b01L73j08j38m3K95k86k87L87L85m17j36K13R6j89j74L51R7k78j10K81O1
$$ -201 172 64 -74 -117 178 -108 -395 -8 377 -40 -176 37 133 -56 -230 121 218 -60 -170 111 172
4525A72k77o9M96k44l62K89J64k75k03L23J32j67k31L63K36m21P0K46j77k20P1
$$ 172 -105 -174 322 78 -284 5 169 -106 -309 14 146 -21 -252 111 347 -74 -4 242 65 -155 -84
4546h4R5l7j67K27K11j91k51K15J63j58j48K31J72m85J69J41o5j51K7J36j40M1
$$ -84 11 -26 -193 34 245 54 -197 18 181 23 -125 106 278 -207 -38 103 38 -113 -86 50 -90 -49
4568d9mK22l01M0K26m0K3j77jJ10j69Q2K04lk13O6kJ23j35J09R2j24p7o7P1K1
$$ -49 -53 169 -132 -92 134 94 117 -60 -61 49 -120 -38 166 163 -50 16 14 137 2 111 203 79 2 -65 6 27
4594B7j89J89mj69L01j51r5L90k97o9k3j00R5R5j45K04j01l1J41k06Q9q5J28P4
$$ 27 -162 27 23 -146 155 4 -91 299 2 -67 -90 -190 -95 0 -145 59 -42 -73 68 -138 -49 -134 -6 68
4618F8p4O8p3O0q9j19Q8J81j66N3P1j63K07L7j96p1P5O0P7k38K18P0j48O2j79
$$ 68 -6 62 -11 49 -40 -159 -71 110 -56 -3 68 -95 112 149 -47 -118 -43 17 94 -144 74 144 -4 58 -121
4643a21K43k91J23n0J33j05L3P9j00J10j34K93k74N1p3J16j74KJ14J46j37J0J7
$$ -121 122 -169 -46 -96 37 -68 -35 44 -56 54 -80 213 -61 -10 -83 33 -141 -139 -25 121 -16 -6 11
4666A1N8k29J56K08j92lL9J02m9m41M25L5k69P6J30J30k99Q3J30m3k98K43K59
$$ 11 69 -160 -4 204 12 9 48 150 101 -340 85 120 -149 -73 57 187 -112 -29 101 58 -240 3 262
4689B62k48k45K44K10l11j97M64P8l87O0L26K8m81j51M64P9l36J0L91k64m62M01
$$ 262 14 -231 13 223 -88 -285 179 257 -130 -70 256 284 -197 -348 116 195 -141 -131 260 -4 -466 -65
4711f5L31m25n6M57Q8n00J2L52l0m70J40M62l42j65J19K60k37l04M15L05n54n1
$$ -65 266 -159 -215 242 330 -170 -158 194 164 -306 -166 296 -46 -211 -92 168 -69 -373 42 347 -207 -258
4733b58L48J35l34J23L28j73m45J59J77o3m48M02M16l34k99L75M4l90o2L79J14
$$ -258 90 225 -109 14 342 169 -276 -117 60 -3 -451 -49 367 33 -266 109 153 -237 -299 80 194
4754A94l81m6M53p8m93J80L92k07k71K46K41k26k45L11O8k67k6N61j88m64Q4M00
$$ 194 -187 -233 220 142 -351 -171 221 14 -257 -11 230 4 -241 70 138 -129 -155 406 218 -246 -162 238
4776B38j61m24J55M47m04j7J69K82m46M7K75J0m13k8M64j4l23R9L27j48k94K53
$$ 238 77 -347 -192 255 -149 -166 3 285 -161 -114 161 171 -242 -270 194 180 -143 -44 283 135 -159 94
4798I4K27m35j14L91P4m10J7M05J6l91K23P1Om36K47L37k00m10L52O8j81j73L61
$$ 94 321 -114 -228 163 237 -173 -156 249 265 -126 97 168 174 -262 -15 322 122 -288 64 132 -49 -222 139
4821A39J12l50j10N37q9m21J50N02k27m12J96K96l16l02L18J09k30k6M05k6l52
$$ 139 251 -99 -209 328 239 -182 -32 470 243 -169 27 323 7 -295 23 132 -98 -124 281 255 -97
4842i7O0L14j31l43J13K97j35l29L47K31k66k63L84M0k89k03L36J22m25j7L22
$$ -97 -37 277 146 -197 -84 213 78 -251 96 327 61 -202 182 222 -67 -270 66 188 -237 -254 68
4863F8J3k82K7K33R4m88L13L69m55k7L18m8k64j36L07J38j19k57M05p4k63J91
$$ 68 81 -201 -174 59 153 -335 -22 347 -108 -135 183 135 -129 -265 42 180 61 -196 209 135 -128 63
4885F3K35k58l07J68K02jj89J28M0k22k2N7J03j11j77N20r1l80K29K25m5k77K44
$$ 63 298 40 -267 -99 103 102 -87 41 81 -141 -163 -106 -3 -114 -291 229 138 -242 -13 212 167 -110 134
4908A34M1p7k54L05J12k23n0K32j31k25K54Q4k72k11K30L95l22k52K56M1k5j76
$$ 134 175 98 -156 149 261 38 -12 220 89 -136 118 202 -70 -281 -51 344 22 -230 26 67 42 -134
4930a34K19m9j7k69M30p9j61K0L05k70j87J35J03j35j13K34Kj0J0K4K6j78O0N1
$$ -134 85 36 19 -250 180 101 -60 -40 265 -5 -192 -57 46 -89 -202 32 34 24 34 58 84 -94 -34 17
4954A7n4k2k0J89j31jj35K47m7p9P6J10k46l4K03jo9K7j11O4j31J44L8j79K49
$$ 17 -37 -59 -79 110 -21 -22 -157 90 43 -36 40 150 -96 -130 73 72 3 30 -81 -17 -148 -4 34 -145 104
4979A04J7j28J35j89K6K5o8K0J18J20j73rP0m6Q3O1j30k16K53j11P5m6J33k42
$$ 104 121 -7 128 -61 -35 -10 -78 -58 60 180 7 -2 68 22 105 166 36 -180 73 -38 37 -9 124 -118
5003a18L9k5j7J05N8J62k85M7J29Qj62J98J8m9l5o5J42L1j23k1k9l7K4K8J2n5
$$ -118 -79 -104 -121 -16 42 204 -81 -34 95 103 -59 139 157 108 73 8 150 181 58 37 8 -29 -5 23 35 -20
5029b0j51Q2K25j74p6Q1R1Q0m94N52n5k68M4K33k0l31J85M7n7j16K95j30l5o3
$$ -20 -171 -89 136 -38 -114 -33 58 138 -356 196 141 -127 -83 150 130 -201 -16 31 -26 -142 153 23 -12 -75
5053g5J36M7k50J06J15J4o1L6J33j83j51J68j3lq9J55N0k26J2J58L3j99j55M53
$$ -75 61 108 -142 -36 79 93 32 68 201 18 -133 35 22 19 -70 85 135 -91 -79 79 112 -87 -242 211
5077B11j36k09J53k9P3l46J59K01j37p5K30J10k11m7K70j23j21q3K12j9j68k3
$$ 211 75 -134 19 -10 63 -283 -124 77 -60 -135 95 205 -6 -53 217 94 -27 -110 102 83 -85 -108
5099a08L59k03m49N81Rk87n1J91r5k25J16K96R4l94k9M02j21k09%L21L8l98J28
$$ -108 251 48 -401 180 189 -98 -149 42 -53 -278 -162 134 228 -166 -195 207 86 -123 -123 198 236 -162 -34
5122c4J52k63p9K86K53m54j19L91K1j77l2L64j35m21K37K6j39j53K32K91l24q0
$$ -34 118 -145 -224 62 315 -139 -258 133 154 -23 -55 309 174 -247 -10 16 -123 -276 -44 247 -77 -157
5144a57J91K93m52l6M90k13l11R0L81q2m59J97K80l26j87M51J23m60L5M56j74
$$ -157 34 327 -125 -161 329 116 -195 -105 276 194 -265 -68 212 -114 -301 150 273 -187 -152 304 130
5165A30k47nK52J31n52J18J76o3k89L13K32k61k08L78K29m55j11K67J07j72j66
$$ 130 -117 -122 130 261 -291 -173 3 -60 -349 -36 196 -65 -273 105 334 -121 -232 35 142 -30 -196
5186a96L81k16j68Q0L59j90l58K11K94l75j66M00K48m60j02L93o8j66J2J80P8
$$ -196 185 -31 -199 -119 240 50 -308 -97 197 -178 -344 56 304 -156 -258 135 67 -99 -87 93 171
5207A71m57J71L04j19l57K58J58k87J4K96L4k65N3K12Pm01J21K46l6l22J96L05
$$ 171 -286 -115 189 70 -287 -29 129 -158 -144 152 186 -79 -26 186 193 -208 -87 159 123 -199 -3 302
5229C02m34k2J95O2j35j83K68or9J25J80k23r9kK59j30j71J08K51l90o0K30J82
$$ 302 -132 -154 41 103 -32 -215 53 47 -52 73 253 30 -69 -71 188 58 -113 -5 246 -144 -204 26 208
5252B08j97k62L89N3k35j98M03n8k29R6K76j19l12L01m9Pl11L83q0j95n8M71j91
$$ 208 11 -251 138 191 -44 -242 161 103 -126 -30 246 127 -185 116 67 74 -237 146 66 -129 -187 284 93
5275I3k64O1K46n2l59L37P1J4l25O5K00k36j50M18pq0j26J26n6j12K43K4l13j43
$$ 93 -171 -110 136 84 -275 62 133 147 -178 -113 87 -149 -299 119 112 32 -94 32 -24 -136 107 131 -182 -325
5299c25L61J82j31j95J23N4q9j59K44J67k74j08K18q5l5j61K74n2lj90L53j53
$$ -325 36 218 87 -108 15 69 -20 -179 65 232 -42 -150 68 -17 -52 -213 61 9 6 -184 169 16
5321A6N4j82K67j86k01K25J31k12rK41K7j96K6j5K7l1n7J71j54m6J8Q6j27K13
$$ 16 70 -112 155 -31 -232 -7 124 -88 -97 144 171 -25 1 -14 13 -18 -75 96 -58 -104 -86 0 -127 86
5345H6Q1n3j43l4J47m1p3K11j02j74J43q4P4j6j17NO8p1J83j25K1o2l1K34j47
$$ 86 167 114 -29 -63 84 43 -30 181 79 -95 48 -36 38 22 -95 -90 -22 -93 90 -35 -14 -76 -107 127 -20
5370b0J26j06QJ06j99P1L3K6J70k62Rj0m6R4R7K9j46Q3j98J97L9j61N8m6J02j10
$$ -20 106 0 8 114 -85 -14 19 45 215 -47 -38 -48 -94 0 97 126 -20 63 -135 62 101 -60 -2 -48 54 -56
5396e6l9L02k57Q5j43J41j20L4J33j84R8j04J33j13J29j11p0J95j19J07J6r8J4
$$ -56 -95 207 -50 35 -108 33 -87 -53 80 -104 -6 -110 23 -90 39 -72 -142 53 -66 41 57 -41 -27
5419b7j16K27k72K45K1j62M8J61O4l38L6J61K12l21J01j30K44k35L44j56j01k23
$$ -27 -143 84 -188 57 78 -84 -36 125 189 -149 -113 48 260 -61 40 -90 154 -81 263 107 6 -217
5441b17K46J08j59N2j35L29l20L7J02J06j31j42J60J41k46K14r0J16k21N6j04
$$ -217 29 137 -22 30 -105 224 -96 -59 43 149 18 -124 36 177 -69 145 55 171 -50 6 -98
5462i8j19K47l4R3j12j07K18M8j67k7J19k62J44J21K27k79j16O7K67j21j47N5
$$ -98 -217 30 -4 89 -23 -130 88 136 -31 -58 61 -201 -57 64 291 12 -104 -37 230 109 -38 17
5484A7J07j18j24J04P8j21j73L65k75n9N1J66L7k91L70J18m47o1L25N7j34j39
$$ 17 124 6 -118 -14 64 -57 -230 135 -140 -199 -148 18 55 -236 134 252 -195 -256 69 126 -8 -147
5506a47J89j3j07j0K57m3l58J55K37K0k86L9K13j79k24L32l5Q0k76K77o8k22l5
$$ -147 42 29 -78 -88 169 126 -232 -77 160 180 -106 -67 146 -33 -257 75 40 120 -156 121 53 -169 -204
5529b04J56J58k99j2L27j60r3J06K62k93k1K74n3l02k14P16l19j21j59M14j81
$$ -204 -48 110 -189 -201 126 -34 -127 -21 241 -52 -73 201 148 -154 -368 348 29 -92 -251 163 -18
5550a8k37J93L00l18j59K81J37l04j23L80m7l9j27L21j72l71K64K76k24k26K00
$$ -18 -255 -62 238 -80 -239 42 179 -125 -248 132 85 46 -81 240 68 -303 -39 237 13 -213 -13
5571a3K21l52r5L88l8j99k07N08j86j62l4J84J3k41J86J87j59k18K62J75l21j16
$$ -13 208 -144 -239 149 111 -88 -295 213 27 -135 -169 15 28 -213 -27 160 1 -217 45 220 -101 -217
5593b17J67J02j79k3K19mm14K94L94j33m45J59M99l85j05J24L76l44k25M24l04
$$ -217 -50 52 -127 -150 69 65 -349 -55 339 206 -239 -80 419 34 -71 53 429 85 -140 284 -20
5614b0Nk7J64J4k86q8K57j23r0k2N18l22j14K07J16l34K5L56j63k27R7J66j7k68
$$ -20 -15 -42 122 136 -150 -238 19 -104 -194 -216 302 -20 -134 73 189 -145 -120 236 73 -154 -57 109 92 -176
5638a76L8J72J04j57m3J91k10m2K90Jl10qL00o2l44J25K44r5o4O5K70l08j82K28
$$ -176 -138 34 138 -19 -62 129 -81 -123 167 168 -142 -150 150 88 -256 -131 113 18 -46 19 289 -19 -201 27
5662B7J58j43j70K05J0k15J04J4N0m6j18L66j84j63K16n8k13P4K15o2j74L2J09
$$ 27 185 42 -128 77 87 -128 -24 -10 40 -6 -124 242 58 -105 111 53 -160 -86 129 67 -107 -75 34
5685C4P7k18j8K71p9k77J58J56q5j07PJ30N0j46Q0P5j92j8K16J6j84JK0j04m9
$$ 34 111 -107 -125 146 67 -210 -52 104 19 -88 -81 49 99 -47 33 108 -84 -102 114 130 -54 -53 -33 -137 -186
5710a86Q6K27k1l82M01J12k40j37O1J81k18R6K03k14M3j6O0N4k06%J30R0k26J79
$$ -186 -100 127 106 -276 125 237 -3 -140 -79 102 -116 -20 183 -31 12 -4 56 110 -96 -96 34 124 -102 77
5734G7J37j03l52K19K4J0j39J54p6j35K30L7J60l17J34nJ04k14j02J72Olo1%%
$$ 77 214 111 -241 -22 2 12 -127 27 -49 -184 46 83 243 -74 60 55 159 -55 -157 15 21 18 -43 -43 -43
5759d3k2N0k1K5p9J10m0k4k9J94j81P6n4p7O5M4O3L0O8j51M6R3k24N8m2M9q2j2
$$ -43 -65 -15 -36 -11 -90 20 -20 -44 -73 121 -60 16 -38 -115 -50 -6 57 87 155 4 50 143 -81 -23 -65 -16 -98 -110
5787a10R6L6k1J39j93o1Q8o2J07p2K8k6K65j35j2j41P0J48j26J42k0j82Jl5J94
$$ -110 -14 22 1 140 -53 -114 -26 -88 19 -53 -25 -51 214 79 67 -74 -4 144 18 160 140 -42 -41 -76 118
5812A18j3k98K15m9k0K03k83J33on3Q0j62K41j20q4K6L5R7q3J57k22P2M2l8j07
$$ 118 105 -193 22 -27 -47 156 -127 6 0 -53 27 -135 106 -14 -98 -72 -37 60 -23 134 -88 -16 26 -12 -119
5837a19J8K39j30j96R4R6J70k36K27J10l18Q4M1J48k53p1L1N6k7l8K23r6j59Q2
$$ -119 -101 138 8 -188 -94 2 172 -64 163 273 -45 39 80 228 -25 -96 -65 -9 -36 -74 149 53 -106 -24
5861b4J03l6j04J14j43o8J24J46o6k35K07J19o3j44J52K2n0j34J70m3o1j97M63
$$ -24 79 43 -61 53 -90 -158 -34 112 46 -189 18 137 74 -70 82 104 54 -80 90 47 -14 -211 252
5884B52j57k70J60R7Q0k97J51J58j86j74j4M00l46O1N1nj44L3P2n1J02j05M13
$$ 252 95 -175 -15 82 162 -135 16 174 -12 -186 -200 200 -146 -85 -34 -39 -183 -150 -78 -129 -27 -132 281
5907B81k20k96J05K34m0k17J73L29l57l41L81J77l07r6K53K9k46J19K49j92j66
$$ 281 61 -235 -130 104 64 -153 20 349 -8 -349 32 209 -98 -194 59 88 -158 -39 210 18 -148
5928a48J13J03L8l43K27K59k48j71K75P7k54j16L85m6k98K47M8m5l24L00J49k90
$$ -148 -35 68 106 -237 -10 249 1 -170 105 182 -72 -188 197 151 -147 100 148 103 -221 79 228 -62
5950f2K4K20o5j79p1J51J86m01n4L76jk28%K72k15k70L29J32j45k06K34J0j07
$$ -62 -38 182 117 -62 -133 18 204 -197 -251 125 124 -104 -104 168 -47 -317 12 144 -1 -207 27 37 -70
5973g0j21K11N0j86N4K25j23k90J43L59k49j56J17L43l25j0M8L8k76J7J48P9j38
$$ -70 -191 20 70 -116 -62 163 40 -250 -107 252 3 -153 -36 307 -18 -28 20 58 -218 -201 -53 26 -112
5996a12J34Q7P6k47j12L44k18j65K73O2j91j39L88j0l06J62k3k8k42K44K70k01
$$ -112 22 109 185 -62 -174 170 -48 -213 60 122 -69 -208 180 170 -136 26 3 -25 -267 -23 247 46
6018D6k74K64M5o1k19L90r9k27J13K0J96k56j5J46Rj74L6J31M9k39P9K39k34r2
$$ 46 -228 36 81 20 -199 191 92 -135 -22 -2 194 -62 -77 69 78 -96 -60 71 120 -119 -40 199 -35 -127
6042a27J55J64k07JK01l5l38J01K34j23j03%J87k92J16N3J32k20j11M08j21j32
$$ -127 28 192 -15 -14 187 152 -186 -85 149 26 -77 -77 110 -182 -66 -13 119 -101 -212 196 75 -57
6064e7N8J94j47j55M9J06j28j34K15J77j82j83L25Rk53k0M28j65j06j59L80j07
$$ -57 1 195 48 -107 -58 48 -80 -214 1 178 -4 -187 138 147 -106 -126 302 137 31 -128 252 145
6086A45k76j51L16J25k92j5K37j28o1J41J58k76m1J99J8k33J0K53q4k94L08j31
$$ 145 -131 -282 34 159 -133 -148 89 -39 -100 41 199 -77 -118 81 99 -134 -124 129 45 -249 59 -72
6108g2O3j1N2M3j55r4L34P6j52j09l6Qj04K8K10P1j74N7Q6k86J5J01J3j16K44
$$ -72 -9 -20 32 75 -80 -174 160 236 84 -25 -61 -53 -157 -129 81 152 -22 35 121 -165 -150 -49 -36 -152 92
6133I2o5R6j39p0K63l0n0k01J21j3l8J7Kl7OJ05J19j94J45k29NJ26m5j42K71r8
$$ 92 27 123 -16 -86 177 147 97 -104 17 4 -34 -17 -15 -52 -46 59 178 -16 129 -100 -95 31 -14 -156 115 17
6159A7j20K78m9k78J47N9j6l3m3j42J72l4qJ7j69Q1K34k6l9l9O3o5J2J7j4K5q6
$$ 17 -103 175 126 -152 -5 54 38 5 -38 -180 -8 -42 -50 -33 -202 -121 113 87 48 9 72 7 19 36 22 47 -39
6186c9J4J11J4j77j7R1O8J1l6R7j66q4R8J59k07Q4m5Q1j11j44M00l05K09j77J17
$$ -39 -25 86 100 -77 -94 -3 65 76 40 137 -29 -113 -15 144 -63 21 -24 57 -54 -198 202 -103 106 -71 46
6211D6R2k24M3P9j19J42j30J34N0q5j20J16K5j63K7N2J34j74K00Nk84J06pJ47
$$ 46 138 -86 -43 36 -83 59 -71 63 113 28 -92 24 49 -114 -87 -35 99 -75 125 130 -154 -48 -55 92
6235I2k9k61J76M0J30l52L59p8j63J21J12J7k55m0J56Jj17J49R9j52j71J27M8
$$ 92 63 -198 -22 18 148 -204 155 77 -86 35 147 164 -91 -131 25 26 -91 58 157 5 -166 -39 9
6258Ij4j53L10k3j50l0O8K01l92K37K2j16k1O1J57k29k43K95J58k34K0K32Q0l78
$$ 9 -5 -158 152 129 -21 -51 17 218 -174 63 85 -31 -52 9 166 -63 -306 -11 147 -87 -67 165 245 -133
6282a33o1K95r9j36J63k1j5j57J16J68j31k43J57L66k81J0J36j22k12J47J23l5
$$ -133 -194 101 2 -134 29 8 -7 -164 -48 120 -11 -254 -97 269 -12 -2 134 12 -200 -53 70 35
6304C5j55J08J68m6j76K7J35p9j86J15L8j74j5M18k03k81L71Jmj48j01K50k1j12
$$ 35 -120 -12 156 110 -66 -39 96 17 -169 -54 -16 -190 -205 213 10 -271 100 101 97 -51 -152 98 77 -35
6328c5J09m0p2j46J10J52k68J6L03k0j64k3J45J24m43L20P9j97r0K53k7k00J75
$$ -35 74 34 -38 -184 -74 78 -190 -174 129 109 -55 -78 67 191 -252 68 147 -50 -140 113 86 -114 61
6351F1O2j18L2p3Q3j5j29p6L04K4l31J61J17j24j36K72L1k82M7R4O7n2k4Q5q6
$$ 61 123 5 37 -36 47 32 -97 -173 131 155 -176 -15 102 -22 -158 114 145 -137 -90 4 71 19 -5 80 -6
6376fj49K49k8l7j16KL35l35j8Q1J47k41K6K05J3j28j05J95L9k00j2K48k74j03
$$ -6 -155 94 66 29 -87 -85 250 -85 -103 -22 125 -116 -90 115 128 0 -105 90 129 -71 -83 165 -109 -212
6400b12K43Q6j52k06K72L8k40J15L4J82l20l2L02P5j52p8J88k28Q8L4J68k32j63
$$ -212 31 117 -35 -241 31 69 -171 -56 -22 160 -160 -192 110 185 33 -45 143 -85 3 37 205 -27 -190
6423a90L58j48k07qK46k1j76P1K14j33R5p7Q3j66J0P7K10m53J11J17J57l07M1
$$ -190 168 20 -187 -195 51 30 -146 -75 139 6 101 24 107 -59 -49 28 238 -215 -104 13 170 -137 -96
6446i6K06k14K4Q1J56j00j29L4J86m0k82K18Q4p1q3j71K59k40K43J01j46n0P5
$$ -96 110 -104 -80 1 157 57 -72 -38 148 108 -174 44 128 57 -26 -197 62 -178 65 166 20 -30 45
6469D5l9N7k04J78n0O3l73L25rj56J33J18Q2j61r0J58jj71N5O9k6o9k0J21J4k92
$$ 45 6 63 -141 37 -13 50 -323 2 -7 -163 -30 88 170 9 -81 77 76 -95 -40 29 3 -66 -86 35 49 -243
6495b43L06P2k56r3K42Rj32J12K3j77n1J42J60j30q4J84R4q3l62L51j77j55K22
$$ -243 63 135 -121 -214 28 37 -95 17 40 -137 -188 -46 114 -16 -100 84 178 95 -267 84 -93 -248 -26
6518b6o6L42k54n6P1J21j72j50K07j7QL3J06k19P8O1J13j89jO8K1j61K35j42n0
$$ -26 -92 250 -4 -60 11 132 -40 -190 17 0 8 41 147 -72 6 67 180 -9 -10 58 79 -82 153 11 -39
6543c9r0K19M6r8j18K40j1m9j58Q3L6Kj97M1K68k45R9j28K56k27K38j13r0j16
$$ -39 -129 90 136 38 -80 160 149 100 -58 25 61 63 -134 -93 175 -70 29 -99 157 -70 168 55 -35 -151
6567a51K32l4o2o6JK6Q3Q1j94J68j65J56j01p0J92k38N8K05j06n8j66J78q7K22
$$ -151 81 47 -15 -81 -80 -54 29 110 -84 84 -81 75 -26 -96 96 -142 -84 121 15 -43 -209 -31 -118 104
6591A04j31LQ5j71J28N8j26r1lJ29j11Q4K3r6M9J91L4J6j67J44r1j2l3j23J42
$$ 104 -27 -24 61 -110 18 76 -50 -141 -144 -15 -126 -42 -19 -115 -66 125 159 175 8 152 61 49 16 -107 35
6616C5j39J0J84R1j64O4J4p2O4j46j22K99j69N8J68j93j46J93Mm9O4oJ8j1M9p5
$$ 35 -104 -94 90 181 17 81 95 23 87 -59 -181 118 -51 7 175 -18 -164 29 33 -16 48 42 60 49 98 23
6642B3M3o4L9P2l4j41J31L4j29n7Q7L8o1rj9j19J70j05J93J29k58Q8J20k06l8
$$ 23 66 2 41 113 79 -62 69 103 -26 -83 4 42 -19 -28 -47 -166 4 -101 92 221 -37 51 171 -35 -73
6667g3MK31l17L6J5K13k49R6K34Ql64K29l2N6m4J0Kn2j70Q9Q4O1n8O3J49l47M
$$ -73 -69 162 -155 -119 -104 109 -140 -44 190 198 -166 63 31 87 43 53 55 3 -167 -78 6 67 9 72 221 -126 -122
6694a22J8L11k74j21K95r8k55K40J3J49k19J02J16r9j16K7R7r7k4K27k67j7j21
$$ -122 -104 207 -67 -188 107 9 -246 -6 7 156 -63 39 155 56 -60 -33 64 -33 -57 170 -97 -114 -235
6717b35J53L06k21L3l2kj37J62K28m54P5L2J05j34j04K60K47m00J50Q3l3k14n6
$$ -235 -82 224 3 36 4 2 -135 27 255 -199 -124 -92 13 -121 -225 35 282 -118 32 115 82 -132 -188
6740a88K32m8j25L14j60k04p6L05L7j40n5J14J76k34j09L71j75p1o1J37J31l89
$$ -188 44 -4 -129 185 25 -179 -255 50 87 -53 -108 6 182 -52 -161 210 35 -36 -97 40 171 -218
6762b18J05J94j58M2R6j5r3j03L94k10j65k1K38j06q1J26P9j28j75K58K07j76
$$ -218 -113 81 -77 -35 61 46 -47 -150 244 34 -131 -152 86 -20 -101 25 104 -24 -199 59 266 90
6784I0k45J43K08j57m1J78pk02n5J28Q2j86P6J25l4j92K59j26J7j98J07R3k66
$$ 90 -155 -12 196 39 -2 176 169 -33 -88 40 122 -64 12 137 103 -89 170 44 61 -137 -30 63 -203
6807b03J54Q8m8j30J89K04k74j87K12J71k29k9K26k9m8n0J40j99k49lM78o0l2
$$ -203 -49 39 -9 -139 50 254 -20 -207 5 176 -53 -82 144 115 67 17 157 -42 -291 -294 184 124 92
6830I2k61K14m1j41J75M7j32l1J16J07j8j33J7Q2j16j68K28p7k72L37P5%k12K78
$$ 92 -169 45 4 -137 38 85 -47 -78 38 145 127 -6 11 93 -23 -191 37 -40 -312 25 100 100 -112 166
6854A66j11r7j07M09k8j80j98K20N9k62K30N7j18p0N5O8k14k5J82j2q5q5K62m6
$$ 166 55 -42 -149 260 232 52 -146 74 133 -129 101 158 40 -30 25 93 -121 -146 36 24 -61 -146 116 70
6878G0j28l7K50j21L0j14M6L4k15J75J7M7j78L24j21j65N3n5J34j56J14J52j28
$$ 70 -58 -95 155 34 64 -50 -4 30 -185 -10 7 54 -124 200 79 -86 -33 -88 46 -110 4 156 28
6901B8n4Q3K1r0j06J61L2j7Rp4l7K8R4m4o5l5J72j27J30j61J4K39k35l1J69j41
$$ 28 -26 57 78 -12 -118 43 75 58 67 -7 -44 -16 78 34 -31 -66 106 -21 109 -52 -38 201 -34 -65 104 -37
6927c7J04j72K29J00k02j62M5N9O5n0j25K15n1l2J69p3j76k5K37r2p8j69K89j04
$$ -37 67 -105 124 224 22 -140 -95 -36 29 -21 -146 69 18 -14 155 82 -94 -119 118 26 -52 -221 68 -36
6951c6M7M9K8k02J44P3k25J22M9J73p6l22K36j56o7M6K20k47J67q2R4j8p5J08
$$ -36 11 60 88 -114 30 103 -122 0 49 222 146 -176 60 -96 -163 -117 103 -144 23 -59 35 17 -58 50
6975E0k05P5J38K9OM1J2j8k0j01l13J26K57J0j20p0M8J16r0J18n3P7r0n0j9k4
$$ 50 -155 -80 58 87 93 134 146 128 108 7 -306 -180 77 87 -33 -103 -55 61 -29 89 36 113 23 -27 -46 -70
7001g0j8Q0k5N8J0r0J17K8n4J9m2j19N6L3p6K12j31N6n1N1P1M0j25o3O4K4nj29
$$ -70 -88 -8 -33 25 35 -55 62 90 36 55 13 -106 -50 -17 -93 119 -12 44 -7 44 115 155 30 -33 31 55 50 -79
7029g9k8J61n7m9Q3N1o8K7o2N0p3l7K68o9o7j30P2p9p6J67K63j90j63K98j88m4
$$ -79 -107 54 -3 -52 31 82 14 41 -21 29 -44 -81 187 118 51 -79 -7 -86 -162 5 268 78 -85 213 25 -19
7055a9k15K72O7k23m6K11k25J37q6J80j05l5q7M68l04k58J99Q4k51R5K03K6q8
$$ -19 -234 38 105 -118 -164 47 -178 -41 -127 53 -52 -87 -174 294 -10 -268 -69 15 -236 -141 62 88 0
7078@r3R9L6j51n8M36l19JJ32%j08q5K25j44j84J67JL7j17J72Q6r0lM4k0J18l88
$$ 0 -93 6 42 -109 -167 269 -50 -49 83 83 -25 -110 115 -29 -213 -46 -45 -8 -125 47 133 43 40 84 64 182 -206
7105b06L37K5l63p5K02J10j43j66L13K8o8r0K08q4j16m9K36J6l07J45K19k50m
$$ -206 131 156 -207 -282 -80 30 -113 -279 34 62 -6 -96 112 28 -88 -137 99 115 -192 -47 172 -78 -82
7128h2K27p2j29oO2J32l06K21Pl02K07n6J43q0Q2N4M5r9j37J48J6j7j43K71k0
$$ -82 145 73 -56 -62 0 132 -174 47 54 -248 -41 -97 46 -34 48 102 147 48 -89 59 75 58 -85 186 166
7153A66j92J79j9j15m9L2M6p8q9J16J16j88J1J84m0k10R9j5O8k9k2J31J0j88J60
$$ 166 -26 153 134 19 -30 2 48 -30 -119 -3 113 -75 -64 120 80 -130 -31 -46 22 -7 -29 102 112 -76 84
7178H4p9m0j31K67J11l47K08j20J10j91M9J68j79N9r5L43k53n7l8J69l8j71J02
$$ 84 5 -35 -166 101 212 -135 73 -47 63 -128 -79 89 -90 -31 -126 217 -36 -93 -131 38 0 -171 -69
7201f9K40l97K31N6K04j67j36L8q3J19RN7j90r0R3L11k93N9J7J26j92j51K85J0
$$ -69 171 -226 5 61 265 98 -38 0 -83 36 45 102 -88 -178 -85 226 -67 -8 9 135 -57 -208 77 87
7225H7j42n7K32m6o8m1K40j54k2j2M8k82L5K07p5J21p9R3m9q8P7J60j64j33K78
$$ 87 -55 -112 120 74 6 -35 205 51 29 17 65 -217 -182 25 -50 71 -8 85 36 -52 25 185 21 -112 166
7250A66j35r5J5J97q5j80n1J84L9j64O9J19O6j63J15O6m5j31j35L33j37n7J39
$$ 166 31 -64 -49 148 63 -117 -168 16 55 -109 -40 79 145 -18 97 163 118 -13 -148 185 48 -9 130
7273A30j34o9J06m8N4j13l2O5J31q0m6Q7j08M3p8J96j49R8J9n1k6J4O2j32j32
$$ 130 -4 -73 33 -15 39 -74 -106 -41 90 10 -36 51 -57 -14 -92 104 -45 53 72 21 -5 9 71 -61 -193
7298a93J56l0J69j55l2J8J76j76O4K56k81j26K26M1j24k6K09k91K0M0l4l9K02
$$ -193 -37 -67 102 -53 -85 -67 109 -67 -3 253 -28 -154 72 113 -11 -37 172 -119 -99 -59 -93 -132 70
7321G0q5J63j65n6Q2R9q0O0O0q8j13L7k04K55j90K59P1l10K7J27l9m7NK26j46
$$ 70 -15 148 -17 -73 9 108 28 88 148 60 -53 -16 -220 35 -155 104 175 -135 -108 19 -20 -67 -62 164 18
7346A8kO0n0O6j93l6K37j05n3l0K31p5j23oJ1Q1q7j40K46R0rj34j0j24J55j58
$$ 18 16 76 26 92 -101 -137 100 -5 -58 -88 143 68 -55 -61 -50 31 -56 -196 50 140 131 -3 -13 -137 18 -140
7372a40J66L2k9j8k9L5j55M4m4nJ92j19J46j2o4K9R4o5j81J58j07p0K16K7j3j66
$$ -140 26 58 29 11 -18 17 -138 -94 -138 -143 49 -70 76 64 0 29 123 58 -123 35 -72 -142 74 101 88 -78
7398g8%K32k09J85o5j14j9k2J90JK1n7q5J34j19j01J69N2q5j2L0P6o1r6J54l3
$$ -78 -78 154 -55 130 65 -49 -68 -90 100 101 122 65 -20 114 -5 -106 63 115 30 18 48 124 63 -33 121 88
7424H8J3j28Q5J0j59kK07j24q6J35n1j4k44L67r7j19O3J43k0k59K78m1j48n9K70
$$ 88 101 -27 58 68 -91 -93 114 -10 -96 39 -12 -26 -270 97 0 -119 -56 87 67 -192 86 45 -103 -162 108
7449A08j55J24j69Q4K7K4Q1j98O3r2J93j83O9L0q3K19k80J25J64o8j29K15j56
$$ 108 -47 77 -92 -8 19 43 124 -74 -11 -103 90 -93 -24 6 -77 142 -138 -13 151 83 -46 169 13
7472A3o8P1j74J49L7j71J82L2L8j89lL27l23J48k3k0m5rJ18k1k37O1j4Q4l0J88
$$ 13 -55 16 -158 -9 28 -143 39 71 109 -80 -83 244 -79 69 46 26 -19 -28 90 69 -168 -107 -121 -37 -67 121
7498A21Q1j33j65P1N7j9o1Q7Q3k46K35l4m2j38J24J08j24m5Q4mQ3j57J08N5j15
$$ 121 202 69 -96 -25 32 13 -48 39 122 -124 111 77 35 -103 21 129 5 -40 44 40 123 -34 74 129 14
7523A4j73J13L5j28Q3J10q2J2j20L65k25q6m4J50j59n2K36O6p2j55J12m9oN6J97
$$ 14 -159 -46 -11 -139 -56 54 -28 -16 -136 229 4 -82 -126 24 -135 -187 49 115 43 -112 0 -49 -55 1 198
7548A98j76j34L12J0k53n4o3N7N8j50L03j80Kj17K56j02n9j7J11p8J59j90J52
$$ 198 22 -112 200 210 -43 -97 -160 -103 -45 -195 108 -72 -70 -187 69 -33 -92 -109 2 -76 83 -107 45
7571D5N8j69J92J2l03J86qK43k98n5K17j69n2m4N0J29j12N4O4lj52N6J14M3k71
$$ 45 103 -66 126 138 -165 21 13 256 -42 -97 120 -49 -101 -145 -95 34 -78 -24 40 37 -115 -59 55 98 -173
7596a73K61r7j16mK61J02l11j9K71j17j80J21J87k03j42K81j26J7k8O0J43l50
$$ -173 88 -9 -125 -129 132 234 -77 -96 175 58 -122 -1 186 -17 -159 122 -4 13 -15 45 188 -162
7618a62j4K11k0kk6j0O7p7o9K32j15j80K32J04j67j56K88M3j5j97P4j2J13q5j29
$$ -162 -176 35 15 13 -13 -23 44 -33 -102 130 15 -165 67 171 4 -152 136 179 164 -33 41 29 142 57 -72
7643g2m6m0K41n1j29p8J75M7k3j05O7L2j57J11R8j9j34J70J04j68L4n9j02R1M
$$ -72 -118 -158 83 32 -97 -175 0 47 24 -81 -14 18 -139 -28 70 51 -83 87 191 23 57 -2 -104 -13 -9
7668iR2L6j57k7J51Po4J7r9J36n4k04K78j81l0K3K92l51JJ06j5O3L4J14k7j14
$$ -9 83 119 -38 -65 86 93 29 46 -53 83 29 -175 103 -78 -108 -85 207 -144 -143 -37 -52 11 45 159 132 18
7694A8K0K9J5j43o7K14k39J25l5L6n0L2L9j0Mm8LR2j75K88p1o7j40J62qM1l9k15
$$ 18 38 67 82 -61 -128 86 -153 -28 -63 -27 -77 -45 -6 -16 -12 -60 -57 35 -140 148 77 10 -130 32 24 65 26 -189
7722a89K57r2j71K40Q4k9r6l9K22r1j78P2M8p5RK09k43M6M8r9mm2J43m6m2J07
$$ -189 68 -24 -195 45 129 100 4 -35 187 96 -82 -10 38 -37 -28 181 -62 -16 32 -67 -71 -113 30 -16 -58 49
7748D9r1J27o6o1j39Q7J45j16R5j47L52k37J94n3j62n4R6j17L0J37j62J83J4j06
$$ 49 -42 85 19 -42 -181 -94 51 -65 30 -117 235 -2 192 139 -23 -77 19 -98 -68 69 -93 90 104 -2
7772bolo4J33p1p7O6j41N9O7l1K0Q8J2q4J21k6j6k7j08J1J0o1K86k75J01j35R2
$$ -2 -8 -11 -75 58 -13 -90 -24 -165 -106 -39 -70 -50 38 50 -34 87 61 45 18 -90 -79 -69 -130 156 -119 -18 -153 -61
7800f1j2J17M2j16k1L0K2J60j63m5Nq9J63j83N0J63N3k11K16j03n5N1k5m8R1j29
$$ -61 -73 44 86 -30 -51 -21 1 161 -2 -47 -42 -131 32 -151 -101 62 115 -96 120 17 -38 13 -12 -60 31 -98
7826i8R9J26j43p4K11k32J31q1j1J72k66J36q6J62k41L58n5k65J79K0R2j86pJ48
$$ -98 1 127 -16 -90 121 -111 20 -61 -72 100 -166 -30 -116 46 -195 163 108 -157 22 42 134 -52 -59 89
7850H9r4j30K76r4O7p9K53k87j99K29O9mj62Q2K0j55K10J10j02j84N8k9J9Nj24
$$ 89 -5 -135 141 47 114 35 288 1 -198 31 100 96 -66 16 36 -119 91 201 99 -85 -27 -56 -37 -32 -156
7875a56J19o4j2J3J61J95l29J28K2k56J07J92r2k23P7J73q7N1J37j12q3Q8j8N8
$$ -156 -37 -101 -113 -100 61 256 -73 55 77 -179 -72 120 28 -195 -118 55 -32 19 156 44 -39 49 31 89
7899H9j1n4J99l7k46K2M9k9o5k3K69j76J12j38J04k15L9kJ53j33o4J94M8r0j26
$$ 89 78 24 223 186 -60 -38 11 -18 -83 -106 163 -13 99 -39 65 -150 -111 -113 40 -93 -157 37 85 -5 -131
7924a31J62J13k25J48O1k22J4J36J32l61K00l9j09R9j6K56j52q7L9O1j34k3K22
$$ -131 31 144 -81 67 128 -94 -80 56 188 -173 27 -12 -121 -22 -38 218 66 -21 18 79 -55 -78 144
7947A44p9pk77K71j35R0n3J4R7L3K6q7j11LM0K12j01l5l5P8r0Op9M4J16k02J26
$$ 144 65 58 -219 52 -83 7 -46 -32 65 98 124 37 -74 -71 -31 181 80 45 10 88 -2 4 -75 -31 85 -117 9
7974IL5j18m9J81n2k00K64j10O6q9q3L30k42R2j8l3N8q0J17M2j78M1R6kk15nK12
$$ 9 44 -74 -123 58 6 -194 70 -40 26 -63 -146 184 -58 34 16 -17 41 -39 78 120 -58 -17 79 77 -138 -143 69
8001F9o1j58J02j5p1Q5N4p2N7j07N2K80m16J68J99k14O5n2n0n8J88j52J26j30
$$ 69 8 -150 -48 -63 -134 -49 5 -67 -10 -117 -65 215 -201 -33 166 -48 17 -35 -85 -143 45 -107 19 -111
8025a11l5L32j15j27n9J59R6k77K52j58M7j12k8J15r1J13J46j7r5j5km1L0p2J2
$$ -111 -146 186 71 -56 -115 44 140 -137 115 -43 4 -108 -136 -21 -112 1 147 130 35 20 18 -23 7 -65 -53
8050e3R3j25m9J41j5k7N6r2p8P2N8j4J48j29l6J0P7j5J22J9l5m8j2Kj66Q7J16
$$ -53 40 -85 -134 7 -8 -35 21 -71 -149 -77 -19 -33 115 -14 -50 -40 37 22 144 163 128 80 68 70 -96 -9 107
8077A07k1n0n6O4m5J01j51K14j05j97K58k5j79J32R5R0l18p4J55J1RJ14j86N6
$$ 107 86 36 -20 44 -1 100 -51 163 58 -139 119 94 -85 47 142 232 -86 -160 -5 6 15 129 -57 -1
8101aM1j0J26k07R7j06J15J06j44L8o3j10J50j07K5J1R4n8m8K2m5Q9O8j11m0M4
$$ -1 40 30 156 -51 46 -60 55 161 17 55 -8 -118 32 -75 -50 -39 55 -3 -51 -29 -74 15 83 -28 -68 -24
8127b4k9P0N4k33L1J80j96K40j23L7lk6J4M5o3N2p1N1n5J29j8m1q7j8N6R1j51
$$ -24 -53 17 71 -162 -131 49 -147 93 -30 7 4 -22 -8 37 -26 26 -45 6 -49 80 62 21 -66 -84 -28 63 -88
8154h8J77j17J04o6m6MkM4p5J35j16%J10j17K2J09J35k09LM1j33K35l1k00J5P6
$$ -88 89 -28 76 10 -36 -32 -34 10 -65 70 -46 -46 64 -53 -31 78 213 4 7 48 -85 150 119 -81 -66 10
8180A0O5L0k4j22Q3o0k6j1Q6J07m3
$$ 10 75 105 81 -41 42 -18 -44 -55 31 138 95
8191I5
$$ Imaginary data points
##PAGE= N=2
##DATA TABLE= (X++(I..I)), XYDATA
0@%%%%%%%%%qJ6j6J6j6K4l2M0m8N6p2Q8j04J20j36J58j83K09k41K77l15L56m03
$$ 0 0 0 0 0 0 0 0 0 0 -8 8 -8 8 -8 16 -16 24 -24 32 -40 48 -56 64 -72 86 -97 112 -129 148 -167 189 -214
32b14M58n16N77o46P21q04Q92r89J096j211J337j474J624j789J968k163K379k617
$$ -214 244 -272 305 -341 380 -424 468 -521 575 -636 701 -773 851 -938 1030 -1133 1246 -1371
50a371K877l167L494l859M270m739N280n911O656p548Q640j0007J1761j4097J7346
$$ -1371 1506 -1661 1833 -2026 2244 -2495 2785 -3126 3530 -4018 4622 -5385 6376 -7721 9625
65I625k2128K9769m3616P5414k49416j03550O33364m33549J60285k59094L05418
$$ 9625 -12503 17266 -26350 49064 -200352 -303902 329462 -104087 56198 -202896 102522
76A02522Q4067m65381L84647j04937J08024k24206K7607L10876l14933N1707n1654
$$ 102522 186589 -278792 105855 918 108942 -115264 -87657 223219 -91714 -40007 -91661
87i1661L03731k64633j60828M31454k62634O7033j39429J99663M7420l38452L06166
$$ -91661 212070 -52563 -213391 218063 -44571 22462 -116967 82696 130116 -208336 97830
98I7830j07247Q9087j82713M2674K57034l36355J65640r4308J76100q0184k36540
$$ 97830 -9417 79670 -103043 -60369 196665 -139690 25950 -68358 107742 27558 -208982
109b08982L92835k21109M3836q3279J07082J12992l53994L12960r9069J1543n0534
$$ -208982 183853 -37256 6580 -76699 30383 143375 -210619 102341 3272 14815 -35719
120c5719k7529K36204l36599K33543q1975q376J22958k78617L29066j77817j5220
$$ -35719 -63248 172956 -163643 69900 -12075 -20451 102507 -176110 152956 -24861 -40081
131d0081P4838p3836J52953k63406K10681k2129j04338Q9402o9028J35240j83788
$$ -40081 34757 -39079 113874 -149532 61149 39020 -65318 24084 -44944 90296 -93492
142i3492J30229j9862n4665J22984k08186K16824r4662m8576P5961o6624J34311
$$ -93492 36737 16875 -37790 85194 -122992 93832 -830 -49406 26555 -40069 94242
153I4242k07521J47581Q388r0189Q6775j03336J72038j73104N1912P9688j24762
$$ 94242 -113279 34302 42690 -47499 39276 -64060 107978 -65126 -13214 66474 -58288
164e8288J29309j72936J63246k8200j23392J44992r5483J08435j26531L4569J05040
$$ -58288 71021 -101915 61331 33131 -90261 54731 -40752 67683 -58848 -24279 80761
175H0761j26425N3283m5260J18205j14767k3529J32801j12364P0491r9735R2335
$$ 80761 -45664 7619 -37641 80564 -34203 -57732 75069 -37295 33196 -66539 25796
186B5796L3222j35617J01679l8775P2848r3614j2991J33009j03458j18j3069J03488
$$ 25796 59018 -76599 25080 -13695 59153 -34461 -47452 85557 -17901 -18019 -31088 72400
198G2400q3220o7992J43257p5304K4176o7848O4985O3068j48175Q2848O66K7855
$$ 72400 -10820 -78812 64445 -10859 13317 -54531 10454 73522 -74653 8195 8861 36716
210C6716n7865l5840J34590q6434k8993K1065O7074m5664p9824J24402l8010j3075
$$ 36716 -21149 -56989 77601 -8833 -37826 -16761 50313 4649 -75175 49227 11217 -1858
222a858k5880L0838O1300j16055N0513J8761l562k1872l5334R0718n0101k1822
$$ -1858 -27738 3100 64400 -51655 -1142 17619 14057 -7815 -43149 47569 -2532 -24354
234b4354J4070L2680l841p1114Q1506j7834j8538K293p300N2397p2313K7830J9866
$$ -24354 -10284 22396 18555 -52559 28947 11113 -7425 -5132 -12432 39965 -32348 -4518 15348
247A5348k7366K3153l5278L5988j739k0535P683O533J4671l6352K7766m859j0358
$$ 15348 -12018 11135 -24143 11845 10106 -10429 -2746 3787 18458 -17894 9872 5013 -5345
260e345J7496k7549K5998j7174N652O425k4971L7975k3179p427K0952k799m193
$$ -5345 12151 -15398 10600 -6574 -922 5503 -19468 18507 -4672 -12099 8853 6054 1861
273A861j6187K4326j526j5939k124R270J6023l2896J0019J6116o725l404j4182
$$ 1861 -14326 10000 8474 -7465 -9589 -319 15704 -17192 -7173 8943 2218 -1186 -15368
286a5368L7417j2289l2778L2554Q743k1430j5732K7483P680l1635M315J8252N099
$$ -15368 22049 9760 -23018 9536 18279 -3151 -18883 8600 16280 -15355 -11040 7212 12311
299A2311k7567O628K7596k0143n910L600J8012j0203k7861L2629L101k4481n51
$$ 12311 -15256 -8628 18968 -1175 -7085 -3485 14527 4324 -23537 9092 12193 -12288 -12839
312a2839J9584N522k9889J1599K2763j4091j5750J5982J8339l0493P14J8692k618
$$ -12839 6745 12267 -17622 -6023 16740 2649 -13101 2881 21220 -9273 -8559 10133 7515
325G515j1915j2891L1952m812l1108J7507J9414j1116k4711K1541K2728l1228
$$ 7515 -4400 -17291 14661 9849 -21259 -3752 15662 4546 -20165 1376 24104 -7124
337g124j2396L0290R312l8707K371L4260r756k8265N131M0731k0338l4800L3225
$$ -7124 -19520 10770 20082 -18625 -16254 18006 8250 -20015 -14884 25847 5509 -29291 3934
350C934K1854k5201k5471L1133K6796m4750j7075M7664N655m9105K759M6964q779
$$ 3934 25788 587 -24884 6249 33045 -11705 -28780 18884 24539 -24566 -21807 25157 16378
363A6378m6221J5898M8630k6095m0924K9518L8339l3903l9653M2810K9238m4869
$$ 16378 -29843 -13945 34685 8590 -32334 -2816 35523 1620 -38033 4777 34015 -10854
375a0854k7561N2012J9399n8227k409N2531L766n7342N635O4580k5444n2929K6742
$$ -10854 -38415 13597 32996 -25231 -27640 24891 28657 -28685 -23050 41530 16086 -36843 -10101
388a0101N0724l5652m8645M6242L3033l7778m2884N7533L3265p3514P26N0068
$$ -10101 40623 4971 -43674 2568 35601 -2177 -45061 12472 45737 -27777 -27051 23017
400B3017J0907o1617p479Q1020l2709n2892K5334N0961k5160o2256N5062L3849
$$ 23017 33924 -27693 -35172 45848 13139 -39753 -14419 36542 11382 -50874 4188 38037
412C8037m0775l8001N0536M0305p9535O020M3981Q238m7760k1954Q8317l6212
$$ 38037 -2738 -40739 9797 50102 -29433 -23413 20568 28806 -18954 -40908 47409 11197
424A1197n0685L3654L5180j5101o1462N6378K8205m7373j9042L6310L5794p3465
$$ 11197 -39488 -5834 29346 14245 -47217 9161 37366 -10007 -29049 7261 43055 -30410
436c0410P257M6667p556l6928j1531P5581m0109l8322L7738K4788j7874n4179
$$ -30410 -23153 23514 15958 -20970 -32501 43080 2971 -35351 2387 27175 9301 -44878
448d4878O6957O261m4919k130K3684L7297q4904L1009M4328l8855k89k1154P2607
$$ -44878 22079 28340 -16579 -18709 4975 42272 -42632 -11623 32705 -6150 -6439 -27593 45014
461D5014m3420m3687O8132j2285j1646l8850N6365Q571o2828K7461J4903K0262
$$ 45014 1594 -42093 26039 13754 2108 -36742 19623 28194 -34634 -7173 7730 27992
473B7992o6749K8367N1654n6775Q374r022N7338m3493m1813P7847k6691o495l4765
$$ 27992 -38757 -10390 41264 -15511 -7137 -16159 41179 -2314 -44127 33720 7029 534 -34231
486c4231N0928J6984p4788M1334O531K2394o0342J1390P4427p6491J4254j521
$$ -34231 16697 33681 -41107 227 6758 29152 -31190 -19800 54627 -21864 -7610 -9131
498i131L6035j5756o3944Q2228j7721j9144k0071L4020L2122p8522L5443J8192
$$ -9131 26904 11148 -52796 29432 11711 -7433 -27504 6516 38638 -39884 -4441 13751
510A3751J0329m8303N27P6813o9756N740J319L0938l599p2474P8350p973j9729
$$ 13751 24080 -24223 -23696 53117 -16639 -10899 -9580 21358 17759 -54715 23635 15662 -4067
523d067j8824K3412M4812p7959K6984J3664J7886l8780k6335Q7558n8478j620
$$ -4067 -22891 521 45333 -32626 -5642 8022 25908 -12872 -39207 48351 -10127 -11747
535a1747m655K8382K0582q9330P4621J139j9729j5330L687O4389q4752K2637K0155
$$ -11747 -16402 11980 32562 -56768 17853 18992 -737 -16067 -12380 52009 -32743 -10106 10049
548A0049L675j1571n1805R7643m6982k5592K7376J540K8364p9285N6874K0306
$$ 10049 13724 2153 -49652 47991 1009 -24583 2793 4333 32697 -46588 10286 30592
560C0592m7501Q839J863L9804n4529O750K3743K358j3177l8782Q0543m3093j7436
$$ 30592 -16909 -8070 -6207 33597 -20932 -14182 9561 11919 -1258 -40040 40503 -2590 -20026
573b0026K7024q808K8465o5009N1789N946l6479K0757j8781M8766n5702R317L3299
$$ -20026 6998 -1810 26655 -38354 13435 19381 -17098 3659 -15122 33644 -22058 -12741 20558
586B0558k7087J5157l9771O7671l6465l0660O1923m2368K4857l5631K4120K6615
$$ 20558 -6529 8628 -31143 36528 63 -30597 31326 -11042 13815 -21816 2304 28919
598B8919o3082L6923K378L340k3896P176L2713l3156K825K725K7347l7048k567
$$ 28919 -34163 2760 5138 8478 -15418 -8242 24471 -8685 -5860 -3135 24212 -12836 -15403
611a5403L8811l2654J2568k1575L1621j983l8520M1557j4173J0263k6787J8510
$$ -15403 23408 -9246 3322 -18253 13368 11385 -27135 14422 249 10512 -16275 2235
623B235K2773m8891L2631j3480J6600j6809j5833M6548l9275J6980j3900J4370
$$ 2235 25008 -23883 8748 -4732 11868 -4941 -20774 25774 -13501 3479 -10421 3949
635C949J3577m5211M2745j5678N371j1999O10L1935m9950L3831j0302j999J5361
$$ 3949 17526 -27685 15060 -618 4753 -7246 -6636 25299 -24651 9180 -1122 -3121 12240
648A2240l6002M2534k1621l765J4773j3980J4917j5151J0348l580j167J07M85
$$ 12240 -23762 18772 -2849 -6614 8159 -5821 9096 -6055 4293 713 -454 -347 138
661A38J030j0319K2821k7955J3938J1047k2792K1737k2124K4440o623k2647K9229
$$ 138 1168 -9151 13670 -14285 -347 10700 -12092 9645 -12479 11961 5338 -17309 11920
674A1920j0871J981j7623K1109M454k7555J8510k654J5741k9818P070L2336l2929
$$ 11920 1049 3030 -14593 6516 10970 -16585 1925 -729 15012 -14806 -7736 24600 -8329
687h329P275o195K1508p157l1420L3993j689j1154j2841K2493P661k9281J1780
$$ -8329 -1054 -7249 14259 7102 -24318 9675 7986 -3168 -16009 6484 14145 -15136 -3356
700c356O931J3278l1172K529L5162k6392m046k329K4568r943k8455K9818L935
$$ -3356 3575 16853 -14319 -11790 23372 -3020 -7066 -9395 15173 5230 -23225 6593 10528
713A0528j0270j8860K7801P881l2715J4412L436J5591k9463m229M0214k9114k136
$$ 10528 258 -18602 9199 17080 -15635 -1223 2213 17804 -11659 -15888 24326 -4788 -6924
726f924k23J5858j74k9206K5940L873r317j1478J4660J1834k4294N655L324J3215
$$ -6924 -7147 8711 8537 -20669 5271 9144 -173 -11651 3009 14843 -9451 -3796 -472 12743
740A2743j9247p877K9321j7153k60m609J2543M340k3221J5880M216p60j6954J0804
$$ 12743 -6504 -14381 14940 -2213 -2473 -7082 5461 9801 -13420 2460 6676 5916 -11038 -234
754b34J5055k3594O122j273J4307j2412j4517K9842j2629l871k880J1496N629
$$ -234 14821 -8773 -2651 -3924 10383 -2029 -16546 13296 667 -3204 -6084 5412 11041
767A1041k5416J5867N868l607j5400Q932J7413k3901M544L234J1863j2000j4893
$$ 11041 -14375 1492 7360 3753 -11647 -2715 14698 -9203 -4659 -1425 10438 -1562 -16455
780a6455L3734j4189j1008N312J0602J457k6324J7947J0001j1046j3799J2832
$$ -16455 17279 3090 -7918 -2606 7996 9453 -16871 1076 11077 31 -13768 -936
792i36J9026k9599K884J5487M188j8069q737L6930j6805k0451J3072J6751p660
$$ -936 18090 -11509 -8625 6862 11050 -7019 -15756 21174 4369 -16082 -3010 13741 6081
805F081k9907K6314J4584k1412j3528K2559J8855m0079N341K6816m063k3551n128
$$ 6081 -23826 2488 17072 -4340 -17868 4691 23546 -16533 -11192 15624 11561 -11990 -17118
818a7118M3529k0645l1237K5413J8322j5521k8812L0157J9464l2652j0107K9718
$$ -17118 26411 5766 -25471 -58 18264 2743 -26069 4088 23552 -9100 -19207 10511
830A0511J2211m0803L291L4346q587k9739M250M0071k1429l0186K6075K0862j9390
$$ 10511 22722 -18081 -14790 19556 10969 -18770 -14520 25551 4122 -26064 11 20873 1483
843A483k7047L2640J7164l4662p274K9155R715l9188K466L6083j2191k6020N658
$$ 1483 -25564 7076 24240 -10422 -17696 11459 21174 -18014 -15548 20535 8344 -17676 -12018
856a2018L4031j5458l1706K6344K0064k2394j9799K7084J4550l0687o970K7045
$$ -12018 22013 6555 -25151 1193 21257 -1137 -20936 6148 20698 -9989 -16959 10086
868A0086O329l2440K024L1093j0086k1661O225K6371j1678k6360K3222J3766j9498
$$ 10086 16415 -16025 -14001 17092 7006 -14655 -8430 17941 6263 -20097 3125 16891 -2607
881b607j1465J7019J3451k4149p305K5269j05k1610K939K0193m341j9313P638
$$ -2607 -14072 2947 16398 -7751 -15056 10213 10108 -11502 -8563 11630 7289 -12024 -4386
894d386J8780j1939j6144J4457J1852j5401j1136J7502Q363k0068k514J8739O51
$$ -4386 14394 2455 -13689 768 12620 -2781 -13917 3585 11948 -8120 -10634 8105 8756
907H756j7164J251J9201o392j6776R714J2953r767j5472J4765J2263j9696m275
$$ 8756 -8408 -7157 12044 5652 -11124 -1410 11543 1776 -13696 1069 13332 -6364 -10639
920a0639J6108M267j5788m260K1128k917j8939P125J5241q113j6427J2122J3033
$$ -10639 5469 9736 -6052 -10312 10816 7899 -11040 -3915 11326 3213 -13214 -1092 11941
933A1941j4507j0730J5868J0795k0863l223J9190J255j6654k825K2197m998k0835
$$ 11941 -2566 -13296 2572 13367 -7496 -10719 8471 9726 -6928 -9753 12444 7446 -13389
946a3389J0351J4915r724j5500J1750J6031j6305j3435K0806Q655k1776k608J8310
$$ -13389 -3038 11877 2153 -13347 -1597 14434 -1871 -15306 5500 14155 -7621 -10229 8081
959H081L486k1092j741K5690r661j8423R186J6069p887k1142J9141J3082j9081
$$ 8081 11567 -9525 -11266 14424 4763 -13660 -4474 11595 3708 -17434 1707 14789 -4292
972d292o513J4426J1695k3127l050K1541m139j4327j593J9807m222k0153J2546
$$ -4292 -10805 3621 15316 -7811 -10861 10680 6541 -7786 -9379 10428 6206 -13947 -1401
985a401J1844r280j0837J0096J0762j2688p980J2941O036j5986r18J2685q10r831
$$ -1401 10443 1163 -9674 422 11184 -1504 -9484 3457 9493 -6493 -7411 5274 4464 -5367
999e367j719J4163k944j1857O392Q609n736q155Q139L836n381o252P548N451j2795
$$ -5367 -7086 7077 4133 -7724 -1332 7277 1541 -6614 1525 5361 -20 -6272 1276 6727 -6068
1014f068M657K988N75k304n425J1926o335k667M374j848K775o295N737k912q94
$$ -6068 -1411 1577 2152 -152 -5577 6349 14 -2653 1721 -127 2648 -3647 2090 -822 -1716
1029a716L217n418P339o740M136M46m932Q723p466L586j209N44K312p487P747
$$ -1716 1501 -3917 3422 -3318 818 1264 -3668 5055 -2411 1175 -34 510 2822 -4665 3082
1044C082l736J042k790J799N065j0266R308m257K289j28o522J2961j1361K357
$$ 3082 -654 388 -2402 -603 4462 -5804 3504 -753 1536 1408 -5114 7847 -3514 -1157
1058a157K295k038K924q136Q832k887j02j555J633O034j1804R286l421J167K85
$$ -1157 1138 -900 2024 -6112 2720 -167 -269 -1824 -191 5843 -5961 3325 -96 1071 1356
1073A356o870J2757j1843M194Q94j342L663r139J2600p964J915J58j972Q951j6847
$$ 1356 -5514 7243 -4600 -406 488 -854 2809 -6330 6270 -1694 221 379 -1593 7358 -9489
1088i489J5788o387l805Q159j2196J7605j7086N055Q842j1580R502j2053J5715
$$ -9489 6299 -88 -3893 4266 -7930 9675 -7411 -2356 6486 -5094 4408 -7645 8070
1101H070q071n741J1171q836J0605j6756J2765K000j3537J3291j0923J4423j2901
$$ 8070 -1 -5742 5429 -3407 7198 -9558 3207 5207 -8330 4961 -5962 8461 -4440
1114d440n43J4542j3852P727j0210J4052n442r481J2564q118J0492j8077J2479
$$ -4440 -4983 9559 -4293 3434 -6776 7276 1834 -7647 4917 -3201 7291 -10786 1693
1127A693O023j7018J4003j1523J7903j4185o672K2652j6725P336j3599J6889P20
$$ 1693 7716 -9302 4701 -6822 11081 -3104 -9776 12876 -3849 3487 -10112 6777 7497
1140G497k1906K0190q029J1199j8952M922K2605k7695J1289n150J4331q339j8850
$$ 7497 -14409 5781 -2248 8951 -10001 -5079 17526 -10169 1120 -4030 10301 1962 -16888
1153a6888L0437j3399j134q544J3665P775k8177J8938p52O396j7654J776K8054
$$ -16888 13549 150 -984 -9528 4137 11912 -16265 2673 1921 8317 -9337 -7561 20493
1166B0493k9528O681n54J2422n964k3290L2484r567n612p406J4493R980l2138
$$ 20493 -9035 -2354 -2908 9514 3550 -19740 12744 3177 -2435 -9841 4652 14632 -17506
1179a7506J9992J220N451j8362j823L5451l5256O605K395R035m52l1837M1178
$$ -17506 2486 3706 9157 -9205 -11028 24423 -10833 -4228 -1833 7202 6750 -25087 16091
1192A6091j1909j1585L635L982J7999l7509J9872R712r851n210o663L3427l0536
$$ 16091 4182 -7403 -3768 214 18213 -19296 576 10288 437 -4773 -11436 21991 -8545
1205h545j274J6313m139K545k3402L1998o570j7798J1365J494J1136l0002J7229
$$ -8545 -9819 6494 2355 4900 -18502 13496 6926 -10872 493 1987 13123 -16879 350
1218C50J1149j5581K71m586K6772k7008q74J9398r844L507j8798K8381o742k0050
$$ 350 11499 -4082 -3811 -8397 18375 -8633 -9507 9891 47 3554 -15244 13137 6395 -13655
1232a3655J7199k237Q758k6604J7217J3100k3178Q643m610K0888k1963n456K8065
$$ -13655 3544 1307 10065 -16539 678 13778 -9400 -757 -5367 15521 -6442 -11898 16167
1245A6167j8828K984j0130J9596j647k5791K2808j149j7j6819J2647J5275k5701
$$ 16167 -2661 323 -9807 9789 8142 -17649 5159 4010 3993 -12826 -179 15096 -10605
1258a0605R155O04J2666j6794p712K8729j8286l03n343J5217J728k7395K3550
$$ -10605 -1450 -846 11820 -4974 -12686 16043 -2243 -2546 -7889 7328 9056 -18339 5211
1271E211N5k989j1084O313J8912k5653O248L880Q376j0748j3999L0046j3656o908
$$ 5211 5266 2277 -8807 -2494 16418 -9235 -2987 893 9269 -1479 -15478 14568 912 -5996
1285e996N26J0656N188k7063J9444M837o357q607K971K1240k4667J235R304M464
$$ -5996 -5470 5186 10374 -16689 2755 7592 1235 -7372 -4401 16839 -7828 -6593 2711 7175
1299G175p472j5913K9054r072j2253O059N455P885k3975J2007J1568j0914n924
$$ 7175 -297 -16210 12844 3772 -8481 -2422 3033 10918 -13057 -1050 10518 -396 -6320
1312f320K516J7417j8120m282J2165K797o493j3024K2965m400j2554N652M183
$$ -6320 -3804 13613 -4507 -8789 3376 6173 -320 -13344 9621 5221 -7333 -1681 2502
1325B502O982k0722R159J2379j2322l069O92J6170j5163o342J6041k820l622r001
$$ 2502 9484 -11238 -2079 10300 -2022 -5091 -4399 11771 -3392 -9734 6307 3487 -135 -9136
1339i136J6088j50j5953R711K905J135j2378N320J2383j3739j664N943P016j0929
$$ -9136 6952 6802 -9151 560 3465 4600 -7778 -2458 9925 -3814 -5478 465 7481 -3448
1353c448l186J3131m639l662l226J0636j810j2862J1348R67l295n331M341R027
$$ -3448 -6634 6497 1858 -1804 -5030 5606 3796 -9066 2282 3249 -46 -5377 -1036 7991
1367G991j3046J830O739l60n236k052J0642n720m652K767N033k390r023J0219
$$ 7991 -5055 -3225 3514 3154 -2082 -4134 6508 788 -3864 -1097 3936 1546 -7477 2742
1381B742R36o348k80L668N202j0216J750P174l324l722o12Q544n796m516N921
$$ 2742 3678 -2670 -2950 718 5920 -4296 -2546 4628 1304 -2418 -3030 5514 -282 -4798 1123
1396A123R77j230o395P117L068q399L070K115J801m867j479P772m326l145K383
$$ 1123 2100 870 -5525 1592 4660 -3739 -669 1446 3247 -1620 -3099 4673 347 -2798 -415
1411d15K523j568l401K551K457j756l208L726J568l428P23j86K564k816j506L549
$$ -415 2108 540 -2861 -310 2147 391 -2817 909 2477 -951 -228 -414 2150 -666 -2172 1377
1427A377j468J76k345K545J744l712J523l33L285k915k290N075k702M20k202J902
$$ 1377 -91 85 -2260 285 2029 -1683 -160 -493 2792 -123 -2413 2662 -40 380 -1822 80
1443H0K495n802K943J490q82j195j026N130k547k415J535K105q82l896L044R73
$$ 80 2575 -3227 -284 1206 324 -871 -1897 3233 686 -1729 -194 1911 1029 -2867 177 1150
1459A150j028k464J445L935m251p62L185Q05k539j735M072N71m015q89M734n55
$$ 1150 122 -2342 -897 3038 -1213 -1975 1210 2015 -524 -2259 1813 2384 -1631 -2520 2214 1659
1475A659m436J521K815K79m599J812M548m188r16J686K066k226k933M076N30k597
$$ 1659 -2777 -1256 1559 1838 -2761 -949 3599 -589 -1505 181 2247 21 -2912 1164 1694 -903
1491i03j548K809J896l887J47K325J037k596j108M017m40l127j64L654r48l378
$$ -903 -2451 358 2254 -1633 -1486 839 1876 -720 -1828 2189 1749 -1378 -1542 2112 1164 -2214
1507b214L32M400j038n751M824K276k831k348J673N994p276j515O393j459k842
$$ -2214 -1882 2518 1480 -4271 553 2829 -2 -2350 -677 5317 -1959 -3474 2919 1460 -1382
1522a382k704P647j643o223L891K728K20p460N666L912o622O01P65N285o873j957
$$ -1382 -4086 3561 1918 -4305 -414 2314 2534 -4926 740 4652 -1970 -1369 -604 4681 -2192 -4149
1538d149Q345l911j822j581O399p78p780O116K208j826n785N136N278r475R87
$$ -4149 4196 285 -1537 -3118 3281 2503 -5277 839 3047 1221 -4564 572 5850 -3625 -2638
1553b638L919L330q412j449J1509n158n133J441Q639m519q797R754K456n200o810
$$ -2638 1281 4611 -3801 -5250 6259 1101 -4032 -2591 6048 1529 -7268 2486 4942 -258 -7068
1568g068J0251L618j3941N058N153J633j0625J176J4606j1620k938M238P166o436
$$ -7068 3183 6801 -7140 -2082 3071 4704 -5921 -4745 9861 -1759 -4697 -459 6707 271
1582B71r734J5425k192o542l200R373M374j7937R483N450j930p617p04J7584j4347
$$ 271 -9463 5962 3770 -2772 -5972 3401 7775 -10162 -679 4771 2841 -4776 -5480 12104 -2243
1597b243m215P896M077m235j2543J7519r02j0479N82O898O910j9549Q243R546
$$ -2243 -6458 1438 5515 1280 -11263 6256 5354 -5125 -4543 2355 9265 -10284 -2041 7505
1611G505o325n076j779J7528j3523o710J1852N57l449j0926J5950K60j2191L785
$$ 7505 1180 -3896 -5675 11853 -1670 -8380 3472 4029 580 -10346 5604 5864 -6327 -2542
1625b542N069N195j6592P089R535q479k174j715J4134j1081o065J1597j433j367
$$ -2542 2527 7722 -8870 -1781 7754 -725 -2899 -4614 9520 -1561 -7626 3971 2538 1171
1639A171r577J3270K87j0567M486J701O872j5030N035R599r554J187m338J3403
$$ 1171 -8406 4864 5151 -5416 -930 771 7643 -7387 -2352 7247 -2307 -1120 -5458 7945
1653G945p893q255J3406m561J429q607R232L782j3223P134l08N298j0693J783
$$ 7945 52 -8203 5203 642 2071 -6536 2696 6478 -6745 389 81 5379 -5314 -3531
1667c531J1586j1631K901k256Q252m100r262J3723m999l6n098O165M576j3550
$$ -3531 8055 -3576 -675 -2931 5321 1221 -8041 5682 683 647 -4451 1714 6290 -7260
1681g260Q220m62L105p613j17J2738j2575K979k46N244j886j0642J4496m440k878
$$ -7260 960 498 3603 -4010 -4127 8611 -3964 -985 -1231 4013 2127 -8515 5981 1541 -1337
1696a337k062M376N455j3950P827J922K51n906q32J3907j3345J339K815K892p99
$$ -1337 -3399 977 6432 -7518 309 2231 2482 -3424 -4256 9651 -3694 -2355 460 3352 2553
1711B553j2355J5915l529o285J494K551O822j4955P068N918m779l169j090J2790
$$ 2553 -9802 6113 2584 -3701 -2207 344 7166 -7789 -721 5197 418 -2751 -3841 8949
1725H949j1150k958P344P52k027r425J3501j374q168K619L742M128j2952O522
$$ 8949 -2201 -5159 2185 2937 910 -8515 4986 3612 -4556 -1937 1805 5933 -7019 -497
1739d97N623n181k216j642J2719j1114l149Q571j698J86r062J1338L65r169M434
$$ -497 5126 -55 -2271 -3913 8806 -2308 -5457 3114 1416 1602 -7460 3878 4243 -4926 -492
1754d92J525L842j0032L454P145o419j037r42Q955p176m036Q503k368L5o059P742
$$ -492 1033 4875 -5157 -1703 5442 -977 -2014 -2956 5999 -1177 -5213 3290 922 957 -5102 2640
1770B640J641q790M807N28K300o683J949N877o394J365j138N338l622m046P719
$$ 2640 4281 -4509 298 826 3126 -3557 -1608 4269 -2125 -760 -1898 3440 -182 -4228 3491
1785C491l602M90k259K594K322o381L828J09J62k302P57L085l640J623j153K716
$$ 3491 -111 379 -1880 714 3036 -3345 483 592 754 -1548 -791 2294 -1346 277 -876 1840
1801A840j954j970N072m201J913j321M51K023m798M013r13m03K94r47K881l343
$$ 1840 -114 -2084 2988 -1213 700 -621 -170 1853 -2945 1068 155 -248 46 -901 1980 -1363
1817a363J672K66m57J6j320L305k858r0J300m94N08j814K198n51o15L42M13N23
$$ -1363 309 575 118 134 -1186 2119 -739 -829 471 -23 485 -1329 869 318 -297 45 458 981
1835I81k207J818j54q28M41j014K694k908N79J603j789J496j356R09L56j212Q17
$$ 981 -1226 592 438 -390 51 -963 1731 -1177 -598 1005 -784 712 -644 265 621 -591 226
1852B26j69L41o10L48K6m17R7l61R69p38m9O82o44P61l05j29L31m24J30J75n72
$$ 226 57 398 -212 136 162 -255 -158 -519 450 -288 -337 345 -299 462 157 28 359 -65 65 240 -332
1873c32L34M13q29J94P43o04k21J11R04n62r15Q64J075j361q78J564J20j058r80
$$ -332 2 415 -414 -220 523 -81 -302 -191 713 151 -764 100 1175 -186 -1064 500 620 -438 -1418
1892a418J876J053l228J062K412j409j750P85K672j509k522J873K334k816j901
$$ -1418 458 1511 -1717 -655 1757 348 -1402 -617 2055 546 -1976 -103 2231 -585 -2486
1907b486L328R05k609j732M270O68m760J231L433p72m000J200M559k891l190K452
$$ -2486 842 1747 -862 -2594 1676 2344 -2416 -1185 2248 1476 -2524 -1324 3235 344 -2846 -394
1923c94L428l169l483N066J267m014j189M078J803o343N97N723k035m560J758
$$ -394 3034 -135 -3618 1448 2715 -1299 -2488 1590 3393 -2950 -2353 3370 1335 -3225 -1467
1938a467M791k354m903L644M406m985k955N530J509m544k062N800R83p043J527
$$ -1467 3324 970 -3933 -289 4117 -868 -3823 1707 3216 -1328 -3390 2410 3393 -3650 -2123
1953b123N151j272n323J893N916m492l176L668L487m149l890O794L70n227K38
$$ -2123 3028 1756 -3567 -1674 4242 -250 -3426 242 3729 -420 -4310 2484 2854 -2373 -2135
1968b135L895J142o551J606N683l206l197K023M143k991l957M608K100m289j805
$$ -2135 1760 2902 -3649 -2043 3640 434 -2763 -740 3403 412 -3545 1063 3163 -1126 -2931
1983b931M702R22n160J53M728p64m285J169M761k493m283L916K772l863k063L521
$$ -2931 1771 2693 -2467 -2314 2414 1650 -2635 -1466 3295 802 -3481 435 3207 -656 -2719 802
1999H02K336m981j236N905j267m057R08M193j021n094L228L563l387k604L235
$$ 802 3138 -1843 -3079 2826 1559 -2498 -1590 2603 1582 -3512 -284 3279 -108 -2712 523
2014E23K524m467j432M365P60m167o63N027o40m463J444M118j755m235K415L852
$$ 523 3047 -1420 -2852 1513 2273 -1894 -2557 2470 1830 -2633 -1189 2929 1174 -3061 -646 3206
2030C206l106l725M315K542m476j941M335K270n590q37O216j158m884J035N110
$$ 3206 100 -3625 690 3232 -1244 -3185 1150 3420 -2170 -3007 3209 2051 -2833 -1798 3312
2045C312j678n857L484M428l565m349M703L653n900j702N207J909n882j179P006
$$ 3312 1634 -4223 -739 3689 124 -4225 478 4131 -1769 -3471 1736 3645 -2237 -3416 3590
$$ [...]
8191a58
##END NTUPLES=NMR FID
##END=
