##TITLE=1H_LR-757-CR3
 CCl4
 8 sc, 
 17.11.2022
##JCAMPDX= 6.0         $$ Bruker NMR JCAMP-DX V2.0
##DATA TYPE= NMR FID
##DATA CLASS= NTUPLES
##ORIGIN= UXNMR, Bruker Analytische Messtechnik GmbH
##OWNER= root
$$ XWIN-NMR		Version 3.5
$$ Thu Nov 17 17:05:00 2022 Russian Standard Time (UT+4h)  she@DPX200
##.OBSERVE FREQUENCY= 200.1313499994
##.OBSERVE NUCLEUS= ^1H
##.DELAY= (6, 6)
##.ACQUISITION MODE= SIMULTANEOUS
##.ACQUISITION SCHEME= undefined
##.AVERAGES= 8
##.DIGITISER RES= 18
##SPECTROMETER/DATA SYSTEM= spect
##.PULSE SEQUENCE= zg30
##.SOLVENT NAME= CDCl3
##.SHIFT REFERENCE= (INTERNAL, CDCl3, 0, 15.7039)
##AUDIT TRAIL= $$ (NUMBER, WHEN, WHO, WHERE, WHAT)
$$ ##TITLE= Audit trail, XWIN-NMR		Version 3.5
$$ ##JCAMPDX= 5.01
$$ ##ORIGIN= Bruker BioSpin GmbH
$$ ##OWNER= she
$$ F:/spectra/data/she/nmr/H-F/1/audita.txt
$$ ##AUDIT TRAIL=  $$ (NUMBER, WHEN, WHO, WHERE, WHAT)
(   1,<2022-11-17 17:03:24.48 +0400>,<she>,<DPX200>,
      <created by zg, POWCHK disabled, PULCHK disabled
       configuration hash MD5:
       00 E9 B6 7A A2 85 ED C7 34 08 36 98 17 FE 4E 26
       data hash MD5: 16K
       6B D7 D4 6B 9E B3 A9 5D DB D9 93 5F 51 38 57 26>)
$$ ##END=
$$ 
$$ hash MD5
$$ B3 3F 5A DD 48 57 97 C7 92 9B DB 7D 34 6D 21 7C
##$RELAX= 
##$RELAX= 
##$RELAX= 
##$RELAX= 
##$RELAX= 
##$RELAX= 
$$ Bruker specific parameters
$$ --------------------------
##$DU= <F:/spectra>
##$EXPNO= 1
##$NAME= <H-F>
##$PROCNO= 1
##$TYPE= <nmr>
##$USER= <she>
##$AMP= (0..31)
100 100 100 100 100 100 100 100 100 100 100 100 100 100 100 100 100 100 
100 100 100 100 100 100 100 100 100 100 100 100 100 100 
##$AQSEQ= 0
##$AQ_mod= 1
##$AUNM= <au_zg>
##$AUTOPOS= <>
##$BF1= 200.13
##$BF2= 200.13
##$BF3= 200.13
##$BF4= 200.13
##$BF5= 200.13
##$BF6= 200.13
##$BF7= 200.13
##$BF8= 200.13
##$BYTORDA= 1
##$CFDGTYP= 0
##$CFRGTYP= 5
##$CHEMSTR= <none>
##$CNST= (0..31)
1 1 145 1 1 1 1 1 1 1 1 1 1 1 1 1 1 1 1 1 1 1 1 1 1 1 1 1 1 1 1 1 
##$CPDPRG= <>
##$CPDPRG1= <>
##$CPDPRG2= <>
##$CPDPRG3= <>
##$CPDPRG4= <mlev>
##$CPDPRG5= <mlev>
##$CPDPRG6= <mlev>
##$CPDPRG7= <mlev>
##$CPDPRG8= <mlev>
##$CPDPRGB= <>
##$CPDPRGT= <>
##$D= (0..31)
0 1.2 0 0 0 0 0 0 0 0.06 0 0.03 0 0 0 0 0.0002 0 0 0 0 0 0 0 0 0 0 0 0 
0 0 0 
##$DATE= 1668690203
##$DBL= (0..7)
120 120 120 120 120 120 120 120 
##$DBP= (0..7)
150 150 150 150 150 150 150 150 
##$DBP07= 0
##$DBPNAM0= <>
##$DBPNAM1= <>
##$DBPNAM2= <>
##$DBPNAM3= <>
##$DBPNAM4= <>
##$DBPNAM5= <>
##$DBPNAM6= <>
##$DBPNAM7= <>
##$DBPOAL= (0..7)
0.5 0.5 0.5 0.5 0.5 0.5 0.5 0.5 
##$DBPOFFS= (0..7)
0 0 0 0 0 0 0 0 
##$DE= 6
##$DECBNUC= <off>
##$DECIM= 32
##$DECNUC= <off>
##$DECSTAT= 4
##$DIGMOD= 1
##$DIGTYP= 9
##$DL= (0..7)
0 120 120 120 120 120 120 120 
##$DP= (0..7)
150 150 150 150 150 150 150 150 
##$DP07= 0
##$DPNAME0= <>
##$DPNAME1= <>
##$DPNAME2= <>
##$DPNAME3= <>
##$DPNAME4= <>
##$DPNAME5= <>
##$DPNAME6= <>
##$DPNAME7= <>
##$DPOAL= (0..7)
0.5 0.5 0.5 0.5 0.5 0.5 0.5 0.5 
##$DPOFFS= (0..7)
0 0 0 0 0 0 0 0 
##$DQDMODE= 0
##$DR= 18
##$DS= 0
##$DSLIST= <SSSSSSSSSSSSSSS>
$$ [...]
##$SUBNAM2= <"">
##$SUBNAM3= <"">
##$SUBNAM4= <"">
##$SUBNAM5= <"">
##$SUBNAM6= <"">
##$SUBNAM7= <"">
##$SUBNAM8= <"">
##$SUBNAM9= <"">
##$SW= 18.0517283424941
##$SWIBOX= (0..15)
0 0 2 0 0 0 0 0 0 0 0 0 0 0 0 0 
##$SW_h= 3612.71676300578
##$TD= 16384
##$TD0= 1
##$TE= 0
##$TE2= 300
##$TE3= 300
##$TEG= 300
##$TL= (0..7)
0 120 120 120 120 120 120 120 
##$TP= (0..7)
150 150 150 150 150 150 150 150 
##$TP07= 0
##$TPNAME0= <>
##$TPNAME1= <>
##$TPNAME2= <>
##$TPNAME3= <>
##$TPNAME4= <>
##$TPNAME5= <>
##$TPNAME6= <>
##$TPNAME7= <>
##$TPOAL= (0..7)
0.5 0.5 0.5 0.5 0.5 0.5 0.5 0.5 
##$TPOFFS= (0..7)
0 0 0 0 0 0 0 0 
##$TUNHIN= 0
##$TUNHOUT= 0
##$TUNXOUT= 0
##$USERA1= <user>
##$USERA2= <user>
##$USERA3= <user>
##$USERA4= <user>
##$USERA5= <user>
##$V9= 5
##$VALIST= <valist>
##$VCLIST= <CCCCCCCCCCCCCCC>
##$VD= 0
##$VDLIST= <DDDDDDDDDDDDDDD>
##$VPLIST= <PPPPPPPPPPPPPPP>
##$VTLIST= <TTTTTTTTTTTTTTT>
##$WBST= 1024
##$WBSW= 4
##$XGAIN= (0..3)
0 0 0 0 
##$XL= 0
##$YL= 0
##$YMAX_a= 426726
##$YMIN_a= -458481
##$ZGOPTNS= <>
##$ZL1= 120
##$ZL2= 120
##$ZL3= 120
##$ZL4= 120
##$ABSF1= 10
##$ABSF2= 0
##$ABSG= 5
##$ABSL= 3
##$ALPHA= 0
##$AQORDER= 0
##$ASSFAC= 0
##$ASSFACI= 0
##$ASSFACX= 0
##$ASSWID= 0
##$AUNMP= <proc_1d>
##$AZFE= 0.1
##$AZFW= 0.1
##$BCFW= 1
##$BC_mod= 2
##$BYTORDP= 1
##$COROFFS= 0
##$CY= 11.3945322036743
##$DATMOD= 1
##$DC= 2
##$DFILT= <>
##$DTYPP= 0
##$F1P= 2.36226072786647
##$F2P= -0.459571619588291
##$FCOR= 0.5
##$FTSIZE= 0
##$FT_mod= 4
##$GAMMA= 1
##$GB= 0.15
##$INTBC= 1
##$INTSCL= 1
##$ISEN= 128
##$LB= 0.24
##$LEV0= 0
##$LPBIN= 0
##$MAXI= 10000
##$MC2= 0
##$MEAN= 0
##$ME_mod= 0
##$MI= 1.114404
##$NCOEF= 0
##$NC_proc= 0
##$NLEV= 6
##$NOISF1= 3.799351
##$NOISF2= 2.8
##$NSP= 1
##$NTH_PI= 0
##$NZP= 0
##$OFFSET= 15.70392
##$PC= 1
##$PHC0= -18021.04
##$PHC1= 1.600698
##$PH_mod= 1
##$PKNL= yes
##$PPARMOD= 0
##$PSCAL= 0
##$PSIGN= 0
##$REVERSE= no
##$SF= 200.130013532006
##$SI= 16384
##$SIGF1= 3
##$SIGF2= 2
##$SINO= 400
##$SIOLD= 16384
##$SREGLST= <1H.CDCl3>
##$SSB= 0
##$STSI= 0
##$STSR= 0
##$SW_p= 3612.71676300578
##$SYMM= 0
##$S_DEV= 0
##$TDeff= 0
##$TDoff= 0
##$TI= <>
##$TILT= no
##$TM1= 0
##$TM2= 0
##$TOPLEV= 0
##$USERP1= <user>
##$USERP2= <user>
##$USERP3= <user>
##$USERP4= <user>
##$USERP5= <user>
##$WDW= 1
##$XDIM= 8192
##$YMAX_p= 0
##$YMIN_p= 0
$$ End of Bruker specific parameters
$$ ---------------------------------
##NTUPLES= NMR FID
##VAR_NAME=  TIME,          FID/REAL,        FID/IMAG
##SYMBOL=    X,             R,               I
##VAR_TYPE=  INDEPENDENT,   DEPENDENT,       DEPENDENT
##VAR_FORM=  AFFN,          ASDF,            ASDF
##VAR_DIM=   8192,          8192,            8192
##UNITS=     SECONDS,       ARBITRARY UNITS, ARBITRARY UNITS
##FACTOR=    0.0002768,     1,               1
##FIRST=     0,             0,               0
##LAST=      2.2672688,     0,               0
##MIN=       0,             -458481,         0
##MAX=       2.2672688,     426726,          0
$$ Real data points
##PAGE= N=1
##DATA TABLE= (X++(R..R)), XYDATA
0@%%%%%%%%qJ6k4L2m0N6p2Q8j04J28j60J98k42K91l48M13m88N73o69P78r02J040
30E56j194J365j557J770k006K269k554K869l215L593m008M463m960N499o089O734
46C535p440Q211r051R973j0984J2094j3318J4674j6181J7863j9759K1910k4369
59a2842K7216l0556L4539l9385M5434n3231O3728p8761J02499j47950L75822o59011
71c72498K97742K44609l08564L69561o80226P40953k55117j73612L0242J07586
81F76K98117o23706M37082j7715p0832M3293l35889O43182n61038P0071K02824
92H6065j24658K00878m49434M22967j24321j20402J42392n6569L21249n44121
102b45954K70640N6717q7721M8593k99751O23783n05287r631K65774k48779L78347
$$ plain form
0 0 0 0 0 0 0 0 0 0 -8 8 -16 16 -24 32 -40 48 -56 72 -88 110 -132 159 -189 224 -264 309 -360 418 -484 556
30 556 -638 727 -830 940 -1066 1203 -1351 1518 -1697 1896 -2112 2351 -2609 2890 -3199 3535
46 3535 -3905 4306 -4745 5228 -5756 6338 -6980 7694 -8487 9376 -10383 11527 -12842
59 -12842 14374 -16182 18357 -21028 24406 -28825 34903 -43858 58641 -89309 286513 -372498
71 -372498 -74756 169853 -138711 230850 -449376 291577 36460 -137152 -106910 676
81 676 298793 -324913 112169 94454 23622 66915 -268974 374208 -186830 -116759 86065
92 86065 -38593 162285 -287149 135818 11497 -108905 33487 -23082 298167 -245954
102 -245954 24686 81403 -6318 42275 -257476 366307 -138980 -148611 117163 -131616 246731
113B46731n66141L80945J35060l32825K17759k02022L68301m01892P4894K43762
123A64572k48115K58261m52587L96605p3693k92912M45875l05355K38683j96057
133f4723p029K33671k52857J55912j26684K14085k22181l5240K63672k99383K09850
144F9093k12850J84909P7761k88141K88988j55946J18064j77314O1115K43375
154B09054l14698J66194j65526J73636o6086j96409L70843k36842R4494j25668
164i1008R1095J64447l53473K99641j16311N1245k4587j58083L33350k80789K3857
175f0616M2373M9487K6543k06819K67058j51597K2282k4721K224K52425l45475
186a26836J25444N6090o5668J3235j12533K32474j33803m4863O418Q7258M5492
$$ plain form
113 246731 -319410 61535 196595 -136230 81529 -120493 247808 -154084 -79190 164572
123 164572 -83543 174718 -277869 118736 45043 -247869 198006 -107349 131334 -64723
133 -64723 -71752 161919 -90938 64974 -61710 152375 -69806 -105046 158626 -140757 69093
144 69093 -143757 41152 118913 -169228 119760 -36186 81878 -95436 -34321 209054
154 209054 -105644 60550 -104976 68660 2574 -193835 177008 -59834 34660 -91008
164 -91008 87 164534 -188939 110702 -5609 45636 21049 -137034 196316 -84473 -60616
175 -60616 -18243 31244 57787 -149032 118026 -33571 -11289 -36010 -33786 218639 -126836
186 -126836 -1392 54698 -10970 2265 -110268 122206 -11597 -56460 -50042 37216 82708
197H2708k60425K61570m4507m1378J3231p3761K39773k64171N325J28673r320
208C7718r852j67316K32532r5593p9226O9367K1938J37301k63030J09520R4908
219H8267j03650Q609o8368K09696j56210p3939J25299k1481L3847j79598J63636
230B6108N6730j32199M9394O713Q9716j70281K8838J15419m6551o303j18340J75483
242G4727o5106j25296J41360m307K7978j24539O7999Q4371r4765p32k740J26348
254A05298j36511l4271J36907p6048k229q2325J07992M1763j28568P3291J8729
265B4028J2906j02874M6125J13114r2472l325k3731P2788n1338p9669J20845j9738
277A6659k5098m6333O5357M5574j08858M8371K7832J8646n7679q539R8211p9132
$$ plain form
197 82708 -177717 83853 39346 -2032 11199 -62562 177211 -86960 -81635 47038 37718
208 37718 27866 -139450 93082 -2511 -81737 -12370 9568 146869 -116161 -6641 88267
219 88267 -15383 -6774 -75142 134554 -21656 -95595 29704 8223 42070 -137528 26108
230 26108 82838 -49361 33 6746 96462 -73819 -44981 70438 23887 17584 -100756 74727
242 74727 9621 -115675 25685 21378 49356 -75183 -7184 77187 -17578 -18310 -21050 105298
254 105298 -31213 -65484 71423 -4625 -6854 -89179 18813 60576 -67992 5299 24028
265 24028 36934 -65940 -19815 93299 827 -2498 -26229 46559 -4779 -84448 36397 16659
277 16659 -8439 -54772 10585 56159 -52699 -4328 23504 42150 -15529 -24068 74143 -4989
289d989l7157R064O3336j2531p8658Q0850k864l7171k7884N8248O6246j00017
301b3527J1031M4000m568m9721j9268R1883l8177n9867K2579N9925j9495q2729
313f7934P0883L4721l8307j9372L7411N3397r3000l1155P9704J1838n8710j6404
325c6928O7284j8212o8409J7929P4653J181q1432L6239O4929m7885m5731L8540
337B158N1235n4607n3542O5622L7404p6521l4846O8502K9993o0233n272P8428
349D8321m709q3545P197Q4706j4379p4290K7231M9741l9888o6447M5006P4097
361E3041o2738m4126O1909M4783n8228m0616P9241J0639n9867j3415O0023J7496
373D8142r8041K664P0040p757n4464J8601P3020m8303m4333L0264N6092q943q4108
$$ plain form
289 -4989 -42146 -33082 30254 17723 -60935 19915 17051 -20120 -48004 10244 76490 -23527
301 -23527 -12496 31504 26936 -22785 -42053 49830 11653 -48214 -25635 34290 14795 -67934
313 -67934 2949 37670 -637 -20009 17402 70799 -22201 -53356 26348 38186 -20524 -36928
325 -36928 30356 12144 -56265 -38336 36317 37498 -43934 -7695 57234 9349 -36382 2158
337 2158 53393 -1214 -54756 10866 48270 -28251 -63097 5405 35398 -24835 -30107 48321
349 48321 43612 -39933 -32736 51970 37591 -36699 -9468 40273 385 -66062 -21056 53041
361 53041 -9697 -53823 8086 52869 -5359 -45975 33266 43905 -15962 -29377 30646 48142
373 48142 -49899 -47235 22805 15048 -39416 -20815 52205 3902 -40431 -10167 45925 36982 -47126
386d7126O4262L1441p0729j4832L5165L8005o5551j1083N5454J5524m6132l3560
398d9162R7772k6778n5686M7906J6932L806q1768K2483O3264m9072j9014J8507
410a0810N2413o4407k7181P2468J43j2084l9710N9266J2092p3027K2950K0957
422A3070J3886o7298J5157O5185n1533q873p998N3160j4308m7016O8335J426k5354
435G839m5285N0138K1015o3285L1580q807L2792n7558k3301J08294o4334o959
447a7871J8258K2856O214o5727N3749M801j5203m3092L6355N9916j14560L9157
459a5147J8240p378R579n2878R8273k3202o4060K9874L2498L117o7843N3231J0253
472B4557k8178k4580r22P7733p5361p391M5637J3900j8709n4557R0906k8474l0931
$$ plain form
386 -47126 17136 48577 -22152 -36984 -1819 36186 -29365 -40448 15006 30530 -15602 -49162
398 -49162 48610 21832 -33854 14052 30984 34790 -46978 -24495 38769 -10303 -29317 -10810
410 -10810 41603 -22804 -49985 22483 22626 10542 -29168 30098 42190 -30837 -7887 13070
422 13070 26956 -40342 -25185 40000 -11533 -20406 -28404 24756 10448 -36568 31767 33193 7839
435 7839 -37446 12692 33707 -29578 2002 -6805 25987 -31571 -54872 53422 -10912 -17871
447 -17871 387 23243 29457 -36270 17479 22280 7077 -36015 340 60256 -54304 -15147
459 -15147 3093 -4285 5294 -47584 50689 27487 -36573 -6699 25799 28916 -38927 14304 24557
472 24557 -3621 -28201 -29123 48610 -26751 -34142 11495 25395 6686 -47871 43035 14561 -16370
485a6370J6051O620N0140j03053K7148M1732l2744p602j1696R0286q3235q780
497c1503M9486j8297M5983j03704Q8292K8848j13546O1154j1388L1132n4817j5047
509d3407Q2343l6111j5039k9186Q7738l1871o7156Q9655k2599K0889o6303M157
521b6890P9252p7368K659J8979L5853n0110k0656N8540j8433J6036n6417O6439
533B7884J2272p9975N9057k3755L1098n9004R854P4672q6164L8550l1822M5615
545A8282q895p1389J18130m8345m524k1924K0290M9937j04976P2390j5756J1573
557A4793j7915o6315J35491q5791j3758M7819j7535M0181o8407L7268J7709j3829
569I711l1885J4580O4080r5403L9599o621q927K9229o4543Q7159k9936k1748J3894
$$ plain form
485 -16370 -319 6301 56441 -46612 -19464 22268 -10476 -18078 -29774 60512 -22723 -31503
497 -31503 17983 -314 45669 -58035 30257 59105 -54441 6713 -4675 26457 -28360 -43407
509 -43407 38936 2825 -12214 -41400 46338 14467 -52689 36966 14367 35256 -31047 -26890
521 -26890 52362 -25006 -22347 -3368 32485 -17625 -38281 20259 1826 17862 -38555 27884
533 27884 40156 -39819 19238 -4517 26581 -32423 -22569 52103 -34061 4489 -27333 18282
545 18282 9387 -62002 56128 7783 3259 -18665 1625 51562 -53414 18976 3220 14793
557 14793 -3122 -69437 66054 -19737 -33495 14324 -3211 36970 -31437 5831 23540 9711
569 9711 -22174 -7594 56486 -38917 682 -5939 -14866 14363 -50180 36979 7043 -14705 -811
582h11O091L0430p7985P6085k4026j7477J3023m5074R3919r8278K1221M7789l7826
595a2919L7217p5612R8225l5311m6919O3025m3160P4359r6037J9921N8655p9748
607c8304M4090l5211O1758l3227l7185O2249l6017M0775o3093M8372K8978p9579
619c6394N6080k8323K7945l4928j1013N2089l7366J5374l5883O4433l5465l7383
631d0834Q1239m8023M0630n6270K1140M5327q2424M8615k2726M3830n1370j9425
643d0291Q6031q2055N3616m2653L2775M3908j06461R1214k9564R1j3636j9525
655b6550P3720p8169L2634j6623J5863J2252o8827R6160l6810k292n40p691N0123
668D3250p5873M3666n666L77m920m2469P8284n6253L641J4092L444K1031n4021
$$ plain form
582 -811 5280 35710 -42275 33810 9784 -7693 5330 -39744 54175 -44103 -22882 24907 -12919
595 -12919 24298 -51314 46911 11600 -35319 27706 -15454 58905 -37132 -17211 41444 -38304
607 -38304 5786 -29425 32333 -894 -38079 24170 -11847 28928 -34165 14207 43185 -36394
619 -36394 19686 -8637 19308 -15620 -26633 25456 -11910 3464 -32419 32014 -3451 -40834
631 -40834 40405 -7618 33012 -23258 -2118 43209 -39215 9400 -13326 30504 -20866 -40291
643 -40291 45740 -36315 17301 -25352 7423 51331 -55130 36084 6520 6611 -7025 -26550
655 -26550 47170 -30999 1635 -14988 875 13127 -55700 40460 3650 1358 818 -6873 43250
668 43250 -32623 11043 5377 5754 834 -41635 36649 -19604 -15963 -1871 1573 22604 -31417
681c1417N8128k2985M286j4466r605P0505r2840M4428r43k5575L6758o4174P8874
694C0974k8029k1571K7557j3231L6705o4763N1095k371k2850K0445m8152P2936
706C8745n7017r057M3845l2821L3791m6107M3241n37l1145K6277j5104M4535n5933
719a7287J2772K4539l6746K0850l1075M6278k3878j7457L2600k0128K9869m6290
731b5953M0333J1493m4672L6508k5503L0387l6241o184L7990l2224J9268l0366
743b5164M1612j2418l6029N5830k7331K3412k7398L065L5639m9726J8729p059
755f838K1545k2665j8082M5487l2480J5758j8474K0936J9345m7580L7534n067
767I419J191k0644k84L4831l7758J0949p570J7063q335l0690N1015j7615l35o753
$$ plain form
681 -31417 26711 3726 8012 -6454 -16059 54446 -38394 6034 5091 -20484 16274 -47900 30974
694 30974 2945 -18626 8931 -4300 32405 -32358 18737 16366 -6484 13961 -34191 38745
706 38745 -18272 -27329 16516 -16305 17486 -28621 14620 14083 -17062 9215 -5889 38646 -17287
719 -17287 -4515 20024 -16722 4128 -26947 19331 -4547 -22004 10596 -9532 20337 -25953
731 -25953 14380 25873 -18799 17709 -7794 22593 -13648 -19832 18158 -14066 5202 -25164
743 -25164 16448 4030 -31999 23831 -3500 19912 -7486 -4421 31218 -18508 221 -6838
755 -6838 14707 -7958 -26040 19447 -13033 2725 -15749 5187 24532 -23048 14486 9419
767 9419 10610 -10034 -10318 24513 -13245 -2296 -9866 7197 -1138 -31828 19187 1572 1237 -5516
781e516R657K1737m5545K3999L862k32j4788j1730M0190l3476k51N580R602O815
795I904l2919L8435l229j3069m382M253K7699l9111Q221R656m318o242j8686L8139
809A4351j3727j2570R352R800O580l1724K5989O406j2896m521m554K9022l0457
822h949q345J9949j408l886j3767K7037l914j5239N443R994J1836l0570J3032
835A213J3979j7611m075m291K2352j4451j3659J8273K726m235j3033J9973N094
848A2255j5807K818P536Q442k4824J035J7744j0824n891k065J5653m668j6346
861a4942J3595J1044n659j1302J4569O002j5539k050N896Q307j6567n616J7278
874E016l052j1968J312J5277l523j0402J0012Q910n906j1342O720R462j1081q746
$$ plain form
781 -5516 4141 25878 -19667 4332 8194 7962 -6826 -18556 21634 -11842 -12093 -6513 3089 9904
795 9904 -23015 15420 12191 -878 -5260 -1007 26692 -12419 -4198 5458 1140 -5102 -23788 14351
809 14351 624 -11946 -2594 7206 13786 -17938 8051 14457 1561 -2960 -7514 21508 -8949
822 -8949 -17294 2655 1247 -2639 -16406 10631 6717 -8522 -3079 6915 18751 -11819 1213
835 1213 15192 -2419 -6494 -10785 11567 -2884 -16543 1730 4456 221 -12812 7161 12255
848 12255 -3552 -734 6802 15244 -9580 -8545 9199 -1625 -7516 -9581 6072 1404 -14942
861 -14942 -1347 9697 4038 -7264 7305 13307 -2232 -4282 1614 9921 -6646 -12262 5016
874 5016 1964 -10004 -8692 6585 3062 -7340 2672 11582 5676 -5666 1054 10516 -565 -9311
888i311J0513M620j5885l00J2346K93o563r19J2727J581j3793L656J3843r178
902C630j0724P821L868m775j0733N289J1081j0820l342J2409N113j1856n95J2245
916H611j051p242n104J2783j914j8147Q464M994k547q518M997J2472j0385p15
930c302N234Q144p005r803J7021m171r361k167M292M645j3653M538O389J546p577
945e230P8J7580j2346q17P232j433J112j3187N708P944j1286o323J0615L954j2234
960h633O730J954M607r66j0558J8895m772j1370M280L639p68j2875Q496M80r64
975a825k708n204J9835j2724j025J2207p191N171r269Q208o58j0717P853o961
989e008P420r728p19J4714j3955N528L681J671J990q149P533J940m874p205O451
$$ plain form
888 -9311 1202 5822 -10063 -10363 1983 2276 -4287 -5206 7521 9102 -4691 -1035 12808 3630
902 3630 -7094 727 4595 -180 -10913 -5624 5457 -5363 -8705 3704 8817 -3039 -3634 8611
916 8611 7560 318 -4786 7997 6083 -12064 -3600 1394 -1153 -9671 -4674 7798 -2587 -3302
930 -3302 1932 10076 3071 -6732 10289 6118 -3243 -5410 -1118 3527 -10126 -5588 801 2347 -5230
945 -5230 -5152 12428 82 -735 6497 5064 6176 -7011 -1303 6641 -4645 -10968 -353 3601 -8633
960 -8633 -1903 51 4658 3692 -6866 12029 7257 -4113 167 3806 3038 -9837 -1341 -861 -1825
975 -1825 -4533 -9737 10098 -2626 -3651 8556 1365 6536 -2733 5475 4817 -5900 1953 -5008
989 -5008 2412 -7316 -8035 6679 -7276 -1748 1933 3604 5594 -2555 4978 6918 2044 -5161 1290
1004A290L537j3537L538K157L485k709o113J2458K809p758p29J1700o447m106
1018d25L558p042J0531j3940n07J3287j6376J1774k537m15O674p398J2446j0825
1032a195M890R37o269R934k0264J5312j494j4149J5590j2342J3140m645p329J7017
1046I133q965O044r032N981Q281j9089R433l451J876N38j2702J1909K778p452
1060d718N90Q482k458q9K343n002Q323p193j654L767n357J198k657M710r231J0233
1076A287R74j1626K0940j6849J0767K968j8948K5992j8910L289K433j1800J7967
1089H484j9244R002j154N21R840j9460K1860q257M4M826j3654K0936j7006n5N220
1104A903p366Q046j3111J1051o08k782M648m777R184n206J561r40L167l428l631
$$ plain form
1004 1290 4827 -8710 -5172 -3015 470 -2239 -8352 4106 6915 -843 -1572 10128 3681 -425
1018 -425 3133 -3909 6622 -7318 -7825 5462 -10914 860 -1677 -2092 4582 -2816 9630 -1195
1032 -1195 3695 4632 -1637 8297 -11967 3345 1851 -12298 3292 -9050 4090 -555 -7884 9133
1046 9133 168 6212 -2820 3161 11442 -7647 1786 -1665 211 749 -11953 -44 2734 -4718
1060 -4718 -4128 4354 1896 1807 4150 -852 7471 278 -1376 2391 -2966 -1768 -4425 285 -8946 1287
1076 1287 2261 -9365 11575 -5274 5493 8461 -10487 15505 -3405 -116 2317 -9483 8484
1089 8484 -10760 -1758 -2912 -2391 7449 -12011 9849 1592 1636 6462 -7192 13744 -3262 -3317 1903
1104 1903 -5463 2583 -10528 523 -85 -2867 1781 -2996 6188 982 2543 1603 4770 1342 -2289
1119b289O381j3516J5201j1158j784J5008j9725J9428j0005K01J0645j3573J5979
1132A0793j4894R489m680n424J3493k4958K5457j3286m998J7404k2343K4603j4948
1145d292J301J3802j4997J2441j3088J1606m984q010J1183j2508J2878j2508L111
1158d065O998q060Q052p650J3056q130J223L299p874J2526j6956J0965l130n914
1172e660P537j2088J7317j6254J0013L862j1249K0091k4159K0664n709j3103K1471
1185A2733k1989J6022j1876L16R715j6604J6635j1926J3381o867n709J9519k0730
1198g380J5637j0393L307P970k0285J6777j1322N852l924k115J2902j5312J3770
1211E484r403P821R66j2221J8877j4132Q120q851J561P353j7423J7776j4342J1350
$$ plain form
1119 -2289 4092 -9424 5777 -5381 -7165 7843 -11882 7546 -2459 -2258 8387 -5186 10793
1132 10793 -4101 5388 708 -4716 8777 -16181 9276 -4010 -9008 8396 -13947 10656 -4292
1145 -4292 -2991 10811 -4186 8255 -4833 6773 1789 -6221 4962 -7546 5332 -7176 -4065
1158 -4065 2933 -5127 2925 -4725 8331 201 1424 4723 -3151 9375 -7581 3384 254 -5660
1172 -5660 1877 -10211 7106 -9148 865 4727 -6522 13569 -10590 10074 4365 -8738 12733
1185 12733 -9256 6766 -5110 -4794 4921 -11683 4952 -6974 6407 -460 -6169 13350 -7380
1198 -7380 8257 -2136 1171 9141 -11144 5633 -5689 163 -3761 -5876 7026 -8286 5484
1211 5484 -3919 3902 4868 -7353 11524 -2608 5512 -3339 -1778 5575 -11848 5928 -8414 2936
1225B936k463j0811K3068k1682J4242l248j251Q948j9207J9418j3736L607q70
1238a049o740J7380k2167J5462l665k618Q627j3464K0915j4805M122K570p314
1251b746J0914j9577J6399n713m142O353j0651J6366j4611Q234J597l000R403
1264H826j6456J9144j2956p71P339j3094J7055j8970Q925K247q220R961j1076
1277h046J7431j1345K231O265j0041J2834j7470J4282l434r918J2370j4614J4059
1290D604j1452K653R461j0044J0634j0308J2154o169m510J0250j1489J2301j4028
1303e943M897L759j2172J2615j1083J2093m525m100J1799j0827R970r235O366
1316C614K640j0687Q394r566R631j0011K57J0322j1950J2116r708P572J682j0344
$$ plain form
1225 2936 473 -10338 12730 -8952 5290 2042 791 9739 -9468 9950 -3786 -179 -1049
1238 -1049 -7789 9591 -12576 2886 -779 -3397 5230 -8234 12681 -2124 1998 4568 -2746
1251 -2746 8168 -11409 4990 -723 -4865 1488 -9163 7203 -7408 826 2423 -577 8826
1264 8826 -7630 11514 -1442 -2213 5126 -7968 9087 -9883 -958 1289 -6931 3030 -8046
1277 -8046 9385 -1960 271 6536 -3505 9329 -8141 6141 2707 -7211 5159 -9455 4604
1290 4604 -6848 -4195 5266 -4778 5856 -4452 7702 1533 -2977 7273 -4216 8085 -5943
1303 -5943 -1046 2713 -9459 3156 -7927 4166 -359 -4459 7340 -3487 6483 -2752 3614
1316 3614 6254 -4433 3961 -5605 4026 -5985 -5728 4594 -7356 4760 -4948 2624 4306 -6038
1330f038J4268q130M766n890M62N217j1700P735o480Q351m130n555J3474j1151
1344d801Q170m075K377O617j2661R533m820K83l288k431R503r306M153l416N545
1359A383J79q893J4468o394K799j463k856Q343j3139M595K175j587j851l849R737
1374C647o994Q55J403L519L646j0380R845k494l374j0k131Q053j0037J383L859
1389G90l064J12l597R483j567l003K326J484J885r117N846K313m978M4k525O586
1405C018o305l750Q474J78j863j673N909L63o141R18M360J410q475J965M955n756
1421b413k656J056O948k518n285O915K222m508k286N707K316o184j070L930M83
1436B657p597n66P788k494l454K135M347n79o521N564M420m860j111J337L705
$$ plain form
1330 -6038 8230 100 4866 -1024 -562 4655 -7045 690 -5790 2561 -1569 -7124 6350 -4801
1344 -4801 3369 -706 1671 8288 -4373 5160 340 623 -2665 -5096 4407 -4899 -746 -4162 1383
1359 1383 1562 -7331 7137 743 3542 2079 -777 7566 -5573 -978 1197 -390 -2241 -6090 3647
1374 3647 -3347 -2492 -1089 2430 6076 -4304 5541 3047 -327 -337 -2468 5585 -4452 -3069 790
1389 790 -2274 -2162 -5759 3724 2157 -846 1480 2964 4849 -4268 1578 3891 -1087 -1043 -3568 3018
1405 3018 -3287 -7037 1437 1615 -248 -1921 3988 4351 -1790 -872 3488 4898 -3577 -1612 3343 -2413
1421 -2413 -5069 -4013 2935 417 -4868 2047 4269 -239 -2525 3182 5498 -686 -1756 2174 2657
1436 2657 -4940 -5506 2282 -212 -3666 -1531 2816 2237 -4284 1280 5700 840 -271 1066 4771
1451D771o879n045R325j052m433p82N345K673r197L608N726K30n406l80J0433
1466H937r716m509N140J258N13r629P935N541r971L21M663N534o649r92P006k370
1482C012m393k401P471k603o360M738K266j835o920O420M483m941L0K778N832
1497G577j0173j59O917k964j446n789J1600m567r704P758L11N891j1575N305J1555
1512A0537j3290K629j900Q841m301j1157J4673n233k476n100M827Q025j3909Q581
1526G47J872M57l320m773J3463q432j969L696J184k096q712Q948r33k132k152
1541d152M899N858j2669O119K419J901m970l447J4472j1676j588r02M502M080
1555D846j7411J5914N1m551j053l384J7451j5891K449P475m182K865j5809J6942
$$ plain form
1451 4771 -2108 -7153 2172 1120 -3313 -4095 1250 3923 -5274 -1666 4060 4290 -1116 -1496 8937
1466 8937 -779 -5288 -148 1110 1623 -8006 -71 5470 -4501 -4180 483 6017 -632 -1624 5382 3012
1482 3012 -1381 -3782 3689 1086 -5274 -536 1730 -105 -7025 -605 3878 -1063 -1033 1745 7577
1497 7577 -2596 -2755 4162 1198 -248 -6037 5563 996 -8708 -950 -639 5252 -6323 -1018 10537
1512 10537 -2753 -124 -2024 6817 2516 -8641 6032 799 -1677 -6777 -1950 6075 -7834 747
1526 747 2619 3076 -244 -5017 8446 14 -1955 1741 2925 829 -7883 1065 132 -2000 -4152
1541 -4152 747 6605 -6064 55 2474 4375 -595 -4042 10430 -1246 -2834 -3736 766 4846
1555 4846 -12565 3349 3400 -1151 -2204 -5588 11863 -4028 -1579 5896 1714 4579 -11230 5712
1569E712l578j0111R748m869R601j3602L468J0274r525N135l968R819o910o803
1583e609J0187n652J741o999Q584J579j0888N091O38O779j0600M272R252p979
1597C96J018p200J3954p612r010J3034n596M678j4036Q850R319j6094J0570m196
1611a925J1609r415q640J9502j4663N838o293M842P122k1021J5654m141P38p16
1625a509l664J7043j6122M257J829J66K037j2113J5992p180l672J14j22Q335j5647
1640a0256J0902L179k369k137m413J5423j2608P46L168K656L62j7131J7841n952
1654e89l259J801k836J7302k1207P186O976o529N663j2595J9032q795p943Q389
1668B596o684R875j6814J1658N590j2318Q471q497J4546j0466k879J4746j0811
$$ plain form
1569 5712 2134 -7977 1771 -3098 6503 -7099 -3631 6643 -2882 2253 -1715 8104 1194 -5609
1583 -5609 4578 -1074 667 -6332 2252 3831 -7057 -1966 -1328 5451 -5149 -877 8375 396
1597 396 1414 -5786 8168 556 -8454 4580 -1016 3662 -10374 -1524 7795 -8299 2271 -1925
1611 -1925 9684 269 -8371 11131 -3532 2306 -3987 855 7977 -13044 2610 -1531 -793 -1509
1625 -1509 -5173 11870 -4252 5 1834 2000 4037 -8076 7916 736 -2936 -2822 -2944 5391 -10256
1640 -10256 646 3825 1456 -681 -5094 10329 -2279 -1533 1635 4291 4653 -12478 5363 -589
1654 -589 -3848 -2047 -4883 12419 -8788 -1602 5374 -1155 4508 -8087 10945 2150 -5793 2596
1668 2596 -4088 5787 -11027 631 6221 -6097 2374 -6123 8423 -2043 -4922 9824 -987
1681i87M850j0064R761n64j2151J0906k939O293j3067N951R181j2342P297o109
1695c984J4350q609r636J6023j0624M905j0379R716N674j7357J1525n038Q976
1708E542r879j393J8140j5877P470p996P832J789j7989K0095r269K210l800k353
1722e478J4308j8301R755J107K581j636r934J8015j2779J633o28K071P136j9290
1736a1440J4338k667k328Ol309J6784j5921L783K541J025M80j3437J9808r290
1750C73j915K78k960J3029k1123J2610M138n786L795r735J7967j3045j546P888
1764C968l155O000j7170J5272k992q207O907o316J5513j6159L278J0083j0157
1777c135O014r465J5241n430r074R676n676O674j4754J0218N918j1824P208p147
$$ plain form
1681 -987 3863 -6201 3560 2996 -9155 1751 -1188 5105 -7962 -2011 7170 -5172 2125 -3984
1695 -3984 10366 1757 -7879 8144 -2480 2425 -7954 1762 7436 -9921 1604 -3434 5542
1708 5542 -4337 -5730 12410 -3467 4003 -3993 3839 5628 -12361 7734 -1535 675 -3125 -5478
1722 -5478 8830 -9471 284 1391 3972 2336 -7598 10417 -2362 -729 -1357 714 7850 -11440
1736 -11440 2898 231 -2097 -2091 -5400 11384 -4537 -754 1787 2812 3292 -10145 9663 373
1750 373 -1542 -1264 -4224 8805 -12318 292 4430 -1356 2439 -7296 10671 -2374 -3920 3968
1764 3968 813 6813 -10357 4915 1923 -6284 623 -5693 9820 -6339 -3061 7022 -3135
1777 -3135 2879 -6586 8655 3225 -5849 3827 -1849 4825 -9929 289 6207 -5617 1591 -5556
1791e556J4213j2110k787J5382j0232N298j0168J0572j40j3882J1675l820P163
1804E608j2485M124J0605j4489P701n384J2404n286j0800J6864j0443L062o986
1817e505N979P329j6194R502k383M500p599j662J6088j3001M664l972O656M99
1831D901j5898J6878n035l7m244L54J1212j6755O917K365L407l552p324J6611
1845I800j1108k33l02L989N534j7816J3345j117m515q07k167J4574j3442K047
1859b218N077j18j413r681J6281n856m037J438m59P840j7025Q796N486n503Q99
1874d93m403J3374j0030l202P693r3J173j1475J2474j557q534K733j72R700j3420
1889f232L039R369p329K9l639J2233m992p242P853n61j62j0964R386M375r815
$$ plain form
1791 -5556 8657 -3453 -6240 9142 -1090 4208 -5960 4612 4472 -9410 2265 -1555 5608
1804 5608 -6877 -2753 7852 -6637 1064 -4320 8084 2798 -8002 8862 -1581 1481 -5505
1817 -5505 474 7803 -8391 1111 -1272 3228 -4371 -6033 10055 -2946 1718 -2254 4402 4901
1831 4901 -10997 5881 846 809 -3435 -3081 8131 -8624 -1707 658 4065 513 -6811 9800
1845 9800 -1308 -1541 -1843 2146 7680 -10136 3209 2092 -2423 -3230 -5397 9177 -4265 -2218
1859 -2218 2859 2741 1328 -8353 7928 2072 -1965 -527 -986 6854 -10171 -1375 4111 -1392 -493
1874 -493 -4896 8478 -1552 -4754 2939 2846 4019 -7456 5018 3461 -5073 -2340 -2512 7188 -6232
1889 -6232 -3193 6176 -1153 -1124 -4763 7470 2478 -4764 3089 2528 2366 -8598 788 5163 -4652
1904d652L019L8P896j0360j853J2300n142p90l704Q972j869j1075P422J223J170
1919B595q466M475P322r804M70J665P728n569n412J1425l601m005l011O271L058
1934E141j1192M649L869j124p139K116R795p100j389L129N307m737q194J0191
1948C322P49n737k045N262K658r736Q92O823P47o384J039R222n451m790K556N206
1964D333j900p783O456L256o347l346M129N167o873m97P036J11n529j898P975
1979D290j083o759L197M331k392p481L432O504n329l223N360L547m671m855P479
1994B347L157p980N53N627J56p416j195P577j596n742K203O674k495p517N413
2009b34M653l472l091K987N038p033l768N891J897n672j107O274p6n003j108P040
$$ plain form
1904 -4652 -1633 -1595 6301 -4059 -5912 6388 1246 456 -3248 5724 3855 -7220 202 1425 2595
1919 2595 -5871 -1396 5926 -3878 -3408 -1743 5985 416 -4996 6429 2828 -1177 -4188 2083 5141
1934 5141 -6051 -1402 2467 1343 -5796 -3680 6115 -985 -2374 755 6062 1325 -6869 3322
1948 3322 4071 -1666 -3711 1551 4209 -5527 -4635 2188 2935 -3449 -2410 6812 1361 -3429 -873 4333
1964 4333 2433 -5350 1106 4362 -1985 -5331 -1202 3965 -2908 -3405 3631 3742 -1787 -3685 4290
1979 4290 3207 -3552 -355 3976 1584 -5897 -2465 4039 -1290 -4513 847 4394 -277 -5132 2347
1994 2347 5504 -2476 -1923 3704 3860 -3556 -4751 2826 1230 -4512 -2309 4365 1870 -5647 -234
2009 -234 4419 947 -2144 843 5881 -1152 -4920 971 2868 -2804 -3911 2363 2287 -2716 -3824 3216
2025C216k07o763M314L977k130o349K434O115p227m00K706M082m460o803J1191
2040C696j677m100Q05L816M112j1802L558N385l330k364k576J0577o307n871O702
2055F24O4J031o453O334M419p468l09J706M371o810l47O065j994l173k893P289
2071B456j444m692L598L469n53p876O800J765m743o8m57Q616j0409j358Q180m239
2087i55O60n408J0582p31r389O539j005M329q742K133J0059j0921J592j856O027
2102B914j757q238J0461k060o08l896K860N743r144L555J940J466m358k570P143
2117C451m571j149l57O616k558p286Q276k227J244m620M020O466j1564L950J17
2132a92L428n479l967J3205q646O35j618L105N253j4104J0994J198k985p52m267
$$ plain form
2025 3216 3009 -3754 560 4537 2407 -3942 -1508 4607 -2620 -3020 -314 3768 -692 -7495 3696
2040 3696 2019 -2081 -1276 2540 6652 -5150 -1592 3793 463 -1901 -4477 6100 -207 -6078 624
2055 624 688 1719 -4734 1600 6019 -1449 -1758 -52 4319 -2491 -2838 3227 1233 -1940 -4833 2456
2071 2456 1012 -3680 -82 3387 2834 -5042 1758 3523 -1220 -1288 -1745 6871 -3538 -4896 3284 -955
2087 -955 -295 -5703 4879 4148 -5241 1298 293 4622 -4120 -1987 8072 -2849 -1257 -3113 2914
2102 2914 1157 -7081 3380 1320 712 -3184 -324 5419 -3725 -170 1770 3236 -1122 -3692 3451
2117 3451 -1120 -2269 -2626 3990 1432 -5854 2422 195 1439 -3181 839 7305 -4259 -309 -192
2132 -192 3236 -2243 -6210 6995 -1651 -1016 -2634 471 5724 -8380 2614 3812 827 75 -4192
2147d192J0794r372k15M267p0R75r301R722j234m264K970n4N650q910K605L739
2163C110k946j354k249R178o937j966L437j23J189p859R929j8m546M86l61P749
2179F719j2082M264N439m565J551q253J1683m317o497Q001k009M380r308N617
2193F23M676q461M016l308Q225o083n023R597o092J179l596O032K323q434M984
2208F58n47L048o342K073P083p584J234j957N731l945n371Q920l062J085n091
2223d067N355L730j0376O278j84L243m932k787R649q582Q77o10M793M93r999J0059
2239B940k491n03j450J42Q667j0464K441K429m51j806m521R207m297j498K89J795
2255D29L171j0067P489K515k720r84j724P389p908l66L906N29q76o720R053k465
$$ plain form
2147 -4192 6602 -2770 -2985 1282 1212 2187 -7114 2608 1374 -2890 80 26 5676 -3234 -629 3110
2163 3110 164 -1190 -3439 5739 -1198 -3164 273 150 1339 -6520 3409 3391 -1155 -669 -1030 6719
2179 6719 -5363 -1099 4340 -225 1326 -6927 4756 439 -6058 1943 -66 4314 -4994 623
2193 623 5299 -3162 854 -2454 5771 -312 -5335 4262 -1830 -651 -4247 1785 4108 -4326 658
2208 658 111 3159 -3183 -1110 5973 -1611 -377 -2334 3397 -548 -5919 3001 -61 1024 -4067
2223 -4067 1288 5018 -5358 920 736 3979 -953 -3740 5909 -2673 -1796 -2406 2387 2880 -7119 2940
2239 2940 449 -54 -1504 -1362 7305 -3159 -718 1711 1260 -546 -5067 4140 -157 -1655 -1366 429
2255 429 3600 -6467 1022 3537 817 -167 -1891 5498 -2410 -2776 1130 1659 783 -5937 3116 651
2271F51l607K113Q86N355r554M187M031m391k26k961Q692n803l154N369j839J202
2287I51o826P330K398n995K449k73M371p329P99O609m913M42l785O404j362o904
2303e634O434L4J063n286L727M301o667J323P4M991n054l154P630m417q28k410
2319c873N203K236q058N156J057K40m374J169O844p013N42L21K986k322n882Q423
2335B655k141j730q33K685L784q638L705K656p7k600j724O744n652j741J923K466
2351A482P5o535O819j58k820l58J080N616p409Q58M115j226k336l056P041k774
2367D14l180K318J683R55p395N595K822l779K46j77M908n947j653N337j128j416
2383c97l195O003j351m120K435J274K354o058K895M502m856n23n17M644l214l350
$$ plain form
2271 651 -2956 -843 43 5398 -4156 31 4062 -329 -555 -3516 5176 -627 -3781 1588 -251 951
2287 951 -5875 1455 3853 -2142 307 34 4405 -2924 -2125 4484 -429 13 -3772 2632 1270 -5634
2303 -5634 800 834 1897 -3389 338 4639 -2028 -705 -631 4360 -694 -3848 3782 -635 -1463 -3873
2319 -3873 1330 3566 -4492 664 1721 1961 -2413 -1244 5600 -1413 -871 -550 2436 114 -5768 2655
2335 2655 514 -1216 -2049 636 4420 -4218 -513 2143 2066 -534 -2258 4486 -1166 -2907 -984 1482
2351 1482 1557 -4978 1841 1683 -1137 -1495 -415 5201 -2208 -1350 2765 1539 -797 -3853 3188 414
2367 414 -2766 -448 1235 2190 -5205 390 3212 -567 -321 -498 4410 -1537 -3190 2147 1019 -397
2383 -397 -3592 2411 1060 -3060 -625 649 3003 -3055 -160 4342 -514 -1037 -1554 3090 -124 -3474
2399c474N223n92j665l495M759K016n034K205J256J709n018q8O033l855j193j28
2415a341L726j704m859M715M78j050k410L313L120o074R17K032J507l351j046
2430b027N529l539k053J88L232L82n298M151J459j842k225J707L928m576k14J652
2446D54J543k136l612N642j043k636P56J835J848n520J682L385j442j767N06L838
2462C333l743j898K520R63r93l300M078J103m073O82K423J074l735P39L244j151
2478A266k563k27L515j764k527K289J855j795k963L145J505k265k79J391K270
2493B853l755j052L699m87j970r29K614K36l395J187J899J81k990J600L502l267
2509g4j079J455J046j146k143K834J268l814o20K948J97k266M55K622o46k320
$$ plain form
2399 -3474 1749 1157 -508 -4003 756 2772 -2262 -57 1199 2908 -2110 -2198 3835 -20 -1213 -1341
2415 -1341 2385 681 -4178 537 1015 -35 -2445 868 3988 -2086 -1169 863 2370 -981 -2027
2430 -2027 3502 -37 -2090 -1902 1330 1712 -3586 565 2024 182 -2043 -336 3592 -984 -1198 454
2446 454 1997 -139 -3751 1891 848 -1788 -1032 803 2651 -2869 -1187 2198 756 -1011 -505 3333
2462 3333 -410 -2308 212 1175 182 -3118 960 2063 -2010 -1328 1095 2169 -1566 -827 2417 1266
2478 1266 -1297 -1524 1991 227 -2300 -11 1844 49 -2914 231 1736 -529 -808 583 2853
2493 2853 -902 -1954 1745 1258 -712 -1641 973 1209 -2186 -999 900 1081 -1909 -309 3193 -74
2509 -74 -1153 302 1348 202 -1941 893 2161 -1653 -2273 675 872 -1394 -939 1683 1037 -1283
2525a283O86K394o00l318K152K051k661r51R74J328j030k235L306J085k668m66
2541a236K033R35k667N33K085o69k435j05K394j95k932J777K345k060q38J030
2557eJ309r19k116K864O58k568k04J202R33l260J230K370j735j92j274L262m47
2574A108l439M116m42j048j314M04K644l250j71J313J362j693k204M457j202j638
2590i97Q96Q67J679l560J76K311r66k033Q78K200j735j007O33J636q53j757L070
2607A438k00j113j035J649J109m118K452P8J47j118j377M305l326l08J793R16
2623A292J26l714L875l76k005N63p55L888m530o29L803j844K45j621K803L86k603
2640a096R49Q83J032l659K039J451k147J55q88K383j705r87K057O36p03k000L477
$$ plain form
2525 -1283 -597 1797 1197 -2121 31 2082 -579 -1530 -556 772 -258 -2493 813 1898 -770 -1236
2541 -1236 797 1732 -935 -402 1683 1014 -1421 -1526 868 673 -2259 -482 1863 -197 -1035 -5
2557 -5 1304 385 -1731 1133 1791 -777 -981 221 1154 -2106 -876 1494 -241 -433 -1707 1555 1108
2574 1108 -2331 1785 1343 295 -1019 -615 2029 -1221 -1392 -79 1283 -410 -2614 1843 641 -997
2590 -997 -101 766 2445 -1115 -939 1372 406 -1627 -749 1451 -284 -1291 -658 978 125 -1632 1438
2607 1438 1238 125 -910 739 1848 -2270 182 260 407 -711 -2088 2217 -1109 -1417 376 1292
2623 1292 1418 -2296 1579 1203 -802 -239 -994 2894 -1636 -2265 1538 -306 -61 -1682 1121 1507 -1096
2640 -1096 -147 736 1768 -1891 148 1599 -548 -393 -1281 1102 -603 -1590 467 1103 400 -1600 1877
2657A877j463j393J707p34J957m036J372K501l253J171j248L455k056j999M083
2672A941j837R89k820K120K525m835J931j01J000j934j061L971k277L10j061J920
2688G81R22l846L105K13j027q71L21J910k337o7L03K004k323q56L891k799M49
2705b27m98J601R66l795K778k82j36j666M35L379m406J520M4N92L95l485N041
2722B256j665j124P14k72K497m462J867J146j338M49j783L436k045j282K019O9
2738D82N74k420K372j78j363L18k65K513l476N64J966j518K66j179K800j278q80
2755g02R52O5J034l459K971K96k425J751j245K238k201r64L145j634K51j335K581
2772A319n53k363K474r15J099j974K14K493k936Q38j44J310q97j550K955j282
$$ plain form
2657 1877 414 -979 728 -6 1951 -2085 -713 1788 -1465 -294 -1542 1913 -143 -2142 1941
2672 1941 104 1093 -1727 393 2918 -1917 14 -87 913 -1021 -2082 1889 -388 -78 -1139 781
2688 781 1703 -2143 962 1175 148 -723 -402 1508 -829 -896 -593 1411 -912 -1768 2123 -676 -227
2705 -227 -725 876 1842 -1953 825 543 407 -1259 -824 2555 -1851 -331 -287 305 700 -2785 2256
2722 2256 591 -533 181 -91 2406 -2056 -189 957 -381 68 -1715 1721 -324 -1606 413 482
2738 482 1056 -1364 1008 830 -533 -215 -480 2033 -1443 -879 1087 -431 -165 -1344 1456 178 -702
2755 -702 250 315 1349 -2110 861 1157 -1268 483 -762 1476 -725 -1689 1456 -178 73 -1262 1319
2772 1319 766 -1597 877 -38 1061 -913 -699 1794 -1142 -304 -448 862 -35 -1585 1370 88
2788H8K50j254J545Q71k827J683M4J62j523r7K485k319N98j96J185j63k202L003
2806A333r79n06p4L12J499l031J404J92L6m09j140L052k210r4Q48l23J171k343
2824a262K010O3j281L57m18J845k377M89P83l80L85j533K239n50j130J254l47
2841A47P38j962J096R50j378J99l71J541j381q34J649n39M06r47J414q4j320J085
2859D09l23O96j584M08J556k087P02l40R28l16j175J913n72J58p16O39O85j751
2877g70J196l45J85o57q06K177j507J47K19M56L12j396J347n2m11n12K96J062
2895I41k047Q71L65k35j09p44J849j039l03N99lP54j577J128K5p12L12o36J248
2914F87j473K45Q76p30N48p84J263l07p05J035p05Q66j295J18J113j389L51j62
$$ plain form
2788 88 338 -916 629 1500 -1327 356 400 562 -961 -1058 1427 -892 -294 -490 695 532 -1670 1333
2806 1333 354 -152 -226 86 1585 -1446 -42 150 186 -223 -1363 1689 -521 -615 233 -90 1081 -1262
2824 -1262 748 811 -470 -113 -531 1314 -1063 -574 209 -171 214 -1319 920 370 -760 494 147
2841 147 885 -1077 19 969 -409 -210 -581 960 -421 -1255 394 -145 261 -686 728 644 -676 409
2859 409 86 782 -802 -394 1162 -925 -223 -563 365 49 -1126 787 215 373 -343 296 981 -770
2877 -770 426 81 266 -391 -1197 980 -527 -380 -161 295 607 -789 558 506 95 -417 -121 941
2895 941 -1106 -235 130 -105 -214 -958 891 -148 -451 148 145 899 -678 450 475 -237 75 -561 687
2914 687 -786 -541 335 -395 153 -631 632 325 -380 655 -50 816 -479 -361 752 -637 -286 -448
2932d48N11q3n50R77l29K84m75L04M71j338J347o32o2j99n88J238j242N66J29
2951a19K94J05n97J124q54J55N2o2P71j689J094j95m00K26n04R84p77M34Q1o8
2971E5O35r83R42l72m83N19o74P21r09L76R1l55P91j096J248m35k19R01r84Q04
2991E73p64M36j84n30O48o74Q36r75K34J137j279P63k04L12k0m86P34n39k42j65
3011c89N04j4p86Q50l53N8K42l64Q60l90j07J00o8k62O2K01o27O20m36p2O32r40
3033f79Q71k22P5J40k48P51r11L69j65j11M06q83J051n51o25Q83l46N86p35L04
3053d0O72n91P4k86Q74l98j003J061n84O4K67o28P42k08l77O04j10j42K78k68
3073Ao5M48m87l74L85j41k1L70k37R9L13n92J55N26l94L81l18n55J427j036m37
$$ plain form
2932 -448 63 -20 -570 407 78 362 -113 191 662 -676 671 39 -23 -222 -810 428 -814 -248 -119
2951 -119 175 280 -317 807 -47 108 160 98 869 -820 274 79 -321 -95 -599 385 -392 42 123 55
2971 55 690 -293 649 277 -206 313 -361 360 -549 -173 -82 -437 354 -742 506 71 -148 753 -231 573
2991 573 -191 245 61 -469 179 -495 341 -634 -400 737 -542 221 17 329 309 -177 557 18 -224 -389
3011 -389 115 101 -685 165 -188 -130 112 -252 608 218 111 211 143 -119 -57 144 -483 137 -299 -371 261 -679
3033 -679 192 -30 45 185 -63 688 -223 146 -19 -130 276 -607 444 -107 -732 151 -195 391 -344 -40
3053 -40 632 41 115 -171 703 305 -698 363 -221 -157 110 -518 224 16 -361 243 133 -9 269 1
3073 1 -64 384 -103 -477 -92 -233 -254 116 -121 -22 291 -301 -146 380 -14 367 49 -506 921 -115 -552
3094e52M54j33O93j197M71Q53o87n4l86J270l96p57J110r07M82o45k51J447j248
3113d33M79l39K18L51o54Q24o87M28L19r71R65o35n9L90o76L55O31o92m60M58
3133a88q3N86k32o65J412p13n29K14M57J64j033P66j70M30p24o04K267k122P92
3152B5L35p46J666k192R48M11p63R38j405J303j056J26Q08j155J483j372P96K47
3170C97j107J584j022M42n07J19O50j290Q76m06P81p50n37J479n78k81m57J384
3188G77l77r59J076q54J380j996K77J788k005J057q16J078j32j256J870j351J014
3205E71r60N06J187k607K144j280K54N36j502K369j774J25N93r1O46j644J757
3222H30o75l37J13m28J655k092O68M39k22J39j161K399j545J7L39L1J072k601
$$ plain form
3094 -552 -98 -231 462 -735 -264 589 -98 -152 -538 732 336 -421 689 -218 264 -381 -632 815 -433
3113 -433 46 -293 -75 276 -378 446 -241 187 506 -465 500 -135 -194 196 -480 -125 506 -186 -646 -188
3133 -188 -271 315 83 -582 830 117 -412 -198 259 423 -610 156 -14 416 -308 -912 1355 -767 25
3152 25 360 -386 1280 -912 36 447 -316 622 -783 520 -536 -410 398 -757 726 -646 150 397
3170 397 -710 874 -148 294 -213 -94 556 -734 142 -264 517 -233 -770 709 131 -150 -607 777
3188 777 400 -559 517 -337 1043 -953 -676 1112 -893 164 -652 426 294 -962 908 -443 571
3205 571 -389 117 1304 -1303 841 -439 -185 351 -1151 1218 -556 -431 162 71 717 -927 830
3222 830 155 -182 -69 -497 1158 -934 -266 173 -49 90 -1071 1328 -217 -200 139 170 1242 -1359
3240a359J798j86m93K57n64J937k578Q91O18o52J269k362K721j055r97J626j070
3257a99J180k075R71Q62j352Q61j277J976j429m11K190j518J248j993J352M68
3273H54j847J541o75J131k165O28J433j572Q70j191K045q94j286K286j140P07
3289G25j793J241J003k288J511j053J330j376n09L031k331O61o29J033K58k157
3305a343K527j175L96j143J25K038k749J422l84O55K5j753K769j672K60m23O46
3322B21J226l003K094m79j89l36o07K939k610M87K95L92L06k191L045j371n74
3339c55K07k73J877l036J415O40p56J43j021K799k124k18J072j81J026k690K293
3356H18j46j488R31p01J969k417M27J203q23M25j392K728j188j339J637p13J144
$$ plain form
3240 -1359 439 253 -240 17 -547 1390 -1188 -297 321 -331 938 -1424 1297 242 -755 871 -199
3257 -199 981 -1094 -123 739 -613 248 -1029 947 -482 -893 1297 -221 1027 -966 386 854
3273 854 -993 548 -127 1004 -1161 -533 900 -672 198 -993 1052 158 -1128 1158 18 725
3289 725 -1068 173 1176 -1112 399 -654 676 -700 -1209 1822 -509 152 -477 556 814 -1343
3305 -1343 1184 9 405 -738 -613 1425 -1324 98 -286 369 394 -1359 1410 -262 -2 -425 221
3322 221 1447 -1556 538 59 -130 -466 -1073 1866 -744 -257 38 430 736 -1455 1590 219 -355
3339 -355 -148 -421 1456 -1580 -165 475 -281 -138 -1159 1640 -484 -702 370 189 1215 -1475 818
3356 818 672 -816 115 -586 1383 -1034 -607 596 -227 198 -1194 1534 346 -993 644 -69 1075
3373A075k549J506R85j828R54q97J911j704n69K310j173M13j529J790P6j943J711
3390E39l63Q16j990M16J939k332R01n73J580p88j652K926j261P8j079J020J184
3407A361k643J501q9L33j408j76K736j986L34l12R80K65k400K393l14l45r36M11
3425b95J699k505P94L56N15p18j035K932j724o61M34N34O88k490K061p9p48m79
3443g21K99K103k456K20Q98pk59j423K642p65j345N76L89R43k442J066R69j060
3461c73J36k56J923j742q47J655r8J0j359J786J54k006Q49J75J222k122Q4J879
3479A070j205j54k83J750j050j104J665l0j91j695J179J440k244N30M98N66j385
3496f43n81K243p26m83n39J725l23k034J833K0m6j216K01J693j620j06M08Q23
$$ plain form
3373 1075 -1474 32 1017 -811 143 -754 1157 -547 -1116 1194 21 434 -1095 695 771 -1172 539
3390 539 176 992 -998 -582 1357 -975 -74 -647 933 145 -1507 1419 158 236 -843 177 1361
3407 1361 -1282 219 130 463 -945 -1121 1615 -371 -37 -349 631 896 -1504 889 575 230 -706 -295
3425 -295 1404 -1101 -307 49 564 -154 -1189 1743 19 -642 -208 326 1014 -1476 585 506 -242 -721
3443 -721 -422 1681 -775 -555 343 336 77 -1346 1296 531 -814 -238 151 1094 -1348 -282 687 -373
3461 -373 -237 -493 1430 -312 -1159 496 398 408 -951 835 989 -1017 -168 7 1229 -893 -809 1070
3479 1070 -135 -289 -572 1178 128 -976 689 659 468 -1227 -48 1392 -852 -322 176 742 -643
3496 -643 -1224 1019 293 -190 -729 996 673 -1361 472 492 446 -770 -569 1124 -496 -602 -194 629
3514F29q04q44K295p05q83k79P40J163k428J175Q15p97r41KK018j440l51N57P60
3533F82m65j491J999J62j426l1P44Q83j981J78J165j94r65J5J953q71j210O93
3551a60P63j58j250J097M11j080l79N19J459j864o2J168m57qq33J591o1j596Q39
3570f1P05j45j389P05J037j364o9L56J400j287j252K072j27r09p9R90K63j409
3588e63n2J257J22j650P3J611p09q43M69J093o90j087J192O99o77r86Q33N79j282
3607f11QP37M30j171l22J481k84q18K85J183l36j665J198Q83j072o02M81J078
3625H83r79j112J390N85j237l56J550J86j517kJ097J59j196J2J681j026j366J044
3643b04O69l49j036Q73R84q45p45R22P68j277o00J317J80j185p4J109j57j350
$$ plain form
3514 629 -175 -1019 1276 571 -312 -591 149 1312 -1116 59 874 77 -864 -862 1156 -284 -635 -78 682
3533 682 217 -1274 725 887 -539 -570 174 1057 -924 -746 419 225 -740 -725 1228 357 -853 -160
3551 -160 603 445 -805 292 703 -377 -756 -237 1222 -642 -704 464 7 -1 -834 757 696 -900 -61
3570 -61 644 499 -890 -185 852 -512 -581 -225 1175 -112 -1364 708 581 -328 -407 583 846 -563
3588 -563 -615 642 764 -886 -813 798 89 -754 -285 808 118 -969 223 922 245 -741 92 671 -611
3607 -611 -603 134 564 -607 -929 552 268 -550 -265 918 582 -1083 115 998 -74 -676 -195 883
3625 883 -96 -1208 182 767 -470 -826 724 910 -607 -609 488 647 -549 -537 1144 118 -1248 -204
3643 -204 465 116 -920 -47 937 92 -653 269 1037 -240 -840 477 657 -528 -602 507 350 -1000
3661a000N79J329n08j457J025R31p66o67O76R33j412q07J503J62q50o95J458L55
3679G89j578O29M74N61j684k7K223j284o53K80Q47m46j305J491N08r29q64R77
3697IJ172j955M09J075q6j093l54J573j81j589O10J086l75j394J080P27n95r04
3715g85Q01J571j929k12R12K78q40q65J995n57j226J38J290M96k185J077J039
3732I98r85m04j38J908j619q70J435J22l39j197J416M77j793Q33N85O40j669j58
3750g58J850j018n28r1J613q75j563J634J70k79j211J211Q30j679K62P13R44k066
3768h41J27J846j036l96o12J756k27k263J856L39j57j393O76J820k145K03N74
3785A27Q61j127j172K434r26m96k40Q93N98k294J265N60j61j053J62K005j602
$$ plain form
3661 -1000 -421 908 400 -1057 -32 899 133 -534 142 1075 -337 -1144 359 521 -329 -1024 434 789
3679 789 -789 -160 314 875 -809 -836 1387 103 -550 -270 577 131 -1174 317 825 -104 -968 9
3697 9 1181 -774 -365 710 624 -469 -823 750 569 -1020 -410 676 301 -1093 -13 714 119 -785
3715 -785 16 1587 -342 -554 358 636 -204 -1069 926 369 -857 -719 571 1067 -1118 -41 998
3732 998 13 -391 -529 1379 -240 -1110 325 447 108 -1089 327 804 -989 -156 429 1069 -600 -758
3750 -758 1092 74 -454 -545 1068 193 -1370 264 434 155 -1056 155 985 -694 -432 281 1225 -841
3768 -841 -714 1132 96 -300 -912 844 617 -1646 210 549 392 -1001 -325 1495 -650 -447 127
3785 127 988 -139 -1311 1123 197 -299 -539 354 952 -1342 -77 483 322 -731 -569 1436 -166
3802a66k96N04N78o13j581K386k44r56l38O87J331k515R21J084l85p68n30K305
3820A404j621p05Q04N44J8k073K291o3j012p6K97J842k574N05J273p03k04j027
3838a080K240q64j327R32K05N61j908J230R99j331m8K51J625j978k66J502m72
3855B71k81j207K109l93j685J157J57Q37j951P91J249j477J68k36J572j178j059
3872a156J915p72n5j112J467O82k076J137J83O39j626J21J929j417J27n85J430
3889H31m96j851K068k66l0j081N80J445j956O53Q8O33r61o88K319j289l58l81
3907g40R68L48j970J736K21l89q39L57J756k034M13M98J0l58j283K207o94p01
3925d94m5O73P49k099J444M54l89m46n41K173j849n07J126OP9j507J776kj182
$$ plain form
3802 -166 -462 42 620 7 -1574 812 568 -388 -726 -39 1292 -1223 -302 782 397 -371 -901 1404
3820 1404 -217 -922 -118 426 444 -1629 662 599 -413 -489 -192 1650 -924 -419 854 151 -53 -1080
3838 -1080 1160 296 -1031 -99 106 667 -1241 -11 988 -343 -391 -140 1485 -493 -759 743 271
3855 271 -10 -1217 892 499 -1186 -29 128 965 -986 -195 1054 -423 -255 -491 1081 -97 -1156
3872 -1156 759 -13 -68 -1180 287 969 -1107 30 213 852 -774 -653 1276 -141 -14 -599 831
3889 831 335 -1516 552 286 256 -825 -245 1200 -756 -103 -15 618 -343 -1031 1288 -1 -359 -740
3907 -740 228 576 -1394 342 563 174 -665 -308 1448 -586 -173 325 335 -23 -1306 901 207 -494
3925 -494 -539 134 883 -1216 228 682 293 -153 -694 1479 -370 -877 249 255 334 -1173 603 601 -581
3944e81J59M62J088j799L40J066n42l07p54J915r47j027P86K37K84j674J590M19
3962G15j168L37P6J332j822p4J256n49K0j126J840m62j423J046J87M12j366R13
3980A44R76j413R1Q0J222j134q00J430l40l80q76J267L46j436Q97K09O06j401
3998e12L1J451r61l38OJ254p69j299J492k77q2p41R03P95j688O63M35K19q81j89
4018d88J504j011m05j79Q94qj635J523K01l77p34O49J184j536K6Q17P4o73q12
4037i86J646k15p48k74P14L90j483P90R17m43p57J29J384j220l67O57J19k87o81
4056g15J183K1j040K7O99N86j108L04Q53o23o13MJ222o16r33Q97J87m48j023J420
4076B84L73q17k25O34O86j246k19J095l02n36m02J176j95j075N41M78J51j172
$$ plain form
3944 -581 -422 40 1128 -671 -331 735 193 -114 -868 1047 100 -927 -141 96 380 -1294 296 715
3962 715 -453 -116 -40 1292 -530 -604 652 103 123 -1003 837 375 -1048 -2 185 597 -769 144
3980 144 1120 -293 -202 -122 1100 -34 -834 596 256 -124 -1000 267 613 -823 74 283 889 -512
3998 -512 -481 970 9 -329 -323 931 162 -1137 355 78 -4 -745 158 953 -735 -72 363 582 -299 -488
4018 -488 1016 5 -400 -579 315 307 -1328 195 396 19 -715 -66 1118 -418 -392 425 499 -174 -986
4037 -986 660 445 -303 -577 137 527 -956 -166 751 308 -449 -320 1064 -156 -523 134 253 -34 -715
4056 -715 468 489 -551 -524 175 761 -347 -43 810 187 -426 -422 800 184 -749 148 335 -113 -1136 284
4076 284 657 -160 -385 249 935 -311 -530 565 263 -273 -675 501 306 -769 -228 250 401 -771
4094g71P19J009j057k05N34M19o46n95J101j08q88j21R71j79j124O52P40j23q36
4113e08L12R76o09q01O45P02p78o09P32L11n33n34R25L96r50j27J003J39j303
4132f11L95R03l71p77M6J075l25j272Q66O51p51l82N07Q38j015k54R14J74r16
4151c05k5Q12P1j270K96R56l96p36K33R90n44q13Q50N75p36m47P63M14j038l28
4171f78R77J28q01r1R06q2q92M83N06K4j030M01R81p41p42O35N30o34o22P69M26
4192D53o51l03Q36L47r85j33J220l21j127O48N91k56j108L75R79o65o61P56N73
4211E68m90p15J105K76r19j66N98M64j085j10Q47l61n08J95Q05j48r75O69N49
4230E99m91m56M49P11r33n75Q58K12p90r1Q62J68j067MJ163j99j016O54N55k93
$$ plain form
4094 -771 -52 957 -100 -305 229 648 2 -593 508 400 -488 -609 362 183 -941 -289 451 328 -508
4113 -508 -196 780 171 -630 15 717 -61 -670 62 373 -160 -694 231 627 -323 -450 553 692 -611
4132 -611 -216 687 316 -461 -415 660 335 -937 -71 580 -171 -553 -46 792 -223 -477 437 611 -305
4151 -305 -330 482 553 -717 -421 535 139 -597 -364 626 82 -731 119 694 -42 -489 274 688 -350 -678
4171 -678 299 427 -374 -465 441 359 -533 -50 456 480 -550 -149 832 91 -651 -16 514 -120 -742 27 453
4192 453 -198 -501 335 682 -303 -436 784 463 -664 -16 575 319 -789 -414 565 -100 -761 -5 568
4211 568 78 -637 468 744 -175 -341 257 721 -364 -474 373 12 -496 -301 504 356 -619 50 599
4230 599 108 -348 101 812 -121 -696 162 374 -416 -507 355 523 -544 -540 623 424 -592 62 617 324
4250C24q69O37N05p14n49M92Q39p58p19J220j27m39j75P79K88j215L87N05k45
4269A66p03J03J021m98o58L53P13n86o23J201J61q99r5O02L60j041K6P03j5r39
4289f48K04Q69l23o00K98Q40l93q37J024K85o36o33O45N72j076k2O81r9n16k21
4309e86J014l4o37K84K29J65q56N19M95n67n17K16Q42q47l86R12J16m21m41Q04
4329C04L11j127L09M74K57r66P7Q90o17l84N3J013o39m65P69J08l44n48Q51L24
4349F50j014J83L80J84p56j27Q82l09k88o5P82k22q55Q19l8K7n29K88P51j118
4369c75l8L28L41l11o32J040j52m67%O44N10j336M61J91J31p49J04R97r45j96
4389d54L00M92k08o72J032j46m22q6L46L83j038L51L31k49j31k85R94o63l66M58
$$ plain form
4250 324 -545 92 597 -117 -666 -174 665 -93 -812 408 281 -158 -333 446 734 -481 -94 411 166
4269 166 -537 -434 587 89 -569 -216 497 -89 -712 489 650 -249 -344 258 618 -423 -397 306 291 -648
4289 -648 -444 425 102 -498 -200 640 247 -590 434 719 83 -550 95 667 -409 -431 250 151 -365 -586
4309 -586 428 394 -243 41 270 435 -421 98 593 26 -491 -275 567 -280 -666 246 362 -59 -500 304
4329 304 615 -512 -203 271 528 -438 -361 529 -88 -472 -419 594 -45 -510 259 367 23 -525 326 650
4349 650 -364 -181 199 383 -373 -500 382 73 -215 -280 502 280 -575 244 206 233 -296 -8 743 -375
4369 -375 -413 -85 256 -55 -687 353 201 -266 -266 378 888 -448 13 204 335 -414 -310 687 -258 -454
4389 -454 -154 338 130 -542 490 344 -78 -164 182 565 -473 -122 209 -40 -171 -456 538 -125 -491 -33
4409c3J98K29q91P94J22o23m4J44Q65j144J22M96j83r7n47R56k58n67N32J49K5
4430B45p17N34M24o36%o5Q06p32m04Q30j96q9m42O96J55o80K85J63Q9o39R0P69
4452D86n82k03k1P44m03n13O12J14j25m41O54K77r57M33j1L16p02j82R42m60k84
4473c06O4Q36k97p89N15K39j38m12K26P63j054O3L90J35n53j17P85m13k09N8N26
4494C12L05j033N70P9o4l82J24N90o22l59M05K57j73o20Q89J53o18p8M02M69r60
4515c54J95N99k11l55k47P97n12l89M01K39n5p86R65L00o71L2J89L49p95R4N21
4536C06j36m87k19Q42l46l82M15K64m4n89L42N15m63j97L22K90o24k45O13j46
4556C1l70r4P47r7n71M18K65K16r16L18N16n69k62N0O44l19o49Q29l4j11m25M69
$$ plain form
4409 -33 165 394 -497 297 419 -204 -248 -104 761 -383 -261 235 52 -45 -592 364 106 -461 71 220 245
4430 245 -472 62 486 -150 -150 -215 591 -141 -545 285 89 0 -442 254 409 -271 14 177 266 -373 -283 486
4452 486 -96 -299 -320 424 21 -492 120 234 109 -332 322 599 -358 75 64 380 -322 -504 438 -22 -306
4473 -306 -242 594 297 -492 23 262 124 -288 -62 701 -353 -290 100 235 -318 -435 350 -63 -272 -214 312
4494 312 617 -416 154 233 169 -213 -89 501 -121 -480 -75 182 9 -611 278 431 -187 -265 137 606 -354
4515 -354 -159 440 229 -126 -373 424 -88 -477 -76 163 108 -678 287 587 -84 -52 137 486 -309 -215 306
4536 306 170 -317 -536 306 -40 -422 -7 257 213 -376 -34 481 18 -179 143 433 -191 -436 177 31
4556 31 -339 -433 314 217 -354 64 329 545 -371 -53 463 -106 -368 -318 326 7 -642 187 153 42 -383 86
4578H6M04p55J21L67nm20j65P32m63k85J89L42k07l71O87Ml05n8M22R1o01oL60
4601A64J32o80m4P10l83k74J71O40j93o42L52L52Q8p19L14M18o69kK97K18k93
4622d3m69O89ol98J77K16K14n80M8N60l85l09J60M01m62q3M00J0k14j88M02K57
4644C97n16q2M27Om92j3N39k11m95K10M66j41n24L95L30j40m49M72J77l77k42
4665b63L18J62l49m26P05l0l79m8N47Nn05N12m3j87l1P3K82l96o9L44j73j53k93
4688c97N32J66n69M8O16k56j35k38N90j85m48L56Q2m3o29K81M37m87M2K28K70
4709B61l96M1K43J79k94j4J21jm66J08N09l22l73M34J53k87k01L79J88l40k38
4730c16N27N9l92k29L43J24n42K21J25J86l26L03K08k49k59K99J37K6m27L45q6
$$ plain form
4578 86 490 -265 -144 223 218 -202 -367 365 -98 -383 -194 148 -59 -430 257 261 -44 -102 320 411 -190 -196 164
4601 164 296 -384 -428 282 -101 -375 -204 436 243 -399 -47 305 393 -326 -12 406 -263 -265 32 250 -43
4622 -43 -512 177 171 -227 -50 166 380 -200 -152 408 23 -286 -126 275 -187 -270 130 140 -74 -262 140 397
4644 397 -119 -201 226 232 -260 -273 266 55 -440 -230 236 95 -429 -34 296 156 -293 179 356 -21 -263
4665 -263 55 217 -132 -558 147 117 -262 -310 237 242 -263 249 206 19 -12 61 343 -53 -122 222 49 -104 -397
4688 -397 135 301 -268 -220 396 140 5 -233 357 172 -276 80 162 119 -510 -229 208 -279 -237 -9 261
4709 261 -135 -94 149 328 34 20 141 140 -326 -218 291 -31 -404 30 183 -104 -305 74 262 -78 -316
4730 -316 211 270 -122 -351 -8 116 -426 -205 -80 106 -220 83 291 42 -217 82 219 245 -182 163 77
4751G7k95N9L9J92k73p4M22k5n5k40M29j64k44J79K77k56l30K58N0j70m5Q4J61
4774E6l18J55J94l5n1q0K52jk95K39p6N9m54K88J84j73L2j91M55k53N5L2No6j76
4799a63K70n2j69P5O0J00l94K1L70j08j58K18K57l39j08L45k08J7j3m8J69l03
4821a61M1N6j7q8J4L29q9q7P2J44o6l93L68j62P9k45M3K45l51L76j62K7J08j58
4845g7K20j20Q7k01Q8J49m44R3J72l1j34l3L30l09J40L15j39L4k34K00m7m6l8
4868b5j15L04k53n5J84j06J71j11K29j07p7l1r1J86k06P3R5j55P0l51M56j15j92
4891b22Q9J88O7k3N0P6k71O1N3o3k67M4K70j84j7K3K78j72o9K65r3J28l18J40
4915C3N0j45P2k10K22k61J25J89k83L09k56J69K15k96J80j90Q1%m3J92k24R4n0
$$ plain form
4751 77 -218 -159 -120 72 -201 -275 147 122 67 -173 256 92 -152 27 304 48 -282 -24 26 -144 -189 -105 56
4774 56 -262 -107 87 52 1 -79 173 172 -123 116 40 99 -355 -67 117 -56 -24 -215 240 -13 42 74 79 13 -163
4799 -163 107 55 -114 -39 21 121 -273 -252 118 10 -148 70 327 -12 -120 225 17 34 21 -27 142 -161
4821 -161 -120 -64 -81 -169 -155 174 85 -2 70 214 148 -245 123 -39 40 -205 -162 83 -268 108 -54 -27 81 -77
4845 -77 143 23 110 -91 -3 146 -298 -205 -33 -64 -198 -231 99 -210 -70 245 106 140 -94 106 59 13 -25
4868 -25 -140 164 -89 -144 40 -66 105 -6 223 116 39 8 -83 103 -103 -30 65 -90 -20 -371 85 -30 -222
4891 -222 -133 55 122 99 149 225 -46 15 68 5 -262 -218 52 -132 -149 -126 152 -20 -89 176 83 211 -107 33
4915 33 83 -62 10 -200 22 -239 -114 75 -208 101 -155 14 229 -67 113 -77 4 4 -39 153 -71 23 -27
4938b7N7J17l19N09l85Q2j35n5L19j57P8l0o5j43j78L50j70K06j09J4J45k70L37
4961A71j97J70j8k72L48k19m6n5J05J23l22L01k13K0K23j78L81n09M98l11r9J31
4983C2l19L09j36l8Q5m8N5j30L17l6j02K24k31K80m68L88j75j90L60l41K38k38
5005a64J39O9l62L91j27J56K1k60K73k59K64m31J40K74m92M36l48K43J74l45M24
5026B16n48N62j32j73J34j05K81k22P1r9j63K50k24J48K1R3J07m01M45k05N7j68
5048e5PK15l33K64k39K8Q9k47L53k54R4J96j65K37k21J75j65j7J56k37K24l70
5070b65K77l2j26L78l65J69n6R3J94l59K17j66J42j78k47M41j96J07j24P6J33
5091A13k68J64mJ07q5j72L39l97K90j54j9K32n09M96l29J55kN3K78l83M60k87
$$ plain form
4938 -27 30 147 -172 337 -48 34 -101 -156 163 6 84 54 -11 -154 -332 18 -152 54 -55 -41 104 -166 171
4961 171 -26 144 126 -146 202 -17 -63 -118 -13 110 -212 89 -124 -104 119 -59 322 -187 311 0 -99 32
4983 32 -287 22 -114 -152 -67 -115 -60 -190 127 91 -11 213 -18 262 -206 182 7 -183 177 -164 74 -164
5005 -164 -25 44 -318 73 -54 102 123 -137 136 -123 141 -290 -150 124 -368 68 -280 -37 137 -208 216
5026 216 -332 230 98 -75 59 -46 235 13 84 -15 -178 72 -152 -4 17 110 217 -184 261 56 113 -55
5048 -55 -48 167 -166 98 -141 -113 -24 -271 82 -172 -78 118 -47 190 -31 144 -21 -38 118 -119 105 -265
5070 -265 12 -20 -146 232 -133 36 -20 73 267 -92 125 -41 101 -77 -324 117 -79 28 -96 -20 113
5091 113 -155 9 5 112 27 -145 194 -203 87 -67 -86 146 -363 133 -196 -41 -43 10 288 -95 365 78
5113G8O0n9k36J99k52%K95j76J31k68N82j78k75R5l8M04m48J24k1L2K8k48M00
5136B29j39m7m4r7J75k78J77J25J7k4n5J12k88J52J46k06J23k39L46k18r5L73
5158B45k88J63k70K89J56l93k6N3K61l09j09K91J35l21l2J66J78k14L2j5J95k49
5180f2R7J6p4J4j10K71j21j56K84j11K5k90L45Jj47J32N1j26j98q5M80k41j21
5203a26Q8K91k33k59M12p7j50M8J61J04l40p6M15l95O7j01L45k38j85L12l7m7
5225b1mR5J71l08q6K33Q1k33L1J22k41J19k68K70j37K12m2K5K8j03K71m9p2l33
5249b39J33J39j59j83L98O0k48r9L25J72m73O4J83J6j07p1K75k30l6J9K6M5j73
5272a63K03K13j36j33K77j96pj53L37j60k28J11K37j00k24Q0M5R0j77J48o8j4
$$ plain form
5113 78 138 79 -157 42 -210 -210 85 -91 40 -228 354 176 -99 -4 -42 362 -86 38 17 49 77 -171 229
5136 229 90 43 -1 -98 77 -201 -24 101 118 94 39 151 -137 15 161 -45 78 -161 185 -33 -128 245
5158 245 -43 120 -150 139 295 -98 -124 -71 190 -119 -228 63 198 -123 -155 11 189 -25 7 -8 187 -62
5180 -62 35 51 -23 -9 -119 152 31 -125 159 48 73 -217 128 129 -18 114 165 39 -159 -244 236 -5 -126
5203 -126 -38 253 20 -239 173 96 -54 -6 155 259 -81 -157 258 -137 -70 -171 174 -64 -249 63 26 -21
5225 -21 -25 70 241 -67 -153 80 161 -72 -41 81 -160 -41 -309 -39 -176 36 -6 19 47 -56 215 166 94 -239
5249 -239 -106 33 -126 -309 89 149 -99 -198 127 299 -174 -110 73 89 -18 -89 186 -44 -80 -61 -35 10 -163
5272 -163 40 253 117 -16 261 65 58 -95 242 82 -146 -35 202 102 -122 -42 3 93 -84 64 -4 -18
5294a8k8K15Q1l66j9K91l2k69q5J41m7k9J8J76L5j26n0L20k64K3MJ69j54l68L25
5319e7K39l53o0K81k0j36l1L42k3k41o9L46j43m36L14K17k41j39P3L58j21j30
5341c0P1K74k49j92L04O0j64j58K23J22m26K06L4o1k19L0M33k72r2J58J85k46
5363il68N63J4l12j46K96J10m91J88K43q2R3k22M41k37k44K32M3l5k98L17j14
5385a8k0j39J06J51k79p3M82o2k50Q9K29q6j15m7k3K41m81K68J68j09j36L0K66
5408A92n27K60J76R0l00j70N70l31n5j12K39J29l22J36L30m69j04K57K87k43k65
5429b32L48O0j13j43K58q1l01K3K21N5k78J45M42m95J09r5L99j08n26L84j8L7
5451I1l12J65J07P2l35J21L86l76j50M93k48p5k13N95k02k80K65l5q3q4K5K31
$$ plain form
5294 -18 -46 169 250 -116 -135 156 124 -145 -230 -89 -136 -165 -147 29 64 -62 -112 208 -56 -33 -29 140 -14 -382 -57
5319 -57 182 -171 -231 50 30 -106 -137 205 182 -59 -128 218 75 -361 -47 170 -71 -210 -137 221 100 -30
5341 -30 41 315 66 -126 178 238 74 -84 139 261 -165 41 75 14 -205 -175 258 -14 -106 52 237 -9
5363 -9 -377 186 200 -112 -258 38 148 -343 -155 88 6 99 -123 318 81 -163 69 112 77 -221 96 -18
5385 -18 -38 -177 -71 80 -199 -272 210 148 -102 -13 216 130 15 -32 -55 186 -295 -27 141 32 -104 -74 192
5408 192 -335 -75 101 191 -109 -279 291 -40 -95 -207 32 161 -161 -25 305 -164 -268 -11 276 33 -232
5429 -232 116 176 63 -80 178 97 -204 -181 40 95 -183 -38 404 -91 18 -77 322 214 -312 72 54 91
5451 91 -221 -56 51 123 -212 -91 295 -81 -231 262 14 -61 -274 321 119 -161 104 69 -14 -98 -73 158
5473A58k29l3N4K09j6m73M50nk92l6K55J73n04K64J96j40j65L4L72j68r7L4J04
5496A45M1m43M36Om15LJ40L70n27J85K51N4j94j46M57k15l01K18m2O6n27M94J47
5519B03j90k26J64K03k69ML41k53K0k90N62q8k84o7K39N0m42L2M61j69m4j02K44
5542I9J8j84M18k32r2j25K10J76l37J6L8J53l76K7M49j97j09Q0K29m9m13L72l5
5565A36k52j64K70J95l16j1J02K59j5n27O63j48l50P2K31J63n60J82J53r0j32
5586a39rL67l19j43L76MK4l53L99k5l86j0K71J25o00K08M67k73j27j33P56l85
5608I5k44Q4J57J58n66L72Q0l75J30o7M07m66J8K55O3q3j51L81j73k95K66J24
5630A70J4m70K22L61l99J08j7K66l78j39M12pk11q0J90R4m94K26L60k19l41J46
$$ plain form
5473 158 -71 -104 -50 159 143 -330 120 115 -177 -213 42 215 -289 -25 171 31 -134 -100 272 104 7 41 145
5496 145 186 -257 179 185 -230 -227 -87 283 -244 -59 192 246 52 -94 363 148 -153 65 23 89 -438 56 203
5519 203 13 -213 -49 154 -115 -111 230 -23 -3 -293 269 181 -103 -170 69 119 -323 -291 170 1 -43 -145 99
5542 99 117 -67 351 119 27 -98 112 288 -49 -33 5 158 -218 -191 258 61 -48 32 261 212 -201 171 136
5565 136 -116 -280 -10 185 -131 -142 -40 219 204 -323 340 192 -158 -86 145 308 -252 -70 83 -7 -139
5586 -139 -148 219 -100 -243 133 137 161 -192 207 182 -204 -214 57 182 -418 -210 257 -16 -143 -276 480 95
5608 95 -149 -65 92 250 -316 56 136 -239 -109 -176 231 -235 -217 38 101 18 -133 248 75 -220 46 170
5630 170 184 -286 -64 297 -102 6 -11 255 -123 -262 150 143 -68 -148 42 136 -358 -132 228 9 -332 -186
5652a86L99k08j60O5L48k77j49N37j33k91j02L01M0k31K2j1K60l47n9K98r7k54
5674b35K74J82Nl87L02K22m02j71K56M30o56j75M43J13l10l8L67J9l72P6J34J03
5696A80n06K95K66k32j98J06L62n32J6K77K40m20j11M05J12m27k0K26P4k89J27
5717d9K00k75j19K6N94m54o8Q8L40j24m17K76J71l93M9L32J57n73P7M11k94k65
5739c10J57L76k44o5J13J06n5k68J34K02l51q8K27J98l67q8M92k1k71QJ51J29
5761A65l50J71J40p9k94J83K34j41l27K61K86l49j80M45Q4k45k66L04J88l92L9
5782a23J40L4l81K96J95o9j54K52J27j22m89K20L91l47j54J93J85k58j03K68m3
5803E8k30K3L48k4m27l1M95j65j30L2M75k92k82J47J80k18j87J67J52m7k19K65
$$ plain form
5652 -186 213 5 -155 -90 258 -19 -168 369 236 -55 -157 144 184 -47 -25 -36 224 -123 -182 116 19 -235
5674 -235 39 221 226 -161 141 363 -39 -210 46 476 -180 -355 88 201 -109 -147 220 239 -133 -57 77 180
5696 180 -326 -31 235 3 -195 -89 273 -259 -243 34 274 -146 -257 148 260 -167 -187 39 113 -176 -49
5717 -49 151 -124 -243 -217 377 -77 -145 -57 283 159 -258 18 189 -204 -155 177 334 -239 -162 249 -45 -310
5739 -310 -153 223 -21 -86 27 133 78 -190 -56 146 -205 -293 -66 132 -235 -323 169 148 -123 -115 36 165
5761 165 -185 -14 126 47 -247 -64 170 29 -298 -37 249 -100 -280 165 249 4 -262 42 230 -162 -123
5782 -123 17 51 -330 -34 161 92 -62 190 317 195 -294 -74 317 -30 -184 9 194 -64 -167 101 58
5803 58 -172 -149 199 175 -252 -283 212 47 -83 -51 424 132 -150 -3 177 -41 -228 -61 91 44 -175 90
5825I0K38n62K18K64Nm87J59L65k47l45J79K74j00k71K85P0k07l1O7K78l71n6
5847a85L20L2l46LK31K48l41P7J66o2k26P8L01k44o0m6K52k67j87M61p2k52q5
5870b04L06j42k94K43K73j24k4j26M27j69n07K38Q5M0l45L23J48j64j06J21K81
5891B80k47k68K80O3j15j81J97M6j99k8L48m6k61j7L12j28j82K25J93m02m7L53
5913A76k1k19r7K83J2k05j4K53j64k02oL93o6k57J26J65k56j8R3K48j58l38K58
5936a4K47k43j8r9L04k23j46M67r3l25P2K78l12r7K39j0nk97K42L60l50j11J39
5959EK15l10j88N17O9m22P4O3J32l62K27J25p3j54j6L80k58k15J67J91j71l7J20
5982G9Q1l16j45L79K43l34p4L41r3j68j44M87l34k61K87O6J6m44M71j4k13j06
$$ plain form
5825 90 328 -234 -16 248 253 -234 -75 290 43 -302 -123 151 51 -220 65 135 -72 -103 -36 242 -129 -185
5847 -185 135 167 -179 -176 55 303 -38 39 205 143 -83 -5 296 52 -8 -54 198 -69 -256 205 133 -119 -204
5870 -204 102 -40 -334 -91 182 58 34 -92 335 166 -341 -103 -18 22 -323 0 148 -16 -122 -1 280
5891 280 33 -235 45 108 -7 -188 9 55 -144 -172 176 130 -131 -148 164 36 -146 79 272 -130 -177 176
5913 176 155 -64 -161 122 134 -71 -85 168 4 -198 -204 189 123 -134 -8 157 -99 -117 -24 224 66 -272 -14
5936 -14 233 -10 -28 -127 177 -46 -192 275 182 -143 -71 207 -105 -202 37 27 22 -275 -33 327 -23 -134 5
5959 5 220 -90 -278 239 308 -114 -40 23 155 -207 20 145 72 -82 -98 282 24 -191 -24 167 -4 -41 79
5982 79 160 -156 -301 78 321 -13 -87 254 161 -7 -151 336 2 -259 28 94 110 -334 137 123 -90 -196
6004a96R7M61n22j37M38j47j42j2K26J76m89J9M45j26l19O7K80J2m19J64K98l31
6026a57j50L95k8o5l21N10K3m60K12K37K0l98k6M17k09n3R8rnj90L74q4k39j97
6050c05M09J73l32j89K35K45m03j21N26o1l47J84J64N4l31J12K88k93k24K47L17
6071C48m92j49K97J20l36NL70J20l61k62N34j56k92L8K22j9k92K64J12o6j00L59
6093B64j14n8k31L40j37j44M9J9K12m20R9L42j53j57L3K49k1l64J83R6k2k88K40
6116A7K86m89o3N01j73k56O7K55Jk21O2K60j17m12L10J66k11l36J88J13K4q9K21
6139A04K46o23J33L21p1k29j81M14J85k61K01r0J22n32K04L24k87p2O2J51j78
6160e7j48L02N7k68p0J11L45m78R3J71Jl31J04M06j60k49J82J84j69j59L2J75
$$ plain form
6004 -196 -99 362 -160 -297 141 -6 -148 -160 66 242 -247 -228 217 91 -228 -161 119 131 -288 -124 174 -157
6026 -157 -307 88 60 -5 -326 184 207 -253 -41 196 216 -182 -208 209 0 -53 45 36 31 -159 215 131 -108 -305
6050 -305 104 277 -55 -244 -9 236 -167 -288 238 177 -170 14 178 232 -99 13 301 8 -216 31 348
6071 348 -144 -293 4 124 -212 -207 163 283 -78 -340 194 38 -254 -216 6 -13 -305 -41 71 5 -95 264
6093 264 150 92 -139 201 64 -80 -31 -12 200 -220 -121 221 68 -89 -56 193 172 -192 -9 87 65 -223 17
6116 17 303 -186 -249 252 79 -177 -110 145 146 -75 -13 247 130 -282 28 194 -17 -353 -165 -52 -28 -117 104
6139 104 350 -273 -140 181 110 -119 -300 114 299 38 239 149 271 -261 -57 267 -20 -92 -30 121 -57
6160 -57 -205 97 154 -114 -184 -73 272 -206 -113 58 59 -272 -168 238 78 -171 11 195 26 -133 -101 74
6182G4m6k02J93O4q3k22L54J15l52l2K30L9k29j70L08J21n33J93K65p4k18J90
6204a5J26j54j21K65j9q6j26L47Pl72M3J57j04j23J05L24k83j19J77P7j44k84
6226c22L15K73l34l19L67J65l73O1K44j54q9J13q7J7j3K28J61j27k15O7J38k2
6248I4m03K60J86l40j84N01J84n02r7O12l20j21l6K66j0j37R8j4O3k3j27J72M8
6271A70k42J32Jk02j77L81J13k40j0J36M2q4r8K36k12j17J26J11m5j11P7Q3N6
6294A26l96K93K12j37k98K83m3j10o3J27o8kP9J64m2k41R5K17o6l18P2K37q6j28
6318i3K08O8k22l76M91L9j46j54J37L95l59j62L40j42m3R4O2j69k09L03J04l7
6340A29j71J1K16k10j89L31J40k78j61L73j55n7j44K08R6k73P9L56r2k72kL00
$$ plain form
6182 74 28 -174 19 83 0 -222 132 247 -105 -137 93 132 -97 -267 41 162 -371 -178 87 13 -205 -15
6204 -15 111 -43 -164 101 82 -4 -130 217 224 -148 -105 52 -52 -175 -70 254 -29 -148 29 106 -38 -322
6226 -322 -7 266 -68 -387 -20 145 -228 -167 77 -77 -166 -53 -140 -123 -136 92 253 126 -89 -22 116 94
6248 94 -309 -49 137 -203 -387 114 298 -204 -301 311 -9 -130 -166 100 90 -47 51 37 100 77 -50 122 170
6271 170 -72 60 61 -141 -318 63 176 -64 -74 62 104 20 -78 158 -54 -171 -45 66 21 -90 -13 70 126
6294 126 -270 23 235 98 -200 83 40 -70 -133 -6 -74 -76 3 167 125 -116 -21 196 130 -188 -116 121 35 -93
6318 -93 115 183 -39 -415 76 115 -31 -185 -48 347 -12 -174 166 24 -19 75 137 -32 -241 62 166 129
6340 129 -42 -31 185 -25 -214 117 257 -21 -182 191 36 -21 -165 43 139 -134 -55 301 209 -63 -65 235
6362B35k57j97J22J68k38j10M73Kk75j45K17K48m01J29K31j5l17J7J46j22r7L05
6384A19L9l8j68L6J79j93j9K22j79m2k3J91j37j31N5J85k6l02J42J23J7j96K3
6407a23L38j82k00K03K23k39K4J7P1j46k60K75K13l03N5K06P1k56j98K26N6k69
6429a98K54K8r5jo2J29Q5k68K70J7k21m8K53r4j33l4J59j30MK1P0J39l90K25O3
6454D3j39n8J56J16j43j62K45J50l13j4K45J4j32k38K72K5j70q6L66l01o9K77
6476H4n2N6k45J42N7l7k31L75p9r0n0P8J10j55M8P6j07qj45M56l53j23L00R9k44
6501c8j8J8J58l24QL47j8k75LL50n1j32k17K75l1j93Q6K63k44k1O8L9r6j38J82
6526AJ07o8j91J54Kj13o2J03J91k31o2K70j5r5k01L02j21l2J92P4j25l34K76L6
$$ plain form
6362 235 -22 -219 -97 71 -167 -277 196 198 -77 -222 -5 243 -158 -29 202 187 -130 -113 33 -89 -186 119
6384 119 158 120 -48 -12 167 -26 -45 177 -2 -44 -67 124 -13 -144 -89 96 70 -232 -90 33 50 -146 -123
6407 -123 215 33 -167 36 259 20 44 61 132 -14 -274 1 214 -89 -34 172 243 -13 -211 15 71 -198
6429 -198 56 84 -11 -12 -74 55 140 -128 142 159 -62 -110 143 49 -84 -118 41 -89 -85 -64 6 145 -245 -20 43
6454 43 -96 -154 2 118 -25 -187 58 208 -105 -119 126 140 8 -230 42 67 -103 -189 177 -124 -193 84
6476 84 32 88 -157 -15 42 5 -226 149 70 -20 -70 8 118 -37 11 87 -20 -28 -173 283 -70 -193 107 206 -38
6501 -38 -56 -38 120 -204 -196 151 133 -142 -139 211 160 28 -189 86 55 -138 -52 211 -33 -54 14 53 -43 -181 1
6526 1 108 40 -151 3 5 -108 -170 -67 124 -107 -169 101 86 -9 -210 92 -29 -61 131 205 80 -254 22 58
6550E8p8q5K72j61j12r5L27M4j45j58K68j0j82q6K59Rm19J65L07k53m4P2J25q1
6574cl1K25jl52l9K07J21k34N7m8K12j30j37J94O2j93K33rp7j60K05J62k40j57
6598a33J54J24l63J17K06j41l2J35J42m7j50J1J21J6k41J8J37k33R9n2J90k34
6620a56J83l7P5J8j14J65j20j68J15Q6K08l88J63J73k11m7m9K95k24j69J56J77
6642A31j79j5K57o6j46K34k53M7j18Q4J28k47N8kJ37o4j15P2J49k2n9Mj23p6Q2
6667a02Q6J40j28PJ09k9j02q0K34j56j32J48R6P6l89K09L3r4J5J09j8k1j87L57
6691A81j05k18J24J26N3l41J13K01k07q2J40K5k6n1L2L2P7k46M13j92k9L8j17
6714e9J42j84L9J11l5p8J64J7j07j4L2J25j85R4j53Q6j00qK7J27o0q6J45K8k44
$$ plain form
6550 58 -20 -105 167 6 -106 -201 126 170 25 -133 135 125 -57 -143 116 125 -294 -129 178 -75 -119 -47 78 -3
6574 -3 -34 191 190 -162 -201 6 127 -107 -50 -98 114 -16 -153 41 103 -90 143 134 57 -103 102 264 24 -133
6598 -133 21 145 -218 -101 105 -36 -68 67 209 162 12 23 144 160 -81 -63 74 -159 -60 -112 78 -156
6620 -156 27 -10 65 83 -31 134 14 -154 -39 47 255 -133 30 203 -8 -55 -104 191 -33 -202 -46 131
6642 131 -48 -63 194 128 -18 216 -37 10 -108 -24 104 -143 -85 -87 50 -14 -129 -57 92 70 11 15 -108 -184 -102
6667 -102 -16 124 -4 3 112 83 -19 -99 135 -21 -153 -5 91 167 -222 -13 20 -74 -59 50 32 11 -176 181
6691 181 76 -142 -18 108 161 -180 -67 134 -73 -155 -15 10 -16 -67 -35 -3 74 -172 241 49 20 58 -59
6714 -59 83 -101 -62 49 14 -64 100 117 10 -4 28 153 -32 62 -91 -5 -105 -113 -86 41 -19 -105 40 68 -176
6739a76J63J78rj37k1Q6J10l79L86jk35r8J36J16p2j49J04J35M0k78J29m0k7Q8
6763D9J9j08LN5Rk3j09J54J34j97m2J21j3Q3j90J20K2j38j17K02j0j55K2J86N1
6788A28j46O7R1j06j87K10N5r9N4m2P5r8P5j67K26j06j31J39N9j82r0J92J9r0
6812e4r3K53j4j66K19m7J0j48N3O5j47J23R2J6j55K7j21k1O5N2j56J27j72K13
6836B1O7k9j36K52k61k1n0J93r5M5M3N5k9j19J52k1q9J24j05J18o8k25J55j2J65
6861A30j18K5J17k30n0J09mJ28j77R0M4n5j63J7J56k18J62k9N9p9K03p1o2r4J77
6886F7J89l09M3l5J13j94P4O1N0j42J00k6J93j35j7J57q1j79lJ09j37J33Q0k47
6910a36M2p7J57P8o0J09l8p5M2o0J17r5l1l7Q5J24j75LM2o8R1r4J44l9K5j62l6
$$ plain form
6739 -176 -13 165 156 19 -2 84 194 -185 201 200 -35 -133 3 119 47 -102 2 137 177 -101 28 -12 -39 49
6763 49 68 -40 -37 18 27 4 -105 49 183 -14 -56 65 52 135 -55 65 87 -51 -168 34 24 -131 -109 77 128
6788 128 -18 49 140 34 -153 57 112 13 67 25 100 2 77 -90 136 30 -101 38 97 -85 -175 17 36 -54
6812 -54 -147 106 92 -74 145 98 108 -40 13 78 -69 54 146 162 7 34 -87 -108 -43 9 -147 -20 -192 21
6836 21 88 59 -77 175 -86 -107 -157 36 -59 -14 29 84 55 -64 88 67 -22 102 -3 115 47 -178 -23 -35 130
6861 130 12 37 154 -76 -126 -17 -21 107 -70 20 64 9 -154 -137 19 -199 -37 -66 -7 -86 117 46 -16 -110 67
6886 67 256 -53 -10 -45 68 -126 -52 9 59 -83 17 -9 184 49 32 189 108 -71 -74 35 -102 31 111 -136
6910 -136 -94 -171 -14 64 4 113 75 0 42 -18 99 4 -27 -64 21 145 -30 -27 15 -53 38 -56 88 49 74 -88 -124
6937a24O7J27j03j53K26N8j31P1J4j35K31k74q7K50l3Nm8R5L6j36J91k24Q4Q3
6961I0j65J47j4j1k1om5j6O4O8j43jJ7N8j58K5J7J02j72J94q0K08j36qR1M9l75
6988b21L14L2q7n7j75K63j30J74o9j6j15p5L6K27o2q6O2KO3qn9oL1n5J36j32o1
7015g4J21j03J13JJ42j61j71K43p5o5Ro6J18o0R8jO0m9j72Q2J07k3K2J2j96J33
7041D5r9p6J37J9J1J3j36J46j60J00k6p6R4m4K24j77r0J8J4K28L5j79J47k38Q0
7066A0j18M6k7O7Q7j50J22M9J26m9r7J28k87Q1m9R7J00j35j5K09l7rn6j59k3J76
7092H7p6m6o9M9Pm4R0j23J10j20K46j05j04K78j30P2jk70J37J27o3Lq9q4J24N2
7118E8p8J08j90P3K51o2l54J43j0JM5o5Q8K0O5r3j17J17j64J46L9j27N3j6P7o5
$$ plain form
6937 -124 -57 70 -33 -186 40 98 -33 38 52 -83 148 -126 -213 37 4 9 -39 56 92 -44 147 -77 7 90
6961 90 -75 72 58 47 26 20 -25 -41 23 91 -52 -53 -36 22 -136 -111 -94 8 -164 30 -50 158 22 14 105 154 -221
6988 -221 93 125 38 -19 -194 69 -61 113 44 28 -87 -162 -126 101 39 -47 15 17 80 72 13 7 38 -17 119 -13 -74
7015 -74 47 -56 57 58 200 39 -132 111 36 -29 -20 -86 32 -28 70 69 129 80 -92 -10 97 74 96 108 -88 45
7041 45 -54 -130 7 26 37 50 -86 60 -100 0 -26 -102 -8 -52 172 -5 -95 -77 -63 165 200 21 168 -70 10
7066 10 -108 -62 -89 -22 65 -85 37 86 212 163 66 194 -93 -12 -61 36 136 1 -14 195 158 149 93 -66 -89 87
7092 87 11 -35 -104 -55 -48 -92 -2 -125 -15 -135 111 6 -98 180 50 122 121 -149 -12 115 52 55 -34 -118 6 58
7118 58 -20 88 -102 -29 222 160 -194 -51 -61 -60 -15 -80 8 28 93 0 -117 0 -164 -18 21 -106 -53 -69 8 -57
7144e7P6KJq1R6Q1l49Q0J95pJ3j21J53l3N6k74Q0K80k81J02r3J28j46K13j1j21
7170a8M0p5K68j11Ok4j10J48o5J18j79l8J57k64J14M9j6J0n2n7J57j21q7L1O1
7195e8J83k59J66j33O8P1j25J87k88J83nj25J21j3O5l0lO2j11N3J48j26K8j38
7219g9J54o3l4k0O2q9J54m1j04P5M9j27J21m6J69k75Q4K04n9j06j42N1J67k17
7243a12J6J19J14k23J0L8J07n5J3Lp4L0Q4j94J60o8O3Q7r8J0M4Q9p6j46j36K94
7269I9j17m6J8n2K7K09k64J47j28K1K57j67N1j75J82j52O3J95K5j44j37O6J0P4
7293F2J4p4J38j57J68l90K46p2J77o7Q9j88J27q5p0m1K6K32k83K51m4J6j04k9
7317e8M5m2l4j79K80J39k37P3o4J59j27J76j03j30j2J74M2k37Q4K28k20r3J95
$$ plain form
7144 -57 19 21 22 -59 37 118 -231 -151 44 37 50 -71 82 49 105 -169 -89 191 -90 12 -81 47 -99 114 103 -18
7170 -18 22 -53 215 104 110 86 -24 124 59 177 -2 -40 117 -147 -33 16 0 10 -42 -99 58 -63 -150 -119 -58
7195 -58 125 -134 32 -101 -33 38 -87 100 -188 -5 -10 -135 -14 -27 38 8 5 67 -44 9 157 31 59 -79
7219 -79 75 12 -22 -42 20 -69 85 44 -60 15 64 -63 58 12 181 -94 -10 194 135 29 -113 -62 105 -112
7243 -112 -96 23 137 -86 -76 -38 69 14 27 30 -44 -14 70 -124 36 -32 31 118 20 30 74 163 87 -59 -195 99
7269 99 -18 -64 -46 -98 -71 138 -126 21 -107 -86 171 4 55 -120 62 -90 -27 168 193 49 -88 -22 -12 62
7293 62 76 2 140 -17 151 -239 7 -65 112 45 134 -54 73 -12 -82 -123 -97 135 -148 103 59 75 -29 -58
7317 -58 -13 -55 -89 -268 12 151 -86 -13 -77 82 -45 131 28 -102 -114 60 102 -135 -51 177 -43 -136 59
7340E9LN9p9j52L04j81Q9k2k58J45p1J37j34M6k37L51j03M3j41Q1K45j26M9j89
7364h2K99j99l5J01l03J79j77K34j43r4J44J50o6j9oM8k25L11Q0k6l02N5N1m6
7388g1Qk3J85L6k48L23j32p3k20J51M6j19J67J24n2j71K13Nj9j71j7J29j39P5
7412GL8J25k49Q6j29J14O8l34L44O6j48q2N6K24j85J47k16J58j51j59M36k74K6
7435c2O0K4Qj90P3K15k52j11K49N5k36K7P1P8j14l0K37k03n2K04o2j1j79K8K04
7460F1O6j82j36J86Q8k19L14qk51j02P5K35j23l1J07k57P5O9J67j81n7K45rj15
7484A7j70N5K40k44P9K9J62k94J8J15K4j8k0P7Q3k55P3L11k34j00O8J22j52l77
7508c91M23N7j56j21K60L7k12K49j42j38L32j95K0j26n4L08k8p4k42J01K78k7
$$ plain form
7340 59 62 121 42 -110 194 13 102 80 -178 -33 -104 33 -101 -55 -292 59 -44 -1 -142 -61 184 58 107 -82
7364 -82 217 18 -17 84 -219 -40 -217 17 -126 -220 -76 74 8 -11 -17 31 -194 117 197 171 -131 -76 -25 -71
7388 -71 -63 -86 99 135 -113 210 78 5 -215 -64 -18 -137 30 154 102 -69 144 149 130 -41 -58 71 -68 7
7412 7 45 170 -79 7 -122 -8 60 -274 70 136 -12 -94 -38 186 1 148 -68 90 -61 -220 216 -58 -32
7435 -32 28 52 60 -130 -57 158 -94 -205 44 99 -137 -110 -39 39 -75 -105 132 -71 -123 81 19 8 -171 -143 61
7460 61 127 -55 -191 -5 83 -136 178 170 -81 -183 -108 127 4 -27 80 -177 -102 -33 134 -47 -104 141 132 17
7484 17 -153 -98 142 -102 -23 6 168 -126 -108 7 31 13 -7 70 153 -102 -29 282 48 -52 16 138 -14 -391
7508 -391 32 89 -67 -188 72 109 -103 146 4 -134 198 3 23 -103 -157 151 123 49 -193 -92 186 159
7530A59l59L30j49J11j99K15j1j10R3m7M8j38j7K39jj91J32N6k44q0J8L95k14
7553C6j48J9K57k65k6K60R2l18O3J06j86l0J88K48k62o4l1k0p0j03R8K49J6k11
7577a02J1J33j6k05K73K2j17jJ40j73n3r4K43j76n2M7J42L8j81K23Q3l40Q2N7
7601a6M6k28P6K38Ol06n0L77j84J7k6J98m0j99k2K29m2k13n2L82j38k20J15N4
7625Bj72k8M34n6l58J40K52N7m64P7L21j06k73K61j0o9n6L8O3o3k68L78J17l22
7649a05L1K75p8k46K3J94l5k75L05m9l0j74K20j8Qj92K71l8k18P4R9P7k38p4L35
7674A42j01o3j71K58N3j89Q6l6J04j89J28J47j64k30J43M14m07k25M36K1j84k13
7696b40K72P6k37M6N9Q3o6l5K25j02k62J27K77k86m9K57j46n5j87L11N2l40K58
$$ plain form
7530 159 -200 130 -19 92 -107 108 97 -13 80 33 81 -57 -74 165 164 -27 105 161 -83 -163 -145 250 36
7553 36 -112 -93 164 -101 -127 133 225 -93 -30 76 -110 -140 48 296 34 -30 -61 -81 -151 -254 -156 93 109 -102
7577 -102 -91 42 26 -179 94 116 -1 -2 138 -35 -88 -182 61 -115 -167 -120 22 60 -121 102 185 -155 -73 -16
7601 -16 30 -198 -122 116 122 -184 -234 143 -41 -24 -50 148 108 -91 -113 116 74 -139 -191 191 53 -167 -52 2
7625 2 -170 -198 236 180 -178 -38 214 271 -193 -116 205 99 -174 87 77 8 -48 -10 53 -10 -278 100 217 -105
7649 -105 -74 201 123 -123 -100 94 59 -216 89 40 10 -164 56 38 46 -146 125 87 -131 -57 42 119 -119 -193 142
7674 142 41 -22 -193 65 118 -71 15 -21 83 -106 22 169 5 -225 -82 332 -75 -300 136 157 -27 -240
7696 -240 32 108 -129 -83 -24 59 -7 -42 183 81 -181 -54 223 -63 -112 145 -1 -56 -243 68 120 -220 38
7719C8J49j87o8k3K82k96PL0J60j45k23L20N5%k40M2K25k96J48R9Q7j59j36L81
7743B50ok86Q3l0L8k16K84Pk8k95J03K04k32J4K69j94rR2J21k98J6O7J32J05k11
7768b0J5J25k49Q6k1J55r0k38K47K37p5k72R8J71k77j38L06J96m34J2L60q1l12
7791a99L9L58m1k01J78J00j67l76L58J84l59k29L19J68o9k04K74j5j16j99K49
7812E2P0l01J41J52o7k58K07J68j64k88L94l3r5N3MJ49k40j42L15j53n4N7K88
7835B55l38ml5J96m6j66O6J91k00r9L30%j90j51K24J11m0k49J55J64k92Q5L13
7858B80k20k02Q5L04j46k68J56J17j30q6J94k4p1k49K96K19k51j29J22P2k00J9
7880a12K83m5l24P6K43j43j17J51m9J22k38K91j93J12j46J98r2o3M5Q7J39k44
$$ plain form
7719 38 187 0 -68 -91 191 -105 -98 -68 92 -53 -276 44 99 99 -141 -99 126 -170 -22 77 164 5 -131 250
7743 250 244 -42 41 11 49 -167 117 124 96 -199 -96 108 -124 -110 159 -35 -44 48 169 -129 -113 -46 86 191 -20
7768 -20 -5 120 -129 -43 -64 91 1 -237 10 247 172 -100 -2 169 -108 -246 60 256 -178 -166 194 113 -199
7791 -199 -160 198 157 -44 134 234 67 -309 49 233 -126 -355 -36 132 63 -141 133 118 2 -197 52
7812 52 122 -179 -38 114 47 -211 -4 164 0 -288 106 73 -22 31 35 184 -56 -198 117 -36 -90 -33 255
7835 255 -83 -87 -122 74 28 -138 -72 119 -81 -180 150 150 -40 -191 33 144 104 -145 10 174 -118 -33 280
7858 280 60 -142 -57 247 101 -167 -11 106 -24 -110 84 60 -11 -260 36 255 4 -125 -3 69 -131 -112
7880 -112 171 126 -198 -122 121 -22 -139 12 -37 85 -153 138 -55 57 -89 109 17 -46 -1 86 225 -19
7902a9k16K03O9n0P5J11q3j99N8J64j17r6J91o2j10M7J33P3l29M8K36J19m87O0
7926a81J39K40l06p0K71m2k04K02M2j00k09K05Q0j91J2K09l6l03J59K81J8l33
7948a17P3K69j60l05L14J15k86n1J3K21j18k49K13J77m8n6kK9j57r8L35l4k86
7971b08R4RK28k97O1O0J57k74K19P3j91n0J60J37k30k67L95J91k28k55M08Rk90
7994h9qJ25M2k72K20J15r0k94K16K46j74k12L08j47Mp6J96kk70o7N19k07j72o7
8018a56K64k03j3j0J70j00j26J00K00k00j66L80j34n3k3J03J98l72k7L42K8k72
8040g0Q9J12j14j27J30K63k47j86J56K47k47l11K68K02k61o4L05p6q2k85K92N0
8062D4k29K16K66k45j96N9L0J63k34m5K92l15r3M06m8K3j99J90m4j61k3R0J8k1
$$ plain form
7902 -19 -235 -32 37 -13 62 173 90 -109 -51 113 -4 -100 91 29 -81 -34 99 172 -157 -109 127 246 -241 -181
7926 -181 -42 198 -108 -178 93 51 -153 49 91 -9 -218 -13 67 -124 -112 97 61 -242 -83 198 216 -117
7948 -117 -44 225 65 -240 74 189 -97 -148 -135 86 -32 -281 -68 109 61 5 3 32 -125 -223 112 78 -208
7971 -208 -114 -105 123 -174 -113 -53 104 -170 49 122 -69 -119 41 178 -52 -319 76 267 39 -216 192 201 -89
7994 -89 -97 28 70 -202 18 133 43 -251 -35 211 37 -175 133 -14 -10 -86 110 108 -162 -229 290 83 -89 -156
8018 -156 108 -95 -108 -118 52 -48 -174 -74 126 -74 -240 140 6 -47 -70 33 231 -141 -168 174 202 -70
8040 -70 19 131 17 -110 20 283 36 -150 6 253 6 -305 -37 165 -96 -160 145 69 -13 -298 -6 44
8062 44 -185 31 297 52 -144 -85 -55 108 -126 -171 121 -194 -287 119 71 94 -105 85 41 -120 -143 -53 -35 -56
8086e6N6P2j24l23K11L33k42K0J37L6o0j58K80j17r3n8J57m9j57K6K19j0k76J22
8110e4K23o2j67P0K37j91l60K75Q0k1O0j61J89j97JL29j08k59R9R4l0k44K36J13
8134A52j59q2R1J57l58K39j97K95j16j13J99O8k26r0K90K2j74j9O8k0k82J28M17
8157B90k29j25J67N1k80K01j55K42j80n5O2N1j94Q2J17q8j72J02L84k79k12J40
8179h0K44R5l69O2J29M6j40k60M16j19k4j03
$$ plain form
8086 -56 0 72 -52 -375 -164 169 -73 -53 84 120 60 -98 182 65 -28 -86 71 22 -135 -109 110 100 -176 -54
8110 -54 169 107 -60 10 247 56 -304 -29 51 30 90 -71 118 -79 -78 251 143 -116 -17 77 47 -197 39 152
8134 152 -7 -89 2 159 -199 40 -157 138 22 -91 108 176 -50 -140 150 172 -2 -21 47 27 -255 -127 290
8157 290 61 -64 103 154 -126 75 -80 162 -18 -73 -11 40 -154 -72 45 -43 -215 -113 271 -8 -220 -80
8179 -80 164 259 -110 -48 81 127 -13 -273 143 24 0 -103
8191a03
$$ Imaginary data points
##PAGE= N=2
##DATA TABLE= (X++(I..I)), XYDATA
0@%%%%%%%qJ6j6J6j6K4l2M0n0N8p2Q8j07J31j54J78k08K42k79L22l70M23m82N48
31B92o21O99p86Q81r88J103j225J364j515J676j852K046k259K490k740L015l317
48a737L645m005M406m854N352n909O540p260Q087r051J0189j1552J3220j5304
62h233J7980k1541K6488l3764M5369o6359J14468l78474j54415Q85207o70092
73b43366M14803m11457K65838K77701o16830L56744o0964L05653m56994N7817
83a11055M12867m59746K56482l44553M16885j14366l96940N81840l07765J75650
93A09299k58349J10743K59086m19473L20009j36990J99049k92610q0523M27612
103B37853l59740J89325k59888L54941n9691m70771O12474l39163K15015j92601
$$ plain form
0 0 0 0 0 0 0 0 0 -8 8 -8 8 -8 16 -16 24 -26 32 -40 48 -59 72 -82 96 -112 130 -149 173 -197 226 -256 292
31 292 -329 370 -416 465 -523 580 -645 719 -796 880 -972 1074 -1185 1305 -1435 1580 -1737
48 -1737 1908 -2097 2309 -2545 2807 -3102 3438 -3822 4265 -4786 5403 -6149 7071 -8233
62 -8233 9747 -11794 14694 -19070 26299 -40060 74408 -304066 -458481 426726 -243366
73 -243366 171437 -240020 25818 303519 -313311 43433 -17531 288122 -168872 -111055
83 -111055 301812 -157934 98548 -246005 170880 56514 -340426 241414 -66351 109299
93 109299 -149050 -38307 220779 -198694 121315 -15675 183374 -109236 -189759 237853
103 237853 -121887 67438 -192450 162491 102800 -367971 244503 -94660 120355 -72246
113g2246q0540N27177n68650K22644n8305R9962l7353k87153N10523l50885J38761
124D3935j48607M862L55056n38522M49247j10892j01468J39235k68628L68139
134A92357k51332L7715L7427j2483L8205k54405L82028k40754K8099P6357j03791
145g0577K87156l74746K04730K1664j13394P3288j49072L36786k99009Q984Q3452
156I262p1904J78428l14256L34141p4218j52575J34900j22815K79550l29848J17458
167a1877J35455k12757J65724k32491K65784r3691j81604K40366q0133R2688k06420
178a18956J62185L1933j73810J58775j14491K25257k24288q1467K58034j83730
188f0558O8108q7462J42816o156j73818J31453m321R5500k26481J28631J35354
$$ plain form
113 -72246 -152786 374391 -194259 28385 -29920 70042 32689 -254464 256059 -94826 43935
124 43935 -104672 -99810 255246 -283276 165971 55079 -46389 92846 -175782 192357
134 192357 -58975 -21260 16167 3684 41889 -212516 169512 -71242 -43143 33214 -70577
145 -70577 216579 -158167 46563 68227 -45167 28121 -120951 215835 -83174 -74190 9262
156 9262 -62642 115786 -198470 135671 61453 -91122 43778 -79037 200513 -129335 -11877
167 -11877 123578 -89179 76545 -155946 109838 16147 -165457 74909 -5224 87464 -118956
178 -118956 43229 75162 -98648 60127 -54364 170893 -53395 -134862 123172 -60558
188 -60558 7550 -79912 62904 56748 -117070 14383 10062 105562 -120919 7712 143066
199A43066k21275J15168j04135J60640j04628j54429K65704q1950j775j23636
209a07250J31601O3200k05505J58773j5484Q0240j59179m4168K32327j77471K0284
220b2632k4538J08762k1173j92599K05047l0605m187q5538M7169J65867k02205
231e6632M4249L2803K7251p7899o2516J89081q7844k3389n8377Q1523O4402j97342
243a24690J58763K8573m5333m8551j0793J42505j20675j2010K5975O1669m8433
254G000j20199J79443n8375n1053N584L2897J04002j53701M2359O1026l6485m0845
266b8347j1216J39732r9114m7237L0336J9690J4507j04661J14426J9138p3415
277b6161L140K2866P3245j07851J3360O8764k8901k4123m0460R4186m9344o8716
$$ plain form
199 143066 -78209 36959 -67176 93464 -11164 -165593 100111 18161 16386 -107250
209 -107250 24351 87551 -117954 40819 25335 105575 -53604 -97772 134555 -42916 -22632
220 -22632 -47170 61592 40419 -152180 52867 22262 18075 -67463 -20294 145573 -56632
231 -56632 -12383 20420 47671 -30228 -92744 96337 8493 -14896 -73273 8250 72652 -124690
243 -124690 34073 62646 17313 -31238 -42031 100474 -20201 -32211 -6236 55433 7000
254 7000 -113199 66244 7869 -43184 -37600 -4703 99299 -54402 -12043 48983 12498 -28347
266 -28347 -39563 100169 1055 -46182 -15846 3844 18351 -86310 28116 47254 -26161
277 -26161 -23021 -155 73090 -34761 -21401 47363 18462 -5661 -46121 48065 -1279 -69995
289f9995N6470L5660J2483q7847N8170L6667o5324N582L1854O3937r1699l0412
301d4454P6212k4393l2338k0069P8058r007q1506M1956N0187q144p7902N0227
313a173O4370o3462j5246K3996L8368o8454m9582R4746J4833o4027j6830O2061
325A9600J787o8892K7014O9928k405p9846J3578P6172m9609n2684M0236M5745
337D0624m5019n5605O1192M5303p1018l3945P5911L6157o0828j8199O8505k113
349D0965q3940N437Q3279j0591q3520J9969N9528l4974n3200M1849P7110n3114
361H798n8897O6514L9842n5762m8128P0217K4199p4795p667N0808J9393q2279
373d7757p997R1974q129n2940R507O7186l4836o2104M7265L9942j0729p8808L1957
$$ plain form
289 -69995 -13525 22135 34618 -53229 4941 41608 -23716 -18134 13720 77657 -14042 -44454
301 -44454 31758 7365 -24973 -45042 33016 24009 -57497 -15541 34646 26502 -51400 -1173
313 -1173 63197 -265 -15511 8485 46853 -21601 -71183 23563 38396 -25631 -42461 19600
325 19600 21387 -47505 -20491 49437 47032 -32814 -19236 56936 7327 -45357 -5121 40624
337 40624 -4395 -60000 1192 46495 -24523 -58468 17443 53600 -7228 -25427 43078 40965
349 40965 -42975 -37538 45741 35150 -48370 -28401 31127 -3847 -57047 -15198 61912 8798
361 8798 -50099 16415 56257 495 -47633 22584 46783 -28012 -35679 15129 34522 -47757
373 -47757 -55754 36220 28091 -24849 -15342 51844 17008 -45096 2169 42111 31382 -47426 -15469
386a5469O3746q1164j1548M7036L0620m6243k8531P0567M367l9733l2010P3866
398C5504J0091r1308N1756K0624k0394m7012k551Q8664m7055l0297L1123L3425
410C2570l1870n0660Q4902K815l6241j9809K3659L7475q3295J5840M0553o138
422I801l5099j1967Q3333m5916k8728K5103K3061J4504o6245N3443J4861n0766
434a4615j8227K4026M9547p3629J7822K3135p251m012m9768J06870k8452o0484
446c5038N6621p354J2567o0340K7888L5670m5268p867M536P2294q9435r596Q3407
459C8085m5837K5094l9464M8756K2310j00111M4330L1418k545n6507K2178M5725
471C3432n6680J730k847O4913l6661m9618P8540q923j3498m8556N8584J8976p9014
$$ plain form
386 -15469 48277 -32887 -44435 2601 33221 -13022 -41553 29014 33381 -6352 -38362 35504
398 35504 45595 -45713 6043 26667 6273 -40739 -43290 45374 -1681 -31978 -855 32570
410 32570 700 -49960 34942 37757 1516 -18293 5366 42841 -40454 -24614 15939 9801
422 9801 -25298 -37265 46068 152 -28576 -3473 19588 34092 -32153 21290 36151 -14615
434 -14615 -32842 -8816 40731 -32898 -15076 8059 808 -3204 -52972 53898 25446 -35038
446 -35038 21583 14229 26796 -33544 -5656 30014 -15254 -23121 -18585 53709 -35726 -45322 38085
459 38085 -7752 17342 -22122 26634 48944 -51167 -6837 24581 22036 -34471 -12293 33432
471 33432 -23248 -21518 -24365 40548 3887 -45731 32809 23886 10388 -38168 20416 39392 -39622
484c9622M5250o378L1114o0401k1919R3584n2095Q45m093N5439k8484o9856R6988
497D0372l5610K0441m8496K765R6032j39051M2191M0850k2030J44m6675R4331
509D5264k7590l8222M640M0200K0873j04808Q5531N985l8998p434l5854R9610
521D9197n8307k9561N1913O600j8334m5678P4718j3819j2059j6019Q262N8059
533E4972j03133M4130J7535k0358L087l9744R9028p2195p307L5230j9385M7773
545C9633r1169Q8038L504p4744L7725k1962O7447q5670J7748N5525n9186L6397
557A3286p3774R9924q281r3629J01084l4284J9424l5672o298N3709m3723n334
569a3568q069O6225o7112j5427O3328n1808N1352m8144L8208K5498p5023M7616
$$ plain form
484 -39622 5628 -750 30364 -30037 -51956 41628 -10467 -9622 -13715 41724 13240 -56616 40372
497 40372 4762 25203 -23293 -20528 75504 -63547 -21356 19494 -2536 -2392 -49067 45264
509 45264 17674 -20548 -15908 24292 45165 -59643 25888 31873 -7125 -14559 -50413 49197
521 49197 -9110 -38671 13242 19842 1508 -44170 30548 16729 4670 -11349 -3087 54972
533 54972 -48161 -4031 13504 -6854 -3767 -43511 55517 -16678 -23985 11245 -8140 39633
545 39633 -51536 36502 40006 -34738 2987 -18975 48472 -37198 -19450 36075 -23111 13286
557 13286 -60488 39436 31155 -62474 38610 4326 23750 -11922 -18220 35489 -8234 -13568
569 -13568 -21637 44588 -22524 -37951 25377 -26431 24921 -23223 14985 40483 -34540 13076
581A3076j3602L0096n6190K1392M0635p6907N2472m4891N9101k3024n6161J10029
593E6026o6168K5546l3547K4743M3806j10002Q7612k9230J6047j8615n6882J15031
605E4367q4032J7828J7559j247K5763p9669P8454k1328j436o802j8667P5358r6028
618c9880L3507J7646k2860J6329m3418O9425l1871n845J21J4051K3519p9534Q7858
631C9048k4943j8700Q078l9359Q2556q0905J9327K7719j5207J2021o4450J03288
643D8473n2287j0459L7242m3666Q2960j04500L9007L9999o8116L8768m3137P0395
655C4679m3452k1320M7934l4911M7915o7241N8322J7681o6982M3466l3256M8103
667C0938m8471m284M7335m5073K7462m5558N7617p395m6854N7627k3614K6660
$$ plain form
581 13076 -526 29570 -26620 -5228 35407 -41500 10972 -33919 25182 2158 -54003 56026
593 56026 -10142 15404 -18143 6600 50406 -59596 28016 -1214 14833 -3782 -60664 54367
605 54367 -29665 -11837 5722 4475 30238 -49431 29023 7695 6259 -543 -19210 56148 -39880
618 -39880 -6373 11273 -11587 4742 -38676 30749 -1122 -6967 -6846 7205 30724 -48810 39048
631 39048 14105 -4595 3483 -35876 46680 -34225 -14898 12821 -2386 9635 -54815 48473
643 48473 -3814 -14273 22969 -20697 62263 -42237 -3230 36769 -31347 7421 -35716 34679
655 34679 -8773 -30093 17841 -17070 30845 -36396 21926 39607 -27375 16091 -17165 30938
667 30938 -17533 -21817 25518 -19555 7907 -37651 19966 12571 -34283 23344 -270 26390
679B6390m4680K3226J9820m4463K7883l5046O4599n3092k0382O8266o5726N1077
691A7872l7659K7167L0636p3119N5061k0826K0830l2096n68M8512o4399L7266
703H677l3602L3296M370o1349P9285l5232J2234r570l839M0305n9318L4245p860
716A642J4228j7892l1453N9459m6122J5230l420J0804J7097m9702M9683j7521
728B033Q356j1807o833M7247o5200K8675p12o304N968l6462N7938k8506J348J304
742b955K511K7263n8725N2649n310j8192R958k9802M8901m1732j601K2711p127
755a451O964l5778N0102j5511j2557J5584j1249L6090m9497J6377J9668k6804
767h062L560j5482M0157k7074r515K0128p062J4676l6176M0851M492l0578J5877
$$ plain form
679 26390 -18290 4936 24756 -19707 8176 -26870 37729 -15363 -35745 32521 -33205 17872
691 17872 -19787 7380 38016 -35103 19958 -868 19962 -12134 -12702 35810 -28589 8677
703 8677 -24925 8371 12741 -48608 30677 -4555 7679 -1891 -5730 34575 -24743 9502 1642
716 1642 15870 -2022 -33475 25984 -20138 -4908 -8328 2476 19573 -30129 19554 2033
728 2033 10389 -1418 -8251 38996 -26204 2471 1759 -4545 1423 -35039 22899 -5607 -4259 -2955
742 -2955 -444 26819 -31906 20743 15433 -2759 7199 -22603 26298 -15434 -17035 5676 -1451
755 -1451 5513 -30265 19837 4326 -8231 7353 -3896 32194 -17303 -926 18742 -8062
767 -8062 -4502 -19984 20173 -6901 -16416 3712 -3350 11326 -24850 16001 20493 -10085 5792
780E792r474K6000l7174K670K7737k1698K329j7879L6715j3681k1991K9105n089
793C362J2842k9326J8829J7330l4539Q960k403K2959k5581j2647L0741j6039K539
806b973j3486K6539N252l0222K0203K810N063k4626Q398K3165k8200K228l571
819i420J9614j2110k3684L3614k755n303p713J5319Q339k6104J0785O576O552
832A3710k2455l138K6826k2433l523L752J3666j372k1968K2291M641q428p526
845e957J0224J2281k2436K101P736K633j5679p248K5382r353q796M583R931K292
859G694j8178J1983J2932r210j1101P897R658j8250k482Q819M498r531q950J9611
873E390K86j2972L195J3802q78j4065P736Q498q810j0824M901J0524r809q829
$$ plain form
780 5792 -3682 22318 -14856 -12186 15551 -6147 -3818 -21697 15018 1337 -20654 8451 3362
793 3362 16204 -13122 5707 23037 -11502 -2542 -4945 18014 -7567 -20214 10527 -5512 -2973
806 -2973 -16459 10080 15332 -14890 5313 8123 13186 -11440 -3042 20123 -8077 -5849 -9420
819 -9420 10194 -1916 -25600 8014 5259 -44 -7757 7562 15901 -10203 582 7158 13710
832 13710 -8745 -11883 14943 -7490 -11013 -7261 6405 5033 -16935 5356 9997 1569 -5957
845 -5957 4267 16548 -5888 -3787 3949 6582 -9097 -16345 9037 -316 -9112 -4529 5402 7694
859 7694 -10484 1499 14431 5221 -5880 2017 11675 -6575 -9057 -238 4260 -5271 -14221 5390
873 5390 5676 -7296 -4101 9701 8823 -5242 2494 10992 2182 -8642 -3741 6783 -3026 -11855
887a1855J0416P359j2848k160J6202R0p725p41R073J582j4256K48J3280p037j3991
902a2363R668O000o162n717M019J3082p750o329J2528L796j1740m114J2974k495
916E397r743k423P764L390j8040P193J2141n946l947K330J3500q974o059Q677
930E260J948m198j2486J2814J977j5286L275L910O267r314Q72J1854k637l624
944F32l439J4868p107j1438J2302m943j365p265Q27J2260r918n329J0689P465
958H239j2206K862Q628l602K021j1317J0606L265j9404P505M110p40r204M906
972d331Q929p031L221n249J3934k357j4009J7350q560j417k082j645P851j4648
986a0044Q103p4m10K551q237J7855q851l711J1165n489K400q124K916M494p854
$$ plain form
887 -11855 -1439 5920 -6928 -9088 7114 7204 -521 -1262 7811 9393 -4863 -4615 8665 1628 -12363
902 -12363 -2695 3305 -2857 -8574 -4555 8527 777 -5552 6976 10772 -968 -5082 7892 5397
916 5397 -4346 -6769 995 4385 -13655 -6462 5679 -267 -4214 -1884 11616 2642 -3417 5260
930 5260 7208 3010 -9476 3338 5315 -9971 -6696 -2786 3481 -5833 -4961 6893 4256 632
944 632 -2807 12061 4954 -6484 5818 875 -490 -7755 -6928 5332 -4586 -9915 774 8239
958 8239 -3967 -1105 7523 3921 5942 -5375 5231 8496 -10908 -3403 707 -33 -9237 -4331
972 -4331 4598 -2433 788 -4461 9473 7116 -6893 10457 1897 480 -1602 -3247 4604 -10044
986 -10044 -1941 -2015 -2425 126 -8111 9744 893 -2818 8347 2858 5258 -2866 50 4544 -3310
1001c310l757L401P584j1706J609R077j109J162o202R022M191j0504j960Q538
1015F036k679j0971P426m819M247j088r947J9911j1355J353J0065j0515J0557
1028H221q489N018j954p914J0534j2548R183r591Q08J5623k1786J5971j460j862
1042b46R389j6649J7252n164n250J818n652J3684j7913K220Q852p281O872j0286
1056h354P900Q799j0019K80P571o71o320M360n386L284q93p985Q007m663J207
1071b883M46K666j222J28J1124j6454J4114k891r997J7575k4559J6751j390j6856
1085a3448J9206j6662J4746n751n471J5476j1521J3875j5663Q224Q157j8165J4268
1098G271j5277J1856k329j5121J7828j0088P181n056J690J0195j1069P888m911
$$ plain form
1001 -3310 -7067 -3666 3918 -7788 -6179 2898 1789 2951 -3251 5771 9962 -542 -2502 6036
1015 6036 3357 -7614 -188 -5007 -760 -1848 -11795 8116 -3239 -1886 8179 -2336 8221
1028 8221 -268 4750 2796 -5118 5416 -7132 2051 -7540 -6732 8891 -12895 3076 1616 -246
1042 -246 9143 -7506 9746 4582 -668 1150 -4502 9182 -8731 -6511 2341 -4940 1932 -8354
1056 -8354 -454 8345 -1674 -1394 6177 5506 -814 3546 -1840 1444 551 -7434 573 -4090 -2883
1071 -2883 -2437 229 -993 -865 10259 -6195 7919 5028 -4969 12606 -11953 4798 3408 -13448
1085 -13448 5758 -10904 3842 -1909 -7380 8096 -3425 10450 -5213 3011 11168 -6997 7271
1098 7271 -8006 3850 1521 -13600 4228 -5860 1321 -3735 -2045 8150 -2919 4969 58
1111E8M373r19n474L759k841J648p810Q884p538M224N794j5212K1862j4416M262
1126F54Q380j6752J9162j5050O821j965p532J1697j6806J7870j5605O883J1884
1139I641k4870K7353j7064P418O871j9464K4367j7595M069r20l626R578j7819
1152a2061J5438p535L415K243r483J6961j1495O017k321K193K345j1475J1418
1165E660j1593Q988o563k902J2446j5768J3258q709Q438k8q787J9193k0488J5639
1179H784j0315k548J6715k8519K3603j1200j909R322j5885K1432j6609R192K162
1192D225n101J0162j9197K1810j3928j036Q770j4776J8306k0221Q947M207q531
1205f363J0578j1066J6223j1593K779N142q673J2473j8242J4657m255p211P265
$$ plain form
1111 58 4431 3512 -1962 1797 -1044 604 -7206 1678 -5860 -1636 4158 -11054 10808 -3608 654
1126 654 9034 -7718 11444 -3606 3215 1250 -6282 5415 -11391 6479 -9126 -2243 9641
1139 9641 -15229 12124 -4940 2478 9349 -10115 14252 -3343 726 -194 -3820 5758 -12061
1152 -12061 3377 -4158 -743 1500 -7983 8978 -2517 3500 1179 3372 5717 -5758 5660
1165 5660 -5933 3055 -3508 -6410 6036 -9732 3526 -5183 3255 3227 -5560 13633 -6855 8784
1179 8784 -1531 -4079 12636 -15883 7720 -3480 -5389 3933 -11952 9480 -7129 2063 4225
1192 4225 -876 9286 -9911 11899 -2029 -3065 5705 -9071 9235 -10986 -2039 2168 -6363
1205 -6363 4215 -6851 9372 -2221 558 5700 -2973 9500 -8742 5915 1660 -5551 1714
1218A714j1113J6547j6509J0034K105p485J4890k1049K1724r747n631J5067j7179
1231f632J5010j7061Q338L565j3457J4640j3466J6880j1160j321J5055j7082J5648
1244H957j2506R434l70j3911J5705j4696J0850j0262K584J1576j7354J4367r512
1257e138R547j523o884J4377j3473J0466j2220N652M221j7105J8522j4348R986
1270B080l345p237J7768j6146J1953n704N132K440j3946J5977j4331Q522n904
1283b741k295J3026k0534J5848p224K709M896j1024J8471j2976N308j720j793
1296d9O786j5513J4750r607L389k80q786J5881j4844J0211r19j160Q270j4509
1310f380J4673q653Q31J908o352J1141j5028P393k123K17L367r475J7087j0871
$$ plain form
1218 1714 -9399 7148 -9361 673 2778 -4707 10183 -10866 10858 1111 -4520 10547 -6632
1231 -6632 8378 -8683 -345 3220 -10237 4403 -9063 7817 -3343 -4664 10391 -6691 8957
1244 8957 -3549 5885 5515 -8396 7309 -7387 3463 -6799 -4215 7361 -9993 4374 -5138
1257 -5138 4409 2886 -3998 10379 -3094 7372 -4848 804 5025 -12080 6442 -7906 2080
1270 2080 -1265 -8502 9266 -6880 5073 -631 4501 6941 -7005 8972 -5359 3163 -2741
1283 -2741 -5036 7990 -12544 3304 -3920 -1211 3685 -7339 11132 -1844 3464 1744 -49
1296 -49 6737 -8776 5974 -3633 -244 -524 -9310 6571 -8273 1938 1019 -141 8129 -6380
1310 -6380 8293 -360 471 2379 -3973 7168 -7860 -467 -2590 -2373 994 -8481 8606 -2265
1324b265L912J978o099J1732j5387J0438j019o353L959p646J0381j0096M050K930
1338E15j588O190j2064J3954n516k390O289p792J0020j2232K952L529p513M768
1352h78n306J0213n132j779M893k201O474j1354J0274M81q144N630p965Q110p529
1367d213j975R870o166J612l643Q156j683m929O921j689L956r262K924M566r766
1382e321M273k501N752l973m594R829m476P57j238N589K137q278L658LQ55o528
1398d056J146P342q154J204p9L503l99o350R650R90m326q38L025J702p430Q30
1414b240M336L19o653n34P607n033k396L419N163m41o922N534L460o005k238M458
1430A834K311o573j767M701J04n440k77Q532m90n573L209L006m92n672K793N948
$$ plain form
1324 -2265 1647 3625 -2474 9258 -6129 4309 3290 -3063 896 -6750 3631 -6465 -2415 515
1338 515 -1073 5117 -6947 7007 1491 -899 5390 -2402 7618 -4614 -1662 1867 -5646 -878
1352 -878 -6184 4029 -1103 -2882 2011 -190 6284 -5070 5204 5685 -2459 3171 -4794 3316 -4213
1367 -4213 -6188 3682 -2484 -872 -4515 3641 1958 -2971 3950 2261 6217 -3045 -121 4445 -5321
1382 -5321 -1048 -3549 2203 -1770 -6364 3465 -1011 -254 -1492 4097 6234 -2044 1614 1617 2472 -4056
1398 -4056 -2910 4432 -3722 -2518 -2597 906 507 -5843 3807 4797 471 -367 2658 4360 -3070 -2240
1414 -2240 2096 2415 -4238 -4772 2835 -2198 -4594 -1175 3988 3547 -3375 2159 5619 -386 -2624 1834
1430 1834 4145 -2428 -4195 506 610 -4830 -5107 3425 2935 -2638 571 3577 3085 -2587 206 6154
1446F154o538k396K098J715l497n383R422K129o999J635L797K962p726O39Q015
1461F027k887m429k371Q469n114q652R327R87n35n525K855R949j0825p85P008
1476C499K132m403n001P803k429n582m42N600J203q240N083L483k608l934L580
1491b56P247o781r27K412K779o112m949J0599l772k305k586N913L013j3805J0105
1506E75L160k51m014l443J5420j3347k958N777M85K771j4644J2519J750r744L200
1521b744M14J1007j1933J385R315p253J013o320J0563k729r040P916j746k01o989
1536g342O793M695o507K309Q66O513j0451K14Q557m746k48o643J1866n357r619
1551i100Q843j168P497j3987P124J0969j4563N218m496J2317o323j0792J6519
$$ plain form
1446 6154 -384 -2780 -682 1033 -2464 -7847 1575 3704 -3295 -1660 2137 5099 -2627 -1988 6027
1461 6027 3140 -1289 -3660 4809 -305 -8957 370 1357 822 -4703 -1848 8101 -2724 -3509 3499
1476 3499 5631 1228 -3773 4030 1601 -3981 -4423 1177 2380 -5860 -777 2706 98 -3836 -256
1491 -256 6991 210 -717 1695 4474 -1638 -6587 4012 240 -2065 -4651 1262 4275 -9530 575
1506 575 3735 3484 -530 -3973 11447 -1900 -4858 919 1404 4175 -10469 2050 3800 -5944 -2744
1521 -2744 -2330 8677 -3256 -1871 7444 191 1204 -5116 5447 2718 -6322 1594 -152 -353 -7342
1536 -7342 -549 4146 -2361 -52 814 7327 -3124 -2910 5647 901 653 -5990 5876 519 -9100
1551 -9100 -257 -1425 6072 -7915 -791 10178 -4385 833 -3663 8654 2331 -8461 8058
1564H058r555J899q455O411R985j8907J2858j318J590k608o809J7212j1112N35
1578b16J789M64J143j2870J2084k216k905K81J010P996j3204N268M319J207l605
1593E45m608J3761j0470j744q96M851L139j6395J5624k264k724j986k123J7995
1607A2705j7705M571N243k252K430j7592K0373o922o877P747o846J3606j8575
1620a0094P285R964j1242Q398q298J3566q456p859J2454p694N611j0765Q803K904
1634D577j3202Q429k943Q680r193J091J2395j0955K036n301J1157m626r469J1469
1648D145m403L306j3850R776P896j4672J0698n670J2147j0082p817J9691j3825
1661b660N088o639O522M653j9690J5359n208M291m673k137J7332j8644P637j217
$$ plain form
1564 8058 -1497 402 -8053 -1642 8343 -10564 2294 976 2566 -42 -6851 10361 -751 -216
1578 -216 1573 2037 3180 -9690 2394 178 -2727 -2446 -1436 6560 -6644 -1376 2943 4150 545
1593 545 -4063 9698 -772 -2516 -3412 1439 4578 -11817 3807 1543 -1181 -3167 -5290 12705
1607 12705 -5000 -429 4814 2562 4992 -12600 7773 851 -6026 1721 -5125 8481 -10094
1620 -10094 -2809 7155 -4087 4311 -3987 9579 1123 -6736 5718 -1976 3635 -7130 1673 4577
1634 4577 -8625 -196 -3139 5541 -3652 -2561 9834 -1121 915 -4386 6771 2145 -7324 4145
1648 4145 -258 3048 -10802 -1026 6870 -7802 2896 -2774 9373 -709 -8526 11165 -2660
1661 -2660 2428 -4211 2311 6964 -12726 2633 -2575 1716 -2957 -5094 12238 -6406 1231 14
1675A4K425L115j4832J8699r421k964O44j035R763j6186J0524K320j960k382m769
1690f045J7120j4323K954K087J144L090j8765J8042n136m250K678k532J4742j9592
1704h786P329N020k954L095j1826K0474j2191m320N971n895J2077j9719J3691
1717A966L668j2226Q810r123J5540j1247j519J2630q775M503j2373J3449k557
1730B746j0612J0986o487J0063j4917M820J0668j2753Q042o069J2743p842q232
1743f844J3019p398M780j2051J1911K774j5275J0892p045J1740j0839j263J7656
$$ plain form
1675 14 2439 5554 -9278 9421 0 -2964 -2320 -3355 6408 -9778 746 3066 1106 -1276 -6045
1690 -6045 11075 -3248 -294 1793 2937 6027 -12738 5304 168 -4082 -1404 -3936 10806 -8786
1704 -8786 -1457 3563 609 3704 -8122 12352 161 -4159 1812 -4083 7994 -11725 1966
1717 1966 5634 -6592 2218 -6905 8635 -2612 -4131 8499 -276 4227 -8146 5303 2746
1730 2746 -7866 3120 -3367 6696 -8221 -3401 7267 -5486 2556 -3513 9230 1388 -6844
1743 -6844 6175 -1223 3557 -8494 3417 6191 -9084 1808 -5237 6503 -4336 -5599 12057
$$ [...]
8191B65
##END NTUPLES=NMR FID
##END=
