##TITLE=1H_LR-757-CR2
 CCl4
 8 sc, 
 17.11.2022
##JCAMPDX= 6.0         $$ Bruker NMR JCAMP-DX V2.0
##DATA TYPE= NMR FID
##DATA CLASS= NTUPLES
##ORIGIN= UXNMR, Bruker Analytische Messtechnik GmbH
##OWNER= root
$$ XWIN-NMR		Version 3.5
$$ Thu Nov 17 17:00:12 2022 Russian Standard Time (UT+4h)  she@DPX200
##.OBSERVE FREQUENCY= 200.1313499994
##.OBSERVE NUCLEUS= ^1H
##.DELAY= (6, 6)
##.ACQUISITION MODE= SIMULTANEOUS
##.ACQUISITION SCHEME= undefined
##.AVERAGES= 8
##.DIGITISER RES= 18
##SPECTROMETER/DATA SYSTEM= spect
##.PULSE SEQUENCE= zg30
##.SOLVENT NAME= CDCl3
##.SHIFT REFERENCE= (INTERNAL, CDCl3, 0, 15.7039)
##AUDIT TRAIL= $$ (NUMBER, WHEN, WHO, WHERE, WHAT)
$$ ##TITLE= Audit trail, XWIN-NMR		Version 3.5
$$ ##JCAMPDX= 5.01
$$ ##ORIGIN= Bruker BioSpin GmbH
$$ ##OWNER= she
$$ F:/spectra/data/she/nmr/H-F/1/audita.txt
$$ ##AUDIT TRAIL=  $$ (NUMBER, WHEN, WHO, WHERE, WHAT)
(   1,<2022-11-17 16:59:10.09 +0400>,<she>,<DPX200>,
      <created by zg, POWCHK disabled, PULCHK disabled
       configuration hash MD5:
       00 E9 B6 7A A2 85 ED C7 34 08 36 98 17 FE 4E 26
       data hash MD5: 16K
       71 E8 FA F0 86 44 B4 99 90 3C FD D1 E2 2A 9C 4E>)
$$ ##END=
$$ 
$$ hash MD5
$$ E5 44 DD 85 A6 6C DC 81 C4 66 50 2A AF D7 EE 88
##$RELAX= 
##$RELAX= 
##$RELAX= 
##$RELAX= 
##$RELAX= 
##$RELAX= 
$$ Bruker specific parameters
$$ --------------------------
##$DU= <F:/spectra>
##$EXPNO= 1
##$NAME= <H-F>
##$PROCNO= 1
##$TYPE= <nmr>
##$USER= <she>
##$AMP= (0..31)
100 100 100 100 100 100 100 100 100 100 100 100 100 100 100 100 100 100 
100 100 100 100 100 100 100 100 100 100 100 100 100 100 
##$AQSEQ= 0
##$AQ_mod= 1
##$AUNM= <au_zg>
##$AUTOPOS= <>
##$BF1= 200.13
##$BF2= 200.13
##$BF3= 200.13
##$BF4= 200.13
##$BF5= 200.13
##$BF6= 200.13
##$BF7= 200.13
##$BF8= 200.13
##$BYTORDA= 1
##$CFDGTYP= 0
##$CFRGTYP= 5
##$CHEMSTR= <none>
##$CNST= (0..31)
1 1 145 1 1 1 1 1 1 1 1 1 1 1 1 1 1 1 1 1 1 1 1 1 1 1 1 1 1 1 1 1 
##$CPDPRG= <>
##$CPDPRG1= <>
##$CPDPRG2= <>
##$CPDPRG3= <>
##$CPDPRG4= <mlev>
##$CPDPRG5= <mlev>
##$CPDPRG6= <mlev>
##$CPDPRG7= <mlev>
##$CPDPRG8= <mlev>
##$CPDPRGB= <>
##$CPDPRGT= <>
##$D= (0..31)
0 1.2 0 0 0 0 0 0 0 0.06 0 0.03 0 0 0 0 0.0002 0 0 0 0 0 0 0 0 0 0 0 0 
0 0 0 
##$DATE= 1668689949
##$DBL= (0..7)
120 120 120 120 120 120 120 120 
##$DBP= (0..7)
150 150 150 150 150 150 150 150 
##$DBP07= 0
##$DBPNAM0= <>
##$DBPNAM1= <>
##$DBPNAM2= <>
##$DBPNAM3= <>
##$DBPNAM4= <>
##$DBPNAM5= <>
##$DBPNAM6= <>
##$DBPNAM7= <>
##$DBPOAL= (0..7)
0.5 0.5 0.5 0.5 0.5 0.5 0.5 0.5 
##$DBPOFFS= (0..7)
0 0 0 0 0 0 0 0 
##$DE= 6
##$DECBNUC= <off>
##$DECIM= 32
##$DECNUC= <off>
##$DECSTAT= 4
##$DIGMOD= 1
##$DIGTYP= 9
##$DL= (0..7)
0 120 120 120 120 120 120 120 
##$DP= (0..7)
150 150 150 150 150 150 150 150 
##$DP07= 0
##$DPNAME0= <>
##$DPNAME1= <>
##$DPNAME2= <>
##$DPNAME3= <>
##$DPNAME4= <>
##$DPNAME5= <>
##$DPNAME6= <>
##$DPNAME7= <>
##$DPOAL= (0..7)
0.5 0.5 0.5 0.5 0.5 0.5 0.5 0.5 
##$DPOFFS= (0..7)
0 0 0 0 0 0 0 0 
##$DQDMODE= 0
##$DR= 18
##$DS= 0
##$DSLIST= <SSSSSSSSSSSSSSS>
$$ [...]
##$SUBNAM2= <"">
##$SUBNAM3= <"">
##$SUBNAM4= <"">
##$SUBNAM5= <"">
##$SUBNAM6= <"">
##$SUBNAM7= <"">
##$SUBNAM8= <"">
##$SUBNAM9= <"">
##$SW= 18.0517283424941
##$SWIBOX= (0..15)
0 0 2 0 0 0 0 0 0 0 0 0 0 0 0 0 
##$SW_h= 3612.71676300578
##$TD= 16384
##$TD0= 1
##$TE= 0
##$TE2= 300
##$TE3= 300
##$TEG= 300
##$TL= (0..7)
0 120 120 120 120 120 120 120 
##$TP= (0..7)
150 150 150 150 150 150 150 150 
##$TP07= 0
##$TPNAME0= <>
##$TPNAME1= <>
##$TPNAME2= <>
##$TPNAME3= <>
##$TPNAME4= <>
##$TPNAME5= <>
##$TPNAME6= <>
##$TPNAME7= <>
##$TPOAL= (0..7)
0.5 0.5 0.5 0.5 0.5 0.5 0.5 0.5 
##$TPOFFS= (0..7)
0 0 0 0 0 0 0 0 
##$TUNHIN= 0
##$TUNHOUT= 0
##$TUNXOUT= 0
##$USERA1= <user>
##$USERA2= <user>
##$USERA3= <user>
##$USERA4= <user>
##$USERA5= <user>
##$V9= 5
##$VALIST= <valist>
##$VCLIST= <CCCCCCCCCCCCCCC>
##$VD= 0
##$VDLIST= <DDDDDDDDDDDDDDD>
##$VPLIST= <PPPPPPPPPPPPPPP>
##$VTLIST= <TTTTTTTTTTTTTTT>
##$WBST= 1024
##$WBSW= 4
##$XGAIN= (0..3)
0 0 0 0 
##$XL= 0
##$YL= 0
##$YMAX_a= 268711
##$YMIN_a= -266526
##$ZGOPTNS= <>
##$ZL1= 120
##$ZL2= 120
##$ZL3= 120
##$ZL4= 120
##$ABSF1= 10
##$ABSF2= 0
##$ABSG= 5
##$ABSL= 3
##$ALPHA= 0
##$AQORDER= 0
##$ASSFAC= 0
##$ASSFACI= 0
##$ASSFACX= 0
##$ASSWID= 0
##$AUNMP= <proc_1d>
##$AZFE= 0.1
##$AZFW= 0.1
##$BCFW= 1
##$BC_mod= 2
##$BYTORDP= 1
##$COROFFS= 0
##$CY= 11.3945322036743
##$DATMOD= 1
##$DC= 2
##$DFILT= <>
##$DTYPP= 0
##$F1P= 2.36226072786647
##$F2P= -0.459571619588291
##$FCOR= 0.5
##$FTSIZE= 0
##$FT_mod= 4
##$GAMMA= 1
##$GB= 0.15
##$INTBC= 1
##$INTSCL= 1
##$ISEN= 128
##$LB= 0.24
##$LEV0= 0
##$LPBIN= 0
##$MAXI= 10000
##$MC2= 0
##$MEAN= 0
##$ME_mod= 0
##$MI= 1.114404
##$NCOEF= 0
##$NC_proc= 0
##$NLEV= 6
##$NOISF1= 3.799351
##$NOISF2= 2.8
##$NSP= 1
##$NTH_PI= 0
##$NZP= 0
##$OFFSET= 15.70392
##$PC= 1
##$PHC0= -18027.93
##$PHC1= 9.800699
##$PH_mod= 1
##$PKNL= yes
##$PPARMOD= 0
##$PSCAL= 0
##$PSIGN= 0
##$REVERSE= no
##$SF= 200.130013532006
##$SI= 16384
##$SIGF1= 3
##$SIGF2= 2
##$SINO= 400
##$SIOLD= 16384
##$SREGLST= <1H.CDCl3>
##$SSB= 0
##$STSI= 0
##$STSR= 0
##$SW_p= 3612.71676300578
##$SYMM= 0
##$S_DEV= 0
##$TDeff= 0
##$TDoff= 0
##$TI= <>
##$TILT= no
##$TM1= 0
##$TM2= 0
##$TOPLEV= 0
##$USERP1= <user>
##$USERP2= <user>
##$USERP3= <user>
##$USERP4= <user>
##$USERP5= <user>
##$WDW= 1
##$XDIM= 8192
##$YMAX_p= 0
##$YMIN_p= 0
$$ End of Bruker specific parameters
$$ ---------------------------------
##NTUPLES= NMR FID
##VAR_NAME=  TIME,          FID/REAL,        FID/IMAG
##SYMBOL=    X,             R,               I
##VAR_TYPE=  INDEPENDENT,   DEPENDENT,       DEPENDENT
##VAR_FORM=  AFFN,          ASDF,            ASDF
##VAR_DIM=   8192,          8192,            8192
##UNITS=     SECONDS,       ARBITRARY UNITS, ARBITRARY UNITS
##FACTOR=    0.0002768,     1,               1
##FIRST=     0,             0,               0
##LAST=      2.2672688,     0,               0
##MIN=       0,             -266526,         0
##MAX=       2.2672688,     268711,          0
$$ Real data points
##PAGE= N=1
##DATA TABLE= (X++(R..R)), XYDATA
0@%%%%%%%%%Qj6J6k4L2m0N6p2Q8j04J28j60J92k27K68l17L73m36N08n88O78p78
$$ 0 0 0 0 0 0 0 0 0 0 8 -8 8 -16 16 -24 32 -40 48 -56 72 -88 104 -123 145 -172 201 -235 273 -315 363 -415
31d15Q91j017J155j311J482j668J875k102K350k622K919l241L595l982M404m865
$$ -415 476 -541 614 -697 785 -883 992 -1110 1240 -1382 1537 -1704 1891 -2091 2313 -2552
47b552N369n920O521p183P910q709R595j0581J1680j2916J4317j5921J7775j9946
$$ -2552 2817 -3103 3418 -3765 4145 -4564 5031 -5550 6130 -6786 7531 -8390 9385 -10561
61a0561K2535k5679K9594l4629M1386n1018O6133r4839K38266m07996K35813M2443
$$ -10561 11974 -13705 15889 -18740 22646 -28372 37761 -57078 181188 -226808 9005 51448
73E1448k09774L49858m41272M39334k18212j9810k0328L8560K37358m28990L63843
$$ 51448 -158326 191532 -249740 189594 -28618 -48428 -68756 -30196 207162 -221828 142015
84A42015j23709m2893J51972l12080L72334l24276Q6392Q6416m1422J20009l08722
$$ 142015 18306 -24587 127385 -184695 187639 -136637 -50245 36171 -5251 114758 -193964
95a93964L28089k21160K4262J69399j43773K45763l76133J85654O148o5717Q1896
$$ -193964 134125 -87035 -62773 106626 -37147 208616 -167517 18137 24285 -41432 40464
106D0464j66144L61312m03191J25522J25578j99474L04869m26097L36921K7321
$$ 40464 -125680 235632 -167559 -42037 83541 -115933 188936 -237161 99760 127081
116A27081k46487K19986j77235J93388k58806J28362J11013j34621J54713l50159
$$ 127081 -119406 100580 -76655 116733 -142073 -13711 97302 -37319 117394 -232765
126b32765L52744j43733j24745L44882k71489J88740j92062M1535J40199j80153
$$ -232765 119979 -23754 -148499 196383 -75106 113634 -78428 -36893 103306 -76847
136g6847J32447j11720J61065j95249L5056J68414k32275J74907j56961J73132
$$ -76847 55600 -56120 104945 -90304 -55248 113166 -119109 55798 -101163 71969
146G1969P569j68117J88999j50175R9454j61931J40980J17673k64350J75553j65242
$$ 71969 79538 -88579 100420 -49755 49699 -112232 28748 146421 -117929 57624 -107618
157a07618J40958l9854r8924K56085j73272M7526j05397J38732J2680j93582K31711
$$ -107618 33340 -6514 -105438 150647 -22625 24901 -80496 58236 70916 -122666 109045
168A09045j80216J38485q9041q2656K58323k82647J08385K7686K4028K8678j28259
$$ 109045 -71171 67314 -21727 -104383 153940 -128707 -20322 7364 31392 60070 -68189
179f8189J47531j33362O8889n0559N6786J14215k73687J71516n1713j7702N0055
$$ -68189 79342 -54020 14869 -35690 21096 135311 -138376 33140 -18573 -36275 13780
190A3780o8087J57157j41842K4032R404M6472l982j44376K03295j05775O263J2630
$$ 13780 -54307 102850 -38992 -14960 -5556 40916 36934 -107442 95853 -9922 -3659 8971
202H971m6587J08638j87756J03822M6194p83j5631q7146J62112j54298M4783O3258
$$ 8971 -37616 71022 -116734 -12912 33282 32499 16868 -70278 91834 -62464 -17681 45577
214D5577l5232P1635j87063J18757R011p0228M2909j3474R0164j42377P3245L6415
$$ 45577 10345 81980 -105083 13674 22685 -47543 -4634 -18108 72056 -70321 2924 39339
226C9339m9933M3953j18232J64466m8718q2106R6575o0579J1045p3943Q6123L8476
$$ 39339 -10594 33359 -84873 79593 30875 -51231 45344 -15235 -4190 -78133 7990 46466
238D6466m9256L739m5380J07894j12338K4074J12244q8874J6354o4668P2266n273
$$ 46466 -2790 949 -44431 63463 -48875 -24801 87443 -1431 14923 -49745 22521 17248
250A7248p1249N5211j961L4806r3424O9317M9972j04265M0170j4416P7768m1043
$$ 17248 -54001 1210 -751 34055 -59369 9948 59920 -44345 -4175 -18591 59177 18134
262A8134n0257P2547n5042j0357l1896R4590R236r9099O0865k0581K4629l5488
$$ 18134 -32123 40424 -14618 -24975 -56871 37719 46955 -52144 8721 -11860 12769 -22719
274b2719J0816Q7572q2146j2309J5439L8440m1212m8475P7278k2530j833k2918
$$ -22719 -11903 75669 -6477 -18786 -3347 35093 -6119 -54594 22684 154 -1679 -24597
286b4597L6198K8800j02123M7843M5786J695k8390j6685M5356n3541j9556L1402
$$ -24597 11601 40401 -61722 -13879 31907 33602 5212 -11473 33883 -19658 -39214 -7812
298g812M9449l0221o4824O3376m123k0876j188K8217L8328p1595Q342M6560j3366
$$ -7812 41637 11416 -53408 9968 5845 -15031 -16219 11998 50326 -21269 -12927 33633 20267
311B0267m6771q185O2487k5758k4059K2024J7790k0221n4191N8603M6688l7384
$$ 20267 -26504 -34689 27798 2040 -22019 5 17795 -2426 -56617 1986 48674 11290
323A1290j8389J7408J2306n0359k13N4072j264m3484j5044M8179m889m4695K7588
$$ 11290 -7099 10309 22615 -27744 -27957 26115 24851 -18633 -33677 14502 9613 -35082 -7494
336g494L7014j8015k8481K4905L3126m0742m0672L8450K7277k9853j4030L0885
$$ -7494 29520 11505 -16976 7929 41055 313 -40359 -1909 25368 -4485 -18515 12370
348A2370j223m8939L909N5966J5513m5597j226M0027l1372k5164K4807K9237j5956
$$ 12370 11147 -37792 -33883 22083 37596 -8001 -9227 30800 -572 -25736 -929 28308 12352
361A2352n0119L2357L0441l8891k1346L9508K2329m1515J1439K9796j804l8981
$$ 12352 -37767 -5410 25031 -13860 -35206 4302 26631 -14884 -3445 26351 24547 -14434
373a4434k3986O5943n633m0448J7425J6985k4143m1115M7070K7845j3708k1864
$$ -14434 -38420 27523 21890 -18558 -1133 15852 -8291 -49406 -2336 25509 11801 -10063
385a0063L81N1213n7620q481N4851j6408k0061j9051M5302r655l9244Q331J9512
$$ -10063 -9682 41531 -16089 -24570 30281 13873 -6188 -25239 20063 10408 -28836 -20505 -993
398i93K9299o0724M0905M0562o9774Q816j026M3632j4215m2577M4133j2211k5666
$$ -993 28306 -32418 8487 49049 -20725 -11909 -12935 30697 16482 -26095 18038 5827 -19839
411a9839k5376O3931J0035n9469L6769k453J9828l5846j0158O6886m3990j6708
$$ -19839 -45215 18716 28751 -30718 6051 3598 23426 -12420 -22578 44308 318 -16390
423a6390J2966L3580l4937m0072M9314r243J7261l1000K8313L2992q2971L1279
$$ -16390 -3424 30156 -4781 -44853 4461 -4782 12479 -18521 9792 42784 -40187 -8908
435h908K1118J4658k8943j1143M5685n5358J2650j6285M3780Q989q7203R3595
$$ -8908 12210 26868 -2075 -13218 32467 -22891 -10241 -26526 17254 26243 -60960 32635
447C2635k0335k2191Q381j0869N5489o3816J7588J9528N155l2043n0925J04939
$$ 32635 12300 -9891 -1510 -12379 43110 -20706 -3118 16410 21565 -10478 -61403 43536
459D3536n6121m778L5351k6858M2232q0072L8729M7552l3922j0635j314M7350
$$ 43536 -12585 -17363 17988 -8870 33362 -46710 -7981 39571 5649 -4986 -6300 41050
471D1050p4191K0021K0654j4008K3284o4976P5855j1042m2650K5315K492K8950
$$ 41050 -33141 -13120 7534 -6474 16810 -48166 27689 16647 -26003 -688 1804 30754
483C0754o4750O2392m366l7694J7203n4740R6255n9279j6560O7329m8466J6193
$$ 30754 -33996 28396 24030 -13664 3539 -51201 45054 -14225 -30785 36544 -11922 4271
495D271m9007P5628q867m1008M2181m3276P5026r7446J6145Q2442j00503N2836
$$ 4271 -44736 30892 22025 -18983 23198 -20078 54948 -42498 -26353 56089 -44414 8422
507H422l0099M1968k661o4366O2818j6864K5817n4070N3972J8233r3145O5743
$$ 8422 -21677 20291 17630 -46736 16082 -782 25035 -29035 24937 43170 -49975 15768
519A5768m2233M9308k1692l7606P9183o4264J3876j4211M9397j3228n0129P8393
$$ 15768 -26465 22843 1151 -36455 42728 -21536 -7660 -21871 27526 14298 -35831 42562
531D2562n6853L9258m7026O867O3326r8416O0831j3715K7153l7732l1629R5019
$$ 42562 -14291 24967 -22059 -15192 48134 -50282 10549 -3166 23987 -13745 -45374 49645
543D9645q5626O0534l3747J8178M7145j34130J07218k0038j3839O005k4021O6930
$$ 49645 -35981 24553 -9194 8984 56129 -78001 29217 9179 -4660 1345 -22676 44254
555D4254q7107M4712j7521L0619J0396r3552J39906p8867o544L4139m9028P2375
$$ 44254 -42853 1859 -15662 14957 25353 -68199 71707 -7160 -13704 20435 -28593 43782
567D3782q3150M4128J3164k0311j0932k7392R0415q7476M7104J2603k9868M3862
$$ 43782 -39368 4760 17924 -2387 -13319 -40711 49704 -37772 9332 21935 -7933 35929
579C5929r2809R4825l0483k2750K4641k9230O4924j07616P2024P153m3435N2916
$$ 35929 -56880 37945 7462 -15288 9353 -19877 45047 -62569 9455 16608 -26827 26089
591B6089o9760J02609o2440k1279M8364l4234L9146q2307R6659l4649m2610N2288
$$ 26089 -43671 58938 -3502 -24781 23583 -10651 28495 -53812 42847 8198 -34412 17876
603A7876p3489J16855r4892J3988Q0057r3577N4317n2641O1653j9113l9143N2039
$$ 17876 -55613 61242 -33650 -19662 60395 -33182 21135 -31506 30147 11034 -28109 23930
615B3930m4776N9743r2796N8949K8727q8840Q9258n8253N7779l2678l3694P1619
$$ 23930 -20846 38897 -53899 5050 33777 -55063 34195 -24058 33721 1043 -32651 38968
627C8968n9789L9110m3914O0294k3756o3304Q5012o5038N8280m9041J3738N8652
$$ 38968 -20821 18289 -25625 34669 10913 -52391 32621 -32417 25863 -23178 -9440 49212
639D9212r1650O0008l6265N6120m1668l3903R8849r4811N6275m9867K0948M5639
$$ 49212 -42438 17570 -18695 37425 -4243 -38146 60703 -34108 22167 -27700 -6752 38887
651C8887j02656R0894k9712K2461l5166p310P4551r4120P4249m5111K7614J4747
$$ 38887 -63769 27125 -2587 19874 -15292 -22602 51949 -42171 32078 -13033 14581 29328
663B9328j01582J19203o4603Q561J2108j8242N2554p9661O1540k0382J3082p940
$$ 29328 -72254 46949 -17654 -9093 3015 -15227 37327 -42334 19206 -1176 11906 3966
675C966l6018R5136r5434L2699M006j8979L5028p1454Q4256l1965o841m78r122
$$ 3966 -32052 63084 -32350 349 4355 -14624 20404 -51050 33206 1241 -5600 -6078 -15200
688a5200O4520r5234O9251p191k1170K0867o5553R5465o3569J174K4593j8383
$$ -15200 49320 -45914 23337 16146 -5024 15843 -49710 45755 -17814 -16640 7953 -10430
700a0430M2206q4718Q3109k2853k3673L6523m8517Q3936q1074J3837L4965m4937
$$ -10430 31776 -52942 30167 7314 -16359 20164 -28353 55583 -25491 -11654 23311 -21626
712b1626L4093m9054P2494m1004j8682L9362l7199N9422p2303M7090K3065o3781
$$ -21626 12467 -36587 35907 -5097 -23779 15583 -21616 37806 -34497 12593 35658 -28123
724b8123M1459l0056M3542m3033j859L7058l1546K6902n3640O7113j8784m3504
$$ -28123 13336 -16720 26822 -16211 -18070 18988 -12558 14344 -39296 27817 9033 -34471
736c4471O2881l6980L9476m9771J1359L5306n1972L0601k5683M8940m0274k1611
$$ -34471 28410 -8570 30906 -18865 -7506 27800 -24172 6429 -19254 29686 -10588 -32199
748c2199O0455m7178L5590l5876L1577J7138o1119M9528k3248K3200l5274P31
$$ -32199 28256 -18922 16668 -19208 12369 29507 -31612 17916 -5332 17868 -17406 -16675
760a6675N0299o0004L0984j8659K3859k778m0563O3242k6377M818k0021J5236
$$ -16675 33624 -26380 4604 -14055 9804 7026 -33537 29705 3328 8146 -11875 3361
772C361K0706n4600M1919j4127J3026j9554j9414N9728m7222J2085M125J0153
$$ 3361 24067 -30533 11386 -2741 10285 -9269 -28683 31045 -16177 -4092 33 10186
784A0186N081m0488M5273j5742k600j3776P245L3321n7342K9361M96k768R45k3189
$$ 10186 15267 -25221 20052 4310 1710 -12066 -4821 28500 -28842 519 1015 -1753 -808 -23997
798b3997N4574k9244q762R542M330Q297m0318L8970m760j5086k093m506L5545
$$ -23997 30577 1333 -7429 2113 6443 14740 -25578 13392 8632 -6454 -8547 -13053 22492
811B2492m1497R730K0520o629q01k0712M0785j9631j6514J4328J161J1922l8140
$$ 22492 -19005 -9275 11245 4616 3815 -16897 23888 4257 -12257 2071 3232 15154 -22986
824b2986K1336J1523k0645J994K792K8677k9478k174K0585o047j038k0090L1718
$$ -22986 -1650 9873 -10772 -8778 -5986 22691 -6787 -8961 11624 5577 4539 -15551 16167
837A6167o494k7066J4914K898P196k6348J2295K1911j8105k389L315K0407k0080
$$ 16167 9673 -17393 -2479 419 7615 -18733 -6438 15473 -2632 -5021 -1706 18701 -1379
850a379j1430K3705k233q051j6750K0852L774k7641J3689J1706J731j7140K405
$$ -1379 -12809 10896 8663 612 -16138 4714 8488 -19153 -5464 6242 7973 -9167 -6762
863f762K2779j1858j1946P400J7260j6053j6006J9792J428j2257q116J4649J1572
$$ -6762 16017 4159 -7787 -387 16873 820 -15186 4606 6034 -6223 -14339 310 11882
876A1882j9912p85J9396p01j8640M771J9342q959j5048M701J2104q146j6426J3172
$$ 11882 -8030 -8815 10581 9880 -8760 -3989 15353 6394 -8654 -3953 8151 5 -16421 -3249
890c249J5532j6676q945J8909N672j4509l319J6028K666j6951l734J7695k173
$$ -3249 12283 -4393 -13338 5571 11243 -3266 -6585 9443 12109 -4842 -8576 9119 6946
903F946k4424J1235J4787r647p954M062J8054j1570j3171J8057Q229j3140j3255
$$ 6946 -17478 -6243 8544 -1103 -9057 -4995 13059 1489 -11682 6375 14604 1464 -11791
916a1791J9984o77j8303M020N914J0806k2212R53K6270j4735o424M364J6176q692
$$ -11791 8193 7516 -10787 -6767 -853 9953 -12259 -11306 14964 229 -6195 -1831 14345 5653
930E653j6363J6679L96m562j8164J5057J5770k9755R217R805K481j0515n248K4811
$$ 5653 -10710 5969 6365 1803 -16361 -1304 14466 -15289 -6072 3733 6214 -4301 -9549 15262
944A5262q726r730l022J8710n141k7763K5258n15p280o267K430K1789k1210k245
$$ 15262 6536 -3194 -6216 12494 7353 -20410 4848 4333 -2947 -9214 -6784 15005 -6205 -8450
958h450J3117R181j5962q719K8403j7690l868j614N609J1939l1588J7965R271
$$ -8450 4667 13848 -2114 -10833 17570 -120 -3988 -5602 7 11946 -19642 -1677 7594
971G594r442n961M225K3257k7465O700O934q83K308k7997L4092p743k0719J2941
$$ 7594 -1848 -7809 -3584 19673 -7792 -1092 5842 4959 7267 -20730 13362 5619 -15100 -2159
985b159Q47J2116k8197J6068J3280j2243J918j2270L3945k3383j6048K7597j1522
$$ -2159 -1312 10804 -17393 -1325 11955 -288 1630 -10640 23305 -78 -16126 11471 -51
998e1K908j9223J6995Q904k0552O308L740J8368k8243P379K0673k0647P399j3293
$$ -51 2857 -16366 629 9533 -11019 -4711 -971 17397 -10846 -3467 17206 -3441 3958 -9335
1012i335J9704o964k0425K0453l238K149j9056K2783M672k3106J9975j1230K0367
$$ -9335 10369 3405 -17020 3433 195 2344 -16712 6071 10743 -12363 7612 -3618 16749
1025A6749k1465p850L3968k8351M120p843J9580m623k7360L3898j3435J1816j8674
$$ 16749 -4716 -12566 21402 -6949 -2829 -10672 8908 4285 -23075 10823 -2612 9204 -9470
1038i470K393L6920m5003J5173M497J368l081k2380L2508j5357m81p052R925J7347
$$ -9470 -7077 29843 -15160 13 4510 5878 2797 -19583 12925 -2432 -2913 -9965 -40 17307
1052A7307l9535L0086r43p028L407j1005K4519k2426J187L536N788n729j9196
$$ 17307 -22228 7858 6915 -113 3294 -7711 16808 -5618 -4431 -895 4893 -836 -20032
1065b0032L7090k2810J019M888j696K0432l6899K4839L116q950l780j1122L8800
$$ -20032 17058 -5752 -4733 155 -1541 18891 -18008 6831 9947 997 -2783 -13905 24895
1078B4895m0180P554J1889r533J9247m1467M0445p62k2983J6778j1038K7872l6984
$$ 24895 -15285 -7731 4158 -5375 13872 -27595 12850 12088 -10895 5883 -5155 22717 -14267
1091a4267J0759J4937j9746J5938l0374L7998j3784k1292L3009j8961J6282j9456
$$ -14267 -3508 11429 -8317 7621 -22753 15245 1461 -19831 13178 -5783 10499 -8957
1103h957J3265R439k2796J3128j0558K2295k8931M373K3762k7557J5692j6763
$$ -8957 4308 13747 -9049 4079 -6479 15816 -13115 -8742 15020 -12537 3155 -13608
1115a3608K6223q087j9455K7412j3237J5452l2943K2579J4067l8743K8702k0882
$$ -13608 12615 4528 -14927 12485 -752 14700 -18243 4336 18403 -20340 8362 -12520
1127a2520K6065j7331j8419M2221k8130J5113j9028K1633O530l9090L9988k4884
$$ -12520 13545 -3786 -22205 20016 -8114 6999 -12029 9604 16134 -22956 17032 -7852
1139g852J8048j3740j3350M1908m4001J8535j906M815L154k3354L7495k4356R057
$$ -7852 10196 -3544 -16894 25014 -18987 -452 -2358 2457 5611 -17743 19752 -4604 4453
1152D453p867K251K1146m3632L3011p420m029j319j1068L3921l3041J4374j544
$$ 4453 -3414 -1163 19983 -23649 9362 1942 -2087 -3406 -14474 19447 -13594 780 -764
1165g64P303M013l4647M6669k4050l8J578q162K9844m5866K6818j487k833N756
$$ -764 6539 10552 -24095 22574 -1476 -1514 64 -8098 21746 -24120 2698 1211 -1622 4134
1179D134k5038M9115l7859O362J1573j4813K6910m3302L4329m411j8950J4802
$$ 4134 -20904 28211 -9648 -3286 8287 -6526 20384 -22918 11411 7000 -11950 2852
1191B852j6825L2900l5746J5295J2641j8186J8506l0030L8604j7975j4351K4356
$$ 2852 -13973 18927 -16819 -1524 11117 -7069 11437 -18593 20011 2036 -12315 12041
1203A2041j8084J8637l2429K3056M455k1277J9441j8458L3589l0383L52K6580
$$ 12041 -6043 12594 -19835 3221 7676 -13601 5840 -12618 20971 -9412 -9060 17520
1215A7520k4975J7782k4327K8147r567k0873K4441j9104K5921l3639J7511J9082
$$ 17520 -7455 10327 -14000 14147 4580 -16293 8148 -10956 14965 -18674 -1163 17919
1227A7919l5244K8052k1875K6112j3482j5735L3467k6429J4796k2654J9519N113
$$ 17919 -17325 10727 -11148 14964 1482 -14253 19214 -7215 7581 -15073 4446 9559
1239I559l1612L3807j9238J7785j7213k730L1307l4518J9962j1104J4005n525
$$ 9559 -22053 11754 -7484 10301 -6912 -9642 21665 -12853 7109 -3995 10010 4485
1251D485k4447L5885k4077J0540j1067O860J7792l6271K7967r011Q257p878r253
$$ 4485 -19962 15923 -8154 2386 -8681 -1821 15971 -20300 7667 -1344 6913 -965 -10218
1264a0218L3443l3805J3390p395N919P267l1831L7593j6723O87j516l108K4751
$$ -10218 23225 -10580 2810 -4585 1334 8601 -23230 14363 -2360 -1673 -3189 -6297 18454
1277A8454l3184K0966k429Q29j863j9177L5780k8856N871L916l922J5890l3050
$$ 18454 -14730 6236 3807 4636 2773 -16404 19376 -9480 -3609 307 -3615 12275 -20775
1290b0775K9115m697p322N854p112K5183l1437J1197M772p337O609k1171L2412
$$ -20775 8340 3643 -3679 2175 -4937 20246 -11191 6 4778 -2559 4050 -17121 15291
1303A5291j7969o734J1628o419J6531k7327K1852L345j4739Q211j2096K3507k3152
$$ 15291 -2678 -9412 2216 -4203 12328 -14999 6853 10198 -4541 3670 -8426 15081 -8071
1316h071P47J4755j0811O885j8985K4796p251j1702J6158q080J5680k4699J0085
$$ -8071 -7324 7431 -3380 3505 -15480 9316 2065 -9637 6521 -1559 14121 -10578 -493
1329d93J1997j9350R702r004J8069j4537q033J8311j0097P268j4263J8632J384
$$ -493 11504 -7846 1856 -7148 10921 -3616 -11649 6662 -3435 3833 -10430 8202 9586
1342I586j8933J4730p310J1058j7042K703J7709j9474N610n864J2994n842j1560
$$ 9586 -9347 5383 -1927 9131 -7911 -5208 12501 -6973 -1363 -7227 5767 -75 -11635
1355a1635K0319o307J875j1507J0554O778k0363J2683k101N400j0674m882J9300
$$ -11635 8684 2377 4252 -7255 3299 10077 -10286 2397 296 5696 -4978 -9860 9440
1368I440j4335J639M53R453j318j5189J6387l336k201o158N567J0214j8935N314
$$ 9440 -4895 -3256 -2803 6650 5332 -9857 6530 3194 993 -5165 402 10616 -8319 -3005
1382c005K564K622o275m598J9520r860l545J735M740K148j5065J2334K998o935
$$ -3005 -441 2181 -4094 -8692 10828 968 -2577 -842 3898 6046 -9019 3315 6313 -622
1396f22m928K416R644j3536J895P998J592m464o682J4424m167q785N340M701L38
$$ -622 -5550 -3134 6510 -7026 -5131 2867 4459 -5 -6687 7737 3570 -5215 125 4826 5164
1411E164j2060M179O641o521m643O404Q385r248l017P848J818n540m774J1443
$$ 5164 -6896 -2717 3924 -2597 -7240 -836 7549 -1699 -4716 3132 4950 -590 -5364 6079
1425F079J52j0845P39O566j403r450M535R071l798o154L278P932o115o403R817
$$ 6079 6231 -4614 -3875 2691 1288 -8162 -3627 5444 1646 -4508 -1230 6702 587 -5816 4001
1440D001L378p678m430N523K568r525O57R177q41n828j336J0328l571r041R762
$$ 4001 7379 -299 -4729 794 3362 -6163 -5506 3671 2830 -2998 -4334 5994 2423 -6618 3144
1455C144K488k763o852K277Q620j2457r11P809K948n909n607J2832l287o310K388
$$ 3144 5632 2869 -3983 -1706 6914 -5543 -6454 1355 4303 -1606 -7213 5619 2332 -3978 -1590
1470a590N906M349j4619M726O888p441l609J408J0770p454n336O498L011l317
$$ -1590 4316 8665 -5954 -1228 5660 -1781 -5390 -3982 6788 -666 -6002 496 3507 190
1484A90o898J2094Q02p245m39L130K971j2649N706N696k833l486k412J3189j1470
$$ 190 -6708 5386 6188 -1057 -1496 1634 4605 -8044 -2338 3358 525 -2961 -5373 7816 -3654
1499c654j456R312o47J979j2915J2492m87j1562N163kR738j5305K550J1874j0849
$$ -3654 -5110 4202 3555 5534 -7381 5111 4624 -6938 -1775 -1777 7961 -7344 -4794 7080 -3769
1514c769L191n395J4542k635j3765J3500l889K10r334N879R507j3607L647n76
$$ -3769 -578 -5973 8569 5934 -7831 5669 1780 1990 -7344 -1465 8042 -5565 -1918 -2494
1528b494O853p655m056J5377n902p35l761P267j589j1156R572j230L190j0351
$$ -2494 4359 -3296 -7352 8025 2123 1388 -2373 4894 3305 -7851 1721 491 3681 -6670
1542f670M608Q898j5105P503l37Q143o156o606J5960j2037J756n147P940N173
$$ -6670 -2062 6836 -8269 -766 -1103 7040 884 -5722 10238 -1799 -43 -5190 2750 7923
1556G923k0105J6012m084m51k931l476K0335j7026L125L207L23R68j5299J9202
$$ 7923 -12182 3830 -254 -705 -3636 -7112 13223 -3803 -678 2529 2852 3820 -11479 7723
1570G723n761m559J225j893J0899j8412Q915O185l274O77o476J4757j2020j661
$$ 7723 1962 -2597 -1372 -3265 7634 -10778 -1863 4322 1048 1725 -4751 10006 -2014 -3675
1584c675N490j02L029j4123J4035m218o295L944r70J2287j6146P724N369p409
$$ -3675 1815 1713 4742 -9381 4654 436 -5859 -1915 -2885 9402 -6744 980 6349 -1060
1598a060K642r279J8559j1276n462J0123o914O384j6244J4136M901j2013Q501
$$ -1060 1582 -7697 10862 -414 -5876 4247 -2667 3717 -12527 1609 6510 -5503 2998
1611B998o172J3550j5286q78J5574j2122O528j1508J1812j495j4847J4392m529
$$ 2998 -3174 10376 -4910 -5788 9786 -2336 4192 -7316 4496 3001 -11846 2546 -1983
1624a983P373j0403M439R857j5413Q290n052J0225n968q480J5455j2633L447n953
$$ -1983 5390 -5013 -574 9283 -6130 2160 -2892 7333 1365 -7115 8340 -4293 -846 -6799
1638f799P694M924j4719J4089n087L030p178J302J3894j6098P211l537N275m568
$$ -6799 895 5819 -8900 5189 102 3132 -4046 -2744 11150 -4948 2263 -1274 4001 -567
1652e67j1950K0433j0701L274l188K729R720k1037J4262l45O12j977p535J7677
$$ -567 -12517 7916 -2785 489 -2699 30 9750 -11287 2975 2630 3242 1265 -6270 11407
1666A1407j7409K523J306J766O206j7291J8969o770l251L128m403J5779j8066
$$ 11407 -6002 -3479 -2173 -407 5799 -11492 7477 707 -2544 584 -3819 11960 -6106
1679f106P631L524p649L263j0286J7211j0162j622P120m089O360j5942J5811p2
$$ -6106 1525 5049 -2600 663 -9623 7588 -2574 -4196 2924 -1165 5195 -10747 5064 4992
1693D992p953O827o890J2921j7459K757R901q482N652j0481J5748p329p559J0491
$$ 4992 -2961 3866 -3024 9897 -7562 -4805 5096 -3386 2266 -8215 7533 204 -7355 3136
1707C136m482J0168j5953J0545M013j3690Q129r293J5372j1001l672J4763j2901
$$ 3136 -1346 8822 -7131 3414 7427 -6263 1866 -7427 7945 -3056 -6728 8035 -4866
1720d866P626j0494J1457K632j3246J4059q128O626j1578K086J2139j5702R688
$$ -4866 2760 -7734 3723 6355 -6891 7168 -960 5666 -5912 -3826 8313 -7389 2299
1733B299o280Q460n004r677J8433j0717N921n556M935N522j8221J2837m208M401
$$ 2299 -3981 4479 -525 -10202 8231 -2486 3435 -2121 2814 8336 -9885 2952 -1256 3145
1747C145o045k268J4600j6610O692l430P281J298j3456J9007j0422J234l824K2
$$ 3145 -2900 -5168 9432 -7178 -486 -3916 3365 4663 -8793 10214 -208 1026 -2798 -2776
1761b776J1864j8448J1948k473R3j633p900J8911j3666M563J562k82N088j7854
$$ -2776 9088 -9360 2588 115 208 -1425 -9325 9586 -4080 483 2045 1763 6851 -11003
1775a1003J6866n075k627K504n063J3516j8284O757M664l458M461r549J6490j0490
$$ -11003 5863 788 -1839 665 -4398 9118 -9166 -2409 2255 -1203 3258 -6291 10199 -291
1789b91k922M702k806Q200j6053J3121j083p835M783o675J5383j3442L113Q506
$$ -291 -3213 1489 -1317 6883 -9170 3951 2868 -4967 -184 -6859 8524 -4918 -1805 6701
1803F701p410M616j1837J4506n066o215Q351n988Q223j5479Q106O103r702Q254
$$ 6701 -709 3907 -7930 6576 1510 -4705 3646 -2342 5881 -9598 -1492 4611 -5091 3163
1817C163o889J2411r987m193J1728q205N763r609J0238p19j1923R328n065Q717
$$ 3163 -3726 8685 -1302 -5495 6233 -1972 3791 -5818 4420 3701 -8222 1106 -3959 4758
1831D758r777L722J0058j2675N789n851R414l999p740J3240q479K637p379N342
$$ 4758 -5019 -1297 8761 -3914 1875 -3976 5438 1439 -6301 6939 -1540 1097 -6282 -940
1845i40N716j2139J0090k816M929p246j835J2406j1669N310l239N112j113j2014
$$ -940 4776 -7363 2727 -89 4840 -2406 -4241 8165 -3504 1806 -1433 3679 2566 -9448
1859i448J2782n332J769k642K697P987j3634O667o43K946k813m616J3065j1080
$$ -9448 3334 -1998 -229 -2871 -174 7813 -5821 846 203 3149 336 -4280 8785 -2295
1873b295N78j060K224L699j1348J1915j664k486j047q00R400j0935M262K735q61
$$ -2295 -1717 -2777 -553 3146 -8202 3713 2049 -437 -1484 -2284 7116 -3819 443 3178 2317
1888B317k247p098J1367o272j387L178R71L713j1382Q067J649l452J001j229Q359
$$ 2317 70 -7028 4339 -1933 -3320 -142 829 4542 -6840 1227 2876 -576 425 -804 7555
1903G555j0225o24M362j689L26n613J0548l190m973L077J32N046r186N869M640
$$ 7555 -2670 -3294 1068 -621 -295 -5908 4640 1450 -3523 -446 -314 4732 -4454 1415 6055
1918F055o637l24k545O982n578k415O985j308q86n362P189N92n447L878R74K652
$$ 6055 -582 -906 -3451 3531 -2047 -4462 2523 1215 329 -5033 2156 2748 -2699 1179 2153 4805
1934D805p499L42N953n723l06Q39N128l523m679N173R23j138k958O022J667p120
$$ 4805 -2694 -2352 3601 -2122 -2428 -1589 3539 16 -4663 510 1433 295 -2663 3359 5026 -2094
1950b094R40J395J698n137L87O676l656l068K64M965j636m375O103J736k763l893
$$ -2094 -1154 241 1939 -3198 -2811 3865 209 -2859 -2595 2370 734 -3641 2462 4198 1435 -2458
1966b458K283L252n729p1M220J000m627j743N659j247k807K438L336k59o026K214
$$ -2458 -175 3077 -2652 -2723 1497 2497 -2130 -3873 1786 539 -2268 170 3506 3247 -2779 -565
1982e65L858m539j657L491J997l839k621M255Q69l461L11N206P43o093J270L610
$$ -565 3293 -1246 -2903 588 2585 -1254 -3875 380 1249 -2212 -1901 3305 4048 -2045 -775 2835
1998B835k883k412R72N212l078n312L760K188k103k608N403K682n299p40K108
$$ 2835 -48 -2460 -1488 3724 646 -4666 -906 1282 -821 -3429 1974 4656 -643 -1383 725
2013G25K224m805n83N564j746l603p41M507k040l053M195J993p1n105L086K753
$$ 725 2949 -1856 -2439 3125 1379 -2224 -2965 1542 -498 -3551 644 2637 2566 -2539 547 3300
2029C300n690J441J888K301n108j796N386l107k05j134O519n33p662O557o51n34
$$ 3300 -2390 -949 939 3240 -1868 -3664 1722 -1385 -1590 -2724 3795 3262 -4400 2157 1506 972
2045I72l407J528O828p960k25J352K012k282m660J0167k523j830q94R76M242q334
$$ 972 -2435 -907 5921 -2039 -2264 -912 1100 -1182 -5842 4325 1802 -28 -922 54 4296 -4038
2061d038M371K751j980k531j739N992n375K89K496J260M18n647O867j841k935
$$ -4038 333 3084 1104 -1427 -3166 2826 -2549 -2260 236 1496 1914 -3733 3134 1293 -1642
2076a642J216J855K708q009M220K03j695j109j833J0394p527j260M092j243K056
$$ -1642 -426 1429 4137 -3872 348 551 -1144 -2253 -4086 6308 -1219 -2479 1613 370 2426
2091B426p592R153k73n163R84k259P427j0050K536O181m553L008o144P921k071
$$ 2426 -5166 3987 3714 -1449 -465 -2724 4703 -5347 -2811 3370 -1183 1825 -4319 3602 1531
2106A531n428O364j765L223p178L306K324o977M249j401N460m558k330O571m486
$$ 1531 -3897 2467 702 3925 -3253 53 2377 -4600 -351 -1752 3708 -850 -3180 3391 -1095
2121a095J069j988O758k614n343N297k922K657p085M370N629q269L746j720N223
$$ -1095 -26 -2014 4744 2130 -3213 2084 -838 1819 -5266 -896 4733 -3536 210 -1510 3713
2136C713n318k366R251n160K960o603M937K092j0929R672k871K644l393k611R195
$$ 3713 -1605 -3971 5280 120 3080 -3523 1414 3506 -7423 2249 -622 2022 -1371 -3982 5213
2151E213q563L555m13K998J00p707R462n351n54l61K96N544q763N002K88q35j468
$$ 5213 -3350 205 -208 2790 2890 -4817 4645 -706 -1260 -1621 -1325 4219 -4544 458 746 -89 -1557
2168a557j286R392p550J107O67j54Q28p550R128j884k140r39O10N658j0054O613
$$ -1557 -2843 6549 -1001 106 773 619 1447 -6103 3025 1141 -999 -1938 -1328 4330 -5724 889
2184H89Q33l42P89o751J1086p764k011M118j799M636q921O835n87l942K875k585
$$ 889 1722 1380 2169 -4582 6504 -1260 -3271 847 -952 3684 -5237 1598 1011 -2931 -56 -2641
2200b641R470q891J080N105o111L714n968P631k032n347N284k760L868p314N040
$$ -2641 6829 -2062 -982 4123 -1988 1726 -4242 3389 1357 -3990 1294 -1466 2402 -4912 128
2215A28L884n944L783l150N742o092j719O564l733K014n559O447j425o426P367
$$ 128 4012 -1932 1851 -1299 4443 -1649 -3368 3196 -537 1477 -4082 2365 940 -5486 1881
2230A881k804M893o024J015O121p952L404k119N001l420m472Q180o005L013m601
$$ 1881 -923 3970 -2054 -1039 5082 -2870 534 -1585 3416 -4 -4476 3704 -2301 712 -3889
2245c889L725M897r481P709k297R03k620k154Q610p232K283j884K285k32p147
$$ -3889 -164 4733 -4748 2961 664 1567 -1053 -3207 5403 -1829 454 -1430 855 623 -6524
2260f524R941l498L62p87o4N387r076N057N56j23q71m143Q488p112K67J308P78
$$ -6524 3417 -81 281 -506 -570 4817 -4259 798 1354 1231 360 -3783 4705 -2407 -2140 -832 -54
2277e4L372p842P902j774k636M58j059P300q672L013J544k977J547n512R337l870
$$ -54 3318 -4524 3378 1604 -1032 -574 -1633 5667 -3005 8 1552 -1425 122 -5390 3947 77
2293G7k507L851j749L638p560N917J047l910K280l452O963p561m89N622l752L291
$$ 77 -2430 1421 -328 3310 -4250 1667 2714 -1196 1084 -2368 4595 -2966 -3455 2167 -1585 1706
2309A706m969O248j370n209M899j530M540p066K739L490o653L229l110O122l786
$$ 1706 -3263 2985 1615 -3594 1305 -225 4315 -2751 -12 3478 -3175 54 -3056 3066 -720
2324g20k967O947l944K152m493M714J639o564N561k555K570n322J02O583o179
$$ -720 -3687 3260 -684 1468 -3025 1689 3328 -3236 2325 -230 2340 -2982 -2880 3703 -2476
2339b476K968k047L889j887m913P929l410J818l088J386L815q458M719r07J664
$$ -2476 492 -1555 2334 447 -4466 3463 53 1871 -1217 169 3984 -4474 245 -662 1002
2354A002k056j918P112n919J332o59K654J107o350P529l055r91j559l46O032p369
$$ 1002 -1054 -2972 4140 -1779 -447 -1106 1548 2655 -3695 3834 779 -212 -1771 -2117 3915 -3454
2370c454L286O73l19n76l248P897m224l32R81K74J924p339N816m16k248N51j127
$$ -3454 -168 505 186 -390 -3638 4259 35 -297 684 958 2882 -4457 1359 943 -1305 -754 -1881
2387a881N833o682J038K860o84J030l974O464l251l057K252n03L179o235L777
$$ -1881 3952 -2730 -1692 1168 484 1514 -2460 4004 753 -2304 -52 -555 2624 -3611 166
2402A66J366l329J165j460O036m634p76M437k413J103m933M970k47m236L049n44
$$ 166 1532 -1797 -632 -2092 3944 -690 -1466 2971 558 1661 -3272 1698 1451 -2785 264 -280
2418b80K459n483J811L777l218J714j506M135l159l400N105j762N33l183L069
$$ -280 2179 -3304 -1493 2284 -934 780 -726 3409 250 -3150 1955 193 726 -2457 612
2433F12R58m510K412J40K630l964O99N054m247K44j301L235j209l852M641j130
$$ 612 1570 -2940 -528 -388 2242 -1722 -1023 4031 -216 28 -1273 1962 753 -3099 1542 412
2449D12k30l301K446L311m986L074J60Q64k058j968N402k914j091pJ944k41m619
$$ 412 182 -3119 -673 2638 -2348 726 886 1750 -308 -2276 3126 212 -879 -886 1058 817 -3802
2466c802M313j07r70n07R28L674m374l38K554j77j865q25L768k084k009l01K495
$$ -3802 511 404 -566 -1073 -145 3529 -845 -1183 1371 1194 -671 -1496 2272 188 -1821 -2122 373
2483C73R63l883L117J467j761j381R59K881k998q02J518J165k145k544M415j189
$$ 373 1336 -2547 570 2037 276 -1105 -146 2735 -263 -1065 453 1618 -527 -3071 1344 155
2499A55k096J551J335J326l825J030K364j649o47K66K600l072k163L090k3q89
$$ 155 -1941 -390 945 2271 -1554 -524 1840 191 -456 -190 2410 -662 -2825 265 242 -647
2515f47j014K153J715l735L53L150p54k355N82K648j526k483J121J699r49k319
$$ -647 -1661 492 2207 -1528 -1175 1975 1221 -1134 -552 2096 570 -1913 -792 907 -42 -2361
2531b361J994K973l313r53K375O02j093j002J990P77l598l01L055r25k124J257
$$ -2361 -367 2606 -707 -1660 715 1317 224 -778 1212 1989 -1609 -1910 1145 220 -1904 -647
2547f47J623o17j723J171K050j647j336J861J648l144r88K839j278o83q05K431
$$ -647 976 359 -1364 -193 1857 210 -1126 735 2383 -761 -1749 1090 -188 -871 -1676 755
2563G55J124m489K202J916q46j338M03L588l781r21J227Q20m9m213M345P64l483
$$ 755 1879 -2610 -408 1508 662 -676 -273 3315 -466 -1387 -160 660 611 -3602 743 1507 -1976
2580a976J651K49J967k808K5L113j060j568j465L680j987k100K754j89o5k219
$$ -1976 -325 -76 1891 -917 -892 2221 1161 -407 -1872 1808 -179 -2279 475 286 221 -1998
2596a998J716J979k199m8J577J645m074R18J981j924K22k069L857j309l007L063
$$ -1998 -282 1697 -502 -550 1027 2672 -1402 -484 1497 -427 -205 -2274 1583 274 -2733 330
2612C30R1P28l458L349J771l868J600j585L400l254k062N564l128l26j157K741
$$ 330 421 1149 -2309 1040 2811 -1057 543 -1042 2358 -896 -2958 2606 -522 -848 -2005 736
2628G36R58m061L686o30J373l076j55M603n122R68L22J096l84l162L922j097j14
$$ 736 1694 -2367 1319 689 2062 -1014 -1169 3434 -1688 -720 -398 698 314 -2848 1074 -23 -137
2645a37j214K731J259m985L628p10K4j164j143M301m098K93M32J785o36l637O189
$$ -137 -1351 1380 2639 -2346 1282 572 596 -568 -1711 2590 -1508 -1215 -783 1002 366 -3271 2918
2662B918k667J6l14j25L725o491K760J225o90r21k280N583m301L99J570K3K313
$$ 2918 251 267 -47 -172 3553 -2938 -178 1047 357 -564 -2844 2739 -1562 -1163 407 430 2743
2679B743o021N042J46k688J005j228L715m938J133J653j039J028l485O037k624
$$ 2743 -3278 1764 1910 -778 227 -1001 2714 -2224 -1091 562 -477 551 -2934 3103 479
2694D79j922L111j625K066m488K964J199k871R19j683M161m773R27L766l034J933
$$ 479 -1443 1668 43 2109 -2379 585 1784 -1087 -168 -1851 2310 -2463 -1536 2230 -804 1129
2710A129l319M356o98l337K942j152K239n085K708K335m563L003k716M480k293
$$ 1129 -2190 2166 1468 -1869 1073 -79 2160 -2925 -217 2118 -2445 558 -2158 2322 29
2725B9k381N139k827J171k987L252N09m599L658k388K733l127K6N023n263K313
$$ 29 -2352 2787 -40 1131 -1856 1396 1905 -2694 964 -1424 1309 -1818 -1792 3231 -2032 281
2741B81q85K181n64l357M763k752J013k352J716K169n947M276r21J260j152j788
$$ 281 -604 1577 1013 -2344 2419 -333 680 -1672 44 2213 -3734 542 -379 881 -271 -2059
2757b059N416m358J117k80J723M4m918N158k120j11p68j32M193n575K812N22J27
$$ -2059 3357 -1001 116 -164 1559 1603 -3315 1843 -277 -388 -1156 -1288 2905 -2670 142 664 791
2774G91m04k770N968m213K34N80o56K423n672M530r0j832R30j158M529n024J729
$$ 791 387 -2383 3585 -628 -394 186 -470 1953 -3719 811 721 -1111 -181 -1339 3190 -1834 -105
2791a05J534j106R95m197N493k442k390K641j218K510m536K927J481k498J231
$$ -105 1429 323 1318 -2879 2614 172 -2218 423 -795 1715 -2821 106 1587 -911 320
2806C20j618M715m277j00K905k394J405l753L980l50l276K880j271K783l972J845
$$ 320 -1298 3417 -860 -960 1945 -449 956 -2797 1183 833 -2443 437 -834 1949 -2023 -178
2822a78K822l689J930k015L275k298k319M151k269J031k836K989R82m084L657
$$ -178 2644 -1045 885 -1130 2145 -153 -2472 1679 -590 441 -2395 594 1576 -2508 1149
2837A149j483K303k554n67M217m262J115j160K318m77l393M129j925J016k047
$$ 1149 -334 1969 -585 -1152 3065 -1197 -82 -1242 1076 599 -2794 1335 -590 426 -1621
2852a621J787K722n023K975l50O51j346j788M291l249K13l11J440M05l747M491
$$ -1621 166 2888 -2135 840 490 1141 -205 -1993 2298 -951 -738 -1049 391 796 -2951 1540
2868A540j078L0q45j35L452m770J712N37k77m7k807M632k359o90Q00L54J900m131
$$ 1540 462 492 -353 -488 2964 -1806 -94 443 166 119 -2688 1944 -415 -1105 -305 49 1949 -2182
2886b182L310J23j633L52j108L673l990K78J793q91N72k867M203j030j793J730
$$ -2182 1128 1251 -382 -30 -1138 2535 -1455 -1177 616 -275 297 -2570 1633 603 -1190 540
2902E40k35J747l665J661J475j962P8j066L409k942q01K718j061R95k795L277
$$ 540 305 2052 -1613 48 1523 -439 -361 -1427 1982 -960 -1761 957 -104 891 -1904 1373
2918A373L74l154J996m98J537l083N92K444k732Q85j309L034j285k053L464j221
$$ 1373 1747 -1407 589 91 1628 -1455 -863 1581 -1151 -266 -1575 1459 174 -1879 1585 364
2934C64M86j961J520J514l519J554k15J375k109o34L457k567L41k72J837q5k770
$$ 364 850 -1111 409 1923 -1596 -42 -257 1118 -991 -1625 1832 -735 -394 -666 1171 1086 -1684
2951a684K811k38n60j495J009J996l569J164K82R59j089j239L615j668r44K80
$$ -1684 1127 889 329 -1166 -157 1839 -1730 -566 -284 675 -414 -1653 1962 294 -650 -370
2967c70J330L69l372K730k58m20j240J77L133l551O10J416J7k54j788L178q09
$$ -370 960 1329 -2043 687 429 9 -1231 -1054 2079 -1472 -862 554 571 317 -1471 1707 898
2984H98j583L43O75J040l300J544J266j640J80l48K526j669r20J731L15p10j491
$$ 898 -685 -342 333 1373 -1927 -383 883 -757 -577 -925 1601 -68 -988 743 1058 348 -1143
3001a143K363l57k156R34L74Q09k455P17J994r59p13J55K520j906j151J536J34
$$ -1143 1220 863 -1293 -359 15 824 -1631 -914 1080 121 -592 -437 2083 177 -974 562 696
3018F96k84k052J881P72k391N36R74R13j979L31J906j010l32p21K042o96k314
$$ 696 412 -1640 241 1013 -1378 -842 132 1045 -934 -603 1303 293 -39 -760 1282 586 -1728
3035a728K314k84p37p94Q21J318j636K24Q45R15j745k93K481j299j180N20Q95
$$ -1728 586 302 -435 -1229 -408 910 -726 -502 343 1258 -487 -780 1701 402 -778 -258 637
3052F37k70j917P97J834j341j178J655J414j890n35J261O82j130j069J731M48
$$ 637 367 -1550 -753 1081 -260 -1438 217 1631 -259 -794 467 1149 19 -1050 681 1129
3068A129k293j94K019m24j300P30J009k76r32K91J869j325j290J626Q8j154m03
$$ 1129 -1164 -1358 661 237 -1063 -333 676 400 -532 -241 1628 303 -987 639 727 -427 -830
3085h30J007J28j209J06J449L25j783M43K010j459q57Q08Q29o51k047J760J178
$$ -830 177 305 -904 -798 651 976 -807 -364 1646 187 -670 138 967 316 -1731 29 1207
3102A207j903m90J212J175k069J02J992m38o64j214K300j8k753J281M96j95j273
$$ 1207 -696 -1186 26 1201 -868 -766 1226 788 124 -1090 1210 1192 -1561 -280 216 21 -1252
3119a252Q82J527j400n40N69J356q20j295K396r36j228J71Q13M43j890O03R03
$$ -1252 -370 1157 -243 -783 -214 1142 322 -973 1423 487 -741 -570 243 686 -1204 -601 302
3136C02J33j739J048K093k397J83P28J054j209j758K265k64r17p60J620J016l222
$$ 302 435 -1304 -256 1837 -560 -377 351 1405 196 -1562 703 439 -478 -1238 382 1398 -1824
3153a824J845K25M79o44j311L374k116p51Q53K81J34k663K694k14r32L09l74K289
$$ -1824 21 246 725 81 -1230 2144 28 -723 130 411 545 -2118 576 362 -570 -261 -635 1654
3171A654k901Q14J939j206k60r05J919j129j014J172L33L19l037K491R94j944
$$ 1654 -1247 -433 1506 300 40 -865 1054 -75 -1089 83 416 735 -2302 189 1183 -761
3187g61M74K83J703k126j90J495m43o43j687L314j105j948J954q50J642k671J460
$$ -761 -287 -4 1699 -427 -617 878 435 -208 -1895 1419 314 -1634 320 -530 1112 -1559 -99
3204i9K037k370O85j077K376k003r59K779k088R05j869K077Q89l229K490l44O55
$$ -99 1938 -432 253 -824 1552 -451 -1410 1369 -719 186 -1683 394 1283 -1946 544 200 855
3221H55j483L23K211k602N52o49J847p13k294K884j298J84p33J497J099k955J771
$$ 855 -628 -305 1906 -696 -144 -793 1054 341 -1953 931 -367 -183 -916 581 1680 -1275 496
3238D96n17J259j778m87L141l174N76o21J663K01k767K883p72L47j017O83K129
$$ 496 -21 1238 -540 -1027 2114 -1060 -484 -1105 558 759 -2008 875 103 450 -567 116 2245
3255B245m209K302o4J54j66k262L617k294k31P16N95J057l347L073m53q14J32
$$ 2245 -1964 338 274 428 262 -2000 1617 -677 -908 -192 403 1460 -1887 1186 733 -81 51
3272E1p34K734l547Q80J005n23J21j953L567j723l62P99k11J544l791K869N13
$$ 51 -683 2051 -1496 -616 389 -134 -13 -1966 1601 -122 -484 315 104 1648 -2143 726 1239
3289A239j607K87j186K660k716M69J704q53P00k521L438j023j628J911j203J831
$$ 1239 -368 -81 -1267 1393 -1323 -854 850 -3 697 -1824 1614 591 -1037 874 -329 1502
3305A502l037J266J508k321Q68j141L016j953r06K503j663J206k244K410L72k543
$$ 1502 -1535 -269 1239 -1082 -214 -1355 1661 -292 -1198 1305 -358 848 -1396 1014 1386 -1157
3321a157J491p65J496k491O17K528k810J266j324K588q94k011K930j502Q24j714
$$ -1157 334 -431 1065 -1426 -809 1719 -1091 175 -1149 1439 545 -1466 1464 -38 786 -928
3337i28J334P94l012J838n10J590j533q15L131k745J088o55J644J5l014K767j106
$$ -928 406 1200 -1812 26 -484 1106 -427 -1242 1889 -856 232 -423 1221 1236 -1778 989 -117
3354a17L19j022K67K141l377J801q7P55n29j658L393k018J52j19O08O09l447L066
$$ -117 202 -820 -553 1588 -1789 12 -75 680 151 -1507 1886 -132 20 -99 509 1118 -2329 737
3372G37n86l21l21m46K576k800Q71R78J52j50k047K958j511o07L58o6J439l234
$$ 737 151 -170 -491 -937 1639 -1161 -290 688 840 690 -1357 1601 90 -517 -159 -225 1214 -2020
3390b020K386L81j210J78o72K577j813j29J055n67J68k176K697k77j552P97m30
$$ -2020 366 747 -463 -285 -957 1620 -193 -322 733 166 334 -1842 855 578 -974 -177 -607
3407f07J609k355J194J719j643K34q92K305j539j039J618q99O95j961J926O23
$$ -607 1002 -1353 -159 1560 -83 151 -741 1564 25 -1014 604 -295 400 -1561 365 988
3423I88k337J245j68J563j642J79J629j768K58p67K022o98k102K152r68M74j197
$$ 988 -1349 -104 -272 1291 -351 -172 1457 -311 -53 -820 1202 504 -1598 554 -414 60 -1137
3440a137J333J321k262P77N6J147j749m47K187j699K98m27J213J0k433K099m9
$$ -1137 196 1517 -745 32 88 1235 -514 -961 1226 -473 -175 -602 611 621 -1812 287 238
3457B38K40q68K60J664k441R79N4O51p37j555K450j099l65J68M68O79k148J697
$$ 238 478 -390 -130 1534 -907 72 126 777 40 -1515 935 -164 -529 -361 107 786 -1362 335
3475C35O74o83o08m29K252k145R4J000l01n81j131K196q7j021K27O67P78k214
$$ 335 1009 326 -282 -711 1541 -604 -510 490 189 -392 -1523 673 586 -435 -208 459 1237 -977
3493i77J143J100j005o35l37J661j436o86J186K33qj501K016j9j208L08N9J446
$$ -977 166 1266 261 -374 -711 950 -486 -1172 14 247 239 -1262 754 735 -473 -165 -106 1340
3511A340k150M29J304j440m3l90J825q33r83J604n42K99j224J208R95j958L08
$$ 1340 -810 -381 923 -517 -560 -950 875 42 -941 663 121 420 -804 404 1399 -559 -251
3528b51M90M11j262m21J667p89l53j0J404l23j644J389M29k46r62M62Q02j378
$$ -251 239 650 -612 -1033 634 -155 -508 -518 886 563 -1081 308 737 491 -471 -9 793 -585
3546e85l30N84J303j499l96J518m55j42m25J218lj631R33N08l68j107K27J478
$$ -585 -915 -331 972 -527 -923 595 140 -2 -427 791 788 -843 90 598 230 -877 -650 828
3564H28j533L61M76L33k88j432K061J12j163J84N47k6j547O72Q94l81o54k08J569
$$ 828 -705 -344 132 465 177 -1255 806 918 -245 -61 486 460 -1087 -415 479 98 -556 -764 805
3583H05q47q93J255L59o67n33R83M38j200p63J340K26j252M14R53k76j100M04
$$ 805 -42 -935 320 679 12 -521 462 900 -300 -1063 277 503 -749 -335 618 342 -758 -354
3601c54J129l92q60N92N71o86r23J257L01j235J53M23O35r64k58J325n96n66M55
$$ -354 775 383 -477 115 686 0 -923 334 635 -600 -447 -24 611 -353 -611 714 118 -448 7
3620GR44l70j367O32O33m92o00K47J234j396m70J524R0o85j80O23M22j459M57
$$ 7 951 581 -786 -154 479 -13 -613 -366 868 -528 -998 526 616 -69 -249 374 796 -663 -206
3639b06R94n87r92J97J489j111n15N17M92j07q37J137N42j127m49R37K55j097
$$ -206 788 201 -791 -594 895 -216 -731 -214 278 171 -666 471 1013 -114 -563 374 629 -468
3657d68M3P35p0j067L9J461k63p47K34Q56n19q41R59J42n82n41M32J128j747K46
$$ -468 -425 310 240 -827 -788 673 410 -337 -103 753 234 -607 352 494 -88 -629 -197 931 -816 -570
3677e70P72K0m21l65J615l15j453M42P66J39j631J174N37j413LM64J057q75q07
$$ -570 202 222 -199 -564 1051 736 -717 -275 491 630 -1001 173 710 -703 -700 -236 821 -54 -861
3696h61J566j34m01n67J026j52j450R60K62P6j330M52J099j052K35L81Q92j012
$$ -861 705 571 170 -397 629 477 -973 -13 249 325 -1005 -553 546 -506 -271 110 1002 -10
3714a0q56J663m75j89p20J180O8j807Q74L10K89j060K65J395r17q6j79J178n49
$$ -10 -866 797 322 133 -587 593 661 -1146 -272 38 327 -733 -468 927 10 -76 -255 923 374
3733C74j548K044n87l24o98L24J271j735P41M99K17r80l88K142j362k16L44J74
$$ 374 -1174 870 283 -41 -739 -415 856 -879 -138 361 578 -402 -790 1352 -10 -226 118 292
3751B92J43j732J592r1n13k96M35J464k044P36M06k76j77o85K008r50j181N10
$$ 292 435 -1297 295 204 -309 -605 -170 1294 -750 -14 392 116 -61 -746 1262 312 -869 -359
3769c59K86N45j705J469J81p25P1j22J820j699j74J035n47J14j203J853q98r83
$$ -359 -73 472 -1233 236 417 -308 -237 -359 1461 -238 -412 623 76 190 -1013 840 -58 -1041
3787a041J042j52J070j977Q82Q89j014M67m52J379j172r10J440o30L65j216J558
$$ -1041 1 -151 919 -1058 -176 713 -301 166 -286 1093 -79 -989 451 -179 186 -1030 528
3804E28m3j524J063j38J125j723K59J624j336K01o92J413j095q76J835n88M41
$$ 528 485 -1039 24 -114 1011 -712 -453 1171 -165 36 -656 757 -338 -1214 621 33 474
3821D74j504J079P67j606J083l6N54j323k45J860j535L56m06Q70r5j692K023n87
$$ 474 -1030 49 816 -790 293 257 811 -512 -757 1103 -432 -76 -482 388 293 -1399 624 37
3839C7J68o10L47J299j862O97M8L25o74j011K433j508n4j33N06N17j644J923j25
$$ 37 205 -405 -58 1241 -621 76 124 449 -225 -1236 1197 -311 -365 -498 8 525 -1119 804 679
3858F79n73l72j58J694j936N37K39Kj57j279K250r22l49K84K91Q19j861J264l6
$$ 679 106 -266 -424 1270 -666 -129 110 112 -45 -1324 926 4 -345 -61 230 1049 -812 452 416
3877D16n88j68k53J859k006K80P58k84J90j279K003n98p24L66O5J217k181Q40
$$ 416 -172 -340 -593 1266 -740 -460 298 14 204 -1075 928 330 -394 -28 37 1254 -927 -87
3895h7P39j006L69q25J623j207m28J317l08N74j619J456Rj280Q38k44R99j776
$$ -87 652 -354 15 -810 813 -394 -822 495 187 761 -858 598 607 -673 165 -79 920 -856
3913h56J47J405j048L09m30J441r90p14J451p14O97j551J039Q19j906J086l79
$$ -856 -709 696 -352 -43 -473 968 -22 -736 715 1 698 -853 186 1005 -901 185 -194
3930a94N30r08k90J856j002N7n11J237k44j415J597n31K95j091K03J199j604P49
$$ -194 336 -572 -862 994 -8 49 -462 775 531 -884 713 182 477 -614 -411 788 -816 -67
3948f7o1P40o06q14J833r69J4m09P06M10j626J064k36j44n31L50J349j393K77
$$ -67 -128 612 6 -808 1025 56 70 -339 367 777 -849 215 -21 -165 -696 -346 1003 -390 -113
3967a13J24L10j50r14J673p12n36q7L99N32j553R26J20J52m62o4J630j622J09
$$ -113 11 321 171 -743 930 218 -318 -405 -6 526 -1027 -101 19 171 -291 -355 1275 -347 -238
3986b38N66M6K13j514J526l81p62L80k3J061j495M49P89n75R3n66J314p84o92
$$ -238 328 374 587 -927 599 218 -544 -164 -187 874 -621 -172 617 42 135 -431 883 99 -593
4005e93R04k33J29j083R23L41r11N88q7P54j420L00J161n50k99l55J060p15o64
$$ -593 311 78 207 -876 47 388 -523 65 -22 732 -688 -388 773 223 -76 -431 629 -86 -750
4024g50P77M4J77j223J129N97j031K46N6P86r10k51J143o90l81o03J214K3j197
$$ -750 27 71 248 -975 154 751 -280 -34 22 808 -102 -353 790 100 -281 -884 330 353 -844
4043h44J067m0l8p06N56R98j075j7J87L00n53m76J157m03o02p0O97L19j140P62
$$ -844 223 183 145 -561 -5 993 -82 -99 88 388 -165 -641 516 113 -489 -559 138 457 -683 79
4063G9L80r7p46K45R09q25l35K00O44m08q75J130j08m97o3O61M22j230M99L72
$$ 79 459 362 -384 -139 770 -55 -390 -190 454 46 -829 301 193 -304 -367 294 716 -514 -15 357
4083C57o5n60l19J361q86k96L77J27J43q62Q77K87o98n7N26L59j294J94P41l43
$$ 357 292 -268 -587 774 -112 -408 -31 96 239 -623 254 541 -157 -214 312 671 -623 -429 312 -31
4103c1j43k61Q18m40o63Q79L00k63o55P09M23p53k54M84M29q93k45R83j14p40
$$ -31 -174 -435 383 -57 -720 159 459 196 -459 250 673 -80 -334 150 579 -314 -559 424 310 -430
4123d30R3O72r0o00N03K86j01q11L32O61n71l80L56K71n43j06Q00j88j92j90J068
$$ -430 -337 335 245 -355 148 434 333 -478 -146 515 -56 -436 -80 191 -352 -458 342 154 -38 -228 840
4144H40l54r43O78J79j52m96J09O27p75m50O23O36l75o55R50J17q09q2Q09Q4q04
$$ 840 486 -457 221 400 248 -248 -139 488 -287 -737 -114 522 147 -508 442 559 -250 -332 477 561 -243
4165b43j43P12k03p22J94P19l88m08L75N96k91p07O90M22p76j28O05n2o97j81
$$ -243 -386 326 123 -599 -405 314 -74 -482 -107 489 198 -509 181 603 -173 -301 304 252 -445 -626
4185f26P62J80n83p0Q92l43o34M62M81l62n86L30N61o54m34Q41J31p14KP72q8
$$ -626 136 316 -267 -337 555 212 -422 40 521 159 -427 -97 464 -190 -624 217 348 -366 -364 408 320
4206C20n09K4O12k5r31M03P77p90l57P7O68k58m75Q07q9k03m25O19L41q58K06
$$ 320 -189 -165 447 422 -509 -106 671 -119 -476 -399 269 11 -464 343 254 51 -374 245 586 -272 -66
4227f6K61J50p21k29J011o09l34M65N31m74n53P67L61m37l27L91L72r08r7N86
$$ -66 195 345 -376 -605 406 -203 -537 -72 459 -15 -568 199 560 123 -204 187 559 -349 -446 140
4247A40J44o64j36R72m62m29K32O30J2r98O74L82n68l38L70L61o97J50L43J78
$$ 140 284 -380 -516 456 -6 -435 -203 427 439 -559 115 497 -71 -409 -39 322 -375 -225 118 296
4267B96m38m14J129l19n37M04J91M2j032N58O61p52j97J56O91o56l73J012k06
$$ 296 -142 -556 573 254 -283 121 312 354 -678 -120 541 -211 -408 -252 439 -217 -590 422 216
4286B16j9n08Q14J12j054K56K89K12p94J72O70m71j64L4Q49n54l59P64k63m2o20
$$ 216 197 -311 503 615 -439 -183 106 318 -476 -304 366 -105 -269 -235 614 60 -299 465 202 160 -460
4307d60P14J69j023L45K07L41p50L8J004p40J04k15P78k59q95R80k71j09l46K53
$$ -460 254 423 -600 -255 -48 293 -457 -419 585 -155 -51 -266 512 253 -642 338 67 -42 -388 -135
4327a35N71j122N06K79P7l75k23J142n76l6k47M51M5j128Q62j6k98l12K33J040
$$ -135 436 -686 -180 99 176 -199 -422 720 144 108 -139 312 357 -771 91 75 -223 -535 -302 738
4347G38j140L18K58K37j51q91J337o39p7j01P4N16j406R42K63m22Q8k41J120j127
$$ 738 -402 -84 174 411 260 -631 706 67 -10 -111 -37 479 -927 15 278 -144 -56 -297 823 -304
4367c04J91K77J53Oj044J102j98n81J25J78N59j149N40O16n85R0l60J186p04n57
$$ -304 -113 164 317 323 -721 381 183 -398 -273 -95 464 -685 -145 471 -114 -24 -384 802 98 -459
4387d59P38k98n9q92J240lp79L92q8N60o38J25P11n04J47m77R62p37o25R72m12
$$ -459 279 -19 -78 -970 270 267 -512 -120 -208 352 -286 -161 550 46 193 -284 678 -59 -684 288 -124
4408a24L60q41Q14M08j060M32o1Q33r21k93J122o75J10p77J009j47r25Q75l7J50
$$ -124 236 -605 209 617 -443 -11 -72 761 -160 -453 669 -6 104 -673 336 189 -736 139 102 252
4428B52o90N08P72j193N41N8J83n30o57J312p63J16m05P16J10r82Q44J44j35k96
$$ 252 -438 70 842 -351 190 248 431 -99 -756 556 -207 -91 -496 220 330 -652 192 336 201 -95
4448i5J06P61j281M04K00Q1m15m91J342o30%o0J52O93j309P49Q2j28k90l75R60
$$ -95 11 772 -509 -105 95 176 -239 -730 612 -18 -18 -78 74 767 -542 207 289 161 -129 -504 456
4469D56q40J73K83L0Q7q10J018j44m16K78j03N33j113L67N35o12J14l57J093n44
$$ 456 -384 -211 72 102 189 -621 397 253 -163 115 12 545 -568 -201 334 -278 -164 -521 572 28
4489B8m48P02p9P1q07J000Nn93J55r6N74q81J97L85k98j76j72Q82l33n33O75o3
$$ 28 -420 282 203 274 -533 467 472 -121 34 -62 512 -369 -172 213 -85 -261 -433 449 116 -417 258 195
4511A95L23r69M32L75p29J96j49O95p96N2O05k85L9l56R84k09q33O47k99L92p94
$$ 195 518 -451 -19 356 -373 -177 -326 369 -427 -375 230 -55 -16 -372 612 403 -430 217 -82 310 -484
4532d84K43P90r80K15K16K32k42m49R26l32j31k77M50K98r17L78J57O8o14O5P49
$$ -484 -241 549 -431 -216 0 232 -10 -459 467 135 4 -273 177 475 -442 -64 93 161 -453 -388 361
4553C61p17R5K85K69j01o85Q98k90q6l52L20K96r25O01r4J70k14Q2P97q03J0K53
$$ 361 -356 -261 24 293 192 -493 405 115 29 -323 -3 293 -632 -31 -125 45 -169 -87 710 -93 -83 170
4575A70K86M1j287J039k74k17J3J52O46j139M80M76k88k0m86R87l50n30M82NM4
$$ 170 456 497 -790 249 -25 -242 -229 -77 569 -570 -90 386 98 78 -408 579 229 -301 181 186 230
4596B30p71N96K60m54j30J94N80o78J7M66Ok75l63P48k66m02K8J57K25p48N55
$$ 230 -541 55 315 -139 -269 -75 505 -173 -156 310 316 41 -322 426 160 -242 -214 -57 168 -580 -25
4617b5L83m21PQ0N13o58n2O49k94j98k24M03Oo53M87L7L31o97K75M11m02j29K67
$$ -25 358 -63 -56 24 537 -121 -173 476 182 -16 -240 163 169 -484 3 40 371 -326 -51 360 -42 -171 96
4640I6K89m44m08M73K20n82P3M36K3m21J46L01R1o82K21O39m41j90O2L49k94k61
$$ 96 385 -59 -467 6 226 -356 -283 153 176 -245 -99 202 293 -389 -168 471 30 -160 -98 251 -43 -304
4662c04K67J41r8l64N67K23o77J90K68kl29j9N54m27l25K76J3J63n31N16M27o51
$$ -304 -37 104 6 -358 209 432 -245 -55 213 211 -118 -137 417 -10 -335 -59 -46 117 -414 102 529 -122
4684a22L2R4M01m56k33O34k48l04k50N69Q6o08L79L67k88l79M83K33j17m83L39
$$ -122 -90 4 405 -51 -284 350 102 -202 -452 117 203 -405 -26 341 53 -326 157 390 273 -210 129
4705A29K79n48j16L19rl05j02N52l1l21J29M64k12m05J57L20l09l78M72Jk04l77
$$ 129 408 -140 -256 63 54 -251 -353 199 168 -153 -24 440 228 -177 -20 300 -9 -387 85 86 -118 -495
4727d95N99J77m88KL59K27n72N7L46J9o63J73N29k38m42K52L86j90m49M76L43
$$ -495 104 281 -207 -205 154 381 -191 -134 212 231 -432 -259 270 32 -410 -158 228 38 -411 65 408
4748D08m21j52K16L12o11r9O04n4m22k5L11n2k97R5N32j54l88J80M11m69j30K87
$$ 408 -13 -165 51 363 -248 -347 257 203 -219 -244 67 15 -282 -187 345 191 -197 -17 394 -75 -205 82
4770H2Q3m46j8N65j56l88J51M42m4n55K56N40k00o11J90M52m45k53M56j7j46m41
$$ 82 165 -281 -299 266 110 -278 -127 315 271 -284 -28 512 312 -299 -109 343 -102 -355 101 84 -62 -503
4792e03O31n0l11K27K04j7m26K66L06k75k70l0N85m10l02N44p9N7m68M40K11n35
$$ -503 128 78 -233 -6 198 181 -245 21 327 52 -218 -248 337 -73 -375 169 90 147 -321 119 330 -205
4814b05J1K96J99m85P4M32l97j78j19M10J16m01M01R8j19k98J92M62o87J63n9
$$ -205 -194 102 301 -184 -110 322 -75 -253 -372 38 154 -247 154 252 133 -165 27 489 -198 -35 -94
4835i4K71l42l20O81r2k94q0O57j70n34L88L51k99n09l2P43l86k5J80%p6m28Q99
$$ -94 177 -165 -485 196 104 -190 -270 387 217 -317 71 422 123 -386 -418 325 -61 -86 94 94 18 -410 489
4858D89m48k54O6K65L45q95M45J62k50j42n4N79m59j48M11O8j17m81O94L2m78
$$ 489 41 -213 -147 118 463 -432 13 175 -75 -217 -271 308 -151 -299 112 180 63 -418 276 308 -170
4879a70QL11N9k99j91M30q5k23j72P92m93k93O47j52j16n90O22M64q52J23N5J34
$$ -170 -162 149 208 -91 -282 148 63 -160 -332 460 -33 -326 321 169 53 -537 85 549 -303 -180 -125 9
4901Ij78k03N28p0j40j15O02k43m88L34J07r7m47K24M76n66L1P8M10l09j43N43
$$ 9 -169 -372 156 86 -54 -169 433 190 -298 36 143 46 -401 -177 299 -267 -236 -158 252 -57 -200 343
4923C43k83O0k65M52k03n01L41P6O5m56J52O63o27jK76K77l63j99O37m59mp8J75
$$ 343 60 120 -145 307 104 -397 -56 20 85 -371 -219 444 -183 -184 92 369 6 -193 444 -15 -19 -97 78
4946G8K16q22M66J94j66j52p7P21n32O7J39o9J73o40O24j11l03p2J26O35q37K57
$$ 78 294 -528 -62 132 -34 -186 -263 458 -74 -7 132 63 236 -404 220 109 -194 -266 -140 495 -342 -85
4968h5R8K10k22j55N94m15k48K36K40k09n64N41J80n30J56K7M83n31L15J82j43
$$ -85 13 223 1 -154 440 25 -223 13 253 44 -520 21 201 -329 -173 -146 337 -194 121 303 160
4989A60r5l60P71l51m63K60J04J92n60M46M6k28J95k77O01o63j9N88m14J75l87
$$ 160 65 -295 476 125 -338 -78 26 218 -342 104 150 -78 117 -160 441 -222 -241 347 -67 108 -279
5010b79L45J40p34N82j07K02n45M08N26n92K14j27L94m20m10O94l64K7l56O99
$$ -279 66 206 -528 54 -53 149 -396 12 538 -54 160 33 427 7 -403 291 -73 -46 -402 297
5030B97j4o49K56L70J28n78K17N73q03l0N3L89k57m44N20q3jk23L80J97n85L87
$$ 297 283 -366 -110 260 388 -190 27 600 -203 -233 -180 209 -48 -492 28 -55 -56 -279 101 298 -287 100
5052A00o8J79j69l07N76m92k4J11R7j1l69M15M2k93K77p6M05n93K19K94l07q0
$$ 100 32 211 42 -265 311 -181 -205 -94 3 -8 -377 38 80 -213 64 -12 393 -200 19 313 6 -74
5074g4l22O78m10j47J94K71L2o26P51j50j65m9P6L38o34J33J78J22j46l84O18
$$ -74 -396 282 -128 -275 -81 190 222 -404 347 197 32 -17 59 397 -237 -104 74 196 50 -334 284
5095B84l06k23J86O1K13m23L29K94n47j7m7M57m25m5M59l18K72m14N37o5n78M97
$$ 284 -22 -245 -59 2 215 -208 121 415 -132 -149 -196 261 -164 -209 250 -68 204 -210 327 262 -316 181
5117A81j69R8l96K21M01n45P7j13L90k85j79N23m7r8k70M00J70o25j7L34J51n17
$$ 181 12 110 -286 -65 336 -209 -132 -245 145 -140 -319 204 157 59 -211 189 359 -266 -283 51 202 -315
5139c15O4O12m51P4j6K45j74k86M02m6k2j45J80J99n21K63J3k2j94ON68n09j1
$$ -315 -251 361 -90 -16 -32 213 39 -247 155 109 87 -58 122 321 -200 63 76 54 -140 -134 434 -75 -86
5162h6N8K96j97m97L97K63l22n2R9J30l49jM26N5k84r5N87j78k26r8J58J78o44
$$ -86 -28 268 71 -426 -29 234 -88 -140 -41 89 -260 -261 165 220 -64 -159 428 250 24 -74 84 262 -382
5185c82K77K27j92k22L06L87n47O9J96l1l2k19M38p3n16J24J44Q0l84L82J72k06
$$ -382 -105 122 -70 -292 14 401 -146 -77 119 88 56 -163 275 202 -314 -190 -46 34 -350 32 204 -2
5207br0J03L11l02k38M29j7l18J67P6R3n04J28L18P9m49O6L23J1l33K96P8k71
$$ -2 -92 11 322 20 -218 211 194 -124 43 119 212 -292 -164 154 233 -216 -150 173 184 -149 147 225 -46
5230d6j16K18P1m48Q9J56K92l11K5J86J83l37l2L75j95l39L37R3j71l04J81J52
$$ -46 -162 56 127 -321 -232 -76 216 -95 -70 116 299 -38 -70 305 110 -229 108 201 30 -274 -93 59
5252E9j86n7K79J62l05mK49J50l61j76M34k38l23L64J89l04j35R7K42k25L7K27
$$ 59 -127 -184 95 257 -48 -52 197 347 -14 -190 244 6 -317 47 236 -68 -203 -106 136 -89 -52 175
5274A75k8k28r0K72k4m13O3M01Pm01J43K88j75o1J35J00j18k12L79p2k01j72K53
$$ 175 147 -81 -171 101 77 -336 -273 128 135 -266 -123 165 -10 -71 64 164 46 -166 213 141 -60 -232 21
5297B1J95j04m50L46L66m76r2M22kk41r8K92k69k2J8L39k23m02M37%j74J9K66
$$ 21 216 112 -338 8 374 -102 -194 228 226 -15 -113 179 -90 -112 -94 245 22 -380 57 57 -117 -98 168
5320A68O3k77j04M54j89r0k35M03j6m17J8L40j73k51J82N28m42k0J70K13l55j89
$$ 168 231 -46 -150 304 115 25 -210 193 177 -240 -222 118 -55 -306 -124 404 -38 -58 112 325 -30 -219
5342b19M23k16q1j04L50n2k88kL33J86n80K77L88l99j13J02K50j86l62L55J08
$$ -219 204 -12 -93 -197 153 101 -187 -189 144 330 -250 27 415 16 -97 5 255 69 -293 62 170
5363A70m11J31K77j44lj07L47k20pj20L37l13j79K78N8k75j58K94J34o0J6N6K18
$$ 170 -241 -110 167 23 20 -87 260 40 33 -87 250 -63 -242 36 94 -181 -339 -45 89 29 45 101 319
5386C19l34r1M14k91j01l6K98j23m19M50j00K9k96M54J77l61N7J67O6m01j35K74
$$ 319 -15 -106 308 17 -84 -120 178 55 -364 86 -14 15 -281 173 350 -11 46 213 279 -122 -257 17
5408A7m8l36P1M18p1m42M45J38k0j58K55J37l99k28J2K85k61k24O51j45j97q3
$$ 17 -31 -367 -296 122 51 -391 54 192 172 14 269 406 7 -221 -209 76 -185 -409 242 97 -100 -183
5430a83L46J58m33J97J01k8m20J57L50l83j16K17J99r5l14N04j37j40m5K71L1
$$ -183 163 321 -112 85 186 158 -262 -105 245 -138 -254 -37 162 67 -247 257 120 -20 -65 206 237
5451B37k61RQ6M1k76LL56k09k32J97O6J40m06N21j84Lj78J92K95n55M1M2Q1k73
$$ 237 -24 -15 71 112 -164 -161 195 -14 -246 -49 17 157 -249 272 88 91 -87 105 400 -155 -114 -72 9 -264
5475b64n0O67l80j80J83J76k6l03L27J52m89j9J13L97o03J16L27o8k8k89P05l74
$$ -264 -314 353 -27 -207 -24 152 126 -177 150 302 -187 -206 -93 304 -299 -183 144 76 48 -241 464 90
5497I0l09L99k22r8j62Q3L43k57j23J48L74n31n0P16l25j68j91N60M0p34O69j29
$$ 90 -219 180 -42 -140 -302 -219 124 -133 -256 -108 266 -265 -315 401 76 -92 -283 277 317 -417 252 123
5519A23q5l38K27M28m21m7QN41l58k33N00k08p0k85K61K26o88M44J97j38l27J05
$$ 123 38 -300 -73 355 -66 -113 -105 436 78 -155 345 137 67 -218 43 269 -419 25 222 84 -243 -138
5541a38N27m28j31L17M0j59j01L57k8n15J61J04K70m64Q0J09J17k20r8O88l60
$$ -138 389 -39 -170 147 187 28 -73 284 256 -259 -98 6 276 -188 -108 1 118 -102 -200 488 128
5562A28l10J15J85M9m49M51M9k33k37J62M77n76L0L74r6k39M4L18p6l87J40M8
$$ 128 -182 -67 118 167 -282 169 218 -15 -252 -90 387 -189 -159 215 119 -120 -76 242 166 -221 -81 -33
5584c3K01n29L27J81j40n2O1M23n07m2L60k40q7k02M27Pm70L45%L0k22J24K78
$$ -33 168 -361 -34 147 7 -45 16 439 -68 -110 250 10 -77 -279 148 155 -315 30 30 60 -162 -38 240
5607B40k87M7J31J62j75l99M49j03j78j60K78J19m43L66o5K35l65J11K84k99j14
$$ 240 -47 0 131 293 118 -281 168 65 -113 -273 5 124 -319 47 -18 217 -148 -37 247 -52 -166
5628a66J80K37l53k15M23j17q4L9K50R4n57L53pK08l24p0L60m42Qn2K66nk85K78
$$ -166 14 251 -102 -317 106 -11 -95 -56 194 288 -269 84 77 285 -39 -109 251 -191 -183 -235 31 26 -259 19
5652A9J59k41j7K75K70n19R7m3J85k95j48M19j68j66J56K14j93l59L37K22n6l08
$$ 19 178 -63 -80 195 465 -54 43 0 185 -110 -258 161 -7 -173 -17 197 4 -355 -18 204 148 -160
5674a60K72J31m92J32J08J44k20j11M25k06j58J61J95L1l76J34K20k19j81J16
$$ -160 112 243 -249 -117 -9 135 -85 -196 229 23 -135 26 221 252 -124 10 230 11 -170 -54
5694e4J60j78k83N03o8j44j77M13L70p80K92J91k3m90K11K19j35k49J14L70k22
$$ -54 106 -72 -355 148 80 -64 -241 172 542 -238 54 245 222 -268 -57 162 27 -222 -108 262 40
5715D0k61N68j91k21j78L41J85k57l4o1J09m07K65M03l65j47n5N06j11k89L10
$$ 40 -221 347 156 -65 -243 98 283 26 -8 -69 40 -367 -102 301 -64 -211 -266 240 129 -160 150
5736A50r8j20j56L60J07o17J78K20O0k94l3M04j28j93J51M5J44l90L14O9l72k24
$$ 150 52 -68 -224 136 243 -374 -196 24 84 -210 -243 161 33 -160 -9 36 180 -210 104 173 -199 -423
5758d23M10J83l12j07K65K25l19P9L04p6m14J55K82j74l63K56J39j39k14L52K4
$$ -423 -13 170 -142 -249 16 241 -78 1 305 229 -185 -30 252 78 -285 -29 110 -29 -243 109 133
5779A33j21l0K28L1j75j64K98j10l09K76J83j10l71J08J86r3p3J51L04k68j38
$$ 133 12 -18 210 241 66 -98 200 90 -219 57 240 130 -241 -133 53 -40 -113 38 342 74 -64
5800f4J60J93l40p1K19l9l6k29L56k01k43K12L37j59k10J65J85l01r9L57n6n9
$$ -64 96 289 -51 -122 97 58 22 -207 149 -52 -295 -83 254 95 -115 50 235 -66 -165 192 136 77
5822G7m25L25J69k29j43L50m8o1m9L05o7l54RK17Q3m02J62K44r7k12P5K29k96
$$ 77 -348 -23 146 -83 -226 124 76 15 -34 271 204 -150 -141 76 159 -243 -81 163 66 -146 -71 158 -138
5845a38oK48J29k77M5K18p4l78J62L01j63l60J22L87j45j61K91J48n02p4L59n7
$$ -138 -144 104 233 -44 1 219 145 -233 -71 230 67 -293 -171 216 71 -90 201 349 -153 -227 132 75
5867G5j54j60K00J70m47K05J99j6k27M6L67k15k28J84K33k90q4L13P2m31L6J80
$$ 75 -79 -239 -39 131 -316 -111 88 72 -155 -109 258 43 -185 -1 232 -58 -142 171 243 -188 -152 28
5889B8K10m34QK25q7J09j22K99r8l37K43k5J59n16L36K32m20l7J05M22l32n7K96
$$ 28 238 -196 -188 37 -50 59 -63 236 138 -199 44 19 178 -338 -2 230 -190 -227 -122 300 -32 -89 207
5912B07k21r3m3K74M0m92L56P8J15k53L2O0q7n2Q7J54q8k90L81m3k85P4q8L02
$$ 207 -14 -107 -150 124 164 -328 28 106 221 -32 0 60 -27 -79 8 162 74 -216 165 122 -163 -89 -177 125
5936A25l83J47J91K4m34K93K53j89q6n9K94k07k73L81J7l17J8M0Q6j72K76P4J50
$$ 125 -258 -111 80 104 -330 -37 216 27 -59 -118 176 -31 -304 77 94 -223 -205 -165 -79 -251 25 99 249
5959B49l78K13K27m66K7J60Mo1l89M30J36j65L3J30K68o42K39K40k26p3j65L47
$$ 249 -129 84 311 -155 -128 32 36 -25 -414 16 152 -13 20 150 418 -224 15 255 29 -44 -209 138
5981A38k22j45K09J94k43j94L30K98k92j05m5L44m11J9J84k0j56%L04j00l91K15
$$ 138 -84 -229 -20 174 -69 -263 67 365 73 -32 -77 267 -144 -125 59 39 -117 -117 187 87 -304 -89
6003h9J91J23n14L16L72m06l25J43M08l83q0L48n8Nl7K18j26l55K55N0Q9k03M1
$$ -89 102 225 -289 27 399 -7 -332 -189 219 -164 -244 104 46 51 14 232 106 -249 6 56 145 -58 -17
6026a7K50l28k63L46K77l97q5M47j65j68kL04k1l30R7K35j14k89mM30k38j62J51
$$ -17 233 -95 -358 -12 265 -132 -217 230 65 -103 -105 199 178 -152 -55 180 66 -223 -227 203 -35 -197 -46
6049d6K59k07l14L68j0J1p8J21J47l71J02J44k10k50K3O34l56j39J88oK27n30
$$ -46 213 6 -308 60 50 61 -17 104 251 -120 -18 126 -84 -334 -311 323 -33 -172 16 10 237 -293
6071b93M93jj44%j03L02m63Q4K11j72J00k57M65p9l62J56K07j23j27J48J91l12
$$ -293 200 199 55 55 -48 254 -209 -125 86 -86 14 -243 222 143 -219 -63 144 21 -106 42 233 -79
6093g9j34O8M90m94p2K91L5k0l90O23N2o11K31J52j06k89J82K05k22%j27N30l57
$$ -79 -213 -145 345 -149 -221 70 105 85 -305 318 370 -241 -10 142 36 -253 -71 134 -88 -88 -215 315 -42
6116d2k49M82j41J41k55P9J01m34K22K78p9l20O1K61j17J5J26J15k05k13K63J53
$$ -42 -291 191 50 191 -64 15 116 -318 -96 182 103 -217 -156 105 -12 3 129 244 39 -174 89 242
6138B42k46j91J61j0k51K08K51k0r6j04K22k2N4k14J72pm99L93Q5j20k07J62K93
$$ 242 -4 -195 -34 -44 -295 -87 164 144 48 -56 166 144 198 -16 156 149 -350 43 128 8 -199 -37 256
6161B56n08O5K82J84l72rL80j36k12R5k%k55K12N1j64pJ97K19l54l6L10K2l27
$$ 256 -252 -187 95 279 -93 -102 278 142 -70 25 23 23 -232 -20 31 -133 -140 57 276 -78 -114 196 218 -109
6185a09m5M16j79l67J63J61K53m45K54P4k74n7J13K53k12n6L09j71l2m61M77j4
$$ -109 -154 262 83 -284 -121 40 293 -152 102 176 -98 -155 -42 211 -1 -57 252 81 49 -412 65 51
6207E1k78Q3K24K5l04L76M0k00R0pJ52j88m14L40o9J9j16K24J14k65O2R8J63m09
$$ 51 -227 -144 80 105 -199 177 217 17 107 100 252 64 -350 -10 -79 -60 -176 48 162 -103 -41 57 220 -189
6231a89J49J63l9k25l8L68k50l57N58J30j43m22L73J59k80J68L9j8j31k12M79
$$ -189 -40 123 84 -141 -179 189 -61 -418 140 270 127 -295 78 237 -43 125 164 146 15 -197 282
6252B82k92j21Q7K44j82l17L22J79k25j7J48J83k40k95L0L46k23k88O10k46o7
$$ 282 -10 -131 -44 200 18 -299 23 202 -23 -40 108 291 51 -244 -214 132 -91 -379 231 -15 -82
6273h2p6K14J49m34M63K5l01m7J6K87k51j46K42j83LM0R6L06l33k07L37O7j13
$$ -82 -158 56 205 -229 234 259 -42 -89 -73 214 -37 -183 59 -124 -121 -81 15 321 -12 -219 118 185 72
6296G2j4P8k89k0m7M51m56j02M57k7Kj92J38J08k38J57N9l6l17K06J80m3j04r4
$$ 72 58 136 -153 -173 -220 231 -225 -327 130 103 105 -87 51 159 -79 78 137 101 -216 -10 170 127 23 -71
6320g1J67j26k62L18K09l02j04K55J30k22k20J93R3mp7R1n1k30K31J83o5j84J11
$$ -71 96 -30 -292 26 235 -67 -171 84 214 -8 -228 -35 58 54 -23 68 17 -213 18 201 136 -48 63
6343F3K89l75j77J31J42k16j9K55mk34N3J68J15k08m0K38j1l65J22K10k24m3K35
$$ 63 352 -23 -200 -69 73 -143 -162 93 89 -145 -92 76 191 -17 -57 181 170 -195 -73 137 -87 -130 105
6366A05J1k52M0J37O3K5l58M46kl35L2K17j64k15J80J89m4k69L06J63l07l40M31
$$ 105 116 -136 -96 41 104 129 -229 217 215 -120 -88 129 -35 -250 -70 119 75 -194 112 275 -32 -372 59
6389E9J74o9l09K68Q4m45O9Q7J31k83k3L88j84j1K18N6j05k24J59N9j19k28J16
$$ 59 233 164 -145 123 207 -238 -169 -82 49 -234 -257 131 -53 -64 154 210 105 -119 40 99 -20 -248 -132
6412a32J83k12P8M2J50j84O2K44K07n74O3K14m4l35K06K09k71k06L90Ok62L1L71
$$ -132 51 -161 -83 -41 109 -75 -13 231 438 -136 -73 141 97 -238 -32 177 -94 -300 90 96 -166 -135 236
6435B36j9k72l2K33J90l32j89K96j07j64J21K50k03j73J73J42ok26M56k26q8j97
$$ 236 217 -55 -87 146 336 4 -185 111 4 -160 -39 211 8 -165 8 150 144 -82 374 148 60 -137
6457a37L40l3m39O3K04J41l36J10M02k69n5K47K1k48k14J33L19l10p0J23J33m00
$$ -137 203 170 -269 -206 -2 139 -197 -87 315 46 -9 238 259 11 -203 -70 249 -61 -131 -8 125 -275
6479b75K75J31o3r9L4L42j92k89J07J88k82k68M96m6k00J5J36J35k82j05L09J34
$$ -275 0 131 68 -31 3 345 153 -136 -29 159 -123 -391 105 59 -141 -126 10 145 -137 -242 67 201
6501B01n7k94K42K6j62k02L79k5k36J08P0q2K7J20J41j64j84K85L7k95J1L11k45
$$ 201 144 -150 92 118 -44 -246 133 108 -128 -20 50 -32 -5 115 256 92 -92 193 230 -65 -54 257 12
6524A2k70K04R1Q6l96K03L58k06j51O0K73j59m64M89j99l1J40m0M6j98K21p0K02
$$ 12 -258 -54 37 123 -273 -70 288 82 -69 -9 264 105 -359 130 -69 -100 40 0 46 -152 69 -1 201
6547B01j74l7K42j64m2n2J91j06l50L59k2k29K44j07K90k73R0L2O7l12N6M71l97
$$ 201 27 -10 232 68 26 -26 165 59 -291 68 46 -183 61 -46 244 -29 61 93 160 -152 -96 375 -22
6570b2n5l3K53j29j58K63Q8k43q0J19K43l31MO8k1j47m4K26m1k14n2M86q3j80
$$ -22 -77 -110 143 14 -144 119 207 -36 -116 3 246 -85 -81 -13 -34 -181 -225 1 -40 -254 -306 180 97 -83
6594h3J24K45j96K7r1K47l28j06K82j72j9k01M72p5m36K67J79k9j29k2L46l79
$$ -83 41 286 90 117 26 273 -55 -161 121 -51 -70 -271 201 126 -310 -43 136 107 -22 -44 302 -77
6616g7p3K2K30k20m7K28M9k02J31j14L49k21K1L3J05k76K0J07j39p6J52J75O8
$$ -77 -150 -128 102 -118 -165 63 112 -90 41 -73 276 55 76 109 214 -62 -42 65 -74 -150 2 177 245
6639B45o42M97N7j22o3K51K39o17K05n0J01k27p9L44j57r6n4L04j31k56M39j8
$$ 245 -397 100 157 35 -28 223 462 -155 50 0 101 -126 -205 139 -18 -114 -168 136 5 -251 188 170
6661A70p6k88J64J28j92o0K51k4l23J48K02M1j96J12r3J89j83L1J86l32j85K43
$$ 170 94 -194 -30 98 -94 -154 97 73 -250 -102 100 141 -55 57 -36 153 -30 1 187 -145 -330 -87
6683h7J94k59kQ7m6L0n7K66R6l84J26qK84m75K36O7j56Q7k23M17j98j87M46j33
$$ -87 107 -152 -154 -67 -113 -83 -140 126 222 -162 -36 -44 240 -235 1 68 -88 -1 -224 193 -5 -192 254 121
6707A21mk47J70J79l65N0J86J11n56K53K41k17k7J69J06k1l67L81j97R7j95K17
$$ 121 117 -130 40 219 -146 -96 90 201 -355 -102 139 -78 -105 64 170 149 -218 163 -34 63 -132 85
6729H5pj65J01N3K9j78j32L24p8j8L0K01k47r3J76m5J20l71K39J11l42N2J53J92
$$ 85 78 -87 14 67 96 -82 -214 110 32 14 44 245 -2 -95 81 36 156 -215 24 135 -207 -155 -2 190
6753A90j24l4K86j22j73KQ3R0m16J79K89j66j46kK79l03L2J17J91k85o9K63P4
$$ 190 66 32 318 196 23 25 108 198 -218 -39 250 84 -62 -64 215 -88 -56 61 252 -33 -102 161 235
6776B35n40J09K70j31k01J48J22R2l14Q9M17k64kN7m9rk06K93k03p5nJ35K47l30
$$ 235 -305 -196 74 -57 -258 -110 12 104 -210 -121 296 32 30 87 38 29 -177 116 -87 -162 -167 -32 215 -115
6800a15J36P8K4k41J27J86k75p0J89mj58m6J15J04k28M6K98m0k49K8J41O6j23
$$ -115 21 99 123 -118 9 195 -80 -150 39 35 -123 -169 -54 50 -178 -132 166 126 -123 -95 46 112 -11
6823a1n4R0j41J0J18MP0l40L19K09m67J96L08j38k35n2J56j29j13N1K02kk17K20
$$ -11 -65 25 -116 -106 12 16 86 -254 65 274 -193 3 311 173 -62 -114 42 -87 -200 -149 53 51 -166 54
6847E4k2o9j91L95K09l83K1j5p2O5l25M66j09n0j44K95j25p1JL50l89qJ21J73
$$ 54 32 -37 -228 167 376 -7 14 -1 -73 -8 -333 133 24 -26 -170 125 0 -71 -70 280 -109 -117 4 177
6871A77j77j60K71m2Lk41K45J22j82j33K79j68q1J48J22q5l26K31K17k67j03K10
$$ 177 0 -160 111 69 72 -169 76 198 16 -117 162 -6 -87 61 183 98 -228 3 220 -47 -150 60
6893F0J12k02r0J99L6j88P0Q2K00m85J66K54j66k17J07J93k59Q7J05Q1l32N4K36
$$ 60 172 -30 -120 79 115 -73 -3 79 279 -206 -40 214 48 -169 -62 131 -128 -41 64 145 -187 -133 103
6916A03j13l6L6O3r1l7L2p3J09j15R3K06o6m60L51K52k12k25K55J3l66m6K52J61
$$ 103 -10 -46 -10 53 -38 -75 -43 -116 -7 -122 -29 177 111 -349 2 254 42 -183 72 85 -281 -327 -75 86
6940H6k08K8J83j57J1J75K35j94k46Q5J73j92j79L11O6k40j25J87J87k31j5L3
$$ 86 -122 -94 89 -68 -57 118 353 159 -87 -2 171 -21 -200 111 177 -63 -188 -1 186 -45 -60 -27
6962b7K19j90p6K60k5l89P0K63k77l2K79N8m1j78lL22l6j61l6J34l56M0J20rq0
$$ -27 192 2 -74 186 161 -228 -158 105 -172 -204 75 133 92 -86 -89 233 197 36 0 134 -222 -182 -62 -71 -151
6987a51p9M67j89r7l4K41L6l31K70j4j17m9R8m8j74j5J79J47k51j62L68J53l13
$$ -151 -230 237 48 -49 -83 158 194 -137 133 119 2 -47 51 3 -171 -186 -7 140 -111 -273 95 248 -65
7010f5lQ9J10o3j06K56l48N6R0J92k08j94K64j28J9J0L39l3m70K33K46k30k13
$$ -65 -68 21 131 68 -38 218 -130 -74 16 208 0 -194 70 -58 -39 -29 310 277 -193 40 286 56 -157
7033a57J28M0P7n7N0J35p7k30L52j58k54M7J14J57l52q3K23r3L0J08N7J44k77
$$ -157 -29 11 88 31 81 216 139 -91 261 103 -151 -104 10 167 -185 -268 -45 -138 -108 0 57 201 -76
7056g6R2P3j1p2LK01l30j46M12q9k84J68J66l7k41J51L10l22P0p4J67r8k84L18
$$ -76 16 89 78 6 9 210 -120 -266 146 57 -227 -59 107 70 -171 -20 290 -32 38 -36 131 33 -251 67
7080F7nj27q1J71J23k67J5J01K21l14J7J36K0j66J02K1j42o4J23K56m24J35n5
$$ 67 62 -65 -146 25 148 -119 -104 -3 218 -96 -79 57 77 -89 13 34 -108 -172 -49 207 -217 -82 -137
7103a37K77j23p2J88J77m01m7K28L3l27J19J6J89k83N2M49k54j63P8K63k92j82
$$ -137 140 17 -55 133 310 -91 -138 90 123 -204 -85 -69 120 -163 -111 338 84 -79 -1 262 -30 -212
7125b12K68j7k15rK18J15n50L39J31l4r4J1K19j10j33l4K47j19l05L48J73k37
$$ -212 56 39 -176 -185 33 148 -402 -63 68 34 -60 -49 170 60 -73 -107 140 21 -284 64 237 0
7147@p7J67J41m09K01J29m9r9j37J81j0p5j51L59j33k83K56J67k07j85K25Q4j52
$$ 0 -77 90 231 -178 23 152 103 4 -133 48 38 -37 -188 171 38 -245 11 178 -29 -214 11 95 -57
7170e7kJ99M4j19k65K68j59J9N0J16p6j86L66J09k21k77J28Q5L5k35K89k01J71
$$ -57 -59 140 184 65 -200 68 -91 -72 -22 94 18 -168 198 307 86 -191 -63 22 57 -178 111 -90 81
7193H1l48K83N6k33J51M1N1j78j1K22j91m4J26M6k3k08J83p1j51j07L69J2j40
$$ 81 -267 16 72 -161 -10 31 82 -96 -107 115 -76 -120 6 52 29 -179 4 -67 -218 -325 44 56 -84
7216h4K18J37q4l08J25J05k57K4O6q8O9r9K17k6N0j53J55J28k08n3J8J60l11J01
$$ -84 134 271 187 -121 4 109 -148 -124 -58 -146 -77 -176 41 15 65 -88 67 195 -13 -66 -48 112 -199 -98
7240i8L14k74j25J09L35l56P1l3M0oj92K20m0j20O0O0Q4k85J14L41j31j00O4J33
$$ -98 216 -58 -183 -74 261 -95 -24 -57 -17 -23 -215 5 -35 -155 -95 -35 49 -236 -122 219 88 -12 52 185
7264A85j22k07L30j85k7m6j9L90k24j53J50p3j34j13L37O0k93J42R9j07j01R6
$$ 185 63 -144 186 1 -26 -72 -91 299 75 -78 72 -1 -135 -248 89 149 -144 -2 97 -10 -111 -15
7286a5R1m4p5k2O9O7r9J72n4r0R2L08k57l24N7L22j26k90K10mJ27k27k5N46l77
$$ -15 76 32 -43 -65 4 71 -28 144 90 0 92 400 143 -181 -124 198 72 -218 -8 -12 115 -112 -137 409 32
7311C2q4J93L7k12nK21j99k46P0K84R7j53j70K62j20j49J62Q0P5l13K20L4j13
$$ 32 -52 141 178 -34 -39 182 -17 -263 -193 91 188 35 -135 127 7 -142 20 100 175 -138 82 116 3
7334Cq6J64l0j47l1L60j69j70P2K67j59L4j0R4j42j77j45K86l3o5K0K65j64j38
$$ 3 -83 81 51 -96 -127 233 64 -106 -34 233 74 108 98 192 50 -127 -272 14 -19 -84 -64 201 37 -101
7358a01K09L9k28P9K29k05J0k88M21p6k95K55J91l45j51K24L03k85p3J43M0k44
$$ -101 108 147 -81 -2 227 22 32 -256 165 89 -206 49 240 -105 -256 -32 271 -14 -87 56 96 -148
7380a48J36Q2r4p9J3P7M8j85J29J53n9k95J72K11p9j03L0o4r6j7K79J36l26k3
$$ -148 -12 70 -24 -103 -90 -13 35 -150 -21 132 73 -222 -50 161 82 -21 9 -55 -151 -168 111 247 -79 -102
7404a02O9J41jj16N7J2j21j10L62k71p5L10k03M5j29K85M1k66K5J47J31j22j31
$$ -102 -33 108 107 -9 48 60 -61 -171 191 -80 -155 155 -48 -3 -132 153 194 -72 -47 100 231 109 -22
7427b2J61M1k41M5J4Q9k84K07Q1k8k25J91N7j86P1J52n8k11J64J03k27j40K61
$$ -22 139 180 -61 -16 -2 87 -197 10 91 63 -162 29 86 -100 -29 123 65 -146 18 121 -106 -246 15
7450A5J47j25k13J26K06o1k41J86J5j36k40L79L43m68k26M30j54j28J05J73o8
$$ 15 162 37 -176 -50 156 95 -146 40 55 -81 -321 58 401 -67 -293 137 -17 -145 -40 133 65
7471F5m4J9M4j29J06k14J70J4j46J83J34l98l4L18J02j32j08J91j26k32J54K58
$$ 65 21 40 84 -45 61 -153 17 31 -115 68 202 -196 -230 88 190 58 -50 141 15 -217 -63 195
7493A95k78l06L46O0k6k2j43K66q9j05K74j34l3j05K62j33r1m6Q2P3k31M6M24
$$ 195 -83 -389 -43 17 -9 -31 -174 92 3 -102 172 38 5 -100 162 29 -62 -108 -26 47 -184 -138 286
7516B86j14j00m5L1l0j08J59Q9k17p8J29n7o4K0K95j12j62O0K58K1m05J28J90
$$ 286 172 72 27 58 28 -80 79 168 -49 -127 2 -55 -119 -99 196 84 -78 -18 240 261 -144 -16 174
7539A74j62j30J74P2j26k51L79l6k55R8K13J8k86J57L5P2l26%K58l3k94L04P3
$$ 174 12 -118 56 128 2 -249 130 94 -161 -63 150 168 -118 39 74 146 -180 -180 78 45 -249 55 128
7562A28j17k37L37Oj25k5J17lj79n6K12q4j42L9L00k03j06J27P1m6r0L19J2l25
$$ 128 11 -226 111 117 -8 -33 84 81 -98 -154 58 -26 -168 -129 171 -32 -138 -11 60 14 -76 243 255 -70
7586g0r8J51R5k31j27J27L12l08p5L53oj90M1mJ43k47K07Q1j59o5M1N0j98R6K20
$$ -70 -168 -17 78 -153 -280 -153 159 -149 -224 129 123 -67 -26 -30 113 -134 73 154 -5 -70 -29 21 -177 -81 139
7611A39j25K5j17K34M6m18L12N6n5j90M0J53j20j37j11M32o9j14K48j42p6q3K86
$$ 139 14 39 -78 156 202 -216 96 152 97 -93 -53 100 -20 -157 -268 164 95 -19 229 87 11 -72 214
7634B14r2k97J90K02k38l23L17L5Q0o1O1M2n2j52K13p5k7k39K87P7l30J30n6J34
$$ 214 122 -175 15 217 -21 -344 -27 8 88 27 88 130 78 -74 139 64 37 -202 85 162 -168 -38 -94 40
7658D0j27O8M17l01q4j55L95p3l67K67k23R6j4m2J10j36M3J84j61O3j97L77N9
$$ 40 -87 -19 398 97 13 -142 253 180 -187 80 -143 -47 -61 -103 7 -129 -86 98 -63 0 -197 180 239
7681B39k91m2J41l1q0N3Q2j83J8J95j0j68n2J02J59j36j73J64k7j57m5J97K1k08
$$ 239 -52 -94 47 16 -64 -11 71 -112 -94 101 91 -77 -129 -27 132 -4 -177 -13 -40 -197 -242 -45 -24 -232
7705b32M46j03k35p3L16ok40J06J88p5j20k26L75j80j88K50J00q8q7J39M0k14
$$ -232 214 111 -124 -197 119 113 -127 -21 167 92 -28 -254 121 -59 -247 3 103 15 -72 67 107 -107
7727a07j36L01O5j78j94L49j31p0j03R4L13j00r0O1j4k0j33K57j66j22n6L34j58
$$ -107 -243 58 123 -55 -249 100 -31 -101 -204 -110 203 103 13 74 60 40 -93 164 -2 -124 -180 154 -4
7750dl16M48J5k59ML6L25k69K0O0J37l54J57L02l18o1Mj3No6J20P5rk25K69J41
$$ -4 -320 128 143 -116 -112 -76 249 -20 0 60 197 -157 0 302 -16 -77 -73 -86 -81 -147 -27 48 39 -186 83 224
7776B24k55J1J17j64k1j65K23L4j47J03l9O1l5L1L39k47l33J86K45j10j24M8O2
$$ 224 -31 -20 97 -67 -88 -253 -30 4 -143 -40 -79 -18 -53 -22 317 70 -263 -77 168 58 -66 -18 44
7799D4k27k8K88J9k62R8J97p5k18J63K34j41k50L2L3Q9j47P4K04k35J77N1J3j93
$$ 44 -183 -211 77 96 -166 -68 129 54 -164 -1 233 92 -158 -126 -93 -4 -151 -77 127 -108 69 120 133 -60
7823f0R5J55j85om3P2L5j78J41l8Jq7K38%q5p4J16L7j68r0L01r8j42j84L01j4
$$ -60 35 190 5 -1 -44 28 63 -115 26 -12 -11 -98 140 140 55 -19 97 134 -34 -124 177 79 -63 -247 54 40
7849D0j28L5J51j08k6KO9m4j54O1R0p9q7K68l6j42m3L40l60J02O4Kq2j79K28Q6
$$ 40 -88 -53 98 -10 -36 -34 35 -9 -163 -102 -12 -91 -178 90 54 -88 -131 209 -151 -49 15 17 -65 -244 -16 70
7875G0r1j58K28j59L5p1L87j68k8j90K01J10j70j75K84M1k79J37N3p1j13L6K20
$$ 70 -21 -179 49 -110 -75 -146 241 73 45 -145 56 166 -4 -179 105 146 -133 4 57 -14 -127 -91 129
7898A29r5K0P5J26k39oK86o4l81J42M9J6p0k46L46Lj94Q1K15j02k72K70n9o1j31
$$ 129 34 54 129 255 16 10 296 232 -149 -7 42 58 -12 -258 88 91 -103 -22 193 91 -181 89 30 -31 -162
7923a62J97j06O1k26K87J21k64K48K0J7j18n1K11j21k74P2J46k8j48N5K63k27
$$ -162 35 -71 -10 -236 51 172 -92 156 176 193 75 24 235 114 -160 -88 58 30 -118 -63 200 -27
7945b7JjK41j07M6Q6k08J5l0J49j40j49O6J24j24l5L1J08k01O9K94p0k19O5L6
$$ -27 -26 -27 214 107 153 239 31 46 16 165 25 -124 -58 66 -58 -93 -62 46 -155 -86 208 138 -81 -16 20
7970B0P0m07J44K55j40k35K49J86k06J27K4R5k14j1N5m0l7O0q2K96l79O1K40p7
$$ 20 90 -317 -173 82 -58 -293 -44 142 -64 63 87 182 -32 -43 12 -28 -65 -5 -87 209 -170 -109 131 54
7994E4j51J61P8r5j89J63J81j3m61K95J75m31j8K09r7Q3J6K48q1p2J0J44l28j08
$$ 54 -97 64 142 47 -142 21 202 189 -272 23 198 -233 -251 -42 -139 -56 -40 208 127 55 65 209 -119 -227
8018b27J28J61j4j21J15J48k16R8P5N4k19k07K20j22K43l02K82j03j17M2J48j15
$$ -227 -99 62 48 -73 42 190 -26 72 147 201 -18 -225 -5 -127 116 -186 96 -7 -124 -82 66 -49
8040d9p3J85o8K39m87J64K28J8m20K10Q6j82nK49k18r0O8K64kj33L2J61k67J19
$$ -49 -122 63 -5 234 -253 -89 139 157 -263 -53 33 -149 -154 95 -123 -213 -145 119 117 -16 16 177 -90 29
8064B9qL0j68j92K26R0l3j24K1K93k01J15n8J93k82L2J22m2j08rR7q3k29J86J43
$$ 29 21 51 -117 -309 -83 7 -26 -150 -129 164 -37 78 20 213 -69 -37 85 43 -65 -74 23 -60 -289 -103 40
8089D0j18p5R4J81j32K6R7j0q9j18J77j13k59K82L27j76k42K15L3j35m5Nl1k5
$$ 40 -78 -153 -59 122 -10 16 113 103 14 -104 73 -40 -299 -17 310 134 -108 107 140 5 -40 -35 -66 -91
8113i1m5K18r1o0M9J29j06l9k2J34L0j63J4P3ln7J47P0m81J5K98j24J42mL2J90
$$ -91 -136 82 -9 -69 -20 109 3 -36 -58 76 106 -57 -43 30 27 -30 117 187 -294 -279 19 -105 37 33 65 255
8139B55k14r1K2J38j81O8J58r8k56J38J14j04LJ48K9k09Q6K11j93p1M5O7J67l06
$$ 255 41 -50 -28 110 -71 -3 155 57 -199 -61 53 -51 -48 100 129 -80 6 217 24 -47 -2 65 232 -74
8163g4j65J63N1q7R2K50k6k54J88o7j0k14K33K2j54j26O5J03j44O7J42j33J15
$$ -74 -239 -76 -25 -112 -20 230 204 -50 138 71 61 -153 80 102 -52 -178 -113 -10 -154 -87 55 -78 37
8186C7n5J36L4k10K52
$$ 37 -18 118 152 -58 194
8191A94
$$ Imaginary data points
##PAGE= N=2
##DATA TABLE= (X++(I..I)), XYDATA
0@%%%%%%%%%qJ6j6J6j8K6l2M0m8N6p2Q8j04J20j36J57j83K10k42K79l14L54m04
$$ 0 0 0 0 0 0 0 0 0 0 -8 8 -8 8 -10 16 -16 24 -24 32 -40 48 -56 64 -72 85 -98 112 -130 149 -165 189 -215
32b15M58n14N76o47P22q00Q88r88J095j208J333j472J624j786J961k157K371k605
$$ -215 243 -271 305 -342 380 -420 468 -520 575 -633 700 -772 852 -934 1027 -1130 1241 -1364
50a364K866l157L479l841M253m722N260n888O631p522Q611r972J1721j4047J7276
$$ -1364 1502 -1655 1824 -2017 2236 -2486 2774 -3114 3517 -4005 4606 -5366 6355 -7692 9584
65I584k2020K9568m3155P4003k39254p5252N06639m71632M05329k78671J09528
$$ 9584 -12436 17132 -26023 47980 -191274 -266526 240113 -231519 173810 -104861 4667
76D667J44499l37707K52239j24387K72162l19465O5776K31620l64490L13859k96431
$$ 4667 149166 -188541 63698 -60689 211473 -107992 -42216 189404 -175086 138773 -157658
87a57658J95535m264k14206L42377k09411J48667k27299J28608R7889k58039L49728
$$ -157658 37877 33613 -180593 161784 -47627 101040 -126259 2349 100238 -157801 191927
98A91927k32325J30192j60777p4540K92181k54588J82429j64985J99495j05694
$$ 191927 -40398 89794 -70983 -145523 146658 -107930 74499 -90486 109009 3315
108C315k13396M25881l33688K29295j64782k9565L51651m58162K38534o8317J5470
$$ 3315 -210081 215800 -117888 111407 -53375 -82940 268711 -189451 49083 -19234 -3764
119c764k102j17338L13948k71115J33336j71814Q4427K09024l79585M00102j83811
$$ -3764 -5866 -123204 190744 -80371 52965 -118849 -34422 174602 -204983 195119 11308
130A1308n4374P9111j74640K85895k17080P2316k800J112J3740j54143K93722
$$ 11308 -43066 36045 -138595 147300 -69780 2536 -264 848 14588 -139555 154167
141A54167k27235O4089M3123n5261J76549k82228J73580m9001l8801L9253n8958
$$ 154167 -73068 -8979 34144 -21117 155432 -126796 46784 -2217 -41018 -1765 -60723
152f0723K43025l06399R0360L8956n7189J60177k18394K39448r5831r9891O5138
$$ -60723 182302 -124097 -33737 5219 -51970 108207 -110187 129261 33430 -66461 -1323
163a323k5763J51400k61267J79616k0462q0570J29727k19993K73693j53177o9375
$$ -1323 -27086 124314 -136953 42663 22201 -58369 71358 -148635 125058 -28119 -97494
174i7494K09334j17203Q0435j51202R9033j8036n8458R8444q3191J59443k30620
$$ -97494 111840 -5363 75072 -76130 22903 4867 -53591 44853 -38338 121105 -109515
185a09515M6037J39808j50742J33369q9684R6525n1146q5717J15286m5336N3876
$$ -109515 -63478 76330 -74412 58957 -30727 65798 14652 -71065 44221 -1115 52761
196E2761j49515J32481K2171j38776J19287r5807J02159r1975l742J57611j04774
$$ 52761 -96754 35727 57898 -80878 38409 -57398 44761 -47214 -50956 106655 1881
207A881K5177r8883J17872l3840q7175J65720j06899N1297j06355J5403J35962
$$ 1881 27058 -71825 46047 12207 -74968 90752 -16147 35150 -71205 -55802 80160
218H0160j40947P3012j0865M7794o5556l1005J31776j16027N2252o4012N9468
$$ 80160 -60787 12225 1360 49154 -16402 -47407 84369 -31658 20594 -43418 16050
229A6050O3082j74448J18330k7772k5618K742K3234R0060j03553J4437k6243O1763
$$ 16050 79132 -95316 23014 -4758 -30376 -27634 -4400 85660 -17893 -3456 -29699 32064
241C2064j8377p2784J54499j00038k9359P041J0249O1087j02355O2007J6417q47
$$ 32064 13687 -59097 95402 -4636 -33995 -26954 -16705 44382 -57973 4034 20451 19604
253A9604l7763m718J03439j21055J9649L8254Q546Q748r8838Q0429k3305l2426
$$ 19604 -18159 -22877 80562 -40493 -20844 17410 25956 34704 -64134 16295 -7010 -39436
265c9436K2920L7812M8697j26626M5743L1632k3723J5757l2519Q4179o5205n0311
$$ -39436 -16516 21296 69993 -56633 -10890 20742 -2981 12776 -19743 64436 -769 -51080
277e1080N3762R551r111o1570P6507P523m0468J3373j196M6263q3440J6629Q1846
$$ -51080 2682 12233 3122 -58448 18059 25582 -14886 -1513 -2709 43554 -39886 -23257 58589
290E8589l7289k4108k8631M2323k2385l2228N2592K5653j8352o9987N3802L1973
$$ 58589 21300 -2808 -31439 10884 -11501 -43729 8863 34516 16164 -53823 -21 31952
302C1952m6735J6460J1759K8632n6654k0140O4421k2712l8295l976O0564o538
$$ 31952 -14783 1677 13436 42068 -14586 -34726 29695 6983 -31312 -35288 25276 18738
314A8738m6976L1304J1652j2940l6939M1144N7765n6753l0167J9154J3609l2246
$$ 18738 -28238 3066 14718 1778 -35161 5983 63748 6995 -23172 -4018 9591 -22655
326b2655q079N8456m697m6782q454M5678J0257m7562K0726M1014k4030l2399J7783
$$ -22655 -30734 27722 23025 -23757 -32211 13467 23724 -23838 -3112 37902 13872 -18527 -744
339g44K8172l4437l9066M1475L5695l3908j9796K8088O813l8514O313N6063O377
$$ -744 27428 -7009 -46075 -4600 31095 -2813 -22609 5479 12292 -26222 -19909 36154 42531
352D2531n1338j4490M2827j8004l3415L2644K2069j6824m2629K3212M4315l7866
$$ 42531 -8807 -23297 19530 1526 -31889 755 22824 6000 -36629 -13417 30898 -6968
364f968k0711L8304K6381m1985o208L6371j5524k9000j7044N5266J2953n9934
$$ -6968 -27679 10625 37006 -4979 -11187 25184 9660 -19340 -36384 18882 31835 -28099
376b8099J7063K1512j6597k8385L8966M1139l7297j6538m469L9892k7754l8759
$$ -28099 -11036 10476 -6121 -34506 4460 45599 8302 -8236 -12705 27187 -567 -39326
388c9326O8602j6250l1731l452K8499J2370n1139K1898K1899J8882l7559n391
$$ -39326 29276 13026 -18705 -22157 6342 18712 -32427 -10529 11370 30252 -7307 -12698
400a2698O5136p4785o046L4019R631P036n9883L8560P626l2821M45L8847L3348
$$ -12698 52438 -22347 -28393 5626 15257 22293 -37590 970 8596 -24225 -23780 15067 48415
413D8415p6210K4280K3640j4838l847l2068O5115k5836m2318L2913J4410j2230
$$ 48415 -27795 -3515 20125 5287 1440 -30628 34487 8651 -33667 -754 13656 1426
425A426m9388N6478J0933j4020m56j2772M9415p2091N964N6483j9929j0190l3062
$$ 1426 -47962 8516 19449 5429 4973 -7799 41616 -30475 -24511 31972 12043 1853 -31209
438c1209N0664l2653j4166L1625k196L9517q7360N3351L7842p6861L9845j8892
$$ -31209 19455 -13198 -27364 4261 2065 41582 -45778 7573 45415 -31446 8399 -10493
450a0493L9478l2317k5553N4435k8745l487m8036Q2781L104p1551P3737m0120
$$ -10493 28985 -3332 -28885 25550 -3195 -6682 -54718 28063 31167 -40384 33353 -6767
462f767K1265l0232j1034Q3873n8056j2158n53L5058l6777k3379O8836m0649K5211
$$ -6767 14498 -15734 -26768 57105 -951 -13109 -13662 21396 -15381 -38760 30076 -10573 14638
475A4638l7568K5890M1183q1255M1908K948J5133l7511P076M7007q0260L9100
$$ 14638 -22930 2960 44143 -37112 4796 7744 22877 -14634 -7558 39449 -40811 -1711
487a711k8531M6981J3102q2951R5823m4486q522j242J9138M4265r0400N4766k6645
$$ -1711 -30242 16739 29841 -53110 42713 -1773 -10295 -11537 7601 51866 -38534 16232 -10413
500a0413K1623j4277o0825J30531r1217M077L9586k6315M4514q3818N7636J1211
$$ -10413 11210 -3067 -63892 66639 -24578 -20501 19085 -7230 37284 -46534 11102 22313
512B2313j6571q293j0920O4311j06908M5564K1378k0055L9583p7127P9545l1029
$$ 22313 5742 -2551 -13471 50840 -56068 -10504 10874 -9181 30402 -46725 32820 1791
524A791k8687L6968j681K8458q0154O9125j7680k5763K6224n0172R1476p9665
$$ 1791 -26896 10072 8391 36849 -43305 25820 8140 -17623 8601 -41571 49905 -29760
536b9760J1778M8652l8823K0334o5028R9830m3968j8131M9132o3277Q2617j12121
$$ -29760 -17982 30670 -8153 12181 -52847 46983 3015 -15116 34016 -29261 53356 -58765
548e8765M3527O8260q9403N0686m1736N7129m4036j2902N6241l9682N5948r8890
$$ -58765 -15238 53022 -36381 14305 -27431 29698 -14338 -27240 29001 -10681 45267 -53623
560e3623Q3750J0859j03562R7696o3631M7934k6279k3307P0786o2544J9784k9586
$$ -53623 30127 40986 -62576 35120 -28511 19423 -6856 -30163 40623 -21921 -2137 -31723
572c1723P1438l1846l5708Q0458p9598M9618n5011K8031M8730r1612O5472l9550
$$ -31723 39715 7869 -27839 52619 -26979 22639 -32372 -4341 44389 -47223 18249 -21301
584b1301M4760m5014q891R1156r8463O4107l9433K9505J8408r5934R3495m3637
$$ -21301 23459 -21555 -30446 60710 -37753 26354 -13079 16426 34834 -61100 32395 -11242
596a1242K1717l4298J9805N0986j11722Q9135m8557M7623M957q8334J34442r8304
$$ -11242 10475 -23823 -4018 46968 -64754 24381 -24176 23447 28404 -59930 74512 -23792
608b3792J2049J5894j2262M6654q7894P0587l1197J6793j6914k5984J02730j15520
$$ -23792 -11743 4151 -8111 38543 -49351 21236 -9961 6832 -10082 -36066 66664 -48856
620d8856O3594M228k8044M1660q5649Q8642l9598m545J2408j1489M2125j00470
$$ -48856 14738 18966 -9078 32582 -53067 35575 -4023 -8568 3840 -7649 34476 -65994
632f5994Q8390j8177j2914L0811n7908R3602q6781J9604K7529k1089L0746q7361
$$ -65994 22396 4219 -8695 22116 -35792 57810 -28971 -9367 18162 -2927 27819 -59542
644e9542J07763n6126j8964M2935n4935R2969r7576M5157L6499n3153K8882n3681
$$ -59542 48221 -7905 -26869 16066 -38869 54100 -43476 1681 38180 -14973 13909 -39772
656c9772R1411o9138O729L8502n9793P3205j06267P7984J8544p5041P4899n1611
$$ -39772 51639 -17499 -10770 27732 -32061 41144 -65123 12861 31405 -43636 31263 -20348
668b0348N2543m9583Q043M2266n0483L9557n9923P5998l9840m3082P7165o1469
$$ -20348 32195 -17388 -9345 32921 -17562 21995 -37928 38070 -1770 -44852 32313 -29156
680b9156N1086m7998L3383K9244o8748M6952l3854N9894n6655k567O4128q0766
$$ -29156 21930 -26068 7315 36559 -32189 14763 -19091 40803 -15852 -18419 45709 -35057
692c5057N0095n1954N1110P758o8873P7906m3768L7508m7858J8220N1296q6462
$$ -35057 15038 -36916 14194 21952 -46921 30985 -12783 24725 -23133 -4913 46383 -40079
704d0079O6399m3494L7455j3123n8187R0041o2653K6994j3936J7526K1289p3437
$$ -40079 26320 -17174 20281 7158 -51029 39012 -23641 3353 -10583 6943 28232 -45205
716d5205P2858l6771K6653j6429k4254P4960q8095L3026M098o54P661m4228O6209
$$ -45205 27653 -9118 17535 1106 -23148 51812 -36283 -3257 841 187 7848 -36380 29829
729B9829l8117J2214j5488J1739L9455q3521O8183j5341r293L248l7138O8415
$$ 29829 -8288 3926 -11562 177 39632 -43889 24294 8953 -340 2908 -34230 34185
741C4185n5517J4522Q819K211J0971o0019P7054l0480n180J3409k1995N0915p2048
$$ 34185 -21332 -6810 2009 4220 15191 -44828 32226 1746 -3434 9975 -12020 38895 -33153
754c3153L2224J2879k0295J0895l3961O6407m7199k412K6769j8772L0600n3052
$$ -33153 -929 11950 -8345 2550 -31411 34996 -12203 -14615 12154 -6618 23982 -29070
766b9070M8804O02l4899J4828j3789L8992n0707J9088K1849k5805J5754l5720
$$ -29070 19734 20336 -14563 265 -13524 25468 -25239 -6151 15698 -10107 5647 -30073
778c0073N7136k0951k5280L7323j7782J6910l9907K6784J1931l2478J4220j1171
$$ -30073 27063 6112 -19168 18155 373 17283 -22624 4160 16091 -16387 -2167 -13338
790a3338L8608m1629q55L7748k9580J8171k3666L4506k498m0634L0964q086J1250
$$ -13338 25270 -16359 -17214 20534 -9046 9125 -14541 19965 17467 -23167 7797 -289 10961
803A0961l0460J6164K2930l7922J4995o519K7655j8891j7393M1693k0051j9j4852
$$ 10961 -19499 -3335 19595 -18327 -3332 -9851 17804 -1087 -18480 23213 3162 3143 -11709
816a1709K1795L516l7639K7360j920N728k1883J507L3131k9743N552O397J5878
$$ -11709 10086 13602 -24037 3323 1403 7131 -14752 -13245 19886 -9857 -4305 2092 17970
829A7970j4199k1971L2992j1105m760j0518J3934J2400l7701J8273J0110j302
$$ 17970 3771 -18200 14792 3687 -1073 -11591 2343 14743 -22958 -4685 5425 4123
841D123j1630j429L1323k1149p860Q616R734q723k1765K6950o01j3956p004J1078
$$ 4123 -7507 -8936 22387 1238 -6622 1994 11728 3005 -18760 8190 7589 -6367 -13371 -2293
855b293J5804k8393R729J9194o736j1281l580K3075r744j6973R274J2503j0066
$$ -2293 13511 -14882 -5153 14041 7305 -3976 -7556 15519 5775 -11198 -1924 10579 513
868E13k0085K0303P748j5682k192J1914J2715j7989n927K0086r48j8848J654J9242
$$ 513 -19572 731 8479 -7203 -9395 2519 15234 -2755 -8682 11404 10456 -8392 -6738 12504
882A2504q171j7980O724J2704n153j3873J1241J6983j4525j1921J8320P191j7012
$$ 12504 4333 -13647 -6923 5781 628 -13245 -2004 14979 454 -11467 6853 14044 -2968
895b968m714J4571K190j7167l406J5869K234k2024P336K2142j2522q377O083J3202
$$ -2968 -7682 6889 9079 -8088 -11494 4375 6609 -15415 -8079 14063 1541 -6836 -753 12449
909A2449o556j7835J6631Q220j5442j1497J4906Q056k2388O446J0591M080j1194
$$ 12449 5893 -11942 4689 12909 -2533 -14030 876 8932 -13456 -7010 3581 7661 -3533
922c533q492K9560j1261j5045J0361P787l228k1131J5372N744j0833o358N307
$$ -3533 -12025 17535 6274 -8771 1590 9377 6149 -14982 390 6134 -4699 -11057 -5750
935e750K3267k6397o51K1787p235m649q630K0750l656j8685M638R247M062k8842
$$ -5750 17517 -8880 -9531 12256 5021 372 -8258 12492 8836 -9849 -5211 4036 8098 -20744
949b0744J8739J4212j9568L887r06J9191j3180j2869K0260J268j0153j4863K5734
$$ -20744 -2005 12207 -7361 -3474 -4380 14811 1631 -11238 9022 10290 137 -14726 11008
962A1008o549j9127J3990k985J4279k2292L554K4944j9380r1O62J9130j7536j1487
$$ 11008 4459 -14668 -678 -3663 10616 -11676 -8122 16822 -2558 -2649 -1987 17143 -393 -11880
976a1880K2826j3510O194j9808J6305J5094l5636K0376L670M272j3762j844K8647
$$ -11880 10946 -2564 3630 -16178 127 15221 -20415 -39 3631 7903 -5859 -7703 20944
989B0944k3350K133n982J5878r41l4876L5297n785q809j947K121K2146k5804N971
$$ 20944 -2406 -273 -6255 9623 8682 -26194 9103 3318 -5491 -7438 -5317 16829 -8975 -3004
1003c004Q269P227j3232j2689L2746k3394j544K254J669J0823k8454K1556L856
$$ -3004 5265 12492 -740 -13429 19317 -4077 -5621 -3367 -1698 9125 -19329 2227 6083
1016F083o683n253N409K0508l2705J5826J851k732K047k6031L8566j8391j2634
$$ 6083 -600 -5853 -444 20064 -12641 3185 5036 2304 4351 -21680 16886 -1505 -14139
1029a4139J4055j2J3140l4232K8580M066j4210P130j8418M0530l2460j0853L0426
$$ -14139 -84 -96 13044 -21188 7392 11458 -2752 4378 -14040 26490 -5970 -16823 13603
1042A3603j8078P962k2208K4345L054k0187J3286n703K3688l2175Q221K3888k8552
$$ 13603 -4475 3487 -18721 5624 8678 -11509 1777 -3926 19762 -12413 -4192 19696 -8856
1055h856J3014j2382J6085p446j4749J9109o078N215k0504K7163j127k3953K5150
$$ -8856 4158 -8224 7861 415 -14334 4775 -1303 3912 -16592 10571 9444 -14509 10641
1068A0641j3667J8037k3088L09K6349k8714Q829j2590K8374j4757k2321L9762
$$ 10641 -3026 15011 -8077 -7768 18581 -10133 -1304 -13894 14480 -277 -22598 17164
1080A7164k3751J7563k2024Q659L0604m6602K2986n692R703j0785j8268L9347
$$ 17164 -6587 10976 -11048 -2389 28215 -18387 4599 -1093 8610 -2175 -20443 18904
1092A8904k9929J2797j0706R055J9167m3871L8431q591n375L226j0777K5332l0234
$$ 18904 -11025 1772 -8934 121 19288 -24583 13848 5257 -118 3108 -7669 17663 -12571
1105a2571J0570M93M558l171j9652L9755k7212L855N175J21J5122l6131K9826
$$ -12571 -2001 -1508 3050 -121 -19773 19982 -7230 -3375 1800 1921 17043 -19088 10738
1118A0738n978l920o363p492L8451m6449J8680N827o719J5614l8553M5695j4402
$$ 10738 4760 840 -5523 -13015 25436 -21013 -2333 3494 -3225 12389 -26164 19531 5129
1131E129j1038J0311r870K8803m7055K7557M034j8260K0216l3755M3843k4157
$$ 5129 -5909 4402 -5468 23335 -23720 3837 7871 -10389 9827 -23928 19915 -4242
1143d242j1045K9695j9588J7864k7278K5735k498k0143J8898j8517K8896l3539
$$ -4242 -15287 14408 -5180 12684 -14594 11141 8643 -11500 7398 -11119 17777 -15762
1155a5762Q581K3110k9577J7660j6691K8374j4605j2236K4676j6996J7528l4287
$$ -15762 -7181 15929 -13648 4012 -12679 15695 1090 -11146 13530 -3466 14062 -20225
1167b0225K7597O440l3321K7711k0764K7464k5419k714L2414k9286K1119k5307
$$ -20225 7372 13812 -19509 8202 -12562 14902 -10517 -13231 19183 -10103 11016 -14291
1179a4291K9482n289l1800M0614k9070K1737k1409Q30K9839m2174K5995j0993
$$ -14291 15191 9902 -21898 18716 -10354 11383 -10026 -9196 20643 -21531 4464 -6529
1191f529J5861p413j7071L8618l2991J6165j3355Q785J4815m1610L6824j5444
$$ -6529 9332 1919 -15152 23466 -9525 6640 -6715 2070 16885 -24725 12099 -3345
1203c345L893o632m902L1748l6730K1859o917Q354O22k9614M3904k7180M186j760
$$ -3345 548 -6084 -10986 20762 -15968 5891 -1026 7328 7950 -21664 22240 -4940 -754 -2514
1217b514j034J8699l9488L1224q741N094k580j5618M2667m2114J5502L834o783
$$ -2514 -3548 15151 -24337 6887 -1854 3240 660 -14958 27709 -14405 1097 4931 -1852
1230a852J6054l6898L7830j6066o422O192q352K8999l9745K5798K237j1735J2064
$$ -1852 14202 -22696 15134 -932 -7354 -1162 -9514 19485 -20260 5538 7775 -3960 8104
1243H104k4946L8876k6671j995J4674j3437J5862l3199L1150m259j4476J5879
$$ 8104 -16842 22034 -4637 -6632 8042 -5395 10467 -22732 8418 4159 -10317 5562
1255E562j4637K8358l1899J0020J5576j7823J2735k2468L1341j8869j1336K0309
$$ 5562 -9075 19283 -12616 -2596 12980 -4843 7892 -14576 16765 -2104 -13440 6869
1267F869j5707K1402l0172K1757Q693k5536J9610j4569K4199k1598j793K1002
$$ 6869 -8838 12564 -17608 4149 12842 -12694 6916 -7653 16546 -5052 -6845 14157
1279A4157k1252J2266k2058K6388n909k0393K7800j7774J7698k1280P824K0044
$$ 14157 -7095 5171 -16887 9501 3592 -16801 10999 -6775 10923 -10357 -2533 17511
1291A7511k8311J7079j0630J5935j4390j1751K6940k0403J1682j4372J5252N777
$$ 17511 -10800 6279 -4351 11584 -2806 -14557 12383 -8020 3662 -10710 4542 10319
1303A0319k7820K6061j0149J0115j2181j257K3088k9262J1849n935R798k754j8305
$$ 10319 -17501 8560 -1589 8526 -3655 -4912 18176 -11086 763 -5172 4626 1872 -16433
1316a6433K8754j5325L220o486P468J2533k7037K1256n936L037p538r495K7037
$$ -16433 12321 -3004 216 -6270 1198 13731 -13306 7950 2014 5051 -2487 -11982 15055
1329A5055k3845N747K299K676K773k0719K5114o951j751j259J089J4770k7398
$$ 15055 -8790 -3043 -744 1932 4705 -16014 9100 2149 398 -861 228 14998 -12400
1342a2400J3061J733k511q33j0973K5144j7442k439P510N4O627j8473J9199j285
$$ -12400 661 2394 -117 -950 -11923 13221 -4221 -6660 850 904 7531 -10942 8257 6972
1356F972r120j94j410J5162k1396O824Q170o210Q58j1453K1003p337q002J0290
$$ 6972 -2148 -2342 -3752 11410 -9986 -3162 5008 -1202 -344 -11797 9206 1869 -6133 4157
1370D157n24M079j7410J1511M846j1157K092j084J2584j5321j863J2611m299O39
$$ 4157 3633 7712 -9698 1813 6659 -4498 -2406 -3490 9094 -6227 -8090 4521 222 861
1384H61p310J6036l674j3088Q700q3L802j2786N584J0209j2633j026J987R588
$$ 861 -6449 9587 5913 -7175 1525 1442 5244 -7542 -1958 8251 -4382 -5408 -3421 6167
1398F167q285l930J3335k845l551o517R976J943j3634P002M067j745q883J376
$$ 6167 -2118 -6048 7287 4442 891 -5626 4350 6293 -7341 -339 3728 1983 -6900 -5524
1412e524J0830o562l790O118P462p964o243R367J048n669m076Q147K574j2620
$$ -5524 5306 -1256 -5046 1072 8534 570 -5673 3694 4742 -927 -5003 3144 5718 -6902
1426f902J056Q159m90p438L014J0249m614o859L011O796m279p747Q122M381r353
$$ -6902 -5846 2313 1823 -5615 -2601 7648 3034 -3825 -814 5982 1703 -6044 2078 6459 -2894
1441b894l642N639L890o919j068J0788j176p050m25P739L1j1449P974M809p250
$$ -2894 -6536 -897 2993 -3926 -4994 5794 4618 -2432 -2857 4882 4913 -6536 1438 6247 -1003
1456a003l426Q2R268p819m743J1745N72m685o007J0546J336j0850N190L480K329
$$ -1003 -4429 -4347 4921 -2898 -7641 4104 4676 -9 -6016 4530 5866 -4984 206 3686 6015
1471F015j1404j146J2463q218l163L542P906l772q999Q936K387l520n477P830
$$ 6015 -5389 -6535 5928 -2290 -5453 -1911 5995 2223 -6776 2160 4547 1027 -4450 3380
1485C380M384j2091J039K999K808q339J076J1154o320j647k292R769l455r895
$$ 3380 7764 -4327 -3288 -289 2519 -5820 -4744 6410 90 -1557 -3849 5920 2465 -7430
1499g430J4251l583r44p716L458R046j6460P350K965L449n982p145J8595j1001
$$ -7430 6821 3238 2294 -5422 -1964 7082 -9378 -2028 937 4386 -1596 -8741 9854 -1147
1513a147q61K381L350N731j9748J1431K621p194m84p11J4163j3382p83O537R4
$$ -1147 -2008 373 3723 9454 -10294 1137 3758 -3436 -3920 -4631 9532 -3850 -4633 1904 1998
1528A998J80r213J5522l707p862K009Q84M355j3103Q790L518l777j765l120J4164
$$ 1998 2178 -7035 8487 4780 -3082 -1073 -189 4166 -8937 -147 3371 -406 -2171 -5291 8873
1543H873j3464J727Q220k345J378j3094J5210n558p817O823j957J1087j9227Q024
$$ 8873 -4591 -2864 5356 3011 4389 -8705 6505 947 -6870 -47 -2004 9083 -10144 -2120
1557b120R136j2187P123p384J6639q641j0218J3917p754M355j2245J0825O224
$$ -2120 7016 -5171 1952 -5432 11207 2566 -7652 6265 -1489 2866 -9379 1446 7670
1570G670j5891Q961m353R239r347j875J6399j1080K475o002Q189k094j1445J3249
$$ 7670 -8221 740 -3613 5626 -3721 -5596 10803 -277 2198 -3804 4385 2291 -9154 4095
1584D095m243K904r512M947P905j4121R620j615P680p836n271J5175j3847M027
$$ 4095 -148 2756 -6756 -1809 6096 -8025 1595 -20 7660 -176 -5447 9728 -4119 -92
1598i2m379Q193J640j7408J6831o561J913m625J491J6459j9238P516q01K345j647
$$ -92 -4471 3722 5362 -12046 4785 -1776 137 -4488 -2997 13462 -5776 1740 939 3284 1637
1613A637j3071K2296j1882j583L21r42J0971j9757J3954K837l374K17o938J6130
$$ 1637 -11434 10862 -1020 -2603 -2282 -3224 7747 -12010 1944 4781 1407 1624 -5314 10816
$$ [...]
8191B9
##END NTUPLES=NMR FID
##END=
