##TITLE=1H_LR-756-R2-RM2
 CCl4
 8 sc, 
 20.1.2023
##JCAMPDX= 6.0         $$ Bruker NMR JCAMP-DX V2.0
##DATA TYPE= NMR FID
##DATA CLASS= NTUPLES
##ORIGIN= UXNMR, Bruker Analytische Messtechnik GmbH
##OWNER= root
$$ XWIN-NMR		Version 3.5
$$ Mon Jan 23 14:15:30 2023 Russian Standard Time (UT+4h)  she@DPX200
##.OBSERVE FREQUENCY= 200.13135
##.OBSERVE NUCLEUS= ^1H
##.DELAY= (6, 6)
##.ACQUISITION MODE= SIMULTANEOUS
##.ACQUISITION SCHEME= undefined
##.AVERAGES= 8
##.DIGITISER RES= 18
##SPECTROMETER/DATA SYSTEM= spect
##.PULSE SEQUENCE= zg30
##.SOLVENT NAME= D2O
##.SHIFT REFERENCE= (INTERNAL, D2O, 0, 15.7039)
##AUDIT TRAIL= $$ (NUMBER, WHEN, WHO, WHERE, WHAT)
$$ ##TITLE= Audit trail, XWIN-NMR		Version 3.5
$$ ##JCAMPDX= 5.01
$$ ##ORIGIN= Bruker BioSpin GmbH
$$ ##OWNER= she
$$ F:/spectra/data/she/nmr/H-F/1/audita.txt
$$ ##AUDIT TRAIL=  $$ (NUMBER, WHEN, WHO, WHERE, WHAT)
(   1,<2023-01-23 14:14:21.64 +0400>,<she>,<DPX200>,
      <created by zg, POWCHK disabled, PULCHK disabled
       configuration hash MD5:
       00 E9 B6 7A A2 85 ED C7 34 08 36 98 17 FE 4E 26
       data hash MD5: 16K
       52 CF AD 4B EA 7C 0D 35 3E D2 9D 64 15 76 CD 16>)
$$ ##END=
$$ 
$$ hash MD5
$$ 71 05 96 B0 55 8F 20 2D 11 E0 04 95 70 0B 62 D4
##$RELAX= 
##$RELAX= 
##$RELAX= 
##$RELAX= 
##$RELAX= 
##$RELAX= 
$$ Bruker specific parameters
$$ --------------------------
##$DU= <F:/spectra>
##$EXPNO= 1
##$NAME= <H-F>
##$PROCNO= 1
##$TYPE= <nmr>
##$USER= <she>
##$AMP= (0..31)
100 100 100 100 100 100 100 100 100 100 100 100 100 100 100 100 100 100 
100 100 100 100 100 100 100 100 100 100 100 100 100 100 
##$AQSEQ= 0
##$AQ_mod= 1
##$AUNM= <au_zg>
##$AUTOPOS= <>
##$BF1= 200.13
##$BF2= 200.13
##$BF3= 200.13
##$BF4= 200.13
##$BF5= 200.13
##$BF6= 200.13
##$BF7= 200.13
##$BF8= 200.13
##$BYTORDA= 1
##$CFDGTYP= 0
##$CFRGTYP= 5
##$CHEMSTR= <none>
##$CNST= (0..31)
1 1 145 1 1 1 1 1 1 1 1 1 1 1 1 1 1 1 1 1 1 1 1 1 1 1 1 1 1 1 1 1 
##$CPDPRG= <>
##$CPDPRG1= <>
##$CPDPRG2= <>
##$CPDPRG3= <>
##$CPDPRG4= <mlev>
##$CPDPRG5= <mlev>
##$CPDPRG6= <mlev>
##$CPDPRG7= <mlev>
##$CPDPRG8= <mlev>
##$CPDPRGB= <>
##$CPDPRGT= <>
##$D= (0..31)
0 1.2 0 0 0 0 0 0 0 0.06 0 0.03 0 0 0 0 0.0002 0 0 0 0 0 0 0 0 0 0 0 0 
0 0 0 
##$DATE= 1674468860
##$DBL= (0..7)
120 120 120 120 120 120 120 120 
##$DBP= (0..7)
150 150 150 150 150 150 150 150 
##$DBP07= 0
##$DBPNAM0= <>
##$DBPNAM1= <>
##$DBPNAM2= <>
##$DBPNAM3= <>
##$DBPNAM4= <>
##$DBPNAM5= <>
##$DBPNAM6= <>
##$DBPNAM7= <>
##$DBPOAL= (0..7)
0.5 0.5 0.5 0.5 0.5 0.5 0.5 0.5 
##$DBPOFFS= (0..7)
0 0 0 0 0 0 0 0 
##$DE= 6
##$DECBNUC= <off>
##$DECIM= 32
##$DECNUC= <off>
##$DECSTAT= 4
##$DIGMOD= 1
##$DIGTYP= 9
##$DL= (0..7)
0 120 120 120 120 120 120 120 
##$DP= (0..7)
150 150 150 150 150 150 150 150 
##$DP07= 0
##$DPNAME0= <>
##$DPNAME1= <>
##$DPNAME2= <>
##$DPNAME3= <>
##$DPNAME4= <>
##$DPNAME5= <>
##$DPNAME6= <>
##$DPNAME7= <>
##$DPOAL= (0..7)
0.5 0.5 0.5 0.5 0.5 0.5 0.5 0.5 
##$DPOFFS= (0..7)
0 0 0 0 0 0 0 0 
##$DQDMODE= 0
##$DR= 18
##$DS= 0
##$DSLIST= <SSSSSSSSSSSSSSS>
$$ [...]
##$SUBNAM2= <"">
##$SUBNAM3= <"">
##$SUBNAM4= <"">
##$SUBNAM5= <"">
##$SUBNAM6= <"">
##$SUBNAM7= <"">
##$SUBNAM8= <"">
##$SUBNAM9= <"">
##$SW= 18.05172834244
##$SWIBOX= (0..15)
0 0 2 0 0 0 0 0 0 0 0 0 0 0 0 0 
##$SW_h= 3612.71676300578
##$TD= 16384
##$TD0= 1
##$TE= 0
##$TE2= 300
##$TE3= 300
##$TEG= 300
##$TL= (0..7)
0 120 120 120 120 120 120 120 
##$TP= (0..7)
150 150 150 150 150 150 150 150 
##$TP07= 0
##$TPNAME0= <>
##$TPNAME1= <>
##$TPNAME2= <>
##$TPNAME3= <>
##$TPNAME4= <>
##$TPNAME5= <>
##$TPNAME6= <>
##$TPNAME7= <>
##$TPOAL= (0..7)
0.5 0.5 0.5 0.5 0.5 0.5 0.5 0.5 
##$TPOFFS= (0..7)
0 0 0 0 0 0 0 0 
##$TUNHIN= 0
##$TUNHOUT= 0
##$TUNXOUT= 0
##$USERA1= <user>
##$USERA2= <user>
##$USERA3= <user>
##$USERA4= <user>
##$USERA5= <user>
##$V9= 5
##$VALIST= <valist>
##$VCLIST= <CCCCCCCCCCCCCCC>
##$VD= 0
##$VDLIST= <DDDDDDDDDDDDDDD>
##$VPLIST= <PPPPPPPPPPPPPPP>
##$VTLIST= <TTTTTTTTTTTTTTT>
##$WBST= 1024
##$WBSW= 4
##$XGAIN= (0..3)
0 0 0 0 
##$XL= 0
##$YL= 0
##$YMAX_a= 691101
##$YMIN_a= -742615
##$ZGOPTNS= <>
##$ZL1= 120
##$ZL2= 120
##$ZL3= 120
##$ZL4= 120
##$ABSF1= 10
##$ABSF2= 0
##$ABSG= 5
##$ABSL= 3
##$ALPHA= 0
##$AQORDER= 0
##$ASSFAC= 0
##$ASSFACI= 0
##$ASSFACX= 0
##$ASSWID= 0
##$AUNMP= <proc_1d>
##$AZFE= 0.1
##$AZFW= 0.1
##$BCFW= 1
##$BC_mod= 2
##$BYTORDP= 1
##$COROFFS= 0
##$CY= 11.3945322036743
##$DATMOD= 1
##$DC= 2
##$DFILT= <>
##$DTYPP= 0
##$F1P= 2.36226072786647
##$F2P= -0.459571619588291
##$FCOR= 0.5
##$FTSIZE= 0
##$FT_mod= 4
##$GAMMA= 1
##$GB= 0.15
##$INTBC= 1
##$INTSCL= 1
##$ISEN= 128
##$LB= 0.24
##$LEV0= 0
##$LPBIN= 0
##$MAXI= 10000
##$MC2= 0
##$MEAN= 0
##$ME_mod= 0
##$MI= 1.114404
##$NCOEF= 0
##$NC_proc= 0
##$NLEV= 6
##$NOISF1= 3.799351
##$NOISF2= 2.8
##$NSP= 1
##$NTH_PI= 0
##$NZP= 0
##$OFFSET= 15.70392
##$PC= 1
##$PHC0= -19108.61
##$PHC1= 9.400789
##$PH_mod= 1
##$PKNL= yes
##$PPARMOD= 0
##$PSCAL= 0
##$PSIGN= 0
##$REVERSE= no
##$SF= 200.130013532006
##$SI= 16384
##$SIGF1= 3
##$SIGF2= 2
##$SINO= 400
##$SIOLD= 16384
##$SREGLST= <1H.CDCl3>
##$SSB= 0
##$STSI= 0
##$STSR= 0
##$SW_p= 3612.71676300578
##$SYMM= 0
##$S_DEV= 0
##$TDeff= 0
##$TDoff= 0
##$TI= <>
##$TILT= no
##$TM1= 0
##$TM2= 0
##$TOPLEV= 0
##$USERP1= <user>
##$USERP2= <user>
##$USERP3= <user>
##$USERP4= <user>
##$USERP5= <user>
##$WDW= 1
##$XDIM= 8192
##$YMAX_p= 0
##$YMIN_p= 0
$$ End of Bruker specific parameters
$$ ---------------------------------
##NTUPLES= NMR FID
##VAR_NAME=  TIME,          FID/REAL,        FID/IMAG
##SYMBOL=    X,             R,               I
##VAR_TYPE=  INDEPENDENT,   DEPENDENT,       DEPENDENT
##VAR_FORM=  AFFN,          ASDF,            ASDF
##VAR_DIM=   8192,          8192,            8192
##UNITS=     SECONDS,       ARBITRARY UNITS, ARBITRARY UNITS
##FACTOR=    0.0002768,     1,               1
##FIRST=     0,             0,               0
##LAST=      2.2672688,     0,               0
##MIN=       0,             -742615,         0
##MAX=       2.2672688,     691101,          0
$$ Real data points
##PAGE= N=1
##DATA TABLE= (X++(R..R)), XYDATA
$$ [...]
2386c192L253L110o385J110N298j968k794R59L876k157m134K969K843l979k004
2401c195M139L40k470j155L540J613n078J592L386j869j964n14L870j357m198
2416c320K458L330l387j679L414J961l133k165M792R70n967J640L693k127l648
2431c168J401N206l579l690N093K347m995n46M434jm269m73N380k052n395M430
2447A23J744k301k091K449L558m097j516M406j19l532R7K012M44l417k59M751
2463B252j895k967K365K289p48l233J922L517m248k196M338K47l483q13M015R67
2479B329n577J702N703l497l501L664K288l197l491M946J860o865J205M616j285
2494I00l565J314M886k414l864L485K626m086j697L170Q28k718j554L555J069
$$ plain form
2386 -3192 61 3171 -3214 -2104 3194 1226 -1568 -609 3267 1110 -3024 -55 2788 -1191 -3195
2401 -3195 944 1284 -1186 -2341 1199 2812 -2266 -674 2712 843 -1121 -1635 2235 878 -3320
2416 -3320 -862 2468 -919 -2598 816 2777 -356 -2521 2271 3241 -2726 -1086 2607 480 -3168
2431 -3168 -1767 3439 -140 -3830 1263 3610 -1385 -1931 2503 2502 -1767 -2240 3140 1088 -4307 123
2447 123 1867 -434 -2525 -76 3482 -615 -2131 2275 2156 -1376 -1279 733 1177 -2240 -2499 2252
2463 2252 357 -2610 -245 2044 1296 -1937 -15 3502 -746 -2942 1396 1643 -1840 -2653 1362 2329
2479 2329 -3248 -1546 4157 660 -2841 823 3111 -86 -3577 1369 3229 -3636 -2431 2185 900
2494 900 -2665 -1351 3535 1121 -2743 742 3368 -718 -2415 755 1583 -1135 -2689 866 1935
2509A935m186Q49L592r77k438K38L842j855l983K965J927k918j645K954K195l740
2525a245j604N563l80m723J328M386j683n131K518M652m672l042N133J897m902
2540a905r65N416J49n130Q98N014k315m458K539L159k800l035L015L361m337j130
2556b524M552N4k856j099M129j95m766J686L082k067k703K004L286l022k336M018
2572A243J786m262r93M880o38m384P45M310j832m782L004M265l807k651L863K796
2588C543m208k395N333M17n029%M470q37m578J716M628k857k937L509K116k930
2604c9k292L785J414m660m90M008r04l715J352M143k053l258K907L256l411k454
2620b411L733J719m551j013M264J79n015P82M933j692l964K861L496k540m118
$$ plain form
2509 1935 -2251 -1402 2190 1213 -1225 -987 2855 1000 -2983 -18 1909 -1009 -2654 300 2495 -1245
2525 -1245 -2849 2714 2334 -2389 -1061 3325 1642 -3489 -971 3681 -991 -4033 1100 2997 -1905
2540 -1905 -2870 2546 2695 -2435 -1537 3477 1162 -3296 -757 2402 -398 -3433 -418 2943 -1394 -2524
2556 -2524 2028 2082 -774 -1873 2256 2061 -2705 -1019 2063 -4 -2707 -703 2583 -439 -2775 1243
2572 1243 3029 -1233 -2226 2654 2016 -2368 -1623 2687 855 -3927 -923 3342 -465 -3116 747 3543
2588 3543 -665 -3060 2273 2690 -2339 -2339 2131 1294 -3284 -1568 3060 203 -2734 775 2891 -39
2604 -39 -2331 1454 2868 -1792 -2282 1726 822 -2893 -1541 2602 549 -2709 198 3454 43 -2411
2620 -2411 1322 3041 -1510 -2523 1741 1920 -3095 -2313 2620 928 -3036 -175 3321 781 -3337
2635c337M178K442m541j695L825J329m484l32M806o20l979J612M163k544l521
2650b698K979K913l722k692M230J117m332j9M068J25m583J321M366k045l274K080
2666a66L842l968k769L723J184l062j887M884K62m401J637K837J58m809J941M309
2682C715l972k385K456K749l613k518N016N71l696m70M718n47m596J846L380j964
2698F90l858K760L282m126j586L622J583l905o54M382Ql918M11M408k378l743
2714c022L003J731j756l198L583K347m186J37K667J359m388K7M211j891k707O22
2730a461L824k118l467L726J612k315k336L782K019n210Q94K769j75l541Q6M473
2746B562k503k787K312K966k598k373L780J319l415j344L660L28m870J394L227
$$ plain form
2635 -3337 841 3283 -1258 -2953 872 2201 -2283 -2615 2191 1571 -2408 -796 3367 823 -2698
2650 -2698 281 3194 -528 -3220 1010 2127 -2205 -2224 1844 1969 -2614 -1293 3073 1028 -2246 -166
2666 -166 3676 -292 -3061 662 1846 -1216 -3103 1781 2043 -2358 -721 2116 2274 -2535 -594 3715
2682 3715 -257 -2642 -186 2563 -1050 -3568 1448 2019 -1677 -2147 2571 2024 -2572 -726 2654 690
2698 690 -3168 -408 2874 -1252 -2838 784 2367 -1538 -2192 2190 2198 -1720 -1309 3099 721 -3022
2714 -3022 -19 1712 -44 -3242 341 2688 -1498 -1361 1306 2665 -1723 -1696 2515 624 -2083 -1461
2730 -1461 2363 245 -3222 504 2116 -199 -2535 1247 3266 -1944 -1050 1719 1544 -1997 -1911 2562
2746 2562 59 -2728 -416 2550 -48 -2421 1359 2678 -737 -2081 1579 1907 -2963 -1569 1658
2761A658j077k927J681L201k843j557K556J944l499j014L578j21l185l24L290
2776A361l73l697K104K422j489k579K143L133l215j837K844J441l605r96L651
2791A308J69l675P58L519q49l686K668K387k879j650K310J701l366r36M047q73
2807I53l149Q03L226q64l249K257K602k604k047K643J352k718j307K801R52l292
2823a641j07L632j075k155Q75K446p62l140K050K019k521j857K377J581l235l19
2839a832K734P32l173L15L888k089k256J564J966j669k945L603R54l014l95K829
2855A212N37l496J023K741j221k249R62K756k689j292J570J011j311j658K997
2870H93M45k413O45J787K25k583L22K162q61k345J133K195k233q38J762J235j319
$$ plain form
2761 1658 581 -2346 -665 2536 -307 -1864 692 2636 -863 -1877 1701 1580 -1605 -1929 1361
2776 1361 988 -2709 -605 1817 328 -2251 -108 3025 -190 -2027 817 2258 -1347 -2343 1308
2791 1308 1477 -2198 -1440 2079 1230 -2456 212 2599 -280 -1930 380 2081 -1285 -2221 1826 953
2807 953 -2196 -1393 1833 969 -2280 -23 2579 -25 -2072 571 1923 -795 -2102 699 1651 -1641
2823 -1641 -1748 1884 809 -1346 -471 1975 1213 -1927 123 2142 -379 -2236 141 1722 -1513 -1832
2839 -1832 902 1634 -1539 -1224 2664 575 -1681 -117 1849 180 -2765 838 1792 -1222 -1617 1212
2855 1212 1749 -1747 -724 2017 796 -1453 -491 2265 -424 -1716 -146 865 -446 -2104 893
2870 893 1338 -1075 -430 1357 1582 -1001 -679 1483 622 -1723 -590 1605 -628 -1466 296 1531 212
2887B12k212L614J44l151Q70J724l38k963Q13L164k236j584K054J726k415o36
2903a214K367O74k633r34L684j721j893J539R73j56k478J793K195k811j70J694
2919I09M46j945p17J908L81k327k0K900j579r44R18J105K6k957K439J731l179
2936i05k93J700N62k104m71K698n74k513J365K448j832j231J528J360j709k033
2952b004K897O64l015K26K054m47j635M82K370j107j733J749J088j800o82Q31
2968f2R96j625r77K668n54j635O32J510J10j774M74J906j189j633J033J190j653
2985e83q24J757Q46j755o70K602n0k398R65J291n47j886P88K039k306j096K318
3002D91K90j259r12K089J025l178J082J844j082j029N0J459j124j334J892L78
$$ plain form
2887 212 -2000 1614 1758 -1393 -523 1201 863 -2100 -1287 1877 -359 -1943 111 1837 -578 -1214
2903 -1214 1153 1827 -806 -1740 1944 223 -1670 -131 842 686 -1792 1 2196 -615 -785 909
2919 909 1355 -590 -1307 601 982 -1345 -1365 1535 -44 -988 -70 1035 1061 -1896 543 2274 -905
2936 -905 -1198 502 1064 -1040 -1511 1187 613 -1900 -535 1913 81 -1150 378 1738 29 -2004
2952 -2004 893 1557 -1458 -1232 822 375 -1260 -778 1592 485 -1248 501 1589 -211 -893 -62
2968 -62 934 -691 -1668 1000 446 -1189 -557 953 1063 -711 -237 1669 480 -1153 -120 1070 -583
2985 -583 -1407 350 1196 -559 -1229 1373 1323 -1075 -110 1181 634 -1252 -464 1575 -731 -1827 491
3002 491 781 -478 -1390 699 1724 -1454 -372 1472 390 -639 -589 870 -254 -1588 304 682
3018F82r12q96J610N64j504M5J216J93j559j39J749j158j251P52J272m85j787
3035a608J914J515k278J7J015O91j654o84K217q06j834J082J171m19j647J404
3051I6J559k204l54J602M85j597o80J704k70j688R31R06P4j643J050J201j311
3068a39l50P01R27j346r56K024p64r24J05J211L4j874J312J243j379l62O81J325
3086A469j641j292J801K45j143n59J440N56j902O39J716q38j130J80J759j197
3102A03j371J586L06j225o96J636P69k035L31J506m07r71J6J849j243j453J556
3119B57M28j078p69J239J132k030K59J415m26n62j94J477r16j518J378M70n39
3136B3j531J548R10j307m37J701P4j330l21J629m36j573O62J172o25j488J562
$$ plain form
3018 682 -230 -1126 484 1048 -456 -411 805 998 -561 -700 1049 -109 -1360 -608 664 179 -1608
3035 -1608 306 1821 -457 -440 575 1266 -388 -1072 1145 339 -1495 -413 758 339 -1308 96
3051 96 1655 -549 -903 699 1184 -413 -1093 611 341 -1347 -416 490 564 -1079 -29 1172 -139
3068 -139 -489 212 1139 -207 -1163 861 97 -827 -722 489 523 -1351 -39 1204 -175 -537 144 1469
3086 1469 -172 -1464 337 582 -561 -1120 320 876 -1026 -387 1329 491 -639 -459 1300 103
3102 103 -1268 318 624 -601 -1297 339 1108 -927 -596 910 503 -468 -452 1397 154 -1299 257
3119 257 685 -393 -1162 77 1209 -821 -562 853 427 -135 -329 1148 232 -1286 92 562 23
3136 23 -1508 40 950 -357 -794 907 981 -349 -670 959 523 -1050 -388 784 159 -1329 233
3153B33Q58j301o17J173O22j115o95J882j59j662N29R29n19j226M34J972j636
3170b98l29J154K19p34q55J684j37j469J57J462l84j585R51J078j018m66P69J170
3188A369j472o19J260M92j405l95J386j70j877J008J469p60j170N20J492q90j185
3205i47J129P80j503n37J440J10j148l82K002l72j369N94J593j186r64Q94R26
3222A060j379p47J509L20j868L90J544l23j487N92J570r08j155J203Q80j233j110
3239a142J538L29j466o23K021Oj382L56J336Mk105Q76J683j791q21R39J241j546
3257e47n07J614K25j249r7J699l92j727J065J086j024j382J213R40j456n75J594
3274D80M54j713O4J599k94j221M4J858q86j450J283M43n50j475J703O38j537l42
$$ plain form
3153 233 1091 -210 -827 346 968 -147 -842 1040 881 -781 -252 677 158 -1068 -634 1338 -298
3170 -298 -627 527 746 12 -843 841 704 -765 -608 854 470 -1115 -164 914 -104 -570 199 1369
3188 1369 -103 -722 538 1030 -375 -770 616 446 -1431 -423 1046 286 -884 -364 1128 238 -947
3205 -947 182 962 -541 -1078 362 472 -676 -1058 944 572 -797 -203 1390 204 -760 134 1060
3222 1060 -319 -1066 443 763 -1105 -715 829 506 -981 -389 1181 273 -882 321 1201 -32 -1142
3239 -1142 396 725 -741 -1364 657 663 -719 -363 973 977 -1128 -252 1431 -360 -1181 -242 999 -547
3257 -547 -1054 560 785 -464 -561 1138 746 -981 84 1170 146 -1236 -23 917 -539 -1114 480
3274 480 934 -779 -715 884 590 -631 -587 1271 385 -1065 218 661 111 -1364 339 977 -560 -902
3292i02J456O51j905J06J887j122j219L71J699j135j188J777O49j418o75K029
3308A061L77k303M82J404m66j816Q11J617j235j209J181J444j449r57J672M29
3324A043j579j01J417l9k059Q63J243n75j439R88J459j213r50J140P52j333p94
3341a177K065m02j332j55J758l28j793R67J707j230j351J534R20j382j098J711
3357D14L94j508n79K110l18j653J042J275r74j235J546J263j802q46J432K25j607
3374h21l09J742j50j387M50J350l65j404Q17J161r98j002J011Q97j694l30J609
3391E77K2j534L10J685o60j161M34J296k88j634J354N28j319j045J725N41j572
3408g41p7J882m55j171qK159j366j398J313R77j200j473K175R5j351l07J564K66
$$ plain form
3292 -902 554 1205 -700 -594 1293 171 -1048 -677 1022 -113 -1301 476 1125 -293 -968 1061
3308 1061 1438 -865 -383 1021 555 -1261 -450 1167 -68 -1277 -96 1348 -101 -1058 614 1043
3324 1043 -536 -637 780 741 -1318 -455 788 213 -1226 -238 1221 8 -942 198 950 -383 -1177
3341 -1177 888 486 -846 -1001 757 429 -1364 -397 1310 80 -1271 263 1183 -199 -1297 414
3357 414 808 -700 -1279 831 513 -1140 -98 1177 203 -1032 514 1777 -25 -871 561 786 -821
3374 -821 -1130 612 462 -925 -475 875 510 -894 -77 1084 86 -916 95 992 -702 -1032 577
3391 577 599 -935 -625 1060 400 -761 -327 969 681 -953 401 929 -390 -1435 290 831 -741
3408 -741 -818 1064 609 -562 -570 1589 223 -1175 138 1115 -85 -1558 617 712 -639 -946 618 884
3426H84k167J224R72o30j025M21J456j719o76J268O64r72o00J534L63j695M20
3443b78Q48K74j766N10J286j116j013P18J865k105k00J787J22j366n87K389n19
3460H49j803O63J221o56j625R93J356j503k80J132Q35j657r6J227j26j346L25
3477d91J401q02j566J523O31o62j092J395N54j305N6R84M09j768J38J486o63j041
3495h13P4J872j229j203J518L09n70n78J345K46j668J51J055qj684P32J226o91
3513H4p52O34J207j221m98J141j19o05o00J235K93j980Q92Q97k13j378Q96J166
3531A079j071p22J141M32q81q40J299j0r06l09J507k63j376P78Q85m58j085Q18
3549A8J110j690l08J165Q8r81j93J373k41r39K00J151k18j451J188N06o41p74
$$ plain form
3426 884 -1283 -59 913 283 -742 -321 1135 -584 -1260 8 672 -300 -900 634 997 -698 -278
3443 -278 570 844 -922 -412 874 -242 -1255 -537 1328 -777 -977 810 932 -434 -1021 1368 849
3460 849 -954 -291 930 274 -1351 -358 998 -505 -785 347 1182 -475 -571 656 530 -816 -491
3477 -491 910 108 -1458 65 696 34 -1058 337 891 -414 -358 626 1035 -733 -595 891 228 -813
3495 -813 -739 1133 -96 -1299 219 528 -42 -620 725 971 -697 -546 509 501 -1183 -451 775 84
3513 84 -668 -34 1173 -48 -546 595 476 -129 -729 506 799 -1181 -289 608 395 -983 -87 1079
3531 1079 8 -714 427 859 -22 -862 437 427 -479 -788 719 456 -920 -142 743 285 -800 18
3549 18 1128 -562 -870 295 383 -598 -791 582 341 -598 -398 753 535 -916 272 778 137 -637
3567f37P37O44j297j72J253k83n89r3J305l27j120N83Q49q12p31P95P65j455j43
3586g28Q16M74j220J11J221j87r00J01J179n90r22M84Q25j114l37J101M78q48
3604e6l75Q29L22j287J99R71o1j241L91J145r38p20J026K59o99k07Q54K08j189
3623e69N36O68l7j345M88J029r92n38O31P11q70m25J372k64n64p9P95J2j005K02
3643b44R03r16l76N87P03r42l37R77N57r89m05R62J2r81J68R82m34j121O87O63
3663D56j12p51L85O77n67n20J015j98r55K81P74l73o93K86R13l61j013R59P75
3682I78j007m39P73K78r89j15P86j40n08j02P22J51j013Q58L91m71m84L40M47
3701D56o21k37K66M10m68q4N98k70l38K09N44K41j294P10K78n80j34L2N38o04
$$ plain form
3567 -637 100 744 -553 -725 528 245 -344 -437 868 541 -579 4 853 41 -690 105 870 -585 -728
3586 -728 88 562 -658 -547 674 487 -413 -312 867 277 -645 -161 664 -450 -787 314 792 -56
3604 -56 -431 398 720 -567 -368 603 542 -699 -308 837 -101 -821 205 464 -235 -442 412 620 -569
3623 -569 -33 635 598 -747 -259 770 -222 -760 -129 582 -288 -713 659 395 -169 -248 547 559 -446 -244
3643 -244 659 -257 -633 -46 657 -285 -622 355 912 -77 -482 480 492 -489 -321 661 227 -894 -207 456
3663 456 344 -407 -22 655 88 -432 583 385 -570 -289 485 112 -581 -295 618 257 -756 203 978
3682 978 -29 -468 305 583 -406 -521 265 125 -383 -485 237 388 -625 233 624 153 -331 9 456
3701 456 -165 -402 -136 274 -194 -278 320 50 -288 -79 465 706 -588 122 400 -180 -314 -282 256 -348
3721c48l86J017Q3p40K9J047j51r69K35P41l98r02P43K67q01K94J84N39o20j94
3741c30P95J4p90M0O93m48m11K60O99r91l55J251j02l54l99J051K5j131J86R35
3761F38m05o98q6R15k24n84M14O56o45m06P08M86j015L2K76K20q09L30P97m00
3781B00p98O54K66l14k04N39N72r63l62P88J92j125j42J032j38q21M00R13l47
3800C42o78N08K82o30l00P87L92j027l9O82k31p79J67J174l78p72O29N99o24l73
3820b69M42K63o63l25P64L7p76L44L62K16p29K50O48n73l34M01N47r52k80R71
3840C44j7o23j67Q20pq93O61N38n17k78m6Q42p26m12N52J50l07o35P03O33r70
3861c55n0J154n6j317L82O40n17n31M50N02p14k31J075J44p36l82J126P5q77m
$$ plain form
3721 -348 -734 283 366 -374 -345 702 551 -418 -183 558 160 -742 1 268 -533 -239 -55 484 -136 -330
3741 -330 465 479 -311 -271 422 -26 -437 -177 522 -469 -824 427 325 -29 -428 623 648 -483 -297 638
3761 638 233 -465 -551 364 140 -444 -30 626 -19 -425 283 769 -246 -214 62 282 -527 -197 600 200
3781 200 -598 56 322 8 -196 343 915 -48 -410 378 570 -555 -697 335 197 -624 -224 689 342
3800 342 -336 172 454 -176 -476 311 703 -324 -363 319 88 -691 -524 650 272 -500 129 728 104 -269
3820 -269 173 436 -227 -552 212 249 -527 -183 179 395 -334 -84 564 -9 -343 58 605 -347 -627 344
3840 344 327 -296 -463 357 350 -543 118 656 139 -139 -185 657 -69 -481 71 221 -86 -721 -18 615 -355
3861 -355 -405 749 693 -624 -242 398 -119 -650 -200 302 -412 -643 432 576 -160 -542 584 659 -218 -222
3881b22Q34n77q62R39K64o19n06J007M36j180K73O83j92l58k96R15m17o30L79
3900a29N37l19r12R20N01n36o28Q39L76j120P4Q32j50q50K17P62l26p37N22P55
3920F28p46l51Q12N43j165k73R27m1j183M16R77p62m17O61P42q71m62J126J78
3939G39q49m77Q67J12p95l4P56k65r69P17P85m42m81L72J062j033p00J033k39
3958A59k68m17Q82q2q20M00Q22j74r50M18O85n94o07P18N24q65n11J164k9j253
3978g98N11R76l3j182M94P24o53r01J023M79r25l17Q34M87j160M6J146n26p01
3997d76K64P65l52q41O66N27p16o65J156J81o33l28J070j67j024J11J230o04q65
4016g01N39O21n41p09Q60P78j432L58O54o7p88K88Q90m96q87L66J061q17p03N37
$$ plain form
3881 -222 612 35 -827 112 376 -243 -749 258 694 -486 -213 470 278 -80 -376 539 122 -508 -129
3900 -129 408 89 -823 97 598 62 -566 273 649 -471 -397 435 285 -565 -348 414 88 -649 -127 628
3920 628 -118 -469 343 886 -279 -552 375 334 -849 -433 544 -218 -635 26 768 -103 -565 561 739
3939 739 -110 -587 280 392 -403 -437 319 54 -915 -198 587 145 -336 36 1098 65 -635 398 159
3958 159 -109 -526 356 274 -546 -146 676 502 -448 -30 655 61 -546 172 696 -169 -680 484 455 -798
3978 -798 -287 689 656 -526 -32 692 39 -862 161 640 -285 -602 232 719 -441 -395 751 225 -476
3997 -476 -212 553 201 -640 26 553 -163 -828 328 509 -124 -452 618 451 -573 -462 768 164 -701
4016 -701 -162 459 -82 -791 69 847 -585 -227 427 360 -428 -140 750 254 -633 -267 794 -23 -726 -189
4036a89O12p16k41P76P29j565K23J039m93q93J55J479r57o58P91M44o95o82J083
4055B42N42p99m33J011K8j203L52M59L3j112N13J069j010l78R74M11p21o82J219
4074E15p3q32J45O84nj291P48N17p08k98P47O49j088k81J102k36o45j00J105m59
4094A96q17K37J080o28r69J128M91p39n93P75O34j352m0R39n6q87J43J132p64
4113i0l91O23N24n70q31J019L58j056J83M88K31j079J45J201n77p90L43J140p11
4132A60p03P56L01p17l10P03L84j060q6J028n2j014K05J305o18p75N51O28p21
4151c5p59R53L80r97J37O80N3q66L55Q71k85j088N24Q18o89p13O80L86n70l15
4171d80P45K85r58J52N37L66r63M66P24r09o42M59N91q09l98J166L11j020P1R90
$$ plain form
4036 -189 423 -293 -534 242 971 -594 -371 668 175 -718 -563 916 -41 -699 92 536 -159 -841 242
4055 242 784 -15 -448 563 591 -612 -260 199 232 -880 -367 702 -308 -686 288 699 -22 -704 515
4074 515 442 -390 -245 439 434 -857 -109 408 -300 -598 149 798 -290 -571 531 295 -350 -450 655 196
4094 196 -621 -384 696 68 -901 227 718 -21 -614 161 795 -557 -597 342 286 -601 -458 674 -90
4113 -90 -481 142 666 96 -735 284 642 -414 -231 257 488 -591 -446 755 178 -612 -269 871 160
4132 160 -543 213 514 -203 -513 190 574 -486 -572 456 404 -610 -405 900 282 -493 58 686 -35
4151 -35 -794 159 539 -458 -321 359 412 -454 -99 772 487 -601 -77 741 52 -661 19 405 -165 -480
4171 -480 265 550 -408 -256 281 647 -316 150 874 -35 -677 -218 373 -436 -834 332 643 -377 -306 684
4191F84Oj364M48J008o63o91O49L64q84m77J085O38r97l51J027L4r57K16O88m1
4211D22r99P13L13o88m54O30O91p19m36J321j91j175M62P63n36o37K84P32m31
4230F5q42R64L76n93n36J113K47r94l53R81R2j216K57J190q15k81J16Q65p02k93
4250c59N81N1o61O6P10k28o37J46P89n06n22K13P09j27n77N22M39l98p42O36J21
4271B26o78J65L97J89o50q4P74l95l06N21O60q46k76K40M48o99j73Q14j33q97
4291g03Q14L29j94r01P13M86l62o61N57K52n93j93O21Q4p58L00Q90k56q17L51
4311d1L48k21l71K33O75p52n14P18J00k00l48N13K45p40L45O27j76p74L53N39
4331E59p72j4j20P86o19l18J031l83l88K74L61o8q09M58K54m16k93L32L87m96
$$ plain form
4191 684 690 -674 -226 782 119 -572 77 441 -443 -920 165 803 -194 -545 482 516 -441 -225 463 422
4211 422 -577 136 449 -239 -693 -63 628 -91 -527 794 603 -572 -110 653 117 -520 -236 496 65
4230 65 -777 187 563 -30 -566 547 794 -200 -553 428 520 -696 -439 751 -64 -345 -229 636 -66 -359
4250 -359 222 273 -388 -322 388 160 -477 -331 458 -48 -570 -357 352 225 -352 170 609 211 -531 105 226
4271 226 -452 -287 110 299 -351 -435 339 -56 -362 159 819 -27 -303 -63 385 -314 -487 327 194 -703
4291 -703 111 440 246 -655 58 544 182 -479 78 330 -263 -456 165 249 -509 -209 681 425 -392 -41
4311 -41 307 86 -285 -52 623 -129 -643 75 175 -25 -373 140 385 -355 -10 617 441 -333 20 559
4331 559 -213 -227 -347 439 -180 -498 533 150 -238 36 397 329 -480 -22 232 -184 -477 -145 242 -254
4351b54l69Q77J51o18N1N96k10n05L94K98l22m90O41k52j46k64N95L79o99lM25
4372B75L73p96N7N41j60n35j30P61o42k13N90L22n03p0K56N32m99n21P51j59p57
4393e27L20M03k07k18M49J33p8l30J19K04j71j29J67K08o57l9P20j47p14J45N92
4414B43k79m04L88O43m97n16Q20K3p59o4L32K85p70K45N13J69o30J86P70o84k59
4435b45L28j0l07q2L37M0l66M00N9L33q83L35Q48n95o01L43L90o08k52P45p3m31
4457b95P7N37m1l79J53M54j58o68K43L90k97j18J3N53n81l69P06J09l48j73L42
4478A50J89m72K45lJ5n16L01M32l48m17M01N87p80M2L16l4k23l23P00Nr26Q86
4500B27M3l32l03K41O48l59l9p5L52n46l23R06j35p24R1Q06k84n63O19J59k08
$$ plain form
4351 -254 -623 254 405 -213 -162 434 224 -281 113 411 89 -401 240 -12 -158 -422 173 552 -147 -150 275
4372 275 648 -148 -91 450 290 -245 -375 386 -256 -469 121 443 -60 -130 126 658 159 -362 389 230 -527
4393 -527 -207 196 -11 -229 220 353 275 -55 64 268 97 -32 135 343 -314 -353 367 220 -494 -349 243
4414 243 -36 -440 -52 591 94 -422 398 421 -338 -402 -70 215 -555 -310 203 372 -258 -72 698 14 -245
4435 -245 83 73 -234 -316 21 61 -305 95 154 487 -396 -61 787 192 -409 -66 324 -284 -536 209 136 -295
4457 -295 -218 319 278 -101 52 506 348 -320 -77 313 16 -102 -89 464 -117 -486 220 329 -19 -192 150
4478 150 339 -133 112 109 124 -392 -91 341 -7 -424 -23 564 -216 -174 142 108 -115 -438 262 267 -659 227
4500 227 270 -62 -365 -124 524 165 126 51 403 -143 -466 440 305 -419 -328 478 194 -369 250 409 201
4521B01l98L39M59j174M47K02L23q24n3N67k44k57N61L46m83n88P20L13p85K07
4541a21J94q8n28L37L58J41r39L09P24k79l60M42L26m32p31N98L00m39m6L01L35
4562D02o60K45M49k13o43N56K32l88m89O72Q2n13n82J091j30k64m3N68k9p66M12
4583a1O21k99q69L06O62o58l94O79J1k57k03Q87o7p40K30O08l69n06P0P80q12
4604c31j15N45M01p29J02N18Q7o14j46Q72j48j076L39R00o86l99L37N44p87J20
4624b66N79j8l6p48Q17l3m74k88J002m29m77L80M16o12j45O39J21n62k66N48K53
4645D01p90K0P97n16l74M66M65l78o79J186Kq85q4L97O42j303M63N40m36o41M91
4666b16P49o08m07P60K76m53n30O97J94r12j00Q34K3r47N49O17m35k40J07Q13
$$ plain form
4521 201 -197 142 601 -573 -126 76 399 -425 -478 89 -155 -412 149 495 12 -576 144 457 -328 -121
4541 -121 73 -15 -543 -206 152 293 -646 -337 387 108 -252 190 516 84 -647 -49 251 -188 -234 67 402
4562 402 -258 -13 436 223 -420 136 368 -20 -509 163 245 -268 -850 241 111 -153 -196 372 343 -423 -11
4583 -11 610 311 -558 -252 410 -248 -642 37 48 -209 -412 475 408 -332 -102 506 137 -369 -299 481 -331
4604 -331 -446 99 500 -229 -127 391 478 -136 -282 590 442 -634 -295 605 -81 -480 -143 401 -386 -266
4624 -266 313 295 259 -489 328 295 -179 -467 535 106 -371 9 425 -187 -332 307 428 -134 -400 148 401
4645 401 -389 -369 428 -88 -462 4 469 91 -588 598 600 -285 -369 28 670 -633 -170 370 -66 -707 -216
4666 -216 533 -75 -482 278 554 101 -429 268 462 -450 -550 284 307 -640 -91 526 91 -149 -42 771
4686G71n51n65N77M88j181K45N23p6o46j81Q64k80n61O73M70n11m98M74M74n91
4706h2m43O65mn59N7R00m6r30K91O02j26o56N01N03j020L0M22L50r08j47R61p
4728C54j218R52M29k83n48N11M90o83p24N77O44o13k71N00J03p17K25J152o64
4747B16q99Q03L00m11r50Q30O96r97j27J024q4q10J11J099n49o44N7R41n75n96
4767e65O21L30o63n10J126J82n27m98P65J06o99o2R41m07p73O01N82o21n55O72
4787D6O21p18n45R22P6r75L59K97J24r02M61P60n48l98O83L85n43m03M59J51p64
4808d52L90O53m29m24j03P33m87o62R94J51n03j82Q19N6p74j50P65K2q28J39J99
4829g3J84m85M59L50n55k91O65K43q35K01K75L82r58RM37L37p25K35L93k19l89
$$ plain form
4686 771 220 -345 232 720 -461 -216 307 231 -415 -596 268 -12 -573 100 570 59 -439 35 509 -82
4706 -82 -525 140 136 -423 -366 534 488 -442 -151 451 325 -331 170 673 -347 -317 105 455 -453 -600 361 354
4728 354 -864 88 517 234 -314 197 687 4 -720 -143 501 -112 -383 117 220 -497 -272 880 216
4747 216 -683 120 420 9 -941 -111 585 -412 -539 485 401 -409 -298 801 252 -392 -335 606 31 -565
4767 -565 56 386 -277 -787 339 521 -6 -504 261 367 -332 -394 547 140 -633 -32 550 -71 -626 46
4787 46 667 -51 -596 326 402 -573 -214 83 207 -695 -234 526 -22 -420 263 648 105 -298 161 312 -452
4808 -452 -62 591 162 -262 -365 368 -119 -781 213 364 -139 -321 498 554 -220 -370 395 417 -411 -272 -73
4829 -73 111 -374 85 435 -120 -411 254 497 -338 -137 138 520 -438 -429 8 345 -380 -145 248 29 -360
4850c60N96M11o25l93P32j80o06J23M16k25l51L86O33o99l50N92M73n41n32P90
4870B90K35r93L04L23p9m48P1O45j27o04M31L38l58l03L14K31o13k13N76J30p58
4891f08L09O63k22n90L95M37m27l61N25L00n83n94R03K22o74L33R5J35l92L7N99
4912E02l80m93M28L17n30j58N42q3l81j08M96J1k70l3N88l80n39N51M13o03m29
4933e39N78Q9l28k4M90J42k99m29M85J08p21K16P47m19p30N61N55p11p3M39JJ0
4955A48l51O49l0r88M84K00O3n97M41J88k48q6J85L04m30j9M55k52j42k14N32
4976B92k74m68L32L50J0m59q3P55o60K8L79L91o13j85M39j37k57j65K54O4o15
4997f22N43M29k29l43K43L33m80J1J42L00q18K6N85k77j38J86M09o9o72P01K80
$$ plain form
4850 -360 236 647 22 -371 361 181 -425 -302 114 -111 -462 -76 557 -142 -492 100 573 32 -500 290
4870 290 525 -468 -164 159 80 -368 -297 348 221 -383 48 386 28 -275 39 270 -343 -556 20 150 -608
4891 -608 -299 364 142 -448 -53 384 -43 -404 121 421 -162 -756 147 369 -305 28 123 258 -134 -97 502
4912 502 122 -371 57 374 -156 -314 228 145 -236 -344 152 163 -107 -140 448 68 -471 80 493 -110 -539
4933 -539 39 128 -200 -224 266 408 109 -320 165 273 -448 -232 515 96 -634 -73 482 -229 -302 137 138 148
4955 148 -203 446 416 -572 -88 112 175 -422 19 207 -41 -127 58 362 -68 -87 368 116 -26 -240 292
4976 292 18 -450 -118 232 242 -217 -300 455 -205 -177 202 593 -20 -205 234 97 -160 -325 -71 -7 -622
4997 -622 -79 350 121 -222 21 354 -126 -115 27 327 -491 -465 120 -157 -295 -109 300 231 -441 260 540
5018E40o93J61J34K52n56M4K99K36n67pO85m90l13L46J03k42m84N08J96l35R5
5039h8K60j31n0j40L34j44j25J64L01k55m50L03J28l43J02K05Q7m86J09L22l03
5060b00J41j61M34j45l30J86L45l37j54K9J73j00j31L70N8l94P4M56ol82j57M63
5082B32m0n46J31O35o49p4K07L24J48p07M53K70o24P2J87l3j90j26N55l65O2J45
5104F7K96m00k77N99K8n29j7O60k95k88j24O09j32m49K27M65m44j68J90L07o87
5125c62K28M29m1n90J24L04k92K2L13J53k08k40J42J98j86k5j92N05n37K99L3
5146G7j38j45LL77J90n66K18L59k70l59Q7L20l59J21k8K74l23J11K19p3j57M9
5168a3N8M15p50J80K36l05J46q3L59l86k51Q66m06k20l4J33J94k06q9N27l57k34
$$ plain form
5018 540 -153 8 142 394 -162 -118 181 417 -150 -157 528 38 -275 71 174 -68 -552 -44 152 -183 -88
5039 -88 172 41 -9 -149 185 41 -84 80 381 126 -324 -21 107 -236 -134 71 158 -328 -219 103 -200
5060 -200 -59 -220 214 69 -261 -75 270 -67 -221 -192 -19 -119 -250 120 178 -216 -142 314 308 -74 -231 232
5082 232 192 -354 -223 412 -237 -311 -104 220 368 -339 114 384 -240 -168 19 -14 -204 -330 225 -140 -78 67
5104 67 363 -37 -314 285 313 -216 -233 427 132 -156 -280 329 197 -252 -25 440 -4 -172 18 325 -362
5125 -362 -134 295 254 -336 -212 92 -200 -178 135 288 80 -160 -18 180 -6 -31 -223 282 -255 44 77
5146 77 -61 -206 -203 174 364 -202 16 375 105 -254 -167 153 -206 -85 -113 161 -162 -51 168 95 -62 -13
5168 -13 45 460 -290 -110 126 -179 -33 -116 243 -143 -394 472 66 -154 -188 -55 139 -67 -156 371 14 -220
5190b20L74j34k79NP60L8n64o3P10n69j73k9L33m4n34J77O12m67k47M89P3l22
5212g4j18K96J85m86l28P83j85l25J69L71m65k38N37J92J10o26K25O3j63l2J84
5233G5m3k85o8P35j43l13M04M1j00m13L90k24m05J03M67m6n71L34J73k54m60M86
5255a17N10n89k4qO35o20n0L97K1n56K58N73l92k42K78K24l23l74N48K23n49k08
5277c85M43K76m94k29L76R1k23R4L18j04m79L39M11l51m57L97J11o17J45P96m83
5298b5n48K07P24q8l95J57L88m56j55K00L03p07j69P47L27p87J09L97Jp14N79
5319I5N27n73m76L56M17m27o8L45J65n58J11L85k86l15N05J44m80k89o5Q21l57
5340b3n06N53L10n56Q6P75k67l75l66N81Q6r04R59O8p13j28M23M59m50l58O66
$$ plain form
5190 -220 154 20 -259 -254 506 544 -20 -83 627 58 -115 -144 189 145 -389 -212 400 -67 -314 175 248 -74
5212 -74 -192 104 289 -197 -525 258 73 -252 -83 288 -177 -415 122 314 424 -202 23 86 -77 -109 75
5233 75 32 -253 -321 414 271 -42 362 403 303 -110 280 56 -349 -246 221 175 -396 -62 111 -143 -603 -117
5255 -117 393 -196 -220 -228 407 -213 -263 134 155 -401 -143 430 38 -204 74 298 -25 -399 149 372 -177 -385
5277 -385 58 334 -160 -389 -13 78 -145 -51 267 163 -316 23 434 83 -374 23 134 -483 -338 458 -25
5298 -25 -573 -366 358 270 -125 32 420 -36 -191 9 312 -395 -564 183 510 -277 -168 229 230 -484 95
5319 95 622 49 -427 -71 346 -81 -149 196 361 -197 -86 299 13 -302 203 347 -133 -422 -487 334 -23
5340 -23 -529 24 334 -222 -136 639 372 -3 -369 212 298 -606 353 421 -292 -420 3 462 12 -346 320
5361C20J90q00K13N51k06o37K24L71j76n99K55J020q08k06O05k33k56k45P61k66
5381G8n67K60K01J4l67L33L02j97l52N48J18n41n8K55N0l89Q5M13k90m16M34M14
5403C28m06l28N68K75m85m12O22J94q64M2N87J33o38K29M72j49l70N81j58m83
5423b62j03L82K67n89J25L76j52m85L67J81L09p42P68j73j88l68M98k4l63N6M78
5444C58p6j062Q80J77k68m0NL77m72o66J145q1m74j13M06Q4j75m77P53j96l08
5465b23L87J33J9p01M46j38K1m34N96Q7n87J86K93J46n66L03M24k50m24J37K29
5486H4j51j30J62L83o13oM90n8l73K89O30n67m28K52L92k80n72L22N00n01n2O03
5508C76k45j95j32L61J47o98K04M10n94k2L74J07m16K40L86K41n62J0j72L79n17
$$ plain form
5361 320 510 -290 -77 474 268 -369 -145 226 50 -549 -294 726 -82 -288 317 84 -172 -417 344 78
5381 78 -489 -229 -28 -14 -381 -48 254 57 -295 253 371 -170 -228 27 77 -312 -227 186 -104 -520 -86 328
5403 328 -78 -406 162 437 -48 -460 162 356 -508 -466 121 254 -384 -155 317 168 -202 379 221 -262
5423 -262 -365 17 284 -305 -180 196 44 -441 -74 107 416 -326 442 269 81 -287 211 187 -176 -120 358
5444 358 282 -780 100 277 9 -31 -26 351 -121 -787 358 277 -197 -310 96 180 5 -472 281 85 -223
5465 -223 164 297 316 -385 61 -77 -56 -490 106 193 -394 -208 85 231 -335 -32 392 142 -282 -145 84
5486 84 -67 -197 -35 348 -265 -271 219 161 -212 77 707 140 -288 -36 356 76 -496 -174 326 -175 -227 376
5508 376 131 -64 -196 165 312 -386 -182 228 -366 -388 -14 93 -323 -83 303 544 -18 -8 -180 199 -318
5529c18J6N70m9m66j15K39l3n3J68N91r86K42K93K95q74K89M13j37k82J56K58
5550B17n1m34K60J86k52j58K81J99m91K05J19K9n44J66N57k27n12L02M18n53L9
5571b44M38J45m96p8Q79n85l17J49L35k89m0j3O84n46k11L24J4n54L63J66n8l63
5593b97LM34k49j14L96O8l00k32K97J04j28k94N79m17j12K19L10l27m73P21j19
5614F9K3l89L28K11l24j20J86K65m71J02L16J5n66L65Q9j24m1K61J86m55l6K19
5636A09P3m25J96j10L20j97j50L14k9J74k00J4q7j97K09l70J26l8K23K03k34L1
5658d5K11j39K26k02J92k51j17J09K42l23m37M47K11m59J86K63j29Q3JK20j59
5679A30k20M9N0m8k16J26j40K68n8R2J49k43j02M90k11l68L4M59m39K42k32M31
$$ plain form
5529 -318 -302 268 219 -247 -362 -123 -156 -209 -41 550 -436 -194 99 394 -480 -191 222 85 -197 -41 217
5550 217 166 -268 -8 178 -74 -232 49 248 -243 -38 81 110 -434 -268 289 62 -450 -148 270 -283 -244
5571 -244 194 339 -157 -235 644 59 -258 -109 226 -63 -103 -116 568 22 -189 135 149 -405 -42 124 66 -297
5593 -297 -294 140 -109 -223 173 241 -59 -291 6 110 -18 -312 267 -150 -262 -43 267 -60 -533 188 69
5614 69 92 -297 31 242 -82 -202 -16 249 -222 -120 196 211 -355 10 99 -25 -66 195 381 -74 -110 109
5636 109 182 -243 -47 -157 163 -34 -184 130 101 275 75 89 2 -195 14 -356 -230 -268 -45 158 -76 -45
5658 -45 166 27 253 51 243 -8 -125 -16 226 -97 -534 -87 124 -335 -149 114 -15 68 69 289 130
5679 130 -90 -41 9 -39 -255 -129 -269 -1 -59 33 182 -61 -163 327 116 -252 -218 241 -198 44 -188 243
5701B43j31j56M3L03l91j01M67km65J79j01J69j25k08N12k26j15M6M12k98k87
5722b32j5L22P2m15L30J02k48N8k43M34l50K63L62l06L1j37MPk02K92j75Mn6r9
5746a97O4K56j91M16l95J67J08j09l4j2mj60K3K3J95o6r8j23J59K13l50j10O28
5769D03l07m06J40K39k0j24j1K58m8k27K10j0j76J91j15J72k35nM0j7j59Q7K03
5792H3k24m7L60M3k36k00M57M1k49rj03L1r8P0K58k29O1Q5M5l4l4j47J67k91j1
5817b11L5K96l49K3L74k38l29N92QK8k34J43l6m72L21O7J0l45J10O68k15k47P6
5840G5R8R1o34L56M74p84J01K96k3l07J16K76Qk18K5N20m56m8J4K88k73l10n8
5863c73O14p7j59L38L9p50K72L23k90J28N2J95n15J62P1R0l31L4J96n5j90J54
$$ plain form
5701 243 112 -44 -1 302 -89 -190 277 275 -190 -11 -112 57 -68 -276 236 10 -105 -59 353 55 -232
5722 -232 -247 75 147 -268 62 164 -84 -26 -269 165 -185 78 440 134 165 28 32 39 -163 129 -46 -42 -98 -197
5746 -197 -133 123 -68 348 -47 120 228 119 85 73 69 -91 -68 -45 150 84 -14 -137 22 235 -115 -225 403
5769 403 96 -310 -170 69 49 -75 -86 172 124 -103 107 97 -79 112 -3 169 -66 -71 -31 -48 -207 -120 83
5792 83 -141 -188 172 215 -21 -221 236 277 28 19 -84 -53 -151 -81 177 -52 9 94 139 105 71 -76 91 -200 -211
5817 -211 -176 120 -229 -206 168 -70 -399 193 201 229 -5 138 102 -370 -49 18 28 -317 -207 461 246 -1 75
5840 75 173 264 -370 -14 460 -324 -223 73 50 -257 -141 135 143 -75 -50 470 14 -34 -20 268 -5 -315 -373
5863 -373 241 164 5 343 382 -368 -96 227 -63 65 117 312 -203 -41 30 120 -211 -177 19 -36 -226 -72
5885g2R6J59n11L06M33l27l94J13K54k48j10M56J44l45r0P81m80kl96L27k1o05
5907e32L47K71L74p26K16M33k56l73K35J11Mj48J46j29l19M07J14k64j42J94K89
5928B52p1l59K19J79k68o7M92j98m45J63P4O9k38p0N05l29j03K86J36l18k8K18
5950I9K17l74j11M00k02k25J16K90n5o7J0L17n51L3L72N9k71j6K90j27k36j89
5972b21K84L4o05Q16j79k46n9K43O7l39J32N57m43l09J24K68m7k59M29k08j60
5993a21j62L58J89m72K2K35J63l74N4M29j08m35J71J69k37j26L49K24q23N47J05
6014A57l5m61L07L08k25l56K94K63l40j73L09K42l90J55j49L90o40m8N95J71m60
6035h6j61O27l63k56O1K78j93j11K90N4m77p8N55J56k81J28O9k74l08M99P5m66
$$ plain form
5885 -72 24 183 -328 -22 411 84 -310 -197 57 -191 -301 155 299 -46 -136 645 165 163 -233 94 73 -532
5907 -532 -185 86 460 -266 -50 383 127 -246 -11 100 104 -44 102 -27 -346 61 175 -89 -231 -37 252
5928 252 181 -178 41 220 -48 -115 377 179 -266 -103 -29 40 -198 -268 237 -92 -195 91 227 -91 -119 99
5950 99 316 -58 -169 231 29 -196 -80 210 155 88 98 415 -136 -103 269 328 57 41 331 204 -32 -221
5972 -221 63 97 -508 308 129 -117 -176 67 134 -205 -73 484 41 -268 -144 124 77 -182 247 39 -121
5993 -121 -283 75 264 -208 -186 49 212 -162 -108 321 213 -222 -51 118 -119 -245 104 328 -495 52 157
6014 157 122 -339 -32 276 51 -305 -11 252 -88 -261 48 290 -100 55 -94 296 -344 -392 203 374 -86
6035 -86 -247 380 17 -239 -178 100 -93 -204 86 140 -337 -415 140 296 15 143 212 -62 -370 129 204 -262
6057b62r2K49R2j54j3O57j37k98k44L56J39n00K45J04l61n2J66L34l47j40N41
6078B83J6r5l52L88J58n04k8J90k12l13L45L33l47j61M69K76p05J77N5K17m04
6099b14n4P46o83J75pK19j44k20K46K5J0j08J31K8r7n4O4O5k94K62L1nk34J02
6123a0M27m88j72L10J21m88L97J23pl93j88M22J15l46J29J98k65q1J04N33o40
6144a99j24K76Q7j70n6L72P3o39J79M91l28k3K66K30n70l5J68J35j76l13O03j81
6166F6k13M9R2J13j74L8M24k77m54L72J27l58J83O0n7j37J29J14R3l13J74R1m
6189A38l62L79j14j55K7J04o4j20J42N17k87l96j36P06m46k57M32N2m23J66L41
6210B44j42K7k01L38j05o5k17N18l06j50KK16m04L8J72J03j58j90O59j87j29j35
$$ plain form
6057 -262 -354 -105 -13 -167 -180 477 340 42 -202 154 293 -207 38 142 -219 -271 -105 229 -118 -258 283
6078 283 299 204 -148 240 398 -106 -134 56 -156 -469 -124 209 -138 -299 170 446 -259 -82 -27 190 -214
6099 -214 -268 478 -205 -30 -37 182 38 -182 64 89 99 -9 122 150 53 -1 63 128 -166 96 127 122 -112 -10
6123 -10 417 -71 -243 67 188 -300 97 220 213 -180 -368 54 169 -177 -48 150 -115 -196 -92 441 -199
6144 -199 -323 -47 40 -130 -186 186 259 -380 -201 290 -38 -61 205 435 -135 -170 -2 133 -43 -356 247 66
6166 66 -147 -98 -6 107 -67 -29 395 118 -336 36 163 -195 -12 48 -9 -146 -17 97 190 -123 51 142 138
6189 138 -224 155 41 -114 -87 17 -47 -167 -25 492 205 -191 -327 379 -67 -324 108 160 -263 -97 244
6210 244 102 129 -72 266 161 96 -121 397 91 -59 -57 159 -245 -207 -35 68 -90 -280 379 192 63 -72
6232g2K92j17l50j13Q07n01n28O52k7k08J21M63k53n5j38J76j24k38J70K3p7j08
6254b05J65K01j10j76J65K02rn22L34J09k45J38L7L7n19l8N45j04j23O3L62k70
6276C7j58K42j39j96J44J3j12j1N0K10n1p1O3K60k84MK38P8l56J27j22O9l06J35
6300a36J83mO0j62K32m65L43L04l47k94J3K42Q6l22K79P3K57m94J27J78q3P4J84
6323C28%n33J24K0J02k91K51m3J03j68J72J86m94K85J77j5l97J57k10K70r5j25
6345a96J10NN6j6J91k10j26L11M9j79k99M47l07Q3j07J54q0J58J3R4p1k7rJ1M8
6370A03j83J04L2j37j24L06j40n1M76l31j60J90l58K74Q6k20J59J79l64J9j51
6391b91O45n03K48%K58l24N4k41P3k37K37J60j15N6O9j1j24k3J24Mj52Q3J35n1
$$ plain form
6232 -72 220 103 -247 -360 447 -54 -582 70 43 -165 -44 419 166 111 -27 149 25 -213 -43 -20 -97 -205
6254 -205 -40 161 51 -125 40 242 233 -289 45 154 -91 47 84 121 -398 -436 109 5 -118 -55 307 37
6276 37 -121 121 -18 -214 -70 -57 -169 -180 -130 80 29 -42 21 281 -3 1 239 317 -39 88 -34 35 -271 -136
6300 -136 47 43 103 -59 173 -292 51 355 8 -286 -273 -31 55 -267 12 85 342 -152 -25 153 70 144 328
6323 328 328 -205 -81 -61 41 -250 1 -42 61 -107 65 251 -243 42 219 204 -193 -36 -246 24 -71 -196
6345 -196 -86 -81 -25 -41 150 -60 -186 125 174 -5 -304 143 -164 -81 -188 -34 -114 44 57 151 80 53 44 55 103
6370 103 -80 24 56 -81 -205 101 -39 -90 386 55 -105 85 -273 1 87 -133 26 205 -159 -140 -291
6391 -291 354 -149 99 99 357 33 87 -154 -81 -318 -81 79 -36 20 89 78 -46 -69 55 59 -93 -10 125 74
6415G4k16o4K20J01l4k74L08L0j45L7L03j91j04k64L91r5j94K02o2k82J05N19
6437C65l40o8l16P15k05l24M1L25j45l46L20J30k45j29K98J42m32K56K21J6L7
6458C16l87L55l50j5j9K55k11J12o6J85j69J80j28l1J5P4p5N8k38j63M90k16k60
6481b88J73K93l51J97r5M03l78J87j53j2j22J13J99l08j28L60R2j11j58M23l02
6502C4m7m7J74k47l9R8N21o15j16K33K32k41lJ12P1k63K18L34j90m14L61q0Nj83
6526i2J7K25l32J46O9J19k53k62M70j65qL6L5j70L0m5M28j57j79L55j89j72M1
6549e3K59k8m50m8K26L79n94O8L95k12r1L6R8O0qj13N1J81n43M48L1k00J91k1
6573F2m7q2P3K07k45m39N87J70k22j06J56J0k94N0J95m07R6J64K02k06K76n91
$$ plain form
6415 74 -142 -206 14 115 81 -193 115 145 0 37 340 149 45 -219 172 77 -117 85 23 -259 -154 365
6437 365 25 -43 -359 356 151 -173 -132 193 48 -298 22 152 -93 -222 76 218 -214 42 263 279 316
6458 316 -71 284 -66 -81 -100 155 -56 56 -10 175 6 186 58 27 42 116 41 99 -139 -302 188 -28 -288
6481 -288 -115 178 -173 24 -71 332 -46 141 -12 -24 -146 -33 166 -142 -270 90 182 71 -87 336 34
6502 34 -13 -60 114 -133 -172 -74 447 -168 -284 -51 181 -60 -63 49 120 -143 75 409 219 -195 166 86 91 -92
6526 -92 -75 150 -182 -36 33 152 -101 -363 107 -58 -66 -30 5 -165 -135 -180 248 91 -88 267 78 -94 -53
6549 -53 206 178 -272 -320 -94 285 -309 -241 154 -58 -149 -113 -15 45 37 -76 -25 156 -387 61 92 -108 83 62
6573 62 15 -67 6 213 -32 -471 116 286 64 -42 114 124 -170 -120 75 -332 -236 -72 130 -76 200 -391
6595c91N59l00K3K46j54P7l78L49R0j52J20P7N2k09J87lk39r4J03J64j85j46J37
6618f7K6r2j00M56L06n47k60N22k12k29J3k5M05Nk3o9k04j96M71Kl04J41L2o8
6642a7k33J3L50o8n26M83J12j36j53J98L98o67k4K16J68k53P0L31m54j19M06K64
6664C59k14r2L71l40Oj19M26p1n54M5L93l31m8L67k81K5J49j62K8K51m13J28J68
6687I1l65M1L55j26k02J69J30Ml44L28J36m83J59L68k51l77J24L50N7j70j60M25
6709B59l21q0K73J42m03L47j71J08l35r4N23m45j87M03M35m54l95L18J55j30q2
6730a34J98P3k49j36J22J02l43J68L61%l59N5N98l05l21K03J92l42j77M95l55
6751a54R0p1L87P6p16L91O1J09r7j29R7l06j98M59r3r9l7M26n2m41K40K38k64
$$ plain form
6595 -391 168 -132 -109 137 -17 60 -318 31 121 -31 89 166 218 9 196 193 -46 -140 -37 127 -58 -204 -67
6618 -67 -41 -133 -233 223 529 -18 -278 244 32 -197 -184 -209 196 201 178 109 -95 -291 180 182 -122 19 51 -17
6642 -17 -250 -237 113 45 -481 2 114 -22 -175 23 421 -246 -270 -54 114 -139 -69 262 -192 -311 95 359
6664 359 145 53 424 84 90 -29 397 326 -228 -183 210 -121 -169 198 -83 -58 91 -71 -43 208 -205 -77 91
6687 91 -274 -233 122 -4 -206 -37 93 97 -247 81 217 -266 -107 261 10 -367 -243 107 164 -6 -166 259
6709 259 -62 -142 131 273 -130 217 46 154 -181 -275 248 -197 -384 19 454 0 -395 -77 78 -52 -134
6730 -134 64 137 -112 -248 -126 -24 -367 -199 162 162 -197 -142 456 151 -170 33 225 -117 -294 201 -154
6751 -154 -64 -135 252 328 -388 3 64 173 76 -53 44 -262 -460 -1 -94 -193 -230 196 144 -297 -57 181 -83
6774h3j49K99o6j74m3K39R2j69p0M49j47k85J52K28l48m1K99j47J7l83K80L60
6796C10l25L6m4K52m42J6M31j81q3o6J67r5j55J76N4j02j3J15K29k63m5J89k36
6819g5J9l4n2J98m00J35O48o30l4K44K33n69K84j84N19l98r3K88j36m3K21K32
6841C73m70p2J24J43l59J42J39N8J7j09J60k05k80K78R8j5j0j6J12K01k76j24
6863i1K13j00j28K06j97q8j77L25M1k83J19K26k3m9n8J99j45j57J73J87m75j19
6885d01Q47l12m63L05Q6%j94Q5L09n80J97K39j02k78J75K67P9l15k63L37K85l99
6907i6K25k60L54l32J11J97o86N58j17P3j25j47M32p9l39L25p8L3l6Ll28N60o82
6930d34L80K74j91K01n5j4k36P2j22K60j79K12j15ok95L96L0j24kj5P7j82k23
$$ plain form
6774 -83 -232 67 1 -173 -216 23 115 -54 -124 325 178 -107 45 273 -75 -116 183 36 53 -330 -50 310
6796 310 -15 21 -23 229 -213 -197 234 53 -30 -96 71 -24 -179 -3 51 -51 -64 51 280 17 -28 161 -75
6819 -75 -56 -90 -142 56 -344 -209 439 -191 -225 19 252 -317 -33 -217 302 -96 -189 99 -37 -80 141 373
6841 373 -97 -169 -45 98 -261 -119 20 78 95 -14 146 -59 -339 -61 37 22 12 -4 108 309 33 -91
6863 -91 122 22 -106 100 -97 -185 -362 -37 4 -279 -160 66 43 -6 -64 135 -10 -167 6 193 -282 -401
6885 -401 446 134 -329 -24 62 62 -132 -47 262 -318 -121 118 16 -262 -87 180 259 -56 -319 18 303 -96
6907 -96 129 -131 223 -109 2 199 -487 71 -46 27 -98 -245 187 108 -231 94 16 49 13 16 -312 248 -434
6930 -434 -54 220 29 230 175 161 -75 -3 -125 135 -44 168 53 47 -248 148 178 54 52 37 114 -68 -291
6953b91K43L4k94J82L08r6k90R0L8j47Q7J56K95m09p7L27k29O0j84K62j3j20J6
6976e2J86j55o5K24j58M7OPj78qK2M9p6O1p1J24Kj56L04M1j6j31R8k41o4Q4J37
7003B1N3l41K11n6J88k03K40J78j59l70M50k05j17j89QM28l66L01k11k6J3M1J53
7026D2oLK83l40J68m37P0K82k27K16mK7o9J05L1l54J77Q6L0j11m27M24k56L42
7050E5n3pm3Ql2M48m61o0J89p7J57j10p7K6l24L59R6R0k15j16K50N5n6p4J45l22
7076a49j39K77J06j29l64N03k60J67j21L93J65l43p0p4O7p5j19L1rJ48n4j8L3
7099c4J4j28K59k01j22J80j29K33j24K69j90N1m6J10j92J9K57o7k64O4J71j06
7121B4K8Mj57OK5m5J68k11j24P9M07j29pJ40K22l39k12K09j5j0j30K99k16J6j45
$$ plain form
6953 -291 -48 -14 -308 -126 182 86 -204 -114 -76 -223 -136 20 315 -94 -171 156 -73 -13 -197 65 52 -68 -52
6976 -52 134 -21 -86 138 -20 27 33 40 -138 -146 -124 -75 -151 -90 -161 -37 -35 -191 113 154 138 7 105 -136 -200 -116 21
7003 21 74 -267 -56 -112 76 -127 113 291 132 -238 212 7 -110 -299 -291 137 -229 72 -139 -165 -152 -111 42
7026 42 36 39 322 -18 150 -287 -217 65 -162 54 50 77 8 113 144 -210 -33 53 83 -28 -455 -31 -287 55
7050 55 2 -5 -48 -40 -72 376 -85 -145 44 -33 124 14 -63 -37 -361 -2 94 184 -31 -147 103 158 102 28 173 -149
7076 -149 -288 -11 95 -34 -398 105 -155 12 -109 284 449 106 36 -38 29 -46 -165 -134 -143 5 -49 -67 -34
7099 -34 -20 -148 111 -90 -212 -32 -161 72 -52 217 27 78 32 142 -50 -31 226 159 -105 -41 130 24
7121 24 52 56 -101 -95 -70 -115 53 -158 -282 -203 204 75 68 208 430 91 -121 88 73 63 -67 232 16 32 -113
7146a13J08J41j41Ql09o2L19l7P2K5r3K80j36K17k03J10j82j1P5Q5m38K98l2j91
7170b10R2K22J17j81m1j48K26l51J08j57M29k38ll0J46q8M0J97p2k43J93M7o4
7193iO8l32M86m49L29k61K06k22OK54Q8m4o1o4J50pj43J77j81Jk1O5m0l33N35
7218A98j7k46J59M1P8l90K51O0P2j98j21j4J58j74n0L92l84Q2kK71Q4j41k19J99
7242H9j20j10K4K32j33N6J31k23L48l33J49R7j75J04O5k09l90M01j1j45JK07k32
7265a77K95r3Q5j99k08N06K01p46J97P5J59l05L83M1r1l45J94Q0j20j36K98j44
7287e0Q1r2K93j76k29r1P5J15J20M0K06j13j37j25P0Q5j72K62j78k83K15%M65
7310C81l30K13l06J20k41N5L40l06j06j2M29j94j7n4K38l25q9L25p2k53J60J81
$$ plain form
7146 -113 -5 136 -5 3 -306 -368 -49 -86 -14 11 -82 198 62 279 76 186 4 -7 68 153 -285 13 -19 -210
7170 -210 -118 104 221 40 -1 -149 77 -274 -166 -323 106 -132 -135 -165 -19 -107 -67 130 58 -185 8 55 -9
7193 -9 59 -273 213 -236 93 -168 38 -184 -178 76 164 120 59 -5 145 138 -5 172 -9 -8 -29 36 -4 -337 198
7218 198 181 -65 94 135 213 -177 74 134 206 8 -113 -127 31 -143 -193 199 -185 -103 -105 166 250 109 -110 89
7242 89 -31 -141 -117 115 -18 38 169 -54 294 -39 110 207 32 136 201 -8 -398 3 -8 -153 -152 55 -177
7265 -177 118 25 110 -89 -297 209 410 -336 -139 -64 95 -210 173 214 123 -222 -28 52 -68 -204 94 -50
7287 -50 31 -61 232 56 -173 -264 -189 -74 46 86 292 179 42 -83 -13 72 -100 162 -16 -299 -84 -84 381
7310 381 51 264 -42 78 -163 -108 232 -74 -180 -192 237 43 26 -28 210 -115 -204 121 49 -204 -44 137
7332A37m73L32n7Qo0P3J39K3O5l08J11j07j19J85K56p2n40L58M0q2P8k32M15l28
7356a58K74p2Q9k34q2K98J61l42O4J06n5n8q6L26k63o2J44j95k6R3K15j82n2J58
7380F1j02l5J62j1j95L98l02p4J79j2l20J18N5k21K09K64q0l03L56k47J0J54J07
7403A71J08j89k97P6RJ31m07O58j73k55K47J91k55k80K55j32j36J22j1Q8j30p1
7425b80M27l6k28m8J09m6L41N4j42l86J31J87l0l61J74M02l06J09m96N64k34l0
7447a25L6N8J2k37R8K97k39M3K0R3j9J36L5j41k35Q3L84k36k26L59j56k18J67
7470a1J22j47k75K25L26l4J5k53K28k49j79K20K24l38lM53l47J6J46p3J25j33
7492E8k4Q5j18K5k80K68k79K39RL31n21L73p7nl41K01M8nO3J78m20J87k62o0M06
$$ plain form
7332 137 -336 -4 -61 -53 -113 -40 99 122 187 -121 -10 -117 -236 -51 205 133 -407 -49 -9 -91 -13 -245 170 -158
7356 -158 116 44 133 -101 -183 115 276 -66 -2 104 49 -9 -95 231 -32 -94 50 -145 -171 -78 137 -45 -97 61
7380 61 -41 -76 86 75 -120 278 -24 -98 81 69 -251 -133 -78 -299 -90 174 94 -209 147 -100 -90 64 171
7403 171 279 90 -207 -131 -122 9 -398 260 87 -168 79 270 15 -265 -10 -142 -278 -156 -167 -79 -209 -280
7425 -280 147 111 -117 -165 -56 -102 239 293 151 -235 -104 83 53 -308 -134 268 -38 71 -425 139 -95 -125
7447 -125 -89 -31 -19 -256 -158 139 -100 -57 -37 56 37 173 208 67 -168 -85 299 63 -163 196 40 -178 -11
7470 -11 111 -36 -311 -86 240 206 221 -32 196 -53 -232 -12 212 -126 -129 324 -23 -7 139 66 191 58
7492 58 34 119 1 26 -254 14 -265 -26 -17 314 -207 166 89 84 -257 -56 -8 -13 50 228 -192 -5 -267 -327 79
7517G9j39p9L19Q9k44O5j1k01k28J32N24n35L25l92M1L31k72M59k62R6j73M64
7539C88l40l10J11L08k41K7M84J5l18j55K33R9m65J67J23j85r9k4L52l82J03J7
7561i2M22l19j87M78m40M2J10L9M2m93M23p9p2r0j23L87n0n6J30m6n1k7J13Rj01
7586c1j11J70j15P4j45L78q6k47K20n1K05j91K40jl91p8L05k18p0M05j87J09j74
7609A0j11K11J3l13K45L6j29L4k7j54L58l34K79j94O7j54O39m49j32P8rj6J06
7632E4j66J51M5k92J96j37N0K12J49j21o9j62R9j15J1M4j21K63p2N8l8LOQ6o1
7657G3m1kpp9P8K81k62q8k5K9J20j03j98L12n3j5J2p8l3J38j8j76J00m1Q5j47
7683a38j18J76K5J8K22k86J36j05m1K22k53K23l11J57J31J36P6j59k9j10p6o4
$$ plain form
7517 79 -60 -139 180 269 25 90 79 -122 -350 -218 306 -229 96 -296 -255 76 -196 263 1 97 -76 388
7539 388 48 -262 -151 157 -84 -57 427 442 124 -31 202 301 -164 3 126 -59 -158 -182 170 -212 -109 -92
7561 -92 330 11 -176 302 -138 -96 14 53 95 -398 25 -54 -126 -216 -339 48 -2 -58 72 26 -25 -52 61 70 -31
7586 -31 -142 28 -87 -13 -158 220 134 -113 107 56 261 70 310 309 -82 -160 145 -73 -143 262 75 184 10
7609 10 -101 110 123 -190 55 91 -38 -4 -31 -185 173 -161 118 -76 -9 -163 476 27 -105 -27 -36 -52 54
7632 54 -112 39 84 -208 -12 -149 -99 113 262 141 72 -90 9 -106 -95 -51 -172 91 19 77 39 42 48 134 73
7657 73 32 30 23 -56 22 303 41 -47 -72 -43 77 -26 -224 88 35 20 32 -46 -79 59 41 -135 -35 -76 9 -138
7683 -138 -256 -80 -55 -37 185 -101 35 -70 -111 111 -142 81 -230 -73 58 194 270 111 82 -28 -104 -168
7705a68J46J92l22J22K42k73L23l19m2K57l04L67n5j72n5j4K96m66O7K15k03J76
7727A0N1j54M0j80L53k11L17J16j98q0m2P1l46K17j27J25J7N7l4o1m6O2q0L4L7
7752e2r5K53nP2m01J50M63k61p5J17l6O7j56j12K5N0J3J48j81O1k76J86r2N04
7776C67j30k70o7R3L8N6q6j09m3J57j07m8L44%k44J60j67j74K20K27j07q7Q2m16
7800c11N52k65J49oq8K3j48j67M61j93L05l84o3L9R7Q9j16j97M26k25l3M47k83
7823A09l2J4l8o2Q2m16L14q2J51n03L73J40k64P8L00n1M2k54Q6j33qJ94k91L89
7847A38j71p9K12j08l8J40K9J4J11r4k62p8K39j8n5p7K79j62K22k34L7K91n04
7870a68O1m7R3m1N4K19p5m67L88k03q1L83O8k02J10k78J93q7j0R9J6k63P0K22
$$ plain form
7705 -168 -22 170 -152 -30 212 -61 262 -57 -99 158 -146 221 166 -6 -61 -75 221 -245 -178 37 -166 10
7727 10 61 -93 -53 -233 120 -91 226 342 144 64 22 93 -253 -36 -163 -38 -21 36 2 -59 -105 -43 -123 -89 -52
7752 -52 -147 106 101 173 -228 -78 385 124 49 166 130 197 41 -71 -46 4 17 165 -16 45 -231 -45 -137 367
7776 367 237 -33 -100 -7 31 87 1 -108 -151 6 -101 -149 195 195 -49 111 -56 -230 -10 217 110 23 105 -311
7800 -311 241 -24 125 119 31 54 -94 -261 200 7 312 -72 -135 -96 1 90 -26 -223 203 -22 -55 392 109
7823 109 77 91 53 -9 73 -343 -29 -111 40 -463 -90 50 -214 -136 164 113 155 -99 -13 -146 -154 40 -251 138
7847 138 -33 -112 100 -8 -46 94 123 137 248 154 -108 -186 53 35 -20 -97 182 20 242 8 45 336 -168
7870 -168 -107 -154 -61 -102 -48 171 96 -371 17 -186 -267 116 184 -18 92 -186 7 -80 -90 9 25 -238 -168 54
7894E4k21O5K37j91K68l65L00p3l03J79J65Q8j73j5m8P4k85L38n8M2m5k39K25
7917A9L2j13q6J15J7M6qJ39k53K45k80L52j83l20J70M1R8j93L46j54j37L93r8
7940A88k71lM9L5j58K18Q0o3l1n8J71k08p5J65k42K56j69K91p5n9k14L4K22j40
7964e7o0L2J73k41J28n5p0M8M96k80l88M15m7r4o9N8J7j04K80n35L47J15j37P1
7988D3J71k92NK59j11r0l3Q9p8j38L11k56K64r2J43l04J62k03K16r9o1N2L04O0
8012C22n00J61K93o8m19L10R9l02J25M2j30P4j88J31K1k34L42K86l89Q3j29o6
8034a36K34j74K23k17K53l16K18J01k47r7K82m6k41J99q4J14o2j27K05l49J95
8055g2J27J44m67J53L31L9k49Q0M0r8l13L06jk11L7K9L69l42K49j67K43o9j77
$$ plain form
7894 54 -167 -102 135 -56 212 -153 147 74 -229 -50 115 203 30 15 -33 41 -244 94 36 78 33 -206 19
7917 19 51 -62 -148 -33 -16 30 22 161 -92 153 -127 225 42 -278 -108 -67 31 -162 184 30 -107 286 188
7940 188 -83 -86 -37 -2 -160 58 138 75 44 -14 157 -51 -126 39 -203 53 -116 175 100 41 -173 -139 83 -57
7964 -57 -117 -85 88 -153 -25 -80 -150 -102 394 114 -274 141 94 0 -69 -11 6 -98 182 -353 -6 109 -28 43
7988 43 214 -78 -73 186 75 -15 -48 41 -37 -175 136 -120 144 52 195 -109 53 -150 66 -33 -94 -42 262 322
8012 322 -178 -17 276 208 -211 99 198 -104 21 63 -67 7 -181 -50 -29 -263 79 365 -24 59 -70 -136
8034 -136 98 -76 147 -70 183 -133 85 186 -61 -158 124 78 -163 36 -48 66 4 -123 82 -267 -72
8055 -72 55 199 -268 -115 216 255 6 86 126 28 -285 21 20 -191 -154 -125 244 -98 151 -16 227 158 -19
8078a9PK92o25M96k58J66l62J15L30k23J35q0KQ4l17L01J8j83n9R8K83m65O6j2
8102b10p4M16l0J3m8m84L47R2o5k9K3k4K03k15P4J69l27M41k60k12J72K08o3J41
8126B58m23L16j48j05k6M20k33l05K46K10j28j48K77M2k58j7l6M3M9j60L36k97
8148h7J74n4J53l29M6K27j74p6R3n0M8N1O4n6k13J46J44q2l6j27Q6J26j54J04
8172B4K3j02K43l54K11o0kJ41l41L82j11N9p2l57M45j13J77m96K15
$$ plain form
8078 -19 -12 280 -345 151 -107 59 -303 -188 142 -81 54 -26 -24 60 -257 44 62 -121 -180 -82 201 -264 -198 -210
8102 -210 -284 132 102 115 67 -417 -70 22 -43 -72 -49 -73 130 -85 -11 158 -169 272 12 -200 -28 180 117 258
8126 258 -165 151 3 -102 -128 292 59 -246 0 210 82 -66 211 253 -5 -22 -58 -15 34 -126 210 -87
8148 -87 87 33 186 -143 -97 130 -44 -120 -27 -77 -29 22 86 30 -183 -37 107 25 -11 -138 -52 74 -80 24
8172 24 47 -55 188 -166 45 -15 -17 124 -217 165 54 113 41 -316 129 16 193 -303 -88
8191h8
$$ Imaginary data points
##PAGE= N=2
##DATA TABLE= (X++(I..I)), XYDATA
0@%%%%%%Qj6J6j6K4l2M0m8N6p2Q8j09J33j60J92k28K70l17L68m24M86n56O35p23
30c85Q21r30J051j182J325j483J655j842K046k269K512k778L067l382L727m105
46b152M519m969N462o005O605p269Q011q847R789j0861J2099j3539J5237j7272
60i192J9753k2854K6831l2100L9394n0072O6987r7258J65387n25331o5515J175071
72F91101j037445P24666p27740N53799K40127j018694Q29523l01356J38341m09970
82c17648K98333K42667n21478M70747m20737O83192o00538m359O63045q70116
92c76892P00345n98521L25648J98296p49330P92881m51844K61751k14082J8131
102i3617M21671n39065L12900k34983M67198m58253j50917O75784o41435L86856
$$ plain form
0 0 0 0 0 0 0 0 8 -8 8 -8 16 -16 24 -24 32 -40 48 -61 72 -88 104 -124 146 -171 197 -227 259 -297 338 -385
30 -385 436 -494 557 -625 700 -783 872 -970 1076 -1193 1319 -1459 1608 -1774 1953 -2152
46 -2152 2367 -2602 2860 -3145 3460 -3809 4202 -4645 5144 -5717 6382 -7157 8080 -9192
60 -9192 10561 -12293 14538 -17562 21832 -28240 38747 -58511 106876 -418455 -483970 691101
72 691101 -346344 378322 -349418 204381 444508 -574186 255337 -46019 92322 -317648
82 -317648 -19315 223352 -298126 172621 -248116 435076 -165462 -169821 493224 -376892
92 -376892 323453 -275068 50580 248876 -500454 292427 -159417 102334 -111748 -93617
102 -93617 328054 -211011 101889 -133094 334104 -124149 -275066 400718 -240717 146139
112A46139m63981M80233J03463q23941Q95240l83238J41043k35369N2089N36631
122D48309q20728M59561r0969J45985k20963k07459P32630p34224L35036r8258
132e1080P0709K04962o74731Q14110m06409m7430J80014k26565M40248n83458
142b79630L23483M9946j41748N0158j83802M52624m28663J49170P969K2302J59316
153A81125n25716O10970k56389r5979J37170j95761M52356n78959K35523J99903
163A64243k49135R8566j81147M28475l33555l2491J98384n7980O0499l76228N15917
174B35548k24178j71018K33559j80440L38158n00878K88384J92328l92074K75055
184I4444k02572L09073k53524r6131L37364k62998J16903k07856K86277p4906
$$ plain form
112 146139 -317842 162391 265854 -558087 337153 -46085 94958 -140411 -88322 448309
122 448309 -372419 87142 -3827 142158 -78805 -286264 446366 -287858 47178 -51080
132 -51080 19629 224591 -450140 363970 -42439 -89869 90145 -136420 303828 -279630
142 -279630 43853 93799 -47949 2209 -181593 271031 -157632 -8462 -493 21809 181125
153 181125 -344591 266379 9990 -85989 51181 -144580 307776 -271183 -35660 164243
163 164243 -84892 13674 -167473 261002 -72553 -105044 93340 35360 95859 -280369 235548
174 235548 11370 -159648 73911 -106529 231629 -269249 19135 211463 -180611 94444
184 94444 -108128 200945 -52579 -148710 188654 -74344 42559 -165297 120980 46074
194D6074k31112K97765j75403K09887k97428J48796K09459l75556K44887j57587
204h0218K04665j48686j60024L67467k55950Q0827j07121J78452J9126k82584
214a84046K94348j07550P6211j91596R6555K06020l69534K10629o4744J13896
224H0189j12095j31048L71996k81166O2261j6716Q8189L1801k81645L10233j17075
235D924o738o4617L5563J87165l29861K05194j5530J8824l5376j21228L16666
246A94986k60791L9697L7593O179N6467k53657K77517q1214o3648K2515r75J68164
258A42833k77376J50500N0182n9688r875r0791K50008k12914r364R7430k2929
269H016L2244j86547K38277n1028j04903P1012n838J10029k22265J14171P5108
$$ plain form
194 46074 -185038 112727 -62676 147211 -150217 -1421 208038 -167518 77369 -80218
204 -80218 124447 -24239 -184263 183204 -72746 8081 -99040 79412 98538 -184046
214 -184046 110302 2752 78963 -112633 -16078 189942 -179592 31037 -33707 80189
224 80189 -31906 -162954 209042 -72124 -9863 -26579 61610 93411 -188234 121999 4924
235 4924 -1814 -66431 -30868 156297 -173564 31630 16100 34924 -452 -121680 194986
246 194986 -65805 -26108 11485 17664 74131 -179526 97991 16777 -46871 -24356 -25331 142833
258 142833 -134543 15957 66139 6451 -3424 -94215 155793 -57121 -66485 30945 8016
269 8016 40260 -146287 91990 40962 -63941 7071 1233 111262 -111003 3168 78276
280G8276j10039J4585m9361J76487j57901k2948J24999m4162J4872j18111J74735
291H1432l5018j16002Q3003q812O1485j62067Q3002Q7803j19218K4723j2268J20627
303H8690j11757m1774J34971n1512k0395o0885J18007j6753j21440Q3682K1042
314B1876O888j02603O8331Q5619j13260R454L0798O0366q9168l9911J23350m8382
326A3358m9991l539P9711j1138j01838P7862M4045m1894n2295N5466N7853r4619
338b7019j0940O1468J3280p2195j3980R4901l0904o0175L0758N7713j9695p4227
350e1015N8591M8901o7961k5825M4172L5144o5513l0560Q6248o115o2402J0243
362b6092O2251j519p8822L6348O0872m5152n3002M0135N8487p6816k5646O4344
$$ plain form
280 78276 -31763 -17178 -66539 109948 -47953 -70901 54098 9936 24808 -93303 81432
291 81432 46414 -69588 13415 4603 66088 -95979 -12977 74826 -44392 -19669 -31937 88690
303 88690 -23067 -64841 70130 18618 -1777 -62662 55345 38592 -82848 834 21876
314 21876 28764 -73839 -5508 80111 -33149 -23695 7103 67469 -21699 -61610 61740 13358
326 13358 -36633 -40172 39539 28401 -73437 4425 48470 6576 -45719 9747 67600 -27019
338 -27019 -37959 23509 36789 -35406 -49386 45515 14611 -45564 -14806 42907 23212 -51015
350 -51015 7576 56477 -11484 -37309 6863 42007 -23506 -54066 32182 26067 -36335 -26092
362 -26092 36159 34640 -44182 -7834 53038 7886 -45116 -4981 53506 -23310 -48956 15388
374A5388J9869n4822l4712J07856k2893p4747M2302L4157J102r2601N2910O5239
386E9048r0001m234L5315M3050o6903k0171Q8192k3812l6404j3864P9370l0743
398A8843o9471O3543m934J3004p4215M2309P0982j04480L9503L368L9506l2964
410D994o1256J13913m5771l1283q973N2967P685j01708P5238J3197P43p0239M0261
423a0232R9350j42107M7062J8863K3139l8177p9903J65132q9697m1987M5527K0271
435A7241J7706j13811J10069P539m9334j3998K7934O9541j41185P3384Q812j1578
447B320L5p8414J60277j11051l555N7440m0803P4865j31647R8409J1126o6934
459b7932K5910k6836R6137j23662L8177M0796j8390Q463r5241J83581j10529l7543
$$ plain form
374 15388 35257 -19565 -54277 53579 30686 -44061 -1759 32398 33500 -59101 -6191 59048
386 59048 -30953 -35187 128 43178 -23725 -43896 44296 20484 -15920 -29784 49586 18843
398 18843 -50628 12915 7981 20985 -53230 -10921 60061 -44419 -4916 -1548 37958 4994
410 4994 -56262 57651 11880 -19403 -28376 24591 32276 -69432 5806 19003 19746 -50493 -10232
423 -10232 89118 -52989 -5927 12936 36075 -2102 -82005 83127 -6570 -48557 -3030 17241
435 17241 34947 -78864 31205 38744 -10590 -24588 3346 72887 -68298 5086 13898 2320
447 2320 2355 -76059 84218 -26833 -30388 27052 -13751 61114 -70533 27876 39002 -27932
459 -27932 -2022 -28858 67279 -56383 -18206 22590 4200 12663 -82578 101003 -9526 -47069
471d7069Q5213m9380P7892j71312J33758L6861j44715Q3608j9669Q3082j28324
482f0055L1327J03056q5697M750l8747J41652j26243k4946J07067p9531P0256
493D2889j36299J35947N632j34505J39598q1679Q4540q6156L94J05727j18296
504d2208N4975n2641Q8312n8765m6175J02246p2298P5266j27750J17251K9248
515F7461j57292J44421q3291R1066j02519k6287J83811j82347M8779Q48O2476
526D7126l7391j03347J72324o6649j5484n0308J01025J3850j70831J54283m6432
537a834K4316o5929M26J53954j90402Q1068J8523n273J091q1197J40552q8014
549a2719n085L918K8206J6605j15153J34009o0760K1896k3809k5323J47263j84206
$$ plain form
471 -47069 38144 -11236 66656 -104656 29102 65963 -78752 4856 -14813 68269 -60055
482 -60055 -28728 74328 -11369 -6619 -45366 96286 -29957 -54903 52164 -27367 42889
493 42889 -93410 42537 48169 -86336 53262 -28417 56123 -30033 -29639 76088 -42208
504 -42208 12767 -39874 48438 -10327 -56502 45744 -26554 48712 -79038 38213 67461
515 67461 -89831 54590 -28701 62365 -40154 -66441 117370 -64977 -16198 -15350 47126
526 47126 9735 -93612 78712 12063 -3421 -53729 47296 61146 -109685 44598 -1834
537 -1834 22482 -43447 -43021 110933 -79469 1599 20122 14849 15940 -65257 75295 -12719
549 -12719 -17804 -13886 14320 30925 -84228 49781 -10979 10917 -12892 -38215 109048 -75158
561g5158Q0500K2622l1203L3341j27319J74324o8499o8046O0612J2815L9876j46383
573i2518J22148J9002n7771j5623l918J46119k03134N8706Q3673q0868M4951j14868
585i4101J81697p2148j07229J57412o7961L0132p9773O7453M5185j19796N5460
596c669P965L7823j06159N6986N7774q2559M8256o8168J33345q7739o2887J45091
608G6059j06161O5695r6192O1962P5799j65898J03233j6216M2844o9019j9107
619d7001J32100j03242J1505l0042J03520n8930j00083J57824q1064L3582q2136
630f3967P5883P7921k00249J51474k8062J0554m2385l4527J66814j76888M4911
641a8521K8193J0391j2057j00372J79003r7725r272J2493J8592O0220j69352J41278
$$ plain form
561 -75158 5342 27964 -3239 30102 -97217 77107 8608 -59438 1174 13989 53865 -92518
573 -92518 29630 48632 -9139 -24762 -28680 117439 -85695 -26989 56684 -24184 20767 -94101
585 -94101 87596 15448 -91781 65631 -2330 27802 -51971 15482 60667 -59129 -3669
596 -3669 4296 42119 -64040 -7054 50720 -31839 16417 -51751 81594 -6145 -69032 76059
608 76059 -30102 35593 -60599 1363 77162 -88736 14497 -1719 41125 -27894 -47001
619 -47001 85099 -18143 -6638 -36680 66840 7910 -92173 65651 -15413 18169 -63967
630 -63967 11916 89837 -110412 41062 13000 23554 -18831 -53358 113456 -63432 -18521
641 -18521 9672 20063 8006 -92366 86637 -11088 -20360 -7867 10725 70945 -98407 42871
653D2871j9792l4227P15l6509J38156j53382M4516L7408r642R738j00058J62706
665H2500q5345j8839K0016q17P3136j72401J31270N7n4155K0925m4122J46245
677I8470j53342K7891P5504m5718J0776q7605J56766q5723m8967O5019j2076M8348
689D9343j51955J45325J29q9383N9863m2422J22068j55309L4735R9893j04762
700c2475M2220o8614J23484o5739o7549J10939m4919L2944r6539J01290J3995
711D9037j02927P0538l2671P7565j15984K3075R9530j06606M1832m3821R6338
722E5906m6905p7375J22191m9210J0534o5561P3697K7433j16393P2231o754L8977
734C8771q7612K1843J01209j09291L1572j2048O7283m8135p2281J29688o1977
$$ plain form
653 42871 23079 -11148 -10433 -46942 91214 -62168 -17652 19756 10114 19852 -80206 82500
665 82500 -2845 -21684 -1668 -2485 70651 -101750 29520 29577 -24578 -3653 -47775 98470
677 98470 -54872 -26981 48523 2805 13581 -74024 82742 -2981 -51948 13071 995 49343
689 49343 -102612 42713 42842 -46541 13322 -29100 92968 -62341 -27606 72287 -32475
700 -32475 9745 -58869 64615 -1124 -68673 42266 -2653 30291 -66248 35042 49037
711 49037 -53890 16648 -16023 61542 -54442 -31367 68163 -38443 3389 -40432 55906
722 55906 9001 -68374 53817 4607 15141 -50420 23277 50710 -65683 6548 -206 38771
734 38771 -48841 -26998 74211 -35080 -3508 -15556 51727 3592 -68689 60999 -978
745i78p551k9192N6986K5236j19500R2530J63j78n0043J6163R3785j19417L1678
758a0318J6549K2021l2896o2228J27714o5268k1773J3457K9505K5760j09558R0391
770B3356Q255l5945j5223M659P8591j07164K0738M3717j0760j6119m5898J08021
782E6228n1113l8186L9655J1489J3564q9862P5996J6568n8471O407P741O0574
794E0590r2116J7263O2784l4975r925k7481Q8587m8523n0050O2069m458j890o5253
807e3378O9149J9162p2172K8302J3459L7135p7015J8415O6238n6723j845j3024
819b2297O4382m2620n0399P6343j7657q039l7073N3814K1981p5964L6915J6666
831A6052J1720n8046J3651O1989o1183l145N673M6625l7337m4249Q2980k2282
$$ plain form
745 -978 -8529 -37721 19265 44501 -74999 17531 17694 17516 -32527 -16364 77421 -41996 -10318
758 -10318 6231 28252 -4644 -66872 60842 -4426 -26199 -12742 16763 42523 -67035 23356
770 23356 31611 -4334 -19557 -14898 63693 -43471 -22733 20984 10224 -5895 -51793 56228
782 56228 5115 -33071 6584 18073 31637 -58225 17771 34339 -24132 -17725 -9984 50590
794 50590 -41526 -24263 38521 3546 -6379 -33860 54727 6204 -43846 18223 13765 11875 -53378
807 -53378 15771 34933 -37239 -8937 4522 41657 -35358 -16943 49295 -7428 -9273 -22297
819 -22297 42085 -535 -50934 25409 7752 -287 -37360 16454 38435 -37529 -614 16052
831 16052 27772 -30274 -16623 45366 -15817 -18962 -13289 33336 -4001 -48250 34730 12448
843A2448k0131j4093M1844J6009p8616M2236K3707j7376l7201J9571N1004n8575
855a9173k013K6284K4455l6950k5691P1361k8802k4287J402K8437P500o5755M2707
868e25K2771k6822j6759J6810M0450m6241r421L3706J1525l6708j6688N7430k1907
881G621l0654Q852L1247Ln8360M5449K8824m1891q282K2748K8346m7725j3960
894b7782N3329j1758m1079J1115M0862j9769l3942K8001K8885k6905k7984M1167
906A4140J3661m4898K422K7740J76l0229m639M4018j6051l2661K7681J5096r386
919G070k3543J5098L0274l4124j4746K7774P989k6939j0441L1304N716l0967l405
932a8940M4466j2418l6781K5650J8409j1397l5897K5699L2836n0971l035L3481
$$ plain form
843 12448 -7683 -21776 20068 36077 -42539 -303 23404 6028 -31173 -11602 39402 -19173
855 -19173 -21186 5098 29553 -7397 -33088 38273 9471 -14816 -13414 15023 22523 -43232 -525
868 -525 22246 -4576 -21335 -4525 35925 -10316 -19737 13969 25494 -11214 -27902 29528 7621
881 7621 -23033 -14181 17066 17069 -41291 4158 32982 -8909 -17191 5557 33903 -13822 -27782
894 -27782 25547 13789 -27290 -16175 24687 4918 -29024 -1023 27862 957 -27027 14140
906 14140 27801 -17097 -14675 13065 13241 -16988 -21627 22391 6340 -26321 1360 16456 7070
919 7070 -16473 -1375 28899 -5225 -19971 7803 15792 -11147 -21588 9716 15432 -15535 -18940
932 -18940 25526 13108 -23673 1977 20386 8989 -26908 -1209 31627 -19344 -22379 11102
944A1102O321l5163j947M8533k0086k7612J3524L5136k7454l3973M8205o628j7369
957g411j3616K5289K2033n8441L1845J6648j3446n123j2360M4792l3626j2079
969a5495K1500k525K809l2827L4008K224j7614J936J618L3934m5855Q184K5951
982A7848j3975l822k6101N0981j9789l5388L4444M997j198l8031M0046J6996m2527
995a5519O627J8550J7220n4906J9756L3166l3051l278m355M6536m1465j3953N0548
1008B5876k6052N209k3330L6831l519m2929M0418j6093J3599k9354J2635K8996
1020B2287m2192K7952k0242L1184j3300k9394M8954l2727J9985l1774J6499L0724
1032B7956o0438L6571q197K0935k6549j3339O2911n0726P981m353K8535j3878
$$ plain form
944 11102 17423 -17740 -19687 28846 8760 -18852 -5328 29808 2354 -31619 16586 9958 -7411
957 -7411 -21027 4262 26295 -32146 -301 16347 2901 -2222 -14582 30210 -3416 -15495
969 -15495 6005 3480 6289 -26538 7470 9694 -7920 -5984 -4366 29568 -16287 -8103 17848
982 17848 3873 51 -26050 24931 5142 -30246 4198 9195 7997 -30034 10012 27008 -15519
995 -15519 -8892 9658 26878 -28028 -8272 24894 -8157 -11435 -15790 30746 -10719 -24672 25876
1008 25876 -176 5033 -18297 18534 15015 -27914 12504 -3589 10010 -19344 -6709 22287
1020 22287 -19905 8047 -12195 18989 5689 -23705 25249 -7478 12507 -19267 -2768 27956
1032 27956 -32482 4089 -4108 16827 -9722 -23061 39850 -10876 -2895 -7248 21287 7409
1044G409m7137O8745l2410j361j2786K2701K2651o9679N9882j0199l941j0901
1056g026l275N0964p1779L3758J493k466K48l5236O9551n2396J2800O481p094
1069c977L3898o5865N7756j8749n844O605l0871O4243o1827J9830P043k238J8386
1082A8390n8661P3484l1090r542Q414p643M3408p9254N1507L030k2429R665k3423
1095b4144O6263o8428J9330K6212k2148J4967m5129P2701m6805j2102L2359k3384
1107a0308L2896o4329O0531o900l2342L3085k9945N5394o3297K3244K4010l6907
1119a4868L1362n1973O5782l4679j9655M1656l4181M7012o4315M1996J8960m9890
1131b2793L6404l1441N0350m8537n081M7676l9349J7860l2649N4943k3821l1299
$$ plain form
1044 7409 -39728 29017 -3393 -4754 -17540 5161 27812 -41867 18015 7816 3875 -7026
1056 -7026 -10301 40663 -31116 2642 4135 1669 1917 -33319 36232 -16164 -3364 3117 -3977
1069 -3977 29921 -35944 21812 3063 -2781 3824 -27047 37196 -24631 -4801 2242 4 18390
1082 18390 -40271 33213 2123 -7419 995 -6648 36760 -42494 9013 12043 -10386 -721 -24144
1095 -24144 42119 -26309 -6979 19233 -2915 12052 -33077 39624 -7181 -19283 13076 -10308
1107 -10308 22588 -41741 18790 11890 -20452 12633 -17312 38082 -25215 -1971 22039 -14868
1119 -14868 16494 -35479 30303 -4376 -24031 17625 -16556 30456 -33859 8137 27097 -22793
1131 -22793 13611 -17830 32520 -16017 -21098 26578 -12771 5089 -27560 27383 3562 -27737
1143b7737M9997k6947K5943n1871M3080J3868n9796M5857k4147L3296m0556R39
1155a8074N2768n4095K4596j7299L4780j8216l1518N3110l3299J7517l4804L0693
1167F159J5558n6483M8652k3435K8493k9425q716O0055n9593K2757j1632K1394
1179A3784l486m7977O2031k6754l5j3625J8348K6948o2631M3248k352L109j9040
1192h432r986N8727o1086J2597J0096N070j436m1590O3773k5000j3120P576Q080
1205E269K0747n8423M2700J719j5517l569r665N0620n7104J2645K2524j0064O213
1218H095l7821N9558k3663k3228K1922l880K0159n4294L7551J2368k9394Q289
1230d338r456M7825n1663L903L6076k2970P174l3523N3360j8912l6358L8123r675
$$ plain form
1143 -27737 22260 -4687 21256 -30615 12465 26333 -33463 12394 -11753 21543 -19013 -18074
1155 -18074 34694 -19401 5195 -12104 22676 4460 -27058 26052 -7247 10270 -24534 6159
1167 6159 21717 -34766 13886 -9549 18944 -10481 -19197 40858 -18735 4022 -7610 13784
1179 13784 10298 -37679 24352 -2402 -2437 -16062 2286 29234 -33397 9851 7499 10608 -8432
1192 -8432 -18418 40309 -20777 -8180 1916 6986 5550 -36040 27733 2733 -10387 -2811 5269
1205 5269 26016 -32407 10293 12012 -3505 -7074 -16739 33881 -23223 -10578 11946 1882 8095
1218 8095 -29726 29832 6169 -17059 4863 983 21142 -33152 4399 16767 -12627 -4338
1230 -4338 -13794 34031 -17632 -13729 22347 -623 6551 -26972 26388 7476 -28882 9241 -434
1243d34J4326m3620L3360K1827m4356J9046l287L1793m4921P36M3584l5839N930
1256a855j9031M3458j8384l7506N1224j6132O920l0484K9268K1396n3904K7820
1268B790j461J6601l4802j234M7739m2756Q009o960L2461j4097l6782N4578k0626
1281C460L73k0795K1889K1690n7653L3011J638N910k3567k713N0176m4771M634
1294f718N835J9299j3658l4971N3927k0186j0441q398K0808J7067n6579L8603
1306D588P393p219j5924R00M5479m9605L846J7516L904j2865k6844N1659k0446
1319B382j6559Q075J5318Q339m5989L7532O552j7318p663K872L4894m6939O309
1332a2195K2360n910p748j9127M5577j7682k0865J6588J0509J286l7895L1422
$$ plain form
1243 -434 13892 -29728 3632 25459 -18897 149 -3138 28655 -16266 -15530 28054 -7785 -1855
1256 -1855 -20886 22572 4188 -33318 17906 1774 8694 -21790 7478 28874 -25030 2790
1268 2790 1329 17930 -16872 -18106 29633 -13123 -5114 -12074 20387 6290 -30492 24086 3460
1281 3460 3833 -16962 4927 26617 -31036 1975 3613 9523 -14044 -16757 33419 -11352 -6718
1294 -6718 -883 18416 4758 -30213 23714 3528 -6913 -15311 5497 22564 -34015 4588
1306 4588 11981 4762 -11162 -10262 35217 -14388 -10542 6974 10878 -1987 -28831 22828 2382
1319 2382 -14177 -6102 9216 17555 -28434 9098 15650 -1668 -9331 -6459 28435 -18504 -12195
1332 -12195 10165 4255 -3493 -22620 22957 5275 -15590 998 11507 12793 -25102 6320
1344F320R925k4387m523R436K7237m2919N905K9848j1235j1116j0377M1676k0115
1357E675k7488K7094O518r388k7146L0990J0508l1299L811J7905J1523l6223J0641
1370f879K8107j9737j0753M81K9133k2221k0975L1574n70j1387j3544K4781Q831
1383A6841l0941Q690J7292K75k6846Q206K4896k0444j1192P130K3123j9556j9432
1396b1958L3905Q5j7499o655K3110O849l5767J0915K3420j2640k2427J3702K3542
1409A8582k3428j2861K2086J4424k6215q107L3169p428k2455M432K1142n931k8239
1422b0829J8359J7969j9059j1583J8309J2775k1458m980J9136M862k2460k425
1434a1384K5110r866j5973N156J6428l051k4641J8472J6484j9004q455J4239J3466
$$ plain form
1344 6320 16245 -8142 -12665 -3229 24008 -18911 -13006 16842 5607 -5509 -15886 25790 5675
1357 5675 -21813 5281 11799 2411 -24735 6255 16763 -14536 -10725 7180 18703 -17520 -6879
1370 -6879 21228 1491 -9262 -8781 20352 -1869 -22844 8730 8160 -3227 -16771 8010 16841
1383 16841 -14100 -5410 11882 12157 -14689 -6483 18413 -2031 -13223 -6093 17030 -2526 -21958
1396 -21958 11947 12032 -5467 -12122 10988 17837 -17930 -7015 16405 3765 -18662 -4960 18582
1409 18582 -4846 -17707 4379 18803 -7412 -15519 17650 10222 -12233 -7801 13341 7410 -20829
1422 -20829 -2470 15499 -3560 -15143 3166 15941 -5517 -10497 8639 13501 -8959 -11384
1434 -11384 13726 3860 -12113 -6957 9471 6420 -18221 251 16735 -2269 -10724 3515 16981
1447A6981k2657r005K5420k51k4785K372K6540r821k2266J5205J9100j4425j9727
1460a7319K3189J3809k9695k253K3471k347k1217M68K5966q987k3943K0467J2748
1473A4357j5506r058J3361J2303k1592m963J9868j997j6356l50J8626m242j5079
1486a0628O273J4626l312j9323J3009J3217j4807r053Q669J4732j8224j1717K4173
1499G635K228j9873J25K1730k182k1396O676K2410j4213k1142K2426P630j9045
1512f991o479J8067Q566k7353O970K1813j0236j4218P744J8665j8492r830J5381
1525C607M962j1969j1871K4325l448j5395P359N931Q393k1801N726J8310j4876
1538g47l820j461J5267p019j7061J6226N994p188j2597J6946Q732k0209K077J0554
$$ plain form
1447 16981 -5676 -14681 10739 10488 -14297 -11925 14615 4794 -17472 -2267 16833 2408 -17319
1460 -17319 5870 19679 -10016 -12269 11202 8855 -12362 -11894 14072 5085 -18858 1609 14357
1473 14357 -1149 -10207 3154 15457 -6135 -11098 8770 6773 -9583 -9933 8693 4451 -10628
1486 -10628 -4355 10271 6959 -12364 645 13862 -945 -9998 -1329 13403 -4821 -16538 7635
1499 7635 9863 -10010 -9885 11845 9663 -11733 -5057 17353 3140 -18002 4424 12054 -6991
1512 -6991 -13470 4597 13163 -14190 -7220 14593 4357 -9861 -2117 16548 -1944 -11774 3607
1525 3607 8569 -3400 -15271 9054 5606 -9789 -2430 3501 11894 -9907 -4181 14129 -747
1538 -747 -4567 -6028 9239 2220 -14841 1385 7379 191 -12406 4540 13272 -6937 -4860 5694
1552E694N690k1500J456K3264j6973q831R410J1602j0923j3032K2553K479j8702
1565g813J359J8380n986j7771R601J1001o689j7357J5491J1977j9812J477R254
1578C112P232j3201o169J9772n761j1040J83J2075k009j5575R451O294l07j2907
1592h850O543J6221j8514J779M425N246n400j5653K3589n679j3677P744M715M586
1606G075j8795J1418J2768j5104l207P329J1012j8990k424J7794o771p857m120
1619i872J9873o233j7715J7704L312m095j1069Q699J2428j8911j011R867K696
1632E673j1753j848J4253l673o980j320J5430o261j1739J1814oM9j2783Q485R386
1647H727j6473L769M036O940j1991j091J6525r792j557m369J5172p004j6297K0259
$$ plain form
1552 5694 11384 -10116 -8660 14604 -2369 -11200 -1790 9812 -1111 -14143 8410 10889 -7813
1565 -7813 -6454 11926 5940 -11831 -2230 8771 2082 -15275 216 12193 -7619 -6142 3112
1578 3112 10344 -2857 -9026 10746 4985 -6055 -5872 6203 4194 -11381 -1930 4364 4057 -8850
1592 -8850 -2307 13914 -4600 -2821 1604 6850 1450 -14203 9386 3707 -9970 -2226 2489 7075
1606 7075 -11720 -302 12466 -2638 -5845 1484 12496 -6494 -8918 8876 2105 -5752 -9872
1619 -9872 10001 3768 -13947 3757 7069 2974 -8095 604 13032 -5879 -6890 2977 5673
1632 5673 -6080 -7928 6325 2652 -4328 -5648 9782 3521 -8218 3596 3590 3639 -9144 -659 8727
1647 8727 -7746 -3977 59 6999 -4992 -6083 10442 650 -907 -5276 9896 2892 -13405 6854
1661F854o571R63j0726Q418J4894k7088J4134L409Q94o554q021K4611j7726l509
1675f018N137M774n57j8496K1622k800o286j150M109J3026k3358J0288N675m396
1689A570l591p040K0170j4740l402P340L290l55j4296J8707l223o431j089M612
1703A522Q965k2162J1697L126k641m421m234K1499j8206O81P244J190J015j7544
1717a2269K2436p250q596L748L64J1668k3989J3150P835r472J370m857K0098j7405
1731c169l291J2512m069R0j4238J9463m202j2232R378K0Q230j8833J0673R619
1745I951j2936K047k262J3517j4114m529J3935n596j173q366J6911l393j1925
1758g933R955J200M075j6612J0077Q890j5074K590n61J1912j3547l915J7319p873
$$ plain form
1661 6854 283 1246 -9480 -1062 13832 -13256 878 4287 5181 -1373 -9394 15217 -2509 -6018
1675 -6018 -881 3893 3336 -15160 6462 3662 -2624 -3774 335 13361 -9997 291 5966 1570
1689 1570 -2021 -9061 11109 -3631 -7033 307 3597 3242 -11054 7653 4430 -2001 -3090 1522
1703 1522 10487 -11675 22 3148 507 -3914 -8148 13351 -4855 -4174 3070 4260 5275 -12269
1717 -12269 10167 2917 -5679 -1931 -1567 10101 -13888 -738 7097 -2375 -1005 -5862 14236 -3169
1731 -3169 -6460 6052 1983 2073 -12165 7298 3096 -9136 242 262 8492 -10341 332 9951
1745 9951 -2985 -938 -3200 10317 -3797 -8326 5609 13 -1160 -9526 7385 3992 -7933
1758 -7933 2022 3222 7297 -9315 762 9652 -5422 -2832 -3393 8519 -5028 -8943 8376 503
1772E03j638m724J4209l110j4815J3045J23r49j1477Q030R639j6945N026L254
1786A71O509r515m406J7936r840l079j161R012j369j5490J3613N11l233o668O137
1801h72J1220j6792L883O548J747p891n458J7960r647p316L770P398j942j4639
1815a2031J5660K297q133k699P270Q823j9179N511R156n134o057k712J7099j1931
1829b060o279J0835J571j956j0726J4480P85j1241K742L400N744j5694M855Q892
1843E348o496j928k900J5346q673p991J1664j93j242j2179J3187L730j5136L655
1857c808N029N695j6118M555J4575j0190l972J279J4870j2744q886J6347l105
1870C527n662p376J5478k97j6828J0845N163n23j2502Q469J0822j5181Q25L445
$$ plain form
1772 503 -1135 -5859 8350 5240 -9575 3470 3593 2644 -8833 -803 8836 -8109 -3083 171
1786 171 6680 -2835 -7241 10695 855 -2224 -3385 5627 4258 -11232 2381 2892 -341 -7009 -872
1801 -872 10348 -6444 -2561 3987 5734 -2157 -7615 10345 698 -6618 -2848 4550 2608 -12031
1815 -12031 3629 5926 -2207 -4906 2364 11187 -7992 -2481 6675 1541 -4516 -7228 9871 -2060
1829 -2060 -8339 2496 4067 2111 -8615 5865 6650 -4591 -1849 1551 7295 -8399 -3544 5348
1843 5348 -1148 -3076 -5976 9370 697 -7294 4370 4177 2935 -9244 3943 7673 -7463 -3808
1857 -3808 1221 6916 -9202 -4647 9928 -262 -4234 -2955 11915 -829 -9715 6632 3527
1870 3527 -2135 -9511 5967 5670 -11158 -313 4850 4327 -8175 294 11116 -4065 -3240 205
1884B05P251j1520m770J5871p027l100k269J0521M18j3891J0018L373j675r635
1898f230M562J1090j3806p77M223P716r932o780J8315m786p291n04J1830j380
1912F250j6884J1219O448p550r084J0048Q981j6940J494J0599K564j2620j73J7847
1926A2199j1363p471O024P479o306j1761J4642J911r829j278R146L976j3392M157
1940a866P640j754r020R96J2830j0224n570O453M846l342j0188J2174M321j0739
1954c443p20Q302L353j2894N53J1712l727j1317M643J2180j0069p078R987O561
1968H043r338p220J5457L85j4222L270J0033l316j2128O315J0479r031o992J0334
1982B069O528j2340j175J0334L12r277k487J2746l812j1338O685O538l326q710
$$ plain form
1884 205 7456 -4064 -8834 7037 10 -3090 -5359 5162 5580 -8311 1707 5080 3405 -6230
1898 -6230 -1668 9422 -4384 -5161 -938 6778 -3154 -9934 8381 3595 -3696 -4200 7630 6250
1912 6250 -10634 585 7033 -517 -9601 447 9428 -7512 -6018 4581 7145 -5475 -5648 12199
1926 12199 836 -6635 -611 6868 562 -11199 3443 5354 -4475 -5753 3393 7369 -6023 -1866
1940 -1866 5774 4020 -5000 -4004 8826 -1398 -6968 -515 4331 989 -9199 2975 7296 -3443
1954 -3443 -4163 4139 7492 -5402 -4849 6863 3136 -8181 -3538 8642 -1427 -8505 1482 8043
1968 8043 -1295 -8515 6942 7327 -6895 -3625 6408 3092 -9036 -2721 7758 -1273 -8265 2069
1982 2069 8597 -3743 -4918 5416 5728 -3549 -6036 6710 2898 -8440 -1755 4783 1457 -7253
1996g253N652J0120r407m750Q436M179q900m437R822J746j0779p09J1849k051
2010C518j1322O023R088n690q010P026Q664j1550n169J2507m25j0839O57J0621
2024E099j265j2454O802J0835r040o596R017N692j0238n308J1286K221j2384N92
2038e741J1401k529r544L599R525l202j0171O842Q032r035m924O380N168p869
2052b068n449J0691J569r459N6J0412j806r047L412Q577m655j0320R059O136j1303
2067d195j569P661L999j0739j354J4470m971r817N515Q788o010r829Q734O526
2081G209r616o362J2227K427j1450J445Q373J910j1208J472J1560p029n790L323
2095a509O778n100q059R559K417n687l999Q681L373j1256L621M861O89r386P84
$$ plain form
1996 -7253 -1601 8519 -888 -5638 2798 6977 -1923 -6360 3462 5208 -5571 -6280 5569 3518
2010 3518 -7804 -1781 7307 1617 -6393 633 9297 -2253 -7422 5085 4660 -6179 -5522 5099
2024 5099 3834 -8620 -1818 9017 -23 -6619 2398 8090 -2148 -7456 3830 6051 -6333 -5741
2038 -5741 5660 3131 -6413 -2814 6711 3509 -6662 180 8212 -823 -5747 633 5801 -2068
2052 -2068 -7517 3174 4743 -4716 -4660 5752 3946 -5101 -1689 6888 2233 -8087 972 7108 -4195
2067 -4195 -5764 1897 5896 -4843 -6197 8273 3302 -6515 -1000 7788 1778 -8051 683 7209
2081 7209 -2407 -8769 3458 5885 -5565 -4120 4253 6163 -5045 -3573 7987 958 -4832 -1509
2095 -1509 5269 169 -7890 1669 4086 -1601 -5600 3081 6454 -4802 -1181 3680 4369 -5017 -4233
2110d233J2464j0504l716N895M739m694q708J3976Q12j0250J181Q014P62j2936
2124g198N066Q374n682p955N400J0174j1401k880Q995K841p128m578J1907k081
2138C854r050K157P281k062r549O580N186m049n944O352O455j0614J360M460J750
2153D167o256l633J2238o232n712L891M530j47j0524R714L768p156j784M004O884
2168G752j2718J029Q326l037m563k414J1996n016q042Q247K686k571p379P565
2182A861M607j0269k22O514J339q741J353Q037k965o020K961Q232o707m179O033
2197A834K456n225m567Q568j75p382J515N296R24q411M263O256m880k934J509
2212i53P233p552l594P480j273k773m102Q129J363q949M145M240o28o166J992
$$ plain form
2110 -4233 8231 -2273 -5989 -94 4645 -49 -8757 5219 6031 -4219 -3038 4976 5738 -7198
2124 -7198 -2132 6242 560 -7395 -1995 8179 -3222 -6102 2893 5734 -1394 -5972 5935 3854
2138 3854 -5196 -3039 4242 2180 -7369 -789 4397 348 -5596 756 7211 -3403 -2043 2417 4167
2153 4167 -2089 -5722 6516 284 -5428 -1537 2993 2846 -7678 2036 5804 -1352 -3136 868 7752
2168 7752 -4966 -3937 4389 1352 -3211 -5625 6371 1355 -6687 1560 4246 1675 -5704 1861
2182 1861 6468 -3801 -4023 2491 3830 -4911 -3558 4479 1514 -4506 -1545 6687 -20 -4199 1834
2197 1834 4290 -935 -5502 3066 2891 -4491 -2976 2320 3244 -5167 -904 5352 472 -2462 -953
2212 -953 6280 -1272 -4866 2614 1341 -1432 -5534 2595 3958 -4991 -846 3394 2766 -3400 -1408
2227a408P751p159l546M575L408n297l985Q486Q1n924M54O067M70q378L914N580
2243E089n141m082L610M880o201l006O506J869o202l20P013j231n293J228N050
2258C769k214o689N168L013m472k472L792M190n978j018N597L82m635j017O728
2273D144k613n173K489L520j173o991O383L194n749K58K423M116o725j292P595
2288D406l326l493RN393k037n849M725L014k315m354N776K413o079M43K463K126
2304C315o181k33O718m114k284J189M525j956m808N032K239l269l168M835J265
2319C105n663M63K936J535n887J147O094l946j547J098M788l220m743N921M33
2334B514l526k359M731N57n453J883L181O62n094J905N457n007q45J433K675l105
$$ plain form
2227 -1408 6343 -816 -4362 213 3621 -1676 -5661 2825 2906 -3018 -2564 3503 3973 -4405 -491 5089
2243 5089 -52 -4134 -524 4356 -1845 -4851 1655 3524 -2678 -2998 4015 2784 -2509 -1281 3769
2258 3769 1555 -5134 34 3047 -1425 -3897 -105 4085 -1893 -2911 2686 3068 -1567 -2584 4144
2273 4144 1531 -3642 -1153 2367 1194 -5797 586 3780 -1969 -1711 712 4828 -1897 -3189 4406
2288 4406 1080 -2413 -2404 2989 952 -4897 -172 2842 527 -3827 1949 4362 -1717 -1274 1189 3315
2304 3315 -2866 -3099 3619 -495 -2779 -1590 2935 979 -3829 1203 3442 173 -2995 1840 3105
2319 3105 -2558 -2095 841 2376 -3511 -2364 3730 -216 -1763 -665 4123 903 -3840 2081 2514
2334 2514 -1012 -3371 1360 1917 -3536 -1653 1528 2190 -2904 -999 4458 -549 -1394 39 2714 -391
2350c91l670N736m32l125p49M114O16m501K199K617k35m801J998M123m620o35
2366a756Q11L017k711l288N875n5l384q0M174l1m873J140L995j811n190L998L046
2383B877m751m04K337L176m424j748P023k429l839J396K901j032m487K599L583
2398B778l708k376M230J263l388r4K600J816m526n42M636k156k419K30K938m36
2414H46l892K218L925k870k408L321J593k797k338L451K117o174L67M845j694
2429E10l229J259M734k344m378M880K629n156j344M620k69l955o42M959r76n334
2445d036L690L373l369j339K028K512k769k626M217J78l867O44K344J95k830l95
2461b050M132m10l857K202K650k008k247O66L679l084l197M488J010l629p50M196
$$ plain form
2350 -391 -4061 1675 1243 -1882 -2631 1483 2099 -2402 -203 2414 2179 -2622 -624 3499 -1121 -1756
2366 -1756 -945 2072 -639 -3927 1948 1893 -1491 -1571 2603 2572 -2301 -1161 2834 1023 -4167 -169 2877
2383 2877 -1874 -2278 59 3235 -1189 -2937 4086 1657 -2182 -786 2115 1083 -3404 -805 2778
2398 2778 -930 -3306 924 2187 -1201 -1295 1305 3121 -1405 -1947 2689 533 -1886 -1656 1282 846
2414 846 -3046 -828 3097 227 -2181 1140 2733 -64 -2402 1049 3166 -3008 -2641 2204 510
2429 510 -2719 -1460 3274 930 -3448 1432 4061 -1095 -2439 2181 1912 -2043 -2685 2274 1298 -4036
2445 -4036 -346 3027 -342 -1681 347 2859 90 -2536 1681 1859 -2008 -1364 980 1175 -1655 -2050
2461 -2050 2082 1672 -2185 17 2667 659 -1588 -922 2757 -327 -3524 964 1974 -1655 -2405 1791
2477A791P74m533L11N641k745n140M544K167l534l048L823L398o138j01N935j475
2493A670l863J116M284j820m600L348K929m019k360L944J150k926j057L535J518
2508B849m345Q3M013j528k244J82K560n91m332K719L098l586j076K933J871l019
2524d13k008M778M17n512J108M323j977m232J863M779l517l765N272K355m708
2539a237j324M814R88n314j38M981j320n438K871L946k932k729K720L377l605
2554c40k291M934l9l507m99L100M09m833J499L802k175k545J828L231k449k643
2570b518L736J917m214j534M253K37m760P66M262r40m509K206M952l590l229M009
2586A044K534m105k876M999J133n481k5N311j087m344J249N068k241m014L319
$$ plain form
2477 1791 2565 -1968 -1657 3984 1239 -3901 643 2810 -724 -3772 51 3449 -2689 -2790 3145 1670
2493 1670 -2193 -1077 3207 1387 -3213 135 3064 -955 -3315 629 1779 -1147 -2204 1331 2849
2508 2849 -1496 -1413 2600 1072 -1172 -990 1570 979 -3353 -634 2464 -1122 -2198 735 2606 -413
2524 -413 -2421 2357 2774 -2738 -1630 2693 716 -3516 -1653 3126 -391 -4156 1116 3471 -1237
2539 -1237 -2561 2253 3241 -2073 -2211 2770 1450 -3988 -1117 2829 -103 -2832 -112 3265 -340
2554 -340 -2631 2303 2264 -1243 -1742 1358 1767 -3066 -1567 2235 60 -2485 -657 2574 125 -2518
2570 -2518 1218 3135 -1079 -2613 1640 1877 -2883 -2117 2145 1205 -3304 -1098 3854 264 -2965 1044
2586 1044 3578 -527 -3403 1596 2729 -2752 -2777 2534 1447 -2897 -1648 3420 1179 -2835 484
2601D84K805l610k462L378J807m378r50M563j76l844J166M134j710l718K603L375
2617C467l595k873L875J885m515j283M488P39m466J37N017p06m872K480L504k492
2633G90l735K812L208m372k177M516J116l851q12N051m27m531J488M130k202l809
2649b805K531K537k674k859L769K120m384n23M170M73m542O61M942k512l230J561
2665g65L388k873l218M394J099l150j478M084J472n118J281L295p90l699O6N219
2681C207l477k886L260K083k567k717M748J106m158k56L867L34n089J065L798
2696B318j929l427K080L956l649k305M057J871l748j295M538n29l892j49M130
2711B027j083m339L115K513k163k680K612L464m623n25L094N04l013j754M959
$$ plain form
2601 484 3289 -321 -2783 595 2402 -1976 -2926 1637 1461 -2383 -1217 2917 1207 -2511 92 3467
2617 3467 -128 -3001 874 2759 -1756 -3039 1449 2188 -2278 -2141 2876 2170 -2702 -222 3282 790
2633 790 -2945 -133 3075 -1297 -3474 1042 2158 -1693 -2505 2546 2119 -2412 -924 3206 1004 -2805
2649 -2805 -274 2263 -411 -3270 499 2619 -1765 -2288 1882 2355 -2187 -1526 3416 904 -2326 -765
2665 -765 2623 -250 -3468 926 2025 -1125 -2603 1481 2953 -2165 -884 2411 1621 -2078 -2012 3207
2681 3207 -270 -3156 104 2187 -380 -3097 1651 2757 -1401 -1657 2210 2544 -2545 -1480 2318
2696 2318 389 -3038 -958 2998 -651 -2956 1101 2972 -776 -2071 2467 1938 -1954 -2103 2027
2711 2027 944 -3395 -280 2233 70 -2610 2 3466 -1157 -1682 1412 1916 -1097 -2851 2108
2726B108j454l056J188L142j022m094L518K380k943j701K488K552m759q02M351
2741A896r30l191R9M630j470l542K351L019k592l051L974J391l813j200L657Q18
2757B046m520R09L770j251k920J470L291k310k605K859J718l162j763L546K95
2772A373l142L8K986M56l944J811L151j905k539J429L161k827k714L368J188l194
2788a304j056L821K78l607N75L521p20l697J945K946k590k582K438K095l188j693
2804b818M372L18l805Q55K905n26k879J422K713k531k191K321J467k675j201L044
2820G91O43k496m54L197k65l110J218K107n87l112J424K664k505j967K614J666
2836A828k172j382L149O79l270m28L586j118l131J834J760j180k702K599K472
$$ plain form
2726 2108 654 -2402 -1214 1928 906 -3188 330 2710 -233 -1934 554 3106 -1653 -2455 1896
2741 1896 966 -2225 -2126 2504 1034 -2508 -157 2862 270 -2781 1193 2584 -1229 -2429 1228 2046
2757 2046 -2474 -1565 2205 954 -1966 -496 2795 485 -2120 739 2457 -705 -2468 1078 1373
2772 1373 -1769 -1731 1255 1711 -2233 -422 2729 824 -1715 -286 2875 48 -2666 702 1890 -1304
2788 -1304 -2360 1461 1739 -1868 -1293 2228 1508 -2189 -244 2702 112 -2470 -32 2063 -1125 -2818
2804 -2818 1554 1872 -1933 -1078 1827 1301 -1578 -156 2557 26 -2165 156 1623 -1052 -2253 791
2820 791 1434 -1062 -1516 1681 1416 -1694 -476 1631 1044 -2068 -644 2020 -485 -2452 162 1828
2836 1828 -344 -1726 1423 2102 -1168 -1596 1990 872 -2259 -425 1335 155 -2547 52 2524
2851B524l533k15K495Q27l234m5L040q26k737P92K531j614k318K767Q09j439j467
2868a643K403J545l359K94K200l89k364OK577r63k040J150K609j951j730K337
2884F82P90j206k056K741R79l816P35J901N6k462q3L931j637k474K315J703k364
2901b65j343K570M25j998j285L319l02l454K308J153p07j604J082K348k345q40
2917i38J861J43j515j006J824K61j666m52K798n70k183J821O16M4k133P16K335
2934A956l064l55K305r9j466o11K440K22k692J002K615j630j786J528N63q20j926
2951a818J718J789l254K28K699o73j572M49J801m22k534J481J752k143p09J318
2967A10L83o86j490K263Q13k135M70J207k04j366J63K132j410j629J250J325j872
$$ plain form
2851 2524 -1009 -1224 1271 2098 -1136 -1181 1859 1033 -1704 -912 1619 5 -2313 454 1263 -176 -1643
2868 -1643 760 2305 -1054 -760 1440 1051 -1313 -1307 1270 307 -1733 -583 2026 75 -1655 682
2884 682 1472 266 -1790 951 1930 -1886 -1151 750 806 -1656 -1739 2192 555 -1919 396 2099 -265
2901 -265 -1608 962 1387 -611 -1896 1423 1121 -2333 -25 1128 421 -1183 -101 2247 -98 -938
2917 -938 923 1066 -449 -1455 369 630 -1036 -1488 1310 740 -1443 378 994 1038 -1095 -379 1956
2934 1956 -1108 -1463 842 743 -723 -1334 1106 1328 -1364 -362 2253 623 -1163 365 928 108 -1818
2951 -1818 -100 1689 -1565 -1337 1362 689 -883 -434 1367 945 -1589 -108 1644 -499 -1208 110
2967 110 493 -193 -1683 580 1393 -742 -272 935 731 -635 -472 1660 250 -1379 -129 1196 -676
2984f76q01J704R89j458o52J852L16k327L12J927j166j226L21J959j075k108K519
3001D10O44j888J05J274J128k675j8K511j259j343M92J457q52j557J563J102j292
3018a98k30R72O63j678k30J488k25j106k70J358l84j269J000Q74o07r36R65J480
3036A667j840q11J781n4j158q30J801L10k674J584J379o38j137L26J994j602j153
3053a055J546K37j187j036K173K69k210P82J266l01j281Q08J530j493p95R61M02
3070F16j006r16J891n9j312P12L86O99j694K67J957j496p02O69P71p28j756J866
3088A65O65j310k76J072Q96j724k90K061o11j260P0J441p62j705J723R12j345
3105b78p72J151J225j965j75K239j060j042L78J234q36j495J360P73q52n45Q61
$$ plain form
2984 -676 -1477 227 1216 -242 -894 958 1274 -1053 -741 1186 20 -1206 -885 1074 -1 -2109 410
3001 410 1054 -834 -729 545 1673 -1002 -1020 1491 232 -1111 -619 838 -14 -1571 -8 1094 -198
3018 -198 -428 544 1207 -471 -701 787 562 -544 -814 544 160 -1109 -109 765 158 -778 187 1667
3036 1667 -173 -984 797 743 -415 -1245 556 866 -1808 -224 1155 517 -620 -294 1700 98 -1055
3053 -1055 491 728 -459 -1495 678 947 -1263 -481 785 484 -797 11 1541 48 -747 214 616
3070 616 -390 -1306 585 526 -786 -74 312 1011 -683 -416 1541 45 -657 12 783 55 -1701 165
3088 165 830 -480 -756 316 1212 -512 -802 1259 648 -612 -542 899 137 -1568 155 1067 -278
3105 -278 -1050 101 1326 -639 -814 1425 365 -677 -299 935 99 -1396 -36 737 -115 -660 201
3122B01J217j946k60J944q98p18m02J472j72k213J677J027j075n95P57J227j339
3139i6m82J421N5j388m32J687k76j541M78J177j69j629R19J869j359j323J494
3156D05O64j379o91J683K2j800L67J344j32j681Q11K035j468r11J262L13j234
3173c90p91J751K81j998N21J196n5j366N90J576j065r06R02R90j382q74J287M40
3191G07j473j49J471L28j598J37J532l23j599Q64J167p24j583J074J158j598l73
3208i82J034Q69j758j37J806j40j041L63J229j116j173Q86J165j404o59J221P22
3225H85j761J0J864m37j238K21J628p29j679R91J287j082j474J806P01j317n59
3242h83J670L80j927M14J096j51j710P21J228r84j373J447J305j376q70J614L24
$$ plain form
3122 201 1418 -528 -788 1156 258 -460 -862 610 438 -1775 -98 929 -146 -741 16 1243 -96
3139 -96 -578 843 898 -490 -922 765 489 -1052 -574 603 434 -1195 -276 1593 234 -1089 405
3156 405 1069 -310 -1001 682 704 -1096 -729 615 483 -1198 -387 1648 180 -731 531 844 -390
3173 -390 -1181 570 851 -1147 -626 570 515 -851 -261 1315 250 -656 246 1236 -146 -1020 267 707
3191 707 -766 -915 556 884 -714 -577 955 632 -967 -103 1064 340 -1243 -169 989 -609 -982
3208 -982 52 921 -837 -974 832 692 -349 14 1243 127 -1046 -160 1005 -399 -1058 163 885
3225 885 -876 -866 998 561 -677 -456 1172 443 -1236 -245 1042 -40 -1514 292 993 -324 -883
3242 -883 787 1167 -760 -346 750 599 -1111 -390 838 -146 -1519 -72 1233 -143 -1013 601 925
3259I25j403k50J755N7k171N17J250n46j308R25J391j543o11J678N10j680m12
3276i16J899m86j335J34J533k85k302J688R97p93r70J191J066j603p15J530L56
3293I89j551n94K221j018j448R14J446o72j477J406R89j372q76J637Q31k110l19
3310a004K010o21j477L59K054j217j295J664P68j106j257J546N59j479m54J421
3326D71M72k072O11J396m03j335N85J772j226j215J406M86j182q53J606K93j688
3343h76o2J743P4j705L37J969j066j333Q64J398j658j259J918M90j673k76J697
3360E82J70j842R05J337p28j192R54J115j601r14J668N28j620j77J764j57j400
3377f08K07J562o73j421P36J169j282o76O59J150j238p92J748J72j279l09J932
$$ plain form
3259 925 -478 -728 1027 1084 -1087 -570 680 134 -1174 -249 1142 -401 -1012 666 1176 -504 -916
3276 -916 983 497 -838 -704 829 544 -1758 -70 927 134 -836 355 1421 -182 -897 633 989
3293 989 -562 -1156 1065 47 -1401 -487 959 287 -1190 216 1205 -167 -1043 594 1425 -685 -1004
3310 -1004 1006 385 -1092 -733 1321 104 -1191 473 1241 135 -1122 424 983 -496 -950 471
3326 471 943 -1129 -518 878 475 -860 -275 1497 271 -944 462 948 -234 -1087 519 812 -876
3343 -876 -938 805 879 -826 -489 1480 414 -919 -55 1343 -315 -1574 344 834 -839 -1115 582
3360 582 752 -1090 -185 1152 424 -768 186 1301 -300 -1214 454 982 -638 -815 949 792 -608
3377 -608 -401 1161 488 -933 -197 972 -310 -986 -327 823 -415 -1207 541 713 -566 -875 1057
3394A057k56j695N80J473r18j527J251J068j282j048J140J035j425k34J951l65
3410H05j549J03J745p39j889J677N22r84j002J684P73j798K01J184L11j724K45
3427d35J615j102r14L09J436j086j241J764K80q77m25J107O79j645K39J014l18
3444D00j448J84J844j103r49R02J475j475j006K082j88j043o58J465L92k185Q81
3461d30J068n88j155P55J968j812o24J344P98j604p25J869n41j032L5J175j08
3478C93j989J534P58p04r70J243Q16j511m08J226J81j091o75J857n21j162O71
3495c52J048j62j687J494O31j020p21O94Q50j434J0J335n16r77j41K049p46j070
3513g15O88R28p47j404J588M58j397j00J061M07j736K91J564p60p52M43R12p05
$$ plain form
3394 1057 801 -894 -314 1159 241 -1286 -35 1033 -249 -1297 -157 878 -547 -781 1170 805
3410 805 -744 -641 1104 365 -1524 153 675 -309 -1311 373 1146 -652 -451 733 1044 -680 -435
3427 -435 1180 78 -836 -527 909 -177 -1418 346 626 -251 -676 431 1110 -535 -296 718 400
3444 400 -1048 -864 980 -123 -1072 -170 1305 -170 -1176 906 718 -325 -983 482 874 -1311 -430
3461 -430 638 50 -1105 -350 1618 -194 -818 526 1324 -280 -1005 864 323 -709 -674 501 393
3478 393 -1596 -62 696 -8 -978 265 1081 -430 -838 388 569 -522 -1197 660 139 -1023 -352
3495 -352 696 534 -1153 341 972 -48 -769 -75 775 -659 -649 686 170 -807 -948 1101 355 -715
3513 -715 -27 901 154 -1250 338 796 -601 -701 360 767 -969 -678 886 126 -626 -183 729 24
3531B4r24Q28P64r65o98J285L31j185L3J312k55j322P93J116o39j240R02P57j447
3550e30l62J381j42p82n49J491L23j417N40O58p3j464Q38Q22q96n09M95P16j060
3569e20l62J498j67o21l90R90P3j517R59Q29p62p12N53N97o76n14J159J97r65
3588c51k18J228j50j161L51J003q28q10Q31P28j071m74J039N90p34o06J197K33
3606G97j188m7J290p64j079L70J131m73p32R33M10o01m00P38N21j340K5J137q63
3625a35p22L87J174n69q99Q97M26l18o13N43P14j332Q7N86Qq26P1J047n99m24
3645d97M06Q17m45q25P82N88r49n13Q14L44r48j68J014M5q65N0Q40j87p20L69
3665d8Q25r16l18P09J97q00k92R33j8o56M54O77p65n40N44P88p24p67P69K06p93
$$ plain form
3531 24 -900 -72 692 -273 -971 314 645 -540 -507 805 550 -772 21 1137 498 -742 160 917 -530
3550 -530 -892 489 347 -435 -984 507 830 -587 -47 611 538 -926 -88 734 -162 -671 -176 540 -520
3569 -520 -882 616 449 -172 -562 428 501 -1016 -57 772 10 -702 -149 448 -228 -742 417 614 -351
3588 -351 -569 659 509 -652 -301 702 -126 -936 -105 623 -448 -922 117 707 -27 -633 564 797
3606 797 -391 -438 852 88 -991 -621 510 37 -695 238 648 47 -353 385 906 -434 -409 728 -135
3625 -135 -857 -470 704 135 -764 133 559 241 -372 171 885 -447 -360 226 234 -592 -521 526 -73 -497
3645 -497 -91 726 281 -544 238 826 -123 -636 178 522 -426 -594 420 465 -400 -350 490 303 -417 -48
3665 -48 777 -139 -457 252 449 -351 -643 290 272 -384 70 747 -18 -558 -14 774 50 -717 52 258 -535
3686e35j39Q81n1m61N9N53J14r64O38L91k21n91M9Q23p62k91P08r1j44l35P99
3707D30L47j064K76K07J63q41N05L73l96o46N42P31n23q17J170M01j189K19O36
3726E24J9j265N19O03p18p11P87O67n44m81O58O63o53j52N06j38p77r3R48r5r28
3747f61M98M36J00r21Q75L03p43j76O19J08p17l17R96k89p44M89N06j92o09M55
3767A6Q23o05p81P50L19o88j96P05k49n30n2J097n71n38M09M44j08p17O56L59
3787E43o60n99J110j57o86k47R62P1q01%J040l28m02J07M26m57o01P00L13o69
3807c35j9N39J85o82k32J217p0j021L21O67l99o22N56L29q85RP48L58j260L44
3827b52N89k3o48N09N13o83n39N33P15q06o98P23O21q88l07Q94L58j044L08O70
$$ plain form
3686 -535 -674 207 156 -305 -246 307 421 -543 95 486 265 -326 -277 546 -216 -507 201 110 -34 -369 430
3707 430 777 -287 -11 196 359 -482 23 396 0 -646 -104 627 104 -713 457 858 -331 -112 524
3726 524 543 -722 -203 400 -318 -1029 -242 425 -119 -600 58 721 68 -84 422 284 -493 -586 362 267 -661
3747 -661 -163 273 373 -548 327 630 -113 -289 330 438 -279 -596 400 111 -633 -144 362 170 -439 16
3767 16 839 234 -547 203 522 -166 -362 343 94 -436 -488 609 38 -500 -91 353 245 -472 184 543
3787 543 -117 -716 394 237 -449 -696 266 337 -464 -464 576 248 -154 -47 379 -78 -679 21 334 -335
3807 -335 -354 185 370 -312 -544 673 603 -418 -97 570 171 -451 105 434 -451 -442 306 664 -596 -252
3827 -252 337 314 -334 175 688 5 -534 -1 714 -92 -790 -67 554 -334 -641 253 611 -433 -125 545
3847E45m06o62M66K76l98p45J088K54n33m37R29J51r28p5R79j21j160O54N49n43
3867a17o57O09R25p95n61J087J40q76j93Q97K26j388N19O35j53j127P78N61n90
3886h0m13P63P95j328m97J219k04m98l55P91Qr51O21M33K02j044N00P78p38m97
3906d95Q21M27j084n04J235k70n19r9R22j02p69K96Q41q26m68Q93L56j346J5J102
3926D26j96o94J92J115n91r32O20Q20p23q46J130L60j086k26P65J86j004L68O79
3945C63J16q40J09J206o94q18N53N45p73p03J024L01r32P8O35K79q59L99R14m57
3965D46j009L82N84k56q53Q82O01j418k72J346L20j453L42J138l37r39J28J082
3983G14p16r03Q11N72n63m40R13M56j303L59P62K8j243K97R35o75p89N40R36q37
$$ plain form
3847 545 139 -523 -57 219 -179 -924 164 418 -115 -552 377 528 -400 -475 504 383 -777 -123 426 -117
3867 -117 -774 -165 760 -35 -596 491 631 -245 -438 459 685 -703 -184 451 298 -829 -51 510 -80
3886 -80 -493 270 1065 -263 -760 459 255 -243 -598 193 201 -750 -129 304 506 -538 -38 740 2 -495
3906 -495 326 753 -331 -835 400 130 -389 -488 434 332 -437 -141 700 -126 -594 299 655 -691 -676 426
3926 426 230 -464 -272 843 252 -680 -60 760 37 -809 321 681 -405 -631 134 320 -684 -316 363
3945 363 479 -361 -252 954 260 -558 -5 540 -233 -936 88 389 -543 -465 170 449 -410 -11 903 446
3965 446 -563 -181 403 147 -706 176 777 -641 -913 433 753 -700 -358 780 443 -496 -368 714
3983 714 -2 -905 -94 478 -85 -525 388 844 -459 -100 662 690 -553 -256 679 4 -785 -245 691 -146
4003a46m13P14O42r76m69J304Q5r95M0O98l47r81R73M40n79n43M11R99q65m41
4023d49Q92p7m41n30J249K0j523P97P83p56p75Q31O62o76m18P96J17q50k2R23
4043E53j46j235K55J338n86j028J068K17l47p48R14O77j094l60P19R8r23M01O54
4062D27j21p41J28R43n76p00J130J24o78m39Q52K84j425J49P23K56j092N71R08
4081G23o15n52N44N64o95o33Q90M34j201j37J053n2r24K91R92k05j093R77N95
4100I56j098o86J312O1j134k00J049J30q65o0J045P9j068O78M72n59p98M83P91
4119E88q50k9K44M23q67l14J657j98j018P1P97l58o74R27J73r22l23O44Q46j430
4139f13j07R93rn94N4R38l38r98M63P70n74r40J001M93q91J48O96R4j153L80P08
$$ plain form
4003 -146 -559 155 797 -179 -648 656 741 -254 -214 484 137 -844 129 569 -10 -553 -142 857 -8 -449
4023 -449 443 366 -75 -605 644 664 -859 -62 721 -35 -810 21 683 7 -411 385 502 -348 -370 553
4043 553 407 -828 -573 765 179 -849 219 436 89 -659 255 932 -162 -522 197 295 -628 -227 427
4062 427 306 -435 -307 636 60 -640 490 614 -64 -503 349 633 -792 -643 80 336 -756 -185 723
4081 723 108 -444 100 664 -31 -664 226 660 -541 -678 375 323 -601 -310 682 477 -616 361 956
4100 956 -142 -828 484 545 -589 -789 260 390 -475 -535 510 589 -479 199 671 112 -686 -203 588
4119 588 -262 -291 -47 376 -491 -805 852 654 -364 -293 504 146 -528 399 572 -350 -673 -29 817 -613
4139 -613 -720 273 264 -330 -276 662 324 -674 -211 559 -15 -955 46 539 -352 -204 492 586 -567 -187 521
4160E21l47p32J00R76m98o41N89K34l96l81J226j73p00M5O86L07j594O74N24l80
4180D0p36N17Q96j098K8Q38j36j92l98M48K23j069L97O42l16q34K95J177r75k10
4200d63O57K04n52j29O90O1r25l0Q55l21n01K48P47m42l83L30N45o42m03Q73J30
4221E49p36l68P16K3o93J74P46k27r14P54P40q71k02O16L13p43l67Q47q5q63K07
4242c84R33q51j43M15L99k66p22J006L32j290J45N31J70p61J59O87k21p37L09
4261b89O81k45o83P87L45n21n89N58L63q22NO58l2n98P0R48l02p23N84M72n09
4282A58p32O55K99o45k92P33N7q64K79J185o72m05L13O25o46o16P26L10r05j00
4302e37Q40j34m71o8Q89m72l44M94J71l46m14K62M80m08l93O41l8j39n37R55J6
$$ plain form
4160 521 174 -558 -458 518 20 -621 -32 202 -194 -575 651 478 -222 -177 509 816 -778 -104 420 40
4180 40 -696 -179 717 -381 -353 485 349 157 -241 207 430 -639 -242 400 84 -750 -455 722 -253 -463
4200 -463 194 398 -154 -283 407 468 -457 -487 368 47 -454 -206 541 99 -284 46 591 -51 -454 419 549
4221 549 -187 -555 161 184 -509 -335 411 184 -730 24 764 -107 -309 307 620 -123 -490 357 272 -591 -384
4242 -384 549 -302 -445 -30 369 103 -619 387 719 -571 -426 105 275 -486 -327 360 139 -598 -289
4261 -289 392 147 -536 251 596 75 -514 44 407 -415 -410 248 216 -382 -312 636 334 -389 195 667 158
4282 158 -574 81 380 -265 -557 176 233 -631 -352 833 161 -244 69 694 48 -568 158 468 -437 -537
4302 -537 303 169 -302 -370 519 47 -297 197 368 22 -392 -130 350 -58 -451 190 152 13 -524 431 447
4323D47o64J80L47r5r54O21J73k93l82N71N85n30m97Q14j65m18K85M36k29m78
4343b46Q0M19n16k39O08L17o00m2K51M01o31M2M60p1n14m3N78l03k67J11P73m76
$$ plain form
4323 447 -217 -37 310 215 -739 -118 55 -238 -620 -49 536 6 -491 323 158 -260 25 461 232 -246
4343 -246 -166 253 -263 -502 106 423 -177 -219 32 433 -198 -156 304 233 -281 -324 254 -49 -316 -205 568 92
$$ [...]
8191b6
##END NTUPLES=NMR FID
##END=
