##TITLE=1H_LR-756-R2-RM1
 CCl4
 8 sc, 
 20.1.2023
##JCAMPDX= 6.0         $$ Bruker NMR JCAMP-DX V2.0
##DATA TYPE= NMR FID
##DATA CLASS= NTUPLES
##ORIGIN= UXNMR, Bruker Analytische Messtechnik GmbH
##OWNER= root
$$ XWIN-NMR		Version 3.5
$$ Mon Jan 23 14:11:21 2023 Russian Standard Time (UT+4h)  she@DPX200
##.OBSERVE FREQUENCY= 200.13135
##.OBSERVE NUCLEUS= ^1H
##.DELAY= (6, 6)
##.ACQUISITION MODE= SIMULTANEOUS
##.ACQUISITION SCHEME= undefined
##.AVERAGES= 8
##.DIGITISER RES= 18
##SPECTROMETER/DATA SYSTEM= spect
##.PULSE SEQUENCE= zg30
##.SOLVENT NAME= D2O
##.SHIFT REFERENCE= (INTERNAL, D2O, 0, 15.7039)
##AUDIT TRAIL= $$ (NUMBER, WHEN, WHO, WHERE, WHAT)
$$ ##TITLE= Audit trail, XWIN-NMR		Version 3.5
$$ ##JCAMPDX= 5.01
$$ ##ORIGIN= Bruker BioSpin GmbH
$$ ##OWNER= she
$$ F:/spectra/data/she/nmr/H-F/1/audita.txt
$$ ##AUDIT TRAIL=  $$ (NUMBER, WHEN, WHO, WHERE, WHAT)
(   1,<2023-01-23 14:08:45.50 +0400>,<she>,<DPX200>,
      <created by zg, POWCHK disabled, PULCHK disabled
       configuration hash MD5:
       00 E9 B6 7A A2 85 ED C7 34 08 36 98 17 FE 4E 26
       data hash MD5: 16K
       9F 7E 6D 8E 79 01 60 33 CD 54 56 7C CE 9F 19 F8>)
$$ ##END=
$$ 
$$ hash MD5
$$ FD A4 AF 9C 4A F1 20 0A 61 DF 96 FE 9E 8A F1 86
##$RELAX= 
##$RELAX= 
##$RELAX= 
##$RELAX= 
##$RELAX= 
##$RELAX= 
$$ Bruker specific parameters
$$ --------------------------
##$DU= <F:/spectra>
##$EXPNO= 1
##$NAME= <H-F>
##$PROCNO= 1
##$TYPE= <nmr>
##$USER= <she>
##$AMP= (0..31)
100 100 100 100 100 100 100 100 100 100 100 100 100 100 100 100 100 100 
100 100 100 100 100 100 100 100 100 100 100 100 100 100 
##$AQSEQ= 0
##$AQ_mod= 1
##$AUNM= <au_zg>
##$AUTOPOS= <>
##$BF1= 200.13
##$BF2= 200.13
##$BF3= 200.13
##$BF4= 200.13
##$BF5= 200.13
##$BF6= 200.13
##$BF7= 200.13
##$BF8= 200.13
##$BYTORDA= 1
##$CFDGTYP= 0
##$CFRGTYP= 5
##$CHEMSTR= <none>
##$CNST= (0..31)
1 1 145 1 1 1 1 1 1 1 1 1 1 1 1 1 1 1 1 1 1 1 1 1 1 1 1 1 1 1 1 1 
##$CPDPRG= <>
##$CPDPRG1= <>
##$CPDPRG2= <>
##$CPDPRG3= <>
##$CPDPRG4= <mlev>
##$CPDPRG5= <mlev>
##$CPDPRG6= <mlev>
##$CPDPRG7= <mlev>
##$CPDPRG8= <mlev>
##$CPDPRGB= <>
##$CPDPRGT= <>
##$D= (0..31)
0 1.2 0 0 0 0 0 0 0 0.06 0 0.03 0 0 0 0 0.0002 0 0 0 0 0 0 0 0 0 0 0 0 
0 0 0 
##$DATE= 1674468525
##$DBL= (0..7)
120 120 120 120 120 120 120 120 
##$DBP= (0..7)
150 150 150 150 150 150 150 150 
##$DBP07= 0
##$DBPNAM0= <>
##$DBPNAM1= <>
##$DBPNAM2= <>
##$DBPNAM3= <>
##$DBPNAM4= <>
##$DBPNAM5= <>
##$DBPNAM6= <>
##$DBPNAM7= <>
##$DBPOAL= (0..7)
0.5 0.5 0.5 0.5 0.5 0.5 0.5 0.5 
##$DBPOFFS= (0..7)
0 0 0 0 0 0 0 0 
##$DE= 6
##$DECBNUC= <off>
##$DECIM= 32
##$DECNUC= <off>
##$DECSTAT= 4
##$DIGMOD= 1
##$DIGTYP= 9
##$DL= (0..7)
0 120 120 120 120 120 120 120 
##$DP= (0..7)
150 150 150 150 150 150 150 150 
##$DP07= 0
##$DPNAME0= <>
##$DPNAME1= <>
##$DPNAME2= <>
##$DPNAME3= <>
##$DPNAME4= <>
##$DPNAME5= <>
##$DPNAME6= <>
##$DPNAME7= <>
##$DPOAL= (0..7)
0.5 0.5 0.5 0.5 0.5 0.5 0.5 0.5 
##$DPOFFS= (0..7)
0 0 0 0 0 0 0 0 
##$DQDMODE= 0
##$DR= 18
##$DS= 0
##$DSLIST= <SSSSSSSSSSSSSSS>
$$ [...]
##$SUBNAM2= <"">
##$SUBNAM3= <"">
##$SUBNAM4= <"">
##$SUBNAM5= <"">
##$SUBNAM6= <"">
##$SUBNAM7= <"">
##$SUBNAM8= <"">
##$SUBNAM9= <"">
##$SW= 18.05172834244
##$SWIBOX= (0..15)
0 0 2 0 0 0 0 0 0 0 0 0 0 0 0 0 
##$SW_h= 3612.71676300578
##$TD= 16384
##$TD0= 1
##$TE= 0
##$TE2= 300
##$TE3= 300
##$TEG= 300
##$TL= (0..7)
0 120 120 120 120 120 120 120 
##$TP= (0..7)
150 150 150 150 150 150 150 150 
##$TP07= 0
##$TPNAME0= <>
##$TPNAME1= <>
##$TPNAME2= <>
##$TPNAME3= <>
##$TPNAME4= <>
##$TPNAME5= <>
##$TPNAME6= <>
##$TPNAME7= <>
##$TPOAL= (0..7)
0.5 0.5 0.5 0.5 0.5 0.5 0.5 0.5 
##$TPOFFS= (0..7)
0 0 0 0 0 0 0 0 
##$TUNHIN= 0
##$TUNHOUT= 0
##$TUNXOUT= 0
##$USERA1= <user>
##$USERA2= <user>
##$USERA3= <user>
##$USERA4= <user>
##$USERA5= <user>
##$V9= 5
##$VALIST= <valist>
##$VCLIST= <CCCCCCCCCCCCCCC>
##$VD= 0
##$VDLIST= <DDDDDDDDDDDDDDD>
##$VPLIST= <PPPPPPPPPPPPPPP>
##$VTLIST= <TTTTTTTTTTTTTTT>
##$WBST= 1024
##$WBSW= 4
##$XGAIN= (0..3)
0 0 0 0 
##$XL= 0
##$YL= 0
##$YMAX_a= 697014
##$YMIN_a= -719074
##$ZGOPTNS= <>
##$ZL1= 120
##$ZL2= 120
##$ZL3= 120
##$ZL4= 120
##$ABSF1= 10
##$ABSF2= 0
##$ABSG= 5
##$ABSL= 3
##$ALPHA= 0
##$AQORDER= 0
##$ASSFAC= 0
##$ASSFACI= 0
##$ASSFACX= 0
##$ASSWID= 0
##$AUNMP= <proc_1d>
##$AZFE= 0.1
##$AZFW= 0.1
##$BCFW= 1
##$BC_mod= 2
##$BYTORDP= 1
##$COROFFS= 0
##$CY= 11.3945322036743
##$DATMOD= 1
##$DC= 2
##$DFILT= <>
##$DTYPP= 0
##$F1P= 2.36226072786647
##$F2P= -0.459571619588291
##$FCOR= 0.5
##$FTSIZE= 0
##$FT_mod= 4
##$GAMMA= 1
##$GB= 0.15
##$INTBC= 1
##$INTSCL= 1
##$ISEN= 128
##$LB= 0.24
##$LEV0= 0
##$LPBIN= 0
##$MAXI= 10000
##$MC2= 0
##$MEAN= 0
##$ME_mod= 0
##$MI= 1.114404
##$NCOEF= 0
##$NC_proc= 0
##$NLEV= 6
##$NOISF1= 3.799351
##$NOISF2= 2.8
##$NSP= 1
##$NTH_PI= 0
##$NZP= 0
##$OFFSET= 15.70392
##$PC= 1
##$PHC0= -19112.23
##$PHC1= 13.40079
##$PH_mod= 1
##$PKNL= yes
##$PPARMOD= 0
##$PSCAL= 0
##$PSIGN= 0
##$REVERSE= no
##$SF= 200.130013532006
##$SI= 16384
##$SIGF1= 3
##$SIGF2= 2
##$SINO= 400
##$SIOLD= 16384
##$SREGLST= <1H.CDCl3>
##$SSB= 0
##$STSI= 0
##$STSR= 0
##$SW_p= 3612.71676300578
##$SYMM= 0
##$S_DEV= 0
##$TDeff= 0
##$TDoff= 0
##$TI= <>
##$TILT= no
##$TM1= 0
##$TM2= 0
##$TOPLEV= 0
##$USERP1= <user>
##$USERP2= <user>
##$USERP3= <user>
##$USERP4= <user>
##$USERP5= <user>
##$WDW= 1
##$XDIM= 8192
##$YMAX_p= 0
##$YMIN_p= 0
$$ End of Bruker specific parameters
$$ ---------------------------------
##NTUPLES= NMR FID
##VAR_NAME=  TIME,          FID/REAL,        FID/IMAG
##SYMBOL=    X,             R,               I
##VAR_TYPE=  INDEPENDENT,   DEPENDENT,       DEPENDENT
##VAR_FORM=  AFFN,          ASDF,            ASDF
##VAR_DIM=   8192,          8192,            8192
##UNITS=     SECONDS,       ARBITRARY UNITS, ARBITRARY UNITS
##FACTOR=    0.0002768,     1,               1
##FIRST=     0,             0,               0
##LAST=      2.2672688,     0,               0
##MIN=       0,             -719074,         0
##MAX=       2.2672688,     697014,          0
$$ Real data points
##PAGE= N=1
##DATA TABLE= (X++(R..R)), XYDATA
$$ [...]
2441C305k683m957N229L276o250j288O055K81o687K025M937j873m682J791N951
2456D430n122l273N415J174l354k515N108J532o163O45N404j946m474K273L156
2471B290j169m622K987M629n149j886M029J264l214k609N706K46n372J075M681
2486B886j212n505L623L970l519l893M362L873p160n37O035p61m765q3O168j494
2502A988o795N082L492m242k604L805L131n452j539O000l57n071P58M550j224
2517A522m634K262L853k618l020L041K505l774j687L684J285l775j541N412m47
2532B068n142K225L760j890l768K315M426m465k941M958J152m402j495N463N61
2547B825o681K373N072k585m295K584M801m618l225M824J869m343j639N177M5
$$ y = [3305, 622, -4335, 894, 4170, -2080, -3368, 2687, 2968, -3719, -1694, 3243, 1370, -3312, -1521, 4430, -692, -3965, 1450, 2624, -730, -3245, 1863, 3395, -2768, -2123, 3281, 1335, -3139, -866, 2290, 1121, -3501, -514, 4115, -1034, -2920, 1109, 2373, -841, -3450, 2256, 2502, -2870, -1795, 2886, 1674, -3831, -208, 3762, 243, -3650, 712, 4585, -2575, -3112, 2923, 2162, -2603, -2686, 3482, 1988, -4807, 275, 3767, -475, -3079, 726, 3857, -1595, -3134, 2866, 2509, -2562, -1804, 2746, 1522, -3112, -850, 3003, 385, -2635, 406, 2911, -863, -2550, 1134, 2419, -1356, -2897, 2515, 2068, -3074, -849, 2911, 1021, -2747, -432, 3994, -471, -3412, 1546, 2698, -1704, -3199, 2264, 2825, -3856, -1483, 3589, 1004, -3291, -707, 4094, -524, -3749, 1075, 2944, -1399, -3038, 2139, 2184]
2562B184m954J755L052o48l963J625M347l882k034K954J777k532k755M668N73
2577B167m425J065K721K87m090R65M669l309k681K560K838l115l085M577J497
2592B641m366n09M273L68n175J156M909k850l266K135M051l649l051M446J376
2607B489l842n12L654L99m061K91M614k236l115J775K516j632l165L638J639l928
2623a476m4K820R12l801n44M835k018k504J076K809j475l922L695J599k586j354
2639a978K656K203m819K15L844o79k878m22M337j892l218K447K599k463k579L505
2655H78J546l622p44L589K71m194R43L096o78l723J985L344l187j144J913J879
2671B152k807j746M109m13k474k46L008m40l772K341K113j707j702J279L168m076
$$ y = [2184, -2770, -1015, 2037, 1389, -2574, -949, 3398, -484, -2518, 436, 2213, -319, -3074, 1594, 2167, -2258, -1193, 1528, 1815, -2275, -1310, 3359, 50, -2631, -71, 2767, -348, -3433, 1144, 2641, -1725, -2234, 2039, 2407, -2768, -1612, 3297, 447, -2819, -684, 3367, -282, -3333, 1113, 2489, -1353, -1865, 1789, 2188, -1873, -1582, 3032, 796, -2319, -544, 1972, 340, -2825, 813, 2452, -1476, -1520, 1300, 2212, -1589, -2133, 2702, 684, -1820, -744, 2065, 590, -3332, 363, 1962, -624, -1978, 678, 2881, -1938, -1723, 2121, 1442, -1436, -1858, 2479, 587, -2631, -184, 2415, -48, -2627, 878, 2424, -1198, -1942, 1647, 1918, -2276, -1333, 1763, 1085, -2638, -653, 2691, -496, -1640, 273, 2152, -655, -2401, 1708, 1295, -1179, -1425, 1583, 1143, -2629, -288, 1825, 118, -1584, -305, 2863, -1213]
2687a213k95K515K30k315q60L887r26l084J117K502n64l614K632K344k360j923
2703a927K080K435l835m25K719L39k625n71L957j292k680J390K417j656k617K760
2719D69J086j968j335K296J261l659R84K052l59k003L63K795j753k177K157J208
2735A417j470j948K886M12k359j20K110N54l204J021K427j157k178J063K727k067
2751A14k017K363R85k039j191K435J030k821j28K800m47k863J198K286j754j852
2767a901J665K026k115j527K775L59k577O16J888m7k529Q59K364j550j820J124
2783c90K036k008j031J630J411j848j341K496K49k352L4J965K67k701N85L162
2799B164j929j762J522J919j857k184K919R08k521q25L327p77k177O85J918n33
$$ y = [-1213, -1508, 1007, 1237, -1078, -1938, 1949, 1023, -2061, -944, 1558, 994, -2620, 12, 2356, -4, -1927, 153, 2588, -1247, -1672, 1047, 1386, -1239, -1810, 2147, 855, -1825, -435, 1982, 326, -2291, 469, 1555, -413, -1748, 548, 1809, -1850, -866, 1186, 827, -1176, -813, 1982, 229, -1948, 209, 1417, -53, -2001, 885, 1297, -1062, -1182, 928, 1482, -1722, -701, 1726, 569, -1609, -546, 2181, 114, -1903, 460, 1445, -594, -1785, 650, 1680, -1141, -1269, 1531, 1084, -1779, -581, 1705, -49, -1901, -236, 1790, -325, -1852, 923, 1282, -1295, -679, 1209, 1162, -1367, -508, 1856, 306, -1514, -390, 1646, -362, -1393, 237, 1648, -200, -1541, 955, 1204, -1148, -1114, 851, 1118, -1583, -998, 2164, 235, -1527, -5, 1914, 57, -2127, 792, 1700, -821, -1646, 1681, 904, -1273, -588, 1330, 797]
2815G97k877K301J709k473p33J583J026k144o76K720j34k171O3K197o51j537P18
2832b82J592q27k187J894J613k396o40J401J083k347o88L085k46k607N76K703
2848A727r85k299J216J948j728k126L005R93k960n5K261L76k871L50L258j642
2864D68k255J531K190k059j419J860Q13j779j216L079j84k325O86J476M99k576
2880a211O20K386j967j074J011J500j724r68J826J141k124j145L209m33k377N84
2896g46K016k86k947J377K909k543j697K064J744k545j117K808O34l664P48L470
2912B225j995j815J173K115j605k581L399Q55k694k48J789Q87k903O05K024k42
2928I89k511P37K413j788r43Q08J758j243k089K802N71k147n89K021O51k859J50
$$ y = [797, -2080, 221, 1930, -543, -1276, 307, 1333, -811, -1487, 1233, 1099, -1072, -1009, 1188, 537, -1000, -282, 1310, 483, -1704, 190, 1803, -593, -1233, 168, 1251, -1096, -1784, 1301, 1055, -1552, -976, 1727, 742, -1557, -341, 1607, -121, -2247, 758, 1751, -1209, -1264, 997, 1373, -1498, -1148, 2110, 468, -1787, -256, 1934, -125, -1544, 316, 1129, -650, -1866, 1213, 1029, -1296, -610, 866, 1365, -1211, -591, 1795, -172, -1246, -235, 1265, -459, -1427, 399, 1540, -584, -1729, 1480, 1047, -1330, -746, 1270, 984, -1963, -586, 2323, -220, -1917, 147, 1891, -654, -1771, 1037, 1671, -1993, -1245, 2225, 230, -1585, -412, 1703, 98, -2483, 916, 1771, -923, -1171, 618, 1505, -1398, -793, 1231, 989, -1522, -785, 1628, -160, -1103, -295, 1463, 220, -1869, 933, 1504, -643, -1232, 789, 1440, -1419, -1269]
2945a269K677m97k669J370K346j869j930K001K062k811j421L624l10k799L33L012
2961A850r21l320K392K330k247k293K655J771l392L02J407J033k916m75L793j826
2977A43j670J182J604k40l183K164J607k131q11J637J300k673m40K401L32k446
2993a224J23K792r77k435J232K478j695k522K782J246k373j425L245O06l554O04
3009a097K717l71l781J823K983k577j670J999J934k622j861L889k56k672N33K103
3025A074K13l338J688K482k128j632J436K473k816j446K669L38j633r86L112k04
3041A302l016J287K047j034k408J526K659k614j889K554J578k702q86K857K45
3056A506l284P52L277j454k416J168K480j921k321K951R86k491r06K372J131l345
$$ y = [-1269, 1408, 911, -1758, -388, 1958, 89, -1841, 160, 2222, -589, -2010, 1614, 1304, -1495, -1162, 1850, 929, -2391, 1, 2331, 84, -2209, 446, 2217, -1175, -873, 534, 1567, -1349, -1824, 1969, 143, -1527, -345, 1259, 1019, -2164, 0, 1607, -524, -1335, 302, 1602, -1071, -1511, 890, 1222, -1224, -1101, 1691, 714, -1721, -489, 1989, 294, -2228, 554, 1800, -573, -1998, 1247, 1853, -1701, -1097, 1620, 1249, -2532, -709, 2274, -303, -1973, 26, 1960, -662, -2523, 1366, 1110, -1562, -1029, 1074, 1287, -2051, -363, 2119, -9, -1641, -205, 2268, -548, -1994, 675, 1013, -620, -1606, 1506, 1302, -1714, -427, 1620, 586, -1822, -296, 2363, -251, -2140, 414, 1992, -710, -1596, 1261, 1506, -1778, -1026, 2251, 797, -1619, -451, 2029, 108, -2213, 738, 1724, -767, -1673, 699, 1830, -1515]
3072a515L74L161j385k446R81K733j720k624K874J182k184j362K820R08l314N00
3088a017K418l27k522N72L134k255j788J939J444j707j712K674J139l358K51K339
3104A224jk640K43K865j178k513J759K318k262j922K655J478k984n19K807J47
3120A477l000L89K790o66l080J756J925j364k246K380J499k607m56K173M83k623
3136a170j7K762j063k382J354J979r60k154J700J822k534o87K233N21k376m99
3152a471L013r62k248J130K368j200k551K014J627j867j490K093J266k774m43
3167a495K863o02k000R9K990j146k459J910J771j800j638K137R00k362n56K405
3183A017K58k774Q31K264j218j698P00K246j651j689K258R65k161p35K301K20
$$ y = [-1515, -1141, 2020, 635, -1811, -830, 1903, 183, -2441, 433, 1615, -569, -1931, 889, 1797, -1517, -1017, 1401, 1074, -1448, -876, 2258, 3, -1785, 154, 1598, -109, -1821, 853, 1992, -1366, -1115, 1224, 1223, -1417, -1174, 1691, 513, -2000, -241, 2077, -185, -2107, 548, 2026, -958, -1477, 1330, 1477, -1523, -1134, 1656, 990, -2090, -334, 1591, 227, -2019, 361, 1860, -747, -1203, 970, 1453, -1170, -1187, 1575, 512, -1870, -516, 1463, 503, -1651, 49, 1871, -663, -1350, 883, 1404, -972, -1471, 1542, 580, -1668, -538, 1830, 630, -1921, 93, 1720, -147, -1637, 456, 1722, -1052, -1495, 1368, 766, -1234, -1135, 1855, 709, -1750, 160, 1931, 131, -1507, 630, 1530, -832, -1388, 1017, 1275, -1499, -668, 1596, 378, -1320, -620, 1626, -25, -1714, 544, 1509, -652, -1387, 914, 1134]
3199A134k361R9K610l01k876J339K150j683j678J483J722k117j036K369K30j615
3215e31j159K702J70k706J078K211j160k438J724J723j996j164J957J151k451
3230h89q32L076p55j492j10K405q15k355J774J141j035j934K071J234k295m09
3246a220K016K29k199J03K460q23j624N80J854j115j895J713J026j534r54K106
3262G23O17k265J3J924K68k749O06K227j100j733J077J897j644j543K450M54k037
3279h15l49J843M56k562P85K176j064j666Q90J729j790p07R53J039j446q33K178
3296H17J64j894K55J456J0j846O79J451r13j074Q54J066j175q47J334O38j546
3313e71o01J810K68k128M49J579j22j782R82J422j546r26J608O26j353n87J559
$$ y = [1134, -1227, -1128, 1482, 1181, -1695, -356, 1794, 111, -1567, -84, 1638, -479, -1515, 854, 1084, -531, -1690, 1012, 1182, -1524, -446, 1765, 605, -1833, -109, 1614, -382, -1546, 411, 1562, -889, -1721, 1355, 600, -892, -1002, 1403, 588, -1767, 7, 1148, 113, -1821, 250, 1484, -811, -1220, 796, 1025, -1174, -1071, 1389, 566, -1058, -478, 1376, 261, -1634, 79, 1105, -429, -1383, 723, 1340, -925, -912, 1012, 1280, -1469, -863, 1364, 264, -1469, -392, 1505, -139, -1682, 768, 1222, -815, -1164, 679, 1135, -1427, -642, 1534, 470, -1196, -306, 1423, -367, -1074, -121, 918, -528, -1361, 817, 981, -913, -658, 798, 808, -1038, -359, 1092, 179, -895, -41, 1025, -150, -997, 337, 975, -571, -1172, 638, 906, -1222, -773, 806, 684, -1098, -116, 1306, -240, -1166, 442, 1068, -285, -872, 687]
3330F87J87j876J12K042n86j706J227R86j053j074J374J037j757m11J320K32j133
3347c92n28J995o76j355Q81J098p53j162J160O38q94j124J376P94j861J84J101
3364D82J08j134m69K109j102r14R47J171q91j722J678L04r72m38J514M06k104
3381a027L19J583l97j292N19J856j746n18J083K14o77j177K030k03j177K37R29
3398E56K87j465N91J038p86q25p7J859j385o92J113L62o40j075J869Qj395K20
3416d37J126J76k042J039Q93p47q26M38J726j817n42J793o9j113j21J593n23j779
3434a232J185P07o11j052J281P39j297m25R62Q42j925M11J022k41p98r8J109l88
3452A91r62P05P96m25j680J388J068j476j49P89Q23j720j03J642o75p45l42J859
$$ y = [687, 874, -1002, -890, 1152, 566, -1140, 87, 1073, 20, -1054, 320, 1357, -400, -811, 509, 741, -392, -920, 1075, 399, -956, -75, 1023, 270, -892, 268, 906, 12, -1112, 264, 1058, -803, -619, 482, 590, -544, -1013, 1096, -6, -920, 27, 1198, 307, -1415, 263, 567, -405, -843, 671, 1077, -1027, -708, 875, 478, -814, -295, 1561, -185, -703, 380, 594, -83, -1260, 770, 567, -610, -373, 556, 843, -622, -31, 1007, 221, -604, -681, 1178, -207, -899, 214, 576, -64, -1139, 730, 738, -657, -437, 689, 865, -1177, -138, 755, 8, -818, -380, 1346, -471, -1013, 780, 711, -402, -523, 1070, 547, -1232, -47, 660, 49, -1003, 278, 1017, -280, -705, 257, 1099, -826, -415, 607, 366, -432, -530, 579, 191, -771, -66, 730, 305, -1375, 13, 1081, -395, -544, 245, 1068, -652, -755, 887, 212, -533, -875, 984]
3470I84n60j801J329P53p99o76J244R19j913k97J656J12j904O13J280n85j094
3487g39P08J193j122r36J330K87r50n38J251L87j563n1J259j03j391P50J025m52
3505C45j194P30J022r56j019J610J96j100l14J203L50j946N00J880r60j102K95
3522d60J713j605p49J657K86j005p37J650J88j699M5J863n68j867J007J612j454
3539a23r45J072J201j320q33J522K97j468j31J470j48j693P69J220m91j322R23
3556@R32r77q64J203O09j317o48J882l88j417O86J145n58j350R76J127r70j213
3574a142J345J016j538o37J550N18j879m3J924p79j495N42J717q32j758J562J058
3591A129j489n95J642L91j894N3J495l8j515M46J506j215r26J025J088j066j156
$$ y = [984, 424, -1377, -48, 705, -94, -770, 474, 1393, -520, -817, 839, 951, -953, -340, 940, 355, -739, -31, 1162, 40, -896, 434, 721, -229, -767, 484, 871, -692, -743, 516, 413, -978, -228, 797, 345, -849, -119, 903, -53, -1072, 538, 734, -366, -680, 523, 873, -1073, -573, 1307, 347, -755, -460, 1253, -352, -1101, 556, 842, -163, -900, 750, 938, -761, -716, 1147, 579, -1288, -281, 1331, -123, -1068, 4, 1205, -115, -948, 574, 871, -597, -728, 742, 594, -1099, -330, 890, 399, -923, 0, 932, -45, -909, 294, 903, -414, -1062, 820, 432, -985, -299, 846, 288, -1062, -86, 1041, 71, -1142, 203, 1219, -319, -956, 594, 1112, -767, -810, 1114, 335, -1160, -618, 1099, 267, -1491, 71, 1129, -360, -955, 687, 1078, -816, -763, 732, 694, -821, -375, 1131, -84, -1010, 15, 1103, 37, -1119]
3608a119J777J72j461m54J819L26j916L11J736q28j589Q77J850j624j002J542
3624D17N04j534o48K074Jj837N24J619n90j378L62K015j486j029J196J057j933
3641f66o37J835N29k037K83J863r88j283Q28J495q92j535J200R48j173q68J719
3658F21J45j587QJ606m7j641M32J817j236j465J538Q68j130j098J268J336k416
3675i81j11J892k57j320l29K458q10j606P95J377j236j152J560Q49j908k44J657
3692F34K6j525J87K187j115j359O80J355j145r71J180J100j976k19J799J39j928
3709i51K58K099q82j917Q95J484q74j377J194J326j572r42J806N83j829k61J873
3726I13l2j761O33J413q34j717J209J289j537o65J290O90j512n11K059j96j474
$$ y = [-1119, 658, 830, -631, -1085, 734, 1060, -856, -545, 1191, 363, -1226, -349, 1501, -123, -1125, 417, 921, -613, -1261, 813, 814, -1023, -499, 1120, 530, -848, -486, 1529, 43, -986, 210, 1267, -666, -1303, 532, 1061, -976, -693, 1170, 182, -1101, -273, 1222, 330, -1205, -5, 943, -230, -1098, 621, 766, -821, -813, 793, 746, -895, -463, 1354, 118, -1347, 191, 1059, -71, -1169, 99, 1435, -981, -1092, 800, 543, -777, -1106, 1352, 542, -1064, -269, 1108, -128, -1280, 280, 1129, -779, -1023, 634, 660, -865, -678, 1509, 394, -965, -285, 1070, -75, -1046, 134, 1234, -742, -961, 838, 977, -951, -693, 1406, 524, -1393, -498, 986, 112, -1265, -71, 1255, -317, -1259, 547, 1130, -699, -960, 913, 881, -880, -247, 1166, 332, -1385, -176, 1113, -424, -1089, 201, 891, -621, -1132, 927, 731, -743]
3743g43L58J534q48j672J361J605j708j013J499P59j758p50K050m0j474M36J501
3760A097n34j745P95J582j106j396J382J042j317p86J484L66j333k34J630j51
3776G76k029R82J066p99j216J148J199j282p11J348N35j721R7J360j1j559K61
3793e56J847j430q53R20J236j263j018J380M63j073k96J204Lj487O30J062l47
3810D22j418N83J566j397p43J477K68j188m03J533m6j413o3J503j9j938J011J173
3828I08n34j372J049J108j562m92J343N59j414o76K198n84j556O83J152n71j425
3845a186J294R17j401o83J218Q69j834K21J253k97r81l1J535o98j177J154O83
3862H56p39q69P70Q19j462j10J008L83j495L06J361o62o53Q8J552r86r32Q93M86
$$ y = [-743, -385, 1149, 301, -1371, -10, 1595, -113, -1126, 373, 1132, -626, -1376, 674, 634, -840, -404, 1097, 563, -1182, -387, 1195, 89, -1307, 75, 1117, -200, -986, 498, 864, -469, -703, 927, 776, -1253, -271, 795, -4, -1220, -72, 1127, -155, -866, 482, 1017, -704, -607, 753, 742, -817, -556, 1291, -139, -992, -72, 1164, -99, -1117, 263, 726, -347, -643, 561, 564, -923, -293, 769, 422, -996, -413, 1153, -244, -987, 490, 758, -430, -833, 700, 654, -759, -822, 681, 662, -1276, -265, 908, 374, -998, 51, 1159, -403, -895, 448, 1007, -407, -1083, 1115, 531, -1025, -342, 810, 239, -1186, 108, 1025, -376, -1059, 159, 1028, -806, -585, 668, 371, -610, -641, 894, 196, -981, 173, 856, 117, -752, 18, 837, -625, -735, 273, 656, -839, -533, 828, 166, -487, -399, 1153, 167, -765, 128, 614]
3881F14j092k50R95O42j420k92J624k41j502O21J070q55o85Q20Q45j314o30J498
3899D48N1r35l04J244J30j509M69J275r70p72P78Q78j197j55O84N47r56l43J505
3918H68m85r36L40P48k9j356P98O47p41m12L40J313j658j11J501k39q23m61J270
3937E74k95p45L33M66q1j317J119O25j036j97Q36N26j073k17R72j99p77K8J284
3956H26r19m86M92P15p94n80J338L39j183j70N76O29j267p9J143p40k74k4J143
3975F85p05o69Q18L16l44o27R80J62j423O54L53Q3p94K92J018q44m51J37Q76j85
3995C32j120J154J27o30m70R43R2j133M62N91j5j207Q75O32r17J27j11Q84j190
4014e74Q8Q41M6p23l28R98k83o50M35L68m9o43M41P33r63P5J28P43r85m46J298
$$ y = [614, -478, -728, 267, 909, -511, -803, 821, 580, -922, -301, 769, -86, -771, 49, 894, -420, -1050, 448, 499, -436, -740, 504, 634, -875, -406, 869, -101, -873, -95, 783, -414, -569, 115, 662, -294, -637, 868, 383, -553, -213, 535, 506, -850, -52, 595, -146, -558, -218, 1095, -563, -674, 827, 588, -235, -696, 574, 279, -466, -133, 333, 252, -1065, 54, 679, -357, -554, 282, 808, -265, -482, 490, 291, -486, -458, 826, -93, -579, -87, 628, -166, -746, 592, 931, -252, -422, 154, 783, -484, -563, 580, -160, -434, -458, 685, -20, -689, 129, 445, 101, -526, 454, 616, -807, -153, 200, 283, -511, -219, 799, -45, -496, -359, 517, 332, -788, 366, 493, -137, -607, 336, 428, -705, -243, 348, 333, -874, 1, 633, -284, -157, -268, 616, -574, -486, 355, 401, -322, -650, 348, 65, -585, -150, 218, 169, -474, -33, 700, -263, -188, -60, 683, -302, -748, 550]
4035E50k39o42n0O93L59j238L54P57n63m25M46P55j243L9O58R0k80n28J033o14
4055h8m15N63M67l27r60R82O9l39m50M47Q39j357L07P69j26m80m42J178o91n74
4075f28M15M82k38p13P23M31p03m2O59J92q36O3P68m37o28J12R68l35q59N98M01
4096C93k19q12R94M19j002m5O50L10j355O57Q52q58k98K73Q39r67o39J106Pn95
4116b90k75O41N43j239M50N04%r66N36O41q10l52O26O77r04k76R79O6r68j82J043
4137D44Qr50J92Q25k66j018O04N91l72q25P85O69p84m67R25O1o57l9O60j29p59
4158e02K75P33l72q87J044M9r75N7J091J18j146RJ451o32r21M44P83l61j267J026
4178A7O56r85l37P92N58j165J40J029k88r00l3J202m74q87N16N35m79l58N34N10
$$ y = [550, 311, -331, -381, 312, 671, -567, -213, 544, -19, -444, 2, 757, -486, -447, 211, 301, 21, -507, 526, -88, -503, 60, 527, 200, -760, 222, 291, -48, -498, -51, 788, -569, -262, 507, 381, -99, -541, 637, -54, -628, -213, 269, 31, -682, 41, 472, -231, -273, 386, 578, -258, -195, 573, 136, -492, -380, 588, 253, -606, -8, 393, 174, -638, 356, 775, -227, -272, 378, 688, -667, -10, 842, -16, -314, -41, 798, -169, -808, 298, 305, -290, -565, 76, 619, -620, -170, 334, 334, -632, -96, 545, -265, -617, 9, 686, -218, -494, 485, 551, -417, -599, 444, 452, -498, -306, 519, 253, -765, -161, 430, 58, -767, 18, 687, -97, -564, 361, 422, -235, -274, 386, 257, -502, -227, 506, 134, -753, 291, 340, -635, -578, 513, 631, -515, -506, 945, 313, -608, -164, 619, 258, -1009, 17, 673, -312, -649, 143, 701, -464, -324, 705, 417, -483, -516, 686, 212, -675, -159, 376, -103, -461, 73, 583]
4198E83q20k73J015N7j113M88Q42p56o89O57Q95j194n96J129M13o52n61J053J05
4217E83j318P23M35j60q70M66Q84q33n00M74J047j219m77J283n0n64o62J389K06
4236H37j463M44Q72l42j255O60R61j008m83J046N06r20n54J213k29p24K91O87
4254E39k92r95Q12O39p26p10J291K06r37j79J055j61j064j24J406l80j111N89
4272a42P83l28j135J140L23p92k85P59J48r47J2J073l12j039N14J041q03o87P93
4291A16P97j001p50J325J44j034j90J236N7j319J93J018m24r26P53N55o79m15
4309e44R06L09j105r1J278m90j040M33R74n74q10O61Q00q07n15R76L06q20l04
4328d57P40J78j054K91Q85m25n56K42R04o34r41Q85P30j053l81J226j07r13k90
$$ y = [583, -237, -510, 505, 562, -551, -63, 779, 23, -666, -9, 886, -308, -904, 225, 638, -14, -575, 478, 583, -735, -12, 423, 263, -607, -141, 743, -90, -590, -116, 931, -288, -765, 518, 468, -96, -758, 631, 837, -626, -182, 690, 348, -907, -247, 714, -294, -777, 269, 775, -145, -699, 514, 285, -439, -148, 539, 247, -748, 64, 703, -23, -733, 558, 764, -173, -352, 703, 542, -522, -646, 760, 380, -731, -142, 641, 313, -822, 318, 641, -151, -436, 323, 471, -476, -464, 609, 297, -742, -228, 813, 10, -677, 116, 913, -88, -838, 487, 631, -403, -593, 643, 700, -619, -426, 592, 168, -758, -5, 550, -129, -544, 362, 671, -434, -525, 753, 263, -777, -344, 630, 56, -754, -93, 707, -100, -615, 361, 667, -153, -457, 283, 461, -593, -302, 583, 158, -398, -156, 748, 114, -827, 58, 788, -265, -646, 580, 473, -440, -730]
4347g30J252K23j302L94R04m91r80N99R46j163n13J128K65j042l9J364n23p85
4365d93L28P82l87q69R86L87j158q6P87K78j105l1J233j97j114J03J088l26q84
4384f78L42R14m56j135J496K25q93l94J029K07r65K0P96k47q56K81R35n74p84
4403g37J075K56j133N7J023k7r87O3R53j36q80M7Q77o10m16Q18M02j122jP52L78
4424F52r23k26J066l71p22L78L89k1p61P03M71q00m65J160Q7q36n78J162j42q05
4444e82L32P45k31p35L96K36J12j124J139L74q96r9O64M52j196K18R25n57p65
4463e92L00N35l80l09M76L82o32j41N46K14q65J14O27L5q58O06N01m74p03O53
4483C5P13r31q5M40M53r26l2Q51j41n72j26O79k67q36O34R38o51p51O53M43o59
$$ y = [-730, 522, 745, -557, -163, 741, 250, -730, -131, 815, -348, -861, 267, 532, -510, -549, 815, 292, -493, -165, 617, 230, -639, 347, 734, -424, -510, 277, 555, -550, -581, 652, 455, -659, -556, 532, 206, -678, -336, 578, 122, -1013, 483, 708, -185, -579, 450, 657, -308, -288, 508, 261, -595, -314, 621, 47, -737, 338, 594, -539, -482, 541, 514, -473, -410, 543, 407, -473, -426, 451, -159, -575, 243, 645, -477, -478, 274, 652, -271, -497, 569, 198, -524, -146, 243, 222, -539, 164, 635, -165, -630, 530, 617, -219, -797, 365, 223, -582, -250, 495, 264, -471, -75, 161, 273, -851, 288, 662, -234, -333, 331, 783, -413, -195, 730, 173, -592, -292, 243, -137, -446, 30, 412, -220, -361, 185, 399, -466, -352, 275, 310, -548, 58, 559, 85, -618, 35, 748, -183, -268, 172, 625, -301, -333, 518, 377, -195, -321, 358, 91, -745, -111, 827, 176, -575, 78, 521, -138]
4504a38k39P05j88l57K2O03j30p95N86M41o58k75O46O5o58o3Q48k06n86p1O48
4525B00K7q16R57P4l10n06M09L27n39l66M68N34p62l7O98j08n37J71O00m91l84
4546c91M38N45l30p92O48J34o61K97L19L9m97p3Q24m64n57M99N18m29n75P74j30
4567A36o7l36L92Jn12K85N59j98l89l04P30l12k86K72K52%o18Q63k20o06J8O00
4589B60J02p14K9O15M7q43L83M92q32M9K08Q60p51k84P35k48l8l48N35j54m42
4610c39N47q0j39l22M23L63p52R4N81R4q21L0P66l93m61L50L33R4q37K64O18n77
4632a64O2K9K77m63R9M26j91j47k13L89R3n43M53J93k38j56J51L01k19l08K09
4653D0J05k57j38M00o5o05K91O22k64k20M05K98n79r6K39K6m42l2R0N62n55J3
$$ y = [-138, -377, 328, 140, -217, -195, 408, 278, -517, 69, 510, -148, -423, 223, 288, -370, -433, 415, 209, -377, -448, 200, 227, -589, 368, 442, 132, -374, 35, 362, -177, -543, -75, 459, -303, -340, 358, 250, -287, -116, 484, -7, -391, 47, 592, 262, -530, 118, 252, -409, -112, 207, 246, -251, -324, 500, 36, -521, -22, 496, 67, -508, 266, 136, 69, -267, 125, 126, -386, -101, 458, 260, -129, -433, 297, -15, -301, -29, 223, 223, -395, 468, 248, -358, -340, 260, 362, -352, -323, 292, 339, -504, -121, 371, -461, -412, -204, 656, -95, -379, 356, 108, 70, -278, 257, 103, -339, 208, 128, -11, -333, 90, 453, -299, -205, 376, 470, -351, -321, 445, 52, -409, -59, 274, 368, -469, -205, 413, -164, -102, -73, 204, -259, -160, 266, 75, -72, -285, 104, 197, -346, 107, 300, 62, -94, 57, 358, 139, -169, 40, 145, -112, -250, 150, 85, -520, -229, 393, 129, -91, 314, 612, 33, -63, 176, 202, -240, -272, -182, 380, -175, -162]
4675a62O64l31m00J31M29l17l20M24J04l41l43M13M31o57M03J1J06m00l48Q83
4695C80k85m39M01M71m07k95J96L48l48l27N78P9n02L09J02j06n31J59N38k89
4715C2k92L51N17o21k58M51J20l93l0K97j64k08K65K20n43m5L91M18p76m4N52
4736B40j21j81j98M85o7j43k07L99J78p36J99L82k10m21Q03J68q32k3Q25q2p26
4757b68p9M41Kn18L18M68k72m12M76L50m78q8K58K58q63P3M35K14q49K28P02n36
4779a40k52L22M08n81k17M16M36m50l9L12k0l40k66O90L2p09K39O45l93l85N09
4800B17L9m42k59P28j39n39l2Q53k73r17O05M21k12o00N94J07j4l39M83J89r30
4821d60n5P58n7k26NK83q9l65K4O49n47m77N71J86j10l57M06K68p96K70M70k30
$$ y = [-162, 502, 171, -229, -98, 331, 14, -306, 118, 222, -119, -462, -49, 382, -275, 128, 139, 245, -155, -503, 380, 95, -344, 57, 528, 121, -174, 22, 370, 22, -305, 273, 352, -150, 159, 261, 155, -376, -217, 321, 32, -260, 91, 608, -13, -271, 180, 300, -93, -123, 174, 10, -198, 67, 287, -256, -301, 90, 508, -268, -312, 240, 119, -62, -260, 225, 158, 15, -192, 207, 385, -351, -152, 230, 20, -401, 402, 570, -262, -285, 540, 458, -268, -347, 94, 96, -422, -104, 364, 92, -320, 156, 506, 28, -60, 198, 456, -407, -334, 101, 315, -534, -306, 396, -140, -392, -70, 338, -243, -460, -44, 392, -58, -97, 215, 195, -145, -411, 279, 311, -398, -159, 486, 93, -292, 217, 256, -186, -445, 283, 144, -395, -427, 426, 153, -764, -159, 262, 50, -550, 44, 151, 137, -202, 281, 470, -460, -515, 243, 186, -40, -35, 248, 159, -206, -182, 467, -80, -557, 14, 200, 90, -267, 139, 407, -389, -119, 351, 121]
4843A21m43M91M61r38J31K23N17q49m0P13N7q01K69N49j30p86J98P42m17l69L30
4864B9L66n08m94R19%p41pR80m07n00J04P76m45n81P09L84n50l82M65L85q34j28
4886d60P90j75m13J45N18k64n78K82N25o92j44N42M06o44l76Q23K2n69Q9N26m11
4907e8o44O99N05n43l80O60K23o86j11N53L10q81QN30j61l07k5R21o44n82O58
4928D5M01p46r7M91K28o47L4M41r6n86L81O22m73p82R30J40m88j31P22L9o48j14
4950c34P79j97n51L10O08m82n95N70M24n55k94N18L98j006P8O22j14l27K4N79
4970D55o18m56O70L25n13n9J61J9j60J0K74J01p74R8P05j11p70P25K84m22k81
4991c37L73L0j71k76O42j43l01N9M51j47n60M96L92q01N1L65N18q31l54Q35J78
$$ y = [121, -322, 169, 630, -308, -177, 46, 563, -286, -326, 387, 444, -357, -88, 461, 331, -455, -257, 485, 68, -301, 29, 395, -113, -607, 312, 312, -429, -436, 544, 137, -363, -259, 517, 72, -509, 200, 584, 34, -348, 117, 502, -332, -460, 330, 155, -258, -113, 405, 141, -437, -155, 370, -322, -466, 76, 482, -162, -538, 285, 307, -262, -173, 353, -58, -702, -3, 502, -41, -421, 239, 462, -224, -335, 218, 528, -353, -345, 185, 24, -283, -308, 613, -31, -613, 45, 446, -300, -397, 94, 322, -325, -291, 150, 54, -532, -151, 471, -2, -784, 146, 286, -202, -333, 389, 428, -220, -334, 445, 248, -303, 7, 615, 133, -462, 108, 532, -23, -317, 201, 599, -407, -329, 293, 179, -148, -124, 455, -163, -619, 51, 376, -137, -196, -35, -16, -176, -166, 108, 209, -565, -467, 238, 127, -643, 82, 366, -56, -337, 36, 66, -105, -381, 261, 118, -183, -124, 327, 180, -380, 116, 508, -293, -242, 123, 641, -190, -544, 291, 469]
5012D69p48o2O69qq54L49M60l84o13R36K25q34n2N59M88p93j62P66j19o27J05
5033b30P20r1q18L68N68o94j50N74N5n96J86L19J47q83O21K48j76k67q4O30n17
5054g0k06M68Nn47R0P20l52l11j71N36k4n56K17M78k52k7K10K0k59l06O54N0o15
5077b48n0Q20j5q70K14M89k03l02K87J64p02M2M25K20p07K80M24M1q29O21M20
5098E21o10M3J62K07l35k45L97J45m86l54Q87j75P3m16L69j89n62N29Q6o2m38
5119d53N33J24l90RN76Nm01k82M90j28k48j14M49j69k45M35J43l16m08L25L32
5140B67m81k9P80m03l80J6O18l84m75N64K86m05m4M2M14m32l30L88L08m92j9M31
5162B40k26k43J48K78k46k66J82M54n97J49L08L1l36K8L60k29k40J25L34j34n36
$$ y = [469, -279, -341, 328, 320, -534, -185, 275, -109, -722, 214, 439, -395, -447, 112, 600, -193, -355, 411, 292, -335, -230, 490, 399, -419, -51, 517, -177, -327, 247, 302, -294, -108, 211, 358, -525, 96, 344, 168, -99, -183, 447, -70, -276, 192, 197, -350, -260, 460, 108, -203, -374, 162, 138, -418, -201, 277, 25, -2, 208, 228, -31, -337, 317, 367, -248, -298, 522, 507, -363, -149, 340, 137, -165, 122, 286, -416, -374, 51, 271, -436, -156, 268, 309, -520, 101, 521, -89, -46, 116, 323, -12, -257, 140, 285, -201, -555, 332, 157, 230, -186, 183, -6, -568, -39, 47, -15, -453, 80, 204, -186, -177, 399, 404, 3, -279, 211, 83, -165, -279, 170, 1, -244, 191, 334, 18, -390, -65, 267, -214, -243, 537, 134, -246, -230, 388, 4, -471, 93, 379, -26, -70, -28, 386, -46, -376, 12, 320, -172, -191, 240, 14, -229, -81, 197, -49, -315, -133, 321, -276, -127, 181, 212, -124, -96, 264, 35, -205, -80, 254, 120, -416]
5183d16N96J29l17j65K55J80n04N1K59M4m78L03O05m88k88L93o0k12k34M06qk18
5205a67L6L48k27j23J62QK23l48J13L35j59l79M24j84k0k85K60L5j6j46K93j97
5227a4o1NM96l40j20m8J89O1n95P94n8m00j16M02k53o2l0j58K15k71L09M33l23
5250E5k83K85J57r3l09L53m1l36r2M03j0j68J30J54j95j66K30m6L12m41L00J70
5272C69m21n9M23j74m26Q5L04k46l6K18j4l8o4L61m5j66j92L49k09n47N10J16
5294I8j64m80M15O08l67j89J58J4j7j90L53m0k55l99Q11l8l95k69L63J85l97K86
5316I1J02m27K27m7PJ85l88L77l5l67j45P53l00k81J32K49k1l43L04O5k22r2L77
5339B01k52k51K92K52j13l37L19Q4p0j22q9M56o36K13J84j34j7l7L96l79K62l80
$$ y = [-416, 180, 309, -8, -173, 82, 262, -242, -191, 68, 112, -366, -63, 542, 54, -234, 159, 99, -113, -347, 59, 51, -167, -131, 217, -10, -133, 29, 37, 260, -88, 25, 360, 201, -178, 246, 62, 42, -243, 17, 52, 36, -110, 183, -14, -75, -70, 426, 86, -34, -82, 107, 168, -427, 367, 309, -91, -207, 195, -58, -120, -150, -308, -93, -364, -55, 378, 55, -228, 57, 214, 121, -188, 165, 124, -212, -304, 99, 89, -79, 51, 205, 10, -156, 74, 28, 340, -101, 199, 369, -52, -111, 312, 138, -288, -203, 101, -145, -181, 37, 23, -15, -79, 282, 237, 71, -121, 228, 19, -528, -18, 98, -66, -546, -131, 477, 110, -79, 79, 93, 76, -114, 239, 199, -56, -455, 356, 318, -77, -346, 17, 202, -195, 91, 193, -234, -7, -54, -47, 138, -250, 127, 92, -275, -420, 333, 33, -248, -116, 133, 112, -231, 73, 138, -84, -176, 201, -51, -302, -10, 242, 129, -208, 111, 195, 125, 3, -86, 370, -266, -53, 131, -3, -20, -57, 339, -40, 222, -158]
5361a58M13j83k72R2n4J12r4Q5K72l28q3N91o0n44j69N60j38l74j08N73j51j0
5383b8J7N83m92j45K02L8P7m92L60M4m65J84M8J06r7n8L16l29J55J22j7m73q0
5406d24O50j93j28J94l9j91k53K90L37l51k01K79K44n01P9M43j86m54J36M49l72
5427a92j00O3M10j47j17K39J08j43l67K01L56o27J94J64J35j87j31K34J35m93
5447b65O3M39k46o2J0Q9k50J86K14J3m59N9O92n97j92L80r9L18m13J02L41l70
5469d7m1K72j60l20j3M11jl63K14R5k96Q1J35K86l98J19M6M6j90k12O03j01l86
5492b20J35O19k97q62P99J85m17l78M68J96p21J94N14m6o69O81J48j74n92J91
5512b46N72m59m06N50J68j56l07M40l06L0k5N05l59o7K26k8m63n6M58J74k86m31
$$ y = [-158, 255, 72, -200, -108, -162, -50, -144, -59, 213, -115, -198, 393, 333, -211, -380, 180, 42, -332, -440, 133, -18, -28, -11, 572, 80, -65, 137, 175, 252, -240, 120, 164, -301, -117, -69, 37, -60, -118, 198, -131, 24, 146, 129, -344, -424, 226, 33, -95, 99, 60, -131, -384, -94, 243, -108, -309, -30, 214, -287, -208, 235, 49, -405, -269, 180, -192, -292, -229, 181, 34, -83, 156, 264, 121, -246, -45, 311, -316, -122, 42, 177, -10, -141, 93, 228, -265, -202, 237, -9, -71, -61, 28, -222, -36, 178, 191, -268, -209, 483, -114, -306, 74, -25, 293, -120, -18, 323, -47, -88, 184, 24, -296, -309, 102, 101, -262, -48, 47, -249, -168, -33, 253, -145, -26, 20, 66, -124, -336, 267, 166, -220, -85, 534, 237, -625, 174, 359, -58, -436, 32, 228, -493, -299, 215, 169, -500, 181, 329, 155, -437, -246, 326, -133, -539, 11, 179, 23, -284, 156, -150, -120, -145, 360, 1, -66, 160, 132, -331, -387, 71, 245, -41, -472]
5534d72N84R4k96k30O59j15m84K07L57j43l92P4M54n79k7M72Q5o12O9O05n8o56
5556d04L71M68l83l16L38P7o1o23Q71J51m57n1N40j59m60L5J85j07l34M09L18
5577D08k53m81N51j51k16J83J35Q9l58J32J84j56j45J66J89p12J33L09M22o74
5597b45j25O18M6n15K8O88m79j02L6K31j98q0K05j2j68k79M26N1n41J94L36k8
5619H7l23j0M43j65l27L35L79m86j22K27J95p16K89O54k03m63J18L33n54Q2K81
5640E4K26l34l11M25J70j91l65P05k29o00K92K70M0n95M60L83m08k87J85L54m57
5661b13kM35j18l6r1P2k03l56O21L91p21J53L27J0l56k18L53J70l46k09P06l72
5683ck66K50J22j53r5M11L3k2n62M05J81m35n8M15j13j38N2J15j17j98L81L4l28
$$ y = [-472, 112, 206, -90, -320, 339, 224, -260, -53, 304, 161, -231, -157, 297, -282, -309, 163, 248, -364, -295, 310, 252, -404, -33, 435, 52, -264, 74, 151, 90, -533, 338, 489, 32, -19, 521, 362, -98, -63, 122, 15, -319, 90, 408, 155, -326, 225, 74, -142, 41, 176, 265, -93, 39, 223, 67, -78, 88, 277, -435, -302, 7, 429, -245, -370, 248, 294, -221, -193, 495, 16, -86, -50, 181, -17, -97, 108, 96, -72, -351, 75, 126, -415, -221, 115, 87, -236, -246, 197, 32, -295, 40, 419, -67, -189, 38, 233, -483, -194, 460, 257, -206, -88, 245, -309, -227, 54, 280, -54, -365, 60, 230, 39, -326, 379, 150, -450, -158, 112, 152, -443, 17, 400, -8, -295, -110, 244, -213, -215, 220, 102, 66, -25, 47, -156, -512, 109, 500, -221, -68, 259, 269, -87, -305, 48, 218, -128, -337, 369, -3, -269, -19, 103, -50, -145, 266, 299, 277, -285, 120, 301, -134, -192, 223, 110, -28, 24, 139, 22, -176, 205, 239, -89]
5706h9k53M80J28m24k22N16K1n59L52L52m11k99M15L36j90l54R9J67j04%J03J80
5728B44k09p2K29k91J92m6k8m3l56M50Lj63m5J96J05k36m1L60k25k71J76k5R3
5751ck07K41K92k43k74L34l4j8l68O03l85j00J02K54j75l08K60j48J85l20K48
5772f4L39m78K16K47j03J5J7l51K85k07k03M74k24j80N31J5j72m37L51J28k80
5793h1J25J04j67J59j89J73j69J8J88l3qk87L48n0k12j0k1K30k49j7J81m0k26
5816b33n3M11j34j00j5O1j64J42K05J05k24r1J15R7k94J98J31P0l92K61o5k37
5838b06Q7K36J84m61Q1J89O9o24L96J34J89l61J23J32k0k36N8K07m20OK81J18
5860A62l08P5J7J9J20Q8j05J43k31J59j42O8l38N1L80l35J22oO80n13k15M81k40
$$ y = [-89, -342, 138, 266, -158, -380, 136, 157, -402, -50, 302, -109, -408, 7, 343, 153, -201, -102, 65, -39, -39, 64, 244, 35, -37, 192, -99, 93, 47, 19, -24, -380, 70, 73, -90, -135, 61, 166, -70, -111, 249, 24, -247, -71, -96, -3, -210, 31, 323, 80, -194, 140, 106, 88, -280, 323, -62, -162, -60, 194, 19, -289, -29, -177, 8, -312, -64, 275, -203, 13, 260, 157, 172, 189, -162, 123, -84, -287, 187, -37, -217, 314, 329, 157, -280, 71, 199, -81, 44, 148, -19, 140, -49, 124, -45, -27, 161, 128, 120, -167, 181, 131, -81, -91, -112, 118, -131, -148, 33, -7, -233, -286, 125, -9, -109, -124, -63, -227, -85, 120, 225, 1, -90, 25, 122, -172, 26, 157, 227, -165, 96, 31, -206, -119, 117, 301, -160, -79, 110, 179, -445, -49, 85, 274, -87, 36, 168, 148, -88, -30, 177, -243, -237, 44, 162, -146, -71, -54, -35, 85, 173, 68, 211, -20, 139, -3, 65, -273, -222, 158, -177, -55, -61, 619, 106, -109, 372, 132]
5883A32n8k78J26j39J68m7M64l85m1J61j23o3JQ0J76l80J78K00l11q9L03K76l41
5906A0k65k0M23k11j45L38j55p2N6K42l71Q6P5kk6j19K3L79k35j80J21J87m70
5929c31Q7J49J44j18J21K68j8m41M5K26j65L1K89l07M4r5J67%k73NL63m03J51
5952f1K25l2n5o9L72n18j23N9K89L9k76j95R3N05l87j78N79k10o9j04J62j49k44
5975c47K73K52m38j00M90j55oo4J29j80pK11m2Lj85J53qj49j19L44L3m2j58K65
5999A53k80L8l1Q4j86K34pJ55l58L04m4jj9K2M69m15l32L46j00m6j35K48J60l90
6023a31N8J27L0nl55M96p6m60K84K45J2m30k9P04q27N1J78L70j15l37M32j94j45
6046a17J08L57l91M0Q3N6j5k94R6K01j65Q0J60L7m33J9O50o56j18J08L12k92l93
$$ y = [132, 74, -204, -78, -217, -49, -96, 368, -17, -58, 103, -20, -83, -82, -2, 174, -206, -28, 172, -139, -228, 75, 351, 10, -255, -275, 148, -63, -208, 130, -25, -97, -41, 201, -170, -84, -9, -11, -37, -156, -133, 246, 11, -169, -48, 139, -331, -244, -95, 49, -69, 52, 320, 302, -139, -94, 132, -33, -2, 287, -20, 24, -71, 96, 96, -177, -172, 191, -212, -61, 164, 132, 77, 8, 380, -138, -261, -202, 87, 126, -150, -345, -252, 253, -134, -312, 267, 57, -12, -116, 46, -103, -347, -74, 178, -260, -360, 130, -25, -31, -95, 34, -146, -153, 58, 16, 19, -166, -13, -21, -170, -289, 55, 88, 46, -112, 153, -127, -89, -120, -36, -222, 12, 5, 160, -198, 106, 62, 61, 42, 64, 533, 118, -214, 132, 32, -14, -149, 99, 259, -131, -73, 54, 84, 79, -276, 220, 144, -316, -32, 213, 225, -205, -234, 470, -357, -306, -128, 242, 127, -210, 222, 28, -117, -9, 348, -43, -3, 80, 136, 121, -173, -77, 124, -41, 39, 199, 236, -197, -178, 472, -184, -302, -194, 118, -174, -567]
6069e67L96K49k44J2M37J09n98j28N18k51k83J06K77K4k64k1N95p10J47L65l8
6090A31p7j40K92k89k01K11K19j16k22M86R6p05J05J00K65j96k07R5K25n14K95
6111a47M33l12m52K20N43l79j76R7N13o71J57L03K73p47Q2N44l03j38J9N44k46
6132A57l67N87k31j84j78M37j88n3q6L91j31n66L46J83pk55J93K77l89O3J00j9
6154H0l61l1M72j86k5jL19k26l67M24K47n70OO1M58n16p2L21R6l63k39Q88l33
6177H2l82M60Qj16J2j8N1j30q3M8J05k56q1L52N1n19M10K04J19n32J55L54j12
6200A82l82O22j47n32oP00m47qq1L16m31k10O14J23p4n59M83J53n94K49J66j33
6222Dl10L65J93m38p7L58J01k52j15NM43m69J50K4J06j00o5K50p1j87O0L18k73
$$ y = [-567, -171, 78, -166, -154, 283, 392, -206, -334, 184, -67, -350, -244, 33, 57, -207, -228, 367, -343, -196, 169, 131, 54, -86, 206, -83, -284, -73, 146, 30, -192, 294, 390, -315, -210, -110, 155, -41, -248, -153, 72, -442, -147, 286, -26, -478, -258, 285, -94, -270, -173, 340, -331, -174, 129, 402, -345, -263, 281, -22, -160, -141, 403, 157, -210, 377, 146, -38, -216, 221, 33, -20, -106, 285, 154, -412, -66, 117, 110, -145, 48, 325, -64, -1, 99, 80, -281, -312, 160, -26, -51, -52, 267, 41, -326, 98, 345, -225, -219, -158, 300, -216, -288, 33, 129, -234, -473, 415, 82, -300, 160, 168, 52, 64, 46, 97, -33, -116, -68, 37, -219, -300, 52, 103, -416, -6, 198, 317, -215, -60, 294, 182, -200, 422, 275, -257, -263, 437, -10, -18, -99, 217, -214, -424, 190, 313, 239, -320, 163, 316, -278, -29, 137, 4, -306, 59, 252, -186, -263, 95, 196, -56, -171, -166, 277, -192, -42, -18, 88, -12, -77, 173, 102, -85, -25, 293, 20]
6245B0k33N10r6m48q8L13Ql87J44N09k92r9O0J39l63j01O43P6k79j10Q5L72o17
6268b34J33M47l60j03k5J87K11m15J40j10K33r2O9n9p6k83L48L23l98J97%L2k95
6291a30o0L52n16M14L0R2l92j09M70J74m21j9K59jj70J35J93k89L5J86J7n36k5
6314c11N92n9j81j47L94m10J22R8n9j33l2L6L68l81N6k4K05k70KM24l52j24R0
6337i6K04k23k92N43Ql37J55J98J77n64J08K45j63j4j21M31k50j49K77J7j39l19
6359c04M67l0k13n7J2K92j31O7j50j8J2j2K66k16j31M01k60j60k37O49k75p9l4
6382a41M28j56j78J62p2N2j46L22k92n5J03p4M2J46l48K17J38k54mJ42j0k31L39
6405A30J61l19P5r4J39j49j25K00K4Pj71K06j95J41J06p9r4N0j16J14j13O2j46
$$ y = [20, -213, 297, 201, -247, -335, -22, -14, -401, -257, 252, -40, -139, -79, 60, -303, -404, 239, 315, 36, -74, 11, 383, -234, -101, 346, -14, -117, -142, 45, 256, -159, -19, -129, 104, 12, 81, 22, -54, -337, 11, 334, -64, 133, 133, 165, -130, -190, 162, -354, 60, 90, 182, -210, -319, 151, 325, -96, -115, 144, 143, -27, 108, 301, 12, 47, 233, 250, -286, -311, 281, 222, 41, -106, 288, -122, 0, 98, 39, -94, -126, -90, 278, -103, -47, -71, 134, -136, -134, 290, -62, -186, -96, 108, -115, -407, 136, 144, -193, -38, 160, 337, -227, -119, 126, -37, -51, -172, 259, 9, -140, 137, 154, 15, -304, 163, 133, -80, -137, -125, 167, 36, 103, -47, -65, -53, -65, 201, -15, -146, 255, -5, -165, -402, 247, -28, -107, -141, 287, 131, -47, 115, 43, 95, -51, 271, -21, -76, 27, -47, -5, 141, -207, 10, 148, -106, -110, 32, 22, -209, 130, 291, -28, 47, -47, 92, -57, -182, 18, 42, 49, -122, 84, -111, 30, 136, 57, -37, 13, -103, 11, -102, -40, -186]
6428a86M51m06J02K29j36k93K19n6N6j36J41K34j86O5K8j27O5j74J40PJ24m14
6450b53J77K16k72l8L75j51k05K59n1m6J63l2L1j14j99K62j07j15J81j37K00k03
6472e9r9M06j23n50N79R9j89k06K68j27n3J96n7L8l34L48K54k18j85q3L27l82
6494a50J05j4Q0J08j47o5Q1J07j68J77n6l17L10P8O7k78qK61M2m42L98j74q1L9
6518d7K95k18l58J91M29l51m0J0K04m31K91k4Q2P6j56J11lj10j02K07K30k70K6
6541D2j65K82k77K42j29J70l82L55J29k29lJ08k3j90J38KJ40r7l06L95m40J44
6563i4K81N8m61J16K08j70kk60L65R7r5l13N06j44q8K6L89l39q6j10L38k79j8
6586g5L04k41k24M3M02j57k58L91j27m6l2J57K08m57l55O59l90N1L69l41K68l98
$$ y = [-186, 265, -141, -39, 190, 54, -239, -20, -76, -20, -156, -15, 219, 33, 98, 126, -1, 64, -110, 30, 37, 161, -253, -76, 140, -132, -170, 205, 54, -151, 108, 57, 11, 174, 142, 173, 59, -140, 122, 15, -100, 81, -56, 144, -59, -158, 248, 125, -425, 154, 253, 64, -142, 126, -1, -54, 142, 85, 123, -211, 137, 391, 173, -12, -95, 232, -150, -45, -59, 21, 129, -18, -83, -2, 105, -63, 114, 58, -259, 51, 129, 196, -82, -90, 171, 213, -229, 169, -5, -86, -47, 248, 30, -328, -137, 292, -59, -99, -89, 115, -316, -25, -49, 33, 109, -47, 64, 61, -49, -151, 56, 286, 16, 42, -123, 159, -118, 124, -5, 165, -217, 138, 267, 38, 35, 143, 120, -70, 68, 70, 210, 113, -193, 202, -238, -94, 187, 245, -216, -100, 108, -62, -64, -324, 41, 138, 43, -270, 236, 92, 4, 30, 419, 80, -6, -116, 222, -57, -75, 229, -12, -236, -193, 209, 52, -206, 185, 58, 12, -20, 137, 345, -112, -467, 192, -198, -147, 222, -119, 149, -249]
6608b49M03J9k82J35K31k61J4j04K8K10k70K89j72j18m0J48Q3k09J29J44k7l16
6630b15j2M61j06l42P5L89k68j75K98K97k01k33k06K31N7k09J17K38k25j24Q4
6651f9j8k29J54L20j76o9J53K04l81r1M00l60L9k18J34N72o48J46M32j84j88J18
6673D1K07l12l28N29pl48j37N06o7k93J29L99l73O5r0N25m32k42j7M18n40J40
6695b27L68J2j95K35P5k80MkK36J7l45L48q6M1n60N44O4m25K45j24K31k56K1M08
6719C49l13j51J7K02j05j04J53J02j12j65M03k81NR0J77j83k74L7K98K18n84L51
6741A30K15n35O5L89j15k83k42O55k08l99L64L93m80r8J04L65n11j25P07n65o7
6762b41L18j26l4J97j57J75k85j5J22K06m4q3o1Q7k26qL47j23q3m1J89jp23P35
$$ y = [-249, 154, 173, -109, 26, 257, -4, 10, -94, -66, 144, -126, 163, -9, -127, -167, -19, 64, -145, -16, 128, 101, -215, -227, 234, 128, -214, -139, 250, -18, -193, 105, 402, 201, -32, -238, -7, 50, -159, -42, 196, -29, -153, -69, -87, -316, -162, 158, -18, -87, 66, 270, -111, -202, 198, -162, -123, -341, -207, 365, -283, -137, 295, 111, -77, 41, 248, -64, -392, 137, 130, -218, -355, 151, 84, -209, -80, 319, -54, 11, -79, 446, 14, -228, -245, 173, -367, -227, 141, 153, -42, 193, 268, -12, -8, -10, 226, 243, -102, 246, 160, 201, -359, 185, 249, -176, 69, -55, 176, -80, -59, 349, 36, -115, -98, 104, -1, -105, 48, 150, 38, -127, 276, -5, 0, 90, 267, 84, -190, -153, 145, 363, -221, 130, 345, -190, -125, 264, 149, -134, -376, 279, 71, -328, 36, 429, -51, -149, -45, 320, -191, -316, 391, -174, -241, 77, -49, -83, 114, -43, 132, -153, -168, -46, 160, 116, 33, -28, 59, -167, -175, 172, 49, -34, -75, 114, 113, -610, 125]
6786A25Q5l52J04R8P1k09J25m2J24j29L3K14n1l80K13N1k45K43J25N9k46j73K65
6809A08o4k97J59K61l32KJ63M15l82k1K16Pj44l16K58j69R1J37J47j23m49L64
6831C1J75l37M5J08J49k01j84K65J56r8J74k11R2l88J41J75j07p5K63k8j97k7
6853g9p0L52j95K8J55l2m11N4M20k15k2K3J74k54L1P5L6pp8K18k03M0j38J49o2
6878a1K0j19L32l41l8j6J34m35O2O29k25K27m29J32J89k43J80K8j84Q2j09J34
6900aK7m29M60k2j72j43L18k83J58K21n6Q3p7R3l9n1r4J24o4j63K6J26J33m78
6924c03J59L96m80L56j70j2J44l21L69L9j66j27J43R1%j91K90m0l48K88K1j92
6946e4m9M08m71n5K4K26R0l87K37L57k02n57L35k6J35k36L37j16J93j65N7J9l15
$$ y = [125, 210, -142, -38, 60, 131, -78, 47, 5, 129, 0, 33, 247, 196, -184, 29, 80, -165, 78, 203, 262, 16, -157, 108, 44, -253, -94, 167, -165, -163, 0, 415, 33, 12, 228, 235, 91, -225, 33, -136, -45, 92, 239, 116, -333, 31, 206, -131, -86, 22, 171, -30, -214, 51, 207, 109, 283, 72, 164, -224, -83, 92, -15, -90, 173, 145, -52, -79, -149, 203, 8, 36, 191, 159, -252, -198, 222, 7, -15, 8, 182, -72, -41, 34, 70, 63, -15, 203, 0, 40, -98, 51, -11, 9, -110, 222, -119, -157, -173, -39, -474, -412, 217, -8, 219, -210, -78, 111, -132, 48, 76, -108, -26, -135, -1, 26, -403, 57, 35, -137, -280, 38, -245, -87, 134, 78, 161, 84, 177, 138, 87, -7, 117, 53, -110, -84, 42, 175, -303, -144, 252, -228, 128, -42, -54, 90, -231, 138, 177, 11, -116, 27, 118, 118, -73, 217, 177, -171, 117, 138, -54, -103, 305, -166, -221, -197, 29, 119, -268, -31, 326, 124, -433, -98, -124, 11, -225, 112, -4, 189, 24, 81, 100, -215]
6969b15K5J94Q2j39oP5P0k98J32R6p9k28K46L48j69k24n1j5k6P3L75l29j45J08
6993a00J00k79J24N1J27J7m2j01M9J34l26M4K33N7Q2k05J17j57K36k53J13j93
7015a72K67J06J11l61P5J6l02L91R2k63K4j78J38L9p2j17M35l02j17M56J74n48
7037a08mJ42J5Qj8m3l8R2j13p9K85n1O2r8j2Q2n1O2j35J21j60Qo1J25K47n3l01
7064g6K02k60L17j22J39Ml03k53N24l45J68J11O5l14J48r2k3J23k7J09q6Pk75
7087b59N95j45l41l7L66o2j58L44j47j98j95K09K83j22k37k6K12k18k1j1K64l34
7109b38K47j2J57r1k14K05k66L63q5K35k77j72J86j8j19J44K32k74J82j9o2j12
7131hl5j66J97o1m7J61j15L2j95L46Kj08P0n9j74J94j2j05kQ1m6J44j48L15m2
$$ y = [-215, -190, 4, 86, -53, -59, 16, 86, -212, -80, 16, -63, -291, -45, 303, 134, -90, -141, -156, -182, -109, 266, -63, -208, -100, 0, -279, -155, -104, 23, 40, -2, -103, -54, 80, -246, -202, 31, 88, 170, -35, 82, -75, 161, -92, 21, -172, 95, 201, 312, -49, 26, 42, -260, 131, 223, -40, -16, -194, -56, -17, -89, -206, 229, -73, -190, 266, 440, -108, -112, 30, 45, 53, 35, -8, -46, 46, -67, -146, 139, 88, 150, 52, 40, 122, 71, 133, -2, 119, -41, -33, -94, 31, 278, 225, -76, 126, -134, 183, 61, 200, 204, -99, -352, 172, -173, -5, 106, 171, -143, 5, -87, -110, 13, -14, 95, 9, 16, -259, 336, 191, -150, -187, 179, 117, -41, 303, 156, -42, -237, -28, 255, 133, -104, -130, 82, -136, -157, -168, 96, -238, 9, -3, 154, 63, -151, 54, -212, 151, 66, 301, 24, -148, 38, 20, -99, 45, 277, 3, 185, 166, 104, -8, -43, -209, -12, -73, -120, 41, -74, -42, -237, 109, 111, 3, 73, 14, -160, 34, 22, -83, -85, -4, -50, 94, -54, 261, 219]
7156B19k12R2j40K74k53J90k37lk03K07K06o6l71J03J09mJ2M6J40M0k15P5pQ4
7180H6k83K26K05l72K4k6K37j37J56M79n02L8r8j96p0K69k30J4J77k31J21J74
7202F1k95M19k41O7k49K78j5J3l81M75o5m02L51jJ27m74o3O06m22m6J75L93l56
7225d5J4L92k68K16m27J28J46l59K1M84m06J24k88N83k83j51J79J37k28J26R8
7246A93o6k6k55J02pl87L25J58n1j14j0J98j63k99L42L8K3j81P6M00l76k54L62
7269B8j94p6M42j0k17l6J20M4k46pJ59n0O0k88R2O27o33K65j5k36r0J57J94j56
7293f6k71L73J85k29k99M32J1j44r6J41j19Q3K11j65m5l26K04N96n56O3r0K00
7315I3j20j29J88K8k6J48J07l80L4l1K76j94j02J94L03o30L56j05r8q1k8K77j2
$$ y = [219, 7, 99, -41, 233, -20, 170, -67, -70, -273, -66, 140, 74, -297, -194, -85, -89, -77, -31, 109, 149, -66, 9, 2, 86, -197, 29, 234, -138, -114, -140, 97, -40, 116, 595, 93, 131, 33, -163, -233, 36, -194, -180, -3, -234, -113, 61, -234, 185, -56, 11, -238, 40, 25, 38, -343, 132, 67, -335, 16, 15, 142, -332, -395, 211, -211, -257, -82, 311, -45, -31, 361, 93, 309, -118, 10, 156, -203, -182, 302, -104, 20, -268, 315, 32, -119, 60, 197, -31, 95, 193, 127, 101, -154, -52, -59, -446, -121, 37, -14, -128, -138, 60, -103, -402, -60, -22, 1, -180, -104, 296, -80, -334, 28, -166, -242, 200, 190, -27, -63, 57, 101, -145, -152, 7, -43, 17, -271, -179, 448, -185, 80, 65, -171, -261, -104, 90, -66, -337, 36, 221, -8, -307, 125, 136, -8, -104, 37, -82, 1, 212, 47, 2, -324, -120, 476, -80, -17, -107, 93, -27, -156, 32, 60, 34, 182, 289, -91, -57, -88, 188, -6, -108, 86, 389, -241, 115, 10, -88, -169, -197, 80, 68]
7338F8j31p1K55l04k08L27M39n50k6J99K18k28Q9n1J46j35J33K15m09j77K27Q2
7360A08r0m8J95k81n3L28j02J59l01R1K38j76k93K44K04m73N6L69q0l68M09j62
7382b6p6k53M61J78l28k36K48K5o1j30K80J29n32L53O0K10j26k84J67k3l31M15
7404A20r3l28J02J9L72m57Q9P9N23m79K35q9J98m18k35M52l46O9K96O0m28J12
7426a47K79Q6k08J16Q0P6l92J76L8j96M2J96j25j0k98K07k1k28M16o8N8k94P8
7449a39J94k10Q4J70L8j50j11J40q6J04q0R5j02m9P7M3J2k05J69K39k84j7N7K94
7473B83m14J59j05J42k70J03R5j58P7l6K88j18j23K11m0j92o7M95R7o89M8R4o3
7496a83Q4K07r1j03k9N8M9lj3J15j7m8j00m7R0N0k28L85m26L42k88M56l59L81
$$ y = [68, -63, -134, 121, -183, -391, -64, 375, -175, -201, -2, 216, -12, 77, 26, 172, 37, 170, 385, -24, -201, 26, 108, 18, -30, 165, -116, -169, 159, 57, 216, -85, 6, 244, 68, -225, 19, 223, -250, -194, 175, 95, -273, 136, -26, -102, -355, 106, 284, -44, -280, -32, -7, -68, -198, 82, 211, -321, 32, 92, 302, 176, -108, 59, 36, -295, 120, 27, -301, -199, -180, 192, -265, -176, -97, 426, -53, 182, 93, 291, -127, -362, 90, -256, -187, 109, 169, -259, -147, 132, 218, 10, 126, 206, 282, -110, 66, 104, -92, -50, 146, 21, 11, -287, -80, -101, -329, 87, 19, 77, -217, -139, 55, -155, -71, 99, 137, -13, -124, 16, -70, 34, -46, 49, -53, -102, -25, 18, 30, -175, -6, 233, -51, -68, -11, 283, -131, 28, -77, 65, -205, -102, -7, -165, -88, -124, 164, 46, -77, 134, 94, -98, -165, 330, 427, -262, -214, -120, -183, -99, 108, 17, -86, -115, -57, -8, -11, -24, 91, 74, 26, -74, -121, -31, 19, -209, 176, -250, 92, -196, 260, -99, 282]
7520B82m4k68k64K60O7k1K5r5pjJ22j82K34l93J24K36L3K2J36j60N6k12j3K74
7544B11o6m27L68P9k83r3J68J76l3j97j08K93R1l40K46N4j77k40K28Q4k30J16
7566h0L05j95n8O4kj8o9j2m7N3q7K70J29k06k51K93j13K18m63K57P7j29K8J99
7590A63j29M7k54K26k89J22J19J5N2n0K5j42O0K05p8k3j52r5R0j79J89K64l15
7613a29L6J8K69m84l0K61J4Mj16K05q0J52j25j45J58M1k23L31l96j04K84pl61
7636d27N70J12k72j1j69L01j84N5j31K37rj71M04l52n8K98k98J91j5M7k14J64
7658F8m1k31Q2Q2R5N0r4J24j31j24K85n7k85J25j24k20L56K6J50m44L29P3j85
7681i1k80K52N4p7J24K27j17j47j57L13Q2j45J8l5k70K81j61P7J40j79Q5j01P
$$ y = [282, 238, -30, -294, -34, 33, 12, 37, -58, -65, -66, 56, -126, 108, -285, -161, 75, 108, 130, 266, 106, 162, -50, -63, 211, 145, -282, 86, 165, -118, -211, -43, 133, 100, -97, -205, 88, 179, -161, 85, 139, -38, -278, -50, 34, -196, -80, 225, 30, -28, 36, 34, 16, -53, -65, -112, -59, -146, 124, 253, 47, -204, 89, -24, 194, -269, -12, 65, -64, -36, 163, 34, 81, -173, 53, -236, -114, 5, 20, 72, 22, 47, -95, -35, 170, 92, 69, -83, -178, -88, -267, -78, 186, -129, -93, -75, 194, -290, -320, -59, -45, -41, -157, 48, -32, 120, -5, -150, 8, 49, -174, 157, -239, -343, -59, -66, -427, 143, 255, -17, -28, -197, 104, -80, -25, -156, 81, 72, -99, 305, -47, -105, 193, -105, 86, 71, 118, -96, 68, 27, -204, -122, -40, 55, 105, 11, 135, 4, -120, 165, 108, -177, -52, -176, -396, -40, -14, 136, -308, 21, 94, -91, -371, -119, -65, -142, -18, 209, 92, -55, -212, 101, 183, 38, 56, 21, -249, 32, -129, -52, 88, -91, -6, -107, -100]
7704a00n3J33r9j10J49q8q7K42N4M6j3k25J41o1P7J21j29j14O2o7K14l0j11m9
7728i7K13rk77K63q9J12l4j17M7J46l40J59K04j27j30PJ91j60j65K50lM6j31P4
7752C3L23m14m6N34o77l1K76K17l05r7K44P4M2Q5k37j0j24K92j38j73P1O9J2j22
7776a02LL42M7k82J45N0k13j88L85m21K05P8rK52j57o8k4j04L8P1j17J17p8R2
7800F2j0k13qn4J18J41K1K1j91L9o5K10N7j49j61L03k10M9k24L68k30k8o0l0J10
7825a34K59J12k61r5L7J7j65J48Q7R9P9k62k54M82k21J18K00l14j03K80Q9k81
7847h3J05N2K0j88K11O7m2n56L24K36o9k90L24K38k31k58P4K62j76r1K58j02j54
7870f9Q2o1Q0m1p2O7N1j05P9N6r0J33N9M2j80l45L49n6k59P5L74k66k13M31j49
$$ y = [-100, -153, -20, -119, -229, -80, -168, -255, -13, 41, 87, 74, -151, -10, -71, 6, 127, -2, -116, -54, -121, 93, 63, -48, -97, 116, 107, -170, 93, 4, 116, 82, -35, 12, 158, -182, -23, 181, 54, -76, -69, 122, -38, -203, 47, 44, 90, -41, 33, 356, -58, -104, 430, -247, -278, -2, 215, -90, -187, 57, 131, 173, 258, 21, 11, -113, 179, 41, -132, -61, 8, 20, -102, -99, 243, 290, 8, 153, 203, -10, -198, 187, -234, -29, 49, 40, 292, 135, 67, 43, -61, -23, 48, -69, 48, -30, 62, 52, -161, -169, -223, -105, 36, 57, 78, -113, -74, -139, 71, 128, -21, -182, 121, -89, -40, -264, 104, -126, -154, -214, -244, -134, 125, 237, -24, -119, -82, -65, -230, -82, 5, 104, 183, -79, -333, 149, -72, 46, 246, -68, -171, 109, 198, -83, 22, 74, 94, -94, 117, 184, 142, -414, -90, 146, 77, -213, 111, 349, 118, -140, -66, 196, 20, -71, 187, 85, -69, 13, -48, 32, -9, -81, -14, 37, -68, 11, 67, -23, 110, 169, 211, 31, -314, 35, -21, -280, -205, 169, -97, -310, 121, -28]
7895b8J54l71J40J09N8k86L24o9l48K15L08J51o04M35m5r2j87K30j40j01l74L77
7917a44J38o7M8K88J58n69j17M43k47k13J73K16j08J0j17J80k02L3j27M71l61
7938a14q7K25p1J55l01L16l45R5j14K78k12j58K25L64l56k3L0jk70N07p5K84p87
7961d35L21L64m50J02N20l79j34jK39k75j52M12J51l76JL23l12P7l00K32J65l31
7983b38O1K76k18K82lj28l4K0k46O28n28q8P7M1j49j86N50Lk53r7J92K22k88J78
8007G4J39k73J28k22J23p1j72K93k5r0J29l5j25o8J91J61O8k33r1K84j35p1J54
8030A33k9J99k00M1k58L1J2K21K6k88K80N1j99k9J29m4j09k52L95l4k76L1J87
8053A8n3j30K87N2p1j5k46J27j4k20N01k81M7r1r1k5J58k7Q4Q2j84J02J80j68
$$ y = [-28, 126, -245, -105, 4, 62, -224, 100, 31, -317, -102, 206, 357, -247, 188, 143, 51, -136, 94, -46, -147, -521, -144, -6, -73, -25, 263, 421, -148, -265, 178, -69, -282, -109, 107, -1, 9, -108, 72, -130, -97, -224, 247, -114, -201, 24, -47, 108, -193, 123, -222, -127, -241, 37, -175, -333, -108, 256, -100, -123, -93, -94, -364, 143, 68, 352, -435, -114, 250, -200, -98, 422, 43, -91, -92, 147, -128, -280, 132, 283, -93, -92, 231, -81, -4, -304, -72, 93, -238, -177, 99, -119, 163, 160, 32, -2, 18, -228, 400, -128, -216, -139, -98, -247, -433, 117, 120, -133, -230, -38, 184, -104, 74, 213, -60, 68, -154, -31, -102, -274, 19, -6, -96, 33, -2, -127, -195, -4, 157, 225, -8, -99, 185, 50, -21, 133, 104, 303, 103, 144, -114, -83, -71, 150, 176, -112, 168, 219, 20, -9, 120, 76, -33, -285, 110, 76, -200, -169, 18, -35, -165, 122, 174, 103, 88, -158, -31, -45, -265, 236, -45, 2, -89, -180, -205, -47, -74, 10, 92, -92, 10, 190, 22]
8077B2j35L33m17J86q3l7J52M8k20K52j45k79M88k11L8j39K00K04l45L2Q0n9K82
8100B47k35j41M21m44K08j66K67k04k34M28l91P2K16j19K34q3j83L04k23L56q3
8121B47l75J63p0R0J55l13J34R0j45j22K90j16q9j09L35n7j99J63m2K1k81J14
8143a16P4Lj18J07j66P8j00N27m79L18j75J50j78Q5m3l1N7q0Q6o7j27J66J57j88
8167f0N7j04K32q3n4j96K11Q8l33K30J69k77j01J54P8J2r9J62Q2k11J32K8r0j
$$ y = [22, -113, 220, -197, -11, -94, -131, 21, 69, -151, 101, -44, -323, 165, -46, -8, -147, 53, 257, -88, -56, 24, -35, 247, 12, -129, 292, -152, 56, -110, 157, -47, -281, 147, -244, -172, 44, -75, 159, 76, -107, 197, -26, 330, 247, -128, 35, -35, 55, 210, -103, 31, 121, -24, -146, 144, 28, -61, -170, 165, 108, -91, 72, 30, 51, -230, -116, -42, -39, -157, -50, -216, -138, -238, 289, -190, 128, -47, 103, -75, 10, -33, -64, -7, -87, -1, -68, -195, -29, 128, -60, -3, -107, 125, 42, -12, -208, 3, 91, -242, -12, 157, -120, -221, -67, 11, 23, -76, 86, 168, -43, 89, 117, 27, 26]
8191B6
$$ Imaginary data points
##PAGE= N=2
##DATA TABLE= (X++(I..I)), XYDATA
0@%%%%%%Qj6J6j6K4l2M0m8N6p2Q8j04J28j57J85k19K59l04L52m04M63n30O05o89
30c67P84q88J003j127J263j415J579j759J954k166K398k649K925l227L557l916
46b051M306m734N204n723O295o926P631q427R327j0350J1528j2904J4527j6468
60h765J8840k1802K5602l0645L7625m7844O4028r2972J57990m97959m1778J134694
72F97014j021487O84636p42781N01842K10442r51131Q40380k40859J96216l82503
82b08231L01105J73904n23761M06059m68096O75092n99696O4996O30882q23405
92c71151P27378o14892L49757J36490o96743P78335m66052K86881k39895N3929
102e5963L59865n35644L13604k50845M70095m77512o3406O40236o28902M11663
$$ y = [0, 0, 0, 0, 0, 0, 0, 8, -8, 8, -8, 16, -16, 24, -24, 32, -40, 48, -56, 72, -85, 100, -119, 140, -164, 188, -216, 247, -283, 322, -367, 417, -471, 532, -595, 668, -747, 832, -927, 1027, -1139, 1259, -1390, 1535, -1692, 1865, -2051, 2255, -2479, 2725, -2998, 3297, -3629, 4002, -4425, 4902, -5448, 6080, -6824, 7703, -8765, 10075, -11727, 13875, -16770, 20855, -26989, 37039, -55933, 102057, -395902, -437680, 697014, -324473, 360163, -382618, 119224, 329666, -621465, 218915, -21944, 174272, -208231, 92874, 266778, -256983, 149076, -319020, 356072, -243624, -178628, 452254, -371151, 356227, -258665, 91092, 227582, -469161, 309174, -156878, 130003, -109892, -55963, 303902, -231742, 81862, -168983, 301112, -176400, -239806, 400430, -228472, 183191]
112A83191m67776N02063N064p54734Q76081m31410J69598k50430J11184M58775
122D01606p76036M91637j33796J59864k45907j23462O49208p22151L88655j46669
132e7051J08059J21675n86291P80134m68106L2800J25085j66032L77263n46525
142b78989L70522k2110r2279J0622j22811L93899m44056K11690n0390P1667P4872
153A22637m46390O14109l43241n203Q1048j24204L84671n75928L35095R3426k04619
164f8599P2195j37122L92795l96539O9159J41155m5572K4569l07290N29192l23059
175d9116o4335J93420j53925K82782m92566L79043N2768l26150K67356j91322
185a02045K96393l12652K9433K57580k52887J26180j85018L09402j75864j26591
$$ y = [183191, -284585, 217478, 222542, -532192, 343889, -87521, 82077, -168353, -57169, 401606, -374430, 117207, -16589, 143275, -102632, -226094, 423114, -299037, 89618, -57051, 51008, 172683, -413608, 366526, -101580, -68780, 56305, -109727, 267536, -278989, 91533, 69423, -22856, -12234, -135045, 258854, -185202, 26488, -23902, 47765, 122637, -323753, 290356, -52885, -58088, 22960, -101244, 283427, -292501, 42594, 136020, -68599, 3596, -133526, 259269, -137270, -68111, 73044, 27472, 52041, -255249, 273943, -49116, -113451, 79969, -73956, 208826, -283740, 95303, 148071, -178079, 89277, -102045, 194348, -118304, -88871, 168709, -84178, 42002, -143016, 166386, -9478, -136069]
195a36069K55393j82812J91304l08812K35738Q1098l05147K54748j63404K17037
205A39074k13946l1472K82500k62851J09443j17692K12878r3825j78090K73927
215A19946j45035R2129k07841J89683Q2456l09694K49108j03666J32863j78799
225g8850q367K82774l09304J24377n0680J25493o9480j73629L04927j81825M7202
236A2638q8999J11775P4206k83195K57170r1132M9713q7324k2405K39445k89496
247a17604J26321j1489M1170j7445j60303K74451j61791P414q837M7797P4485
258I4169k40842K10334m0634j9168l8575j3872J90217k41896Q7609L9874k947
269B4269j7873j16815K33208j38304k8223M4151K0307M5041j91235J79397j5999
$$ y = [-136069, 119324, -63488, 127816, -180996, 54742, 135840, -169307, 85441, -77963, 139074, -74872, -106344, 176156, -86695, 22748, -94944, 117934, 24109, -153981, 119946, -25089, 67040, -140801, 48882, 131338, -178356, 70752, -32914, 99949, -78850, -87217, 195557, -113747, 10630, -40050, 85443, 15963, -157666, 147261, -34564, 12638, -76361, 35414, 109620, -173575, 83595, -7537, 42176, -45148, -67553, 171892, -117604, 8717, -2772, 38398, 20953, -139350, 135101, -26690, -19276, -28113, 19684, 94169, -146673, 63661, 23027, 3859, -34716, -48588, 141629, -100267, -12658, 27216, 24269, 6396, -110419, 122789, -15515, -43738, 413, 20720, 65761, -125474, 53923, 37924]
280C7924o6329N095j438J31804j91890O8308O5375m2519j0603p0232J74716j15268
292a5057l8438P1310j169K1775j36420J43522j805q7448L2162O315Q2182j42971
304f6042M3551Q3399o5783j3365k5241J17050q1670n2097Q6266j504j4006p8897
316f8339J06329P776r3396L6133K6623L2113j00963L0118Q4897p1033k0967J5463
328a5246O8716n7171n3348Q7250K338m7245k6951P2858O264q3542K9180M9479
340C2582j1839o6487L3064O6276o2261k8261M3408L4323m8986l9289P7710K156
352C2396o4401Q802M8357K670o7030J8207O7761m3418m0581L5718M2278m0190
364E69m6942O2339K1891n6698j9506O2890J1159p6487K2531M9668r467n9400J5611
$$ y = [37924, -28405, -23310, -24748, 107056, -84834, -16526, 48849, 6330, -4273, -74505, 100211, -15057, -53495, 17815, 16646, 38421, -97999, 45523, 43718, -43730, -11568, -5253, 76929, -66042, -22491, 60908, -4875, -18240, -43481, 73569, -8101, -60198, 26068, 24564, 10558, -68339, 37990, 45766, -47630, -11497, 15126, 47239, -53724, -23606, 61291, -9742, -30709, -15246, 53470, -3701, -57049, 30201, 32539, -14706, -41657, 31201, 37465, -46077, -16897, 32582, 20743, -45744, -12680, 53596, -8665, -36926, 6482, 40805, -8181, -47470, 30240, 32396, -32005, -23203, 25154, 27824, -39206, -20999, 46762, 3344, -37237, -1519, 40759, 569, -46373, 15966, 37857, -18841, -38347, 24543, 35702, -40785, -18254, 31414, 21947, -37453, -21842]
377b1842Q3394p3001k7314N0787J8001k8183n9629R0482K037p6008K7315L5420
389B1459R986p5557L4358N3010m4162k7088J5662O6915p7307r826N6317j5021
401H746M68o4045R0944m655q1148O1331j0045L4325p1771J1639Q2360p5937k428
414b0216O414O0769n6253l9824Q3812k0741j0552o0447J01050m343j10515R2497
426B1651j4861K5331q0284K4795J07654j34280L1947K8466K5956n0641l8873J13964
438F0825n9881j8919j3239P6656k6472r1308J15929m9741K7284n8757K2669R6610
450H1656j52102Q5101j1788J2281m409p6703J32856p8389l046k551L5846J9094
462C7846j12374J12586l6075J7688n4894J2147J23169j84357R2340P637m245k322
$$ y = [-21842, 61552, -11449, -38763, 12024, 30025, 1842, -57787, 32695, 34732, -41276, -13961, 21459, 31445, -44112, -9754, 43256, -906, -27994, -12332, 54583, -22724, -32550, 23767, 8746, 9214, -54831, 36113, 31458, -49690, 11641, 1596, 35921, -35850, -24211, 58149, -17788, -20216, -13802, 46967, -9286, -49110, 34702, 13961, 3409, -57038, 44012, 39669, -70846, 21651, 6790, 32121, -48163, -23368, 84286, -49994, -18047, 10419, 36375, -14266, -53139, 60825, 944, -17975, -31214, 45442, 18970, -72338, 43591, -6150, 21134, -37623, -14954, 81656, -70446, 14655, 2867, 15148, 10739, -65964, 66892, -11497, -14543, -17094, 18752, 37846, -74528, 38058, 1983, 19671, -35223, -23076, 100093, -84264, 8076, 15713, 11468, 9146]
474I146r7710J89353j16041l6360P0548K67J2185j19342J36631j6359n9152k128
486b8962L6882O9023j73045J14595J1926l6408O743o5043J66866j42785L137P8462
498D1391n3084M5085j03729J14009k4003n4322L6038r486O4982j26431Q8989Q79
510B0318k8427J9856p7805J66538j44792O963Q6172p2052O9026j37804J45536
521E3529o412j27129J01571j7747N2433j32823P1738Q1170j13207K0200j3241
532b9918J24124j42239j2875J39015r5944K8180p6031J24463k0258j31686J39978
543D6809m0596J1489o5404N0357N8392j16034N9203j0458N2141q3126O315J00666
555F9754j09117N5471n2177P4273j0124j14920J46946o5082J0891l7096K0281
$$ y = [9146, -88564, 100789, -15252, -51612, 18936, 19203, 31388, -87954, 48677, 32318, -26834, -28962, 7920, 76943, -96102, 18493, 30419, -5989, 754, -64289, 102577, -40208, -37071, 41391, -11693, 33392, -70337, 43672, 19669, -34653, 1385, -8101, 56881, -69550, 19439, 20318, -8109, 11747, -66058, 100480, -44312, -37349, 48823, -23229, 45797, -92007, 53529, 47117, -80012, 21559, 3812, 56245, -76578, -4840, 76330, -36877, -16677, -29918, 94206, -48033, -60908, 78107, -17837, 10343, -65688, 58775, 38517, -93169, 46809, 6213, 17702, -47702, 2655, 61047, -54987, 4216, -6242, 45899, -37227, -30912, 69754, -39363, 16108, -36069, 38204, 28080, -86840, 60106, -4976, 5915, -31181, -10900]
566a0900Q8316j41529N8191K0450K7257p4479j9788J41123j14915J3515k1013
577c3772Q4451j4441j55308J96333o7792k3683o962L329J20407j97460R4160N3783
589E3045o6815L539l3242J25812j16018l038O2504o948j4792p6933J51400q5903
601g389k3975L9796j5226P4337j64535J27521J2175q4551N8114o5327J33328j20293
613c6025r257R9052o2565K8224q8480J24258l1186p6629O0907q844O0982j46346
625h5909J00823L8453q9063L9763m7556J38904j45678M074J18583r8655M5131
636A8870q9606J40723n2861j03003J40567o2498M1716j04809R4141M4203j44422
647g6979R9081l4045O9453j08016J5539J19340j31788N7183m8653R6143n1330
$$ y = [-10900, 77416, -64113, -5922, 14528, 41785, -32694, -52482, 88641, -26274, -12759, -33772, 50679, 36238, -119070, 77263, 9471, -14212, -21174, -17845, 102562, -94898, -738, 53045, -13770, -10231, -43473, 82339, -33679, -36717, 25787, 18839, 4047, -72886, 78514, -7389, -31364, 8432, -6794, 67543, -96992, 30529, 42704, -41847, 16267, -49060, 84268, -36025, -45282, 53770, -8795, 19429, -69051, 55207, 24021, -52608, 8299, -545, 60437, -85909, 14914, 53367, -35696, 4067, -43489, 95415, -50263, -46189, 72394, -26261, 18870, -70736, 69987, 17126, -85877, 54690, -7808, 33908, -70901, 23240, 67443, -76979, 22102, -11943, 57510, -50506, -34967, 84373, -47415, 9768, -38885, 57258, 5928]
658E928q2894J44597q6517M3905p8029O9159M6563j44235J13943m6737N6129p3977
670c2165j0931J31562j38121N5404k7552O2650k6811r5575J50292p6729Q785m0478
682c9669N9393L7575j43921J17981k4546J8229o3452J1941J19783j58733O7288
693A869k472L1776k9250q0801J64559j04674R76O999K5396L2888j32459J26383
705D1190k5816k0153j5470K917R3289j41499O8228J1715l675q999o4667J43228
717H0288j02134k743L4025m511L5850j18676J15877j2485n1567J8719n433P6403
729F3613j19827M7735M2802l5007l894m0629J15740q8247j7773N7386j6390J8182
741B3691r0803J06030j1550o8659M5475o850N0364j00004M6850N1030o3998J2193
$$ y = [5928, -76966, 67631, -18886, 25019, -53010, 16149, 62712, -81523, 32420, -14317, 41812, -32165, -43096, 88466, -49655, 5749, -21803, 40847, 14036, -81539, 68753, -7976, 809, -39669, 19724, 57299, -86622, 31359, 6813, 25042, -38410, -26469, 93314, -65419, 1869, -603, 31173, 1923, -78878, 85681, -18993, -18017, -11018, 14378, 47266, -85193, 41190, 15374, -4779, -20249, -17332, 75957, -65542, 2686, 14401, 10726, 1727, -62940, 80288, -21846, -24589, 9436, 4925, 40775, -77901, 37976, 25491, -26076, -7357, -12790, 63613, -56214, -8479, 34323, -684, -4578, -45207, 70533, -17714, -35487, 21899, 5509, 23691, -67112, 38918, 27368, -41291, 4184, -2666, 47698, -52306, -5456, 45574, -18424, -6231]
753f231k0625Q4755p9395j6739P4802l8482J2652o0995Q9023j3602p5870O8683
765A7976j6991L0451p5164L7831N7435q4609K9402q476N3322n6903k4210Q5657
777D5721n1670N666l0661O1136o664p7143P5972j6385Q118m7470K7925N6256q9486
790c8685L5858N469K4746m0417k4063Q6989n8934k757k554L8435o453p0847P9939
803B6726j6016j2178k2075K4708M4607q8177M2390J3121J184k8061j6314P9844
815D9759o5636m50J5981J6456k905o0229P6869j8178k3910P28J4077L3401p4376
828c8413L7873J8616j4446j5825j0097O5732n9084k379K6353M013l627m9321O9754
841B9149j5851l5178J6986J0358K0774o2041L4272K7691l1618q700N796M4565
$$ y = [-6231, -26856, 57899, -21496, -38235, 36567, -1915, 10737, -50258, 38765, 25163, -50707, 17976, 985, 31436, -43728, -5897, 51538, -33071, -3669, -12145, 41177, -15726, -39936, 45721, -5949, -283, -30944, 30192, 23528, -53615, 22357, 5972, 14090, -33380, -5455, 50801, -38685, -2827, 2642, 27388, -13029, -37092, 49897, -9037, -11794, -14348, 24087, 17634, -53213, 26726, 10710, -1468, -23543, 1165, 45772, -42405, -15, 13106, 14290, -13771, -30085, 49759, -15877, -16327, -346, 16110, 13205, -47024, 29845, 11667, -12243, -11515, 2562, 35963, -38413, -540, 18076, 3630, -12195, -22292, 43440, -15644, -18023, 8330, 12343, 8716, -40605, 29149, 13298, -21880, -4894, 5464, 26238, -35803, -1531, 26160, -5458, -14158, -8362, 36203]
853C6203n2592k233L5112o642j3065k6186N8719k1707l3775K9588M575O843m3164
866b8324L0397K3862l8118J820J1137K2390l6860j926L0966q356j4194j2611M3281
879B3464j7712k7339K5527M999J898l4509K4043K6218m0864J557J8412J1416k8075
892a0965q340L9838j0693k8149R776L0934j8495k7887K9541J2145k1813j6104
904b0212K7661J4409m0887P583K9685j3202j7390L647K7313j3419k7163K8111
916F136P882j9886n704J4160J1718k2789l475K1050P38j9292L80K1969p862j3801
930h776P13K0921m518k9175K2274J2520j5748j2980J4234K2633l2890m820K8905
943A3293O21k8246P3L7841k2093j9012J4102K1637j5119l2475M6166l522k6548
$$ y = [36203, -16389, -18622, 16490, 9848, -3217, -29403, 29316, 7609, -26166, 3422, 7997, 14840, -28324, 2073, 25935, -12183, -10363, 774, 23164, -13696, -15622, 15344, 6988, -7206, -19817, 23464, 5752, -21587, 3940, 8939, 10837, -23672, 371, 26589, -14275, -12718, 5694, 17110, -10965, -19305, 20533, 9840, -18309, -8533, 22401, 3906, -23981, 5560, 17705, -4108, -20212, 7449, 21858, -19029, -11446, 18239, 5037, -12353, -8706, 18607, 5188, -21975, 6136, 14018, -5868, -11572, 2588, 14306, -8483, -11958, 9092, 9830, -9462, -9082, 12887, 5025, -8776, -8063, 12858, 8340, -20835, 1439, 13959, -1789, -14769, -535, 22098, -10792, -15612, 13293, 13914, -14332, -14259, 23582, 1489, -17523, -3421, 18216, 3097, -29378, 16788, 13266, -13282]
956a3282O631J1898J4735m3370J9962K2842k6057J230k503K7467k5847p414K5707
969A1999j2746O955k3184K6313J870k5726J9811j1662K2694k5999m391L4109k5009
982d966L025j1061K9115p487l3719L4130J701p657k6012L1209J4730m5953J7976
995d969J2450J0147l9780J1638M2730m4092K413P261K3498k7184j8506M9287k6619
1008a726k735q380K6297k727l8752M4734j8526Q026j6119L650L3572n1110L1795
1021G999j1891R310J405l4420N2713l1672P204q539P203K7580n8216L9679k802
1034E553K024j7239j0087N9899o0683J1185J3284P482o224m2939P1919l2006j7752
1047a5584J3008J0602J2646n9133N4610m372j9414r61L237L8426o5908L6713Q344
$$ y = [-13282, -6651, 5247, 19982, -23388, -3426, 19416, -6641, -5411, -7914, 19553, -6294, -13708, 11999, -747, 6208, -16976, 9337, 11207, -14519, 5292, -6370, 16324, -9675, -14066, 20043, -4966, -1941, -13002, 16113, 8626, -25093, 9037, 10738, 3081, -22931, 8278, 23008, -22945, -4969, 7481, 17628, -22152, -10514, 32216, -11876, -9463, -2202, 21296, -5888, -24394, 24893, -1726, -4461, -12841, 13456, 10729, -28023, 16711, -1815, 6211, -9908, -6258, 27314, -23796, 7999, -3892, 5418, 6823, -27597, 25116, -6556, 648, -7891, -688, 26892, -31324, 8355, 5553, 7577, -9662, -19749, 40150, -20533, -9348, 3936, 11418, 5194, -37745, 34174, 2168, -15584, -2576, 8026, 20672, -38461, 16149, 11777, -7637, -8598, -5361, 33065, -32843, 3870, 12214]
1060A2214j4185M672k7325O1763n2362M901K0802j5223K2715n1577N3976j4939
1072E432j6547J4540j6412M6487o0589K6652J3379j6043J1571m1817O9810m2200
1084e737j3389K9303j3128K6143o3022N7025J987l9409K2150r108M0611o4583
1096c1157K5675L1185l6746J0502k0648N8044m9673r270M5262k6841J2828l9611
1108c0450N5740j5047l8162M0073j6535K5412n0772L3014K0847m4192K6429k1918
1120a5561M4852m0535r018M6639l6844K0123l3731M0318j452m4071M1742j4528
1132b066J8552l9446K0909L0550m7446J9507r006L5023l8689j1572N4178l8624
1144h130Q368j9910L9475n451n1447N6328j4505O77k5239K0851K9902n8678K7383
$$ y = [12214, -1971, 2701, -24624, 37139, -15223, -10322, 10480, -4743, 17972, -33605, 20371, 5432, -11115, 3425, -12987, 33500, -27089, -437, 12942, -3101, 8470, -33347, 36463, -5737, -19126, 10177, -2951, 23192, -39830, 17195, 19182, -20227, 1923, -7185, 33426, -31157, -5482, 25703, -11043, -541, -21189, 36855, -12818, -22088, 23174, -3667, 9161, -30450, 25290, 10243, -27919, 12154, -4381, 21031, -29741, 3273, 24120, -20072, 6357, -15561, 29291, -11244, -20262, 26377, -10467, 9656, -24075, 16243, 14791, -29280, 12462, -2066, 16486, -22960, -2051, 28499, -18947, 560, -8446, 26577, -12112, -23684, 30494, -8130, 238, -19672, 19803, 14352, -37095, 19233, 4728, 5405, -19834, 1017, 30919, -27759, -376]
1157c76M136J1441k8369n353N1343m4840P618k443K2651p723m1737N7865k3025
1170A188l845q044J0314K8245n8147L3525O820o303j0434j0487M9391m3527k17
1183a1521J5595O099m254l7312N3095j4382j9492N202J0513K1033n5104L2467
1195A939J5780j9684o507m696M5425m6272j479K7918o408m157l0051N3117j8304
1208F621k6010K2067J555J4101m8336L5697J4473l3115Q795l621L5910m5612K713
1221a4762L6188k3444K030k1553M6859j9988l0740L6711q315Q661l8548L2707
1233E806J7811m4565K0061j281K4476l7990R0M2658l2819J990j0110L5400j7686
1246C841l1754M3133j1251j07k5327K9799J3610m6112K5878J843J2621l3069N081
$$ y = [-376, 3760, 15201, -13168, -18521, 32822, -12018, -4400, -6843, 15808, 8085, -33652, 24213, 1188, -2657, -10701, -387, 27858, -30289, 3236, 10056, 3753, -6681, -17168, 32223, -11304, -11521, 4074, 10173, 5919, -31393, 21702, 7320, -12172, -6970, 3543, 24576, -30528, 1939, 17719, -1965, -8472, -13168, 32257, -14015, -15494, 12424, 6016, 1859, -28192, 24925, 6621, -19389, 2678, 4233, 18334, -30002, 5695, 20168, -12947, -4152, -7773, 28137, -17475, -14762, 21426, -2018, 12, -21541, 25318, 5330, -25410, 11301, 2986, 11647, -26901, 5806, 23617, -20948, -887, -2168, 22308, -15682, -15592, 27066, -5753, -3763, -13873, 21527, 3841, -27913, 15220, 3969, 3862, -21465, 8334, 21944, -24168, 1710, 3553, 16174, -16895, -11814]
1259a1814M0988m1117O135j113K6129j9430k7361M9270j8664n443j3002K6238
1271A0816Q039m6628L2987J605J532k4658Q514L6874m5582J0792O238J4358j6729
1284a842k3109M9783k3912r269J21J7613N417m2073L4365L241r932j4314J1054
1297b857K8328m2819J1138J2354N131j6891j4997M5620k6066j1522J0283J2190
1309I892J35l6243L5807M118k0199m040J3060J8442l9426J2317J7922o047j5433
1322i695l613L7675k9175r129J8222M513m227k6288L3798J9k4486O943J0244Q965
1336A3766l0428J1759J9251j3461j0828L529K6276k4761q464K0411P68p941j8406
1349a8529L0558q67k6979J2737J0462K548k5797J1650K2640k1348r372J2837J6367
$$ y = [-11814, 29174, -11943, -5808, -6921, 19208, -222, -27583, 21687, 3023, -2420, -15422, 10816, 18855, -27773, 5214, 6819, 8351, -16307, -7793, 29081, -16501, -5709, 529, 14887, -1842, -24951, 24832, 920, -8349, -8228, 9385, 14802, -27271, 7094, 10335, 403, -13911, -2857, 25471, -17348, -6210, 6144, 11275, -5616, -20613, 25007, -1059, -12581, -2298, 9892, 10027, -26216, 9591, 13709, -6490, -10530, 2530, 20972, -18454, -6137, 11785, 5738, -9695, -13308, 24367, -4808, -13937, 4285, 8798, 4571, -21717, 12081, 12100, -12386, -5443, 4801, 13766, -16662, -4903, 14348, 887, -9941, -6412, 19864, -4897, -13361, 7050, 7818, -123, -18529, 12029, 11162, -15817, -3080, 7382, 9930, -15867, -4217, 18423, -2925, -12297, 540, 16907]
1362A6907k4238o834K5105l544j4459n963K7754p402k5518K0527P805p484j6162
1375a3506J4426J5735k5548m53J5328L662j8421n14K1366q555j1796K472J8100
1388A2296q604j8546J9263L695q228j0449J0616J4606k3687J80J6489J38j5237
1401g468j599K2318q687j6180Q389J6431j1874j7766K2119N111j6499m631J5846
1414E510P910k6421O042K0823j1568j3170Q229J5763j4145j1802J6424P207j6722
1427e920m646J9324l050j3169K993J1566m47j7811R469J1763j1506n433O093R033
1441H259r141q596J2735N678j3581l433J5203j059j2063m52J4209o64j9648R978
1455b575J4565j3609p846J0089J0256j3013j0354K0385J740k0120N308J4541n321
$$ y = [16907, -7331, -14165, 10940, 7396, -7063, -13026, 14728, 7326, -18192, 2335, 10140, 2656, -13506, 920, 16655, -8893, -9346, 5982, 9644, -8777, -9291, 12075, 3520, -8276, -5804, 12296, 3692, -14854, 4409, 8104, -124, -10573, 43, 14649, -9038, -8858, 7631, 7769, -7468, -9067, 13251, 4564, -11616, -3227, 13204, 1330, -16436, 5683, 10794, -5705, -10336, 5510, 13420, -13001, -6959, 13864, 2296, -10874, -2645, 13118, -1027, -12829, 3595, 10802, -5920, -10566, 8758, 5708, -7461, -4468, 7098, 6651, -11160, -1691, 10072, -1434, -6867, -774, 8259, -882, -9478, 3257, 8935, -4646, -8079, 7124, 6065, -5998, -6450, 7759, 7095, -12553, -2575, 11990, -1619, -9465, 624, 10880, -2133, -12487, 7898, 9638, -10482, -5174, 9367, 4046]
1468D046j4070O430J5152j1968j1321J5601N639j5524m07J2820j066j0495r84
1481f147J4765m780j4451J1938M048n408n551L274J2267j2799m564J1898L31o564
1495a743m969J0491K647j1874j190J3217j185j4710P989Q123m119r934L741J6755
1509A3239j6858n985J5641m54q935m808J4611J60j6602P368J2150q901j0149J2730
1523C207M042r820m543J0166O395j9034N857J1948q546l721kJ2321p021j0078
1537h829J1662K955o573o282R627K795p729k440M893Q624j5023J761J0948n296
1551A093r60q137J5315j615j6936J3925J944l378q317O267J1232j5716n35J0049
1565D231K292j3120J466J5370j0749m975L411R685o694j3041J9659k954j0142
$$ y = [4046, -10024, -3594, 11558, -410, -11731, 3870, 9509, -6015, -6422, 6398, 5332, -5163, -6147, 8618, 3838, -10613, 1325, 5373, -35, -5586, -2312, 9955, -2844, -7408, 4490, 4821, -1743, -6712, 3779, 6426, -5448, -6638, 6579, 5394, -9316, -1327, 6796, 2677, -7257, -3516, 13239, -3619, -9604, 6037, 5583, -3352, -8160, 6451, 6611, -9991, -2623, 9527, 626, -9523, 3207, 7249, -2571, -7114, 3052, 9447, -9587, -3730, 8218, -328, -4049, -4051, 8270, 1249, -8829, 2833, 5788, -785, -7067, 2560, 5355, -2374, -4814, 79, 8703, -6320, -4559, 6389, 1093, 133, -8004, 7311, 5696, -11240, 2685, 4629, 1251, -7066, -799, 10433, -5283, -5818, 4231, 6523, -6597, -5131, 10239, -510, -5485, -2074, 7611, 917, -12124, 7535, 4581, -5561]
1578e561K479N629N078j5515N409J0439p484o251M742Q151r282k086L488P249
1592F485o452r316J6072m966k799k711L545J0052j8666O838P147l708m711l348
1606f538J6996j2452l395N648N241k766j5730K2477o602q342M333N89J1234k3546
1620a2853J2422J0571j5572M512l066J4888j4693m233J5944o790k186p329J6704
1633H319n798j0823J0609j127N144j6710J1273Q149j4631M705j851J2022j3177
1646c896l506J3745m339k872p552J7300o913q816P470O83P296k1960J6491N713
1660H844j5957P707n661J7099j8458j318J9375j4211K889q235J7808p300j4110
1673a1528J8211o277M014j5632J4509O857k2265J4633l622R180j3924j270K1433
$$ y = [-5561, -3082, 2547, 7625, -7890, -2481, 7958, 474, -5777, -1035, 7116, -2166, -4252, -764, 6485, 33, -9283, 6789, 1823, -976, -3687, -142, 9910, -8756, -1918, 5229, 1521, -3190, -6538, 10458, -1994, -5389, 259, 5500, 2734, -12996, 9481, 2879, -5463, -1130, -541, 10693, -12853, -431, 10140, -5432, -920, -3986, 10902, -3791, -8024, 7920, 1130, -1056, -8385, 8319, 2521, -8302, 2307, 1180, 6324, -10386, 887, 9036, -5595, -890, -2741, 9281, -3896, -7402, 6343, 2004, -868, -8420, 8880, 1967, -6849, 621, 1304, 8600, -13360, 3131, 8844, -7113, 594, -5067, 12032, -6426, -7744, 11631, -2580, 309, -7926, 9882, 2582, -11528, 6683, 406, 4420, -11212, 3297, 10154, -12111, 2522, -1100, 8080, -5844, -7114, 14319]
1686A4319j9233L062j435J0582n289j4147J9007m275k724q307J2424M868j8933
1699a0081J0840P89N766j4539K184J7381j7441K770p54J1214p978j1884K0674
1712H941p918j534p007J2386L498k0767J5637o61J514j1153K910J8428k2906N853
1726b779L835N042o847j1198K4096j1287n575J689P612K432k0730J7330K322o752
1740h10m787L565J5020k1146L613R649j319n910p117K0181j0046q087O616N380
1754D802r13j5909J6177K096r056k254M889J1401k0125N351J0293n003m830m549
1768g630J9213j2105q541J2093J795k320j4026J7105J657j4140L824M944P127
1781H996j9111O849J2999j1966j337j048J5792j2818q725J7493m326l430q127
$$ y = [14319, -4914, -1852, -3287, 7295, 2006, -12141, 6866, 2591, -133, -8440, 3984, 8852, -10081, 759, 1548, 7314, -7225, -5041, 12340, -5101, -2331, -3085, 8129, 151, -11733, 8941, 1023, -511, -7518, 4868, 8366, -12401, 3236, 2575, 4089, -7064, -4154, 14274, -8632, -2779, 1056, 6098, -749, -11947, 12149, 862, -4713, -3024, 4588, 7020, -13710, 3620, 5942, -810, -5597, -2032, 12988, -8158, -4545, 5104, 3785, -2125, -9242, 10939, 893, -7194, -578, 4802, 3889, -12020, 4157, 6253, -2803, -5057, -168, 11233, -8892, -3541, 6752, 1749, -3081, -7630, 11583, -522, -9063, 3030, 4825, 2505, -11521, 5584, 7241, -6899, -3075, 1869, 8996, -10115, -3266, 9733, -2233, -3570, -4618, 11174, -1644, -10369, 7124, 2798, -632, -8759]
1794h759J4334J663j6926R288L847J960j4117O232J3116j4907Q78J884J0760j1297
1808b044q207J8966o910l855n114J2865J176j8044J2600L225j332j1522P140J3337
1822A2281j8803K567N144O986j2078n752K0994j1078n201J094J0947k280j7261
1835a2440J7103J000o613o183Q569Q739j9398P119N834N82q830k496J8982j4133
1849b165k490M060N794k030j4791J7172q03p761j911O298P577j7571O338P245
1863D962j229q756n47J7519j4707l393O557N518m964j3138K0198l159j1232K929
1877c442P623L497j8577J0393Q885r213n883N630J1545j6282j46J0118L12p176
1891b716n140J7653q204q505P229L073P43j3309J0513N637j0327m03L882P020
$$ y = [-8759, 5575, 7238, -9688, -400, 3447, 5407, -8710, -2478, 10638, -4269, -3391, -1507, 9253, -2044, -10251, 8715, 1805, -2050, -7164, 5701, 6877, -11167, 1433, 4658, 3326, -8196, -1056, 12281, -6522, -3955, 1189, 8175, -3903, -9655, 11339, 261, -4940, -3846, 7101, 4821, -12440, 4663, 5663, -950, -7133, 1436, 10175, -9223, -2104, 3730, 4312, -4518, -7014, 11968, -2165, -4655, -595, 5199, 3169, -11622, 5550, 4747, -3014, -4925, 1373, 8950, -8621, -2283, 4962, 3733, -5023, -5570, 11949, -2758, -6151, 406, 5924, 960, -12178, 8020, 4861, -6371, -3442, 4181, 7678, -10899, -506, 8379, -834, -6717, -1087, 10458, -5824, -5970, 4148, 4460, -2716, -7856, 9797, 1593, -6912, 317, 3390, 4133, -9176, 1337, 6974, -3353, -3756, 126, 7146]
1905G146j1468l22R283q87o704l143J3819o178q117N918N232j003j3374J1811
1919B013N935j2568J0O905N249j3380O64J3029n468r190L887J2044j0257o576
1933g703J0446K912p038o774J4157k84j3265O649N457j685r215M251R866r462
1947a688l751O913M031p290l455Q499J078o898k645J0156j384r118M118M621Q7
1962C274r232L657J0180q600n177P122M716p281m889R983J289r930M8J1424m149
1977B435r337O528O130m840q099Q980N968j2881Q03R089j611p669N02J0455m839
1992A614q253P003N427o585m309O956L070o756k737P403J406q311R85O900j226
2007B587o172O69P474k200p298M587N266m965m107M343M940o576m378R353L04
$$ y = [7146, -4322, -4644, 4639, 3752, -2952, -6095, 7724, 1546, -6571, -653, 4579, 3576, -9798, 2013, 7948, -4620, -4610, 2295, 7544, -5836, -5172, 7857, 2389, -6801, -2914, 9130, -1127, -7703, 2743, 5655, -1383, -8157, 6000, 5716, -7549, -900, 4557, 2872, -6343, -2092, 7774, -1688, -5439, 1474, 5505, -1785, -5240, 3259, 4337, -2561, -5206, 4950, 3566, -5552, -1434, 3187, 3274, -5958, -2301, 7879, -721, -5898, 1224, 5940, -1341, -6230, 3753, 5042, -4888, -4840, 6584, 2435, -6902, -374, 5756, 916, -7183, 1797, 7765, -5116, -4313, 4776, 3165, -4504, -4002, 6453, 1614, -6639, 364, 5791, -794, -5103, 1853, 4923, -1833, -4570, 2833, 4239, -4072, -3087, 3813, 2587, -3585, -2916, 4558, 2358, -4940, -353, 4913, -52, -4159, 184, 5124, -1452, -5830, 3523, 3827]
2022C827q244J938O382r44q473L862Q316p805m436P564L090p753k347R038l27
2037C688q953K339Q529m465o955N720N752o197m838O738L440p172k229P631J66
2052C194o016M61M736J006p326J866O890m962k173J148M406k145o386P311J252
2067C262m814j079L813K992p782J431O033k597m552J709P057o254l555N913J944
2082C521m898l745Q890k88p936K680N821j989o515L333O008m667n003N620L541
2097D373o098j164M300K611o225j362P915l336l463N77M443o33o367M577K427
2112B575k612k619K404M802p143O74L603K49l304k365Q041l511m134L579J747
2127A986q6o577N458L629o886K43L779J712n739n45O334j535n072K113N095l326
$$ y = [3827, -4417, -2479, 3903, 2959, -5514, -1652, 6664, -1141, -5577, 1987, 5077, -2676, -5023, 4015, 3688, -5265, -2926, 5603, 1138, -5817, -97, 5655, -542, -5380, 1358, 4798, -2374, -4603, 3028, 3194, -2822, -2361, 2375, 3381, -3945, -2079, 4811, -151, -2324, -1176, 3230, 1085, -5301, 2010, 3262, -1552, -2631, 1182, 4174, -3608, -2177, 3856, 1259, -3293, -1584, 5473, -781, -4336, 1577, 3521, -1377, -5122, 3768, 3480, -4456, -1776, 4045, 2056, -4459, -1126, 4882, 215, -4788, 832, 4373, -1725, -2889, 1411, 4022, -2203, -3565, 4350, 1014, -2449, -1872, 2571, 1938, -4429, 148, 2575, -37, -2656, -252, 4550, -2593, -1919, 1684, 1933, -1371, -3736, 4305, 794, -3340, 239, 1986, 1900, -4677, 781, 4410, -2476, -2233, 1546, 3258, -2481, -3026, 3308, 1773, -3299, -1186, 3909, 583]
2143E83m413M015L588m065l405N439J178m712r52M735N13n742J904L655o55m770
2159c104J899N287m803j753K663K429k653m064O531j71m529J006K552J075n126
2174b761J770M650l706k449K177L409l288l641N505Q57m433n82M492L91n542J548
2190a603M910k433l934K252M405l501m018M954J721l678k081M390J945o000J146
2205a525M160p73m535J206M927l073l404K994L045l711k407M198J496m146j107
2220b655N209p17m605J451L704p81n021K790L943m053j958K784L678n227j959
2235c417O211q08l693q05N479j178n818L477L110j709m854M008M222o065o79L533
2251A014K192n087j240O647k504l529J130M031j338n159M105K799l178k895L847
$$ y = [583, -3830, 185, 3773, -292, -3697, 1742, 2920, -1792, -2744, 1991, 2504, -3238, -1334, 2321, 1666, -3104, -1205, 4082, -721, -2474, 189, 2618, -35, -4099, 2432, 2261, -2268, -1262, 1290, 2365, -2761, -991, 3659, -47, -2496, -319, 3090, -198, -3839, 1666, 2523, -1910, -2492, 2000, 2391, -3151, -1603, 3307, 874, -3060, -808, 3597, 96, -3922, 1032, 2753, -925, -3006, 1384, 3329, -2671, -1525, 2635, 1862, -2673, -1467, 3460, 387, -3017, -23, 3022, -689, -3096, 1102, 2598, -1548, -2655, 2554, 1837, -2768, -1317, 2387, 1606, -3415, -625, 3318, -735, -2693, 91, 3769, -1458, -3417, 2794, 1986, -1707, -2512, 2967, 1789, -4029, -552, 2558, 849, -4005, 3, 4225, -1840, -2519, 1014, 3206, -1881, -3121, 3526, 1022, -2507, -1377, 2654, 1316, -3843, 262, 3061, -117, -3012, 835]
2266H35K221m866j43L426J332n532N34N635l006k844Q43M691k341n122N571K072
2282C306m274k211M742J398n966O45M710J69o212K159N630m223k612K371M271
2297C903m174m033O562M93n015k50M374P17n906J783M974k461m367L517L311l822
2313c94k140K821L016m918j924O291q15l748j62M233J72n718K113M928l574l581
2329c400L706L062m120l049M945K624o261n52O571j741n097J713N473k647n528
2344d301M254M218n895j942N419J172m955p21N651l80o124K459M979l336l649
2359c151K750L608l191l679M713K339n507j72M114L57l506j469O263j474n850
2374c855L496L085j985l829K642M560m744l367O073J618o618O34N386p64n557
$$ y = [835, 3056, -1810, -1953, 1473, 2805, -2727, -2193, 3442, 436, -2408, -1565, 3126, 785, -4337, 1234, 3306, -968, -3179, 1563, 2961, -3005, -2360, 2350, 2519, -3693, -1534, 4096, -127, -2739, -368, 3903, -271, -4304, 2258, 2751, -2264, -2514, 1860, 2577, -3329, -1546, 3428, 967, -3400, 117, 3428, -394, -2534, 287, 3303, -1615, -3539, 2752, 1937, -1811, -1973, 2260, 2432, -3286, -1173, 3755, 181, -3400, 306, 3368, -752, -3801, 1144, 3768, -2493, -3045, 3526, 1785, -3312, -1599, 3874, 1227, -4301, -47, 4171, -1724, -3666, 1753, 2925, -2030, -2751, 2900, 2520, -3604, -1145, 3834, 498, -3151, -401, 3207, 16, -3663, 1050, 3389, -2118, -2290, 1824, 2181, -1325, -2794, 3469, 1995, -3855, -359, 2726, 741, -3088, -446, 4114, -630, -3997, 2076, 3694, -2924, -2290, 3096, 2332, -3225]
2389c225O56P546m714n002N873J884l968k812N360K503p376J045N640j532n479
2404c601K403M579k940l822K709M986n936j557N351o8k994j860M898R40o786K430
2420a268L975j785l664J896M152k674m264L599M592o597r03N016ll290k358O623
2436C047l43p805M833L697l037m217L667M864o187k223N947J341p035Q79O126
2451C554k359m522J441O069l735n160O222J787m570j449L953K359n832o91N965
2466C032j189m764J976L819j802l675J341N241m162l222M879J161l537k186M485
2481A397J743o036Q06N037j490m720J993N123l451l477L421L706n450k619P158
2496C141p66n112N35M747k98o739L825M977m808k859L796L190m793k919O337L36
$$ y = [-3225, -2569, 4977, 263, -4739, 1134, 3018, -950, -3762, 1598, 4101, -3275, -2230, 3410, 1878, -3601, -1198, 3381, 441, -3381, -672, 4314, -1622, -3179, 2172, 2104, -890, -2750, 2148, 3088, -3698, -1268, 2707, 922, -2742, -846, 3306, 632, -3632, -33, 4559, -2038, -2941, 2075, 2072, -1218, -3576, 3047, 2704, -5101, -268, 3429, 392, -3825, -158, 4706, -1481, -3704, 2243, 3584, -3451, -2572, 3554, 1195, -3327, -1886, 4183, 448, -4712, 1510, 3297, -1273, -2722, 1231, 3590, -2242, -2933, 3032, 1843, -2921, -945, 2874, 1072, -2603, -1262, 3979, -183, -3405, 1474, 2635, -902, -3088, 1397, 3140, -2896, -2090, 2947, 1457, -3263, -1270, 3853, 402, -3075, 346, 4052, -1398, -4017, 3141, 2375, -2737, -2202, 2545, 2247, -4492, -667, 4310, -498, -3357, 439, 3629, -1164, -4083, 2254, 2590]
2512B590n512Q91M753o51m805J588M261k541l339K432L441l630k300L926J296
2527B400l660j416M472O85m929R73M521k080l462J476M608l272m413N435J754
2542C092m767j117M285J723o398Q63N993k490m253K256M686l853m205N263K005
2557C083m018k386M863J333n514J284L946j567l379J201M430k919l393L787J387
2572B138k585k100L605J957n345J120L175n20l068j51M770k221l916K941K659
2587B459k641l246L946K585m790o04M210M68m746K77N207k101l976K148L637k706
2603A27l221M130J939m391p12L877K45l664l18M541j227m402K746K486j870k681
2619b395K322L214m237r05L121Q39k932j344M760j356l386J774K255p57l630K580
$$ y = [2590, -2922, -2031, 2722, 2071, -2734, -1146, 3115, 574, -2765, -333, 3108, -522, -2822, 1104, 2400, -1260, -2676, 1796, 2481, -2448, -1475, 3046, 966, -2496, -1020, 3588, 316, -4097, 1338, 3092, -1675, -2792, 1493, 3216, -3182, -2319, 3674, 1184, -3069, -813, 3873, 20, -4185, 1078, 3083, -935, -3321, 1542, 2875, -2639, -1355, 2591, 1024, -2355, -1154, 3276, 357, -3036, 751, 2138, -447, -2547, 1058, 3015, -2330, -1210, 1965, 1445, -1623, -1774, 2996, 775, -3141, -200, 2459, -182, -3428, 518, 3103, -1687, -2291, 1919, 2387, -2359, -2082, 3125, 1024, -2952, -804, 2833, 127, -3094, 1036, 2975, -1416, -2128, 1749, 1994, -1670, -1988, 2553, 1326, -3076, -330, 2156, 286, -2395, -73, 3141, -1096, -2001, 1120, 1959, -973, -2317, 2443, 1087, -2299, -525, 1730, 973, -2657, -77]
2635g7K750l781m32J871K309l944r74M709j239k731Q8L701j128l975K851K332
2651B330k243k523L253J909l800q00L077Q52m067M31L453r28k735Q26L505k476
2667F4k411L123J195k105k198L391M74l258O06K399K45l775J648L088k589j189
2683a292Q81L018k793k228L688r0k002j298L222Q09m074J575K190n62l113J515
2699e54L130k903j689K095K062l178j158L683j37k498o73L719q74l143J673K276
2715A831j080l102K284K115k883q64K132J571l251m31L541j017j847M1K730j054
2731G16k783K241J528j925j883K619J316k544n83K128N69k739K11L147j304k375
2747a661J147K311j591k355K413J480k364j200K771O14k762j28K581J24l393J448
$$ y = [-77, 2673, -1108, -1540, 331, 2640, -1304, -2278, 2431, 1192, -1539, -1451, 2250, 1122, -2853, -2, 2330, 87, -2436, 817, 2726, -1074, -1874, 1203, 2055, -2012, -1581, 1872, 944, -1791, -965, 2540, 64, -2347, 776, 1971, -134, -2332, 1059, 1533, -1725, -1119, 1280, 1525, -2250, -602, 2486, -103, -1292, -411, 2607, -186, -2414, 1274, 1184, -818, -2116, 1106, 1915, -2159, -584, 1606, 1044, -2069, -554, 2576, -327, -2016, 79, 2141, -1037, -2195, 1488, 1351, -1147, -1820, 1899, 1025, -2118, -445, 1831, 751, -2351, -67, 2048, -835, -1699, 433, 2004, -1247, -1678, 1863, 846, -1001, -960, 1770, 716, -2067, 174, 1702, -223, -2106, 513, 1829, -715, -1298, 830, 1399, -1340, -1129, 2018, 714, -1661, -514, 1797, 206, -2149, 264, 1744, -620, -1820, 951, 1565, -1197, -1325, 1256, 1380, -2013, -565]
2763e65K509j743j958J583J827j855j721K618R68k403l45K232j0k446K4K762j064
2780D13k139J695J571j464j414J533J508j898j451K446O84k783K50K035k91j985
2796a290J51L270j659k019J640J475j204k270K289J299k565j159L298k92k700
2811a736Q89K248n94k451J207K454k424j152K195N18j661j319K932Q9k277J65
2827i17K162p57k020J370J318o75j931J000K337k442p87J499J221j613j723L098
2843A140J95k808P75K247p70k707J590J951j366k037J927J717k866m15K524L36
2859A433k558l50L554j409k711J874J941j848j478K163O75j587j477K857L64k912
2875a469Q80J696n08j500m0K520j215j938J894J270j329j665J506J089j338j436
$$ y = [-565, 1944, 201, -1757, -174, 1653, -202, -1923, 695, 1663, -740, -1085, 1147, 1137, -1309, -1285, 1477, 413, -1726, -31, 1540, 76, -1338, 195, 1703, -195, -1646, 800, 1484, -1299, -1049, 986, 695, -1290, -1139, 2131, 472, -1547, 93, 1568, 364, -1906, 383, 1682, -883, -2042, 1256, 964, -1736, -847, 1401, 807, -1644, -437, 2017, -407, -1559, 636, 1154, -507, -1826, 1106, 1195, -1082, -917, 1245, 488, -1532, -162, 1156, 481, -1450, -450, 1887, -555, -1342, 157, 1378, -235, -1958, 1140, 1335, -1473, -698, 1549, 779, -1928, -338, 1613, 247, -1790, 137, 1854, -1012, -1427, 1097, 1433, -1125, -1475, 2079, 670, -2041, -167, 1774, -74, -1552, 611, 1286, -301, -1778, 1079, 1443, -1469, -589, 1107, 599, -901, -941, 1579, 364, -1574, 320, 1590, 261, -1404, 102, 1191, -147, -1583]
2891a583K740N14k957Q5K102j98k220K67L448k161k065K286J621k397j248K512
2907G46Q44k801m52L553j386k408J791J580j231k311K305K080l204l55K317K55
2923A323k429l22K839n59k310N28K705j374j956J296J572j102k008K214J390k771
2939i64l08J946P14k273l92K867m56k748P07L200k243j791J825J865k126k269
2955b446L891K09l452Q51K409n7l630J719K717j629k670K148K262l368o13K727
2971A068J54j961j239L459n05k780J983J031o56k273J393K231k146j055J588J220
2987A512k177r88K778l4k107j66L073q59k798J423K060j431k488K395J873k832
3003g66j061K767N17l032L17K908n81k910Q81L720k676k226K227J234j566k097
$$ y = [-1583, 1157, 1671, -1286, -1201, 901, 703, -1517, -1250, 2198, 37, -2028, 258, 1879, -518, -1766, 746, 1590, -1211, -1663, 1890, 504, -1904, -113, 1467, 236, -2075, 230, 2310, -894, -1249, 1068, 1323, -1106, -1428, 1411, 852, -1458, -930, 1775, 401, -1555, -259, 1313, 211, -1797, 417, 1807, -964, -1272, 674, 1388, -885, -1277, 1590, 1134, -1614, -907, 2293, 50, -1741, 84, 1949, -177, -2446, 1445, 1654, -1798, -947, 1462, 1405, -2225, -506, 2211, 582, -2088, 60, 2322, -1046, -1659, 1068, 1222, -739, -1978, 1481, 976, -1804, 179, 1210, 554, -1719, -326, 1905, -241, -1296, 292, 1512, -665, -1653, 1125, 1091, -1016, -1182, 1891, 1032, -1766, -343, 1717, 286, -2202, 193, 2066, -766, -1827, 940, 1457, -1575, -1258, 1650, 1069, -1841, -960, 2760, 84, -2142, 85, 1319, -247, -2344]
3019b344L439P79l752J038J927M72l360O16L282j880j730J527J798j963k167L281
3035I63L92k164k24K026P80l565J050K556j182k122P56K622j772k166K650J270
3051A870k658j035L024N70l348%L426r34k980J564K593k062k206K447J878l088
3067i39p32K628O86k564n21L229j056k214P63K612j438k768K875J179k071j034
3083a365J930J545l482j21L001n36k133L0L029j507k696K531J405j631k083K321
3099B38J766l085m96K666p0k395N0L289j263k778J818K281j887j961K390J331
3115A894k707r87K740N12k971J22L071q50k779J347K626j574k210J642K504k953
3131e73j012K582L94k185j001L496n64l108J378K234j072k278J326K332k380j191
$$ y = [-2344, 1095, 1874, -1878, -840, 1087, 1559, -1801, -1185, 2097, 217, -1513, 14, 1812, -151, -2318, 963, 1355, -809, -1033, 993, 1773, -1792, -742, 1814, 632, -1490, -734, 1888, 116, -2050, 600, 1870, -788, -1823, 1201, 1771, -1577, -1577, 1849, 915, -2065, -501, 2092, 30, -2176, 271, 2149, -939, -1671, 957, 1643, -921, -1442, 1787, 731, -1483, -720, 1892, 454, -2314, 561, 1740, -331, -1365, 565, 2110, -1372, -1493, 1508, 972, -1161, -1131, 1898, 391, -2305, 226, 1631, 0, -2083, 238, 2004, -1081, -1577, 1089, 1019, -1376, -1326, 1963, 700, -2078, -260, 2021, 134, -1827, 563, 1894, -813, -1800, 940, 1452, -1519, -1397, 1674, 824, -1955, -608, 2018, 444, -1766, -124, 2380, -573, -1585, 997, 1391, -794, -1795, 1701, 1137, -1971, -593, 1641, 569, -1709, -383, 1949, -431, -1622]
3147a622K447M43k153n76K907k72k839R48K364j036k824K035K070k507j028J972
3163C29J380k206j392L112K6k579K17K363l34k810J721J903j898j738K113J420
3179A627k241r27K633K84k556J03K680j098k001J194J700q63k322K045J173j832
3195d01j057K274O36k697J91K348j96k589P57K299j212j952J435J703j631j880
3211a972K441O37k093m27K369O78l411Q71K422r19k103P99K462j994j349J970
3227C81J078j713j430K820l1k402M67K099l76k650J458J602j492j298J602J570
3243A685k379o36K206L35k263j55K582p73j958Q84J423o05j927J397J571j572
3259a85r15J505J025k466q2K065K51k285L5K639j204j469J063J204q73k203K656
$$ y = [-1622, 825, 1268, -885, -1461, 1446, 1174, -1665, -717, 1647, 611, -2213, -178, 1892, -615, -1643, 329, 1709, -497, -1889, 1223, 1249, -1330, -1113, 1250, 916, -1894, -173, 1730, -168, -1906, 207, 1627, -614, -1541, 1092, 1376, -1180, -1077, 1603, 505, -1496, -302, 1398, 535, -1787, 258, 1431, -401, -1458, 816, 1452, -1245, -1054, 1294, 1098, -1491, -734, 1565, 353, -1599, -164, 1539, -92, -1972, 469, 1106, -987, -1414, 955, 1633, -1778, -907, 1515, 596, -1507, -708, 1754, -240, -1589, 381, 1459, -254, -1684, 1136, 1105, -1297, -830, 1269, 893, -1757, -299, 1303, -189, -1487, 115, 1685, -694, -1330, 876, 1211, -1052, -1207, 1375, 602, -1356, -472, 951, 346, -1581, -184, 1387, -185, -1100, 405, 1430, -1036, -1118, 947, 1198, -1087, -1052, 1587, 383, -1086, -23, 1181, 308, -1895, 761]
3276G61O82k089k63J615M64k265K26J943o98j574J010J550j353j300J727O22j638
3293e80m10J533O44j973J18J437j34j508P4J952r75j251J263Q24p64j597J835
3310D88Q11k019m09J622K69j804N67J507l83j661M06K121j638j400J983N82j610
3327e68p89K088K89k036M50J482k97j720R43J084q96p58P20J199j738j64J403
3344F92r4r35m21J448K2j618O96J009l70j224P66J110j302j016J231J151j743
3361e98k86J760k48r97n56J831q8k042J234Q57o55j261J084J268j855j66J077
3378C59P19j963J71J966q33j079j13K192j419j331J699L03n69j066J449O09j952
3395h58O86P42Q4j166j61J671r83k60j09J255o55j242J451K52o57r53J203P41
$$ y = [761, 1443, -646, -909, 706, 1170, -1095, -869, 1074, 376, -1198, -188, 1362, 9, -1291, 436, 1058, -580, -990, 543, 1187, -786, -668, 769, 635, -873, -799, 1153, 178, -1073, 190, 1014, 250, -1347, 488, 1299, -720, -1129, 493, 762, -1042, -475, 1032, 649, -1012, -606, 1515, -123, -1523, 460, 1042, -568, -1357, 731, 1020, -1016, -566, 916, 619, -1101, -158, 926, 30, -728, -8, 1191, -547, -711, 692, 598, -337, -758, 690, 712, -906, -210, 799, 429, -795, -29, 1081, -221, -1237, -6, 1145, -598, -884, 876, 628, -369, -925, 906, 818, -1224, 10, 867, 212, -1049, 35, 1303, -552, -718, 359, 1078, -885, -714, 1252, 419, -660, -773, 1419, 0, -1331, 368, 671, 102, -964, 485, 1094, -858, -172, 570, 654, -512, -673, 998, 15, -245, -354, 901, 246, -996, 455, 707, 50, -903, 300, 1041]
3413A041k010N21J053mj514J90K099j419q08P00J160j158j071J729K10j235k21
3430g37J510J8j986Q79J139p21j357J003J334j432m2L25J042j310p73K095o46
3447C41q97j13J188N6j742R80R98n38j090M74J343j455k79J179J85j124o07J887
3465G86l83j133M60J253o87j562J275J124j236o71R07R58j488n85J879k63j557
3482i23M54J735p81j214P89J055j118j215J519M21r64m52J195K95j238j60J337
3499G35k62j320L47J519p41j141P04R85l99j486J371O61j061n53J116K53j504
3516g76N6J555m14j702P86J597r91j489J541P60j273n32J156Q30k113M12J600
3533A003j56j994M37J922j185j226J399P72r97j035J562L58j630J64J338K9j824
$$ y = [1041, -969, -448, 605, 601, -913, -723, 1376, -43, -851, -151, 1009, -149, -1220, 509, 719, -516, -737, 773, 791, -1195, -316, 823, 102, -1255, -252, 1082, -350, -392, -67, 975, -335, -1108, 987, 341, -556, -669, 519, 575, -1167, -187, 811, 273, -817, -343, 1000, -455, -734, 445, 630, -494, -1101, 786, 403, -730, -270, 983, 296, -1266, 9, 1133, -103, -774, 133, 1091, -397, -982, 897, 634, -923, -469, 1266, 485, -729, 60, 1115, -3, -1218, 301, 722, -242, -694, 501, 796, -442, -602, 735, 473, -847, -500, 1019, 278, -863, -159, 826, 427, -1059, 312, 973, -88, -641, 475, 728, -776, -720, 835, 421, -1281, -495, 1102, 111, -1378, 163, 923, -350, -882, 274, 1104, -1009, -597, 1003, 847, -1147, -710, 1212, 27, -1199, 200, 972, -25, -1060, 502, 860, -770, -606, 732, 761, -1063]
3550a063P00J370p02j363Q78J154j450l42J311K51p46r58J672q4j611L91J475
3567H83k85j653N90J886j346j170J294J094j797o79J905M89j933m14K283n14j887
3584a254R18J573r64j509R68J551j561q79J424P41j509n67J422K90j333J10J753
3601A174r23j512J368J081j113j248J322R21j816J70J217L20j909J06K239j025
3617C72j646J152J218r83j218J497P51j579r07J853M88k098M92J792m50j770M80
3634e56K038j320j485J464J216j807o28J577P20j887j91J887n94j492O98J251
3650H91o98j486J247J197j714n98J609L76j682k51K036j49j576J72J616o08j772
3667a390J382J192j373p79J164J324j871q45K128l46j371k26K236n94k045J321
$$ y = [-1063, -363, 1007, 305, -1058, -180, 974, -476, -818, 493, 744, -2, -960, 712, 628, -983, -592, 883, 598, -1055, -465, 1421, 75, -1095, 199, 1293, -504, -1183, 722, 1211, -722, -1136, 1147, 633, -1254, -336, 1237, 273, -1236, -268, 1283, -278, -1157, 267, 1008, -501, -1068, 354, 644, -689, -579, 1174, 251, -1261, 107, 1188, 75, -1173, 149, 1070, -746, -576, 641, 961, -948, -842, 1397, 372, -1274, -122, 1096, 113, -1105, 392, 1143, -436, -1343, 510, 998, -1100, -608, 1184, 734, -1036, -556, 1482, 162, -1323, 141, 1357, -450, -1078, 499, 1219, -668, -859, 1028, 434, -1058, -360, 891, 193, -1293, -46, 1151, -563, -1161, 448, 824, -858, -1109, 927, 778, -798, -626, 990, 382, -1390, -8, 1184, -189, -968, 196, 1520, -351, -1196, 932, 586, -785, -1011, 1225, 631, -1414, -93]
3683i3J194j131j058J425P27j552o61J838K20j708k1J679j24j959R67J470j028
3700A85j543J341J005j628m07J588L84j847k2J894k86j784O43J387n77j570Q86
3717c51J752j812q58J864N67j596n65J644K87j766L61J244k98j553O98J591j436
3734b27r52J484J154k062p04K285j03j852M04J363k88j757R39J673j512q78J348
3751C15L80r12j045J950J33j726K66J648m57j629M98J436o26j360J013R44r33
3768a05p35J295L91j502j47J593k76j250L28J832r81j472J107J150j256j149J538
3785C61Q46j697j81J484k41j562M12J800j016j507J345J030j120q70J222P58j424
3802c60n01J392L91j990L36J787p70j181O30J680j400j136J452K87p10p74J268
$$ y = [-93, 1101, -30, -1088, 337, 1064, -488, -1149, 689, 909, -799, -820, 859, 735, -1224, -257, 1213, 185, -1358, -17, 988, -640, -1047, 541, 925, -922, -944, 950, 664, -1120, -477, 910, 333, -1237, -351, 1401, -411, -1269, 595, 1162, -434, -999, 645, 932, -834, -473, 771, 473, -1080, -382, 1209, -227, -1179, 305, 1459, -603, -1307, 978, 875, -977, -573, 790, 502, -1255, -316, 1357, -155, -1033, 315, 695, -217, -1262, 688, 821, -905, -639, 1009, 552, -1077, -579, 857, 231, -1129, -116, 828, -105, -840, 455, 846, -656, -803, 790, 514, -736, -408, 1424, 443, -1029, 78, 1228, -28, -1177, 361, 1207, -490, -671, 813, 572, -990, -578, 1222, 206, -1301, 44, 1074, -46, -916, 306, 1064, -360, -861, 531, 922, -1068, -732, 1055, 285, -896, -266, 1414, 14, -1122, 330, 617, -93, -867, 401]
3819D01N81j677K24J097K03j696N58J420q99j267J322J000j735m31J292N29j217
3836b95n86J707nj924O29J497o96j480J286R89j481o28J019Q88j398l64J821n67
3854D12p34j78J485o30j267J085O44r34n28R49M55j108o38J471N26j355k79J252
3872F28m00r54L83J139l53j517J185P29j205m27Q73P65j142m83J319j05j064J70
3890d59J292o23j130O58J286j079j036J579L93j354j81J178J46j369L61J434j080
3907A6n12K34Q99o82o02R27L84q68m94J084M00j495P00O23k48p38j01J291r16
3926i8m64N10P27p29p01J050K03r83j82J055J24j254O83P61l79j272P31J074j334
3945d78o8J049o1p56o55J664m36j034M94P80m92r17J117L29n83n31O10P49j232
$$ y = [401, 982, -695, -471, 626, 829, -867, -309, 1111, 212, -1055, 267, 1267, -468, -899, 393, 922, -295, -881, 826, 821, -1103, -474, 1023, 327, -1153, 133, 1122, -359, -987, 32, 920, -478, -842, 979, 412, -322, -500, 985, 355, -912, 173, 817, -117, -645, 304, 759, -349, -987, 484, 1010, -345, -624, 628, 228, -726, -343, 796, 443, -1074, 111, 840, -365, -792, 81, 846, -296, -779, 540, 435, -629, -459, 833, 210, -920, -262, 1024, -55, -1091, 488, 881, -473, -654, 524, 670, -699, -338, 1096, 16, -496, -262, 637, -45, -647, 280, 664, -204, -698, 386, 786, -709, -9, 614, 366, -372, -473, 818, -98, -562, -52, 675, -54, -755, 295, 498, -485, -667, 388, 512, -742, -59, 702, 323, -949, -218, 856, -478, -546, 503, 442, -314, -969, 695, 259, -775, -281, 499, 7, -910, 207, 536, -47, -578, 32, 781, -451]
3964d51J14N76R5p32k59J525n88q70O21M29k22j072J214N11j083k38N47N16j364
3983g31J64J073j63o58j63J555p86p97N88M66m40r30Q56O45j095j5L97O25q73
4002b82K0M20j90k77j29J233q90l24N70K38l34q70J289K4r62L67M13K68j332R30
4022A82j8j40l52O8J206j259m23P63M75m31q26J185L46j153J52M84J31q26L50
4041h6O00o72l31M07J046j229L00L52p1o62k17J343j04j344N56L12q9p58L18Q72
4061E43n60m33N53O20q64k47N57L8n71j76J016N9j276P06Q43q49o50O41O07q47
4081b90j85M97M07r21R7J066k07q90q9J522o50r49O47L48m64n55J058J34q71j93
4101d88J008j49n81l13R81n06k71Q6Q66n49q05J242j86p54j12O27K36j213N72
$$ y = [-451, -337, 239, 334, -398, -657, 868, 280, -590, 31, 460, 238, -834, 380, 891, -192, -430, 117, 633, -731, -567, 506, 343, -315, -478, 1077, 291, -506, 82, 548, 108, -822, 34, 679, -416, -431, -34, 591, -282, -262, 158, -32, -309, -438, 795, -95, -419, 151, 389, 55, -815, 474, 498, -464, -97, 316, 584, -748, 182, 164, 24, -328, -260, 946, -313, -736, 27, 502, 71, -755, 430, 776, -377, -225, 259, 390, -436, -86, 514, -158, -489, -82, 964, -265, 35, 387, 316, -346, -563, 780, 676, -668, -112, 200, 111, -647, -329, 543, -17, -450, 103, 723, -141, -388, 169, 207, -364, -540, 476, 535, -741, -35, 808, -41, -691, -50, 557, -290, -475, 22, 429, -492, -395, 671, 464, -426, -515, 1007, 357, -592, 55, 403, -61, -616, 442, 576, -295, -488, 520, 371, -210, -523, 458, -48, -319, -233, 633, 84, -721, 521, 335, -419, -531, 96, 332, -881, -309]
4120c09Q90k76o36J26R31o80q11Q27L18j29j104R24K94p62K07N77L95j383J77
4139d24R51j88r49K01R82m34p57P03L94p86k61J070L9j008L2R23n6j101M22P47
4159E00m64n68P81N74j081m90J304j33o29k58J143l10j171R16L48j63r86P05O48
4178F66o56o66O42P40q78n29J033n9o13k31J081o7j088O69N86n99o06Q22N82j316
4198d87r6J027M9j042K26Q97j24j142M01R82p37o90R73N16r32k53Q68J74j155
4217e45R3J013n11o35K15J083o03r63N59R45m59p78J013J86r08j66R10J00j080
4236e31R2J191n93q97N31R24q21n11R05M01j073l07J120Q3j099J75J048k06j338
4255i06J077O64q50l99N44P12j175j77J395j79j079j85J322m62r26N79O57l43
$$ y = [-309, 581, 305, -331, -205, 726, 46, -765, 62, 380, 251, -853, 71, 365, -397, -190, 387, 782, -601, -424, 527, 339, -610, -409, 573, 139, -618, 85, 479, -307, -568, 502, 541, -467, -435, 488, 432, -669, -247, 500, 36, -532, 249, 823, -258, -748, 556, 423, -206, -464, 679, 369, -802, 114, 462, 299, -687, 18, 666, 10, -656, -14, 726, -152, -681, 352, 293, -320, -551, 530, 463, -625, 44, 630, 31, -575, 247, 829, -487, -583, 444, 493, -549, -323, 574, 450, -692, -291, 691, -46, -736, 237, 753, -179, -432, 436, 610, -545, -452, 561, 50, -585, -370, 713, 110, -853, -294, 651, 192, -586, 427, 613, -295, -461, 449, 549, -531, -439, 752, 159, -738, -207, 717, -104, -615, 290, 691, -382, -689, 431, 514, -585, -410, 638, 432, -906, 171, 835, -15, -414, 130, 842, -333, -510, 885, 706, -373, -558, 764, 302, -624, -45, 612, 269]
4273B69j023R63O20j029k58Q30J54j219J64R35O2j231L38J215q05p11P12N15o29
4292a28q06J280L40j155r1J144j54q75Q5J093l50j088R35L72q55o71J330L94j307
$$ y = [269, -754, 209, 829, -200, -458, 372, 526, -693, -529, 406, 468, -763, -425, 790, -15, -726, -14, 501, -128, -934, 346, 686, -469, -560, 584, 430, -445, -360, 733, 383, -705, 230, 602, -253, -924, 406, 800, -507]
$$ [...]
8191G8
##END NTUPLES=NMR FID
##END=
