##TITLE=1H_LR-756-R2-RM1-EtOAc
 CCl4
 8 sc, 
 20.1.2023
##JCAMPDX= 6.0         $$ Bruker NMR JCAMP-DX V2.0
##DATA TYPE= NMR FID
##DATA CLASS= NTUPLES
##ORIGIN= UXNMR, Bruker Analytische Messtechnik GmbH
##OWNER= root
$$ XWIN-NMR		Version 3.5
$$ Mon Jan 23 14:20:36 2023 Russian Standard Time (UT+4h)  she@DPX200
##.OBSERVE FREQUENCY= 200.13135
##.OBSERVE NUCLEUS= ^1H
##.DELAY= (6, 6)
##.ACQUISITION MODE= SIMULTANEOUS
##.ACQUISITION SCHEME= undefined
##.AVERAGES= 8
##.DIGITISER RES= 18
##SPECTROMETER/DATA SYSTEM= spect
##.PULSE SEQUENCE= zg30
##.SOLVENT NAME= D2O
##.SHIFT REFERENCE= (INTERNAL, D2O, 0, 15.7039)
##AUDIT TRAIL= $$ (NUMBER, WHEN, WHO, WHERE, WHAT)
$$ ##TITLE= Audit trail, XWIN-NMR		Version 3.5
$$ ##JCAMPDX= 5.01
$$ ##ORIGIN= Bruker BioSpin GmbH
$$ ##OWNER= she
$$ F:/spectra/data/she/nmr/H-F/1/audita.txt
$$ ##AUDIT TRAIL=  $$ (NUMBER, WHEN, WHO, WHERE, WHAT)
(   1,<2023-01-23 14:19:04.48 +0400>,<she>,<DPX200>,
      <created by zg, POWCHK disabled, PULCHK disabled
       configuration hash MD5:
       00 E9 B6 7A A2 85 ED C7 34 08 36 98 17 FE 4E 26
       data hash MD5: 16K
       54 86 11 5F 10 1E 3E 1D 45 90 C0 CB E7 0D 18 6A>)
$$ ##END=
$$ 
$$ hash MD5
$$ 2F 58 90 1A 7B 95 62 A6 14 B5 34 D9 58 9C 03 61
##$RELAX= 
##$RELAX= 
##$RELAX= 
##$RELAX= 
##$RELAX= 
##$RELAX= 
$$ Bruker specific parameters
$$ --------------------------
##$DU= <F:/spectra>
##$EXPNO= 1
##$NAME= <H-F>
##$PROCNO= 1
##$TYPE= <nmr>
##$USER= <she>
##$AMP= (0..31)
100 100 100 100 100 100 100 100 100 100 100 100 100 100 100 100 100 100 
100 100 100 100 100 100 100 100 100 100 100 100 100 100 
##$AQSEQ= 0
##$AQ_mod= 1
##$AUNM= <au_zg>
##$AUTOPOS= <>
##$BF1= 200.13
##$BF2= 200.13
##$BF3= 200.13
##$BF4= 200.13
##$BF5= 200.13
##$BF6= 200.13
##$BF7= 200.13
##$BF8= 200.13
##$BYTORDA= 1
##$CFDGTYP= 0
##$CFRGTYP= 5
##$CHEMSTR= <none>
##$CNST= (0..31)
1 1 145 1 1 1 1 1 1 1 1 1 1 1 1 1 1 1 1 1 1 1 1 1 1 1 1 1 1 1 1 1 
##$CPDPRG= <>
##$CPDPRG1= <>
##$CPDPRG2= <>
##$CPDPRG3= <>
##$CPDPRG4= <mlev>
##$CPDPRG5= <mlev>
##$CPDPRG6= <mlev>
##$CPDPRG7= <mlev>
##$CPDPRG8= <mlev>
##$CPDPRGB= <>
##$CPDPRGT= <>
##$D= (0..31)
0 1.2 0 0 0 0 0 0 0 0.06 0 0.03 0 0 0 0 0.0002 0 0 0 0 0 0 0 0 0 0 0 0 
0 0 0 
##$DATE= 1674469143
##$DBL= (0..7)
120 120 120 120 120 120 120 120 
##$DBP= (0..7)
150 150 150 150 150 150 150 150 
##$DBP07= 0
##$DBPNAM0= <>
##$DBPNAM1= <>
##$DBPNAM2= <>
##$DBPNAM3= <>
##$DBPNAM4= <>
##$DBPNAM5= <>
##$DBPNAM6= <>
##$DBPNAM7= <>
##$DBPOAL= (0..7)
0.5 0.5 0.5 0.5 0.5 0.5 0.5 0.5 
##$DBPOFFS= (0..7)
0 0 0 0 0 0 0 0 
##$DE= 6
##$DECBNUC= <off>
##$DECIM= 32
##$DECNUC= <off>
##$DECSTAT= 4
##$DIGMOD= 1
##$DIGTYP= 9
##$DL= (0..7)
0 120 120 120 120 120 120 120 
##$DP= (0..7)
150 150 150 150 150 150 150 150 
##$DP07= 0
##$DPNAME0= <>
##$DPNAME1= <>
##$DPNAME2= <>
##$DPNAME3= <>
##$DPNAME4= <>
##$DPNAME5= <>
##$DPNAME6= <>
##$DPNAME7= <>
##$DPOAL= (0..7)
0.5 0.5 0.5 0.5 0.5 0.5 0.5 0.5 
##$DPOFFS= (0..7)
0 0 0 0 0 0 0 0 
##$DQDMODE= 0
##$DR= 18
##$DS= 0
##$DSLIST= <SSSSSSSSSSSSSSS>
$$ [...]
##$SUBNAM2= <"">
##$SUBNAM3= <"">
##$SUBNAM4= <"">
##$SUBNAM5= <"">
##$SUBNAM6= <"">
##$SUBNAM7= <"">
##$SUBNAM8= <"">
##$SUBNAM9= <"">
##$SW= 18.05172834244
##$SWIBOX= (0..15)
0 0 2 0 0 0 0 0 0 0 0 0 0 0 0 0 
##$SW_h= 3612.71676300578
##$TD= 16384
##$TD0= 1
##$TE= 0
##$TE2= 300
##$TE3= 300
##$TEG= 300
##$TL= (0..7)
0 120 120 120 120 120 120 120 
##$TP= (0..7)
150 150 150 150 150 150 150 150 
##$TP07= 0
##$TPNAME0= <>
##$TPNAME1= <>
##$TPNAME2= <>
##$TPNAME3= <>
##$TPNAME4= <>
##$TPNAME5= <>
##$TPNAME6= <>
##$TPNAME7= <>
##$TPOAL= (0..7)
0.5 0.5 0.5 0.5 0.5 0.5 0.5 0.5 
##$TPOFFS= (0..7)
0 0 0 0 0 0 0 0 
##$TUNHIN= 0
##$TUNHOUT= 0
##$TUNXOUT= 0
##$USERA1= <user>
##$USERA2= <user>
##$USERA3= <user>
##$USERA4= <user>
##$USERA5= <user>
##$V9= 5
##$VALIST= <valist>
##$VCLIST= <CCCCCCCCCCCCCCC>
##$VD= 0
##$VDLIST= <DDDDDDDDDDDDDDD>
##$VPLIST= <PPPPPPPPPPPPPPP>
##$VTLIST= <TTTTTTTTTTTTTTT>
##$WBST= 1024
##$WBSW= 4
##$XGAIN= (0..3)
0 0 0 0 
##$XL= 0
##$YL= 0
##$YMAX_a= 450008
##$YMIN_a= -408178
##$ZGOPTNS= <>
##$ZL1= 120
##$ZL2= 120
##$ZL3= 120
##$ZL4= 120
##$ABSF1= 10
##$ABSF2= 0
##$ABSG= 5
##$ABSL= 3
##$ALPHA= 0
##$AQORDER= 0
##$ASSFAC= 0
##$ASSFACI= 0
##$ASSFACX= 0
##$ASSWID= 0
##$AUNMP= <proc_1d>
##$AZFE= 0.1
##$AZFW= 0.1
##$BCFW= 1
##$BC_mod= 2
##$BYTORDP= 1
##$COROFFS= 0
##$CY= 11.3945322036743
##$DATMOD= 1
##$DC= 2
##$DFILT= <>
##$DTYPP= 0
##$F1P= 2.36226072786647
##$F2P= -0.459571619588291
##$FCOR= 0.5
##$FTSIZE= 0
##$FT_mod= 4
##$GAMMA= 1
##$GB= 0.15
##$INTBC= 1
##$INTSCL= 1
##$ISEN= 128
##$LB= 0.24
##$LEV0= 0
##$LPBIN= 0
##$MAXI= 10000
##$MC2= 0
##$MEAN= 0
##$ME_mod= 0
##$MI= 1.114404
##$NCOEF= 0
##$NC_proc= 0
##$NLEV= 6
##$NOISF1= 3.799351
##$NOISF2= 2.8
##$NSP= 1
##$NTH_PI= 0
##$NZP= 0
##$OFFSET= 15.70392
##$PC= 1
##$PHC0= -19110.57
##$PHC1= 11.20079
##$PH_mod= 1
##$PKNL= yes
##$PPARMOD= 0
##$PSCAL= 0
##$PSIGN= 0
##$REVERSE= no
##$SF= 200.130013532006
##$SI= 16384
##$SIGF1= 3
##$SIGF2= 2
##$SINO= 400
##$SIOLD= 16384
##$SREGLST= <1H.CDCl3>
##$SSB= 0
##$STSI= 0
##$STSR= 0
##$SW_p= 3612.71676300578
##$SYMM= 0
##$S_DEV= 0
##$TDeff= 0
##$TDoff= 0
##$TI= <>
##$TILT= no
##$TM1= 0
##$TM2= 0
##$TOPLEV= 0
##$USERP1= <user>
##$USERP2= <user>
##$USERP3= <user>
##$USERP4= <user>
##$USERP5= <user>
##$WDW= 1
##$XDIM= 8192
##$YMAX_p= 0
##$YMIN_p= 0
$$ End of Bruker specific parameters
$$ ---------------------------------
##NTUPLES= NMR FID
##VAR_NAME=  TIME,          FID/REAL,        FID/IMAG
##SYMBOL=    X,             R,               I
##VAR_TYPE=  INDEPENDENT,   DEPENDENT,       DEPENDENT
##VAR_FORM=  AFFN,          ASDF,            ASDF
##VAR_DIM=   8192,          8192,            8192
##UNITS=     SECONDS,       ARBITRARY UNITS, ARBITRARY UNITS
##FACTOR=    0.0002768,     1,               1
##FIRST=     0,             0,               0
##LAST=      2.2672688,     0,               0
##MIN=       0,             -408178,         0
##MAX=       2.2672688,     450008,          0
$$ Real data points
##PAGE= N=1
##DATA TABLE= (X++(R..R)), XYDATA
0 0 0 0 0 0 0 0 0 0 -8 8 -8 16 -24 24 -32 40 -56 64 -80 96 -120 144 -168 201 -238 280 -326 380 -438 503
30 503 -577 660 -753 856 -968 1091 -1229 1379 -1545 1725 -1924 2140 -2376 2634 -2914 3223
46 3223 -3560 3925 -4327 4766 -5249 5777 -6363 7012 -7733 8540 -9452 10487 -11677
59 -11677 13061 -14689 16643 -19031 22036 -25954 31292 -39087 51772 -77586 242117 -339894
71 -339894 26302 97476 -140502 223430 -408178 374754 -86812 -195750 53478 56349 155486
82 155486 -236245 162449 -46971 33845 18242 -107284 294804 -384664 130503 22284
92 22284 -75298 179664 -317005 255295 -67818 -48908 146804 -83483 138265 -233996 125195
103 125195 53910 -38442 -64772 -118195 267725 -254460 83367 72080 -41562 77567 -264869
114 -264869 380115 -82922 -162692 112276 -78715 155871 -263156 144659 63955 -180525
124 -180525 70017 -36577 237905 -230150 33273 141970 -137081 133690 -177505 187280
134 187280 -103789 -159152 223541 -127822 89223 -124561 54370 111975 -132998 113360
144 113360 -40627 69319 -118725 8912 117596 -118612 36957 -133753 159789 -30099
154 -30099 -116077 178148 -96482 76064 -98575 73108 125764 -211355 65797 -10909 51595
165 51595 -85844 -34082 135159 -122387 32210 -12783 133571 -56806 -121347 189024 -95929
176 -95929 40818 -73981 24857 74553 -211798 151630 -7140 -13851 -17934 -38183 166384
187 166384 -120384 38171 14459 1614 -9345 -98991 149939 -92824 -18301 -11095 10265
198 10265 98740 -145985 110573 3652 -28246 22765 -43935 126846 -131431 -13645 44871
209 44871 -13012 8365 -94732 121931 -43523 -25333 44723 18390 51559 -139447 96690
220 96690 20055 -59345 4537 -47142 97957 -116198 17069 81502 -45691 15168 -53852
231 -53852 123689 -37077 -48052 47922 -26647 29159 -102939 80297 3971 -79023 42226
242 42226 -20892 93645 -78042 7425 77244 -59049 29274 -44790 69589 -46743 -68181
253 -68181 65337 -21669 23666 -72230 59802 35843 -63727 53934 -5638 43211 -71024
264 -71024 -4701 73731 -66660 -3972 -30207 53997 -23884 -45311 81132 -17853 6264 -33047
276 -33047 54652 29522 -79120 27999 -5181 10963 -49650 -361 55370 -57801 7951
287 7951 10842 50174 -16660 -41998 67629 -18623 -8604 -24387 22181 7305 -72547 33623
299 33623 14916 3361 -30878 8968 62618 -38463 3625 17207 14116 -25411 -39681 52386
311 52386 -17825 -34607 -8923 28221 16267 -43885 35731 25588 -9739 -17196 13992 39940
323 39940 -48524 -22291 22500 1113 -22803 -21754 40595 -543 -26655 20175 34782 1074
335 1074 -35941 19279 23192 -25218 -25983 9484 14199 -35363 -10551 36336 7414 -20883 -40
348 -40 41395 5497 -31712 11651 17209 -18947 -30157 9439 21659 -30217 -21711 34035 18665
361 18665 -17795 -4297 34415 8922 -31092 3070 25942 -14143 -44368 11568 24196 -23214
373 -23214 -17512 18703 31383 -22207 -8660 46983 -2660 -25511 -8059 25495 -2090 -49764
385 -49764 14448 15140 -14417 -17064 18992 34145 -26640 -2055 26504 15410 -24170 -20195 33256
398 33256 -19536 -20890 -5112 15943 10200 -48015 38079 23275 -12488 -1565 -407 42028 -37992
411 -37992 -17772 27942 -7660 -26224 -22368 45262 -9215 -25930 15527 26403 14639 -50004
423 -50004 45774 17672 -41960 -429 -3276 32484 -54560 -10780 47284 -20037 -8147 -765
435 -765 48079 -15111 -25272 32747 5954 -5846 -47325 36479 848 -41035 14962 -7424
447 -7424 38784 -44426 9664 52407 -30267 11465 -21770 39073 -12636 -47118 34586 -10675
459 -10675 -481 -39816 35680 24217 -43695 25656 2112 43346 -51446 -381 60856 -61787
471 -61787 5279 -16544 33828 -16466 -58900 74078 -10310 -13667 -6116 37712 19692 -60911
483 -60911 35115 8183 -1180 -49633 9112 49034 -66866 17725 2856 27820 -9129 -36429
495 -36429 75807 -25728 -10161 -3924 10210 16059 -60073 26943 269 -70 -23730 6788
507 6788 51937 -48229 22827 1140 25983 -10884 -50570 73645 -43450 -18063 2987 5934
519 5934 27197 -75752 55651 25904 -28368 -2358 10791 53791 -71685 5592 33062 -13445
531 -13445 -25008 -35146 78659 -40737 -30090 41957 5526 16899 -53537 52492 18611
542 18611 -49703 11152 -2409 24515 -53856 6375 28905 -21895 5457 -16014 56290 -26394
554 -26394 -16110 40244 -17896 15172 -47847 30492 12906 -57159 24842 -2411 24642 -39472
566 -39472 6065 56253 -29923 -4963 -6027 54571 -40644 -40318 54246 -21836 -1828 -48993 52612
579 52612 26842 -80955 58368 5382 13589 -30575 -5278 68794 -69309 -213 10696 11122
591 11122 -22760 -33062 62861 -27734 -532 -1633 29333 13830 -58499 57937 -16038 -6108
603 -6108 -16766 -11307 51281 -71420 23823 11804 3452 4436 -38690 76188 -28335 -15460
615 -15460 9990 6119 18335 -72515 42611 6476 -22378 -11985 4316 60603 -66730 21949
627 21949 28404 -450 -8412 -39844 77997 -52502 -23258 24690 -6502 16337 -66342 67709
639 67709 3311 -36048 27851 -4747 44389 -66473 22844 29136 -40836 4847 -27493 55512
651 55512 -44356 -11812 40812 -12764 21142 -46381 59787 -3341 -40273 28267 -21590 37164
663 37164 -62829 13378 37719 -44030 19068 -19868 55775 -28243 -22342 53107 -21045 6857
675 6857 -40755 42590 -2094 -55161 34913 -7197 20278 -45795 25631 43846 -48251 21591
687 21591 -5857 37791 -39592 -21509 53345 -40883 2597 -24175 37127 252 -47496 53648
699 53648 -8028 11695 -25598 16815 34271 -57249 20498 -7339 15289 -27626 -19077 53882
711 53882 -36382 9512 -5015 29135 5475 -46292 52063 -14368 -5499 -18283 2627 32527
723 32527 -59842 21644 10974 2742 -9607 -12013 55752 -31589 -3031 8278 11236 -4053 -45618
736 -45618 43520 -12587 -17468 -1876 7132 30844 -46711 26708 20109 -9989 -4317 -11679 41034
749 41034 -38430 -10147 14929 -2751 -1849 -32197 44854 -5703 -16756 15209 5736 22252 -43123
762 -43123 21735 14295 -26640 -573 -14570 34372 -33365 -7739 31585 -8652 6916 -19640
774 -19640 37430 -1983 -27157 17951 -3743 8490 -37444 14348 17794 -29240 9442 -3720
786 -3720 30905 -20891 -7455 37224 -16822 174 -15993 22289 -6247 -33255 21539 -2985
798 -2985 3857 -21826 18539 23430 -28082 14643 2532 16256 -21561 -11277 29958 -25121 -3765
811 -3765 -9227 18613 -3145 -25238 32163 -1252 3516 -10943 11575 18785 -33194 8711 875
824 875 2190 -17079 -9589 28821 -18455 502 2733 18691 951 -22818 29343 -4879 -8240
837 -8240 -10290 3826 12992 -32988 8146 10894 -981 -8035 488 29479 -15510 -3443 8485
850 8485 7567 -8640 -21565 21498 -7716 -13283 -1251 8655 10811 -20980 14333 14141 -4630 -4100
864 -4100 -633 16830 -17660 -9733 6596 1020 -7779 -13130 19476 1558 -7076 2890 12489 9478
878 9478 -20358 7491 11010 -11768 -10490 -2136 14361 -14623 -11145 18176 5661 -8232 -2983
891 -2983 21242 1487 -16141 4556 9762 -6544 -20077 7255 10273 -16243 -3196 11658 8544
904 8544 -6832 -3090 19254 -192 -11658 1605 5637 -3784 -14635 -55 9096 -7071 -7284
917 -7284 7434 11759 -2567 -5852 11347 7275 -8933 -10369 10448 1509 -19484 -1049 10073
930 10073 559 -13621 4797 22243 -8118 -9433 15885 8523 -14012 -10089 13801 -759 -19192
943 -19192 -3243 17768 -4977 -15928 16566 10237 -3544 -6715 9002 13588 -19511 -3538 8757
956 8757 -4331 -9251 -7346 13937 -2659 -5883 4141 10163 6577 -14801 11049 4444 -5866
969 -5866 -7333 -6627 16731 -18500 -8201 14886 -136 -235 -10739 24009 4135 -19967 11431
982 11431 7576 -2287 -22897 9465 12133 -21699 -4346 10222 14309 -20581 2179 26259 -9126
995 -9126 -5268 -2203 18586 -9877 -22696 17591 -2922 -6541 -10393 12230 9540 -13623 7374
1008 7374 5864 10929 -15228 1292 13896 -15005 1367 -13069 13964 -3151 -20406 22244
1020 22244 -3377 4901 -9466 10100 17531 -24723 6638 3344 5462 -21043 -6024 26203 -21588
1033 -21588 -2072 1882 19661 -4016 -23594 36436 -5415 -10089 -5269 8713 10312 -36521 13669
1046 13669 7960 -6258 -10259 4076 25443 -21063 5174 7561 7233 -6838 -17186 26695 -17167
1059 -17167 -6127 -942 1210 11823 -26102 20325 5725 -3250 -699 -1058 21913 -22792 -180
1072 -180 4013 2415 -8461 -20003 30476 -11735 -7768 5401 9083 14070 -32154 23469 9212
1085 9212 -16251 -4990 -1814 20966 -31502 -420 17452 -3993 -5960 -7871 33534 -14211 -10250
1098 -10250 15682 857 1038 -27219 22245 332 -22505 7000 770 14726 -21847 8620
1110 8620 19674 -9912 -5 -5354 21716 -16431 -12351 12972 -5734 2624 -21848 19747 8268
1123 8268 -20385 13080 2932 13133 -17665 -358 20989 -15941 -8397 -1853 16368 -15823
1135 -15823 -12410 21005 -349 -1917 -11760 24951 4738 -26701 16861 2183 -620 -19896 2908
1148 2908 20421 -24652 -891 9553 11251 -10946 -6749 26223 -6261 -6851 -4482 14017 -1726
1161 -1726 -25961 16076 -868 -2039 -10176 4488 22514 -21988 6939 9269 3644 -5439 -13774
1174 -13774 22539 -11379 -12820 2645 6394 1523 -21183 19411 7318 -7759 -2378 6634 18551
1187 18551 -26042 2035 12725 -7597 -9572 -9161 23080 -11652 -12272 13799 8478 -325 -16809
1200 -16809 21938 3696 -15564 -40 2273 10327 -27056 4435 14502 -10515 -1054 -2469 22930
1213 22930 -10482 -8176 16377 -1201 -2273 -16787 16648 -1299 -19077 6972 1176 9978 -19501
1226 -19501 9426 18401 -13796 2849 -1680 16936 -14304 -12915 18135 -7988 -5083 -10838 16567
1239 16567 2654 -18207 14333 5350 5124 -15574 8007 14841 -20381 -196 -283 9645 -14174
1252 -14174 -8994 21258 -6819 -2639 -1362 16027 602 -17027 14567 586 -3109 -14220 5706
1265 5706 10433 -21186 4661 4562 7420 -8975 -2998 21955 -9180 -3379 159 9063 -4418 -18460
1279 -18460 14196 -1846 -5768 -6682 7730 12319 -17169 7853 8652 2089 -8905 -3649 16538
1292 16538 -13849 -7310 2801 5516 -4441 -13068 17221 2357 -6690 477 9028 7602 -17264
1305 -17264 5368 6332 -5951 -9164 -1800 13799 -12479 -4135 10231 4681 -2640 -6168 15083
1318 15083 479 -10363 806 4779 165 -16065 5035 6216 -6571 -2820 2742 13794 -8587
1331 -8587 -3090 11912 105 -5356 -6732 9029 -2141 -12833 2448 5796 113 -10532 8579
1344 8579 10776 -7417 -658 4617 8119 -11325 -6007 10893 -4825 -8600 -2281 9537 -962
1357 -962 -9752 9315 7236 -1802 -5731 7057 6865 -12060 -1545 3247 695 -9139 -3063 10776
1371 10776 -3159 -3480 3276 8793 -45 -7972 7292 2724 -5506 -6268 2269 4683 -11029 -789
1385 -789 6250 2739 -5046 -351 13077 -2322 -5602 2769 5589 -3859 -11214 6204 2613 -8142
1399 -8142 -3510 7129 5549 -9070 3574 9539 -608 -5977 428 9168 -8646 -7259 4660
1412 4660 1023 -4593 -5489 8423 3590 -5749 2633 7188 1625 -6779 1554 4004 -4039 -6353 -1201
1427 -1201 5678 -5386 -3621 6010 3848 -827 -2833 6987 4677 -7450 -1711 4719 -1639 -8487
1441 -8487 -1058 6121 -2630 -6843 5136 9204 -4945 -2716 7898 3384 -6845 -4328 7127 -1253
1455 -1253 -11704 1557 6624 -4286 -4525 4965 7440 -2984 -3766 7879 3093 -7565 -1159 3407
1469 3407 -2066 -5725 -2465 5004 -276 -5059 4250 5669 -1051 -895 1050 4867 -2968 -6466 3622
1484 3622 541 -5850 -3410 4491 3199 -5594 712 9028 1114 -6294 3173 7184 -6548 -6682 3144
1499 3144 3943 -8031 -6235 10730 673 -6747 3337 7681 1902 -8611 4287 7198 -8327
1512 -8327 -4457 2653 1714 -6102 -3496 6611 2049 -3736 836 7660 -139 -3759 2085 1675 -151
1527 -151 -7194 -535 4695 -5659 -2877 3351 4136 -1304 -3090 7437 4599 -6162 -2436 7457 -2666
1542 -2666 -8902 588 4452 -1315 -9906 6795 8676 -7496 -27 7266 4323 -7841 -2988 9871
1556 9871 -4854 -8135 -23 6135 -3837 -7693 8817 2767 -1583 -2307 5903 6061 -10668 2025
1570 2025 2380 -2132 -4080 -5376 9408 -4544 -4753 5006 3444 2307 -6342 6335 4500 -5367 -3611
1585 -3611 2575 3591 -10404 -798 5482 -37 -4718 -910 12617 -3957 -5149 6958 3986 -3602
1599 -3602 -8524 8096 67 -8714 -2151 6126 3094 -11360 7222 6597 -1572 -2697 296 12137
1613 12137 -10956 -3604 6083 -2537 -1696 -9181 10738 209 -7632 5503 3103 5275 -9140 4804
1627 4804 6199 -6960 -2034 -2817 7914 -9219 -4585 9183 -2144 420 -4132 10510 2119 -9373
1641 -9373 6217 2654 -1444 -9755 3779 4756 -8699 -2173 3796 7735 -9500 633 11028 -2506
1655 -2506 -2631 -3596 10497 -4497 -10681 6698 87 -1100 -9321 8186 6418 -8771 3396 3408
1669 3408 6472 -8852 -674 9593 -8055 -2517 -3255 7442 -4053 -8691 11215 -787 240
1682 240 -3914 6683 6351 -11702 4398 2237 -1007 -7293 -1558 9116 -7658 -3016 3826 6622
1696 6622 -3508 -5499 11171 -162 -4578 -3264 5642 1747 -12635 3417 3815 -1643 -5976 2782
1710 2782 10248 -6837 -681 4952 4549 -5141 -6289 9850 -3889 -6374 -1021 4817 1236 -9864
1724 -9864 7957 4896 -2560 -2528 3056 8123 -10542 -1012 5007 -2210 -4806 -4963 10140 -3221 -6319
1739 -6319 5912 4366 927 -7817 7572 4293 -7378 -2094 1591 4440 -10387 -1226 7573 -2166
1753 -2166 -3053 -445 10397 -2326 -6043 6439 2318 -2406 -7986 5461 2493 -9154 441 3636
1767 3636 3640 -7573 2312 9487 -3797 -2394 784 7268 -5983 -7002 6917 -1367 -3263 -5175 7450
1782 7450 3240 -8506 5462 3728 1862 -6393 1497 7856 -8017 -2533 604 4105 -5223 -5675
1796 -5675 9080 -540 -2052 -1174 7730 2482 -9088 5108 2074 -1737 -7029 686 7101 -8855
1810 -8855 -894 4095 3684 -3441 -2817 10562 -1985 -3953 -147 4746 -1513 -9804 6069 715 -3363
1825 -3363 -3350 3709 6899 -7622 2467 5207 881 -4000 -2670 7165 -5210 -4261 587 3251 -1135
1840 -1135 -6869 7774 2127 -2049 -849 3414 5308 -8613 657 3455 -1627 -5091 -2554 8001
1854 8001 -4364 -3629 4561 4375 -1091 -4712 7669 1120 -5523 -1644 3005 1325 -9654 2909
1868 2909 4147 -2819 -2193 1639 7651 -4488 -1713 5998 442 -3459 -3442 4348 -1371 -5288 64
1883 64 3114 848 -5391 4830 3915 -1374 -717 373 5372 -5302 -3299 3789 -1029 -3478 -2574 4774
1899 4774 1177 -4251 1887 5349 256 -4865 3633 2999 -4368 -3233 1321 3166 -6822 -1597 6370
1914 6370 -854 -2692 1165 5929 -240 -4858 3883 2535 -3981 -3915 2847 589 -4873 -751 3337
1929 3337 2111 -3837 2020 4980 -1637 -1256 -231 2512 -1857 -5340 2480 984 -3072 -1518 2449
1944 2449 3055 -1727 -413 4668 1565 -4180 219 3368 -2703 -3864 -190 3377 -2399 -4261 4955
1959 4955 2645 -3274 21 4389 1755 -4715 -447 4250 -2145 -5770 1790 2685 -3314 -1611 3057
1974 3057 3840 -2613 -1188 5657 -65 -3115 -17 1089 -359 -4346 132 2707 -1621 -1660 2382 2858
1990 2858 -730 -763 2025 2536 -2809 -2872 2632 -568 -3759 -573 2184 976 -3262 1454 5447 -1657
2006 -1657 -2196 3228 2194 -3011 -3283 2500 1147 -5703 -581 4188 -94 -2920 1564 4950 -978
2021 -978 -2724 3070 2074 -3424 -2822 1832 -98 -3899 -1024 2967 616 -2377 1416 3815 -445 -1282
2037 -1282 665 2097 -1760 -3516 1097 661 -2848 -964 1653 2349 -1704 -859 5028 796 -3080 1079
2053 1079 1975 -1135 -4453 -23 3081 -3299 -2492 3417 2545 -2564 -660 4731 628 -3318 -36 3308
2069 3308 -1450 -5343 1693 1759 -2948 -1757 2106 3457 -2797 -349 4397 463 -2310 -644 2341
2084 2341 -741 -4498 416 1984 -1361 -1922 1330 3258 -789 -1324 3383 1811 -2528 -1293 1710
2099 1710 -158 -3942 -1270 3084 -936 -2577 1945 4281 -1439 -1756 3403 1870 -2901 -2709 2931
2114 2931 475 -5209 -131 2978 -683 -2954 1153 5040 -1673 -2287 3142 2151 -2764 -2475 2279 900
2130 900 -4520 -1089 2840 -57 -2079 936 4171 -428 -2223 2122 2403 -2186 -2885 1930 913 -3665
2146 -3665 -1201 2657 1153 -2644 639 4901 -672 -2451 1303 2706 -2144 -4281 2512 1358 -3913
2161 -3913 -1991 2946 2176 -3048 497 4641 490 -3471 1012 3634 -2472 -3819 997 2043 -3168
2176 -3168 -2734 3697 1655 -2374 -112 4329 1030 -3495 677 2625 -1392 -4085 1276 2040 -3483
2191 -3483 -1584 2540 2861 -2182 -844 5085 -84 -2623 -341 2872 -793 -4964 1299 2425 -2200
2206 -2200 -2729 2592 3522 -2833 -564 3412 1962 -3287 -1697 4128 -1717 -4323 118 2591 -1302
2221 -1302 -3640 2853 3222 -1621 -1480 3582 2100 -3855 -602 2696 -565 -4340 -410 3807 -1683
2236 -1683 -2647 2512 3516 -1490 -2376 3664 1503 -3026 -2002 2535 333 -4937 96 2822 -603
2251 -603 -2656 1537 4406 -1776 -2082 2628 2354 -2782 -3034 2877 122 -4394 -1068 3338 495 -3461
2267 -3461 1897 4369 -641 -2672 2232 3213 -3570 -2076 2529 172 -3469 -1607 3894 229 -3839
2282 -3839 1894 4088 -890 -2368 2219 2642 -2733 -3028 1941 981 -4120 -1048 3364 348 -2314 601
2298 601 4065 174 -3332 1764 2480 -2297 -2816 1329 1746 -3146 -1922 3623 1492 -2523 561 4111
2314 4111 263 -3126 652 3217 -2065 -4609 2051 1453 -3509 -1957 3141 2169 -3215 -101 4473
2329 4473 -45 -3142 722 3111 -2447 -3458 1442 1464 -2549 -2497 4001 1442 -2628 735 2846 994
2345 994 -3034 322 2967 -1892 -2677 314 2205 -1802 -2502 2577 2278 -1380 -1703 3912 1065 -3209
2361 -3209 -302 1644 167 -4494 -22 3604 -2319 -2120 1919 2929 -1821 -1411 3758 1262 -3286
2376 -3286 -1028 3271 -1419 -3464 901 2095 -274 -3129 3183 3229 -2777 268 2244 1016 -2382
2391 -2382 -1581 2607 -839 -3120 54 2243 -1061 -1389 1769 2127 290 -2541 2427 2232 -3308 -989
2407 -989 993 660 -2697 -1581 3491 -128 -2382 1681 3142 -880 -2165 1666 1921 -2322 -3245 2997
2423 2997 436 -3850 174 2384 540 -2644 1178 3687 -1571 -1812 2019 1243 -2523 -1949 1938 170
2439 170 -2400 -893 2769 264 -1811 1466 1769 603 -2020 556 2464 -2421 -1761 757 319 -1096
2455 -1096 -1792 2420 1630 -1942 347 3066 21 -2096 214 1763 -1041 -3172 902 1788 -2633 -1274
2471 -1274 2358 1130 -1889 -187 3106 457 -3011 721 2412 -1965 -2379 1152 974 -1366 -1645 2438
2487 2438 1443 -2122 750 2029 252 -1885 -547 1731 -1090 -2509 631 928 -719 -1274 1460 1713
2503 1713 -995 -345 1348 1100 -2020 -896 1341 -550 -2355 -367 1670 -488 -2067 1980 2116 -692
2519 -692 -590 1540 1549 -2245 -1228 1806 -667 -2455 -11 1580 -303 -2102 2000 2283 -924 -1184 1532
2536 1532 1035 -1838 -1013 1228 -321 -1877 77 1499 290 -1410 1282 1780 -337 -811 810 1445
2552 1445 -1714 -1525 846 110 -1823 -792 1392 865 -1333 662 2061 120 -1312 428 1479 -1458
2568 -1458 -2329 1148 306 -1802 -695 1620 1093 -1772 785 2409 127 -1480 181 1934 -1543 -1924
2584 -1924 983 245 -1205 -1184 1810 1546 -1468 258 1945 181 -1588 32 1263 -1061 -1658 107
2600 107 912 -1084 -919 1512 1141 -713 -245 1636 693 -1458 -288 1201 -654 -2473 306 908 -848
2617 -848 -1074 1006 2205 -1125 -316 2198 656 -1431 -1113 1523 -563 -2432 105 995 -482 -1447
2633 -1447 1332 2096 -759 -282 1448 1062 -1579 -906 1207 -76 -1997 -499 1251 -110 -1311 1026
2649 1026 1748 -429 -997 1056 1118 -1223 -1336 754 230 -2127 -266 1334 -186 -991 392 2230 -185
2666 -185 -1248 1126 1064 -1444 -1662 987 280 -1885 -846 1503 735 -1430 397 2392 -159 -1356
2682 -1356 630 1450 -1372 -1979 969 530 -1806 -1282 1483 774 -1065 359 2147 351 -1452 469
2698 469 1144 -1203 -1753 101 1138 -1701 -1118 1608 856 -983 -120 2087 365 -1327 -130 1498
2714 1498 -916 -2270 299 880 -1359 -924 1356 1727 -1291 -196 1764 624 -1625 -292 1241 -861
2730 -861 -2307 52 1332 -1072 -1315 1502 1374 -912 -454 2076 683 -1751 -160 926 -435 -1942
2746 -1942 -246 1631 -980 -1112 1278 1840 -1093 -659 1711 838 -1607 -746 1361 -403 -2007 179
2762 179 1234 -546 -1408 950 1944 -492 -760 1664 992 -1662 -955 1180 179 -1964 -625 1687
2778 1687 -392 -1528 1204 2179 -326 -894 1484 1355 -1783 -1148 1196 226 -2174 -680 1569 -354
2794 -354 -1327 989 2119 -325 -1167 1230 1082 -1527 -1227 1165 475 -2082 -679 1460 329 -1197
2810 -1197 512 2234 -83 -1572 686 1333 -1272 -1682 812 781 -1997 -959 1933 669 -1362 72
2826 72 2520 -216 -1610 661 1601 -1470 -1694 1144 675 -1893 -631 1957 850 -1714 329 2337
2842 2337 67 -1572 61 1626 -1432 -1891 912 837 -1102 -1150 1828 759 -1399 161 1913 606
2858 606 -1721 216 1448 -884 -1596 305 1620 -1257 -1120 1401 1469 -1057 -685 2207 513 -1768
2874 -1768 -480 1135 -210 -2521 743 1298 -1229 -990 1305 1642 -1485 -167 1996 251 -1571 -670
2890 -670 1542 -728 -2307 583 960 -959 -1358 1698 1367 -965 -215 1653 787 -1961 -69 1240
2906 1240 -745 -1333 -495 1824 -427 -1070 1391 1188 21 -1091 1499 632 -1703 -646 603 391
2922 391 -2169 -440 1791 -414 -858 598 2294 -863 -1279 1720 558 -1269 -1506 1581 -77 -2522
2938 -2522 157 1440 -33 -1026 1102 2116 -577 -574 956 794 -1862 -1051 1484 -332 -1172 -563 1620
2955 1620 291 -1158 1067 1221 -48 -1096 687 843 -1378 -1122 541 560 -1344 -520 1788 308
2971 308 -647 275 2056 -169 -1901 1172 656 -1063 -1715 481 1023 -1701 -272 1344 593 -860 76
2988 76 1977 -305 -1185 424 974 -1272 -1568 1001 413 -1088 -577 1873 1064 -1347 138 1417 19
3005 19 -915 43 981 -1041 -1455 557 410 -886 -422 1300 763 -424 14 1269 583 -1478 154 820
3023 820 -761 -1387 -142 1146 -756 -904 1538 900 -664 -464 1663 483 -1308 -359 1032 -494
3039 -494 -1600 531 1045 -511 -524 1084 1759 -837 -496 1462 37 -1285 -526 761 -123 -1491 180
3056 180 1014 -142 -699 1041 1000 -385 -395 824 192 -917 -869 582 -370 -1084 111 1104 167 -696 1086
3075 1086 1318 -371 -684 661 647 -1113 -699 908 -158 -1470 46 1306 35 -825 329 1390
3091 1390 -429 -913 602 878 -787 -1328 712 205 -1182 -253 1052 387 -811 409 1596 -415
3107 -415 -914 192 206 -703 -1326 536 -80 -1043 -119 755 656 -319 541 1188 -29 -824 106 565 -935
3126 -935 -1301 626 -49 -550 -559 1174 765 -705 260 1026 141 -868 -302 624 -826 -1414 235 451 -540
3145 -540 -649 1339 863 -636 -291 1117 184 -1070 -449 332 -518 -1255 215 569 -619 -237 682 1003
3163 1003 -588 -368 860 -20 -915 -429 658 -592 -1320 -205 326 -65 -978 627 1243 -826 -243
3180 -243 740 296 -945 -705 760 225 -866 109 683 288 -688 741 866 -293 -362 402 488 -1125 -909
3199 -909 520 -101 -915 -241 751 262 -754 705 1043 -16 -437 592 490 -919 -721 543 92 -1151
3217 -1151 -395 640 408 -612 218 1452 -309 -697 145 501 -381 -1376 447 216 -872 -447 831
3234 831 604 -556 438 1250 245 -729 -76 872 -609 -1147 633 522 -605 -647 860 953 -621 52
3252 52 1028 -9 -963 -211 531 -628 -1456 578 618 -385 -376 1004 615 -310 25 967 397 -991 -254
3271 -254 681 -523 -1264 -264 679 -112 -711 817 1111 -611 -293 956 292 -959 -726 761 171 -1434
3289 -1434 -2 1033 -168 -557 669 1209 -418 -817 1031 525 -1162 -409 585 -373 -1115 138 1015
3306 1015 -7 -914 716 877 -751 -265 469 524 -773 -913 875 -369 -1133 -227 840 326 -695
3323 -695 774 1231 -52 -640 653 686 -1032 -838 293 388 -1071 -881 1504 20 -691 564 1133 284
3341 284 -1231 691 943 -1111 -1113 530 293 -1177 -255 793 663 -879 100 2019 -599 -367 313 332
3359 332 -420 -1045 763 531 -762 -361 879 550 -697 -44 1137 383 -931 126 845 -830 -936
3376 -936 227 715 -535 -829 1209 935 -711 103 912 202 -1267 322 923 -567 -1336 142 849
3393 849 -888 -480 1084 863 -760 -317 1681 453 -1491 152 767 -624 -1287 412 994 -818 -661
3410 -661 751 811 -725 8 707 35 -995 -214 665 -339 -1362 392 638 -210 -727 282 1250 -876
3428 -876 -560 1056 473 -991 -535 727 88 -1216 -77 1005 -277 -651 846 987 -616 -555 646
3445 646 843 -1376 -547 1099 -126 -1104 63 1006 69 -977 1068 969 -481 -433 770 379 -1100 -610
3463 -610 620 283 -1345 338 1053 -254 -385 473 952 -124 -1035 829 403 -725 -650 228 190 -1183
3481 -1183 -141 959 271 -854 332 1226 -391 -917 192 973 -667 -993 536 163 -1003 -297 1074
3498 1074 561 -961 499 1038 -133 -1209 423 684 -937 -592 215 785 -893 -164 1737 121 -309
3515 -309 224 859 262 -1171 347 643 -825 -985 399 822 -861 -469 580 297 -607 -386 980 -122
3533 -122 -725 40 585 -552 -888 188 713 -641 -458 880 782 -723 32 999 158 -904 -263 702
3551 702 -825 -930 38 484 -646 -557 1066 568 -591 -215 938 298 -935 15 538 -270 -962 161
3569 161 666 -473 -485 1103 810 9 -618 830 173 -1056 152 389 49 -952 65 782 -360 -288
3587 -288 645 733 -307 -517 695 320 -862 -344 569 -144 -989 -56 892 -157 -519 593 810 -395
3605 -395 -367 390 580 -862 -834 350 -42 -900 -207 941 -71 -460 545 522 88 -713 406 463 -949
3624 -949 -174 316 179 -882 -147 1016 36 -224 428 789 -12 -786 511 210 -693 -568 197 221 -885
3643 -885 -147 1260 222 -468 397 676 -198 -944 77 315 -523 -940 244 254 -568 -225 701 526 -166
3662 -166 350 960 114 -512 -98 400 -658 -539 192 352 -439 -237 883 520 -207 -128 461 67 -567 75
3682 75 22 -391 -781 -58 269 -356 -131 775 491 -30 -274 442 235 -1206 -248 248 -221 -530 118 884
3702 884 -189 -269 570 704 -113 -449 824 57 -674 -330 -19 -96 -730 -57 581 -83 -304 242 775 -126
3722 -126 -263 481 130 -647 -374 115 -57 -752 -47 609 -152 -88 533 545 -144 -240 377 171 -758 -576 282
3743 282 60 -420 -255 621 128 -94 214 528 11 -456 151 122 -686 -603 2 39 -381 -40 957 110 -2
3764 -2 70 800 362 -498 74 221 -399 -793 24 327 -458 -74 454 540 -172 -74 886 -7 -646 -82 350 -214
3786 -214 -1057 -32 506 -245 -257 394 693 -153 -76 521 215 -426 -375 521 -319 -663 -198 360 -339 -445 333
3807 333 673 -492 77 472 193 -876 -478 193 -225 -670 -144 540 -509 -127 663 95 -137 -186 372
3826 372 154 -683 -318 202 -103 -810 -319 281 76 -118 293 716 -278 -518 265 383 -588 -737 402 156
3846 156 -666 -40 748 204 -271 76 985 -295 -533 501 367 -657 -622 233 104 -921 100 818 243
3865 243 -250 326 515 194 -531 -50 667 -801 -498 349 71 -483 -511 610 493 -85 87 683 213 -799
3885 -799 79 380 -413 -485 9 493 -678 -89 597 353 -237 -97 1012 33 -609 128 311 -276 -874 294
3905 294 620 -640 -239 664 593 -348 228 725 -275 -317 -418 547 -552 -1186 539 108 -110 -200 716 548
3925 548 -359 -24 430 448 -607 -195 366 -534 -587 -102 880 -546 -556 867 688 -89 -444 667 182 -984
3945 -984 -24 592 -495 -904 187 698 -148 -90 532 737 -250 -363 721 51 -360 -525 698 -152 -998
3964 -998 127 649 -53 -499 707 906 -240 -685 591 585 -768 -429 923 -157 -323 209 679 161
3982 161 -829 603 880 -203 -278 449 399 -591 -341 81 283 -787 -76 564 30 -220 321 945 17 -584
4002 -584 299 402 -331 -460 523 504 -819 -39 827 326 -439 187 902 -181 -845 321 405 -345 -863 855
4022 855 243 -841 -131 468 517 -231 -49 794 -189 -795 176 200 -542 -850 492 196 -284 -301 828 353
4042 353 -453 187 796 -33 -564 132 564 -589 -546 75 362 -488 -437 944 402 -235 -143 695 -231 -716
4062 -716 110 546 -189 -779 339 611 -335 2 612 741 -411 -238 654 39 -793 -172 287 -237 -818
4081 -818 124 241 -360 -332 481 254 -106 -92 494 153 -626 -263 372 -450 -557 108 439 -37 -374 274 696
4102 696 -536 -218 359 250 -868 -257 591 -73 -671 306 880 -183 -191 441 474 -279 -553 646 105 -668
4122 -668 -155 234 61 -655 167 484 -29 -559 362 571 -338 -375 329 6 -675 -204 109 50 -661 201 496
4143 496 77 -165 262 558 -172 -257 51 156 -601 -464 380 250 -396 5 577 94 -422 470 574 -198
4163 -198 -344 -60 218 -800 -478 182 117 -433 11 755 269 -308 309 613 -374 -506 148 229 -311 -577
4183 -577 399 314 -512 -129 665 258 -153 98 476 -180 -626 23 206 -379 -375 170 328 -259 52 518 421
4204 421 -272 -10 564 104 -629 -77 202 -238 -492 314 614 -46 -318 575 452 -437 -78 316 46 -676
4224 -676 -192 174 -139 -653 -6 346 -148 164 371 336 -441 -367 307 -171 -585 -88 206 -124 -419 -5 243
4245 243 14 -222 305 216 -235 -136 235 155 -438 -212 143 126 -481 48 687 42 -153 445 596 -196 -172 277
4267 277 67 -508 -688 156 -67 -337 93 338 13 -338 58 241 -315 -249 -138 244 -516 -342 385 -3
4287 -3 -207 -131 459 461 -246 271 411 -231 -170 -289 339 -230 -475 172 107 -242 -81 398 -66 -34 55 286 -264
4310 -264 -452 -85 379 -200 -530 -56 267 -387 -426 438 210 -165 -19 433 138 -315 -74 173 -355 -631
4330 -631 76 9 233 18 312 386 90 97 276 235 -385 16 139 -223 -518 -72 400 116 -105 308 642 214
4352 214 -77 154 4 -253 -695 -114 -84 -443 -136 422 -69 -127 453 139 -221 -285 140 104 -286 -235 119 -8
4374 -8 -523 -119 495 2 -50 65 224 -63 -572 189 242 -569 -456 148 -174 -344 -40 288 495 37 157
4395 157 398 48 -442 101 -25 -367 -478 85 362 -120 -237 408 382 -478 123 543 -245 -582 -291 166
4415 166 -459 -407 196 143 -248 -35 386 79 -184 174 697 180 -436 2 104 -474 -266 80 177 -492 -177
4436 -177 593 269 -521 -187 397 278 -455 18 69 -7 -712 -130 423 -102 -252 70 582 -359 -88 361 -74
4457 -74 -365 -366 288 -236 -617 444 337 -38 -184 406 607 -410 -78 344 -1 -164 -83 296 -189 -486 30
4478 30 351 -41 -324 584 501 -131 -233 185 267 -427 -35 165 37 -271 127 519 116 -163 221 588 65
4499 65 -196 315 -59 -347 -144 189 146 -423 -60 787 258 -216 73 607 -3 -188 71 172 -347 -465 377
4520 377 -32 -465 -152 650 220 -225 659 733 56 -379 131 270 -513 -585 268 430 -306 -101 840 236 -487
4541 -487 312 496 -168 -409 259 330 -459 -342 69 268 -268 -181 398 135 -192 12 520 13 -607 51 -11
4562 -11 -485 -450 316 343 -286 8 414 208 -235 234 646 15 -356 5 321 -550 -610 137 384 -219 -381
4583 -381 631 574 -207 176 166 -133 -298 -220 331 -174 -330 -68 360 -38 -108 438 119 88 -253 596 2
4604 2 -568 -25 -9 -163 -251 307 194 -48 -137 436 359 -652 -138 424 -25 -648 -183 298 -436 -556 216 244
4626 244 -204 -215 163 572 -195 -50 150 -3 -544 -21 377 -36 -334 82 407 78 -176 71 337 -198
4646 -198 -150 -65 -98 -511 -449 384 -332 -415 89 485 17 -314 724 368 -107 -203 317 16 -800 -366 382 -75
4668 -75 -514 77 494 204 -17 180 566 -261 -289 64 112 -425 -360 152 82 -355 98 327 -105 -24 248 369
4690 369 -183 -414 529 32 -513 -404 110 -335 -341 79 -2 212 27 234 238 -167 -289 488 -184 -365 -357 198
4712 198 200 -1 5 407 211 -129 16 460 96 -380 159 50 -246 -201 231 102 -95 -12 752 497 -78 233
4734 233 157 5 -554 -102 48 -443 -153 52 465 28 -243 407 230 -119 -270 246 21 -105 -126 41 -32
4755 -32 -345 179 97 -128 144 373 377 45 -40 106 90 -441 -79 93 -107 -243 12 444 -543 -35 390 343
4777 343 -184 -167 167 85 -397 -166 55 129 -492 222 332 126 39 286 487 -143 -181 143 -96 -689 -287 206
4799 206 -301 -245 -96 289 213 -23 220 361 41 -113 63 124 -206 -400 178 -112 -244 -186 203 172 -85 -55
4821 -55 380 69 -290 -24 37 -271 -242 136 51 -49 234 402 128 -60 306 323 -25 -275 186 81 -128 -127
4843 -127 146 -7 51 84 421 263 -81 -186 231 -100 -106 -141 112 -255 -340 -115 384 -116 -51 135 404 113
4865 113 122 281 231 6 -284 -206 -276 -55 315 137 102 -30 306 282 -96 -3 139 254 -388 -388 105 -49 -461
4888 -461 -445 448 -53 42 59 42 -170 -319 284 83 -558 -229 220 -78 36 -63 241 236 102 177 504 -252 -366
4911 -366 -36 13 -302 -223 -204 -34 -241 -20 168 -17 -23 -63 442 67 -288 -165 -18 -177 -278 -70 -230 -272
4933 -272 114 268 284 26 195 302 37 -260 -182 -104 -177 -216 104 189 -263 73 316 190 -34 82 287 199
4955 199 -367 -170 262 -203 -152 59 123 -79 16 316 374 10 113 360 140 -404 -206 9 -277 -311 -43 233
4977 233 -195 58 636 71 -65 -293 44 111 -269 -127 424 -15 -496 3 358 -348 12 388 424 -214 -186
4998 -186 65 -62 -506 -106 162 -197 -410 269 207 276 -9 99 511 -288 -313 93 269 -411 -139 66 -72
5019 -72 -189 -81 465 29 -222 162 304 -273 23 -52 -35 -304 -392 60 -25 -331 34 629 256 -94 211 529
5041 529 103 -463 45 78 -325 -266 162 -66 -350 228 367 325 -168 237 375 -107 -288 -132 -22 -163 -330
5062 -330 156 29 -130 -59 349 52 -135 86 272 -311 -370 219 314 -382 -160 55 10 -363 -377 115 111 -100
5084 -100 -15 336 -256 -371 29 116 -308 -331 85 304 -134 152 316 186 -75 226 469 82 -439 -124 315
5105 315 -226 -265 4 -93 -272 117 218 396 -300 64 244 117 -349 -403 161 -322 -276 33 225 -109 -254
5126 -254 46 257 -256 -6 463 -43 -759 -114 242 -236 -472 106 218 -237 -235 544 637 -266 -151 321 -105
5147 -105 -465 -151 208 -339 -330 317 167 -134 -81 -64 469 -262 -198 278 141 -553 -234 151 226 -328 10 649
5169 649 64 -319 352 349 -152 106 25 82 -110 -342 246 -176 -274 131 375 -89 -252 109 325 -42 -26 63
5191 63 182 -148 -157 241 -260 -333 113 452 5 -361 188 337 -282 -317 -112 49 -444 -145 217 114 -180 -73
5213 -73 335 153 -381 144 374 111 -329 -154 139 -179 -133 130 125 -456 59 264 228 -575 316 262 -82 -439
5235 -439 112 102 -133 -210 207 152 -73 131 366 305 -57 316 91 -282 -242 -163 -26 -182 -323 322 -65 -290
5257 -290 -38 326 194 -451 79 187 -578 -252 -55 -101 -471 -316 247 -1 -33 80 259 405 -347 -183 170
5278 170 -69 -648 -56 82 -290 -388 94 128 162 29 442 244 -158 -240 68 48 -445 -60 229 -56 -274 241
5300 241 278 -77 84 247 215 196 -196 73 -323 -169 -285 384 -284 -141 101 310 45 213 263 112 -198
5321 -198 -217 110 61 -216 -299 -109 195 -133 80 198 273 -186 223 293 57 82 -160 -19 -238 -194 179 274 226
5344 226 -18 523 20 -143 159 152 186 -54 96 -112 -327 -122 272 -104 -145 -180 514 188 63 145 157 68 -307
5367 -307 65 241 -43 -234 122 44 139 160 214 56 265 75 125 -188 -217 197 -438 -138 -221 -123 245 -37 360
5390 360 369 166 -27 238 162 -278 -280 106 53 -135 -123 -32 36 195 -164 267 300 -122 -167 -9 -96 -20 108 -49
5414 -49 -138 -421 265 217 -156 -129 -124 175 -205 93 -139 -14 -133 -159 0 -181 -251 -46 466 22 134 116 334
5437 334 4 -125 93 -83 -25 -163 253 -148 -162 148 178 94 -240 117 133 279 51 -103 -54 -450 -217 21
5459 21 -62 -221 171 310 91 392 155 393 -197 -273 2 -57 -58 -219 -82 18 -80 -127 276 192 15 355 83
5482 83 -155 -82 -298 128 -308 -66 154 156 -212 75 300 102 21 76 88 -8 -217 32 272 -280 -376 -152 127
5505 127 -69 -107 144 38 -93 -38 206 -36 -277 -391 -100 -4 -178 68 254 -203 -204 119 158 87 -175 102
5527 102 141 -380 -373 -80 -59 -240 28 -55 126 -272 249 277 -9 -155 171 -140 -204 -161 55 176 -431 21 481
5550 481 -236 -292 144 467 -312 12 -113 -54 -479 -56 296 93 -203 -82 269 -160 -231 137 115 122 -234 -91
5572 -91 -198 -411 -261 79 -73 -173 59 458 -24 -81 240 335 63 -324 144 -5 -130 -414 3 -86 -243
5593 -243 42 407 102 -66 60 304 31 -544 112 131 -150 -367 92 177 59 101 460 363 -201 75 191
5614 191 -100 -100 -262 -11 -175 -417 -144 445 -241 165 375 195 -180 -39 220 56 -146 71 137 41 -111
5635 -111 227 319 -159 -69 265 251 -64 61 369 16 -184 21 477 -160 -647 127 492 -210 63 218 170
5656 170 -276 -180 325 193 -94 -32 190 -164 -152 39 385 -383 119 228 396 -360 61 -47 394 -535 -376
5677 -376 122 -140 -137 16 275 34 -14 324 218 -182 -170 -1 162 -379 -138 325 70 -77 48 215 -101
5698 -101 -171 107 4 -227 -92 271 -133 -21 -132 213 -95 -60 -69 325 32 -142 28 461 -179 11 52 -114
5720 -114 -285 -244 199 -194 -58 57 300 125 -204 363 355 -143 -103 -53 25 -340 -519 14 50 -392 41 286
5742 286 166 -58 181 291 -243 -254 96 200 -512 -264 19 -16 114 -263 355 206 -5 123 180 5 -420
5763 -420 -89 -152 -282 -334 304 199 -92 -64 114 204 -64 -203 330 -33 -318 -97 -34 -128 -211 -37 207 -167
5785 -167 209 371 225 34 -66 361 -146 -313 -29 60 -174 -178 36 338 43 2 83 88 -96 -205 142 -246
5807 -246 -199 179 90 -80 -191 4 308 -118 -115 87 284 -345 -107 155 -68 -193 -327 125 37 -326 158 -4
5829 -4 -113 -18 81 106 -210 -364 42 203 -451 -105 -151 -194 -336 53 290 123 -133 151 275 -128 19 66 190
5852 190 10 82 221 137 -126 167 296 -215 -165 143 105 -129 -169 141 -175 -201 -187 82 226 -137 -10 98
5874 98 -241 -284 156 157 -319 -132 203 11 -198 -126 205 -199 -28 262 162 -322 -95 240 -79 -78 -356 24
5896 24 -184 -135 -21 123 15 -103 -175 136 134 -181 229 34 -49 -317 -98 40 33 -169 78 243 -85 134 147
5919 147 -25 116 -22 304 -25 -159 66 -134 -142 -193 157 153 -136 99 238 63 158 91 84 -201 0 -132 178
5942 178 -15 -272 -52 233 -104 213 181 88 75 17 89 -154 5 -151 -84 -366 -118 -7 344 -44 144 138 113
5965 113 60 -242 -111 -240 -214 -240 -93 -75 -256 -13 183 -89 -49 46 425 163 259 179 -163 -248 -88 40 29
5988 29 189 52 -51 127 124 183 116 -129 -104 -77 220 -68 42 -181 244 -81 99 156 2 -55 85 221 -163
6011 -163 -67 -65 47 -194 -184 29 154 51 -122 223 88 64 -68 422 20 -286 -137 -130 -81 -256 -313 -45 165
6034 165 17 174 341 -47 -135 182 -148 -168 -1 -80 -35 -220 14 338 140 -204 480 429 -29 -194 123 279
6056 279 -212 -113 -13 101 -83 11 96 -139 -259 317 225 35 -199 98 -87 -157 -237 7 65 -222 51 134 27
6079 27 47 -64 360 -43 -139 133 8 -190 -454 5 -183 -470 223 459 137 -12 111 85 2 -215 -21 -207
6101 -207 -80 -129 -16 52 -4 -16 445 73 -37 284 479 324 -111 -236 -225 -119 -10 104 169 8 -352 170
6123 170 340 103 -232 249 -137 -53 22 -40 -190 -342 213 -24 -279 24 75 19 -173 1 335 270 -115 -9
6145 -9 285 -242 -183 238 6 68 -79 372 273 73 -38 125 206 -274 65 377 -197 -277 -235 90 -76 38 109
6168 109 173 -288 130 374 -68 -502 -356 18 -111 -467 173 54 -81 19 118 242 -125 -144 196 272 -276
6189 -276 -134 119 -247 -75 -150 134 -195 -68 148 137 -210 -19 204 -55 -3 -144 148 18 -493 19 88
6210 88 -92 -162 300 202 192 -102 -172 142 -303 -133 70 -26 -203 94 53 21 -356 308 -185 -266 -327 -134 142
6233 142 -197 -519 -71 -10 -28 -74 131 131 -208 -20 188 -88 -169 88 -149 54 -27 283 315 -353 61 556 -51
6256 -51 -43 15 162 99 -101 122 284 -296 -60 55 93 -110 -107 -40 130 -62 59 213 66 -123 44 -121 -184
6279 -184 -332 -97 30 80 39 281 75 61 221 197 98 -290 67 9 -279 -165 103 224 -6 43 59 -27 56
6302 56 12 506 -131 -432 216 61 -303 -402 2 246 -75 -105 275 -49 16 182 181 -47 -366 144 248 -93
6324 -93 -313 -9 -31 -64 87 137 -26 86 160 194 172 -317 97 84 -248 9 205 112 -176 -20 313 234 209 -26
6348 -26 164 134 -277 80 150 -71 -291 177 317 126 -87 111 348 127 106 -26 -45 16 -209 240 113 107 -11
6371 -11 426 -205 -134 93 291 -207 98 183 183 40 -345 52 -198 15 -173 156 176 -72 14 94 -4 157 234
6394 234 -118 -149 65 19 101 -116 88 -92 -85 78 346 376 77 -193 248 35 -223 -456 -68 140 -253 -126
6416 -126 226 -28 -14 -48 292 125 -87 -78 -79 -256 -105 107 222 -118 -20 290 -108 -57 75 -14 -93 -342 -18
6439 -18 -23 -333 -44 -66 142 -283 209 191 194 -361 119 207 -60 -173 -37 334 -200 -106 -272 174 42 49 108 46
6463 46 -50 189 120 321 -139 11 -94 128 -316 153 249 50 99 271 -69 -102 -215 -67 48 50 65 44 38 -101
6487 -101 -12 287 110 84 -137 -136 7 27 -40 4 -90 33 63 -253 224 -261 113 183 150 114 149 155 -197 -261 256
6512 256 -29 -366 188 37 -122 116 64 116 -149 70 336 -3 -310 -205 -182 -130 -211 131 -146 46 -8 196
6534 196 382 -109 56 49 -240 -183 104 175 -259 -246 -114 102 243 86 325 55 91 -66 97 -47 -26 6 -181
6557 -181 -124 -189 5 -35 -68 170 207 136 122 -135 115 -178 -226 -230 18 -277 -366 109 54 205 69 157 241 159 134
6582 134 220 -155 -117 -174 159 53 -160 -40 256 146 138 158 47 -269 65 93 -149 -158 35 -195 144 2 -184
6605 -184 64 230 -5 17 118 -19 -195 59 151 -581 -242 187 -303 -7 104 255 -135 54 -30 189 332
6626 332 -375 -115 97 13 -334 -268 172 39 -22 158 152 157 -152 87 -174 -9 -11 -51 21 -32 136 -29 -41 -14 220
6651 220 -81 140 49 331 25 -255 35 202 -89 -243 -35 200 -119 -303 80 272 149 51 51 -89 -82 18
6673 18 37 -36 28 253 104 -22 -82 375 415 189 -135 366 21 -221 135 91 -155 -68 225 97 -158 281 100
6696 100 209 18 -165 258 57 163 170 223 -13 -381 -68 141 30 -194 338 117 31 -209 61 -10 -223 -132
6718 -132 113 -137 -287 68 189 -22 -132 -36 169 -192 -181 62 64 -170 -80 -91 82 -31 235 253 138 -48
6740 -48 153 291 368 -132 99 35 -127 87 60 -77 -224 89 45 -6 -256 -1 17 222 92 214 118 -7 176
6763 176 -111 167 -173 221 181 -115 82 117 274 -57 -273 14 262 -129 -255 91 252 -598 3 522 315
6784 315 -91 24 -29 -47 -52 -307 72 -358 -194 -98 91 32 -268 335 359 -34 -77 32 65 -187 12 230 103
6807 103 -199 271 42 -21 180 466 79 68 103 179 84 -53 13 74 -150 -16 62 38 220 -20 190 470 -75
6830 -75 -214 -45 166 -334 -122 155 -119 -32 -155 122 -60 -278 116 24 -156 176 -23 -115 48 -165 -46
6851 -46 -295 -111 -153 -16 59 -120 230 -1 24 97 -215 -111 19 -522 -79 -164 -286 25 91 -135 -229 85 212
6874 212 -9 9 38 -162 -86 -159 159 -109 -49 -4 253 185 -145 8 106 160 -181 251 86 17 -18 78 40 -82
6898 -82 120 -16 63 -111 319 168 57 -20 -126 44 -281 160 -4 -11 73 -122 212 -97 -165 109 85 -77 -397
6921 -397 -185 -163 22 -166 188 48 -60 -250 111 -1 -69 25 198 -1 -136 16 108 -168 -124 -15 127 -60
6943 -60 -198 105 230 -226 -19 14 -76 -132 -132 151 -137 -175 45 219 -119 -96 98 142 -124 315 137 -94 -146
6966 -146 243 139 -181 71 196 145 71 176 246 123 -182 -3 195 113 -19 136 171 82 -275 210 364 242
6988 242 -174 18 24 -18 -85 -86 -37 -141 -199 -298 -270 -100 -233 115 190 -139 97 122 23 323 119 156 -335 160 -1
7013 -1 -77 33 8 -85 6 -66 305 98 17 -263 -165 94 -169 -39 -106 -5 1 -55 91 255 -106 418 343 195 29
7038 29 -15 49 -111 -86 -84 -39 -109 195 257 163 -177 -114 -94 5 -78 -450 -59 -91 -11 -76 -98 259 -121 206 16 -209
7064 -209 161 -39 366 -206 -236 192 45 -133 -171 316 -218 33 -106 87 -28 72 122 147 -220 163 -63
7085 -63 122 -285 -103 11 -143 102 -47 223 -29 81 -154 261 74 -67 -257 -243 -66 -66 119 -99 10
7106 10 314 274 113 189 224 -158 -6 164 114 73 -368 -14 -108 -63 71 -88 -86 36 -104 -17 66 -43 -187 102
7130 102 132 -255 19 134 62 -65 -100 262 100 222 195 -107 21 -129 -85 50 -29 -238 476 130 68 31 194
7153 194 129 -198 -102 30 -52 -164 -207 30 -19 -68 175 186 78 -134 530 -13 85 -139 162 -188 -138 -153 -255
7176 -255 201 -191 -42 144 193 -149 -6 -177 -171 -73 169 -79 -248 -99 -36 287 -143 119 66 -47 147 176
7198 176 -191 225 -7 265 265 -353 2 -46 80 100 9 53 -10 47 165 95 -115 139 -56 51 -62 -202 287
7221 287 -60 -43 -85 -100 -27 -199 8 196 -230 -26 126 38 73 -175 274 -51 111 100 197 -235 22 87 -96
7244 -96 -119 -94 -52 56 -189 -101 96 -108 -110 -194 373 13 -195 135 97 65 117 202 373 141 -148 53 6 62 168
7269 168 -22 37 -52 8 120 -99 -26 -14 -152 -213 -74 329 235 -191 34 248 188 -55 -12 39 -253 -102 -102 91
7293 91 114 -275 133 122 91 -100 343 -38 107 -114 145 -10 -318 333 85 30 -62 -98 212 15 -326 -58
7315 -58 14 -350 -65 -75 76 -259 56 -52 253 16 198 184 -285 76 236 43 -162 68 167 -101 -39 41
7337 41 402 274 25 197 216 9 -5 319 293 -27 11 264 -359 -201 214 193 112 -42 86 76 -248 16 -238
7360 -238 -158 -18 83 309 -78 -219 110 18 -209 -116 -94 87 -84 -63 232 -116 -132 -218 -89 92 -418 13
7382 13 5 64 -238 77 107 113 -153 122 74 -5 65 29 -287 -302 229 -134 128 130 212 214 188 -274 137 -103 -154 -90 178
7409 178 167 -302 -39 278 -92 -157 121 230 80 138 3 165 -84 -324 234 -133 -158 143 234 -62 -142 18
7431 18 332 66 -24 20 28 17 -227 -42 140 -127 -149 -28 99 -164 -2 102 118 -87 87 30 -65 -107 244 218
7455 218 96 -199 343 132 -110 164 -12 150 -180 281 145 -107 -235 -134 33 245 214 223 204 -70 79
7476 79 -13 -85 -170 -118 62 -17 -193 -164 -4 -244 130 194 250 -93 198 54 57 -157 -110 68 -121 -85 -272 191
7500 191 -17 -87 179 390 -9 62 9 175 -255 -241 176 -369 -174 52 -156 -80 -13 -1 38 102 -131 71 -290
7523 -290 -107 -16 -33 -108 -289 197 -225 -94 -309 -13 149 -77 -219 44 135 -74 -133 73 92 -326 -137 137
7545 137 -65 -199 300 107 19 73 115 -71 -151 67 44 -57 79 -202 235 108 -131 122 88 152 -1 -301
7567 -301 -81 -8 -166 -145 -219 -96 -78 56 -75 -18 -10 229 -140 -193 -190 -98 183 -218 92 -59 -121 12 118 -157
7591 -157 156 100 8 -198 -109 -146 216 211 7 187 300 190 -38 -92 65 -102 -19 -2 146 145 102 67 26 -8 22
7616 22 -220 -119 159 -43 298 -59 196 341 -71 -84 -134 55 141 -72 -205 119 251 35 348 -112 -74 42
7638 42 -30 34 -310 -78 112 -137 -106 14 131 -41 -156 63 -173 385 107 60 261 -55 244 172 -332 -61
7660 -61 -57 243 172 312 101 -188 -27 -108 -137 7 4 -164 197 -104 -279 -8 131 74 -94 71 271 29 161
7683 161 87 212 -119 -92 63 -50 72 -340 9 187 -143 10 117 116 4 13 159 -216 -179 -27 -159 273
7705 273 -332 139 106 214 -23 -193 442 6 -77 -273 -210 -189 -66 157 -51 -165 150 66 165 246 169 2 -125
7728 -125 196 179 -144 -157 71 2 50 135 -242 90 38 -102 32 -7 -295 -232 17 149 35 57 -60 -245 -89
7751 -89 60 313 159 101 298 2 -43 -148 124 -102 -388 -80 -136 -85 -349 208 11 -152 -6 -80 -92 57
7773 57 -209 22 -166 -88 -133 160 -53 47 148 187 110 -171 177 90 -26 85 100 -196 -168 35 -6 -109 68
7796 68 -57 -5 -103 -311 -25 232 -264 37 34 -121 -94 -137 70 41 -151 41 299 -4 -4 -122 66 143 -221 143
7820 143 -51 252 45 -9 -39 13 129 43 239 36 -155 107 56 -305 -335 235 -217 -155 290 -62 88 -145
7842 -145 218 23 84 -98 -44 82 -385 -141 224 -90 -225 10 106 -25 76 -66 -18 -75 -56 323 20 -73
7864 -73 62 138 103 -137 -102 210 284 -48 -3 -46 -4 -188 -209 -52 91 79 101 141 -48 24 97 33 8 113 -90
7889 -90 -151 -4 -13 161 73 -52 25 -98 -76 110 110 -249 -205 -315 14 -51 -398 -132 -89 -124 188 252 113 -159 174
7914 174 137 -35 -94 38 -34 3 -105 -161 -64 -181 -12 -235 74 305 -74 -24 -106 -69 245 -24 -80 -304 145
7937 145 201 6 53 176 130 220 -9 96 -87 -262 -116 431 -97 -221 139 36 -34 -15 -42 -31 -126 142 66
7960 66 241 -72 -119 149 -17 -286 -84 174 -199 75 228 74 -114 168 -72 -400 -63 55 131 -162 -10
7981 -10 213 31 11 -21 100 91 -61 326 274 -119 186 -211 190 -18 -255 -33 84 -62 -23 356 83 125 125
8004 125 390 -198 -92 -106 -211 -32 87 9 247 -85 106 311 93 116 -107 164 -26 131 -7 118 47
8025 47 -118 -42 -154 266 -110 99 59 -33 -71 184 27 -271 276 -296 92 -317 -94 10 106 -88 302 286
8047 286 -140 205 170 5 -326 14 -101 116 -83 104 -170 15 -116 155 70 -53 -40 17 208 251 37 -88
8069 -88 59 -108 85 64 78 -37 -52 250 -189 72 48 199 -158 -28 233 -277 148 259 -314 -37 92 159
8091 159 229 -112 -103 -96 149 -21 -357 176 -112 -139 -87 118 3 19 -94 -118 -47 -366 53 89 49 -102 54 172
8115 172 287 -93 -208 -109 121 -204 49 301 6 -148 -9 -47 -434 -388 121 -104 209 122 -143 -142 -113 -65 -212
8138 -212 -65 -66 -99 124 -284 15 81 -52 140 -22 -61 -52 -107 -46 -11 127 0 -25 100 171 -125 46 -63 38
8162 38 105 104 -97 58 -26 -98 -120 -156 -35 -112 -130 -115 -19 233 -268 264 -65 -109 207 -89 37 -46 72 174 -85
8187 -85 -41 -25 -148 205
8191B05
$$ Imaginary data points
##PAGE= N=2
##DATA TABLE= (X++(I..I)), XYDATA
0 0 0 0 0 0 0 0 0 -8 8 -8 8 -8 16 -16 24 -24 32 -40 48 -56 70 -80 96 -112 128 -148 172 -196 222 -252 289
31 289 -325 368 -413 462 -518 575 -641 713 -789 874 -964 1064 -1175 1293 -1424 1566 -1720
48 -1720 1891 -2080 2289 -2519 2779 -3072 3403 -3780 4217 -4729 5333 -6066 6964 -8098
62 -8098 9569 -11543 14327 -18496 25304 -38072 69144 -266934 -283093 450008 -271558 158824
74 158824 -303642 92434 287864 -328302 171315 -29293 87349 -137393 67885 168984
84 168984 -202500 73898 -201650 265155 -117142 -135763 247898 -278892 227310 -126699
94 -126699 87151 158190 -303217 200610 -71979 101733 -90514 -90296 149126 -161217 74348
105 74348 -80257 201323 -117834 -156206 288719 -115878 123991 -210707 110283 136698
115 136698 -336718 238718 -64926 24652 -125590 -34879 293737 -228430 70110 -17661
125 -17661 93720 -33632 -134688 280048 -222122 24706 -43053 27531 132420 -286263
135 -286263 218312 -53761 -27638 78742 -64949 170013 -189458 42097 58221 -15828
145 -15828 -14415 -125473 153169 -107945 27199 5346 17433 86971 -210877 199417 1950
156 1950 -48071 5139 -89790 179835 -176233 10145 85537 -65339 -2365 -74799 191576
167 191576 -65418 -53764 48373 18655 54581 -170308 161457 -42951 -105360 57625 -48677
178 -48677 147924 -180233 38235 120811 -102514 78441 -63578 112043 -72802 -74689 118298
189 118298 -59148 21703 -116670 91664 18510 -87555 93546 -48186 88494 -97736
199 -97736 26948 116562 -120590 35545 -65307 77296 -29325 -90894 112546 -58657
209 -58657 19804 -45061 83780 44043 -115851 72909 -11810 47287 -87332 810 84746
220 84746 -127888 41184 -11043 64258 -36070 -74904 144227 -51509 11457 -22096 34901
231 34901 18264 -116044 88157 -21811 -3275 -56868 9540 97412 -101026 57237 -868
242 -868 25927 -7096 -58862 119096 -76906 -20547 -7387 12707 32117 -100904 76976 -5894
254 -5894 -5338 -3167 12187 81603 -100032 25889 21992 -1901 -18419 -61586 84724 -56145
266 -56145 -19299 30263 17472 19701 -76055 82593 14252 -29638 -4706 -6282 46206 -85112
278 -85112 16477 29834 -25277 -15201 -20147 83439 -31005 -17614 33868 7388 9692 -57088
290 -57088 55011 -5839 -53133 2711 4315 37464 -61968 15414 43503 -14371 1639 -3771
302 -3771 55797 -38168 -33263 36194 -3661 -14173 -48147 36958 11766 -40294 20771 22464 20139
315 20139 -40912 19375 45569 -28831 -20901 -5723 29237 -31204 -32683 37844 -1098 -18878
327 -18878 -8121 42131 20282 -38802 12459 26212 -3710 -34484 3770 22762 -33660 -23317
339 -23317 19303 24860 -21975 -15138 40630 14820 -19375 -676 25317 -1360 -42316 4965
351 4965 23414 -21565 -29318 9094 30537 -11948 -17004 34643 19310 -23544 -5763 27942 5199
364 5199 -41904 -8899 25096 -7247 -34252 9786 34234 -18200 -11616 28008 27650 -19142 -26534
377 -26534 37053 2257 -38250 -4702 12354 4117 -40869 14120 37417 -17553 -9858 15007
389 15007 35928 -20457 -19156 24501 -1024 -22880 -23706 30370 -3906 -34096 14393 14657 22733
402 22733 -32866 14451 42362 -33964 436 -2776 21005 -23194 -41971 40254 -2185 -19897
414 -19897 -10874 35823 14244 -36576 27052 18524 4936 -43642 9838 42701 -60116 -1136
426 -1136 6100 16379 -17995 -28409 67262 -13957 -19642 11907 28019 1340 -49289 29627 1949
439 1949 -16671 -27857 13753 33375 -54601 23644 13024 18761 -8056 -28472 65982 -35460
451 -35460 -11284 1648 546 13274 -62804 37324 11568 -14573 -7501 8573 52313 -51099
463 -51099 16613 16400 3457 -17809 -43422 74822 -49981 -24695 25213 226 23204 -61628
475 -61628 61695 22644 -47471 16564 11554 27640 -65604 9957 30686 -26943 -17325 -12438
487 -12438 66413 -49027 -7917 45813 -5809 14737 -50744 53608 1397 -51962 21972 -11599
499 -11599 21751 -46988 10135 35882 -21032 4994 -10141 56299 -34224 -12164 30440 -17797
511 -17797 11511 -60474 52251 307 -58615 42112 -7643 33681 -45941 14951 64258 -58618
523 -58618 4929 3277 34903 -46445 -36258 64538 -28256 -12141 -21811 56806 5712 -65202
535 -65202 64370 3104 -836 -32756 8292 48316 -71165 8496 10580 7367 -20887 -17655
547 -17655 59028 -26465 3394 -1042 26537 5210 -52482 48036 -19216 -8502 -15184 -5495
559 -5495 46325 -61711 20527 24917 907 -4958 -22470 64490 -30953 -23507 8593 20691 -8288
572 -8288 -67592 63418 -3035 -23217 -5321 13226 63112 -84400 31104 43541 -34653 -708
584 -708 -34045 65472 -45002 -37864 48401 -10290 2160 -34878 57041 1873 -34433 27126
596 27126 -1396 25438 -60985 25881 21194 -48090 17973 -24569 51505 -37227 -14635 58702
608 58702 -27802 20680 -37306 43167 6577 -60739 35227 -11971 17457 -50228 11543 50382
620 50382 -46752 12201 -1788 51665 -36890 -24515 62218 -33977 -282 -38683 48171 -4220
632 -4220 -67638 60541 -13126 15924 -34506 24476 51865 -72572 35381 -2523 14961 -30752
644 -30752 -26990 65598 -55835 5751 -3777 27167 3372 -48088 67005 -18139 5039 -21399
656 -21399 10911 35839 -74475 34718 -8936 7917 -14605 -27663 74751 -47905 8947
667 8947 9044 15450 11094 -59334 59229 -17576 -18685 -10540 4700 35270 -68300 35618 16863
680 16863 -4048 -7403 -10293 64854 -54169 -410 16928 -1121 -5323 -51186 62928 -23752
692 -23752 -20188 14615 6289 32745 -57879 42524 15679 -24557 1528 -16467 44935 -53225
704 -53225 -2509 25198 -12899 6280 -32954 58238 -15163 -19419 25324 -3632 22165 -54362
716 -54362 30390 11767 -38860 10189 -13376 39937 -38898 -2772 45006 -19363 6974 -19337
728 -19337 42016 -13161 -35618 28184 -8628 4266 -40133 27443 19870 -38108 20664 1815
740 1815 28727 -29085 -3705 42615 -31826 -1267 -13651 24998 -13961 -34026 37750 -7855
752 -7855 4113 -18740 26120 21183 -39555 23611 18 9053 -27610 -8542 36390 -38851 2757
765 2757 -1424 19632 -2644 -28690 47213 -9554 -3429 -6845 10316 15912 -45435 17903 2227
778 2227 -3776 -15056 -4387 39352 -30604 6455 11956 10330 -369 -29821 39211 -14990 -17359
791 -17359 84 3013 13032 -38075 22418 12573 -7104 -2467 1737 33677 -30884 263 13412
804 13412 -5580 -6659 -25627 33124 -14088 -15245 12464 5997 14383 -28568 26077 10778 -16080
817 -16080 641 -5686 21246 -31177 -4898 17023 -9385 -883 -12693 31687 -5398 -12329 16523
830 16523 3033 7429 -28647 16959 6731 -24653 1681 -2537 17684 -21759 -684 27227
842 27227 -7990 -1181 -3263 22806 -9294 -19268 14669 -2215 -5227 -20730 16491 7525 -20110
855 -20110 9834 7761 12410 -14771 2304 21053 -14386 -6120 -3410 9873 -9746 -17051 14770
868 14770 1646 -2862 -7524 16575 10322 -13939 4798 6156 4994 -19074 -4124 15739 -14716
881 -14716 -8905 2751 13239 -3693 -13410 21627 8140 -10544 -3686 13887 2455 -22197 1165
894 1165 9539 -6535 -15675 5779 17423 -11510 -4071 16597 6663 -6428 -6911 13400 356
907 356 -18466 493 5781 -3561 -10698 1070 13795 -2026 -6023 9666 10215 -3501 -9403 6848
921 6848 4937 -12300 -10631 7303 5699 -16379 -97 15868 2005 -8782 2351 20026 -6072
934 -6072 -17088 12446 5957 -15924 -11937 12388 4205 -17130 135 19300 2460 -16965 13792
947 13792 14227 -11043 -6427 2161 10664 -16957 -11197 15058 -3905 -6019 -2173 13424 5306 -9935
961 -9935 7532 6015 4013 -14897 749 9758 -13907 -3869 -5296 13480 -4296 -14845 23418
974 23418 1334 -3058 -4076 10331 11828 -27629 5998 9345 -8106 -15073 1809 21456 -18635
987 -18635 -3898 16282 10880 -11608 -8901 28454 -10076 -15271 2316 6865 -741 -26832 17154
1000 17154 8155 -11706 498 7486 16136 -15580 2580 8511 493 -9026 -11700 17955 -14493
1013 -14493 -4347 1192 3003 12597 -22950 20247 7851 -8600 2432 -4692 19725 -24521 -4873
1026 -4873 12809 -5817 -7322 -12852 30776 -10584 -11747 16739 6197 5976 -28867 24742 7856
1039 7856 -28620 5376 -510 13976 -27928 2521 26170 -14272 -634 250 23885 -14112 -10852
1052 -10852 17831 -6652 -1976 -20857 19354 -1136 -20796 16047 -3633 15371 -16178 6261
1064 6261 21201 -17832 3993 -6742 14485 -13941 -14776 16985 -6074 991 -16443 24121 6658
1077 6658 -22155 17768 901 11404 -24557 2301 24363 -29374 -280 -362 16138 -14552 -13684
1090 -13684 32449 -7688 -3722 -4661 21225 -504 -28310 20950 -3495 -3798 -17012 7241 19355
1103 19355 -29678 11825 7876 7003 -8230 -6900 27658 -15855 -5386 -1833 8852 -3663 -24155
1116 -24155 21030 -2863 -1326 -6765 6288 23388 -26081 9493 9125 -806 -7997 -14036 23708
1129 23708 -13997 -13100 6083 10753 -2572 -18053 24924 3583 -8315 -3875 9448 13757 -33222
1142 -33222 9338 11291 -11706 -7151 -4570 26563 -16690 -8325 20561 3989 -4486 -13374 22264
1155 22264 -2471 -18224 2320 4217 5388 -25300 11896 13371 -10893 2240 -1697 23107 -15436
1168 -15436 -7916 18853 -8214 -2943 -14860 14941 660 -21484 12162 5665 5212 -14509 10254
1181 10254 18346 -17377 689 1346 12528 -18452 -11831 22795 -11269 -6772 -3816 18346 2164
1194 2164 -20168 18974 6628 -3604 -14037 9101 12256 -25264 2089 3486 6989 -14134 -5976
1207 -5976 26934 -11750 -1447 2708 12270 -793 -20669 18043 -2216 -8061 -9439 6090 11997
1220 11997 -23389 10280 7573 3924 -6807 -4108 25654 -17644 -4263 3858 3956 -3345 -21772
1233 -21772 20936 -1753 -9836 780 8423 13217 -21121 10550 10650 -5189 -8521 -4296 19198
1246 19198 -20048 -6007 9057 2409 -1947 -13152 23725 -381 -10015 5388 5934 5417 -21743
1259 -21743 8875 6160 -11530 -4861 -639 17007 -16403 284 14807 -69 -1595 -9022 19485
1272 19485 -6101 -13533 5582 1294 1132 -18466 11433 8691 -10995 1914 3946 14783 -14342
1285 -14342 -1473 14330 -6643 -5851 -8169 13883 -7223 -13784 10637 3911 859 -10743 13333
1298 13333 9603 -13491 2177 4475 5055 -15806 -2671 12484 -9734 -5214 -179 13631 -4187
1311 -4187 -9120 14926 2763 -3492 -6742 8262 3681 -15801 1066 4254 472 -10657 1890
1324 1890 13910 -7219 -978 3797 9621 -4230 -10703 11902 -1533 -8697 -4815 5615 3420
1337 3420 -12845 4170 9361 683 -6487 3963 13449 -9400 -4515 4517 2816 -7844 -10260 12020
1351 12020 -884 -8957 2497 8740 3180 -10046 7210 8800 -5875 -5817 2226 6438 -11772 -4616
1365 -4616 7111 -93 -4508 -2704 12499 532 -6202 4899 5305 -387 -10144 3415 4328 -8510
1379 -8510 -4297 2051 6796 -6728 -1983 10424 1836 -2948 -2410 10115 -1542 -10633 2304 2908
1393 2908 -3184 -10238 5051 7605 -7722 -691 7673 6573 -7526 -944 10114 -3818 -7670 -1874
1407 -1874 7277 -5559 -10054 7720 3474 -3163 -2416 7662 6351 -7362 329 5959 -1095 -7854
1421 -7854 -1584 5087 -4125 -4597 467 6447 -684 -4416 7692 3944 -2036 -3147 3220 3690 -8647
1436 -8647 -4089 5139 -1012 -6619 188 8030 217 -5024 4682 9169 -4546 -6300 6769 1461
1450 1461 -7941 -4628 5664 1435 -9940 1925 9937 -2251 -4166 5563 6441 -3464 -6105 5227
1464 5227 2583 -9343 -2916 5053 -1224 -4425 -31 6139 2474 -4630 3378 6117 -2784 -3120 400
1479 400 1707 -2967 -7034 3027 3363 -4848 -1072 5561 4714 -3898 -660 8010 169 -8277 -176
1494 -176 6496 -5866 -8160 4235 4498 -4486 -5424 10968 4290 -8509 3320 6921 -139 -8695
1508 -8695 -90 7786 -8567 -6056 5229 2680 -3406 -2605 7893 3432 -4047 369 5558 -344
1522 -344 -6629 981 698 -1976 -4467 -1262 6809 -2771 -2707 6049 3654 -839 -3765 4398 3464 -7591
1538 -7591 -4480 5967 -854 -9383 2221 6103 293 -6133 4288 11202 -7855 -3362 7682 1171
1552 1171 -7007 -6029 8737 -2338 -9626 3430 6282 139 -7247 8297 5994 -5169 -1043 1734
1566 1734 5400 -10012 -2964 6757 -4751 -1400 -3378 7829 1898 -7194 7543 2905 223 -5301
1580 -5301 1285 5815 -8069 -3711 2157 3940 -7216 -2717 9716 -402 -2218 -458 9652 -632
1594 -632 -10457 6775 2270 -5082 -7899 5332 4591 -9942 902 6672 4723 -8698 2858 10810
1608 10810 -6496 -2902 -1544 7574 -6170 -10562 10881 -2762 -1864 -3792 6191 7552 -11024 5953
1622 5953 3639 1039 -6169 -2475 9079 -9536 -2667 391 4800 -1368 -8037 12939 -540 -2563
1636 -2563 57 3804 5472 -12955 3601 4046 -4603 -5996 511 9154 -8035 -1416 6105 5836 -4974
1651 -4974 -4986 12763 -3906 -5797 -1550 4755 807 -13812 7714 3801 -2988 -3169 3931 11465 -10296
1666 -10296 1051 5158 525 -5140 -7038 10953 -6415 -5237 2386 3249 2753 -10254 10694 3394
1680 3394 -4796 632 339 7251 -12294 -898 6919 -4991 -3539 -2482 10379 -3453 -5251 7744
1694 7744 3816 -1420 -7542 8585 1597 -9317 -962 2456 3804 -11239 1743 9117 -2964 -2481
1708 -2481 1108 10307 -5334 -5744 6533 612 -4237 -8096 7804 521 -8837 3497 4041 3674 -7592
1723 -7592 4453 8763 -6346 -1526 748 5890 -7849 -6331 8844 -3034 -3191 -2272 7984 2600
1737 2600 -9165 7013 4049 -1221 -6233 2008 6573 -9957 -2113 3009 3473 -5370 -3417 11406
1751 11406 -1272 -3344 833 6598 480 -10334 5302 2113 -4816 -5547 2330 6938 -9140 707
1765 707 6398 2447 -3962 -1906 10363 -4473 -5361 1602 3196 -2846 -9503 7752 1357 -4604 -247
1780 -247 4403 6852 -9103 2786 6003 -2609 -4294 -2736 7760 -6462 -5232 4752 2154 -722
1794 -722 -5818 9373 2648 -5363 1359 2715 3469 -10363 1517 5097 -5053 -3378 -889 8804
1808 8804 -5432 -3252 7802 1448 -1684 -4807 8314 -530 -8528 1422 2145 563 -9194 4331
1822 4331 6095 -5156 455 2060 7339 -5869 -2332 7282 -2686 -3700 -3839 5709 -1971 -6696 4139
1837 4139 2839 1175 -5334 5481 5335 -5685 74 989 4341 -7148 -3442 6617 -3068 -2998 -1318
1852 -1318 7519 0 -5643 6380 3101 -1548 -5406 4169 2670 -8144 -977 2443 2414 -6688 1045
1867 1045 8375 -3389 -1053 1690 5530 -2685 -5793 5980 -808 -4654 -2623 3058 1345 -5411
1881 -5411 1891 4185 1498 -3933 2420 5503 -4093 -1556 -671 2680 -3175 -5921 5376 120 -2948
1896 -2948 -332 4411 3037 -4501 1569 4646 -1029 -5582 1261 3720 -5395 -3004 2214 3651 -3699
1911 -3699 -2476 7833 321 -3607 1367 4121 -580 -6361 2188 2980 -4811 -3557 3106 2653 -3807
1926 -3807 181 4313 2200 -3042 -170 5200 -2722 -3577 56 891 -609 -4716 2312 3800 -2778
1941 -2778 18 3269 2870 -1851 -1805 3280 636 -4947 -1464 3412 -2035 -3606 1229 3535 -658 -3574
1957 -3574 4595 4368 -4099 -976 3479 169 -5105 -1773 3614 -1388 -5094 2142 4733 -2197 -1307
1972 -1307 3635 3223 -1997 -2602 3934 46 -4997 -282 1241 -417 -3119 20 4287 -537 -1250 2782
1988 2782 2578 -1404 -1713 1070 642 -2823 -3227 2051 479 -3294 474 2929 1323 -2205 325 4928
2004 4928 -1539 -3940 2251 1537 -3576 -3417 2116 2168 -4283 -633 5913 399 -2531 1261 4268 -1152
2020 -1152 -4332 1731 1793 -3944 -2970 2193 1249 -2967 106 4148 1273 -1889 712 3374 -1409 -2562
2036 -2562 -45 867 -1280 -3405 1312 2210 -2244 -121 3023 2197 -792 -1578 3360 715 -4586 -113
2052 -113 2077 -1618 -3381 484 4114 -1522 -2038 4022 2771 -2230 -1531 4182 260 -4697 -846 2623
2068 2623 -841 -5090 1928 3993 -2323 -1056 2702 3204 -2058 -1957 3765 -327 -3640 -1186 1501
2083 1501 -158 -3831 724 3219 -629 -1176 1834 3109 -720 -2367 2222 1008 -3420 -1941 2026
2098 2026 242 -3028 -397 4152 476 -2440 1912 3935 -1405 -3293 2288 1424 -3542 -2982 2538
2113 2538 1572 -4532 -66 4837 -119 -2186 1070 4253 -1201 -4072 2196 1468 -3380 -2656 2144 1551
2129 1551 -3148 -824 4266 826 -2090 769 3612 -444 -3446 841 1494 -2509 -3345 1470 1848 -2775
2145 -2775 -982 3539 1699 -2333 -77 4309 -532 -3759 572 1689 -1653 -4226 1663 2960 -2845
2160 -2845 -1195 3603 2568 -2723 -696 4299 23 -4163 -508 3156 -2210 -4090 1807 2655 -1515
2175 -1515 -2151 3947 2452 -2492 -442 3127 749 -4451 -438 2666 -1717 -3354 943 3602 -2330
2190 -2330 -1525 3254 2271 -1539 -2278 4019 109 -4249 -250 1667 -11 -4686 740 4017 -1267 -1933
2206 -1933 2538 3886 -2641 -2060 3530 610 -3397 -2837 3444 -549 -4439 1067 3307 127 -2932
2221 -2932 2868 4244 -2273 -1972 2306 1982 -4590 -1903 2894 -740 -3112 -205 4398 -325 -2853
2236 -2853 2895 3319 -1425 -2866 2650 1547 -4252 -1438 1933 1028 -3948 -13 4340 -245 -2250
2251 -2250 1320 4027 -1249 -3552 2425 1689 -2795 -3499 2785 1669 -3920 -531 3867 1208 -3137
2266 -3137 848 4344 -1456 -3329 1245 2608 -3424 -3400 3353 1123 -2845 -681 4257 1566 -3587
2281 -3587 1423 3782 -1548 -3782 1078 2200 -2885 -3180 2127 2109 -3114 -924 4136 1029 -2519 499
2297 499 3259 -73 -4186 383 2563 -2741 -2735 1698 2507 -1837 -1719 3825 2381 -2598 -53 3614
2313 3614 -304 -3969 -109 2452 -1187 -4197 2057 3088 -2441 -973 3197 2529 -2697 -854 4083
2328 4083 -628 -3912 13 2442 -1801 -3760 2128 2646 -1440 -1805 3485 2564 -3221 -88 2350 235
2344 235 -3043 -1359 2905 -1470 -3122 1275 2505 -767 -1782 2852 2096 -1335 -2189 2417 1345 -4148
2360 -4148 -574 1786 264 -3161 -199 4538 -1135 -2169 2470 2700 -1485 -2729 2875 906 -3729
2375 -3729 -1507 3173 -285 -3741 1854 2839 -24 -1910 1802 3878 -3602 -1314 2218 -187 -2142
2390 -2142 -2295 2323 127 -2826 828 3048 -17 -1681 1743 1899 -467 -2590 733 2335 -3522
2405 -3522 -1515 1905 496 -1257 -1286 3715 1142 -2984 1423 3107 -1111 -3060 1093 1574 -2507 -2604
2421 -2604 1983 2047 -3491 320 3411 244 -1827 129 3434 -1767 -3205 1827 865 -2161 -1931 1941
2437 1941 1130 -1903 4 3056 1054 -2435 1440 1548 -861 -1703 -754 1970 -1887 -2236 1872 1097
2453 1097 -537 -830 1708 2416 -1911 -407 2701 -269 -2821 -183 1536 -517 -2638 836 2957
2468 2957 -1707 -1465 2995 1320 -1883 -972 2128 226 -3349 -280 2455 -1473 -2571 1733 1843 -863
2484 -863 -864 2214 2262 -2128 -399 2090 -605 -2135 -1024 1569 -521 -2284 1049 1535 -461 -687 1273
2501 1273 1814 -1082 -982 1258 539 -2052 -1172 1084 -94 -2160 527 2311 481 -1700 1573 2589
2517 2589 -1598 -1520 1094 662 -2452 -1880 2038 152 -2269 418 2206 284 -1230 1282 2212 -1408
2533 -1408 -1539 1042 689 -2183 -1677 1489 349 -1731 273 1989 634 -1210 848 1711 -964 -1634
2549 -1634 266 747 -1396 -1669 935 791 -1111 -176 1624 1223 -885 49 1872 -628 -1844 -294
2565 -294 883 -1111 -2129 1022 1442 -1378 -144 1813 926 -1537 -30 2213 -423 -2106 -397 1177
2581 1177 -1110 -2295 1289 1333 -882 -628 1494 1706 -1356 -246 1569 -221 -1797 -624 563 -855
2597 -855 -1437 757 1637 -387 -959 1579 1542 -1143 -929 1070 -95 -1834 -686 845 -186 -1666 289
2614 289 1760 -338 -583 1367 1811 -765 -1426 1313 205 -2247 -1024 1317 167 -2050 732 2042
2630 2042 -44 -876 1037 2156 -1177 -1080 830 409 -1932 -1244 1593 10 -1506 183 1863 687
2646 687 -918 840 1625 -643 -1213 503 738 -1587 -1307 647 691 -1419 -105 2185 362 -969 470
2663 470 1896 -418 -2087 704 876 -1474 -1557 837 1132 -1562 -274 1849 1209 -1317 321 2277
2679 2277 -616 -1828 239 1151 -1255 -2119 901 1129 -1248 -651 1795 1158 -1326 -246 1701 -16
2695 -16 -2004 -114 997 -1369 -1450 498 1464 -644 -685 2110 1431 -787 -489 1363 -46 -1794 -312
2712 -312 1086 -673 -1792 705 1778 -1149 -545 1627 1748 -1231 -893 1723 151 -2359 -791 992
2728 992 -395 -1737 391 1910 -311 -1385 1539 1667 -931 -1178 1423 672 -2472 -728 1029 -259
2744 -259 -1663 83 2078 -377 -1030 1435 1419 -840 -1496 1068 631 -2007 -1156 1165 177 -1719 149
2761 149 2030 80 -1171 955 2041 -838 -1667 1087 578 -1894 -1415 1773 369 -1472 -151 2146
2777 2146 663 -1350 1100 1880 -753 -1600 637 972 -1749 -1142 1382 821 -1530 -353 2080 267
2793 267 -1154 645 1791 -769 -1941 588 853 -1551 -1533 1263 900 -1519 -323 2244 930 -1366
2809 -1366 151 1922 -29 -1834 622 1024 -1585 -1902 825 1356 -1349 -755 2085 882 -1257 -25
2825 -25 1960 -148 -2246 203 1250 -1057 -1905 1284 1489 -1404 -583 2022 938 -1533 -234 1802
2841 1802 -446 -1921 46 1546 -983 -1863 1500 1170 -723 -680 1757 1167 -1349 48 1549 -43
2857 -43 -1833 -321 1456 -933 -1251 666 1701 -346 -1414 1801 949 -1140 -888 1651 611 -2471
2873 -2471 -378 1322 10 -1784 307 2312 -873 -959 1531 1655 -1155 -1252 1741 -233 -1988 -745
2889 -745 1572 45 -2028 1049 1538 -78 -983 1371 1412 -1675 -458 836 211 -2019 -1163 1702 -436
2906 -436 -1179 -22 1563 224 -905 1373 1019 -714 -1166 560 863 -1989 -755 1193 368 -1202
2922 -1202 -416 2416 -10 -1388 576 1799 -712 -2185 1434 319 -1749 -1154 1334 866 -2120 695
2938 695 2053 164 -866 685 1743 -1131 -1533 646 743 -1787 -1322 1406 17 -969 172 1565
2954 1565 672 -1426 869 1198 -764 -1061 -205 859 -1261 -1215 951 919 -824 -260 1719 722 -895
2971 -895 -170 1521 -81 -2220 320 761 -935 -1139 237 1677 -1116 -531 1910 262 -1109 -339
2987 -339 1587 -272 -1901 317 1010 -1050 -1582 1261 1003 -793 -361 1565 1076 -1424 -308 1174
3003 1174 -633 -1306 -261 721 -429 -1319 726 1278 -514 -470 1471 935 -1130 -592 916 221 -1617
3020 -1617 -821 1185 -626 -963 231 1503 -36 -921 1315 1094 -810 -763 798 74 -1723 -443 1063
3037 1063 -21 -1418 395 1910 -416 -639 1228 1293 -745 -1114 1147 -126 -1378 -612 606 328
3053 328 -1195 397 1340 -173 -221 527 1237 -956 -732 297 51 -1089 -868 1228 264 -883 497
3070 497 1251 270 -871 633 798 -632 -864 344 315 -1377 -621 1005 551 -865 274 1571 43
3087 43 -894 420 997 -327 -1607 695 481 -1364 -988 717 854 -706 128 1384 671 -710 40
3104 40 940 -494 -1359 168 354 -485 -1136 703 879 -751 -111 953 498 -709 -106 918 -104 -914
3122 -914 -243 503 -689 -1294 848 727 -408 65 854 557 -1058 -72 860 -64 -1251 -217 721 -186
3140 -186 -1120 422 942 -190 -392 879 982 -746 -443 684 68 -1315 -360 760 -177 -730 67 958
3158 958 -142 -228 811 660 -515 -902 779 260 -1294 -459 566 101 -744 469 779 90 -186 213
3176 213 1084 -941 -703 344 -80 -787 -917 492 593 -1239 305 1151 218 -684 342 1149 -824 -772
3194 -772 57 521 -881 -897 749 483 -688 187 1035 500 -754 407 913 -678 -834 -132 448 -793
3212 -793 -837 250 738 -540 111 804 580 -519 -269 863 -192 -1341 12 231 -506 -1019 308 881
3230 881 -688 -205 1232 551 -741 -210 945 -258 -1134 -293 593 -420 -1173 504 768 -605 67
3247 67 1070 1166 -689 -483 1133 -193 -1118 -317 641 -262 -1172 393 791 -126 -413 809 752 -429 -519
3266 -519 671 53 -1172 -620 687 -354 -822 151 1064 150 -844 828 1084 -559 -807 678 298 -1285
3284 -1285 -660 619 288 -1089 27 1542 -100 -851 561 870 -438 -981 543 293 -1229 -567 848
3301 848 419 -1062 318 1289 -7 -480 143 1474 -536 -937 709 243 -770 -942 732 291 -772
3318 -772 429 1072 569 -472 225 1192 -352 -1005 -12 535 -815 -860 691 785 -378 -722 1470 280
3336 280 -894 571 966 96 -1262 -17 953 -841 -1210 816 778 -990 223 1234 523 -567 -420
3353 -420 1373 -501 -1240 12 366 -268 -1292 633 1008 -642 84 1065 549 -880 16 693 -177 -1277
3371 -1277 -337 931 -343 -1005 394 786 157 -559 1171 1059 -1149 -109 524 171 -1542 -356 887
3388 887 -538 -1384 393 1321 -165 -513 1056 870 -743 -644 801 51 -1596 7 1042 -527 -647
3405 -647 430 1299 -200 -614 1140 807 -1109 -614 700 -169 -1308 -599 649 -55 -1105 464 1214
3422 1214 88 -300 541 1120 -766 -831 681 312 -1159 -649 660 454 -1310 201 1453 -56 -739
3439 -739 673 1025 -839 -967 322 632 -1399 -689 1101 305 -715 153 1375 100 -927 679 1155
3456 1155 -912 -720 576 149 -1180 -633 674 415 -802 36 1108 20 -668 208 743 -42 -1346
3473 -1346 164 518 -1089 -643 611 738 -806 -137 1390 413 -710 -220 1215 -218 -846 2 321
3490 321 -708 -1361 958 435 -737 -6 1189 639 -1160 -163 1245 -326 -1171 60 822 -542 -759
3507 -759 935 684 -824 -504 1535 233 -907 211 513 35 -1300 -426 1024 -888 -595 668 908
3524 908 -736 -619 1149 355 -778 -516 970 -55 -1240 41 718 -27 -674 350 975 -294 -321
3541 -321 789 815 -732 -524 864 -174 -1029 -307 1097 -150 -1083 504 649 -198 -537 1076 723 -717
3559 -717 -299 625 427 -1237 -392 788 -217 -568 183 1207 -49 -552 714 350 -707 -753 488 -133
3577 -133 -1125 -97 512 -137 -812 62 1224 -125 -810 594 456 -561 -895 426 212 -1142 -328 666
3595 666 212 -818 368 1267 148 -458 246 778 -866 -879 506 462 -820 -338 418 256 -441 30 841
3614 841 376 -477 342 447 -69 -977 198 660 -1093 -355 769 326 -464 -187 1144 446 -641 173
3632 173 442 14 -1176 79 499 -295 -156 573 365 -283 -495 1006 411 -380 270 522 -181 -995 -233
3651 -233 499 -477 -740 527 892 -249 -187 886 448 -416 -206 726 -328 -921 -144 331 -363 -622 141
3670 141 645 -186 -134 648 128 -588 151 314 -272 -802 -185 421 -230 -202 59 549 -57 -334 926 504
3690 504 -509 -397 174 60 -982 -352 571 -16 -152 332 790 158 -595 325 499 46 -315 114 310
3709 310 -740 -351 210 486 -374 5 848 8 -364 142 290 -307 -524 109 169 -657 -557 324 286 -330
3729 -330 294 741 164 -485 57 489 -358 -421 -8 315 -352 -598 435 532 -69 -150 962 659 -399 -16
3749 -16 358 -448 -604 -480 727 -275 -334 450 256 -460 -322 685 386 -420 -16 470 -167 -816 -244 374
3769 374 -237 -663 266 574 -234 4 475 401 -548 -260 258 43 -870 -329 107 -318 -604 274 519 -122
3789 -122 -202 468 671 -371 -300 400 -27 -720 -418 640 -55 -825 162 596 -62 -418 537 678 -363 -413
3809 -413 264 226 -710 -253 155 97 -645 551 662 50 -541 144 295 -549 -388 193 169 -1013 -806 446
3829 446 61 -471 -119 997 105 -460 454 477 -121 -920 79 319 -586 -382 543 312 -532 29 841 86
3849 86 -155 102 703 -301 -845 341 -4 -824 -643 337 503 -629 -113 537 176 -372 242 475 -236
3868 -236 -343 -192 241 -681 -852 408 324 -154 59 613 368 -510 118 354 -166 -865 31 366 -347 -653
3888 -653 290 545 -154 -138 632 420 -175 -411 589 58 -1148 163 480 -158 -576 496 718 -479 73
3907 73 508 419 -445 -403 553 -273 -859 -22 544 50 -1103 433 100 -73 -270 261 782 -506 -187 211
3927 211 -21 -800 -112 685 -136 -522 137 684 -140 -609 774 188 -375 -88 55 262 -746 -259 408
3946 408 128 -635 -28 1143 -74 -256 81 298 -279 -829 400 203 -971 -427 167 387 -578 39 976
3965 976 70 -386 123 901 -949 -702 225 261 -573 -628 636 168 -597 170 502 246 -551 195 840 -483
3985 -483 -494 5 554 -672 -456 499 432 -510 79 716 262 -384 178 431 -381 -969 138 500 -793 -524
4005 -524 49 1004 -623 -141 917 174 -422 -177 560 16 -735 187 417 -842 -837 370 552 -459 222
4024 222 638 129 -529 -444 886 -146 -955 38 179 -285 -727 365 518 -101 -370 766 563 -576 136
4043 136 459 -117 -819 -88 339 -347 -521 383 509 -307 -220 499 65 -412 -399 382 -149 -990 3 518 -195
4064 -195 -545 78 857 -386 -182 455 472 -430 -400 653 -104 -858 -36 234 22 -733 245 847 -498 -224
4084 -224 127 711 -660 -302 275 168 -893 -68 471 96 -383 362 655 92 -364 594 571 -661 -536
4103 -536 109 179 -513 -192 766 128 -443 31 832 28 -425 284 378 -271 -786 206 536 -639 -163 459
4123 459 79 -141 -37 492 72 -242 274 545 -526 -405 371 -113 -465 -162 201 240 -502 229 780 26
4143 26 -15 -62 442 -314 -379 9 99 -421 -293 540 -15 -238 204 633 328 -479 -25 493 -518 -789 -40
4164 -40 224 -444 -425 416 410 -136 -50 672 32 -566 -16 478 -88 -606 -24 253 -218 -439 505 373 -412 58
4186 58 557 222 -268 -161 156 -135 -421 202 182 -332 -364 515 480 -169 45 268 196 -387 -40 60 56 -513
4208 -513 -150 459 -362 -384 394 480 -140 -196 658 496 -388 -77 36 -45 -529 -122 689 83 -315 291 457
4229 457 141 -387 394 -81 -156 -259 121 38 -336 -139 322 -46 -209 244 625 23 -314 224 355 -459 -96
4250 -96 97 -72 -375 -170 285 141 -201 88 402 177 -64 48 405 -206 -245 51 116 -410 -212 520 170
4271 170 -108 196 714 279 -323 368 466 -216 -261 -42 151 -560 -108 373 364 79 262 101 185 -202 -10 287
4293 287 -8 -483 -64 78 -16 -259 78 341 -152 -196 270 215 -203 -231 181 -76 -685 -192 338 -124 -289
4314 -289 119 442 -4 -228 536 560 -197 -310 224 -458 -460 -41 98 113 -389 164 338 -315 -21 435 297
4335 297 -169 -154 -55 44 -475 8 130 -100 -260 -43 300 292 -90 -18 293 -244 -275 -105 74 -308 -360 218 249
4358 249 -486 95 536 121 -231 324 169 -467 -428 133 125 -846 5 147 118 -300 19 564 231 -433 111
4379 111 469 -99 -461 -67 183 -221 -323 101 269 -91 77 419 57 -158 149 283 -27 -282 -40 136
4399 136 -153 -308 289 307 -205 51 425 76 -99 16 443 -193 -384 -56 289 -314 -432 362 190 81
4419 81 -136 539 475 -599 -290 338 -61 -570 -183 304 111 -350 -100 249 -306 -89 450 380 -278 -235 45
4440 45 29 -346 -213 326 -73 -93 112 470 -54 -118 490 643 -378 -594 388 -25 -380 -76 414 -12 -259
4461 -259 369 605 -127 -24 276 358 -387 -393 329 -60 -344 -122 458 -106 -115 147 184 -60 -394 514 58 -468
4483 -468 50 283 306 -400 -291 230 366 -329 -71 705 71 -203 226 321 -474 -618 237 257 -307 -225 238
4504 238 158 -282 55 564 303 -478 267 594 -453 -598 208 276 -441 -95 503 293 -393 155 500 130
4524 130 -660 253 605 -389 -367 103 288 -466 -464 530 220 -166 68 612 176 -470 -122 162 -291 -345 -127
4545 -127 562 -103 -354 456 303 -144 108 379 -156 -304 -256 393 12 -548 107 352 -330 -492 453 558
4565 558 -359 204 482 372 -345 -33 356 -230 -804 -158 501 -148 -555 525 516 -203 215 347 479 -455
4585 -455 -209 412 116 -662 -131 420 -273 -133 400 419 -31 -309 637 130 -232 -128 309 -24 -641 -372
4605 -372 727 143 -451 276 483 -111 -214 355 237 -307 -419 231 116 -807 -374 345 188 -251 347 647
4625 647 102 -320 443 457 -410 -334 554 50 -558 -311 553 -33 -198 349 460 169 -243 108 462 -432 -662
4646 -662 124 -38 -358 -398 424 58 -117 134 365 73 -322 327 264 -405 -530 290 241 -411 -194 359 189
4667 189 -215 59 764 -196 -281 53 248 -365 -583 90 138 -184 -121 371 263 -345 304 591 57 -41 -203
4688 -203 316 -459 -469 192 34 -75 81 577 173 -341 -201 364 293 -369 -26 -39 29 -277 -324 59 -337 -128
4710 -128 269 283 -145 251 252 80 -433 -68 161 -13 -436 69 327 -216 -66 110 427 -327 192 541 340
4731 340 -308 -219 86 104 -302 55 406 -35 -300 480 229 97 49 172 79 -522 -290 47 -247 -180 158 313
4753 313 -173 -216 161 503 202 -101 263 312 -362 -329 186 -232 -576 -430 229 -186 -52 449 467 -109 12
4774 12 383 263 -354 -326 -24 123 -299 -61 113 -13 -5 344 638 -270 -385 155 103 -107 -452 358 -31 -299
4796 -299 196 268 -383 67 -59 436 208 -371 81 139 -44 -194 127 116 -255 30 319 190 -59 197 -8
4817 -8 86 -307 14 284 -100 -368 -12 9 -423 -272 312 96 -89 82 247 68 -305 103 242 28 -325
4838 -325 -114 48 -249 -106 278 425 -43 -171 364 311 -66 -3 -9 99 -494 -177 202 4 -153 260 290 84
4860 84 67 512 64 -423 -110 9 -208 -306 29 94 -127 -235 175 366 44 8 170 261 -312 -180 181 36
4882 36 -379 -204 270 -85 6 330 384 250 -158 333 168 -327 -218 -40 70 -237 97 125 -32 -93 123 228
4904 228 112 -136 332 217 14 -489 -123 -86 -319 -142 217 379 -26 -96 468 106 -324 -236 254 -245 -574
4925 -574 -185 345 -102 -599 23 215 271 -142 407 172 -179 -43 136 -126 -359 -14 204 -126 -301 105
4945 105 316 -207 -202 152 101 -178 -39 259 -39 -237 -283 108 84 -56 139 511 83 -146 125 267 -57 -96
4967 -96 -119 25 -725 -104 153 -301 -188 134 352 -30 -341 324 484 -298 -38 104 -14 -234 -99 118 -166
4988 -166 -5 276 535 49 23 437 289 -225 -155 -23 4 -538 -327 127 207 -296 71 307 203 101 292
5009 292 465 -180 -346 246 76 -662 -247 241 115 -127 187 294 87 -58 362 353 -96 -248 36 309 -247
5030 -247 -132 486 213 -64 106 386 110 -274 174 335 -130 -492 58 233 -575 -255 379 423 97 -214
5050 -214 406 -212 -130 6 195 -201 -621 -153 245 -78 -333 261 424 -66 86 359 105 -253 -31 197
5070 197 -281 -252 -204 102 -335 -137 424 410 -139 114 361 115 -224 39 20 -30 -150 -181 344 -284 -355 351
5092 351 297 -182 -246 455 207 -341 167 -2 -99 -149 215 106 -2 -262 328 389 -95 234 113 437 -258 -293
5114 -293 194 -71 -263 -2 160 171 -1 178 178 -81 -100 314 311 -103 -7 369 9 -364 -173 186 95 -417 200
5137 200 748 30 -120 392 112 -480 -461 173 -46 -291 -285 373 261 -178 194 389 95 -188 54 -17 -475
5158 -475 -97 362 40 -392 72 88 -87 -108 130 441 -76 -4 -55 216 -343 -253 187 -83 -355 -161 376 247
5180 247 -187 51 619 153 -482 -29 87 -370 -510 78 192 -167 -143 290 184 -303 229 269 -40 -168 556
5201 556 160 -284 -414 -6 378 -113 -338 358 117 -222 4 208 -140 -474 18 152 -332 -503 146 377
5221 377 -87 -253 353 229 -61 56 274 262 -303 -23 109 -410 -157 -153 469 -4 -357 312 152 -278 -38
5242 -38 249 -191 -420 104 147 -102 -242 -353 227 -20 -197 121 498 -74 33 369 51 -475 59 218 -161
5263 -161 -329 116 259 -83 -317 60 141 32 -295 190 122 -295 -108 60 -183 -540 -5 172 -192 -13 432
5284 432 296 -46 -17 489 65 -223 -201 -77 67 -413 -207 376 76 -73 88 329 -159 -131 85 197 -552
5305 -552 -169 179 -347 -279 49 88 161 -39 199 335 -180 -175 54 -195 -280 -204 45 -67 -260 -280 27 106 130
5328 130 177 216 -167 12 149 248 -95 -329 -2 1 -60 -116 279 424 4 183 3 -58 -506 60 -10 -216 -363
5351 -363 64 40 -167 -147 120 255 -81 331 253 -190 -47 108 -2 -187 -378 -54 -11 35 -120 113 153 28
5373 28 8 285 -228 -189 -288 222 -234 -235 -152 67 -507 -134 185 167 120 49 2 34 28 -440 17 -343 -457 -213 223
5398 223 62 -203 516 288 34 -129 287 71 108 -370 -139 -64 -245 -11 372 51 122 200 245 -153 119 172
5420 172 67 -160 -306 67 -181 -184 52 175 155 -22 189 329 133 -226 224 62 -143 -127 -161 26 44 -19
5442 -19 -7 247 70 217 213 194 -182 73 288 -4 -85 -156 185 -84 7 113 329 -71 37 578 210 145 118
5465 118 103 61 -311 -82 191 17 -149 255 171 187 79 124 -189 -419 -111 162 -342 -117 -127 67 -51 -74
5487 -74 344 170 163 99 133 194 -364 37 -127 -130 -233 -224 172 -207 -354 160 277 45 35 -31 -7 -200 -274 63 287
5512 287 -272 -203 -44 -227 -593 -172 99 137 -186 212 10 -101 -114 -158 105 -318 -423 185 -151 -43 -115 461
5534 461 96 -97 -94 183 -275 -392 268 110 -219 -7 267 116 -140 18 333 118 -145 216 79 -26 -309
5555 -309 62 360 -154 -238 22 278 -58 73 444 113 -216 -47 347 -254 -455 -117 -8 -184 -92 66 204
5576 204 -295 273 339 130 -308 217 -56 -318 -443 -101 75 -80 -123 20 189 -162 -204 51 143 -182 -235 198
5598 198 39 -366 199 310 -380 -92 163 307 -14 -115 323 207 -75 47 207 -107 -303 -185 462 152
5618 152 -41 264 275 36 37 178 66 -359 -147 204 156 -119 -141 243 -299 -69 113 236 131 48 198 151
5640 151 -193 -204 222 30 -396 -103 100 -150 -184 -118 20 94 -54 -20 257 -409 -157 158 -245 -305 -116 239
5662 239 180 -223 160 210 51 127 90 31 -192 -299 -3 138 -58 -249 283 103 -207 265 121 9 -226 185
5684 185 -33 -117 -245 216 -40 -437 -80 354 -6 -89 155 422 148 -318 -49 109 -322 -286 -12 -12 -302 -59
5706 -59 326 450 -115 58 513 61 -219 89 155 -121 -195 113 196 -331 -151 132 171 -166 200 459 224 54
5728 54 -122 41 -42 -390 -195 19 -633 -218 -118 126 -300 68 387 62 -217 102 41 -143 -230 5 29 -166
5750 -166 -135 371 313 -105 12 167 170 62 83 -14 -230 -239 92 86 -246 -175 61 119 105 86 186 35 -266 -57 106
5775 106 -238 -420 -171 99 125 -282 281 27 58 -29 7 17 -92 -239 319 -399 -317 -184 55 55 -101 215 308
5798 308 56 -178 370 54 -93 -50 120 194 -13 -170 194 11 -498 344 457 -359 -170 210 244 -138 -151
5819 -151 -55 -108 -308 -33 -40 -37 -116 65 112 -44 197 101 -25 -374 -197 136 -74 -243 -102 32 81 197 25
5842 25 251 170 -423 232 -90 -119 -124 269 55 -104 -64 277 104 -179 76 368 -295 -35 51 -124 -180 -542 -169
5865 -169 23 -455 -107 112 306 153 94 261 56 -90 -73 1 -143 -216 301 319 -248 -9 71 388 219 -70
5887 -70 262 280 -146 -98 -139 -145 -397 102 3 41 86 105 164 92 -51 202 -160 96 -31 25 -55 -264 -4 269 -38
5912 -38 -96 -103 21 -119 -77 186 135 -230 -458 -5 -503 -195 59 186 39 145 247 18 145 -69 218 18
5934 18 -58 49 -118 -185 -50 -56 184 173 -146 65 326 -41 8 9 148 -364 -9 -191 -213 -32 -177 17 5 -220
5958 -220 124 193 110 103 114 -14 -1 -260 -126 66 -202 -65 198 157 293 267 106 -151 -35 -61 114 -28 -267
5981 -267 137 64 -197 -248 -103 -10 -108 -55 394 9 -372 -60 79 157 45 62 87 -148 -185 125 -39 95 -100
6004 -100 180 -22 -148 -135 4 -183 -350 -7 6 -207 -250 281 388 -54 -145 134 -93 -176 -100 15 -62 58
6026 58 64 193 39 -270 -148 128 112 -22 295 172 -195 -41 -11 -166 -120 -190 237 219 -94 14 196 142 66
6049 66 362 209 -19 120 -53 -25 29 47 92 -29 -157 63 224 90 30 126 12 -98 -122 93 135 -377 -313
6072 -313 97 -149 -87 127 226 334 -70 18 62 -1 -463 -162 131 -154 -220 -44 186 -102 46 42 -161 117 82
6095 82 141 -162 -126 21 37 -147 61 194 -28 207 -32 304 68 -76 28 264 -128 -196 -104 -40 -111 -313 260
6118 260 233 105 -108 205 -215 -74 -3 60 -34 -446 -19 117 38 -100 136 125 -258 -81 85 -45 204 -157
6140 -157 153 -175 -510 84 190 -257 -15 231 176 -103 41 -125 112 91 -137 37 79 -68 -164 128 58 -239
6162 -239 15 477 -196 -284 144 120 8 -240 -218 -131 -705 -303 268 -44 -183 73 360 -111 -170 -23 215 -194
6184 -194 -235 -91 -80 -311 -55 33 266 89 80 426 175 -211 200 199 -196 -289 81 155 -160 -138 8 65 -289 205
6208 205 269 296 -166 84 162 -182 -163 -61 -185 -123 91 285 -265 -63 -49 135 -151 -59 41 133 -172 -514 -180
6231 -180 30 -336 -48 263 142 77 -207 227 132 -374 90 180 -376 -249 172 249 34 -116 -102 177 -94 43
6253 43 331 156 -85 -148 390 -117 -163 166 98 -155 -22 59 96 -71 -45 350 283 -3 -179 156 -103 -263 129
6276 129 21 -48 265 265 157 -160 -134 452 104 -103 122 73 -10 -379 -92 1 -140 -151 194 148 -190 174 73
6299 73 -85 -297 169 155 138 -488 -153 259 -33 -90 297 408 -10 47 179 217 -263 -281 144 -247 -486 -175
6321 -175 -19 -12 80 -32 197 -80 -131 206 -31 -199 -172 171 23 -177 -118 19 182 -150 -130 -100 -328 -98 243
6344 243 33 -25 -285 286 -89 -134 -32 369 16 -112 373 287 68 -130 -187 49 -23 -19 61 -27 -112 -249 361
6367 361 111 -11 22 83 -137 95 28 80 -257 -334 121 202 13 203 -149 379 67 -88 104 -70 -102 108
6389 108 392 -193 -240 -344 -93 -250 -385 139 174 -121 -246 266 -76 132 101 131 -47 -354 -65 -5 -207 -201
6411 -201 43 297 275 127 -28 127 -407 272 101 -225 -244 132 26 -60 -99 180 83 -101 -78 160 44 -110
6433 -110 -81 -112 9 -210 43 128 -325 -123 -35 -10 68 106 221 -131 -289 -270 183 -198 46 -137 -37 15 -10
6456 -10 263 39 0 -75 270 96 29 -176 -78 -45 -177 -169 127 125 -85 216 -29 367 -287 313 117 -70 -200
6479 -200 -31 -221 -85 -190 -5 99 -43 125 72 -116 139 148 92 37 -90 -63 219 44 -176 120 86 172 164
6502 164 42 298 55 122 -51 -87 63 52 119 39 -62 -78 271 -14 -33 88 216 199 130 -156 -160 -310 241 -53
6526 -53 9 -17 105 17 198 266 186 -140 -28 -281 -294 -54 67 263 12 183 -238 -34 14 29 222 -185 278
6549 278 -14 -236 -78 -216 139 -60 284 -17 58 16 217 68 -89 292 450 -111 148 100 -147 -290 4
6570 4 47 323 179 -30 253 -12 -357 76 115 68 -2 19 125 -235 -20 216 80 -54 -188 169 307 -31
6592 -31 285 401 -98 36 -60 -214 -209 -76 116 50 225 76 66 -53 -70 146 200 35 -128 -16 90 -250 -236
6615 -236 -4 39 -38 328 368 -63 -245 -228 138 163 -340 -73 -72 42 -183 46 326 30 -34 -133 212 -219 286
6638 286 -130 -84 -181 -55 94 -247 -164 305 155 -154 173 102 138 -47 -39 102 -260 -367 -88 111 0 -56 142
6661 142 1 24 -232 -36 111 -248 -281 90 -79 -210 42 -31 65 -189 92 423 -52 -293 169 96 -129 -34
6683 -34 94 -34 -410 229 302 76 -203 124 275 -51 193 131 185 -7 -422 47 -121 -480 -56 92 -209
6704 -209 -182 136 301 -163 64 92 79 -36 -129 121 -145 -355 -211 69 211 132 0 64 67 -70 80 174 -58
6727 -58 -67 -46 174 -41 -152 474 104 -16 -160 127 -92 -279 144 35 174 -364 157 5 -103 9 24 227
6749 227 -143 -228 163 361 -114 122 210 -131 -228 -139 -128 169 -254 -217 363 92 -7 167 44 -296 72 262
6771 262 -225 -9 -51 -46 -65 22 109 303 -292 53 300 -20 -181 10 292 72 -267 -57 -95 -298 -130 126
6793 126 61 -127 35 285 158 -78 -102 252 223 -222 77 176 -27 -177 108 167 42 -12 238 212 -182 -218 81
6816 81 -218 -301 -206 89 44 -144 167 -143 235 22 70 163 -176 -176 26 -105 -359 -29 37 -226 -126 -16 194
6839 194 114 -304 285 -2 5 -122 -47 126 -126 -189 -44 87 -186 182 208 -18 -123 22 97 60 155 319 422
6862 422 -166 -64 165 204 -245 6 198 58 -112 270 86 45 -7 79 -152 -38 -51 14 111 -379 6 -86 253
6885 253 1 104 61 -318 -233 -230 103 44 -125 3 27 193 -13 143 140 110 -282 81 14 -83 -136 -249 -248 29 81
6910 81 301 33 70 -46 110 30 -246 49 88 48 216 69 -52 -219 -186 -72 -95 -14 -14 56 -3 -144 -18 130
6934 130 -202 270 116 -200 9 175 102 -115 124 -123 188 -325 17 -75 -34 -15 4 -27 154 -203 245 149
6956 149 -71 -138 -119 -1 -141 105 -193 -76 -412 98 268 -218 99 -18 231 43 144 -58 310 45 -85
6977 -85 -139 110 -110 -49 120 -189 38 60 78 -117 62 366 64 -108 -75 -99 -67 -181 -242 -88 -166 -97 118 -95
7001 -95 196 -208 88 -247 -281 -143 -200 -201 -191 -119 -66 125 3 8 83 -6 -2 112 53 -46 46 340 77 -128 -350 115
7027 115 377 36 -35 107 2 -82 -9 -36 -87 -231 27 -201 139 -150 1 30 150 -103 140 92 -7 139 26
7050 26 -16 -255 239 -15 -138 -101 -136 277 46 8 -3 85 -174 -188 35 -161 -336 -206 -67 -104 -271 -12 17
7073 17 -56 -126 -59 101 -308 77 25 -132 -11 -104 -3 -213 -124 40 102 -167 237 -56 39 -296 -93 27 -215
7096 -215 -246 -241 -25 24 -41 -143 280 -200 30 131 -21 -350 94 -95 -24 181 -256 192 -237 -43 117 245
7118 245 197 -60 -40 130 307 23 65 -219 -219 -245 127 5 152 196 114 300 152 -166 135 58 -111 17 31
7141 31 -80 -122 45 -187 59 -119 -151 155 79 -143 216 -7 50 -102 18 -20 47 3 44 62 286 181 62
7164 62 -84 -128 124 -86 -35 -123 -120 -262 -209 -62 28 -216 -24 433 311 139 -127 97 89 -143 -114 32 -107 -79
7188 -79 -48 179 -66 108 30 63 -221 -168 241 -134 -42 52 -216 149 -95 139 251 49 -366 17 -32 -116 -115 34
7212 34 65 -61 161 -21 -164 -211 -54 63 -27 -363 344 229 0 -245 -136 -20 -177 -248 114 -193 69 76
7234 76 52 101 -158 20 4 -6 97 328 61 16 -34 3 151 128 171 180 75 83 -109 -106 22 -19 65 -222 -147 167
7260 167 94 76 -253 -93 196 14 34 -33 98 134 -215 -173 -115 -309 -118 69 177 55 150 120 98 129 -35 36
7284 36 88 -117 -277 168 -47 56 93 175 -157 -100 -74 205 -234 -54 297 81 -250 94 -25 81 -144 22
7306 22 275 -168 -39 208 56 -184 78 -80 -127 -218 36 31 -172 148 -8 42 -168 -85 252 167 -116 -109 7
7329 7 -7 -252 29 331 -82 -97 43 183 -174 0 -19 -10 -301 -165 -67 -86 -288 -89 306 42 -256 15 79
7352 79 -103 136 100 136 -133 -131 67 98 -447 -112 142 170 28 159 -128 -65 -175 134 175 -86 110 -83 -1
7375 -1 -172 -145 139 117 28 -41 198 38 -67 198 140 -295 -198 211 179 -172 78 49 122 112 50 278 41 -58 141
7400 141 77 -182 -165 -147 0 -101 -37 160 69 -184 168 256 6 -178 -155 148 71 -177 -213 -43 13 43 97 -116
7424 -116 -114 -210 227 43 -78 93 135 -196 -59 -9 35 -120 -105 59 -31 174 223 -202 196 -227 -32 -37 -40 -150
7448 -150 123 -51 27 -516 48 -63 106 42 -62 -51 -174 242 92 199 -119 -152 -111 -142 -150 -99 183 124 20
7471 20 108 -103 23 -273 -80 145 -50 -98 67 0 62 -40 61 256 -23 -102 195 -303 -280 -276 -150 -231 -237 250
7495 250 -53 22 -126 24 -58 -310 267 231 -206 -158 -73 -20 -97 -191 -70 -62 44 -129 102 -140 266 95 -90
7518 -90 -99 42 -169 -153 -110 -331 270 -234 -45 -154 56 108 35 216 -4 115 71 30 88 -252 19 -108 85
7541 85 -86 -25 83 250 -29 189 93 57 -211 7 125 -137 -154 29 201 12 -6 -125 202 87 63 -48
7563 -48 98 -272 -224 -21 -196 -202 1 227 60 72 347 273 103 -242 142 4 -161 -134 78 -12 -285 -158 -11
7586 -11 162 -29 135 -54 -69 -104 -1 264 -46 -210 162 376 -54 222 104 -179 128 227 -86 90 100 55
7608 55 186 -68 -262 209 -272 174 169 -14 -109 -134 -85 -55 -63 -102 -39 -179 -120 17 161 -49 -134 34 40 65 190
7633 190 154 86 -144 44 39 -74 50 32 110 -50 256 13 -175 225 86 212 -64 -2 -31 87 7 -149 -53
7656 -53 -118 103 -181 -56 -95 18 132 180 -9 -133 -228 -265 -30 90 -86 13 212 -32 114 149 -113 -84 88
7679 88 85 -62 9 -162 -51 -131 -228 33 -145 47 -139 -41 199 47 110 -56 168 -186 -213 81 -194 -232 -191 165
7703 165 66 -10 -62 202 -12 66 -280 -265 62 -81 -21 -273 -67 -77 220 -70 -268 -45 233 19 71 92 -160
7726 -160 30 -137 8 -4 -140 -50 234 15 158 30 73 5 -18 234 253 -163 -89 48 31 -79 -84 226 -144
7749 -144 -183 -26 125 186 -33 210 -73 95 -127 -131 -9 -143 27 -114 54 -72 65 203 -15 -136 151
7770 151 -5 104 18 113 -208 43 -95 -21 360 -50 -109 111 86 -89 15 39 6 -134 -2 34 -68 98 11
7793 11 -146 -82 0 345 -111 -178 108 51 48 -232 -106 60 124 -24 252 207 40 -16 131 -19 -27 -31 85 -233 97
7818 97 287 -76 -255 91 74 69 -179 -80 -30 -56 -50 46 140 -325 -65 303 60 34 -190 193 287 -90 -279 -49
7842 -49 54 300 -132 -228 -41 -107 296 251 -54 -172 224 -182 34 12 156 23 -502 90 -245 -139 -142 16
7864 16 -119 21 -38 230 75 -80 79 -145 -125 -216 -241 20 -17 -80 -153 182 -126 -14 -12 -166 2 205 118 -159
7888 -159 -41 -172 298 100 -132 9 168 306 -283 52 -57 -44 135 -80 -12 64 -43 26 -80 96 81 296
7910 296 234 191 85 -6 10 -52 100 136 -193 -59 34 -290 -101 159 112 169 -13 -14 262 -211 139 -86 23 67
7934 67 -80 137 214 -28 -91 -58 238 -241 25 30 12 -79 -220 185 25 -404 101 132 -89 248 132 62 76 92
7958 92 216 -172 -241 -304 -66 -142 58 182 -176 135 -99 206 343 -243 -47 24 181 -113 -130 -85 -137 -140 -65 20
7982 20 148 350 100 198 -104 344 252 11 -225 -118 -374 -117 122 -5 -152 -137 340 312 273 -48 -30 -33 -177
8005 -177 -6 10 312 31 -159 68 147 192 -43 108 209 265 -14 2 -12 -50 119 -85 -32 -51 -106 232 5
8028 5 -16 85 135 -127 63 172 122 -92 -6 114 -45 66 136 59 327 -24 34 -51 -219 27 123 -117 -72 307
8052 307 -250 -279 -31 -192 107 -110 -195 -18 -20 9 -166 203 -4 -148 60 129 -100 71 137 16 7 -86 192
8075 192 -81 217 -88 -174 -7 -205 -61 33 301 -69 53 211 198 -290 -49 78 175 -131 -174 240 -191 -2
8097 -2 -133 357 -36 -36 103 144 -6 -118 241 35 -58 -168 -104 72 -90 237 76 141 -38 295 251 -3 -4 -62
8121 -62 -122 -173 -78 58 -196 13 96 73 184 206 61 30 -87 -158 -221 173 -73 8 -260 3 195 -100 150 47
8145 47 -97 16 -184 -84 -95 119 207 37 -53 -4 -166 -212 -40 -106 -81 192 145 301 -4 -191 128 8 -6
8168 -6 7 24 200 -76 -81 11 -97 -200 73 153 34 -188 -97 39 -9 -171 -96 69 6 157 176 17 138
8191A38
##END NTUPLES=NMR FID
##END=
