##TITLE=1H_LR-755-R3-RM2
 CCl4
 8 sc, 
 21.12.2022
##JCAMPDX= 6.0         $$ Bruker NMR JCAMP-DX V2.0
##DATA TYPE= NMR FID
##DATA CLASS= NTUPLES
##ORIGIN= UXNMR, Bruker Analytische Messtechnik GmbH
##OWNER= root
$$ XWIN-NMR		Version 3.5
$$ Wed Dec 21 14:14:35 2022 Russian Standard Time (UT+4h)  she@DPX200
##.OBSERVE FREQUENCY= 200.13135
##.OBSERVE NUCLEUS= ^1H
##.DELAY= (6, 6)
##.ACQUISITION MODE= SIMULTANEOUS
##.ACQUISITION SCHEME= undefined
##.AVERAGES= 8
##.DIGITISER RES= 18
##SPECTROMETER/DATA SYSTEM= spect
##.PULSE SEQUENCE= zg30
##.SOLVENT NAME= DMSO
##.SHIFT REFERENCE= (INTERNAL, DMSO, 0, 15.7039)
##AUDIT TRAIL= $$ (NUMBER, WHEN, WHO, WHERE, WHAT)
$$ ##TITLE= Audit trail, XWIN-NMR		Version 3.5
$$ ##JCAMPDX= 5.01
$$ ##ORIGIN= Bruker BioSpin GmbH
$$ ##OWNER= she
$$ F:/spectra/data/she/nmr/H-F/1/audita.txt
$$ ##AUDIT TRAIL=  $$ (NUMBER, WHEN, WHO, WHERE, WHAT)
(   1,<2022-12-21 14:12:40.35 +0400>,<she>,<DPX200>,
      <created by zg, POWCHK disabled, PULCHK disabled
       configuration hash MD5:
       00 E9 B6 7A A2 85 ED C7 34 08 36 98 17 FE 4E 26
       data hash MD5: 16K
       C0 07 43 B5 8C 39 C9 2C 72 54 EA 2C 62 F6 F5 13>)
$$ ##END=
$$ 
$$ hash MD5
$$ B6 4A 08 83 2D 78 C7 E6 0D 6F 79 AE 66 05 FB 03
##$RELAX= 
##$RELAX= 
##$RELAX= 
##$RELAX= 
##$RELAX= 
##$RELAX= 
$$ Bruker specific parameters
$$ --------------------------
##$DU= <F:/spectra>
##$EXPNO= 1
##$NAME= <H-F>
##$PROCNO= 1
##$TYPE= <nmr>
##$USER= <she>
##$AMP= (0..31)
100 100 100 100 100 100 100 100 100 100 100 100 100 100 100 100 100 100 
100 100 100 100 100 100 100 100 100 100 100 100 100 100 
##$AQSEQ= 0
##$AQ_mod= 1
##$AUNM= <au_zg>
##$AUTOPOS= <>
##$BF1= 200.13
##$BF2= 200.13
##$BF3= 200.13
##$BF4= 200.13
##$BF5= 200.13
##$BF6= 200.13
##$BF7= 200.13
##$BF8= 200.13
##$BYTORDA= 1
##$CFDGTYP= 0
##$CFRGTYP= 5
##$CHEMSTR= <none>
##$CNST= (0..31)
1 1 145 1 1 1 1 1 1 1 1 1 1 1 1 1 1 1 1 1 1 1 1 1 1 1 1 1 1 1 1 1 
##$CPDPRG= <>
##$CPDPRG1= <>
##$CPDPRG2= <>
##$CPDPRG3= <>
##$CPDPRG4= <mlev>
##$CPDPRG5= <mlev>
##$CPDPRG6= <mlev>
##$CPDPRG7= <mlev>
##$CPDPRG8= <mlev>
##$CPDPRGB= <>
##$CPDPRGT= <>
##$D= (0..31)
0 1.2 0 0 0 0 0 0 0 0.06 0 0.03 0 0 0 0 0.0002 0 0 0 0 0 0 0 0 0 0 0 0 
0 0 0 
##$DATE= 1671617559
##$DBL= (0..7)
120 120 120 120 120 120 120 120 
##$DBP= (0..7)
150 150 150 150 150 150 150 150 
##$DBP07= 0
##$DBPNAM0= <>
##$DBPNAM1= <>
##$DBPNAM2= <>
##$DBPNAM3= <>
##$DBPNAM4= <>
##$DBPNAM5= <>
##$DBPNAM6= <>
##$DBPNAM7= <>
##$DBPOAL= (0..7)
0.5 0.5 0.5 0.5 0.5 0.5 0.5 0.5 
##$DBPOFFS= (0..7)
0 0 0 0 0 0 0 0 
##$DE= 6
##$DECBNUC= <off>
##$DECIM= 32
##$DECNUC= <off>
##$DECSTAT= 4
##$DIGMOD= 1
##$DIGTYP= 9
##$DL= (0..7)
0 120 120 120 120 120 120 120 
##$DP= (0..7)
150 150 150 150 150 150 150 150 
##$DP07= 0
##$DPNAME0= <>
##$DPNAME1= <>
##$DPNAME2= <>
##$DPNAME3= <>
##$DPNAME4= <>
##$DPNAME5= <>
##$DPNAME6= <>
##$DPNAME7= <>
##$DPOAL= (0..7)
0.5 0.5 0.5 0.5 0.5 0.5 0.5 0.5 
##$DPOFFS= (0..7)
0 0 0 0 0 0 0 0 
##$DQDMODE= 0
##$DR= 18
##$DS= 0
##$DSLIST= <SSSSSSSSSSSSSSS>
$$ [...]
##$SUBNAM2= <"">
##$SUBNAM3= <"">
##$SUBNAM4= <"">
##$SUBNAM5= <"">
##$SUBNAM6= <"">
##$SUBNAM7= <"">
##$SUBNAM8= <"">
##$SUBNAM9= <"">
##$SW= 18.05172834244
##$SWIBOX= (0..15)
0 0 2 0 0 0 0 0 0 0 0 0 0 0 0 0 
##$SW_h= 3612.71676300578
##$TD= 16384
##$TD0= 1
##$TE= 0
##$TE2= 300
##$TE3= 300
##$TEG= 300
##$TL= (0..7)
0 120 120 120 120 120 120 120 
##$TP= (0..7)
150 150 150 150 150 150 150 150 
##$TP07= 0
##$TPNAME0= <>
##$TPNAME1= <>
##$TPNAME2= <>
##$TPNAME3= <>
##$TPNAME4= <>
##$TPNAME5= <>
##$TPNAME6= <>
##$TPNAME7= <>
##$TPOAL= (0..7)
0.5 0.5 0.5 0.5 0.5 0.5 0.5 0.5 
##$TPOFFS= (0..7)
0 0 0 0 0 0 0 0 
##$TUNHIN= 0
##$TUNHOUT= 0
##$TUNXOUT= 0
##$USERA1= <user>
##$USERA2= <user>
##$USERA3= <user>
##$USERA4= <user>
##$USERA5= <user>
##$V9= 5
##$VALIST= <valist>
##$VCLIST= <CCCCCCCCCCCCCCC>
##$VD= 0
##$VDLIST= <DDDDDDDDDDDDDDD>
##$VPLIST= <PPPPPPPPPPPPPPP>
##$VTLIST= <TTTTTTTTTTTTTTT>
##$WBST= 1024
##$WBSW= 4
##$XGAIN= (0..3)
0 0 0 0 
##$XL= 0
##$YL= 0
##$YMAX_a= 747977
##$YMIN_a= -682028
##$ZGOPTNS= <>
##$ZL1= 120
##$ZL2= 120
##$ZL3= 120
##$ZL4= 120
##$ABSF1= 10
##$ABSF2= 0
##$ABSG= 5
##$ABSL= 3
##$ALPHA= 0
##$AQORDER= 0
##$ASSFAC= 0
##$ASSFACI= 0
##$ASSFACX= 0
##$ASSWID= 0
##$AUNMP= <proc_1d>
##$AZFE= 0.1
##$AZFW= 0.1
##$BCFW= 1
##$BC_mod= 2
##$BYTORDP= 1
##$COROFFS= 0
##$CY= 11.3945322036743
##$DATMOD= 1
##$DC= 2
##$DFILT= <>
##$DTYPP= 0
##$F1P= 2.36226072786647
##$F2P= -0.459571619588291
##$FCOR= 0.5
##$FTSIZE= 0
##$FT_mod= 4
##$GAMMA= 1
##$GB= 0.15
##$INTBC= 1
##$INTSCL= 1
##$ISEN= 128
##$LB= 0.24
##$LEV0= 0
##$LPBIN= 0
##$MAXI= 10000
##$MC2= 0
##$MEAN= 0
##$ME_mod= 0
##$MI= 1.114404
##$NCOEF= 0
##$NC_proc= 0
##$NLEV= 6
##$NOISF1= 3.799351
##$NOISF2= 2.8
##$NSP= 1
##$NTH_PI= 0
##$NZP= 0
##$OFFSET= 15.70392
##$PC= 1
##$PHC0= -19113.25
##$PHC1= 17.20072
##$PH_mod= 1
##$PKNL= yes
##$PPARMOD= 0
##$PSCAL= 0
##$PSIGN= 0
##$REVERSE= no
##$SF= 200.130013532006
##$SI= 16384
##$SIGF1= 3
##$SIGF2= 2
##$SINO= 400
##$SIOLD= 16384
##$SREGLST= <1H.CDCl3>
##$SSB= 0
##$STSI= 0
##$STSR= 0
##$SW_p= 3612.71676300578
##$SYMM= 0
##$S_DEV= 0
##$TDeff= 0
##$TDoff= 0
##$TI= <>
##$TILT= no
##$TM1= 0
##$TM2= 0
##$TOPLEV= 0
##$USERP1= <user>
##$USERP2= <user>
##$USERP3= <user>
##$USERP4= <user>
##$USERP5= <user>
##$WDW= 1
##$XDIM= 8192
##$YMAX_p= 0
##$YMIN_p= 0
$$ End of Bruker specific parameters
$$ ---------------------------------
##NTUPLES= NMR FID
##VAR_NAME=  TIME,          FID/REAL,        FID/IMAG
##SYMBOL=    X,             R,               I
##VAR_TYPE=  INDEPENDENT,   DEPENDENT,       DEPENDENT
##VAR_FORM=  AFFN,          ASDF,            ASDF
##VAR_DIM=   8192,          8192,            8192
##UNITS=     SECONDS,       ARBITRARY UNITS, ARBITRARY UNITS
##FACTOR=    0.0002768,     1,               1
##FIRST=     0,             0,               0
##LAST=      2.2672688,     0,               0
##MIN=       0,             -682028,         0
##MAX=       2.2672688,     747977,          0
$$ Real data points
##PAGE= N=1
##DATA TABLE= (X++(R..R)), XYDATA
0 0 0 0 0 0 0 0 0 0 -8 8 -16 24 -32 47 -56 76 -96 120 -150 184 -224 270 -323 386 -458 538 -631 734 -853
29 -853 985 -1134 1297 -1484 1688 -1914 2164 -2441 2744 -3079 3443 -3842 4280 -4758 5277
44 5277 -5845 6466 -7141 7877 -8684 9565 -10532 11591 -12759 14045 -15474 17066
56 17066 -18852 20867 -23163 25804 -28885 32530 -36922 42343 -49234 58352 -71144 90871
68 90871 -128017 345924 -656428 272657 -76753 75282 129846 -554823 747977 -549028
78 -549028 318978 -300699 257894 15789 -254721 183732 -22457 115543 -325766 265297
88 265297 9913 -77676 -128725 202894 44511 -264195 162640 26195 21315 -175926 122697
99 122697 58820 -46713 -145034 195997 -47678 -4690 -128422 141762 134367 -403027 364666
110 364666 -196012 208594 -307276 166070 190692 -406285 365485 -317314 392850 -381216
120 -381216 142095 110302 -167644 166620 -310352 468662 -385697 141515 -35971 94910
130 94910 -41709 -209970 390476 -315984 168963 -166599 207208 -85185 -128369 209375
140 209375 -152523 141381 -197909 151797 19458 -114649 39636 33808 31375 -97581 2762
151 2762 142150 -120608 -38811 119340 -74593 66272 -160011 206154 -105720 -23786 62387
162 62387 -77281 168834 -258734 217967 -99535 53217 -73204 13488 143231 -239443
172 -239443 198400 -136826 161160 -189223 105702 40490 -123427 140482 -181976 245324
182 245324 -233819 133495 -40612 535 57393 -167250 237983 -194136 99594 -60626
192 -60626 59495 -7860 -86071 127441 -84857 39206 -43754 53007 -24382 -5206 -11009
203 -11009 38329 -23393 -12053 15646 886 21879 -79213 101794 -66841 31413 -37888
214 -37888 45928 -7918 -49864 75076 -69673 77218 -98689 96479 -62176 26778 -3167
225 -3167 -34860 93419 -134469 131397 -105620 88362 -66245 10703 62472 -110704 118296
236 118296 -111761 106311 -86287 42554 6281 -36796 55035 -72677 82465 -73030
246 -73030 51871 -39406 33337 -16882 -11622 33723 -38763 40139 -49023 56674 -50030 31344
258 31344 -15974 5429 7389 -22632 32762 -35231 37604 -42021 41626 -32639 20350 -11635
270 -11635 1412 15398 -35083 49721 -53753 52496 -46735 34059 -14752 -7205 26033 -41424
282 -41424 51788 -55210 49890 -37613 23580 -8598 -7513 23829 -36609 42854 -43487 39492
294 39492 -31921 21558 -8512 -4567 17555 -27353 32895 -33832 30975 -26214 19183 -10222
306 -10222 -95 10460 -17994 23293 -25641 26070 -24016 18703 -10979 1113 7448 -14176
318 -14176 18517 -19958 20296 -17687 12839 -6706 251 4251 -7805 9850 -11907 12976
330 12976 -12560 10741 -7219 3648 35 -3795 7386 -10846 12136 -11513 8996 -5124
342 -5124 867 3920 -7512 9654 -9854 8555 -6124 1544 2926 -6720 8510 -8603 7937
355 7937 -5326 1599 2204 -5556 8256 -11460 11500 -8462 4111 -1296 -721 6180 -13309 17421
369 17421 -16354 12044 -9250 4600 2861 -12020 17927 -19796 20493 -16899 7896 3003
381 3003 -9111 9694 -12216 16611 -15712 5558 5180 -5315 -1153 4065 -1553 1677 -6028 5908
395 5908 1645 -9850 14260 -19381 26843 -25587 11115 4842 -9618 9947 -22291 39776 -42445
408 -42445 25824 -10530 9075 -5735 -11940 34044 -42819 42084 -45040 44778 -27023 -2110
420 -2110 21333 -29860 47648 -72104 74609 -41716 3846 10680 -16819 39706 -68053 67383
432 67383 -36856 10796 -2418 -7384 28422 -37340 22614 -8505 14550 -19785 1044 19688
444 19688 -6967 -22877 23983 6600 -20401 -766 14941 6597 -34740 29812 -10894 15203
456 15203 -31707 24068 3071 -12473 6661 -26214 70729 -87060 53562 -18829 19773 -16795
468 -16795 -36433 105945 -121577 84462 -55541 49759 -21060 -45592 96210 -96703 82465
479 82465 -85822 75724 -18783 -43300 52094 -30857 44407 -86610 84469 -24749 -17533
490 -17533 -228 20792 13080 -60754 57839 -22559 17135 -35769 21475 23484 -34964 2219
502 2219 11553 18503 -27789 -20387 59381 -20997 -49295 62050 -29361 33498 -77505 78153
514 78153 -5387 -65677 80845 -83178 113955 -126838 70251 9758 -40979 44737 -87853
525 -87853 150707 -144413 63647 -5437 15209 -17569 -48074 119244 -115685 69544 -62048
536 -62048 82925 -57337 -15411 58797 -54609 65932 -112488 119824 -50565 -19974 20145
547 20145 -191 39469 -100012 85132 -3064 -40122 8907 16066 11957 -30560 -12838 62305
559 62305 -48376 6567 -3131 13809 30068 -102222 110724 -51653 18627 -43774 43872
570 43872 33952 -112132 108356 -64589 67299 -100046 78721 -2918 -49524 55193 -76755
581 -76755 133121 -152711 98675 -35484 20672 -6077 -69970 155691 -158060 89200 -46690
592 -46690 52649 -30865 -47728 107722 -90205 46737 -43280 51671 -16890 -32342 28864
603 28864 9720 -9528 -29857 34009 12450 -30486 -18849 63541 -38999 -7011 -2671 43296
615 43296 -37221 -12495 34445 -13502 12742 -53519 78396 -54471 29391 -41521 43114 14918
627 14918 -88682 105720 -79224 78395 -102824 81222 3232 -79249 95331 -90578
637 -90578 109396 -119975 76914 -6349 -32054 41794 -68102 104529 -98829 46837 -10445
648 -10445 16919 -16956 -24474 64780 -53079 16485 -13998 38472 -36712 1952 16342 -1504
660 -1504 -6687 -13239 27021 -8930 -8007 -8258 31894 -24070 1376 -9164 38254 -38404 477
673 477 30224 -28511 27322 -52513 75723 -61277 24702 -1075 -12332 41722 -78257 87326
685 87326 -65002 44797 -38337 18272 27372 -67013 70045 -55431 55255 -61584 43432
696 43432 -3464 -25266 31908 -38266 55681 -63398 47007 -24991 14748 -6264 -16859 41257
708 41257 -43416 28765 -22312 27426 -23022 2281 12601 -7746 -1847 -2104 12456 -13126 9344
721 9344 -14490 26486 -29269 20588 -13465 10565 -177 -20991 38637 -40328 35213 -34850
733 -34850 33723 -20131 -3413 21027 -29279 35998 -44790 47429 -38084 23381 -10585 -3175
745 -3175 21669 -38891 45499 -43319 39437 -34313 21521 -1196 -16598 26090 -30971 35514
757 35514 -37259 31124 -20294 10489 -2682 -6310 15769 -21481 23427 -23982 25166 -23205
769 -23205 16400 -8493 1817 3750 -11088 18806 -23543 24489 -23238 21741 -17460 10171
781 10171 -1514 -6990 15090 -23061 28199 -29134 26128 -20435 12709 -2813 -8616 18198
793 18198 -24853 27196 -27047 24107 -18342 10435 -1899 -6161 13286 -18970 22618 -24356
805 -24356 23125 -19632 13615 -5385 -3022 11055 -17181 21670 -23614 22268 -17968 11542
817 11542 -4753 -1837 7537 -12405 16393 -18167 18013 -16000 12924 -9167 4216 2070 -8869
830 -8869 14492 -17925 18836 -17619 14717 -9577 3518 3367 -9537 13380 -14838 14457 -13442
843 -13442 11735 -8279 3549 1171 -4810 7520 -9843 12261 -13622 13271 -10228 5506
855 5506 -519 -3647 7652 -11053 13662 -14508 11694 -6512 1374 1930 -4388 6977 -9659
868 -9659 10662 -8322 4665 -1735 202 445 -1702 3001 -4454 4977 -3634 1762 -1141 2849 -4321
883 -4321 2266 1221 -2958 1372 -313 1845 -5081 6021 -4121 2100 -1381 1101 -538 -864 3241
898 3241 -6980 9647 -8139 3805 -851 1052 399 -7115 14386 -15073 8317 -1676 -1150 4356
912 4356 -9751 14735 -14475 10468 -4881 -2637 11001 -16121 13762 -8731 7190 -6919
924 -6919 -191 12957 -19448 14517 -6800 5307 -7079 2125 7879 -14066 14120 -12937 12768
937 12768 -8534 90 5025 -6122 10553 -20366 23980 -12492 -2966 8214 -5483 9804 -21334
950 -21334 24278 -11686 -4252 10457 -11866 16128 -18180 10143 1471 -6299 8051 -15846 23645
963 23645 -16238 -4484 16094 -11562 7349 -16272 24784 -14505 -6039 15894 -13439 14755
975 14755 -23187 23840 -12944 3603 -1258 -6938 26159 -38071 30078 -15991 14905 -17509
987 -17509 251 31709 -47749 38377 -25169 24325 -19289 -3594 30135 -38495 33871 -32454
999 -32454 29759 -10946 -15758 25240 -16685 15327 -27018 26944 -2169 -21542 17560 -1490
1011 -1490 1698 -14385 12222 6779 -16306 8453 -3154 10075 -10619 -5853 19094 -13703 7097
1024 7097 -18924 32824 -18894 -13336 29273 -22261 22840 -41604 49460 -25782 -8486 25319
1036 25319 -31345 46597 -61083 50846 -21517 1134 7014 -25692 55392 -64891 40960
1047 40960 -14392 10976 -12250 -9640 40748 -46390 27260 -16282 21668 -19248 -2202 19547
1059 19547 -16711 12558 -22102 28056 -10803 -11847 12284 594 2461 -19668 18102 9137
1071 9137 -29160 20880 -5065 5581 -8600 -8529 34562 -41715 30619 -23613 20910 -1861 -31922
1084 -31922 51448 -44559 35094 -39526 37013 -7013 -31410 45171 -37820 37758 -48512 44366
1096 44366 -16934 -8691 17069 -23170 40026 -51764 41013 -21204 14095 -11485 -7630 36383
1108 36383 -45089 29941 -16960 19860 -18631 -2992 25458 -25835 12602 -7815 9968 -2169
1120 -2169 -12710 15545 -3047 -5541 2962 -5625 20904 -29005 15024 6324 -13138 11030 -19492
1133 -19492 36445 -39300 22190 -4747 -1679 9257 -26814 41546 -40300 30824 -26493 21186
1145 21186 -1951 -23916 37314 -35951 35857 -41866 37544 -14114 -11846 23946 -27395 34914
1157 34914 -42129 35455 -16533 1189 6071 -14578 26164 -29055 18769 -7957 6507 -6514
1169 -6514 -2343 11943 -9925 -219 3787 2308 -5405 1220 978 5537 -12612 11587 -7465 7202
1183 7202 -8024 1414 9620 -14905 14598 -17083 23571 -23537 12361 1095 -8092 13531 -23876
1196 -23876 34223 -34327 24392 -13293 4036 8353 -23438 33359 -33386 28345 -23464 15612
1208 15612 -1122 -13669 20808 -21734 22744 -24521 20491 -10539 747 3671 -6413 11839
1220 11839 -15993 15762 -12086 9891 -8692 5107 317 -3631 3146 -3996 7195 -9701 8478
1233 8478 -6992 8302 -10590 9039 -4189 -397 3054 -7308 13345 -18003 18321 -16060
1245 -16060 13088 -7857 -168 8889 -15113 18537 -21076 22367 -19136 11570 -2781 -4301
1257 -4301 10854 -17507 22374 -22967 19193 -14108 8048 -426 -7073 13250 -16201 17485
1269 17485 -17261 14795 -10286 4901 -987 -2419 6065 -10357 13046 -13482 13067 -12299
1281 -12299 10469 -6845 1443 3562 -8237 11733 -14272 14601 -13202 10741 -7390 3280
1293 3280 1574 -5837 8677 -10901 12802 -14314 13809 -11302 7191 -2039 -3264 8578 -13239
1306 -13239 16519 -17492 15682 -11197 5418 430 -5363 9631 -12374 13931 -13560 11384
1318 11384 -8172 4848 -2226 -1008 4407 -8350 11463 -12820 12628 -11187 8934 -5261
1330 -5261 530 4946 -9658 12256 -12538 11556 -9906 7656 -4432 150 3948 -6827 7941
1343 7941 -8471 9316 -10044 9605 -6847 3143 798 -3947 6447 -9013 11368 -12276 10549
1356 10549 -6764 2231 1267 -3803 6319 -8953 10662 -10365 7709 -4497 2088 -647 -1397
1369 -1397 4607 -7705 9424 -9025 7281 -5508 3950 -2075 -1233 5436 -8517 9309 -7421
1382 -7421 5374 -4309 3139 -661 -2973 5597 -5555 4032 -2632 2770 -3325 3259 -2172 479
1396 479 474 -474 199 -1793 5199 -7747 7156 -4174 2111 -1314 489 2417 -6601 8932 -8089
1411 -8089 5751 -3382 2000 -683 -933 4040 -7220 8804 -7538 4779 -2971 2713 -1242 -3184
1425 -3184 8712 -10967 8763 -5118 2891 -1024 -2267 6319 -9386 9607 -6929 2107 2843
1438 2843 -5378 5328 -4536 4776 -4932 1739 4428 -7987 6112 -2161 -169 -54 -591 3235 -5966
1453 -5966 6173 -4062 1096 1602 -3643 3954 -3233 4662 -6991 6653 -1583 -4486 6575 -5672
1467 -5672 5725 -8441 9133 -4970 -2564 8340 -11094 11254 -9690 6400 -2113 -2690 7829
1480 7829 -13107 15596 -11866 3365 3805 -6109 7369 -11069 13998 -11708 3883 4043 -7982
1493 -7982 9477 -10202 10496 -8756 5771 -1393 -4302 10182 -13093 11144 -7705 6732
1505 6732 -5757 585 8544 -15055 15026 -10891 7405 -4703 -449 7652 -13311 15151 -13288
1518 -13288 8214 -561 -6916 10750 -10645 9993 -9956 6276 2615 -11599 14069 -10655
1530 -10655 6393 -4277 1152 5130 -11629 14124 -12541 9113 -4087 -2319 7938 -10837
1542 -10837 12314 -14802 15666 -10720 410 8057 -11779 14103 -17897 20664 -16457 6396
1554 6396 4256 -12027 17629 -21674 21122 -15962 8531 -532 -8771 17796 -21843 18141 -10682
1567 -10682 5319 -1396 -4753 12721 -15962 12135 -5506 1346 1531 -5014 8183 -8212 5424
1580 5424 -2419 -534 5153 -9925 10066 -6348 2733 -1456 -1536 8888 -15952 16499 -11790 6882
1594 6882 -2787 -3700 13020 -19834 21689 -19394 14719 -6825 -4724 15359 -20787 22030 -22299
1607 -22299 20047 -11061 -2261 12767 -16908 18273 -20026 19080 -12103 2130 5328 -9392
1619 -9392 13048 -15606 13960 -8548 3682 -979 -2979 8443 -11005 7916 -3054 1062 -368
1632 -368 -2982 7434 -7785 3149 1837 -4394 6360 -9249 10704 -6608 363 4860 -8750
1645 -8750 13924 -17778 15679 -8398 875 4570 -10179 17682 -21902 19123 -11946 5358
1657 5358 516 -8243 16106 -20213 18484 -14952 11467 -5262 -3323 10917 -14180 14962 -15401
1670 -15401 14510 -9345 963 4921 -7884 10031 -12267 12150 -7786 1971 1440 -3237 5119
1683 5119 -6569 5316 -1505 -1109 1529 -1844 2638 -1729 -1819 5451 -6278 4858 -4267 3410 -79
1698 -79 -5389 9333 -10246 9807 -9406 7148 -2083 -3959 8687 -11202 13677 -14619 11920
1711 11920 -6369 536 4498 -9081 13817 -16078 14349 -9797 5385 -914 -4346 9759 -12597
1724 -12597 12282 -10353 8164 -5159 901 3198 -5401 6438 -7247 7851 -6346 3897
1736 3897 -1910 1033 195 -2084 3427 -3167 2360 -2432 3328 -3318 3051 -2948 3305 -2836 1074
1751 1074 804 -2864 5026 -7591 9317 -8583 6345 -3526 417 3318 -7652 10410 -10974
1764 -10974 9810 -7873 4959 -1082 -2680 5959 -8269 9582 -9929 8787 -6415 3558 -699
1777 -699 -2146 5700 -8258 9195 -8520 7213 -5607 3179 -196 -2759 4778 -6018 6251
1790 6251 -6106 5224 -4711 3580 -2394 479 1342 -2968 4266 -5793 6836 -7276 6793 -4365
1804 -4365 1655 648 -3196 5088 -6753 7596 -7358 6163 -3975 1985 -92 -1538 3523 -5573
1818 -5573 7165 -7460 6719 -5367 3869 -1709 -928 4215 -6852 8145 -7786 6548 -4920
1831 -4920 3011 -596 -1997 4512 -5730 5905 -5212 4700 -4233 3495 -2193 -111 1992 -3285
1845 -3285 4166 -5095 6120 -6612 5311 -3180 259 2087 -3522 4775 -5919 6442 -5927
1858 -5927 3996 -1715 -230 1023 -1662 2890 -4366 5490 -5207 3982 -2948 2469 -1754 -224 3190
1873 3190 -5385 6722 -6451 4867 -3901 2676 -492 -2398 5121 -6128 5488 -4002 3004 -2661
1887 -2661 1864 84 -2026 3379 -3418 2722 -2638 3368 -3662 2758 -478 -1642 2471 -2398 2513
1902 2513 -3290 4104 -3014 892 876 -1198 629 -249 607 -1622 2492 -2444 1954 -1747 2830 -3324
1918 -3324 1956 1457 -4295 5231 -4853 4592 -4411 3544 -980 -2392 5157 -6151 5473 -4099
1932 -4099 3037 -2551 1189 1140 -3885 5344 -4635 3208 -2679 3023 -2432 -268 3496 -4965 4598
1947 4598 -3726 2608 -1826 603 1479 -3499 4892 -4237 1509 1341 -2296 2032 -1604 2420 -2315
1962 -2315 86 3175 -4830 4031 -2023 221 1108 -2068 3510 -4603 4899 -3883 1014 2091 -4083
1977 -4083 3929 -3783 4381 -5242 3990 -214 -2981 4374 -4625 5092 -5772 5034 -2940 -189
1991 -189 3813 -6788 7426 -6241 4214 -2799 987 2531 -7009 8832 -6993 3474 -875
2004 -875 -977 3116 -5818 7336 -6405 3635 -285 -2915 4997 -5458 4849 -3995 3339 -1363
2018 -1363 -2393 5860 -6140 4441 -2823 2480 -1532 -1639 4764 -6249 6066 -4631 2592 72
2032 72 -2470 4288 -5729 7007 -6837 3579 1185 -4539 5534 -6049 7074 -6705 3009
2045 3009 1409 -5437 7284 -7941 7312 -4576 1264 1787 -4513 7299 -9348 7956 -4176
2058 -4176 183 2132 -3912 6643 -8738 8240 -4998 1510 1219 -3761 6608 -7949 7590
2071 7590 -6071 3949 -465 -3776 7085 -7696 6293 -5551 4368 -985 -4003 6850 -7029
2084 -7029 5609 -4427 2356 1038 -4506 5891 -5760 5026 -3174 -108 4087 -5818 5435
2097 5435 -4888 4568 -2513 -1548 5586 -6701 6422 -5849 5115 -2323 -1995 5087 -6520 7670
2111 7670 -8329 6738 -2895 -1148 3780 -5995 8916 -10074 8156 -3853 303 2463 -5478
2124 -5478 8452 -9382 7534 -4465 1754 1326 -4890 7341 -6932 5360 -3681 1899 923 -4154
2138 -4154 5428 -4404 2714 -1949 814 1818 -3890 3848 -2562 1694 -553 -1436 4006 -4752 3643
2153 3643 -2520 1805 166 -3338 5728 -5956 5198 -4342 2832 342 -4360 6490 -7096 6850
2167 6850 -6453 4200 -122 -3609 5600 -6654 7666 -7373 4988 -1420 -1478 3552 -5438 7238
2181 7238 -6775 4789 -2369 593 1388 -3671 5334 -4894 3554 -2360 1582 407 -2346 3053
2195 3053 -2610 1646 -1148 305 1156 -1977 1495 -378 -163 504 -2031 3005 -2856 1012 421 -1344
2211 -1344 2504 -3942 4715 -3839 2172 -882 -771 2686 -4658 5498 -4854 4113 -3088 1015 1852
2226 1852 -4132 5028 -5460 5421 -4889 2831 -145 -1927 3426 -4542 5258 -4681 3402 -1710
2240 -1710 237 1066 -2717 3489 -3114 2239 -1844 1552 -1040 -129 599 -572 519 -1041 1190 -1301
2256 -1301 1328 -1368 1776 -1366 684 -632 298 328 -1348 2381 -2493 2675 -2983 2864 -1830 377
2272 377 1010 -2355 3602 -4373 4260 -3582 2338 -773 -896 2738 -4065 4416 -3995 3623 -2593 1366
2288 1366 58 -1409 2106 -2831 2937 -3115 2744 -2349 1780 -770 -446 1373 -2288 2587 -3035
2303 -3035 3221 -2940 1895 -735 -346 1038 -1581 2222 -2631 2683 -2421 1814 -1326 873 -401
2318 -401 -280 1538 -2584 3284 -3378 2843 -2479 1718 -639 -885 2280 -3491 3695 -3385 2709 -1945
2334 -1945 1348 -186 -956 2068 -2608 2632 -2500 2481 -2562 1898 -674 -554 1348 -1978 2272
2349 2272 -2830 3253 -2836 1811 -454 -645 1388 -1748 1878 -2406 2625 -2315 1537 -682 235
2364 235 -14 -428 1535 -2386 3058 -2690 2114 -1499 1090 -171 -912 2270 -3052 2729 -2021 1601
2380 1601 -1361 931 -130 -920 1698 -1857 1841 -1894 2276 -2374 1944 -941 -682 1745 -2315
2395 -2315 2512 -2703 2984 -2551 909 842 -1928 1836 -1679 1906 -1827 1567 -815 83 664 -689
2411 -689 474 -105 477 -1429 1753 -1265 714 -447 717 -449 -561 1475 -1586 1375 -965 1049
2427 1049 -804 1095 -718 -23 736 -1259 1158 -1296 2154 -3007 2390 -759 -965 1797 -2202 2744
2443 2744 -3496 3407 -2083 280 976 -2292 2973 -2874 2231 -1719 1712 -566 -1393 2388 -2038
2458 -2038 1139 -976 1705 -1374 -32 1196 -1214 1104 -1231 1007 -404 -47 77 -540 1223 -1659
2474 -1659 260 1391 -1538 542 -441 1236 -1062 -501 2347 -2974 2422 -1814 1442 -55 -1623
2489 -1623 2508 -2896 3316 -3825 2348 360 -1988 2219 -2314 3524 -4213 3224 -517 -1000 1549
2504 1549 -2360 3469 -3746 2683 -1284 836 708 -2650 3750 -3355 1748 -1490 1348 172 -2961
2519 -2961 3930 -2922 1523 -1189 530 1172 -2879 3153 -2227 1702 -1038 -953 2929 -3446 2338 -1818
2535 -1818 2093 -1113 -1681 3978 -3807 2465 -2062 1978 -507 -2033 3417 -3508 3209 -3258 2344
2550 2344 312 -2320 2728 -2849 3949 -4419 2675 544 -2356 2392 -2978 4353 -4483 2447 278
2565 278 -1865 2613 -3899 4871 -3752 1282 104 -847 2669 -4771 5040 -2962 578 -25 -817 2734
2581 2734 -4734 4173 -2240 902 -367 -1343 3504 -4196 3202 -2142 1671 -652 -1921 3974 -3963
2596 -3963 2686 -2058 2140 -346 -2434 4146 -3654 2623 -2656 1500 889 -3300 3559 -3000 3383
2611 3383 -2863 996 1786 -3497 3366 -3122 3735 -3254 423 2389 -3302 3034 -3907 4225 -2724
2626 -2724 -70 1866 -2512 3224 -4456 4352 -2273 -152 1082 -1809 3229 -4804 4117 -1997 162
2641 162 393 -1584 3502 -4474 3099 -1310 649 43 -1933 3530 -3397 1830 -1067 795 375 -2440
2657 -2440 3610 -2502 1310 -904 286 1325 -3228 3103 -1887 1245 -1237 -81 2440 -3497 2952
2672 2952 -2102 1875 -1193 -755 2918 -3428 2860 -2681 2542 -1550 -890 2651 -2912 2876 -3477
2687 -3477 3271 -1452 -905 1793 -1984 2814 -3484 2957 -1196 -375 949 -1406 2520 -3069 1955
2702 1955 -931 237 195 -1081 2167 -2061 1147 -38 286 216 -1384 1719 -1198 218 234 -149 1013
2719 1013 -1813 1725 -667 -116 515 -921 1934 -2439 1703 -554 -30 289 -1432 2571 -2728 1841
2735 1841 -1290 744 -116 -1380 2316 -2346 1974 -1866 1464 -489 -862 1470 -1566 1828 -2073
2750 -2073 1862 -904 -190 530 -868 1486 -1861 1462 -753 301 -193 -250 655 -928 472 -83 23
2767 23 -296 0 -178 186 -676 721 -397 250 -203 -61 588 -1162 1302 -1113 927 -923 345 336
2785 336 -1078 1260 -1272 1571 -1573 1049 -490 88 642 -1163 1407 -1623 1421 -1365 1040 -329
2801 -329 -404 839 -1336 1284 -1447 1293 -822 366 117 -496 651 -785 825 -913 860 -946
2817 -946 704 -227 133 -134 -233 558 -1036 1262 -1150 919 -581 442 -128 -404 808 -1088 885
2834 885 -923 1140 -953 867 -424 -67 496 -860 1114 -1334 1414 -1391 1024 -355 -203 843
2850 843 -1115 1224 -1228 1243 -953 473 122 -476 345 -387 705 -951 1130 -993 767 -585
2866 -585 354 -148 -419 697 -1233 1418 -999 727 -476 -19 -53 -465 799 -898 858 -517 349
2883 349 -766 600 -351 -55 474 -668 695 -941 1196 -1464 976 -140 -440 693 -822 1051
2899 1051 -1129 1301 -970 278 -78 -361 527 -456 766 -1064 1115 -920 541 -124 -254 373 -696
2916 -696 893 -1275 1003 -223 87 127 -168 545 -445 495 -284 179 13 -122 -233 311 -293 -14 252
2935 252 -296 191 -216 848 -1050 645 -187 -50 157 -464 864 -1044 949 -834 726 -283 -316
2952 -316 539 -403 753 -1523 1648 -932 283 109 -273 738 -1414 1745 -1624 933 -405 -144
2968 -144 715 -1311 1192 -1058 1044 -798 -171 1009 -814 503 -263 547 -601 -73 587 -478 127
2985 127 -166 235 119 -535 508 -182 198 -486 -45 798 -1190 762 -444 645 -903 138 1224
3002 1224 -1594 1207 -1133 1384 -856 -60 919 -1176 1534 -2012 1776 -943 -392 761 -683 1273
3018 1273 -2323 2034 -1065 -67 279 -407 1172 -1756 1540 -558 437 -184 -460 1402 -1497 807
3034 807 -221 660 -427 -862 1501 -1202 199 -320 433 68 -1427 1566 -850 474 -374 92 1188
3051 1188 -1874 1477 -841 579 -902 -288 1747 -2156 1404 -1142 1408 -938 -526 1780 -1882
3066 -1882 1381 -1491 2019 -928 -643 1315 -946 1205 -2173 1869 -446 -730 572 -607 1431
3081 1431 -2262 1535 -163 -491 16 -844 1751 -2079 836 138 -202 188 -1363 2106 -1467 249
3097 249 140 175 525 -1824 2228 -1108 156 -168 -5 1072 -2070 1873 -836 317 -483 -141 1787
3114 1787 -2185 1389 -672 854 -746 -632 2036 -1864 1104 -1013 1430 -765 -1215 1901 -1285
3129 -1285 933 -1390 1467 -293 -1378 1450 -828 1173 -1855 1209 306 -969 829 -1012 1799
3144 1799 -1914 663 634 -790 485 -1211 1860 -1506 287 546 -250 343 -1397 1967 -952 -31
3160 -31 283 -293 891 -1755 1627 -298 -11 -51 -94 1261 -1733 1052 -367 195 -176 -611 1606 -1789
3178 -1789 861 -410 578 -233 -882 1797 -1365 755 -606 708 77 -1351 1435 -872 680 -969
3194 -969 880 335 -1312 1050 -717 999 -1281 390 633 -878 962 -696 1308 -994 287 544
3210 544 -585 566 -950 1429 -877 -182 253 -414 492 -935 1088 -465 -93 194 -224 634 -839
3227 -839 707 15 -257 79 -328 660 -961 429 36 -286 231 -727 935 -784 348 -20 -156 440
3245 440 -890 1001 -783 522 -220 206 458 -959 866 -773 585 -512 109 543 -952 658
3261 658 -512 621 -676 68 188 -337 291 -390 592 -533 289 99 -135 177 -182 279 -52 57 79
3280 79 43 21 -166 166 230 -296 326 -197 29 -98 -100 179 -546 284 -486 501 -312 -166 271 -516 532 -657
3302 -657 780 -426 154 146 -404 304 -514 614 -530 359 -313 57 96 -150 327 -341 662 -629 458
3321 458 -39 152 77 40 403 -383 323 -234 121 -100 50 -137 -6 5 -131 144 -258 321 -169 399 -279
3342 -279 197 -128 -135 307 -236 518 -487 510 -356 -26 6 -253 236 -311 373 -500 600 -154 164 -89
3362 -89 16 211 -422 592 -479 430 -276 19 26 -208 304 -444 363 -285 368 -195 139 -247 -57 154
3382 154 -316 263 -101 212 -225 507 -452 -22 65 -184 205 -244 264 -441 294 -40 -155 -51 -83 27 -199
3403 -199 478 -593 464 -156 295 -69 102 172 -536 608 -646 536 -354 186 34 -328 479 -585
3421 -585 484 -388 139 -71 -164 152 -126 365 -271 394 -270 -48 -94 60 55 -204 222 -204 0 -4 113 3
3443 3 -78 38 109 -104 13 -162 98 -60 -396 266 -259 293 -404 362 24 -445 610 -674 495 -558
3463 -558 424 61 -101 287 -571 770 -820 545 -219 54 -176 -404 940 -978 551 -339 262 -126
3481 -126 -353 685 -707 408 -432 482 41 -428 367 -457 486 -598 343 262 -580 281 -21 319 -306
3500 -306 -53 316 -763 444 -339 139 -125 -253 822 -568 525 -635 604 -54 -695 745 -681
3517 -681 813 -890 798 41 -513 576 -745 1093 -1383 677 -172 -140 393 -766 1256 -1219 650
3534 650 -153 328 256 -836 1184 -991 420 -262 263 103 -739 1018 -513 350 -398 248 555 -977
3552 -977 708 -221 292 -347 -256 779 -1022 789 -161 432 -68 -434 1100 -1084 525 -701 693
3569 693 -149 -841 1132 -871 847 -980 662 185 -895 903 -708 1129 -1378 846 194 -537
3585 -537 549 -760 1410 -1377 603 21 -303 400 -1006 1364 -1119 289 127 -92 288 -991 1247
3602 1247 -680 -21 154 -76 602 -1325 916 -208 42 22 -223 1088 -1327 759 -141 13 -103 -519
3620 -519 1238 -1336 482 -287 272 -155 -765 1547 -978 617 -822 501 286 -967 1171 -857
3636 -857 828 -979 726 325 -1107 980 -742 828 -832 22 568 -674 706 -618 1143 -886
3652 -886 13 652 -616 491 -768 1160 -592 -309 295 -189 532 -1139 1036 -241 -284 284 -242 870
3670 870 -1171 856 42 -183 212 -573 948 -1096 550 -43 -9 147 -668 1183 -781 227 -274 104
3688 104 52 -781 954 -585 472 -247 310 203 -875 944 -552 523 -751 282 495 -814 655
3705 655 -644 475 -668 18 542 -786 588 -522 734 -316 -193 433 -327 275 -717 773 -59
3722 -59 -273 337 -365 122 -629 597 -112 -260 244 -252 510 -636 381 102 -222 112 -261 708 -622
3741 -622 183 46 -100 35 -475 526 -571 4 88 -31 449 -571 563 -339 151 -80 -101 440 -662
3760 -662 434 -234 21 -216 19 384 -428 323 -297 219 -332 -248 344 -353 257 -490 250 -166 -220 167
3780 167 -298 208 -310 258 -32 -102 174 -28 44 -93 102 45 -112 143 -199 165 -46 -91 265 -93 66
3801 66 -200 148 18 16 255 -122 206 -212 209 -21 -78 142 -81 339 -335 193 -272 86 97 -48 143 -403
3823 -403 238 -246 279 -5 37 69 -129 298 -231 -2 -12 -25 6 114 -66 -45 153 0 7 21 213 -178 -132
3846 -132 53 -26 104 78 29 -135 3 -241 176 29 144 -78 -13 112 -190 213 -190 195 -174 9 -118
3867 -118 -55 335 -330 407 -199 74 -265 -37 -4 -165 142 -295 258 -19 213 -216 100 -66 -253 146 -164
3888 -164 245 -29 288 -79 -4 30 -98 159 15 91 -134 -85 -14 70 -5 -26 8 131 33 -90 164 -109 198
3911 198 -31 134 -92 -102 138 -273 249 -86 97 -339 -92 7 -65 121 -236 255 -169 315 -246 143 88
3932 88 -177 281 -219 180 -352 12 -66 -190 214 -165 -45 -263 138 -108 12 91 -70 68 -226 -57 148
3953 148 -4 19 -27 1 -46 -203 376 -105 -23 -108 32 108 -80 252 -336 275 -190 84 235 -283 217 -368
3975 -368 470 -362 42 96 -289 289 -475 667 -368 49 56 -4 264 -611 639 -365 227 -306 55 205
3995 205 -480 359 -196 276 -511 -73 251 -418 269 -308 254 -204 -77 145 -313 239 -199 78 -24 -396
4015 -396 353 -366 47 -375 8 311 -567 505 -266 427 -527 167 390 -548 421 -536 709 -646 238
4034 238 210 -360 395 -831 660 -695 44 84 -72 489 -675 960 -571 121 -68 -54 298 -667 722
4053 722 -235 106 -257 -101 560 -645 334 -113 297 -89 -209 633 -585 192 -33 305 -79 -531 709
4072 709 -588 291 -320 65 190 -741 776 -521 453 -511 247 564 -1031 731 -541 680 -779
4089 -779 199 741 -914 734 -752 1000 -690 127 428 -507 357 -825 974 -450 -164 243 -136
4106 -136 339 -1020 782 -228 -209 -3 -133 739 -878 533 -89 -56 20 -302 901 -829 91 84 31 -12
4126 -12 -580 999 -754 183 46 145 367 -830 1032 -605 191 -78 22 461 -1041 860 -412 389
4144 389 -562 138 559 -872 617 -428 821 -674 -138 603 -863 635 -581 705 -511 -391 666
4161 666 -399 589 -884 742 -186 -437 415 -360 511 -703 509 -68 -301 338 -351 626 -663 304
4179 304 67 -128 203 -609 694 -681 260 -57 -171 156 -611 900 -617 247 -74 -105 513 -846 982
4198 982 -520 125 -61 -210 569 -889 495 -436 160 -124 -261 480 -847 229 -390 301 -197 -142 583
4217 583 -516 403 -376 450 -87 -395 250 -369 402 -639 521 30 -357 308 -506 216 -427 371 111
4236 111 -363 343 -236 477 -449 216 214 -309 269 -572 484 -332 60 163 -348 372 -467 548 -196 0
4256 0 90 -269 434 -422 358 -139 -244 44 -265 238 -464 333 -140 41 19 -200 302 -375 322 -135 188
4277 188 85 -235 330 -425 175 -189 198 125 -174 403 -178 225 -159 158 65 -135 249 -71 146 -130 84
4298 84 -18 26 -11 -104 262 -218 18 177 -202 53 -100 70 61 40 136 -269 217 -197 66 0 -76 290 -225
4321 -225 184 -136 151 -74 -297 168 -35 160 -198 92 -92 -71 162 -96 -30 -111 163 -186 116 -74 -20
4342 -20 273 -157 -77 -66 146 -17 89 184 -129 -49 -57 68 43 -140 89 83 -53 44 -210 95 -49 -173 188 78
4366 78 45 -142 121 -71 28 59 -179 69 -136 32 -319 278 21 -72 -101 -40 217 -139 197 -365 224 -68
4388 -68 -24 91 -195 -75 -288 231 -50 -3 202 -57 29 -65 19 -21 18 -38 -80 274 62 -83 104 50 -41 -89
4412 -89 12 -66 -28 152 -73 173 -132 -68 41 -86 124 -108 211 -42 11 -58 -202 129 -94 226 -284 69
4434 69 -72 -134 -33 -189 251 -296 262 -278 199 10 -258 353 -271 281 -389 203 127 -285 150 -41 118
4455 118 -213 119 40 -2 297 -156 260 40 136 -29 -235 121 -91 186 -138 -171 194 -339 162 -170 176
4476 176 -280 -55 419 -230 230 -242 214 -80 -143 206 -298 300 -442 411 -196 -34 301 -223 516 -460
4496 -460 346 -359 21 40 -419 494 -505 355 -237 134 -11 -246 349 -503 467 -193 333 3 -362 413
4516 413 -184 259 -221 76 128 -266 265 -363 275 -259 -178 365 -382 372 -361 302 -178 -255 554 -629 469
4537 469 -355 212 97 -332 409 -400 589 -647 557 -48 -287 428 -478 779 -690 534 -48 -135 264
4556 264 -354 751 -824 575 -107 156 192 -524 811 -671 322 -158 118 194 -683 660 -413 265
4574 265 -128 31 241 -590 458 -248 237 -154 -248 561 -703 432 -116 229 73 -306 707 -614 569
4593 569 -470 469 10 -338 775 -730 594 -696 556 -3 -642 741 -913 788 -754 370
4609 370 235 -379 662 -622 779 -812 295 129 -259 380 -587 776 -555 5 121 -321 330 -588
4627 -588 687 -425 -42 187 -98 399 -692 733 -293 178 127 -317 579 -922 717 -218 -41 235
4645 235 -124 742 -792 509 -158 -16 -25 -552 861 -894 448 -317 393 60 -561 784 -652 571
4663 571 -462 392 155 -551 671 -517 501 -542 272 274 -623 514 -539 833 -384 76 339 -572
4681 -572 413 -533 453 -378 24 354 -427 469 -649 549 -217 -305 385 -349 601 -682 607 -191 -197 231
4701 231 -354 506 -698 430 -93 -174 156 -360 705 -584 464 -106 -75 370 -511 767 -595 201
4719 201 -384 -106 306 -669 637 -415 213 -103 95 250 -534 596 -451 22 -242 60 295 -546 539
4738 539 -328 86 -123 -144 274 -439 327 -104 319 -199 -90 411 -365 367 -294 251 -72 -191 315 -310
4758 -310 255 -414 265 143 -303 359 -219 385 -307 270 -37 -414 489 -294 225 -218 115 2 -69 203
4778 203 -308 277 -194 27 44 149 218 -396 245 -273 302 -49 -28 166 -337 191 -138 114 107 -183 317 -292
4800 -292 58 -47 121 126 -132 393 -311 43 -121 184 106 -185 180 -290 232 -88 76 194 -89 296 -91
4821 -91 156 -56 36 135 -191 190 -255 114 -188 -67 255 -217 45 -250 45 49 84 116 -122 88 -191 139
4843 139 -162 -176 103 -37 91 -61 175 32 -28 82 -136 -80 -15 115 17 -11 91 33 -138 -82 -78 47 -21 97
4867 97 -123 58 -66 -50 68 52 -6 7 -68 63 67 -20 -68 163 -150 126 157 -11 47 -135 80 -154 -2 -83
4891 -83 76 81 -97 142 -84 56 -120 38 -75 51 48 38 33 -74 245 39 124 36 -72 53 -13 -1 -50 47 99
4916 99 -71 -1 -33 18 198 -170 85 -113 85 211 111 216 -111 51 -83 161 43 -142 198 33 120 -52
4938 -52 141 35 -115 108 -95 138 -128 127 -243 188 33 -49 151 -235 318 -160 67 -44 -129 316 -181
4959 -181 315 -237 168 8 -24 259 -198 260 -197 120 -97 -150 118 -98 144 -151 62 185 -209 86 -279
4980 -279 80 72 18 47 -328 111 -138 261 -77 -157 241 -216 181 -170 341 -294 -137 79 -204 363 -409 443
5002 443 -208 -60 65 -306 433 -450 497 -56 43 224 -325 254 -408 409 -251 140 80 -376 490 -533
5022 -533 366 -208 74 16 -203 355 -339 344 -221 62 153 -270 330 -369 100 -73 -34 396 -338 481 -377
5043 -377 279 -109 122 261 -543 516 -255 295 -217 -3 529 -419 573 -526 499 -93 -209 484 -568
5062 -568 592 -685 557 -209 -210 360 -464 659 -501 550 -194 -164 212 -405 486 -530 572 -169
5080 -169 5 179 -385 596 -444 476 -74 -73 422 -575 625 -414 406 100 -295 378 -516 683 -516
5099 -516 64 91 -327 607 -739 623 -426 144 -139 -244 591 -564 471 -391 324 -67 -205 566 -747
5118 -747 680 -618 509 -78 -263 583 -657 695 -538 371 -107 -321 600 -480 550 -522 438
5135 438 -26 -432 531 -645 685 -487 295 152 -279 470 -554 588 -314 155 105 -412 582 -800
5153 -800 544 -268 -5 196 -361 616 -760 618 -353 76 175 -445 761 -782 820 -420 241 233 -484
5172 -484 818 -709 829 -332 254 250 -489 650 -777 508 -401 193 114 -302 703 -531 349 -580
5190 -580 189 286 -429 316 -498 437 -418 61 194 -410 317 -520 467 -150 -111 329 -435 428 -501 437 -229
5211 -229 -24 444 -617 455 -470 442 -119 -106 500 -383 549 -637 362 -79 -93 346 -371 551 -597
5230 -597 438 -156 33 273 -537 671 -494 300 -16 -40 256 -322 613 -353 220 2 42 193 -574 587
5250 587 -439 155 -93 -133 263 -331 360 -246 188 -94 -224 272 -382 254 -132 136 -74 -75 317 -470 330
5271 330 -251 81 -13 -74 406 -279 385 -234 252 0 -225 315 -542 297 -356 189 -13 -138 332 -194 274
5292 274 -295 73 -5 -215 234 -49 293 -100 -50 85 -17 152 -95 297 -43 75 20 -84 1 -76 140 -62
5314 -62 -182 66 106 329 -187 61 -174 2 42 -32 251 -345 82 22 -62 139 -134 365 -90 170 -38 -2
5336 -2 -31 -377 228 -201 246 -137 106 101 -145 8 -114 84 -78 -21 -26 -187 281 -108 -5 -41 54 117 -45 156
5360 156 -69 7 -22 112 171 -87 288 -93 218 -31 47 152 -174 42 23 99 -118 -211 149 -115 3 -76 -200
5383 -200 50 -120 108 -265 137 -49 -38 13 -152 228 -43 78 -160 73 57 -68 -48 -29 221 74 -10 59
5405 59 -106 81 -22 -28 -55 -34 212 64 101 -225 78 96 -39 -41 71 141 38 -27 -97 60 106 71 160 -21 88
5430 88 -25 -176 -115 -238 159 62 17 -93 56 55 122 82 -35 106 10 26 -53 66 64 -321 37 -8 36 144 -62
5455 -62 253 -148 235 -22 44 138 -262 198 -272 142 -120 22 -121 -150 325 -121 -44 -159 -213 -14 -119 75
5477 75 -26 229 -22 72 67 -95 109 -47 32 -181 -28 32 -170 106 -108 200 -118 -63 67 -246 113 -235
5499 -235 216 -217 -131 248 -212 223 -151 167 -154 -138 172 -88 388 -346 32 -352 -101 130 -213 319 -403
5520 -403 382 -101 19 24 -236 345 -325 368 -234 169 66 -394 407 -183 222 -175 101 74 -151 343 -219
5541 -219 249 -191 -12 57 -240 504 -368 84 -135 25 192 -348 159 -305 241 -130 36 330 -199 398
5561 398 -298 308 13 -100 273 -469 464 -402 345 -205 -62 315 -301 449 -427 264 -100 -78 345 -394
5581 -394 588 -455 413 -205 -213 196 -333 528 -294 273 -5 106 284 -433 473 -27 296 -57 1 352 -365
5602 -365 401 -303 173 97 -161 424 -446 360 -296 185 49 -346 485 -578 508 -363 150 -9 -289 412
5622 412 -420 462 -416 109 127 -197 429 -474 378 -631 236 98 -191 341 -425 473 -399 213 -87 -147
5642 -147 273 -365 487 -340 158 8 -207 335 -372 452 -54 30 0 -312 468 -607 439 -106 -88 30
5662 30 -423 466 -406 191 -205 80 164 -260 534 -377 378 -23 46 333 -442 409 -303 266 -269 58 364
5683 364 -473 527 -618 494 -218 -16 170 -383 365 -467 305 -269 -125 335 -346 484 -529 295 1
5702 1 -62 186 -283 436 -320 257 74 -78 325 -374 258 -438 351 -81 -47 74 -341 548 -349 224 7
5723 7 -240 124 -342 304 -345 336 -52 -171 218 -553 216 -258 280 -124 -101 388 -233 373 -270 326 -104
5744 -104 -238 239 -372 375 -139 255 -36 -88 273 -354 218 -266 202 -280 -65 112 -169 336 -283 78
5764 78 -7 -204 199 -188 287 -248 250 76 -292 144 -341 247 -238 92 126 -150 233 -255 169 -82 25
5785 25 207 30 270 -68 278 -103 150 10 -149 245 -301 293 -220 85 98 -175 124 -234 67 -201 70
5806 70 -176 -158 216 -42 -64 -155 125 68 87 162 -219 62 -127 -28 26 -17 192 -253 53 -169 -201 58 -186 -27
5830 -27 -121 -150 -108 -56 92 -171 105 24 81 -110 -123 107 -213 115 -190 220 -75 -141 36 -220 34 -197 52
5853 52 -112 8 100 -36 76 6 7 -17 -99 25 -120 191 76 -44 -40 -16 67 -168 207 -285 -37 -109 71 147
5877 147 99 50 23 47 75 78 121 190 -78 -111 21 9 -168 111 -271 98 -118 129 -28 -168 151 -190 13 -49
5901 -49 23 -49 -148 7 -174 73 38 106 154 44 -19 -55 123 -8 123 -216 -170 -58 -155 -21 -75 30 28 -44 32
5926 32 -90 5 -100 61 53 -95 16 -53 135 -42 8 -47 -31 116 -140 146 98 -17 -76 -285 -37 -64 5 -53
5950 -53 -23 4 19 47 -63 53 -76 44 37 69 231 -97 87 -148 60 -15 -62 -14 -21 412 -27 -118 127 14 137
5975 137 -149 159 -84 -9 -43 -27 -1 -115 166 14 -108 -112 -142 204 -50 151 -99 -9 56 2 115 -59 79
5998 79 89 139 48 3 169 -203 110 7 134 112 -181 296 -261 112 25 79 40 -89 294 -326 272 -129 -35
6021 -35 77 -332 215 -73 188 -65 -13 166 -140 415 -492 380 76 17 172 -323 251 -455 244 -16 -51
6042 -51 168 -156 303 -310 42 -160 91 172 -47 292 -220 197 -101 -153 23 -290 282 -382 70 -39 -64
6063 -64 226 -270 277 -289 143 -166 0 55 -275 267 -243 234 -60 -120 342 -190 291 -343 337 -114 18
6084 18 198 -316 437 -283 272 -88 -182 128 -433 416 -433 239 -117 3 392 -228 483 -280 82 -37 -146
6105 -146 67 -225 327 -352 146 -13 -84 130 -412 552 -284 217 -124 -59 319 -436 388 -298 137 -47 -133
6126 -133 372 -496 411 -122 212 -56 -278 358 -427 459 -118 267 -91 -180 491 -435 381 -417 43 98 -382
6147 -382 287 -322 355 -368 284 86 -162 364 -343 288 -308 189 25 -168 139 -249 545 -435 145 26
6167 26 -60 258 -657 261 -201 -109 143 -92 437 -411 325 -286 -62 41 -213 484 -415 464 -201 -121 166
6188 166 -211 372 -375 197 -206 33 29 -328 385 -327 266 -84 31 43 -243 446 -302 342 -265 -29 99
6209 99 -344 195 -302 348 -154 75 176 -355 258 -196 239 -191 -101 249 -313 305 -236 279 -37 19 297
6230 297 -124 134 -156 261 -58 -91 99 -334 431 -161 169 85 -107 34 -347 432 -258 75 -7 -76 34
6251 34 -312 246 -261 103 -53 -188 259 -175 197 -74 90 11 -128 188 -406 382 -196 214 -25 9 206
6272 206 -98 77 -263 11 -130 63 249 -24 84 -204 149 53 -39 186 -52 311 -58 97 -37 -180 286
6293 286 -138 290 -194 151 179 -220 340 -184 390 -138 -12 154 50 63 -142 205 13 -54 -80 -175 23 -258
6315 -258 76 -27 -25 25 -58 77 -227 176 -69 187 -23 -10 239 -139 -32 30 77 182 -85 139 -309 84
6337 84 44 -38 144 -196 142 -24 162 154 -55 61 -44 37 32 22 -72 40 -8 -95 -7 -136 95 -85 56 185
6361 185 -62 109 -185 176 -94 49 -16 -218 126 -190 43 -109 12 150 -47 123 -164 259 141 -97
6381 -97 112 -103 120 57 121 139 -28 14 -116 45 -142 -13 23 -2 -100 37 181 -97 11 -104 -36 238 -135
6404 -135 78 -161 -106 -16 -14 116 -73 50 -9 49 -64 -38 198 28 45 -7 -37 44 62 146 -47 164 -173 114
6428 114 22 -13 -28 -23 53 -100 14 104 28 9 -94 59 27 -35 -19 -102 142 -83 90 33 -31 148 124 117 -158 100
6454 100 47 41 -118 -143 14 -109 59 -159 -36 208 -103 233 -109 31 -62 -21 -23 -23 137 -131 137 -41 -17 98
6478 98 -154 107 -111 159 -33 13 -64 -62 33 -25 109 -74 61 46 -128 70 -229 60 36 24 -30 -138 97 18
6502 18 30 -113 89 -77 -66 34 -176 -1 111 -49 142 -178 251 -45 62 -100 55 36 -3 148 3 -48
6524 -48 -67 73 -19 -188 191 11 138 -76 -104 218 -204 155 9 211 -110 65 12 -201 284 -67 -17 -38
6546 -38 15 129 -141 69 -232 276 69 -105 232 -88 159 -217 274 -122 -39 127 -160 112 -231 104 0
6567 0 -37 19 -211 330 -170 18 140 42 -22 -178 294 -250 -112 87 123 59 -177 182 -234 92 -103 -19 90
6590 90 -364 344 -222 38 -135 -242 138 -157 271 -68 139 -25 50 250 -212 236 -306 183 17 -109 193
6611 193 -86 433 -119 165 158 -73 219 -228 265 -247 -110 141 -152 149 -300 257 -122 120 81 -135 142
6632 142 -361 227 -260 -147 -7 -125 246 -229 272 0 136 -20 -231 264 -387 237 -45 187 -51 24
6652 24 262 -269 276 -178 0 -59 -91 193 -141 219 -142 156 10 -272 249 -284 67 -113 132 -56 -251
6673 -251 68 -137 130 -157 134 116 -211 156 -203 231 -49 -72 53 -151 218 -209 347 -29 76 3 -278
6694 -278 118 -250 267 105 -87 128 -135 424 -295 110 -26 -48 119 -206 257 -319 313 -80 76 22 -272
6715 -272 425 -129 188 -93 51 92 -98 236 -178 259 11 -9 123 -127 200 -103 112 61 -16 16 -307 350
6737 350 -94 95 32 -63 322 -111 194 -185 208 -91 -131 254 -112 224 -154 67 -49 -178 -33 -130 247
6758 247 -146 92 -11 -281 158 -208 77 -235 171 91 -187 81 -106 318 -162 162 -19 108 28 -183 171
6779 171 -256 211 -89 -17 59 -177 139 9 36 -167 7 -67 -298 185 -97 70 -46 -246 -22 -155 111
6800 111 -188 110 58 -201 236 -168 39 -124 163 -46 -127 115 -125 156 -168 54 90 -38 29 -164 187
6821 187 -52 35 -62 -129 -79 -74 195 -213 -52 -18 -115 36 -135 98 -91 8 0 -34 166 -156 22 -7 -23 -7 -100
6846 -100 104 -170 -134 22 -26 50 -105 270 -172 24 -165 -6 113 -180 152 -211 29 38 34 114 -185 -29 -59
6869 -59 -60 17 -17 85 -266 -39 -165 95 49 57 -48 -45 -5 -91 -39 -135 29 180 -155 -129 -21 -173 -120 -48 28 16
6895 16 26 -143 64 128 77 52 -36 -40 -98 -212 55 -46 17 100 123 23 -24 -6 70 129 45 86 70 83 28 -123 239
6922 239 -112 -150 -88 -20 23 15 1 -115 126 -110 -140 168 -128 128 -164 2 -73 -35 -88 11 175 12 117 1
6946 1 83 79 35 173 31 57 -21 -153 -76 -11 72 -8 -70 -1 2 -47 -64 -97 -65 151 11 39 26 -135 139 -146 79
6973 79 -86 -129 -47 -81 57 -33 139 62 4 -191 -126 -9 -43 -44 75 86 53 -1 184 -49 5 14 -47 -11 -58 40 28
7000 28 95 -148 75 135 12 131 -46 -29 -6 -25 81 -94 180 -12 44 -45 -107 -6 75 92 -26 165 -105 29
7024 29 60 78 9 -157 139 -78 -123 -18 -183 164 -108 115 -74 -67 206 92 253 -165 117 109 98 -21 -132
7047 -132 176 -60 -103 -169 60 158 -171 177 -194 60 -215 -194 -26 -136 216 -108 31 -27 -77 105 -256 105
7069 105 -182 231 -95 -136 163 -68 41 -134 105 -40 -192 153 -82 321 -202 120 -67 -37 -24 -276 198
7090 198 -186 -77 64 -19 104 -327 289 -58 -7 25 -14 -32 -275 187 -234 -19 -160 -56 107 -337 235 -107
7112 -107 -54 -41 -66 179 -157 161 -148 4 17 -57 78 -161 248 -195 209 -55 39 92 -280 188 -238 112
7134 112 -76 36 59 -184 171 -303 214 -47 -103 45 -58 239 -178 51 4 -24 119 -190 343 -209 54
7155 54 88 -61 105 -77 259 -129 -98 46 -1 199 -120 151 -26 204 8 -154 273 -202 172 -130 -71 45
7177 45 -12 428 -388 139 -178 -6 -63 -254 295 -95 -38 -274 114 115 -154 133 -23 175 -198 75 -22 -99 43
7200 43 -110 213 -94 5 15 -168 173 -211 197 -118 -79 63 -85 198 -212 279 8 18 39 -93 153 -105
7222 -105 67 -11 -89 21 -138 207 -388 97 106 -66 46 -91 25 -225 102 -93 -238 -26 -50 96 -142 62
7244 62 -112 105 162 -181 123 -173 232 -19 58 -171 -230 169 -3 -86 -200 18 96 -124 162 -135 118 -1
7266 -1 -137 295 -241 168 -131 122 85 -162 182 -122 37 -138 78 128 17 274 -34 96 -169 120 58 -7
7288 -7 -15 -24 98 -57 140 73 -3 119 -71 136 -132 -9 11 -203 112 15 24 -119 -21 -6 -36 102 -131 63 -127
7313 -127 -21 24 -50 177 -53 7 -39 11 -52 -24 -74 -143 -95 -25 -97 -38 -26 -36 -231 -65 -83 65 159 -25 162 -306
7339 -306 210 -24 96 -22 -7 -147 129 -9 -131 103 14 -57 65 -74 -8 52 -77 122 21 217 -149 36
7361 36 -131 49 -15 -81 3 -145 -6 -36 -123 -169 -225 -60 -46 -64 -89 -51 -35 72 13 -245 -24 23 58 -74 -71 242
7387 242 63 -37 -72 26 -32 -238 92 -114 74 42 45 7 -3 -112 81 -62 -129 80 -92 14 68 -52 -28 -150
7411 -150 15 -68 -16 69 -163 122 -171 -25 70 -55 -68 -131 119 0 28 -22 -147 -152 -30 -85 -184 24 194 -139
7435 -139 61 1 -109 91 -87 26 -141 66 -171 71 116 -165 2 43 113 -18 -36 39 -189 -29 55 34 -99
7458 -99 -20 163 -152 -39 3 -6 113 62 -23 -150 -127 -147 -56 87 -57 119 116 37 169 36 29 186 91 191 -60
7483 -60 28 -1 -166 77 7 22 102 -132 116 -104 -190 39 -91 101 -116 102 19 73 3 -34 50 -114 -68 -64 10
7508 10 30 -37 42 -91 -15 -84 -104 -73 -35 134 -128 112 18 146 162 -44 13 -21 51 -143 54 -33 32 -84 -56 135
7534 135 5 -9 40 -144 137 -131 165 -15 -37 218 -29 -10 -52 72 57 -68 0 -95 235 -50 -58 5 -9 -91
7558 -91 16 -12 44 65 -186 77 -104 42 100 -42 25 -210 -59 218 -91 59 45 -77 -63 8 -64 -43 79 -116
7582 -116 -206 -1 -81 45 -28 22 -137 109 -223 -133 241 18 131 64 140 -55 -34 94 -68 97 23 -26 -79 -2
7606 -2 24 -128 133 -243 -117 20 -36 35 -166 88 -29 46 -155 -81 106 -215 269 -68 92 21 65 103 -113
7629 -113 350 -119 117 73 -63 -3 94 293 -171 60 94 -89 117 -36 6 -63 36 54 -3 206 -43 62 -145
7652 -145 9 -36 -221 162 60 159 -237 18 74 -48 208 -109 100 -96 -25 -158 -31 168 -245 209 -230
7673 -230 80 116 -19 61 -145 189 -265 81 -6 -46 183 -353 219 -138 59 22 -67 221 -232 13 -46 -8 10
7696 10 142 173 -22 40 -118 -143 147 -113 115 -117 60 -115 -2 -98 32 190 -166 214 41 42 13 23 97
7719 97 -167 -70 -79 31 83 -86 -32 -121 298 -24 118 64 -29 79 -150 83 -92 -107 280 -73 -9 -71 236 -201
7743 -201 -2 -17 -153 180 -177 -12 -40 -16 44 -136 102 -150 85 -49 -66 -6 -162 29 -207 55 -44 -129 0
7766 0 -177 168 -95 82 38 71 35 -242 145 -142 139 -92 -284 17 -158 189 -16 -169 -49 -204 -78 -13
7788 -13 -75 -105 50 61 -189 53 -79 113 -84 127 -98 -104 31 -141 -11 -98 24 55 -46 -32 -205 65 -11
7811 -11 38 93 -77 200 11 89 42 -107 89 -16 79 137 167 17 166 29 16 25 29 43 -57 29 -24 -72 78 -38
7837 -38 -12 -103 75 17 -74 81 -144 67 -55 87 -43 19 126 -199 21 52 82 -42 32 105 -3 7 20 -94
7861 -94 -52 82 -23 3 -17 -6 -56 94 9 -35 -60 67 -65 37 -52 -140 -86 -67 -27 -4 -98 22 60 -147 54 -36
7887 -36 -39 110 4 2 8 -72 8 -41 34 150 -26 119 -63 30 14 -73 -24 -256 170 -164 71 78 92 -60 -211 109
7913 109 65 18 -62 -35 -27 55 149 106 89 40 75 3 -245 -80 79 -17 53 82 -50 -37 58 85 -78 85 44 71 1
7940 1 -55 -16 45 92 -34 -6 -89 110 106 38 128 131 24 119 14 128 71 -14 54 185 19 -39 -73 1 131 57 76 -17
7968 -17 35 51 -8 43 74 -3 131 110 -50 119 15 -41 118 -31 66 86 -140 41 -106 -112 116 102 85 67 115 75
7994 75 21 61 -32 8 111 -75 -164 -51 -158 3 43 -26 0 -152 22 -153 86 -126 -52 9 -76 -23 -123 241
8018 241 -57 124 -48 -142 12 -166 -113 -54 4 93 -46 106 32 -16 -104 78 -96 -87 94 -28 -37 -14 49 3 -114
8043 -114 -144 -145 -101 -72 -85 45 -166 3 -54 177 -71 14 -8 -47 0 -118 38 -66 137 63 -40 50 -114 98
8067 98 30 5 -4 -4 -30 -63 103 54 69 -29 -172 125 -99 116 5 -154 100 -100 -31 -2 -33 -138 -42 102 -84
8092 -84 167 -115 -9 -58 39 -17 -20 147 -104 110 -87 49 -57 -195 96 -218 154 -195 -136 16 -56 67 -108
8115 -108 123 84 -96 -49 231 55 -116 -49 1 -151 10 -121 79 -298 124 67 -115 7 -106 19 -85 188
8137 188 116 -96 80 -245 47 -13 -4 4 73 167 -110 147 -62 15 43 -59 12 -252 224 -13 25 -58 44 133 -171
8162 -171 281 41 64 89 -8 50 56 35 -37 157 -45 -149 226 -41 -44 121 176 -8 -117 130 -231 92 -39 186
8186 186 40 -24 102 50 -28
8191b8
$$ Imaginary data points
##PAGE= N=2
##DATA TABLE= (X++(I..I)), XYDATA
0 0 0 0 0 0 0 0 8 -8 8 -16 24 -24 32 -40 48 -64 72 -88 109 -128 152 -180 212 -245 285 -326 374 -428 488
29 488 -553 624 -706 793 -887 991 -1106 1229 -1366 1511 -1673 1846 -2033 2238 -2462 2704
45 2704 -2968 3259 -3577 3925 -4310 4734 -5206 5735 -6329 7003 -7777 8671 -9720 10963
59 10963 -12463 14309 -16628 19623 -23625 29194 -37404 50512 -74244 129085 -446868 -323289
71 -323289 557820 -463617 501209 -682028 588347 -149621 -199115 228031 -214655 378181
81 378181 -472956 270465 -27796 63244 -201961 79338 202660 -233419 10071 47704
91 47704 188581 -334722 143613 87790 -40457 -111895 50130 123267 -92618 -91022 102559
102 102559 84276 -161761 52818 -51515 273489 -404304 203630 84536 -139241 83890
112 83890 -224326 488686 -521285 273065 -56753 13688 66025 -303808 474637 -398882
122 -398882 251529 -241976 245947 -45341 -238624 314611 -204396 195377 -344180 374225
132 374225 -153016 -81809 115452 -77575 175381 -318125 289288 -123438 30178 -35971
142 -35971 -25436 166566 -198610 67340 34243 17876 -72859 -14392 115771 -42076 -131018
153 -131018 174763 -72393 12081 -53545 45798 89064 -209040 197394 -139608 145639 -145660
164 -145660 32176 119520 -163823 124470 -147384 235479 -234522 100500 23694 -38593
174 -38593 37980 -130133 243828 -252889 176727 -124148 101398 -21641 -111953 195049
184 195049 -191714 180524 -200563 173312 -50993 -78166 114596 -93113 110644 -154495
194 -154495 135224 -45069 -22489 17903 -3003 25571 -47813 27119 -205 18773 -53310
205 -53310 51432 -27416 36462 -68252 56362 5279 -51189 45641 -35982 66596 -102430
216 -102430 93048 -51166 26617 -20510 -5637 54126 -89558 97587 -103880 116448 -102008
227 -102008 46600 16890 -54182 78247 -115764 147344 -137172 85344 -30782 -5248
237 -5248 39667 -79927 107603 -104524 83918 -65155 43708 -12404 -19807 35637 -38815
248 -38815 48363 -62910 65378 -49061 30867 -22870 14881 4277 -28151 41140 -42824
259 -42824 43703 -44683 39864 -27618 16291 -9058 -1150 16455 -30337 36730 -39721 45385
271 45385 -48434 41808 -24921 5380 12319 -30015 45529 -56170 56741 -49575 37570 -20159
283 -20159 153 19857 -34405 42830 -47470 47628 -41909 29583 -14516 -529 14274 -25591
295 -25591 34227 -38558 38725 -34048 25081 -13704 1406 8783 -16961 24107 -28977 30375
307 30375 -27486 21616 -14230 5937 2227 -10805 18440 -23620 25392 -22976 18000 -11522
319 -11522 4786 1927 -8661 13782 -16731 16299 -14344 11410 -8403 5720 -1130 -3008 6863
332 6863 -9859 10994 -11748 11148 -9575 5935 -1332 -3370 7826 -10094 11346 -10313 7331
345 7331 -3649 -705 4615 -8131 9659 -9192 6518 -2889 -751 4459 -7779 9007 -9063
358 -9063 7733 -5750 1948 3720 -8471 10150 -10045 11494 -13232 10164 -2813 -5332 10015
371 10015 -13123 17338 -19424 17083 -10031 2600 5283 -14296 20649 -20004 13485 -9241
383 -9241 7542 -2014 -8177 15142 -10173 427 2173 1661 -3641 1283 -3188 10728 -15777 14053
397 14053 -10006 6889 2212 -19166 30594 -27954 19990 -21227 24580 -12554 -12630 29261 -27550
410 -27550 25341 -34717 42757 -33842 14590 -1127 -10389 31306 -53714 58497 -46903 40182
422 40182 -36678 13741 30847 -64023 62241 -47530 46921 -48195 22999 20976 -45691 41836
434 41836 -35631 38816 -32474 7342 10764 -5695 -118 -13588 26034 -8551 -17592 11005 21270
447 21270 -30458 5209 8573 12720 -33108 17449 10626 -11273 -537 -10568 37291 -42338 27906
460 27906 -31599 50172 -36730 -17468 59190 -55448 48819 -78528 105678 -71015 -5556
471 -5556 52839 -59562 74159 -109738 115794 -68022 13790 9833 -30750 77398 -111107
482 -111107 85627 -36163 26093 -43071 19215 46364 -76606 43089 -12572 36205 -66078
493 -66078 40250 10935 -22512 4322 -14008 47514 -44257 1558 15878 10970 -19595 -19283
505 -19283 38901 12042 -72875 60744 -3295 -12283 -10951 -7573 81393 -125994 95583 -47809
517 -47809 32104 -9369 -61631 128955 -127306 88283 -81845 89189 -35773 -65313 114486
528 114486 -84024 60050 -96062 123242 -71674 -9054 34683 -22374 48440 -106501 119228
539 119228 -76436 47083 -52584 26442 54233 -109659 82735 -36893 48511 -75333 31690
550 31690 55007 -78594 22722 16268 6037 -22120 -16324 48660 -13623 -42310 47917 -30064
562 -30064 52123 -87083 54834 29722 -69708 43877 -39017 95906 -131976 78639 1820
573 1820 -21620 5382 -37524 108287 -133250 98466 -72650 77518 -48897 -36195 105139
584 105139 -106879 93718 -123393 144632 -82068 -27084 79953 -65598 68563 -113945
594 -113945 125477 -61212 -11417 24286 -13477 37567 -68276 46874 1616 -4389 -30932
605 -30932 30070 13991 -24605 -24292 54417 -13579 -37704 26678 11396 1089 -50868 62064
617 62064 -27025 12703 -37422 41220 2618 -41027 37406 -36780 80192 -118279 88649
628 88649 -20788 -11469 11131 -45373 117603 -152404 112251 -53768 29596 -8408 -48874
639 -48874 109571 -117913 87048 -70561 65663 -28223 -36728 68204 -49132 35384 -58358
650 -58358 73062 -37354 -11713 16403 6717 -1664 -32389 43021 -18593 3990 -18675 27031
662 27031 -5764 -11141 -4747 23455 -9264 -16351 11793 9117 549 -40690 60622 -41248 21303
675 21303 -26698 26668 7058 -51559 67896 -62522 64230 -67393 42851 4338 -37240
686 -37240 45113 -56077 80081 -87033 55809 -14405 -3273 8783 -31229 64425 -74337
697 -74337 56522 -39027 34208 -22588 -7300 34198 -40312 39089 -46412 50714 -33520 5006
709 5006 7820 -5512 10076 -26580 32811 -19397 5565 -7803 16711 -14489 6056 -6426
721 -6426 11205 -5631 -9825 20732 -23275 28363 -38559 39547 -23803 4328 6153 -13533 28288
734 28288 -45152 49099 -39561 28462 -20636 8758 10765 -29126 38397 -42560 45832 -44182
746 -44182 31365 -12246 -3845 15719 -28554 42128 -46611 39665 -28362 18458 -8895 -4723
758 -4723 18191 -26006 28049 -28662 28665 -24025 16303 -8734 2762 4083 -13054 20251
770 20251 -22798 22752 -22867 22270 -17624 9564 -1477 -5331 11778 -19167 24598 -26636
782 -26636 25866 -22939 17127 -7931 -2748 12588 -20471 26298 -30121 29109 -23253 14773
794 14773 -5664 -3353 11975 -19403 23867 -25198 23969 -20776 15062 -8479 652 7247 -14635
807 -14635 20674 -23986 24272 -21575 16381 -9564 1440 6759 -13958 18285 -20122 19796
819 19796 -17650 14291 -9607 3733 2128 -7525 11571 -15167 17933 -18944 17325 -12865
831 -12865 7122 -231 -5978 11405 -15961 18155 -17999 14762 -9781 4490 477 -4152 8217
844 8217 -11462 13387 -13378 11420 -9484 7247 -4368 -148 5438 -10011 12964 -13424 12806
857 12806 -10979 7918 -3729 -2462 8210 -11453 11781 -10094 8897 -7491 4394 515
869 515 -4946 6457 -6139 5134 -4562 4828 -4241 2512 -429 -1660 1721 -234 -151 -2141 5091
884 5091 -5295 2578 -491 2066 -3661 2717 477 -3293 3514 -3354 3654 -4445 5203 -5983 4850
899 4850 -333 -5344 7664 -6307 5956 -9389 11004 -5180 -4839 11487 -11362 10130 -10417
912 -10417 9489 -3223 -4958 10791 -14538 15954 -12867 4302 4101 -7131 7308 -11778 18118
925 18118 -16266 4077 7061 -8536 6095 -9332 15680 -15252 8222 -1173 -2494 7425 -13940
938 -13940 15666 -11992 10290 -11705 6879 8372 -21612 20430 -11124 8784 -12496 7234
950 7234 9524 -22731 21023 -12610 8269 -4222 -6343 16529 -16593 11090 -10078 8779 3753
963 3753 -21726 25714 -12094 1604 -4459 6292 7998 -26077 27400 -14885 7292 -7876 2796
976 2796 11943 -21568 20679 -21074 27883 -25280 5015 15339 -18732 16219 -28269 45673
988 45673 -41056 12437 11952 -17399 21082 -36339 47542 -36660 13526 1131 -9726 25784
1000 25784 -41192 35903 -14674 3447 -7146 1724 21226 -34849 19253 3797 -5535 -5746 2234
1013 2234 14961 -18720 4043 6270 -2113 1965 -15259 22257 -10207 -2386 -1927 6772 12056 -39600
1027 -39600 42016 -20519 7402 -12154 6104 25069 -54195 54287 -38229 29887 -22761 -3064
1039 -3064 37340 -51683 45818 -44283 48630 -33389 -6190 36089 -34552 25500 -35990 49551
1051 49551 -35069 1614 15354 -10523 11404 -27728 35753 -21740 7208 -8127 7622 10529
1063 10529 -28022 19947 -618 -504 -11070 5132 19753 -29006 8067 14688 -15677 10453
1075 10453 -21127 34253 -24344 -2106 18548 -23213 35310 -52603 49185 -20658 -4972 11144
1087 11144 -18428 43768 -65270 55228 -25206 8366 -5641 -7433 35964 -53552 46212 -34247
1099 -34247 32199 -25974 1860 23940 -30163 27463 -35558 46786 -35976 5633 13808 -12402
1111 -12402 12265 -27136 37433 -23510 518 7933 -4366 7797 -16123 11432 5058 -13500
1123 -13500 8114 -4770 11243 -9638 -10054 29755 -28526 16741 -14846 19034 -9070 -15712
1135 -15712 32835 -32719 29326 -32714 31532 -14410 -6746 17641 -23715 36283 -48616 43533
1147 43533 -23654 8232 -1724 -10591 33653 -49930 45304 -30358 21150 -14239 -2432 23940
1159 23940 -34304 31137 -26826 25042 -16427 -466 12814 -12406 8804 -12850 16634 -9183
1171 -9183 -2597 4672 2821 -6459 1538 777 4412 -8530 3136 4626 -6764 6911 -12117 18991
1185 18991 -17872 10359 -5582 4600 1732 -15952 26584 -26939 22804 -21747 19115 -6934
1197 -6934 -10802 23689 -28701 31316 -33418 28254 -14016 -1141 11551 -19592 28733 -33722
1209 -33722 28340 -17401 8857 -3361 -4725 15314 -21518 19870 -15902 14720 -12957 6996
1221 6996 586 -4877 5942 -8559 11726 -11891 8698 -6446 7469 -7010 3214 485 -1031
1234 -1031 706 -4251 9615 -12717 12919 -12728 13083 -10759 4744 2875 -8905 13643 -18925
1247 -18925 21882 -19867 14692 -8870 2692 5399 -14228 20582 -22113 20899 -18907 14463
1259 14463 -6715 -2687 10418 -15766 19035 -20924 19319 -14521 8632 -2967 -2932 8366 -12601
1272 -12601 13806 -13611 13122 -12486 10270 -5896 1498 1990 -5868 9817 -13265 15018 -14440
1285 -14440 12549 -8850 4435 787 -5339 8757 -11703 13511 -13708 12125 -9493 6913
1297 6913 -3542 -432 5512 -10435 13978 -15658 15659 -14110 10291 -4978 -1642 8159 -12973
1310 -12973 15787 -15753 14014 -11397 7363 -2665 -2471 6394 -8992 10502 -11193 11636
1322 11636 -11190 9667 -6203 1839 2472 -6346 9404 -12399 13980 -13413 10440 -5657 932
1335 932 3024 -6051 8544 -10898 11462 -10431 8034 -5050 3139 -957 -1735 5313 -8809 10665
1349 10665 -10746 9682 -8173 6319 -2869 -1644 6697 -10085 10786 -10143 9015 -7857
1361 -7857 5638 -1656 -2822 6162 -7484 7563 -7631 8231 -8008 5887 -2198 -1417 4138
1374 4138 -5444 6680 -8270 9393 -8370 5045 -595 -2659 4045 -4598 6000 -7722 7292
1387 7292 -4173 1030 711 -795 382 -934 2382 -3787 3768 -3196 2645 -3288 5120 -4522 1281
1402 1281 2920 -5393 5220 -5141 6619 -7619 6076 -2139 -2180 4627 -5334 5492 -6021 6789
1416 6789 -6753 4713 -738 -3351 5069 -4653 5508 -8032 9629 -6868 862 4338 -6264
1429 -6264 6580 -7834 8308 -6966 2851 2206 -6755 8960 -7824 4039 -1164 -130 1165
1442 1165 -4113 7654 -7305 2247 3541 -4939 3303 -2742 4015 -4369 1681 1748 -4744 6127 -5582
1457 -5582 3822 -1648 1296 -1493 -859 6009 -9911 8565 -3984 1491 -1270 -325 6082 -11504
1471 -11504 12729 -8999 3855 976 -5585 9340 -11159 11454 -10086 5841 2191 -10751
1483 -10751 14419 -11841 8114 -6409 4398 1818 -10127 14825 -13182 8669 -4682 1520
1495 1520 2263 -6661 9777 -11861 12484 -9173 2561 3351 -5946 6639 -10299 14902 -14427
1508 -14427 6836 2072 -7108 9005 -11470 13885 -12834 7473 47 -7055 12499 -14749 12199
1521 12199 -6536 1236 2144 -6391 12455 -15198 10646 -1312 -5307 7320 -8430 11353 -12090
1534 -12090 8146 -843 -5323 10098 -13334 14011 -11154 6786 -3660 -457 8064 -16254 19893
1547 19893 -16023 10798 -7459 3272 5540 -16451 22432 -21759 17421 -11624 3499 6272
1559 6272 -14486 18962 -20910 20142 -13924 2729 7879 -12413 12952 -13967 14880 -10888
1571 -10888 1501 6835 -9450 8558 -8168 7139 -3284 -1842 5170 -6660 7779 -7894
1583 -7894 3461 3177 -6945 7493 -8470 11304 -11782 5542 4195 -10469 13268 -15594 18160
1596 18160 -16315 8602 1257 -9798 16891 -23179 24701 -19240 10481 -2477 -5305 15169
1608 15169 -24165 25893 -19713 11486 -6015 -621 9597 -17612 19554 -16289 12355 -8284
1620 -8284 1966 5275 -9707 10066 -10118 10552 -7997 1367 4658 -5784 4460 -4873 6037
1633 6037 -2995 -3514 7518 -7055 5208 -3952 1077 5041 -10832 12636 -11427 9567 -6680
1646 -6680 -1100 10557 -16249 16991 -15993 15129 -10507 728 9827 -15634 17619 -18660
1658 -18660 18380 -13409 4701 3804 -9362 14056 -18179 19127 -14704 8077 -3017 -1764
1670 -1764 8218 -14318 15787 -12948 8920 -6383 2315 3843 -9003 9575 -7617 5984 -4404
1683 -4404 1138 3010 -4450 2856 -1329 617 886 -3809 5069 -2823 -635 2831 -4324 6854 -9366
1698 -9366 8979 -5383 784 2122 -5622 10123 -13178 13039 -10011 6441 -2269 -3682 9871
1711 9871 -13831 14519 -13368 11578 -7626 817 6178 -10377 12433 -13699 13354 -10452
1723 -10452 5017 277 -4146 6988 -9477 10604 -9091 6752 -4294 2238 621 -3462 4829
1736 4829 -4654 4487 -4946 4492 -3081 1142 -798 996 -529 -698 1361 -1677 2478 -4098 5696
1751 5696 -5937 5789 -5152 3319 209 -4092 7070 -8797 9730 -9986 8121 -4287 -72
1764 -72 3900 -6856 9221 -10508 10270 -8296 5498 -2471 -1106 4426 -7218 8665 -8999
1777 -8999 9026 -7914 5237 -1558 -1844 4120 -6270 7692 -8092 7542 -5478 3451 -1493
1790 -1493 -346 1912 -3367 4362 -5554 6023 -5676 5107 -3934 3110 -1202 -1445 4153 -6540
1804 -6540 7408 -7274 6605 -5232 3466 -794 -1692 4205 -6005 6377 -6513 6349 -5931
1817 -5931 4708 -2226 -545 2749 -4630 6203 -7308 8291 -7350 5090 -2086 -1116 3661 -5435
1831 -5435 6367 -7310 6967 -5622 3199 -913 -889 1752 -2689 4082 -5557 5949 -5205 4141
1845 4141 -3235 2134 -667 -1854 4759 -6543 6918 -6138 4787 -3503 1975 382 -2892 4994
1859 4994 -5368 4908 -4162 3774 -3585 2807 -673 -1176 2501 -2983 3824 -4869 6049 -6130
1873 -6130 4074 -1491 -1345 2854 -4250 5471 -6439 6403 -4498 1753 875 -2018 2651 -3058
1887 -3058 4213 -4758 4218 -2684 1126 -342 277 356 -1775 3857 -4891 4090 -2368 1504 -1325 647
1903 647 1137 -2852 3697 -2894 1502 -676 949 -1750 1783 -1045 -197 611 -344 845 -2825 5081
1919 5081 -5994 4239 -1762 -175 1339 -2773 4900 -6678 6563 -4641 1591 1104 -2488 3099
1933 3099 -3859 4722 -5622 4443 -1783 -771 1638 -1503 2394 -4433 5631 -4736 2236 333
1947 333 -1789 2459 -3149 3948 -4167 3125 -583 -2658 4207 -3515 1759 -317 158 741 -2536 4404
1963 4404 -3600 540 2153 -3632 3658 -3287 2930 -2204 608 1704 -4594 6103 -5346 3088
1977 3088 -1209 734 65 -2325 5534 -6903 5595 -3286 1710 -499 -1461 4134 -6403 7473
1991 7473 -6477 4022 -335 -2711 4348 -5468 6746 -7561 5437 -568 -4037 6057 -5874
2004 -5874 5643 -5350 3631 -457 -3226 5905 -6827 5929 -3693 749 1221 -2403 4084 -6185
2018 -6185 6591 -4004 -75 2457 -2905 3624 -5258 6176 -4432 1470 1460 -3773 5465 -6029
2032 -6029 5204 -3854 2345 137 -4163 7436 -8054 5575 -2906 1119 1022 -4793 8007 -8717
2046 -8717 6426 -3162 -260 3667 -6461 7844 -7277 6196 -4003 213 4888 -7736 7669
2059 7669 -6518 5798 -4475 1026 3747 -6829 7593 -7088 6479 -4624 1102 2198 -4681
2072 -4681 6881 -8428 8082 -4774 565 1954 -3694 5882 -8165 7656 -3987 33 2442
2085 2442 -4213 6118 -6738 4976 -2019 -673 3057 -5613 7005 -5495 2223 346 -1877 3992
2099 3992 -6618 7701 -5383 1970 544 -2648 5212 -7535 7950 -6140 3505 -1169 -2201
2112 -2201 6374 -8613 8307 -7056 5793 -3457 -1179 6334 -8519 8520 -8022 6980 -3966
2125 -3966 -615 4723 -6531 7559 -7740 6509 -3102 -693 3000 -4181 5730 -6357 4702
2138 4702 -1264 -1440 2259 -2965 3985 -3921 2013 817 -2037 2436 -3599 4132 -2690 -42 2195
2153 2195 -3063 4198 -5627 5008 -2727 -353 2297 -3907 6326 -7560 6720 -3672 942 1407
2167 1407 -4376 7391 -8658 7169 -4944 2736 -118 -3469 6661 -7545 6637 -5614 4137
2180 4137 -1444 -1831 4321 -5202 5338 -5448 4379 -1951 -786 2316 -2593 3405 -3853 3083 -928
2195 -928 -508 1225 -1326 2146 -1906 321 1116 -1503 1408 -1438 1380 244 -1888 3135 -3137 2779
2211 2779 -2607 1779 418 -2771 3988 -4305 4550 -4355 2843 -437 -1788 3093 -4597 5837 -5887
2226 -5887 4279 -2168 445 1331 -3464 5620 -5837 4957 -3831 2375 -515 -1853 3414 -3886
2240 -3886 4054 -3858 2906 -1584 -56 849 -1154 1753 -2346 2116 -1676 1190 -1100 1096 -615
2255 -615 206 -205 -44 656 -1236 1254 -1526 1799 -2504 2379 -1518 775 69 -913 2118 -3315 3843
2272 3843 -3785 3338 -2320 719 1298 -2680 3803 -4519 4614 -4114 2433 -685 -888 1829 -3045
2287 -3045 3828 -3763 3311 -2607 1516 -646 -207 1197 -1748 2495 -3096 3119 -2819 2079 -1381
2302 -1381 570 447 -1645 2689 -3013 2801 -2414 1932 -1404 785 136 -835 1575 -2088 2281 -2375
2318 -2375 2616 -2600 2211 -1012 -173 1269 -2113 2812 -3537 3711 -3056 1861 -525 -752 1614
2333 1614 -2346 2836 -3189 2999 -2517 1448 -407 -186 521 -1496 2604 -3201 3078 -2512 1826
2348 1826 -1155 605 470 -1651 2812 -3111 2707 -2036 1527 -1257 601 479 -1209 1751 -1884
2363 -1884 1689 -1879 2376 -2229 1479 -308 -745 1347 -1981 2490 -2789 2874 -2451 893 373
2378 373 -1127 1202 -1519 2094 -2538 2485 -1976 1029 -429 147 211 -1021 2255 -2987 3057 -2476
2394 -2476 1407 -613 99 936 -2429 3298 -3163 1961 -730 501 -93 -649 1340 -1678 1666 -1174
2410 -1174 669 -447 896 -1129 783 95 -980 834 -606 955 -1708 1802 -1424 379 266
2425 266 -313 341 -649 874 -1566 1782 -1759 934 -479 759 -648 -563 2485 -3312 3130 -2128
2441 -2128 1666 -1332 76 1865 -3164 3882 -3269 2555 -885 -275 910 -1297 2237 -3139 2870
2456 2870 -1177 -124 253 -48 562 -1855 2310 -1609 866 -386 -56 681 -972 822 -805 797
2472 797 -601 -1028 1872 -1353 -204 878 -192 608 -2046 2803 -2120 256 1105 -1498 2433 -3364
2488 -3364 2901 -1828 1027 -9 -1905 3993 -4447 2917 -1644 1579 -945 -1071 3637 -4012 3297
2503 3297 -2426 2292 -994 -599 2351 -2745 3125 -3610 3068 -964 -1223 1653 -1554 2514 -3858
2518 -3858 3134 -500 -1422 1910 -1832 2735 -3143 1839 211 -1377 1784 -3051 3627 -2450 334
2533 334 1206 -1217 2021 -3705 4067 -2173 -499 1658 -1591 2738 -4193 3828 -1953 213 540 -1871
2549 -1871 3759 -4542 3234 -1758 1198 -321 -1939 4588 -4741 3268 -2032 1714 -384 -2326 4570
2564 4570 -4506 3298 -2734 1795 483 -3176 3960 -3728 3177 -3425 1913 1394 -3707 3632 -3094
2579 -3094 3441 -3307 1058 1694 -3159 3002 -3267 3858 -2688 226 1750 -2287 2728 -3810 4106
2594 4106 -1985 -454 1670 -1784 2885 -4157 3819 -1496 -533 1306 -1957 3708 -4585 3057 -749
2609 -749 -296 1038 -2948 4668 -4604 2374 -540 -221 1392 -3441 5043 -4124 1971 -1034 195 1668
2625 1668 -4116 4714 -3421 2502 -1989 629 2296 -4121 4006 -2846 2862 -2508 534 2494 -3393
2640 -3393 3143 -3151 3217 -2301 -233 2322 -2654 2524 -3191 3292 -1596 -1036 1909 -1930 2158
2655 2158 -3088 2586 -366 -1342 1799 -1839 2673 -2895 1468 540 -1524 1757 -2384 3303 -2963
2670 -2963 837 922 -1500 1702 -2961 3830 -2827 784 358 -958 2203 -3772 3901 -2636 1228 -687
2686 -687 -604 2393 -3697 3458 -2442 1623 -1032 -106 2364 -3133 2642 -2026 1895 -1472 -179 2027
2702 2027 -2056 1791 -1683 1948 -798 -749 1460 -1191 1010 -1426 1139 146 -1294 1410 -932 962
2718 962 -982 292 1021 -1672 1365 -1332 1352 -903 -264 1558 -1925 1659 -1821 1987 -1115 -400
2734 -400 1337 -1619 1954 -2466 2365 -1229 242 519 -1168 1962 -2661 2290 -1333 781 -377
2749 -377 -140 1354 -1945 1943 -1472 1081 -977 161 721 -1009 872 -953 1060 -797 226 184
2765 184 -167 -87 -20 37 -63 -266 245 169 -614 546 -747 949 -897 514 -94 -377 600 -1165 1577
2784 1577 -1602 1191 -756 425 60 -772 1335 -1530 1644 -1494 1436 -792 163 441 -931 1370
2800 1370 -1607 1690 -1368 839 -327 -35 553 -1035 1182 -1286 868 -953 631 -374 2 87
2816 87 -520 795 -910 800 -735 971 -1089 660 -125 -317 720 -752 982 -1156 1116 -922
2832 -922 440 -208 -50 332 -483 738 -1234 1430 -1095 1028 -525 338 358 -653 1403 -1720 1554
2849 1554 -1374 746 -368 45 384 -875 1235 -1338 896 -552 522 -492 197 -66 -448 610
2865 610 -888 805 -1026 1406 -1048 575 143 -673 775 -887 831 -1038 969 -636 181 173 -504
2882 -504 220 -308 622 -913 1018 -897 707 -500 337 -23 -628 1157 -1447 1447 -1056 758 -271
2899 -271 255 280 -806 1119 -985 717 -603 645 -551 209 360 -753 990 -1081 749 -759
2915 -759 539 -417 -210 798 -922 847 -626 490 -387 414 -50 -237 193 -60 51 120 1 -562
2933 -562 482 -649 258 -307 573 -315 -254 836 -981 736 -777 832 -862 294 184 -435 880
2950 880 -1004 1106 -802 761 -863 572 474 -1198 1321 -1240 1152 -1397 868 2 -658 1024
2966 1024 -1399 1508 -1158 579 -189 -162 606 -892 1297 -862 98 290 -41 -58 -514 838 -549
2983 -549 -173 304 -169 381 -401 245 118 -398 102 -538 1101 -977 181 425 -424 306 -1003 1649
3001 1649 -1429 566 291 -440 893 -1755 1973 -1497 867 -571 1 1107 -1940 1872 -1270 1161
3017 1161 -1148 406 1140 -1689 1642 -1140 1317 -1277 265 817 -917 890 -1147 1351 -1012
3032 -1012 -266 711 -394 400 -1172 1259 -269 -643 759 -406 666 -1346 883 246 -851 879
3048 879 -828 1559 -1557 499 614 -844 950 -1538 2334 -1794 203 601 -566 822 -1978 2511
3064 2511 -1490 400 114 -179 1161 -2179 2157 -1227 546 -594 115 1366 -2293 1504 -867 834
3080 834 -1202 -69 1606 -2129 1046 -875 1176 -912 -723 1793 -1363 853 -1331 1457 -236
3095 -236 -1182 1591 -842 915 -1606 1001 473 -1465 1293 -953 1457 -1814 680 960 -1290 895
3111 895 -1224 2114 -1720 129 954 -1002 809 -1675 2373 -1437 -264 726 -328 1031 -2328 2255
3127 2255 -790 -207 64 -247 1386 -2276 1604 -491 321 -284 -481 1706 -2092 1185 -395 651
3143 651 -500 -1010 2051 -1558 918 -797 902 -59 -1349 1709 -982 694 -1203 767 555 -1408
3159 -1408 1226 -680 860 -1209 366 790 -1393 794 -868 1298 -1330 -130 1132 -1064 713
3174 713 -910 1627 -862 -306 1004 -736 802 -1461 1578 -507 -496 564 -491 1246 -1749 1297
3190 1297 -168 -205 410 -669 1356 -1804 829 -190 -90 170 -832 1533 -1404 698 -211 361 115
3207 115 -864 1295 -1064 515 -393 354 326 -913 1073 -719 648 -610 408 586 -984 666 -322
3224 -322 527 -527 3 741 -722 478 -395 461 -155 -288 853 -664 417 -540 399 -121 -539 718
3242 718 -593 632 -888 503 103 -632 590 -449 760 -808 694 -18 -269 482 -640 1009
3258 1009 -926 525 -157 -122 156 -513 848 -813 199 -369 122 -91 -320 506 -325 278 -329 167
3276 167 -37 -191 -12 102 -11 -78 32 115 -287 -5 135 -254 171 -376 480 -361 192 42 -6 337 -581
3297 -581 737 -514 506 -259 17 324 -471 608 -706 590 -435 239 89 -202 409 -496 410 -585
3315 -585 181 -366 202 -49 -255 261 -495 541 -322 354 -337 321 219 -262 133 -158 90 -175 345 -207
3335 -207 280 -88 -12 -50 53 91 -207 375 -377 365 -284 258 -69 -26 357 -433 686 -320 181 -533 388
3356 388 -181 125 275 -264 283 -597 423 -470 234 -129 -116 459 -313 437 -362 234 -348 225 -17 -144
3376 -144 320 -225 149 -213 257 -256 53 -98 201 91 82 115 -433 434 -429 317 -292 81 -48 -244 290
3397 290 -368 338 -261 209 -463 324 -312 -53 10 -333 380 -437 383 -514 355 -239 -102 461 -385 403
3417 403 -502 512 -383 123 143 -268 225 -316 297 -273 323 -77 89 263 -200 186 -34 145 -277 159
3437 159 32 -133 134 158 87 -151 59 141 -43 25 57 -112 150 -424 159 -35 -85 -27 -273 503 -742 384
3459 384 -264 207 157 -158 466 -744 812 -400 265 -166 -297 587 -558 595 -744 681 -389 -348
3477 -348 547 -464 581 -679 835 -319 233 204 -205 491 -669 494 -206 -17 -192 -85 629 -592
3495 -592 209 149 -56 150 -334 480 -475 -87 36 -176 354 -765 651 -270 -14 136 -313 785 -1045
3514 -1045 733 -530 -26 131 -394 891 -1160 975 -517 374 -145 -385 1113 -1048 919 -757
3530 -757 746 -254 -462 939 -788 859 -1041 850 -186 -477 640 -518 716 -803 669 189
3546 189 -498 179 -513 721 -827 273 396 -307 322 -542 976 -608 -206 546 -546 519 -906
3563 -906 996 -423 -217 400 -680 929 -1439 1176 -293 -23 243 -544 1164 -1640 1111 -267
3579 -267 304 -83 -528 1391 -1516 946 -521 549 -243 -771 1267 -986 564 -930 682 -147 -987
3596 -987 992 -737 730 -822 625 209 -913 713 -649 748 -957 422 637 -650 554 -467
3612 -467 864 -663 42 696 -556 554 -935 1123 -451 -484 645 -559 881 -1237 1077 -463
3628 -463 -451 356 -437 1271 -1528 1053 -164 -219 129 -560 1345 -1419 663 -114 206 83 -744 1335
3646 1335 -1037 325 -184 176 184 -958 1205 -785 304 -488 258 338 -1056 742 -338 534 -523
3663 -523 224 692 -934 833 -422 611 -439 -99 747 -899 532 -547 697 -407 -281 838
3679 838 -654 546 -680 851 -123 -610 778 -558 730 -774 674 -7 -414 192 -427 735 -1053
3696 -1053 727 122 -395 248 -424 914 -917 254 5 9 294 -754 1164 -634 176 -80 40 280
3714 280 -730 990 -344 242 -59 -57 480 -823 675 -214 84 -271 -148 512 -545 379 -288 244 -139
3733 -139 -216 771 -403 315 -329 391 -244 -383 568 -439 250 -479 413 24 -354 542 -486 507 -344
3752 -344 189 66 -384 604 -294 342 -398 130 207 -360 309 -259 482 -417 23 248 -323 61 -420 521
3772 521 -302 50 -32 193 342 -525 401 -87 160 -18 39 397 -297 258 -141 -118 34 11 49 -267 53 -33
3794 -33 -193 255 -333 192 -52 -54 76 -77 139 -131 381 -184 60 94 50 188 -307 142 -252 252 -94 -136
3816 -136 64 -203 291 -414 157 -306 38 223 -140 223 -266 292 -160 38 25 38 5 29 9 -67 183 -91
3838 -91 155 -150 97 30 -52 -81 68 116 -117 295 113 291 -116 19 -97 -35 96 18 105 -39 217 -338 55
3861 55 -31 -52 119 -224 239 -355 277 -90 -46 73 25 -34 -133 302 -248 188 -23 4 184 28 22 -24 96 -253
3885 -253 14 -121 71 14 40 105 -179 130 -268 -33 -142 -21 -184 -35 -94 -20 -87 9 212 -182 211 -162
3907 -162 219 25 -80 102 13 134 -298 138 -126 17 149 -6 44 -129 253 -260 290 -153 134 26 -30
3928 -30 138 -107 474 -382 282 51 -32 25 -134 245 -319 212 -186 -7 -25 -94 171 -296 288 -81 43 -24
3950 -24 -38 150 130 124 -115 17 79 -71 85 134 -115 82 -183 85 -53 212 -15 -172 165 -244 431 -392
3972 -392 46 -203 18 141 -362 547 -493 341 -254 249 95 -317 419 -418 392 -446 233 -18 -211 210
3992 210 -211 572 -519 409 62 -53 120 -287 439 -456 120 91 -10 170 -339 289 -171 -102 176 -135
4012 -135 390 -488 406 15 -352 69 -166 405 -571 335 35 -144 141 -425 911 -499 370 -163 88
4031 88 -4 -567 841 -734 290 -481 170 77 -600 719 -509 513 -634 300 350 -611 513 -401 688
4050 688 -657 211 346 -377 227 -265 491 -639 -64 351 -191 96 -469 531 -299 -278 387 -85 394
4069 394 -458 573 -67 -527 382 -316 704 -746 474 426 -357 333 -556 961 -954 377 -30 -191
4087 -191 120 -692 1026 -800 194 -184 146 182 -876 955 -568 325 -590 275 324 -960 756 -452
4105 -452 355 -576 126 508 -756 616 -376 527 -452 36 410 -672 468 -486 660 -194 -424 664
4123 664 -462 339 -773 591 -27 -684 714 -528 684 -641 578 155 -579 559 -362 941 -818
4140 -818 199 371 -362 384 -640 1107 -927 276 16 -129 358 -770 1081 -713 219 45 15 337
4158 337 -932 865 -600 154 -85 -41 471 -965 702 -91 259 -89 -129 641 -672 388 -287 349
4176 349 -251 -242 659 -572 402 -509 531 150 -452 811 -446 463 -588 541 159 -492 586 -537
4194 -537 629 -626 151 325 -571 485 -388 687 -692 33 280 -461 317 -443 917 -603 -44 357
4212 357 -243 347 -684 773 -308 -7 97 -38 565 -566 579 -81 -49 21 -10 522 -693 591 -113
4231 -113 47 -14 -78 653 -550 273 -275 86 26 -446 564 -481 75 -4 167 389 -457 509 -370 251
4251 251 -280 -169 143 -354 391 -193 263 -168 349 298 -281 366 -275 507 -264 -52 165 -194 280 -399
4271 -399 293 -151 -155 345 -211 341 -520 267 -125 11 123 -86 231 -375 381 -125 -101 86 -165 178 -172
4292 -172 188 -172 71 -44 -226 153 -310 -28 -107 287 11 -88 119 -158 23 120 -68 179 -164 165 -72
4313 -72 -134 93 -350 264 -199 126 -110 66 117 -94 206 -401 162 -98 239 -63 -55 273 -227 168 -185 197
4335 197 -65 -33 77 -56 195 -80 235 69 88 -78 233 88 -173 191 12 -66 173 1 1 25 12 -3 -65
4358 -65 57 11 72 81 -202 107 -80 36 -41 -7 107 -75 286 -94 101 -77 47 -86 -74 141 -286 163 -43
4381 -43 162 -64 105 7 -87 132 -100 214 3 25 38 32 51 -149 85 -125 -63 -17 83 -36 5 57 -213 104
4405 104 -95 -8 -20 148 60 -74 92 20 -56 17 9 41 61 -39 -15 -37 54 -174 -97 8 -277 259 -91 303 -61
4430 -61 72 -188 -195 227 -99 250 -142 204 22 34 1 -256 253 -251 351 -257 18 -76 -118 135 -333 249
4452 249 -110 152 -45 68 124 -25 295 -86 35 -155 -199 145 -52 -57 -110 124 123 -278 198 -109 -41 190 -13
4475 -13 49 -244 395 -43 -51 182 32 308 -281 361 -441 183 -144 -295 278 -480 404 -417 208 -160 -135 401
4497 401 -417 424 -379 476 117 -12 331 -427 371 -565 389 -288 -95 131 -226 379 -485 358 -256 89
4517 89 55 -195 506 -428 132 -128 91 97 -464 500 -276 52 288 -236 272 -602 529 -369 -59 241 -332
4538 -332 622 -580 457 -226 200 -38 -97 685 -889 655 -431 363 -173 -149 606 -755 452 -540
4556 -540 619 -238 -327 584 -413 605 -616 501 -48 -419 455 -429 417 -476 465 -37 -356 435 -331
4575 -331 502 -385 113 247 -346 367 -462 601 -292 11 291 -477 408 -509 793 -563 6 305 -339
4594 -339 731 -903 777 -445 4 203 -320 651 -1045 905 -420 184 44 -386 931 -951 842
4611 842 -259 105 100 -348 847 -732 501 -380 384 44 -431 655 -532 374 -288 322 -4 -584 519
4630 519 -266 331 -492 136 305 -789 645 -397 514 -498 -272 581 -633 615 -539 490 -513
4647 -513 -233 590 -567 653 -749 642 -277 -338 545 -424 663 -754 805 -66 -166 179 -346 613
4665 613 -818 689 -164 87 26 -392 691 -824 514 -111 43 24 -432 783 -697 312 36 30 483
4684 483 -658 562 -485 170 -105 -74 373 -596 716 -265 258 -111 -21 470 -629 539 -411 254 -210
4703 -210 -287 772 -657 403 -445 450 -68 -133 355 -466 361 -646 477 -19 -204 317 -521 496 -600
4722 -600 476 22 -292 465 -479 557 -647 145 112 -161 267 -268 569 -359 9 167 -149 333 -417
4741 -417 287 -314 81 176 -144 269 -385 380 -277 -33 128 -19 219 -444 420 -241 -18 -52 -107 480 -416
4762 -416 435 -126 175 -38 -226 397 -316 259 -198 50 -12 -299 332 -164 295 -146 54 -116 -369 233
4782 233 -214 214 -191 128 199 -285 411 -225 314 -310 -59 182 -106 163 -356 142 -118 110 19 -137 109
4803 109 -123 249 -101 -136 253 -88 29 -153 144 56 49 147 -172 204 -128 34 -15 6 13 -254 156 -38 112
4826 112 97 -39 57 -123 200 -116 49 -121 -217 167 -182 119 -66 106 37 -102 218 -213 52 66 154 -95
4848 -95 -73 147 -183 169 -136 23 -46 -110 48 10 -94 -22 7 -43 -71 216 -21 66 -72 -26 -1 -38 -95 45 168
4873 168 -56 -195 91 -51 59 -150 220 38 -261 144 -44 88 -30 106 -168 -36 92 -172 70 -160
4893 -160 100 -42 -78 155 -125 -16 -157 -35 -115 133 17 78 34 -165 261 -31 -35 -31 98 -26 -34 106 -90
4916 -90 33 -21 -111 91 13 75 -150 -88 -77 -72 47 -69 -21 -60 -215 56 -159 0 -123 -171 103 -59 209 -61
4940 -61 245 -133 131 -338 51 242 -97 226 -234 202 -88 24 56 -127 186 -147 167 -191 56 -6 -80
4961 -80 281 -232 151 -214 -5 54 -77 118 -281 352 -78 81 86 -81 167 -106 81 98 -71 43 -143 -82
4983 -82 -319 109 82 -47 236 -211 181 -140 61 43 -74 -29 -398 278 -206 280 -135 -63 153 -414 418 -296
5005 -296 126 -304 -113 286 -450 325 -342 305 -291 -8 219 -368 464 -497 333 -233 -88 309 -234 261
5025 261 -353 433 -168 24 127 -281 210 -432 321 37 -74 252 -231 417 -117 265 -36 -115 323 -474
5045 -474 443 -453 25 73 -272 419 -491 632 -584 85 -25 -215 397 -721 664 -470 214 109 -227
5064 -227 491 -564 606 -571 457 -209 66 314 -607 628 -529 344 -437 -160 461 -565 619
5081 619 -434 110 -166 -249 357 -327 433 -479 332 -61 -252 491 -393 390 -508 157 208 -247 386 -452
5101 -452 604 -423 28 268 -534 606 -720 595 -473 148 196 -363 473 -799 707 -553 165
5118 165 -15 -522 755 -871 631 -394 171 114 -422 745 -707 662 -342 152 -68 -478 617
5135 617 -665 541 -367 187 35 -515 592 -702 408 -251 -45 212 -588 566 -569 409 -294 6
5153 6 205 -675 540 -744 558 -220 6 507 -639 748 -617 451 -223 -58 411 -588 839 -615
5171 -615 742 -455 45 489 -693 621 -714 663 -386 -195 209 -520 469 -656 439 -374 -118
5188 -118 244 -652 361 -593 468 -116 -2 296 -477 634 -452 347 -205 -43 386 -545 657 -417
5206 -417 382 89 -266 325 -563 580 -347 253 12 -214 369 -559 616 -215 396 -225 -269 503 -597
5225 -597 442 -404 389 -240 -247 420 -560 458 -323 263 -37 -250 397 -384 392 -372 389 -63 -202 295
5245 295 -402 464 -314 136 118 -241 296 -338 407 -201 44 172 -327 287 -520 398 -346 12 90 -105 473
5266 473 -393 374 -110 105 134 -224 443 -287 304 -422 135 109 -352 287 -371 272 -293 114 -147 -263 357
5287 357 -438 245 -48 -136 -5 -70 469 -323 160 -264 152 34 -127 72 -190 37 -91 21 144 -242 173
5308 173 -122 24 -226 113 293 -104 217 -242 119 -1 -74 80 -138 124 -219 107 -152 -104 371 -143 189
5329 189 -175 22 -31 -194 136 -178 230 -119 344 -60 -141 190 -181 394 -160 99 -2 -40 -39 -69 -72 -105 181
5352 181 -24 -10 142 -201 116 -169 31 78 -51 -42 -251 28 -31 11 14 124 132 -177 55 36 40 109 1 62 -54
5377 -54 66 -89 -67 41 -68 70 -192 -7 -84 -156 97 -57 -27 -182 287 -107 66 16 155 92 -182 -14
5399 -14 -40 35 -62 -143 184 -136 63 -110 -43 190 -185 199 -80 2 -335 84 -20 -80 114 -127 118 -156 0
5422 0 -33 -3 -52 11 82 152 93 -24 -116 146 -64 137 -40 -50 41 -145 23 -79 -9 -123 -67 -63 -260 342 -69
5447 -69 -48 -39 -141 10 -82 153 -350 111 24 31 -7 -63 130 -169 221 -126 68 224 -101 151 -61 53 -94
5470 -94 -36 158 -193 190 -221 195 -115 60 63 -62 257 -207 214 -29 204 147 -60 21 -173 -19 -64 -29 -50
5493 -50 -379 140 -284 166 -189 -124 51 -210 223 -241 263 1 -97 7 -206 376 -103 198 -99 -142 156
5514 156 -138 446 -127 129 -104 -67 136 -105 187 -94 286 -51 33 269 -236 185 -337 414 -83 -101 151
5535 151 -262 344 -394 173 -82 -95 129 -217 446 -337 142 104 -139 283 -233 380 -246 259 -34 -72 266
5556 266 -215 483 -408 -121 102 -125 315 -506 508 4 123 -30 -163 512 -447 542 -363 278 -18 -311
5576 -311 359 -544 353 -154 204 -66 -175 336 -518 467 -319 227 12 -209 430 -337 481 -315 180 60
5596 60 -186 258 -289 253 -309 210 113 -161 310 -379 370 -305 80 67 -319 578 -504 465 -237 -77 271
5617 271 -209 347 -488 467 -193 -31 105 -316 538 -546 373 -322 54 183 -377 392 -527 569 -335
5636 -335 139 186 -409 659 -356 396 -196 103 17 -315 309 -403 325 -235 69 280 -242 406 -307 357
5656 357 -170 146 220 -450 409 -383 285 -281 -171 404 -408 323 -499 275 -39 -169 308 -337 684 -476
5676 -476 217 -93 -24 247 -579 457 -529 400 -46 -139 225 -519 527 -460 418 -144 -36 177 -492 422
5696 422 -349 386 -160 2 195 -377 296 -185 232 183 -108 294 -291 286 -355 240 54 -83 269 -281
5716 -281 445 -283 38 168 -52 356 -406 269 -346 126 25 -232 295 -462 544 -208 312 100 -230 220
5736 220 -309 441 -396 244 283 -36 381 -444 462 -208 -49 18 -123 312 -540 394 -282 78 -152 -152 318
5757 318 -347 267 -199 155 35 -175 207 -306 389 -199 97 12 -135 240 -270 184 -56 71 -37 -146
5777 -146 357 -156 -54 -76 -48 249 -253 292 -203 88 -331 11 145 -241 205 -192 223 -71 51 188 -283
5798 -283 104 -289 139 -149 63 53 -288 266 -354 289 42 -22 48 -71 60 -184 106 -180 -16 60 -131
5819 -131 179 2 85 -55 -6 121 -161 137 -213 62 -85 -67 73 -288 94 -194 98 25 50 235 -345 4
5841 4 -163 -4 -108 -105 236 22 126 -259 76 82 -11 59 -245 126 -58 102 62 -70 -6 -7 -49 -160 99 -80
5865 -80 -96 88 74 57 -10 55 25 -84 -31 -46 278 -102 58 -15 -6 -40 -2 100 -89 24 71 -48 50 -49 54 -20
5891 -20 -244 52 34 204 -85 -22 -65 247 -37 -157 98 76 26 -34 100 59 -119 91 124 -27 18 44 124 46
5915 46 8 -136 164 -103 -58 -41 -137 6 -130 -106 -171 -67 -251 -144 46 -105 2 -106 19 20 -122 118 -26
5938 -26 115 -49 -4 52 -141 89 17 66 92 -110 6 67 97 89 192 193 -77 322 -219 259 -168 29 28 -13 -27
5963 -27 -176 56 -57 -38 109 69 -103 -161 64 -197 167 -261 90 223 -156 150 -70 71 -73 38 124 -129
5985 -129 301 -152 190 -23 -81 52 -221 83 -290 327 -101 -89 67 -66 102 -190 220 7 29 19 -32 157
6007 157 -189 154 -100 -60 35 -263 201 -250 126 -8 113 120 -239 234 -219 255 -22 -72 255 -57 126 -292
6029 -292 194 -142 -68 84 -231 223 -194 152 -189 -62 201 -188 159 -145 253 -232 -249 91 -97 166 -358
6050 -358 177 -56 -134 92 -121 122 -402 213 -43 -143 211 -409 381 -254 55 76 -126 151 -309 574 -372
6071 -372 -90 -46 -162 144 -445 341 -164 93 -50 20 394 -423 293 -340 -13 -106 -164 234 -443 396 -217
6092 -217 158 -67 -9 401 -401 257 -106 60 -25 -144 401 -321 303 -189 220 42 -190 277 -417 205 -371
6113 -371 182 13 -231 322 -124 263 -274 35 110 -327 231 -382 528 -398 -12 142 -346 245 -513 511
6133 511 -214 -23 241 -86 262 -453 352 -236 -160 -129 -162 525 -393 455 -273 107 86 -96 222 -433 386
6154 386 -129 212 42 -280 486 -371 211 -327 -24 -4 -274 486 -411 363 -238 97 31 -321 416 -380 242
6175 242 -267 41 250 -308 366 -291 358 -201 -4 181 -308 316 -496 411 -303 -50 359 -368 366 -391
6195 -391 383 -215 -23 161 -143 393 -364 229 -177 5 224 -44 489 -448 124 25 -161 251 -202 381
6215 381 -169 72 -106 -66 252 -366 351 -315 191 14 -132 189 -371 348 -153 165 -47 -175 233 -264
6235 -264 258 -276 198 81 -176 275 -247 237 -161 232 99 -111 223 -253 143 -393 211 298 -55 321
6255 321 -328 378 -249 95 65 -116 213 -203 136 -385 -131 20 -91 110 -201 140 -230 -23 35 -121 204
6276 204 -208 231 -3 26 110 -24 192 -179 242 -55 53 -14 -134 222 -127 130 -74 90 118 -120 161
6297 161 -146 203 48 101 183 -52 191 -296 157 -71 106 161 -129 187 -90 155 -20 -39 -105 -108 242 -104
6319 -104 157 -18 -41 -17 -102 123 -131 74 -138 -58 29 -79 7 -160 116 34 -140 49 -68 118 -220 126
6341 126 -25 -3 -64 -138 3 79 -97 -21 -83 128 39 -38 106 211 -10 -40 -24 -175 68 63 16 -192 -79 32
6365 32 -146 257 -78 33 39 23 161 -123 90 141 -1 144 -44 -23 -116 -128 -83 -74 104 -76 3 -6 -11 -50 86 84
6391 84 -125 123 -37 11 25 16 170 -27 90 55 -78 -15 15 82 -78 219 38 80 9 134 45 -43 82 -203
6415 -203 1 -44 34 -70 -67 126 -76 172 56 -98 57 -149 123 146 74 -19 -31 -30 -184 49 -347 146 -2
6438 -2 -8 56 -37 143 13 102 49 -38 -48 7 -59 36 91 -84 11 216 -42 137 -47 69 -62 63 -140 -7 175
6463 175 15 -79 85 57 81 -198 -5 -198 7 76 -109 -4 9 278 -122 -74 -4 -45 -174 -17 251 -87 9
6486 9 117 24 195 -90 95 -114 68 -129 102 82 -197 -47 -89 114 -80 -6 194 -11 225 36 226 -107
6508 -107 14 186 -103 6 -148 162 -101 -18 142 -56 138 9 31 -29 -175 107 -251 166 -297 109 -133
6529 -133 -205 99 -107 235 -150 58 57 -76 -15 -88 210 -138 -145 -48 -48 37 -197 345 -26 172 -109 -119 213 -284
6553 -284 86 -47 261 -48 67 210 -174 200 -164 180 -98 -99 32 -127 65 -176 79 -29 -43 250 -147
6574 -147 -13 -283 1 -88 -252 91 -122 139 -129 138 79 -127 212 -214 202 -124 66 19 -115 97 -305
6595 -305 287 -127 146 -132 -66 125 -303 66 -29 67 27 37 87 -372 264 -28 111 48 -99 179 -304 89
6617 89 -144 -40 -53 -117 259 -302 163 -229 14 138 -91 197 -182 212 20 41 -18 -373 287 -79 190 -72
6639 -72 55 248 -209 325 -278 330 -135 -105 165 -134 141 -223 392 -208 36 196 -241 241 -460 304 130
6660 130 3 210 57 130 -302 159 -197 -88 99 -223 328 -380 184 -104 -72 -151 -194 447 -221 117 -7
6681 -7 -61 -106 -312 72 -206 210 -136 -24 300 -258 274 -149 211 -46 -77 222 -314 266 -214 173 -249 -143
6703 -143 130 -238 150 -271 179 -106 -203 205 -321 178 -318 319 -55 -139 76 -175 149 -338 210 -128 -57
6724 -57 69 -222 301 -354 250 216 -79 189 -217 241 -237 93 -94 -148 178 -250 192 -261 57 14 -18 168
6746 168 -223 208 -9 29 -122 -273 207 -244 199 -209 39 34 -187 179 -143 202 -72 31 -95 -50 220
6767 220 -273 299 -224 238 65 -132 137 -125 149 -43 147 -43 -62 133 -134 183 -217 72 30 -107 -106
6788 -106 -231 269 -34 -29 84 -72 94 -94 205 -53 -89 279 -106 203 -114 222 -121 -258 70 -103 103
6809 103 -63 162 -67 -154 23 -270 29 -183 181 -85 6 15 -101 106 -140 84 -87 -64 -13 -89 -71 -150 -100
6832 -100 -211 77 200 -54 40 -96 80 -116 -90 47 -22 74 -18 32 -209 -78 -160 -150 49 -99 71 73 -139
6855 -139 175 -129 154 51 49 -51 -109 232 -113 174 18 41 85 24 86 -126 89 -291 -38 24 4 31 -119
6878 -119 -51 -148 -39 32 -15 181 -42 111 114 -2 -122 2 101 46 18 -84 -22 82 69 -63 -65 107 4 -116
6902 -116 -17 53 -83 130 114 142 46 154 115 -21 -97 100 51 49 92 -195 -96 60 76 -87 54 -20 79 -12 132
6927 132 118 15 -33 37 -108 161 23 -64 8 239 -32 23 87 -161 24 -96 135 78 -11 118 -107 151 44
6950 44 -112 57 -9 -73 102 72 -57 -21 48 -108 24 -37 -13 156 -37 253 -45 -44 -108 -8 -195 51 70 -56
6974 -56 278 -146 75 50 45 -13 -115 58 -193 164 -37 41 -109 -139 72 -160 19 -48 6 -151 -2 82 -115
6997 -115 37 -140 -63 -26 3 215 -104 32 15 -125 83 -211 147 -39 198 12 -41 88 8 101 -211 198
7019 198 -85 23 146 -131 -38 137 100 -25 65 94 -16 150 -26 64 66 -31 184 -4 52 -161 129 62 96 99
7043 99 61 102 -56 17 30 91 78 -18 71 -63 129 -73 -191 106 -79 190 -151 151 2 -12 79 -44 182 -131
7067 -131 -54 -7 -131 41 -376 117 78 16 -210 -47 181 -140 212 -230 100 -63 12 199 -180 144 -122 307
7089 307 -46 20 191 -127 128 -169 -43 107 -249 83 -97 139 -197 61 104 -117 139 -199 63 -223 159
7110 159 228 -61 114 -137 50 -104 28 5 5 197 -226 79 -201 -36 68 -58 99 -167 210 -47 -71 -94
7132 -94 -195 149 -304 102 -281 149 -18 -83 356 -304 196 -101 -23 91 36 87 -78 204 -240 70 78 -73
7154 -73 278 -119 187 -138 93 160 -198 119 -186 202 -203 55 259 -81 26 -297 329 -341 -70 51 -219
7175 -219 71 -209 163 -6 -82 231 -204 147 10 96 70 24 -13 -85 81 -72 227 -28 -2 82 -32 188 -255
7198 -255 -34 86 -77 -30 -9 186 -224 -28 34 -53 187 -239 158 -152 89 -124 -114 53 -153 157 55 -47
7220 -47 -139 -90 180 -55 90 -117 100 -73 -72 94 -157 305 -184 142 44 2 186 -225 47 -161 185 -108
7242 -108 -159 39 -56 13 -35 122 -36 36 28 -51 161 -359 75 53 3 51 -87 189 -44 -125 79 -215 326 -191
7266 -191 167 -177 -99 70 -3 334 -107 189 -188 76 33 64 51 -302 157 20 158 96 15 74 -184 41 -112
7289 -112 -24 -122 -95 246 -68 86 -121 -43 311 107 103 -54 111 -146 15 262 -115 187 -14 -83 59 48 43
7312 43 -58 190 -48 28 75 69 57 -207 -8 52 91 40 -56 151 85 16 -104 135 13 102 -14 -23 101 27 79 -46
7338 -46 111 -70 -137 -74 2 30 -131 -159 -116 45 79 33 65 140 -59 72 -64 -18 85 90 -17 108 157 -21 88
7363 88 -40 71 -80 -25 79 -46 200 -56 193 -104 -51 130 34 73 7 97 -7 -123 39 -3 110 -66 21
7386 21 10 68 -6 85 -17 -52 -19 17 -53 -39 106 -51 -93 59 28 -92 39 -57 31 -134 42 43 122 126 -134 199
7412 199 -42 -26 -20 -152 121 -6 14 84 -85 149 -139 11 25 -77 -103 35 24 -28 -44 -10 17 53 -55 39 -102
7437 -102 -9 -88 0 88 16 0 5 49 99 160 -79 -31 86 101 96 16 160 -4 41 -75 -33 123 206 78 -46 -84 105
7464 105 -74 175 -111 185 163 45 -196 -60 10 -11 206 -80 -93 187 17 -72 -88 -88 -25 -140 119 -158 6
7487 6 40 34 -32 141 108 -80 159 -33 64 -84 47 -214 61 70 31 76 -39 -36 -38 12 31 -37 -104 70 53 -52 32
7514 32 149 -151 106 -47 66 -179 -211 25 -213 -47 84 87 60 -3 156 -75 -5 -73 -76 -106 -63 84 52 61 -158
7539 -158 85 64 -151 175 -131 206 -65 -159 273 -154 91 -64 190 -183 110 79 -23 125 -92 230 -181
7560 -181 -36 84 -160 16 -177 -66 -142 -151 44 -39 51 25 -3 121 -71 105 -246 169 -173 109 20 -40 52
7583 52 -80 194 -93 65 10 66 -122 -234 155 45 110 93 -23 54 -170 208 -98 20 0 13 83 -77 82
7606 82 -55 -4 -155 -156 214 -208 229 -159 -65 133 -97 108 -172 168 -142 218 -7 15 41 -147 137 -61
7628 -61 -20 53 -66 88 8 45 32 81 133 -70 -3 -139 12 -85 145 -58 53 37 -200 -15 -167 -179 6 -106
7652 -106 -44 -207 195 67 -123 -132 -129 172 -126 84 -9 90 120 -92 216 -149 119 -92 140 -89 -126 132 -197
7675 -197 5 -100 -8 100 6 15 -150 186 -84 114 153 -153 134 -123 297 -214 36 -10 -167 109 -173 101
7697 101 -100 4 48 -97 87 -158 11 18 -121 110 33 165 -19 240 -64 70 -32 -131 61 -165 122 176
7719 176 112 -75 69 -9 10 111 112 92 60 -8 226 -113 29 -193 -123 283 -55 186 11 57 -36 -169 141 -319
7743 -319 127 -96 -33 21 79 77 -212 57 -53 109 -123 -22 20 -173 220 -164 6 -12 -30 95 -57 42 -121
7766 -121 103 101 -17 -9 105 102 -130 13 -47 -189 32 -14 159 -77 165 -52 -8 80 -197 82 -78 17 115 16
7790 16 -33 -34 68 -41 70 71 -18 233 -76 272 -127 151 -68 81 85 169 74 99 77 -107 147 120 -129 -11 -26
7815 -26 5 21 -102 287 -279 68 145 3 -167 -14 12 -32 33 -8 -5 153 -246 148 -56 -141 173 11 -26 3
7839 3 132 -23 99 -24 8 23 -42 23 92 -67 83 108 22 -17 53 -17 55 -67 -61 8 -48 170 -41 -53 62 190
7865 190 -9 -38 169 -124 37 -57 -148 73 -221 133 -107 -2 65 96 -14 -83 30 1 48 23 112 84 9 157
7889 157 80 37 -44 30 151 33 43 -72 72 -36 -9 32 -19 -11 -139 188 39 -181 84 -69 151 -29 -118 -24
7913 -24 84 -89 -6 123 -17 3 -115 -49 -36 -179 188 -12 -2 65 85 95 -3 36 51 20 80 57 153 -9 208
7938 208 63 144 -25 -182 -80 94 -32 13 -57 -83 -148 52 -40 -28 -112 -38 -54 93 -100 -89 215 50 95 33
7962 33 -45 -100 -46 124 33 27 102 -116 24 1 -102 77 50 78 -69 114 -169 191 -14 54 164 -55 238 -82
7986 -82 41 8 -11 127 15 70 63 -32 -75 -75 101 -102 86 -111 118 17 -46 34 -110 -28 26 117 -14 30 42 -64
8012 -64 4 -100 93 -65 -61 90 -6 105 -234 -50 -4 -105 -45 -14 109 39 22 22 73 -102 -38 120 -20 155 144
8037 144 130 50 93 32 60 68 -76 -140 -85 -54 104 -147 34 -84 54 -112 -124 11 -216 -8 -81 -3 97 -117
8061 -117 162 131 139 163 -304 -49 -85 132 16 0 48 -195 42 51 -49 -3 -18 -85 60 131 -180 86 -84 -51 -156
8086 -156 -17 -74 -213 256 -167 20 -145 -70 109 21 127 -95 -136 -59 13 195 -215 104 -17 -20 -106 -77 26
8109 26 49 205 45 -29 29 24 153 22 50 -238 -70 -6 46 119 0 25 -107 -53 46 -107 214 -169 120 -110
8133 -110 184 -15 -186 2 29 186 -4 174 -18 -34 83 -130 -56 -87 150 32 -114 255 -140 246 27
8154 27 -63 -30 -170 191 -57 163 -229 93 33 -80 -40 -107 46 -96 -133 87 31 44 -61 -71 -40 36 -8 -98 -28
8179 -28 67 81 93 -107 11 61 23 -92 59 85 -26 66
8191F6
##END NTUPLES=NMR FID
##END=
