##TITLE=1H_LR-755-R3-RM1
 CCl4
 8 sc, 
 19.12.2022
##JCAMPDX= 6.0         $$ Bruker NMR JCAMP-DX V2.0
##DATA TYPE= NMR FID
##DATA CLASS= NTUPLES
##ORIGIN= UXNMR, Bruker Analytische Messtechnik GmbH
##OWNER= root
$$ XWIN-NMR		Version 3.5
$$ Mon Dec 19 14:15:10 2022 Russian Standard Time (UT+4h)  she@DPX200
##.OBSERVE FREQUENCY= 200.13135
##.OBSERVE NUCLEUS= ^1H
##.DELAY= (6, 6)
##.ACQUISITION MODE= SIMULTANEOUS
##.ACQUISITION SCHEME= undefined
##.AVERAGES= 8
##.DIGITISER RES= 18
##SPECTROMETER/DATA SYSTEM= spect
##.PULSE SEQUENCE= zg30
##.SOLVENT NAME= CDCl3
##.SHIFT REFERENCE= (INTERNAL, CDCl3, 0, 15.7039)
##AUDIT TRAIL= $$ (NUMBER, WHEN, WHO, WHERE, WHAT)
$$ ##TITLE= Audit trail, XWIN-NMR		Version 3.5
$$ ##JCAMPDX= 5.01
$$ ##ORIGIN= Bruker BioSpin GmbH
$$ ##OWNER= she
$$ F:/spectra/data/she/nmr/H-F/1/audita.txt
$$ ##AUDIT TRAIL=  $$ (NUMBER, WHEN, WHO, WHERE, WHAT)
(   1,<2022-12-19 14:13:59.51 +0400>,<she>,<DPX200>,
      <created by zg, POWCHK disabled, PULCHK disabled
       configuration hash MD5:
       00 E9 B6 7A A2 85 ED C7 34 08 36 98 17 FE 4E 26
       data hash MD5: 16K
       B6 11 E8 22 A4 9D 5D 7B 61 E4 33 E2 77 6D 1A F0>)
$$ ##END=
$$ 
$$ hash MD5
$$ 96 8F 9D 6D 1F F0 61 6F C8 1A 04 54 EE 93 44 C3
##$RELAX= 
##$RELAX= 
##$RELAX= 
##$RELAX= 
##$RELAX= 
##$RELAX= 
$$ Bruker specific parameters
$$ --------------------------
##$DU= <F:/spectra>
##$EXPNO= 1
##$NAME= <H-F>
##$PROCNO= 1
##$TYPE= <nmr>
##$USER= <she>
##$AMP= (0..31)
100 100 100 100 100 100 100 100 100 100 100 100 100 100 100 100 100 100 
100 100 100 100 100 100 100 100 100 100 100 100 100 100 
##$AQSEQ= 0
##$AQ_mod= 1
##$AUNM= <au_zg>
##$AUTOPOS= <>
##$BF1= 200.13
##$BF2= 200.13
##$BF3= 200.13
##$BF4= 200.13
##$BF5= 200.13
##$BF6= 200.13
##$BF7= 200.13
##$BF8= 200.13
##$BYTORDA= 1
##$CFDGTYP= 0
##$CFRGTYP= 5
##$CHEMSTR= <none>
##$CNST= (0..31)
1 1 145 1 1 1 1 1 1 1 1 1 1 1 1 1 1 1 1 1 1 1 1 1 1 1 1 1 1 1 1 1 
##$CPDPRG= <>
##$CPDPRG1= <>
##$CPDPRG2= <>
##$CPDPRG3= <>
##$CPDPRG4= <mlev>
##$CPDPRG5= <mlev>
##$CPDPRG6= <mlev>
##$CPDPRG7= <mlev>
##$CPDPRG8= <mlev>
##$CPDPRGB= <>
##$CPDPRGT= <>
##$D= (0..31)
0 1.2 0 0 0 0 0 0 0 0.06 0 0.03 0 0 0 0 0.0002 0 0 0 0 0 0 0 0 0 0 0 0 
0 0 0 
##$DATE= 1671444839
##$DBL= (0..7)
120 120 120 120 120 120 120 120 
##$DBP= (0..7)
150 150 150 150 150 150 150 150 
##$DBP07= 0
##$DBPNAM0= <>
##$DBPNAM1= <>
##$DBPNAM2= <>
##$DBPNAM3= <>
##$DBPNAM4= <>
##$DBPNAM5= <>
##$DBPNAM6= <>
##$DBPNAM7= <>
##$DBPOAL= (0..7)
0.5 0.5 0.5 0.5 0.5 0.5 0.5 0.5 
##$DBPOFFS= (0..7)
0 0 0 0 0 0 0 0 
##$DE= 6
##$DECBNUC= <off>
##$DECIM= 32
##$DECNUC= <off>
##$DECSTAT= 4
##$DIGMOD= 1
##$DIGTYP= 9
##$DL= (0..7)
0 120 120 120 120 120 120 120 
##$DP= (0..7)
150 150 150 150 150 150 150 150 
##$DP07= 0
##$DPNAME0= <>
##$DPNAME1= <>
##$DPNAME2= <>
##$DPNAME3= <>
##$DPNAME4= <>
##$DPNAME5= <>
##$DPNAME6= <>
##$DPNAME7= <>
##$DPOAL= (0..7)
0.5 0.5 0.5 0.5 0.5 0.5 0.5 0.5 
##$DPOFFS= (0..7)
0 0 0 0 0 0 0 0 
##$DQDMODE= 0
##$DR= 18
##$DS= 0
##$DSLIST= <SSSSSSSSSSSSSSS>
$$ [...]
##$SUBNAM2= <"">
##$SUBNAM3= <"">
##$SUBNAM4= <"">
##$SUBNAM5= <"">
##$SUBNAM6= <"">
##$SUBNAM7= <"">
##$SUBNAM8= <"">
##$SUBNAM9= <"">
##$SW= 18.05172834244
##$SWIBOX= (0..15)
0 0 2 0 0 0 0 0 0 0 0 0 0 0 0 0 
##$SW_h= 3612.71676300578
##$TD= 16384
##$TD0= 1
##$TE= 0
##$TE2= 300
##$TE3= 300
##$TEG= 300
##$TL= (0..7)
0 120 120 120 120 120 120 120 
##$TP= (0..7)
150 150 150 150 150 150 150 150 
##$TP07= 0
##$TPNAME0= <>
##$TPNAME1= <>
##$TPNAME2= <>
##$TPNAME3= <>
##$TPNAME4= <>
##$TPNAME5= <>
##$TPNAME6= <>
##$TPNAME7= <>
##$TPOAL= (0..7)
0.5 0.5 0.5 0.5 0.5 0.5 0.5 0.5 
##$TPOFFS= (0..7)
0 0 0 0 0 0 0 0 
##$TUNHIN= 0
##$TUNHOUT= 0
##$TUNXOUT= 0
##$USERA1= <user>
##$USERA2= <user>
##$USERA3= <user>
##$USERA4= <user>
##$USERA5= <user>
##$V9= 5
##$VALIST= <valist>
##$VCLIST= <CCCCCCCCCCCCCCC>
##$VD= 0
##$VDLIST= <DDDDDDDDDDDDDDD>
##$VPLIST= <PPPPPPPPPPPPPPP>
##$VTLIST= <TTTTTTTTTTTTTTT>
##$WBST= 1024
##$WBSW= 4
##$XGAIN= (0..3)
0 0 0 0 
##$XL= 0
##$YL= 0
##$YMAX_a= 575892
##$YMIN_a= -578160
##$ZGOPTNS= <>
##$ZL1= 120
##$ZL2= 120
##$ZL3= 120
##$ZL4= 120
##$ABSF1= 10
##$ABSF2= 0
##$ABSG= 5
##$ABSL= 3
##$ALPHA= 0
##$AQORDER= 0
##$ASSFAC= 0
##$ASSFACI= 0
##$ASSFACX= 0
##$ASSWID= 0
##$AUNMP= <proc_1d>
##$AZFE= 0.1
##$AZFW= 0.1
##$BCFW= 1
##$BC_mod= 2
##$BYTORDP= 1
##$COROFFS= 0
##$CY= 11.3945322036743
##$DATMOD= 1
##$DC= 2
##$DFILT= <>
##$DTYPP= 0
##$F1P= 2.36226072786647
##$F2P= -0.459571619588291
##$FCOR= 0.5
##$FTSIZE= 0
##$FT_mod= 4
##$GAMMA= 1
##$GB= 0.15
##$INTBC= 1
##$INTSCL= 1
##$ISEN= 128
##$LB= 0.24
##$LEV0= 0
##$LPBIN= 0
##$MAXI= 10000
##$MC2= 0
##$MEAN= 0
##$ME_mod= 0
##$MI= 1.114404
##$NCOEF= 0
##$NC_proc= 0
##$NLEV= 6
##$NOISF1= 3.799351
##$NOISF2= 2.8
##$NSP= 1
##$NTH_PI= 0
##$NZP= 0
##$OFFSET= 15.70392
##$PC= 1
##$PHC0= -19269.18
##$PHC1= 14.80072
##$PH_mod= 1
##$PKNL= yes
##$PPARMOD= 0
##$PSCAL= 0
##$PSIGN= 0
##$REVERSE= no
##$SF= 200.130013532006
##$SI= 16384
##$SIGF1= 3
##$SIGF2= 2
##$SINO= 400
##$SIOLD= 16384
##$SREGLST= <1H.CDCl3>
##$SSB= 0
##$STSI= 0
##$STSR= 0
##$SW_p= 3612.71676300578
##$SYMM= 0
##$S_DEV= 0
##$TDeff= 0
##$TDoff= 0
##$TI= <>
##$TILT= no
##$TM1= 0
##$TM2= 0
##$TOPLEV= 0
##$USERP1= <user>
##$USERP2= <user>
##$USERP3= <user>
##$USERP4= <user>
##$USERP5= <user>
##$WDW= 1
##$XDIM= 8192
##$YMAX_p= 0
##$YMIN_p= 0
$$ End of Bruker specific parameters
$$ ---------------------------------
##NTUPLES= NMR FID
##VAR_NAME=  TIME,          FID/REAL,        FID/IMAG
##SYMBOL=    X,             R,               I
##VAR_TYPE=  INDEPENDENT,   DEPENDENT,       DEPENDENT
##VAR_FORM=  AFFN,          ASDF,            ASDF
##VAR_DIM=   8192,          8192,            8192
##UNITS=     SECONDS,       ARBITRARY UNITS, ARBITRARY UNITS
##FACTOR=    0.0002768,     1,               1
##FIRST=     0,             0,               0
##LAST=      2.2672688,     0,               0
##MIN=       0,             -578160,         0
##MAX=       2.2672688,     575892,          0
$$ Real data points
##PAGE= N=1
##DATA TABLE= (X++(R..R)), XYDATA
$$ [...]
2324B351n279N744n400M664l538K067Lk684N057o147O103n204M013k835J136J092
$$ 2351 -2928 2816 -2584 2080 -1458 609 612 -2072 2985 -3162 2941 -2263 1750 -1085 51 1143
2340A143l135M333m599M240l936L843l359K018R2k114L422m121M695n285N196
$$ 1143 -1992 2341 -2258 1982 -1954 1889 -1470 548 640 -1474 1948 -2173 2522 -2763 2433
2355B433l922J633Q80k839L683l826M241m567L903k343P79M00q73R84j760L329
$$ 2433 -1489 144 1024 -1815 1868 -1958 2283 -2284 1619 -724 55 455 -418 566 -1194 2135
2371B135m807M958l837K638j896Q78J208l780N698o240N365l585J828p81k84K196
$$ 2135 -2672 2286 -1551 1087 -809 69 1277 -2503 3195 -3045 2320 -1265 563 -218 -502 1694
2387A694m182M853m210L027k325K497k397Q28J616l448M183m240M193m180L634
$$ 1694 -2488 2365 -1845 1182 -1143 1354 -1043 -215 1401 -2047 2136 -2104 2089 -2091 1543
2402A543j954q67L607m932M652l534K893k749J587P69k629K663j363O38j081J983
$$ 1543 -411 -1278 2329 -2603 2049 -1485 1408 -1341 246 1015 -1614 1049 -314 324 -757 1226
2418A226k450K001j224N98m48P27n3k065M256m576K980j515J589j902M72K163
$$ 1226 -1224 777 -447 151 -297 430 377 -1688 2568 -2008 972 -543 1046 -856 -384 1779
2434A779l938M138l643L382l196K896k113K20K646n514O256m943M031m158L339
$$ 1779 -2159 1979 -1664 1718 -1478 1418 -695 -475 2171 -3343 2913 -2030 2001 -2157 1182
2449A182J36m796P190o460M824l941K941n20k284M216n281N241l735Q68J138q97
$$ 1182 1318 -3478 3712 -2748 2076 -1865 1076 556 -1728 2488 -2793 2448 -1287 -419 719 -178
2465a78M96j934L817l009j81K173j238l45J02R68p72p86J972k240K561k295L97
$$ -178 318 -1616 2201 -808 -989 1184 -54 -399 -297 671 -101 -887 1085 -1155 1406 -889 -492
2482d92J989k595K131l326N773n782J805K940m677M435n493P325o764L065J153
$$ -492 1497 -1098 1033 -2293 3480 -2302 -497 2443 -2234 2201 -3292 4033 -2731 334 1487
2497A487m207O660q581Q246n355K526j013j449O217r767Q397m090J595j498k70
$$ 1487 -2720 3940 -4641 3605 -1750 776 -237 -1686 4531 -5236 3161 -929 666 -832 -1102
2512a102M765p864O946m433K890j253j855M903n154M279m791M540q05m499O417
$$ -1102 3663 -4201 2745 -1688 1202 -51 -1906 2997 -2157 2122 -2669 1871 1066 -3433 2984
2527B984m492L081m048L802O68o032P593o131M904l854O97L962o773O969p036
$$ 2984 -1508 1573 -2475 1327 1995 -4037 3556 -2575 2329 -1525 -828 3134 -3639 3330 -3706
2542c706P269m448j886O851p178O071p118Q036m475k305O654p141P237q205P290
$$ -3706 3563 -885 -2771 4080 -3098 2973 -4145 3891 -584 -2889 3765 -3376 3861 -4344 2946
2557B946k992j564L917n989R088j0249O503r60j595K286n463J0285j1009O209
$$ 2946 -46 -1610 2307 -3682 5406 -4843 1660 700 -895 1391 -4072 6213 -4796 1413
2571A413r41j309L108o979J0209r177N178j915p61N194r766J0078o451L509k388
$$ 1413 472 -837 2271 -4708 5501 -3676 1502 -413 -1174 4020 -5746 4332 -2119 1390 -998
2586i98n76O572j0847R516n242K837j523k166P338r519P660n371L874n98m844
$$ -998 -1574 4998 -5849 3667 -1575 1262 -261 -2427 4911 -4608 3052 -2319 1555 957 -3887
2601c887Q290p676N993n892M916K63o708R051p320O068o147L834J788p023Q486
$$ -3887 4403 -3273 2720 -3172 1744 2007 -4701 4350 -2970 3098 -3049 785 2573 -4450 4036
2616D036q033Q096o629J651M226o928P244q531R800p014K77N170o661P276r252
$$ 4036 -3997 4099 -2530 -879 3347 -3581 3663 -4868 4932 -2082 -1805 3365 -3296 3980 -5272
2631e272R894o156M5M039n813P970r882Q559l914j36J988m450Q509j0297O957
$$ -5272 4622 -1534 -1489 2550 -3263 4707 -5175 3384 -530 -666 1322 -3128 5381 -4916 2041
2646B041k122k24J390m434Q218q603N145j644q3K281n787P660o032L176j550k10
$$ 2041 -81 -305 1085 -3349 4869 -3734 1411 -233 -316 1965 -3822 3838 -2194 982 -568 -778
2662g78M132p871P733m518K022r21j606O064q786P480m569K459l05l529P412q488
$$ -778 3354 -4517 3216 -1302 720 -201 -1807 4257 -4529 2951 -1618 841 536 -2993 4419 -4069
2678d069P045n673M325p58m380P814p717O608o364N215j238m064O925o927O758
$$ -4069 2976 -2697 1628 870 -3510 4304 -3413 3195 -3169 2046 808 -3256 3669 -3258 3500
2693C500o840M767n43k941M359n330O651o263L124N00k153K459l638N143m480
$$ 3500 -3340 1427 884 -2057 2302 -3028 3623 -2640 484 984 -1169 1290 -2348 2795 -1685
2708a685J436J333j978K082l127L537j893n10J919k533L511m011K464L94k228
$$ -1685 -249 1084 -894 1188 -1939 1598 -295 -805 1114 -1419 2092 -1919 545 939 -1289
2723a289K746l556M925n209K953L79k486L504m769O092n718L604j176j102L516
$$ -1289 1457 -2099 2826 -2383 570 949 -1537 1967 -2802 3290 -2428 1176 0 -1102 2414
2738B414n808O621n562L965k577Q24K050m877N775m831L568k796J764M00k489
$$ 2414 -3394 3227 -2335 1630 -947 -123 1927 -2950 2825 -2006 1562 -1234 530 930 -1559
2753a559L153l159K928k432J395j84l17N00j045J605j276J91L87J21o91M75k22
$$ -1559 1594 -1565 1363 -1069 326 142 -175 325 -720 885 -391 -200 187 308 -383 92 -130
2770a30O01j297J602j049J03O76j582K575l086K968k571J937o20j353L221l989
$$ -130 471 -826 776 -273 -170 506 -1076 1499 -1587 1381 -1190 747 127 -1226 1995 -1994
2786a994L794l406K970k000J78J760k903L383l459L275k711J676o39n00J775k637
$$ -1994 1800 -1606 1364 -636 -458 1302 -1601 1782 -1677 1598 -1113 563 -76 -576 1199 -1438
2802a438K918k860K772k401J462j57j085J777j991K170k169J893j490Q10k02q0
$$ -1438 1480 -1380 1392 -1009 453 296 -789 988 -1003 1167 -1002 891 -599 211 9 -71
2818g1K17m66P85j208J775k104J983j610J330q47k13J532k612L056k972K604j892
$$ -71 146 -320 465 -743 1032 -1072 911 -699 631 -216 -429 1103 -1509 1547 -1425 1179 -713
2835g13Q89J97j229K142k490K348k346K040j555J143k65o33J370k037K417k646
$$ -713 176 373 -856 1286 -1204 1144 -1202 838 -717 426 161 -472 898 -1139 1278 -1368
2851a368K799k511J408q7j047J881k371K708k649K083j304N30K38q11J214j524
$$ -1368 1431 -1080 328 241 -806 1075 -1296 1412 -1237 846 -458 72 310 -501 713 -811
2867h11J680j780J651j443J327r40K48O04j342J796k212K336k066J555q24q9R94
$$ -811 869 -911 740 -703 624 -316 -68 536 -806 990 -1222 1114 -952 603 -221 -310 684
2884F84j561J871k011K068k012J740j273N17K00q87J710k428K911k796K309j482
$$ 684 -877 994 -1017 1051 -961 779 -494 23 223 -664 1046 -1382 1529 -1267 1042 -440
2900d40K86R61k087K702k945K870k175R96J04q09J383j696J891k065J688j078
$$ -440 -154 807 -1280 1422 -1523 1347 -828 168 272 -537 846 -850 1041 -1024 664 -414
2916d14P01m16L5N38j119J468j581J468r93O67m25J41K38q78R75n98L52n75J018
$$ -414 287 -129 -94 444 -675 793 -788 680 -313 354 -71 70 308 -570 405 -193 159 -416 602
2935F02j239J082r97J025n38l78J300k227K977l214K679j466J29R73k022L230
$$ 602 -637 445 -552 473 -65 -443 857 -1370 1607 -1607 1072 -394 -265 708 -1314 1916
2951A916m083L673k306J030R9j319K549l393L454k804K002j076k04J306j917K408
$$ 1916 -2167 1506 -800 230 329 -990 1559 -1834 1620 -1184 818 -258 -462 844 -1073 1335
2967A335k773K839j967L69O74r24J176j947K291j477J05P34q11Q59j006N49M02
$$ 1335 -1438 1401 -566 -197 477 -447 729 -1218 1073 -404 -299 435 -376 483 -523 26 428
2984D28j200J321j193J300n98j108K514k588K010j981J787n41j561L192l393L146
$$ 428 -772 549 -644 656 58 -1050 1464 -1124 886 -1095 692 151 -1410 1782 -1611 1535
3000A535l084K441p81j086K251l086M059m423L223j153m2P68k205M350n090L629
$$ 1535 -1549 892 111 -975 1276 -1810 2249 -2174 1049 -104 -146 622 -1583 2767 -2323 1306
3016A306j775P32J06k037L956m237L189k095J256K92k398L297k468J661j897J301
$$ 1306 -469 263 369 -1668 2288 -1949 1240 -855 401 693 -1705 1592 -876 785 -1112 189
3032A89J101l118K696j167Q13j162K25K111l285K448j425J173l67j735L403l086
$$ 189 1290 -1828 868 -299 514 -648 -423 1688 -1597 851 -574 599 232 -1503 1900 -1186
3048a186K076k263K209n9k974M305l396K824l430K892J8l119L966l616L934m265
$$ -1186 890 -1373 836 777 -2197 2108 -1288 1536 -1894 998 1016 -2103 1863 -1753 2181 -2084
3064b084K616N29k368K675l628N142m735J835Q10j389J626l543N335m136J114
$$ -2084 532 1061 -1307 1368 -2260 2882 -1853 -18 792 -597 1029 -2514 2821 -1315 -201
3079b01N75p40J748l871M310k256L97j13m78K688m372L251q74K90p12q21L888
$$ -201 374 -366 1382 -2489 1821 -435 -38 -151 -629 2059 -2313 938 64 354 -358 -1179 2709
3096B709m671K514n93N51l07k130M304l757K056j380J199P97l837M479k856J841
$$ 2709 -1962 552 -41 510 203 -1927 2377 -1380 676 -704 495 1292 -2545 1934 -922 919
3112I19k458J817J598m547M258k651K618k941J124K239l992L328k901L606k838
$$ 919 -1539 278 1876 -2671 1587 -1064 1554 -1387 -263 1976 -2016 1312 -1589 2017 -821
3127h21k28K776k753K275l445M286k316j174K599j874K048l922M071j169j356
$$ -821 -1049 1727 -1026 1249 -2196 2090 -226 -1400 1199 -675 1373 -2549 1522 353 -1003
3142a003J666j527K911m196K890l64p58P49j849M089m272J710L41j42J84k474
$$ -1003 663 -864 2047 -2149 741 377 -381 368 -1481 2608 -1664 46 387 245 429 -2045
3158b045M435l584J126Q1l6J165l230L825k263P48o51K8K189m018L219j067N52
$$ -2045 2390 -1194 -68 13 -23 1142 -2088 1737 -526 222 -429 -401 1788 -2230 989 -78 474
3175D74r55k85K949l985K519j095J193p74j436L344l148J934j977K152k96k417
$$ 474 -481 -766 2183 -1802 717 -378 815 41 -1395 1949 -1199 735 -1242 910 614 -1803
3191a803L282k387K058k773K521q6k383K733k205K578k958J794M07j745J737k139
$$ -1803 1479 -908 1150 -1623 898 812 -1571 1162 -1043 1535 -1423 371 778 -967 770 -1369
3207a369L052k681Q32P28r02Q10j853K984k074R0O73m57P92j756K053j096m2L48
$$ -1369 1683 -998 -166 562 -340 470 -1383 1601 -473 -383 290 -167 625 -1131 922 -174 -216 132
3225A32o87J549k014J280Pl40J28q22K168k334Q03N21n74P20j703K492k118J075
$$ 132 -555 994 -1020 260 267 -73 55 -767 1401 -933 -130 391 -183 537 -1166 1326 -792 283
3243B83l49k87J351k398K493j795J351j057L40J098k528K500j705J464j502Q74
$$ 283 -66 -353 998 -1400 1093 -702 649 -408 -68 1030 -1498 1002 -703 761 -741 133
3259A33M83j560J793j743J730j347O06K11o15Q55j507J677r17k9M34k04J34n33
$$ 133 616 -944 849 -894 836 -511 95 306 -309 546 -961 716 -201 -230 204 0 134 -399
3277c99P81l77l42N36j47p0J72m95P65p15O12o83O21o2p91J161q80P35j065J221
$$ -399 382 5 -337 199 52 -18 154 -341 424 -291 321 -362 259 197 -594 567 -313 422 -643 578
3297E78p85q8Q87j262J404j490J512j392Q48J4r11J563j770J516j016Q43p78J67
$$ 578 -207 -295 592 -670 734 -756 756 -636 212 226 -685 878 -892 624 -392 451 -327 -160
3315a60Q43j385J235p48N86p28P46m99l6M42o37N32m56O95j001J064n85r8L58
$$ -160 683 -702 533 -215 371 -357 389 -110 -146 296 -341 191 -265 430 -571 493 -92 -190 168
3334A68j91Q6l18P49j083R49m51K41m61O12k65m88J045j218J110q98P76o60L92
$$ 168 -23 63 -255 494 -589 360 -91 150 -311 301 36 -452 593 -625 485 -413 363 -297 95
3353I5L69j201J575j448J152r37O80l31l15Q46j074J030p44Q18q70Q09m95j61
$$ 95 464 -737 838 -610 542 -395 285 -46 -361 485 -589 441 -303 515 -355 454 -41 -202
3371b02N65p02P32p93J088j211O40j8m19O03o40O59q27J044p99L20P8j62J8K8
$$ -202 363 -339 393 -400 688 -523 117 99 -320 283 -357 302 -525 519 -280 40 118 -44 -26 2
3391BJ82o45R04r56Q60p07O67n53R3O80j379J486j042O99n86N61j38o27J085j096
$$ 2 184 -461 443 -513 347 -360 307 -246 -153 527 -852 634 -408 291 -295 266 128 -499 586 -510
3411e10R63j024J178r24M87j33m05R82j325J291j293J182q80K36Q47j451J337
$$ -510 453 -571 607 -317 170 37 -368 614 -711 580 -713 469 -411 -175 672 -779 558
3428E58j041R72j035N79K89p93Q74o84M44k55J48o9N0l5n0L1K73n75K94K20m23
$$ 558 -483 489 -546 33 322 -471 403 -281 163 -92 56 -13 37 2 -48 -17 256 -319 -25 195 -228
3449b28K81l31R81j145P13m10Q8K92r28J572j710J608j498J230k70j075J856j981
$$ -228 53 -278 703 -442 271 -139 -51 241 -687 885 -825 783 -715 515 245 -830 1026 -955
3467i55J961k173K011q29o55J411j850K396k582J965o93q7M54j328K269k422J534
$$ -955 1006 -1167 844 15 -640 771 -1079 1317 -1265 700 7 -80 374 -954 1315 -1107 427
3484D27n06K90pr30J900j867R18l59L15K39j275J550j004L43k48O7J043k010J539
$$ 427 -79 211 204 -726 1174 -693 225 -134 181 420 -855 695 -309 34 -214 -147 896 -1114 425
3503D25l02j30J10r03K287k730J740o32J61O14k197L324k931J874j364R39O07
$$ 425 123 -7 103 -800 1487 -1243 497 -135 26 640 -1557 1767 -1164 710 -654 285 892
3520H92k813L746l071K297k205J416O26k549L095k814K887k813J402R59k090K080
$$ 892 -1921 1825 -1246 1051 -1154 262 888 -1661 1434 -1380 1507 -1306 96 1055 -1035 1045
3536A045k447L031k697P68J130j519J582k389L026j977j41J402j417J671k572
$$ 1045 -1402 1629 -1068 -300 830 -689 893 -1496 1530 -447 -588 814 -603 1068 -1504
3551a504K398p29q70J318j578K577l205J984L41j587J573k270L664l588J619M04
$$ -1504 894 165 -705 613 -965 1612 -1593 391 732 -855 718 -1552 2112 -1476 143 547
3567E47j349K022l445M382l258J200n1n01K193m330M663k764J048o46k76K531
$$ 547 -802 1220 -2225 2157 -1101 99 48 -453 1740 -2590 2073 -691 357 -289 -565 1966
3583A966m393M080k608J696j103n65K840l630K788k068K242j325j237L165l106
$$ 1966 -2427 1653 -955 741 -362 -927 1913 -1717 1071 -997 1245 -80 -1317 1848 -1258
3598a258K161k229K335o33k022L322k743K115k261J551Q30k841L044k383K506
$$ -1258 903 -1326 1009 376 -1646 1676 -1067 1048 -1213 338 1168 -1673 1371 -1012 1494
3613A494k553O89J976l062K593k750L455k608k11K499k676K410l100L499k093
$$ 1494 -1059 -370 1606 -1456 1137 -1613 1842 -766 -977 1522 -1154 1256 -1844 1655 -438
3628d38l64J883k352L057m042L571j288o46J116j622L334m486L331q00n63O52
$$ -438 -802 1081 -1271 1786 -2256 1315 27 -619 497 -1125 2209 -2277 1054 254 -309 343
3644C43j733L597l935K389p53O5Q27k625L749k944J262n12K16J165l224L691j998
$$ 343 -1390 2207 -1728 661 -92 -27 800 -1825 1924 -1020 242 -270 -54 1111 -2113 1578 -420
3661d20N76l37r4J638l150K970j639R18o11o81K464l095K380j507J365q03j229
$$ -420 156 -181 -275 1363 -1787 1183 -456 462 -149 -830 1634 -1461 919 -588 777 -26 -1255
3678a255K936k926J984j690J706m89j731K947k629K158k119J510L31j986K352
$$ -1255 1681 -1245 739 -951 755 266 -1465 1482 -1147 1011 -1108 402 733 -1253 1099
3693A099k106K345k281P85J216k162J871j802K340k110M79J161j695J678k021
$$ 1099 -1007 1338 -943 -158 1058 -1104 767 -1035 1305 -805 -326 835 -860 818 -1203
3708a203K308j540Q4Q10j011J535k411K392j169j84P20q24J602k311J968q14j40
$$ -1203 1105 -435 -351 459 -552 983 -1428 964 -205 -389 331 -493 1109 -1202 766 -48 -188
3725a88N82j192J988k001J091k84j12O24j610K230j728N78Q9j94N72j473J964
$$ -188 394 -798 1190 -811 280 -4 -116 508 -1102 1128 -600 -22 67 -127 445 -1028 936
3742I36j230L86j23k60Q72j428J486j078P12k72n64J437j555J192q97R49p25l61
$$ 936 -294 92 -31 -291 581 -847 639 -439 273 1 -563 874 -681 511 -386 563 -162 -523
3760e23J338j653J360r85Q74m78l09R22j223J208r90N84J02o03O40n64P72j029
$$ -523 815 -838 522 -463 411 -67 -376 546 -677 531 -459 125 227 -376 264 -300 472 -557
3778e57P26J30n45M27l12K54m07L20J14l09M54n10K63Q4k54K16j65K15m82N32
$$ -557 169 299 -246 181 -131 123 -284 36 150 -159 295 -215 48 132 -122 94 -71 144 -338 194
3798A94n7m78P12o41M86n17M70j88k82P88q99P38o28M82k28m3L98p86J058q03
$$ 194 137 -341 371 -270 216 -301 169 -19 -301 487 -412 326 -302 180 -48 -91 307 -479 579 -224
3818b24K91j1k3m3k17O28p60N24l60L18j56J99r8k32M98o14L81L3j31j13K26j10
$$ -224 67 56 33 -10 -227 401 -359 165 -195 123 -33 166 68 -164 334 -280 101 134 3 -110 116 6
3840Fk53L68k0o0o9K37m74L90j48J25j70J19J14n20P76q23O52j68K0j31q4K53
$$ 6 -247 121 101 41 -28 209 -265 125 -23 102 -68 51 165 -355 421 -402 250 82 102 -29 -113 140
3862A40n71P03m74J89q2L09l15%M15o44O65m92L03k97K35J7l59N96n40L58k13
$$ 140 -431 272 -202 -13 -95 214 -101 -101 314 -330 335 -157 146 -151 84 101 -258 338 -202 156 -57
3883e7J51j06k1K37l91L00j96J04j27L20m13J96Q0j58M7K7J68m35O08m30N0J41
$$ -57 94 -12 -33 204 -187 113 -83 21 -106 214 -199 -3 77 -81 -34 -7 161 -274 334 -96 -46 95
3905I5Pj44r9M77o72O85l97J94k76K19q6l68P23p30P55n40K99k28J58J71o49Q18
$$ 95 102 -42 -141 336 -336 349 -48 146 -130 89 3 -365 358 -372 383 -157 142 -86 72 243 -406 412
3927D12o81M97l49J54m2j99N63q64Q09m52K94k52J26J14l22L84m46K89L7j56n9
$$ 412 -269 228 -121 33 -9 -208 355 -509 300 -152 142 -110 16 130 -192 192 -254 35 72 -84 -143
3948a43K34j11j50K88K8l19K28J21k66J64k75L33j82K03k13p4N36q58Q22n96M12
$$ -143 91 -20 -170 118 146 -173 55 176 -90 74 -201 132 -50 153 -60 -134 402 -456 366 -230 182
3969A82m68L28K25q25J073q66P92p31M76k6m74Q11j148J288j080N23K8j86L80
$$ 182 -286 42 267 -558 515 -351 441 -290 186 160 -314 497 -651 637 -443 80 108 -78 302
3988C02r42J396j207N68k25O8J80o38J036p28M13l10l0L97o06M03j69K85l94J15
$$ 302 -640 756 -451 117 -108 -40 140 -498 538 -190 223 -87 -117 280 -326 77 -92 193 -201 -86
4008h6M32o77K44K35o4k5m01R45r11M05j85J0O63j398J522j030N73n22R7Q52j493
$$ -86 346 -331 -87 148 84 59 -342 603 -308 97 -88 -78 585 -813 709 -321 252 -270 -173 679 -814
4029h14J484j063P27q20M10O19j278J384j307J340j057K82M44o93P82j215J581
$$ -814 670 -393 334 -486 -76 543 -735 649 -658 682 -375 -93 351 -342 440 -775 806
4046H06j150PM57k65N27j117J468r33P1J54k05P96j280R05j35k26R5l35J238j374
$$ 806 -344 -337 120 -145 382 -735 733 -200 -129 25 -180 616 -664 241 106 -120 -25 -360 878 -496
4066d96L07N97n50J91o84J441j282L16M27m13O52j456J660r18L18l08j5J127k144
$$ -496 -189 408 -142 49 -635 806 -476 -160 267 -146 506 -950 710 -208 110 -198 -213 914 -1230
4085a230J821q43O43p11mJ356k047J538j095J218j017j07J391j582J134j207J514
$$ -1230 591 -252 391 -320 -324 1032 -1015 523 -572 646 -371 -478 913 -669 465 -742 772
4102G72p82p39J342r48Q46j251J422m75q45J042o42Q85j402J002J52p52N47o74
$$ 772 -10 -749 593 -355 491 -760 662 187 -658 384 -258 627 -775 227 379 -373 174 -500
4120e00J353j382K53Q49p88L96r05J629j342qQ22o56Q52j614J882j074k3M85o51
$$ -500 853 -529 -276 573 -215 181 -724 905 -437 -445 377 -279 573 -1041 841 -233 -256 229 -422
4139d22J438k224J807n40j10O5n50J727k325J436k95R3j00o95J725j719R74o52
$$ -422 1016 -1208 599 59 -51 14 -536 1191 -1134 302 7 100 0 -695 1030 -689 285 -367
4157c67P65j56j071J510j099P36q85R28M8j444J620r08P80j061O49O45j404J312
$$ -367 398 242 -829 681 -418 318 -567 361 409 -1035 585 -323 457 -604 45 690 -714 598
4175E98j041J026q36j06J207j395J008j061J310q02o30J421j154Q54j211J390
$$ 598 -443 583 -253 -359 848 -547 461 -600 710 -92 -722 699 -455 399 -812 578
4191E78m14p02J034r37J231j490Q72L0n96O43q86J664j836J008N8m82L86q30J609
$$ 578 164 -538 496 -441 790 -700 172 202 -394 249 -637 1027 -809 199 257 -225 161 -669 940
4210I40j601P84q8j16M92j160J459j050M29j21r7O97j459J443p17L21j87k14Q41
$$ 940 -661 123 35 -81 411 -749 710 -340 89 -32 -129 568 -891 552 -165 156 -31 -245 596
4229E96j333J028n53L67k02k33Q97j140Q35n39M53j64n76J030p29N01n30N40N4
$$ 596 -737 291 -262 105 -97 -330 567 -573 262 -277 176 12 -564 466 -263 238 -292 248 302
4248C02r39J138q23O96o15K91L07r28J039r11Q23o91J31O03q30P24o84P50m98
$$ 302 -637 501 -322 374 -241 50 357 -571 468 -443 380 -311 -180 423 -407 317 -367 383 -115
4267a15j83O90p29O31o72P25l98m5L51n45O30q73Q35k49r0P5k56O04p96O76k54
$$ -115 -298 392 -337 294 -378 347 -51 -96 255 -290 340 -533 302 53 -37 38 -218 386 -410 266 12
4288A2j34J83k86O92q22L63o5n2L05m89N48l07J6J53j79K21m82M81j04j13J95
$$ 12 -122 61 -225 467 -355 8 -57 -109 196 -293 255 -52 -36 117 -62 159 -323 158 54 -59 136
4309A36k18L17n44M98k61P9J36m14M37l26K86j70J29l8l26N62o22M76j94J67j05
$$ 136 -82 235 -309 189 -72 7 143 -271 166 -160 126 -44 85 47 -279 283 -339 137 -57 110 5
4330Ej15L75n96N30k95mJ56j47J28j87L53m37K04J89l66K61L2Lk37K05l8L0k5
$$ 5 -110 265 -331 199 -96 -100 56 -91 37 -150 203 -234 -30 159 -207 54 86 89 -148 57 19 49 24
4353B4j4k8P8l0n7P0J1r4n1K13k74K11k21K23k09K18P3l23M09l35J27p5J47j22
$$ 24 10 -18 60 30 -27 43 54 -40 -91 122 -152 59 -162 61 -148 70 143 -180 229 -106 21 -54 93 -29
4377b9r2K95m22M46j78n2J61j16N4l11N02m32K69q4kj8qK63m02L18j70L5l6kK1
$$ -29 -121 174 -248 198 20 -32 129 13 67 -244 258 -174 95 11 9 -9 -17 246 -156 162 -8 27 -9 -11 10
4402A0r6K24k30O5O4j52J32J70j88L7K4pj11J02L6j49J38j91J76j73J89j08l1
$$ 10 -86 138 -92 -27 37 -115 17 187 -1 36 60 53 -58 44 80 -69 69 -122 54 -119 70 -38 -69
4425f9K47m39M02k92L42k45J27P5l13N64o16M02l37J46J43l36N18o20N61m34J50
$$ -69 178 -261 141 -151 191 -54 73 148 -165 399 -217 185 -152 -6 137 -199 319 -301 260 -174 -24
4446b4J42k89K33k86N40n55L42M0k89K90l18L77m00K16Lj23L16l72K04k2j38K01
$$ -24 118 -171 62 -224 316 -239 103 143 -146 144 -174 203 -197 19 22 -101 215 -157 47 25 -113 88
4468H8k01M10o17K61K09m31M42m18N80n29J34J80l31O65r42R43p67L99j27r8O26
$$ 88 -113 297 -320 -59 150 -281 161 -257 323 -206 -72 108 -223 442 -500 443 -324 75 -52 -150 476
4489D76j027J019o94L96k27l4M77r73J086q44P40m68m2N08r59R15p77P87n64o0
$$ 476 -551 468 -226 170 -57 -91 386 -587 499 -345 395 -73 -115 393 -566 349 -428 359 -205 -265
4509b65O65p25N44n95P43l73l00P35o37N05n41K99K01o41O76p10P74o31L47K85
$$ -265 400 -325 219 -376 367 -6 -306 429 -208 297 -244 55 256 -385 291 -419 355 -276 71 356
4529C56p54Q09q20Q91p95J70N62r70R01q75J044q78J88N20q61J295j635J533r33
$$ 356 -398 411 -409 482 -313 -143 419 -551 350 -525 519 -359 -171 349 -512 783 -852 681 -252
4548b52J03M26p14J300j809J469n88O1J50o34J207j423J047n39L24J9p25J263
$$ -252 -149 277 -437 863 -946 523 -65 -4 146 -488 719 -704 343 -196 128 147 -578 685
4566F85j121O74l71K68J64r87J334j067O65m08J8N80j139J294r16N60l04l52J198
$$ 685 -436 238 -133 135 299 -688 646 -421 244 -164 -146 434 -705 589 -327 233 -71 -423 775
4585G75j440J145j023R36m53m61J359j676J507j318J092l72o44J330j459J391
$$ 775 -665 480 -543 393 -60 -521 838 -838 669 -649 443 71 -573 757 -702 689
4601F89j403J071j46p89J288j418J510j625J163j03o41Q19j092J585j566Q24O9
$$ 689 -714 357 211 -578 710 -708 802 -823 340 237 -404 415 -677 908 -658 166 235
4618B35n25Q11j159J452j195L25K39l75Q36j409J379q01j2M77o71J079j637J416
$$ 235 -290 521 -638 814 -381 -56 183 -192 644 -765 614 -187 -199 278 -393 686 -951 465
4636D65m27j91M16q44J474j567R54k83j16M05j019J593j575J022n34K72L37j158
$$ 465 38 -153 263 -581 893 -674 280 -3 -119 286 -733 860 -715 307 -227 45 382 -776
4654g76J678j434R82p29K82M94j179J427j291J024p80K40O32j265J239j058J026
$$ -776 902 -532 450 -279 3 497 -682 745 -546 478 -302 -62 570 -695 544 -514 512
4671E12q08J87P06j114Q83p85P67l88j98P45q58P98r10P97j82m63O57p33Q56r84
$$ 512 -296 -109 597 -517 366 -419 348 -40 -238 507 -351 447 -463 334 152 -311 346 -387 469 -515
4691e15P31Q6p40Q93r06R22r81O81Rn57Q60j058J222j025L66L47n91P03j071J155
$$ -515 216 302 -438 455 -451 471 -510 171 180 -377 483 -575 647 -378 -12 335 -256 447 -624 531
4711E31r60L35K54l61N73j041J203o97J81J55l47O80r90P15m07K84j07k31O98
$$ 531 -429 -94 160 -201 372 -669 534 -163 18 173 -174 506 -484 231 -176 108 1 -230 468
4730D68q56O41m83L12n6k43N32o71N51l15J45J14n13Q31p38N35k75m5M01o83P12
$$ 468 -388 253 -230 82 26 -217 315 -356 195 -120 25 139 -374 457 -281 254 -21 -66 335 -348 364
4751C64o15M32k81P4M41q84P67m85L51j77p4L34n52M89n24M92k10l6L32m09L33
$$ 364 -251 181 -100 -26 415 -469 298 -187 164 -13 -87 247 -305 184 -340 152 -58 -94 238 -171 162
4772A62m83O41m52m3K80k85L91m59M68k87n0K13k44L96m25J59J46k17J65k61M53
$$ 162 -321 320 -132 -175 105 -180 211 -248 220 -67 -117 96 -148 248 -177 -18 128 -89 76 -185 268
4793B68l49N5P3j89K88k63K15j98J11M5r0J63k85K30j31J00Mj00K43m28L29j61
$$ 268 -81 -26 47 -142 146 -117 98 -100 11 56 -34 129 -156 74 -57 43 47 -53 190 -238 91 -70
4815g0L4J14j53K13k88K45j62K3J09j16L46m53K77j60J05R2k11J21j34K06j30
$$ -70 -36 78 -75 138 -150 95 -67 -44 65 -51 295 -158 119 -41 64 156 -55 66 -68 138 8
4836HMR5j22J83k20J16j56J54%j06R6j62J76j84J70j08R4L7lnp4P2J9p2K6J1n7
$$ 8 12 107 -15 168 -52 64 -92 62 62 -44 52 -110 66 -118 52 -56 38 75 72 67 -7 65 84 12 38 49 -8
4863hN3j17J31k05K42o8k6l2l3J01m8J16k04N7J04k17K89k15J13n2Lj8j11K03
$$ -8 45 -72 59 -146 96 28 2 -30 -63 38 -10 106 -98 -41 63 -154 135 -80 33 -19 -16 -34 -145 58
4887E8j96K66j20Po5OpK7J06j59J33j23%J05j44K12k69K30j52K1R8q7K7l5R2j05
$$ 58 -138 128 8 15 -50 -44 -51 -24 82 -77 56 -67 -67 38 -106 106 -163 67 -85 -64 34 -53 -26 -61 31 -74
4913g4J39p6K7l1N8j15k1R9J3j82J45J11j06K4p4K02j88J34o6j05K31k46J09n8
$$ -74 65 -11 16 -15 43 -72 -93 6 19 -163 -18 93 -13 11 -63 139 -49 85 19 -86 145 -101 8 -50
4937e0R1r2j8J41j78K08k39K50j76O7M2j76J95k53K95j93O1Q5k88L44j70K64k28
$$ -50 41 -51 -69 72 -106 102 -137 113 -63 4 46 -130 65 -188 107 -86 -25 60 -228 116 -54 210 -18
4960a8JJ13j81J81j18K06k67O9J7PP7k87J94mN0q3qK35k64J43p0k4Ok8J82j55
$$ -18 -17 96 -85 96 -22 184 -83 -14 3 10 87 -200 -6 -10 40 -43 -51 184 -80 63 -7 -31 -25 -53 129 -26
4986b6J25p2p3J68k91M32m56K61j68nL64o12O17l42J61j57J10J85n31O39o64N27
$$ -26 99 27 -46 122 -169 263 -193 68 -100 -105 259 -353 264 -78 83 -74 36 221 -310 329 -335 192
5008A92k48p6K08k69M92n81O04m45M8J46l83M42l07M24l97K18P7l01K58l26M15
$$ 192 -56 -132 76 -193 299 -282 322 -123 -75 71 -312 130 -177 247 -150 68 145 -156 102 -224 191
5029A91l04R8P4k23M19l59K38j85O3J85m01M29m05J84R1l11N34n97O03n40J81
$$ 191 -113 -15 59 -164 255 -104 134 -51 12 197 -204 225 -180 4 95 -216 318 -279 324 -216 -35
5050c5R0k66N00p06P31m43K74j16j68N92r81R36p35N37j52k15N07p63Q34o21M11
$$ -35 55 -211 289 -417 314 -129 145 29 -139 453 -528 408 -327 210 58 -157 350 -413 421 -200 211
5071B11k19l50O49p49P96o11M70j51l49O09n85N72o24M25Q7n16N70m94N23l90
$$ 211 -8 -358 291 -458 338 -273 197 46 -303 306 -279 293 -331 94 181 -335 235 -259 264 -126
5091a26O3L39n77N45n74P57o14K6M16n38O70q85R55o63J26L29o00R02j185J072
$$ -126 -63 276 -301 244 -330 427 -187 -161 255 -283 387 -498 457 -206 -80 249 -351 551 -634 438
5111D38n72K1L90o23R05j241J139o10N2L70p31J035j107Q14m54J94J64o50R89
$$ 438 -134 -113 277 -346 559 -682 457 -153 -101 269 -462 573 -534 280 -174 20 184 -466 523
5130E23q91O50m34J68K77p44R51q94N81k93J22L49r43R93p10M82l89l4O08r05
$$ 523 -368 282 -152 16 293 -451 500 -394 187 -106 16 365 -578 415 -295 187 -202 -236 372 -533
5150e33R50p42N04j32m26R22j015Q35o34N68k26m94R38r91R69q33N88j52m46Q39
$$ -533 417 -325 179 47 -379 543 -472 363 -271 297 71 -423 515 -476 493 -340 248 96 -350 489
5170D89r66J053j026O50m5m26O25p87J032j014N55l0m66P76r80J045q63M37J06
$$ 489 -477 576 -450 200 155 -271 354 -433 599 -415 140 110 -356 420 -560 485 -378 59 165
5189A65m05O36r31Q61m74J62P9l33P17r94Q80m81L5L32n99Q42r88O80k39O9J44
$$ 165 -240 396 -535 326 -148 14 93 -240 477 -517 363 -118 -83 249 -350 492 -496 184 -55 14 158
5210A58o04Q47q50O82m26J62K88q59J144r04P26m74J45K30p68J019r46O76m04
$$ 158 -446 401 -449 233 -193 -31 257 -602 542 -362 364 -110 35 265 -503 516 -430 246 -158
5229a58J13L97q75Q50o55P22m07k20O57p31O07n76N77m26q0N03n75N78n18M37
$$ -158 -45 352 -523 327 -328 394 -13 -233 424 -307 300 -276 301 -125 -205 298 -277 301 -217 220
5249B20k03k05M19n59O18o07M04K4k51L38m96O18n42J53J78m32N11m12N73n88
$$ 220 17 -188 231 -328 290 -317 87 111 -140 198 -298 320 -222 -69 109 -323 188 -224 349 -239
5269b39K99j7k25M81o38O69l55N0J5j91L79o43O89m47J71J88l92L63l95L76l19
$$ -239 60 43 -182 299 -339 330 -25 25 40 -151 228 -415 274 -173 -2 186 -206 157 -238 138 -181
5290a81J80Q0j88K83k91K13j94J76k5k60L54l02K41j46N0J27l68L41k52J74q8
$$ -181 -1 79 -109 174 -117 96 -98 78 53 -207 147 -155 86 -60 -10 117 -251 90 -162 12 -76
5311g6L2K46m49M88l04J53j49j0K20l39K40mM1j18LJ61l43M03j94n4N1o1N4k09
$$ -76 -44 202 -247 241 -63 90 -59 -69 151 -188 52 48 89 -29 -26 135 -208 195 1 -53 -2 -63 -9 -218
5335b18L14j89K07j6j88K23l14K92k03J23L0j81K45k63K00r7M1M4j60J96j09J43
$$ -218 96 -93 114 98 -90 133 -181 111 -92 31 61 -120 125 -138 62 -35 6 50 -110 86 -23 120
5357A20k24J88K2j28J02j01N1j21k1K17k39K21p6J31j54n7P1j97L45j05j11L0
$$ 120 -104 84 106 -22 80 -21 30 -91 -112 105 -134 87 11 142 -12 -69 2 -195 150 45 -66 -36
5379c6m4R6n8J33k01J89k3j54J92j73J43j99J93n4j41J61p8Q5r2M0M4j66K14j30
$$ -36 -80 16 -42 91 -110 79 56 -98 94 -79 64 -135 58 4 -137 24 -54 31 -61 -21 23 -143 71 -59
5403e9P2P3l4l7j14J86j81J61j47J02Pq1J20j02M3l8l0J03p4O8j56R6k1L4N0r6
$$ -59 13 86 52 15 -99 87 -94 67 -80 22 29 -52 68 -34 9 -29 -59 44 -30 38 -118 -22 -43 -9 41 -55
5429e5K34k94K69k15JM9j17K39k28K13j72J04n5nJ04j18R5q1Q5M7k13K32k27K74
$$ -55 179 -115 154 -61 -60 -11 -128 111 -117 96 -76 28 -27 -32 72 -46 49 -32 53 100 -113 119 -108 166
5453A66q4j0M1k54L43l62K57j10J0J9j08K65l80L38k43J12J25k42J33l11M04j26
$$ 166 82 72 113 -141 202 -160 97 -13 -3 16 -92 173 -207 131 -112 0 125 -117 16 -295 109 -17
5475a7M3L4k22L62j72O6k66J47J26k76L64k95K30j60P6R4l20K92l29M20j90q7
$$ -17 26 60 -162 200 28 94 -172 -25 101 -175 189 -106 124 -36 40 134 -186 106 -223 197 7 -80
5497h0L07n22M93l67K56j31m4K73m34L49l48K39J2j24L34m85N14n53L75n4q4K43
$$ -80 227 -295 198 -169 87 -44 -88 185 -249 100 -248 -9 3 -121 213 -272 242 -311 64 10 -74 169
5519A69l96O24o28M37k40p2K50m05M85l83J36N8r8K72m85N47l78K13j30n9L34
$$ 169 -227 397 -231 206 -34 -106 144 -261 224 -159 -23 35 -63 209 -276 271 -107 106 -24 -83 251
5540B51m58M40l29O9P7l16N64o95N29l53Q9M08n95O06n90N38m50J98J69n72P50
$$ 251 -207 233 -96 -27 50 -266 298 -397 132 -221 -132 276 -319 287 -303 235 -215 -17 152 -420 330
5561C30o86O03l69K25J08m88O22o57O52m44Q1J90m62O15p05O72m05P7J17l20N16
$$ 330 -356 247 -122 103 211 -277 345 -312 340 -104 -23 167 -295 320 -385 287 -118 -41 76 -244 272
5582B72o10N89k58k5J09k19M94o55N99l67R7J91n86P01o69N26k57j06L29l90O92
$$ 272 -338 251 -7 -32 77 -142 352 -303 296 -71 26 217 -369 332 -337 189 -68 -174 155 -235 457
5603D57p46M67j96j03L93o73O91n64L43o8p4L53p49P99m93K16j00j94N74p31P90
$$ 457 -289 178 -18 -121 272 -401 290 -274 69 1 -73 280 -469 330 -163 53 -47 -241 333 -398 392
5624C92o79M11K6l39N47p54O96o69N63k02l18O13o68O56n96N36j65m23P57p06
$$ 392 -287 124 150 -189 358 -396 300 -369 194 -8 -326 287 -381 275 -321 215 50 -373 384 -322
5644c22M88m25J73K14k29L57n94N82l26N2K53l79M23n04N69m67K05J38m84N32
$$ -322 166 -259 -86 128 -101 256 -338 244 -82 -30 223 -156 267 -237 332 -135 70 208 -276 256
5664B56o39O96l76L8O5k90O68p58O89n38K67J03m99O62q03P01l22M5K33m74O12
$$ 256 -383 313 -63 -25 40 -250 418 -340 349 -189 78 181 -318 344 -459 242 -80 -35 198 -276 336
5685C36p27O38l87O2K29m83O22m63M18l70J06J41l23N04n39N55m49Q4J64l52M51
$$ 336 -391 247 -140 -78 151 -332 290 -173 245 -125 -19 122 -201 303 -236 319 -130 -46 118 -234 217
5706B17n12N60l17o7K97l10L23m38M05k16k75O22n38N06n69L26J01j10J91n22
$$ 217 -295 265 -52 -119 178 -132 191 -247 158 -58 -333 289 -249 257 -312 14 115 5 196 -326
5726c26O65m58J68l0j81K82l79N34n41M22j50n5K03m48M71m06M56k76PK56m00
$$ -326 339 -119 49 19 -162 120 -259 275 -266 156 6 -49 154 -294 177 -229 227 -49 -42 214 -186
5747a86L67l37L92k79M9K02l60K40k42K86j68l2K77k52J88l33K16L9k03K26k46
$$ -186 181 -156 236 -43 6 208 -152 88 -154 132 -36 -68 209 -43 145 -188 28 67 -136 90 -156
5768a56K50k30K7K25l33L10k87L71k65jJ43j38K80l52K77j92R3J1p8K19m80N04
$$ -156 94 -136 -109 116 -217 93 -194 177 -88 -89 54 -84 196 -156 121 -71 22 33 -45 174 -306 198
5790A98k07o1J32j67J97l63M17k78R6J0j08K94l54K95j41L3J06k08K94k98N1K00
$$ 198 -9 -70 62 -105 92 -271 146 -132 -36 -26 -134 160 -194 101 -40 -7 99 -109 185 -113 -62 138
5812A38j41p4N8O3j01mR8j31J72k06J85p6M7q3k5K02k40K44j81J35k07R6K22m36
$$ 138 -3 -77 -19 44 -57 -61 37 -94 78 -128 57 -19 28 -55 -80 122 -118 126 -55 80 -127 -31 191 -245
5836b45L02j94P3%oJ15j17K05k48P6J52j95K67k34J94k47J59qJ2Lj79J85j88M7
$$ -245 57 -137 -64 -64 -70 45 -72 133 -115 -39 113 -82 185 -49 145 -102 57 49 61 64 -115 70 -118 -71
5860g1N0lP0j44J51j02J15j26J15J02k21N0r1K22k8j70J36j48K00j48j1M3o9M2
$$ -71 -21 -24 46 -98 53 -49 66 -60 55 157 -64 -14 -105 117 89 -81 55 -93 107 -41 -52 -9 -78 -36
5884c6m4R5J6m8m7O8J09j14lJ9j00M3q7K31j58R6n1K7J09r9J16k71J70q9L4M6
$$ -36 -80 15 31 -17 -64 4 113 -1 -4 15 -85 -42 -129 102 -56 40 -11 16 125 26 142 -129 41 -48 -14 32
5910C2J9q2m2K36p8j17K9p5J76j68P3j5R5j22PJ26j36K0Q1j59O6M8m5j2O4K5j51
$$ 32 51 -31 -73 163 85 -32 -3 -78 98 -70 3 -12 83 -39 -32 94 -42 -22 59 -100 -34 14 -31 -43 21 46 -105
5937a05J72k70L44j99K3K9J1K8o9J39r6j59J85K5m7q6P3r3J5QM4N2j28K18k36
$$ -105 67 -203 141 -58 -35 -6 5 33 -36 103 7 -152 33 58 11 -75 -2 -95 -80 -72 -28 24 -104 114 -122
5962a22R7o7L4J57j46Q1q0P3N8l0L6k71K60j06k1J4k8O6j37L02l26L72j71j79
$$ -122 -25 -92 -58 99 -47 34 -46 27 85 55 91 -180 80 -26 -47 -33 -61 5 -132 170 -156 216 45 -134
5986a34J93k76K29j38K14R4k42R0j66J55r4R7l3n3J65k30K32p5Oj2p2J86k36J99
$$ -134 59 -217 12 -126 88 182 -60 30 -136 19 -75 22 -11 -64 101 -129 103 28 34 22 -50 136 -100 99
6010I9j67N2J19k02L25m24L59k74J29J35l33L28k24J61j88Q7J40l20L92l97L80
$$ 99 -68 -16 103 -99 226 -198 161 -113 16 151 -182 146 -78 83 -105 -18 122 -198 194 -203 177
6031A77k62R8K2k33L91m81M51j93J11M5l07L88m56M84k10m4K46m50M72m51L98
$$ 177 -85 13 35 -198 193 -288 163 -30 81 126 -181 207 -249 235 25 -19 227 -223 249 -202 196
6052A96l33J17K00m53M53m28M96k25mJ13l95N52n58O26m10n5L09n16N69m49L22
$$ 196 -137 -20 180 -273 180 -248 248 23 19 132 -263 289 -269 357 -53 -108 201 -315 254 -195 127
6073A27j56q2M25p19P34n74L75o4k73M01n15O66n59L18k8k17M40n85N02k99L08
$$ 127 -29 -111 314 -405 329 -245 130 66 -207 194 -321 345 -214 104 76 -141 299 -286 216 -83 225
6094B25k99j6M35o18N44m44L54k26k08O29o91N02l78K24N1k77M40m88N54n40J66
$$ 225 -74 -90 345 -273 271 -173 181 -45 -253 376 -315 187 -191 33 84 -193 247 -241 313 -227 -61
6115f1J95l58M52n31O74n96K81J45n82P03p06O65l60NK15m75O88p23N13k16l5
$$ -61 134 -224 228 -303 371 -225 56 201 -381 322 -384 281 -79 -74 141 -334 354 -369 144 -72 -107
6136a07L20n13P23p87O35l48j0J67l78O56p07N69m13J5L22o09Q07o39N40l18M9
$$ -107 213 -300 423 -364 271 -77 -87 80 -298 358 -349 220 -193 -178 144 -465 342 -297 243 -75 -26
6157b6K13o04P86o50L74p8j16M06o78O71n61L90q8j36L94n28N14n53M42j78j97
$$ -26 187 -417 369 -281 93 15 -101 305 -373 298 -263 127 39 -97 297 -231 283 -270 172 -6 -203
6178b03N62o98N70m63M23j40k71N89o65O13o36N44r0l74O36o60P33p54L93l5l81
$$ -203 359 -339 231 -232 191 51 -220 369 -296 317 -319 225 135 -239 397 -263 470 -284 109 74 -307
6199c07O14o93Q10n89J51J83n13O29o42O31n18K61Q3k32N15p37N93k49oK8k04
$$ -307 307 -386 424 -165 -14 169 -344 285 -357 274 -244 17 100 -132 383 -354 239 -10 -16 12 -192
6220a92N41n46L35k82Q7K46m37M36m55L70j61L9J47m39O26n73M47j70j13J86n53
$$ -192 349 -197 138 -144 -57 189 -248 188 -267 103 -58 -19 128 -311 315 -258 189 19 -94 92 -461
6241d61R09o75L80j46j61L77n27P50o76L95k30NK68m54M10k52K36j21j09K90n43
$$ -461 448 -227 153 7 -154 223 -304 446 -230 165 -65 -60 208 -246 164 -88 148 27 -82 208 -335
6262c35N99m81K81rj23K25l64M60n81M54q3j97L16l81L45k70J29P5j71L42l62
$$ -335 264 -217 64 55 -68 157 -207 253 -328 126 43 -154 162 -219 126 -144 -15 60 -111 231 -131
6283a31K62j68N2J00k58L27l22L46k16j34K05k00L58l45K30k34J8J68k08K80k85
$$ -131 131 -37 15 115 -143 184 -138 208 -8 -142 63 -137 221 -124 106 -128 -110 58 -150 130 -155
6304a55K13j28L5J49j73J99k19J98j47J09L0j91K98l82J78r0J91q8q2J38k66K61
$$ -155 58 -70 -35 114 -59 140 -79 119 -28 81 111 -80 218 -164 14 -76 115 27 -55 83 -183 78
6326G8j13j58L03j53K01k33K5J34j72J22n5J9N1j9j32OK35k13J74j38p8J70j61
$$ 78 -35 -193 110 -43 158 -75 -50 84 -88 34 -21 -2 49 30 -102 -96 139 -74 100 -38 -116 54 -107
6349a07P9j03K57k26L6J18j68K63j93J06j72R2R0q0O9j92K27j18J3qj6N2p8J12
$$ -107 -28 -131 126 -100 -64 54 -114 149 -44 62 -110 -18 72 -8 61 -131 96 -22 -9 -17 -33 19 -59 53
6373E3M1j59K5l9J12j27N6M3o4J30j50J25n2n0N3N3Qj04P7n1L9rj11J42k5N2j45
$$ 53 94 -65 -40 -79 33 -94 -38 5 -59 71 -79 46 -6 -56 -3 50 58 -46 31 -20 19 10 -101 41 16 68 -77
6400g7Q2k2r2J35m3M2k4Q0k0q0R4j78J75j37PN3k8P9j30J33j06L8L4r7J69j53
$$ -77 5 -17 -109 26 -17 25 1 81 61 -19 75 -103 72 -65 -58 -5 -33 46 -84 49 -57 -19 15 -82 87 -66
6426f6J09q2Q5j33L7J79j65J51j36J22Nj05Q0r0J10l5L8j60l2J19j08J92k23Q3
$$ -66 43 -39 46 -87 -50 129 -36 115 -21 101 106 1 81 -9 101 66 104 -56 -88 31 -77 115 -108 -25
6450b5N2o2K12k04J05qm3k7q0O9%J25j32L3P3j13J21r9Q2j16J44j92K4N7j16J64
$$ -25 27 -35 177 -27 78 70 27 0 -80 -11 -11 114 -18 15 88 -25 96 -3 79 -37 107 -85 -61 -4 -120 44
6476D4Kr6R6j15J65j12L7n3l0J80j62K04j73J48j87Nl4J63L9j62J29j71K1L3J9
$$ 44 46 -50 46 -69 96 -16 21 -32 -62 118 -44 160 -13 135 -52 -47 -81 82 121 -41 88 -83 -62 -29 -10
6501a0P0k14J78qr3J51j32K01j78Q4n2P9K3k61K04j43J49p1l2J03k55K99j57J09
$$ -10 60 -154 24 16 -77 74 -58 143 -35 49 -3 76 99 -162 42 -101 48 -23 -55 48 -207 92 -65 44
6525D4j09K9J32k22K51k07J72j59Q2M4k08L53k54J83j84rL11l36J39k01K20L3
$$ 44 -65 -36 96 -126 125 -82 90 -69 13 57 -151 202 -52 131 -53 -62 249 -87 52 -149 71 104
6547A04j55J67j76J67k79K91j65p9J30l3J83j96J49j14n8J07k30K98k93J90J0
$$ 104 -51 116 -60 107 -172 119 -46 -125 5 -28 155 -41 108 -6 -64 43 -187 111 -182 8 18
6568A8r7Q5j71K93j98P6j9m6K42l79K43j16L8J01j11K08l62K35m5K6m5p2K90l04
$$ 18 -79 6 -165 128 -70 6 -13 -59 183 -196 47 -69 -31 70 -41 167 -195 40 -5 21 -24 -96 194 -110
6592a10K63k11J75r0k38M88l55J06n6J27k5l27N00k51Q1k07K62j01k54M09k34
$$ -110 153 -58 117 27 -211 277 -78 28 -28 99 74 -253 247 -4 77 -130 132 31 -223 186 -48
6613d8N0r6l0K90k91K96k22K80k79K9J63k13K19l18L19k61j8K94k34K58l44L23
$$ -48 2 -94 -124 166 -125 171 -51 229 -50 -21 142 -71 148 -170 149 -112 -130 164 -70 188 -156 167
6635A67j85j52L00k05K51m22L78p0j17N8j67M50l95L9P8j57L36k91K57l66K06
$$ 167 -18 -170 130 -75 176 -246 132 62 -55 3 -164 286 -109 -70 8 -149 187 -104 153 -213 -7
6656gqJJ06l90M00j61J61k08O8J91l38K78p5N3j53q1K31k14K64j57k2N2k6J87
$$ -7 -15 -14 92 -298 102 -59 102 -106 -38 153 -185 93 18 71 -82 -163 68 -146 118 -39 -61 -9 -35 152
6680A52l46K95k99J79J52k97L93l91L52l37K14R0k34K17p0O3k84K17n9m0K05k65
$$ 152 -194 101 -198 -19 133 -164 229 -162 190 -147 67 157 -77 140 70 133 -151 66 7 -33 172 -93
6702i3K57l37J37K01l28L73l88L52l33J75j09m0L23m28L71j50P9j08rK06l09K63
$$ -93 164 -173 -36 165 -163 210 -178 174 -159 16 -93 -133 190 -238 133 -17 62 -46 -55 151 -158 105
6724A05j25O4j0j86K68k72K14j34P4O2j84L76k60J03k16J91M2l15L60j60J56r9
$$ 105 -20 44 34 -152 116 -156 58 -76 -2 60 -124 252 -8 95 -121 70 112 -203 157 -3 153 54
6746E4m3R0l03L50k47R9j25J52L8j85K24j75J39r4k2J05q3J26k02K50k20oJ48
$$ 54 11 101 -202 148 -99 0 -125 27 65 -120 104 -71 68 -26 -48 57 -26 100 -102 148 -72 -78 70
6769G0j29J02j0mM4r7k0lK44k78L4j8N2M9j15K70k68J28k7L1n4m3J77j87L8M6
$$ 70 -59 43 33 29 73 -24 -44 -47 197 -81 -47 -65 -13 36 -79 191 -77 51 24 55 1 -42 135 -52 -14 32
6795C2r6J33j88K36j80J49j16K2M3k41L22k01N1M5p5J45j57J21q9J94p9j80J64
$$ 32 -64 69 -119 117 -63 86 -30 -8 35 -206 116 -85 -34 11 -64 81 -76 45 -44 150 71 -109 55
6818E5j39R0k9J49n6j88K04k11J68k06K20K3q2J01j33J35p8l4M9r4M1L3L3r1J13
$$ 55 -84 6 -23 126 70 -118 86 -125 43 -163 57 80 -2 99 -34 101 23 -11 38 -56 -15 18 51 -40 73
6843G3n7rJ19j58J6n0k3R8N3o0j67K25Lp2L3j27O8l4R3o0o0J25O0J7j17K0j0M6
$$ 73 16 7 126 -32 -16 -66 -89 9 62 2 -165 60 63 -9 24 -103 -35 -69 24 -36 -96 29 89 106 -11 9 -1 45
6871D5J9j8O2J2j33N9j7J45k00P2q9J1O5j7R4j62O6r4N0l5Q5j28O7m5n0O5J19
$$ 45 64 46 108 120 -13 46 29 174 -26 46 -43 -32 33 16 110 -52 14 -80 -30 -65 20 -108 -41 -86 -136 -71 48
6898D8j94J98k5K4o1j5Q4K1j45K8J05p7l1K9J4P6j23J07m1j50P9L8J03r5M9k7
$$ 48 -146 52 27 51 -10 -25 59 80 -65 -37 68 -9 -40 -11 3 79 -44 63 22 -128 -49 -11 92 -3 46 19
6924A9j5m5K8J26j01J4j4o5L8o8J77j68J36j51QJ25k10J94rl2j4JnlN8K4k7j15
$$ 19 4 -41 -13 113 12 26 12 -53 -15 -83 94 -74 62 -89 -81 44 -166 28 19 -13 -27 -26 -31 -34 24 48 21 -94
6952i4J35N0j33J48j44L7K8j34Q1k1P8j31L2P4j22J95p7O6j25J87j01PK6n8J1
$$ -94 41 91 -42 106 -38 -1 27 -107 -26 -47 31 -100 -68 6 -116 79 2 68 -57 130 29 36 62 4 15
6977A5k1j2K6q2J38ql7j25MJ44j12J70k23J34N8j02Ll8J65j30l1N2P3l2n8P0j73
$$ 15 -6 -18 8 -74 64 56 19 -106 -102 42 -70 100 -123 11 69 -33 -30 -68 97 -33 -64 -12 61 29 -29 41 -132
7004a32K52k06N5J3K9P6j42R0n9J27p4q7J66q8J0n5j8O3q5K00k54J65r3J10O6
$$ -132 120 -86 -31 -18 11 87 -55 35 -24 103 29 -58 108 20 30 -25 -43 20 -65 135 -119 46 -47 63 129
7029A29j76Q5r0K56k31M3J07k21K48k57K49o5j5k1j06R0j08J72j61J01l5PM8k63
$$ 129 -47 38 -52 204 -27 16 123 -98 150 -107 142 77 62 41 -65 25 -83 89 -72 29 -6 1 49 -214
7053b14K91k20J93K1j16K08k63J85r4k3L6j40K52k35J98p6m5R6j69K52j82J4J30
$$ -214 77 -143 50 71 -45 163 -100 85 -9 -32 4 -136 116 -119 79 3 -42 54 -115 137 -45 -31 99
7076I9r5rj57K92k49J09Nm9K14k20K00k94K52j28K3J31j93J17j62K08j11k4J24
$$ 99 4 -5 -162 130 -119 -10 -5 -54 160 -60 140 -154 98 -30 -7 124 -69 48 -114 94 -17 -41 83
7099H3k21L46k47P8M4k83K46j45P5p6J08L9j98K10k22L60l11J09R1r1K34k88K02
$$ 83 -138 208 -39 39 83 -200 46 -99 -24 -100 8 47 -151 59 -163 197 -114 -5 86 -5 229 -59 143
7122A43k20O2P9j11R1j12J89j81J17L3j09K38m10K83j2j41J09k22K95k48J28k0
$$ 143 -77 -15 64 -47 44 -68 121 -60 57 90 -19 219 -191 92 80 -61 48 -174 121 -127 1 -19
7144a9qO3j32L08l76K50j50L6R2j86J92k15K31j65M7J49j50K29l36K37j42R9Q0
$$ -19 -27 36 -96 212 -164 86 -64 -28 64 -122 70 -145 86 -79 -32 117 -33 196 -140 97 -45 54 134
7167A34j92J68k06J89j10j34K06n4J54k22P7k7r3K22j75J02r2Q3n3j38L10k88
$$ 134 -58 110 -96 93 -17 -151 55 1 155 -67 10 -17 -110 112 -63 39 -53 30 -23 -161 149 -139
7189a39K54l80L47p2n0J49k72L50k60J1J39o9J00l44L51j79J04J1n7N1j66J84
$$ -139 115 -265 82 10 -40 109 -163 187 -73 -62 77 8 108 -236 115 -64 40 51 -6 45 -121 63
7211F3j33J21l6j63K83k02K59k19j7J03n5R0k56L12j93J37j30k3K74m87K91nq3
$$ 63 -70 51 15 -148 135 -67 192 -27 -44 59 4 94 -162 150 -43 94 -36 -59 215 -272 19 14 -69
7234f9J12k18K10j26J88n1p1J26j89K44j83J24j02p8J63k77K63j90K38q1j25R6
$$ -69 43 -175 35 -91 97 46 -25 101 -88 156 -27 97 -5 -83 80 -197 66 -124 114 33 -92 4
7256DJ2M0N7q0n5o5J29j82K12k7O0j11j19J73j80J76k2Q9q7j22J03QL2Qq4J02
$$ 4 16 56 113 33 -22 -87 42 -140 72 45 105 -6 -125 48 -132 44 22 111 24 -98 5 13 45 53 -31 71
7282G1o6Q3j62J30n2r4J36l5K6j06R5j61J82q3k3J10p7J06j84K07q8l5K8j3J02
$$ 71 5 88 -74 56 4 -90 46 11 37 -69 26 -135 47 -36 -59 51 -26 80 -104 103 15 -20 8 -5 97
7307I7j09N6M0j52K51j99N9p7k1K7K2J0n3J01j5J18j77O8Or8J31j36K6N8j40J92
$$ 97 -12 44 84 -68 183 -16 43 -34 -55 -28 -6 4 -49 52 37 155 -22 46 52 -46 85 -51 -25 33 -107 85
7333H5k09P2k5N8J16n9J2p7O9r2P5j4j2J8j22J90o0%op8k1P2L6m3L1p4O1k3J8
$$ 85 -124 -52 -77 -19 97 38 50 -27 42 -50 25 11 -1 17 -105 85 25 25 19 -59 -80 -8 28 -15 16 -58 3 -20 -2
7362bP5r4j8N1J2L4p6kQn1J00q7Q1K1p1l3O7N3j22J10j11M1O1n9o4L2J06n6m2
$$ -2 73 -21 -39 12 24 58 -18 -20 -12 -63 37 -50 31 52 -19 -52 15 68 -54 56 -55 -14 47 -12 -76 -44 62 6 -36
7391c6O5l5J19n1l1K4k0r8K6Q7%J02j63pO5nk3l2QJ25q3n5N6J9l7Q2j16m9R0o9
$$ -36 29 -6 113 62 31 55 35 -63 -37 50 50 152 -11 -18 47 42 19 -13 -5 120 37 -18 38 57 20 102 -14 -63 27 -42
7421d2J04p3k3Pj9N1O9Q7j32Q9j19n1K8O0q3P3L7j13M1nk6q7K12r1k2Jlj50K49
$$ -42 62 -11 -34 -27 -46 5 74 161 29 118 -1 -52 -24 36 -47 26 63 -50 -9 -14 -40 -127 85 -6 -28 -27 -30 -180 69
7450F9j32J6J6k5P0j31J16r9J33q3n7L5j2N4p9J73r9%R1n0M4lk8m0J07K1j75P7
$$ 69 -63 -47 -31 -56 14 -117 -1 -100 33 -50 -107 -72 -84 -30 -109 64 -35 -35 56 6 50 47 19 -21 86 107 -68 9
7478IQ5k08N7Q8J4q7Q5J2r7R4j00J4j2QJ1J21j24o8K10q9Pj06O1OJ20q9j42J24
$$ 9 94 -114 -57 31 45 -42 43 55 -42 52 -48 -34 -46 -38 -27 94 -30 -98 112 23 30 -76 -15 -9 111 22 -120 4
7506Dqk1L4L2J7j19J42j35L9P0n7J28k5mo4n2R1r7j7j5l6R3o2P4k4M4Ll3k9O6
$$ 4 -4 -25 9 41 58 -61 81 -54 -15 55 -2 126 101 97 33 -19 72 -25 -42 -57 -93 0 -62 12 -12 32 35 2 -27 39
7536C9j12J17q2j9J14k24k9J79J29r8o4J12l4p7K8K1J23k04L4K5j7N5m0J1m6K32
$$ 39 -73 44 -38 -57 57 -167 -196 -17 112 14 -50 62 28 -49 -21 0 123 -81 -47 -22 -39 16 -24 -13 -59 173
7562A73k84Q6N1P7N2k22J15l8POl6J19j34Po6J10L8k5l7k4J18k00J24L0j06K1
$$ 173 -111 -25 26 103 155 -67 48 10 17 23 -13 106 -28 -21 -87 23 61 36 -1 -25 93 -107 17 47 -59 -38
7588c8j15J21J9n0Q7n3J7q3j3J06m5O7m6R4j46J91j08n6Q7j27J63j32J07Mn9J
$$ -38 -153 -32 -13 -63 24 -29 -12 -95 -108 -2 -47 20 -26 68 -78 113 5 -51 36 -91 72 -60 47 51 -8 -7
7614gl7R5m7L9N1j16q0P7Q0j09J50j80J36m4j00J50k5k9k6O7qj70K31j85Q7o1
$$ -7 -44 51 4 43 94 -22 -102 -25 55 -54 96 -84 52 8 -92 58 33 4 -22 45 37 -133 98 -87 0 -61
7640f1K6J04j76K39j99J71r0nJ24j65O0n5O8p9q3J23j27K26j46K2N4j33J34j59
$$ -61 -35 69 -107 132 -67 104 14 9 133 -32 28 -27 41 -38 -121 2 -125 101 -45 -23 31 -102 32 -127
7664a27J12q2K06j42oM2l4K59l46J90k4l1P0j41K83l14j3J37J8l4o6J51j53M9
$$ -127 -15 -97 109 -33 -39 3 -31 228 -118 72 48 17 87 -54 229 -85 -98 39 57 23 -43 108 -45 4
7688DM2j05O0r5J74r3L4Rj46J15j19J88r1mnr3K75j50P5j05pO7r8P1q0J05L9p8
$$ 4 46 -59 1 -94 80 -13 21 30 -116 -1 -120 68 -23 -27 -32 -125 150 0 75 -30 -37 30 -68 3 -77 28 67 -11
7716a1J02j64R2J7lj2J0K5n8J55j55J65j84K6qKm3j8J40j56R8K9j21J07q6J14
$$ -11 91 -73 19 36 33 21 31 56 -2 153 -2 163 -21 5 -3 -1 -44 -62 78 -78 20 49 -72 35 -51 63
7742F3o1o4J36o7m2l6j1J44l7K1p9M9p8J51o9j02M3J8J62j81O8J1p9J05l4L1j03
$$ 63 2 -62 74 7 -35 -71 -82 62 25 46 -33 16 -62 89 20 -82 -39 -21 141 -40 28 39 -40 65 31 62 -41
7769d1N9lkK7n3O6m8N8K6k8K8j64P4m5J09m6r6Q0k8P7l6j9L2NK3j43J32j24O2
$$ -41 18 15 13 40 -13 53 5 63 89 61 89 -75 -1 -46 63 17 -79 1 -27 50 14 -5 27 32 55 -88 44 -80 -18
7798a8K7j04J30r7N8j19J43MM8N6j61Q1j61J85m5m4pM9N4o8N6mj75J20l3N8N5
$$ -18 9 -95 35 -62 -4 -123 20 24 72 128 -33 48 -113 72 27 -17 -24 25 79 11 67 63 -112 8 -25 33 88
7825H8j29M3j4M4j94K40j66K6Q0p5J52p8O6n2k9l7L4m2J5N7J30j51K5RLo9K7p7
$$ 88 -41 2 -12 32 -162 78 -88 -62 18 -57 95 17 83 31 2 -35 -1 -43 -28 29 159 8 33 42 45 -24 3 -74
7853g4K00j41L6Pj48P7O1p8J15o6N3n5j00J78q1n3l8J17m1rJ8m5L6m6J34rr7Q5
$$ -74 126 -15 21 28 -120 -43 18 -60 55 -11 42 -13 -113 65 -16 -69 -107 10 -31 -40 -22 -67 -31 -77 57 48 -49 36
7881C6M0L6j57R7m5j4L4m7m2pP0L8j05J13j56J41j86J60n4l2J73r4k1pJ50o0j1
$$ 36 76 112 -45 52 7 -7 27 -20 -62 -69 1 39 -66 47 -109 32 -154 6 -48 -80 93 -1 -22 -29 121 61 50
7908E0o3o8O8L6p3J43j39M4k5P6j30J66k5j27N3r0J47m2Kk2No8R9KQm9K6j6%o9
$$ 50 -13 -81 -13 23 -50 93 -46 -2 -27 49 -81 85 60 -67 -14 -104 43 1 3 -19 -14 -82 17 19 27 -22 4 -12 -12 -81
7938h1J46m9O4p3j3M1r9J08q1l0N1KJ2j7K9j24O8J16j00J12n8l5k8M8k6P9o6o9
$$ -81 65 16 80 7 -6 35 -64 44 -37 -67 -16 -14 -2 -19 10 -114 -46 70 -30 82 24 -11 -39 9 -17 62 -4 -73
7966g3L5rl0J23p5j7MR8j29O3J8K2K2j18J21j2l7o4M5Q0q2NJ9P8Qj44J7L0l0J10
$$ -73 -38 -47 -77 46 -29 -46 -42 56 -73 -10 8 30 52 -66 55 43 6 -58 -13 67 -15 -10 9 87 95 -49 -32 -2 -32 78
7996G8k0Qj95J53j07J09m5K5l8J6M9J5l2m8r0J99q0J20j46R3j07J23p5P5n4q6
$$ 78 58 66 -129 24 -83 26 -19 6 -32 -16 33 48 16 -32 -122 77 -3 117 -29 64 -43 80 5 80 26 -60
8022f0P7j8k5L2rK1j49J61M3j17J61j39J42j07J00j87K7J66k12J76j16K9O2q8
$$ -60 17 -1 -26 6 -3 18 -131 30 73 -44 117 -22 120 13 113 -74 -47 119 -93 83 -33 -4 58 -30
8046c0Q2j34J18l2J3K1o9J4O4M1q2%j09N6K7n9J56r2J7k6L7n0%O2j94J48j0P4
$$ -30 52 -82 36 4 17 38 -31 -17 47 88 6 6 -103 -47 -20 -79 77 -15 2 -24 13 -37 -37 25 -169 -21 -31 43
8074D3R8j85Q9JLm8l2O6j14J12j59J36P4q5N4j00R8l0J1J14j97L4p6N0j9m4K07
$$ 43 141 -44 45 46 49 1 -31 35 -79 33 -126 10 84 -1 53 -47 51 21 32 146 -51 -17 -93 -43 -62 -106 101
8101A01j63J61j57j8L3J20L5j68J00k7O8q6N4n6j7P2j31J99j37m1J54q5J7OOp1
$$ 101 -62 99 -58 -76 -43 77 112 -56 44 17 85 -1 53 -3 -20 52 -79 120 -17 -58 96 11 28 34 40 -31
8127c1m7J41j20K1j7P5mj01J27p7M9n8M9Ql9l7qJ88j56M9l9j9J17j51P6l1OM0
$$ -31 -78 63 -57 -36 -53 22 18 -83 44 -33 16 -42 7 15 -24 -61 -69 119 -37 12 -27 -46 71 -80 -4 -35 -29 11
8155A1r6J69j83J49j35k7J57p9Q0o3M9p5J60n1k4M2j32J30p8q4M5M3J35j94O9
$$ 11 -85 84 -99 50 -85 -112 45 -34 46 -17 32 -43 117 66 42 84 -48 82 4 -80 -35 8 143 -51 18
8180A8L1l7P4j64P8j0J48j75J3J25j58
$$ 18 49 12 86 -78 0 -10 138 -37 -24 101 -57
8191e7
$$ Imaginary data points
##PAGE= N=2
##DATA TABLE= (X++(I..I)), XYDATA
0@%%%%%%%%qJ6j6J6k4L2l2L7m5N2o0O8p6Q5r7J12j24J32j44J59j73J87k01K16
$$ 0 0 0 0 0 0 0 0 0 -8 8 -8 8 -16 16 -16 21 -24 28 -32 36 -40 45 -52 60 -64 68 -76 83 -90 97 -104 112
32A12k32K48k62K76k90L05l19L29l38L47l57L66l76L89m02M15m34M58m87N27n81
$$ 112 -120 128 -134 142 -148 157 -162 167 -171 176 -181 185 -191 198 -204 211 -223 235 -252 275 -306
53c06O56p57Q91j074J328j678K158k830L782n154P181j0277J5238k3750M0066
$$ -306 350 -407 484 -590 738 -940 1218 -1612 2170 -2984 4197 -6080 9158 -14592 25474
68B5474p8691K68208K23922r14067Q03916o87904Q04315o95501J15645M55462
$$ 25474 -53217 214991 438913 -475154 328762 -359142 445173 -250328 -134683 320779
78C20779n84667N16280o15221O94189m15305J3839N0171J08194j001l59185M40051
$$ 320779 -263888 252392 -362829 331360 -83945 -70106 -19935 88259 87258 -271927 168124
89A68124j20829p1634j54380L73118j65462j76469J70425O1426p3492j20902J24689
$$ 168124 47295 -24339 -178719 194399 28937 -147532 22893 84319 10827 -110075 14614
100A4614Q7161j20960j17809K61164j47775J15976l56713M96460j97087k52478
$$ 14614 101775 -19185 -136994 124170 -23605 92371 -264342 232118 35031 -217447
110b17447L83436k93136M04590o84792O78600k71756j25454K57957l55409O01736
$$ -217447 165989 -127147 277443 -407349 271251 -505 -125959 131998 -223411 378325
120C78325p54530N77587k82251J59679q3876k08354N69978o24411L98741k86131
$$ 378325 -376205 201382 -80869 78810 -5066 -213420 356558 -267853 130888 -155243
130a55243L85901l54756J0930L33937l77895K80935l26488M32804l32766O6583
$$ -155243 230658 -124098 -113168 220769 -157126 123809 -202679 230125 -102641 -36058
140c6058R4059j09349J76285l13205K94639p5177p7754J4564O0030M4394j56917
$$ -36058 58001 -51348 124937 -188268 106371 31194 -46560 -31996 28034 72428 -84489
151h4489L5062K00601k43472P4815M6392k9717O2212k29222L50946k88348J61136
$$ -84489 -49427 151174 -92298 -17483 28909 -808 61404 -167818 183128 -105220 55916
162E5916j06288L6744J54372l44775L55103k50110K28150k74117J91085M9072
$$ 55916 -50372 -13628 140744 -204031 151072 -99038 129112 -145005 46080 95152
172I5152k35326K46155k20941K93505l68221K97158j26829K148P4651j96505L36703
$$ 95152 -140174 105981 -114960 178545 -189676 107482 -19347 -17199 57452 -139053 197650
183A97650l70041K86388k07220J68226o6575j29737K80681k71446J85792j59105
$$ 197650 -172391 113997 -93223 75003 8428 -121309 159372 -112074 73718 -85387
193h5387J67292r8051l7587J13288q8721N2793o1342O4198k7221R403n0679Q9832
$$ -85387 81905 -16146 -53733 59555 -29166 23627 -37715 26483 -738 8665 -42014 47818
205D7818o7160K8517m1462O5007j4274r0710J46497j22118R5858j16105J28866
$$ 47818 -19342 9175 -32287 32720 18446 -72264 74233 -47885 47973 -68132 60734
216F0734p8582k006N3356q2269J25267j68773J72836j42873J16577q7865J5560
$$ 60734 -17848 -19854 33502 -48767 76500 -92273 80563 -62310 54267 -33598 -18038
227a8038R3170j73663J89624j78658J78479j62917R2282J5180j00786J41681j60506
$$ -18038 75132 -98531 91093 -87565 90914 -72003 20279 35459 -65327 76354 -84152
238h4152J68536j50669J04089n2877J0847L3194q0049J05056r4525P4153p3024
$$ -84152 84384 -66285 37804 -15073 -4226 28968 -51081 53975 -40550 33603 -39421
249c9421P9192o1537J9837J4895k7143L3612n0210O9595p7039P1633n9198L9995
$$ -39421 39771 -21766 -1929 12966 -14177 19435 -30775 38820 -38219 33414 -25784 14211
261A4211j5516n210J6779k8933N1260p4443P9866o4917M6932l7278K7346l467
$$ 14211 -1305 -6515 10264 -18669 32591 -41852 38014 -26903 20029 -17249 10097 6630
273F630l3010O5840q2669Q3464p4577O0907m2921J9176J2229m7404P4259q2340
$$ 6630 -26380 39460 -43209 40255 -34322 26585 -16336 2840 15069 -32335 41924 -40416
285d0416P2615n7738M6606l4043J0598K1874m8924N9714n6679N0105m6621M2792
$$ -40416 32199 -25539 21067 -12976 -2378 19496 -29428 30286 -26393 23712 -22909 19883
297A9883l0546P167J9248l6194L9796l7486L8978m3647M1538k6749M547J3346
$$ 19883 -10663 -3496 15752 -20442 19354 -18132 20846 -22801 18737 -8012 -3465 9881
309I881k1019K3093k8180L7899m3877L7006j8380m81J0210j2903J6935k6267L4598
$$ 9881 -11138 11955 -16225 21674 -22203 14803 -3577 -4058 6152 -6751 10184 -16083 18515
322A8515l2978K0557n354k819K809k576R205k0070K5510k0639J0568m628N239
$$ 18515 -14463 6094 740 -2079 730 -1846 7359 -12711 12799 -7840 2728 -1900 3339
335C339n984P0J2096k2001K1893j3319N113l080L820J25r895J8470j8629J0453
$$ 3339 -2645 -2575 9521 -12480 9413 -3906 1207 -1873 1947 2072 -7823 10647 -7982 2471
349B471o10m500M091m063R000j6078J6771p111n599J1954j0668R194j2347J5789
$$ 2471 1861 -2639 1452 -2611 6389 -9689 7082 -29 -5628 6326 -4342 4852 -7495 8294
363H294j3654N355M540j1976J5716j6131J5876j7204J8311j3494K19J4729k2222
$$ 8294 -5360 -5 4535 -7441 8275 -7856 8020 -9184 9127 -4367 -4148 10581 -11641
376a1641K1692k0950K3561k2246J0972N225j6240J9472j9965J8554j2168L265
$$ -11641 10051 -10899 12662 -9584 1388 6613 -9627 9845 -10120 8434 -3734 -469
388d69P48J068j377j132j707J1279j4891K756J5792k5478K7757l3351L9059l0647
$$ -469 279 1347 -30 -1162 -2869 8410 -6481 -3725 12067 -13411 14346 -19005 20054 -10593
402a0593Q074J2798k5723M0083n7419O1852m4938K2927j2276L213K1516n2851
$$ -10593 -2519 10279 -15444 24639 -32780 29072 -15866 7061 -5215 -2002 19514 -33337
414c3337O6324o0143N4806n6011M4172r976k6811M9210o6390Q8381r7330P1968
$$ -33337 32987 -27156 27650 -28361 15811 5835 -20976 28234 -38156 50225 -47105 24863
426B4863k7633l880K2736n3425R1806j00387O6506k5327P435K726k8614N3298
$$ 24863 -2770 -6650 16086 -37339 54467 -45920 20586 -4741 2694 5420 -23194 30104
438C0104m7723K2234j0981J5094q020p728J444K7005l6055Q947J4781n796m091
$$ 30104 -17619 4615 -6366 8728 708 -7020 -5576 21429 -14626 -5679 9102 3306 -785
451g85k3161O3467o5148L3041j7385K8956k6567p887L9134m4750N2855q3848J03235
$$ -785 -23946 39521 -25627 7414 -9971 18985 -7582 -15469 23665 -21085 31770 -52078 51157
464E1157p7043L3496j3872k455O1888j42915J70850j28993P9264n7574K1782O1641
$$ 51157 -25886 7610 -6262 -8717 53171 -89744 81106 -47887 31377 -26197 -4415 57226
476E7226j44275J63851j34594J08695q4976K6749M9175q4844P6955q0279J06627
$$ 57226 -87049 76802 -57792 50903 -34073 -7324 41851 -42993 33962 -46317 60310
487F0310r8296L3626K0002r101j6846j2765P1312p9984L7497j6509L8207m3362
$$ 60310 -37986 -4360 15642 6541 -10305 -23070 48242 -31742 5755 -10754 27453 -15909
499a5909L461L0302j9378K651j8262K8853N396l8829O483O0650p7690M4272m0191
$$ -15909 -12448 17854 -1524 1127 -17135 11718 17114 -21715 -15232 45418 -32272 12000 -28191
512b8191Q1087q1341o464J08324j41677J30342j36804J41930q4619j8521R2706
$$ -28191 52896 -28445 -34909 73415 -68262 62080 -74724 67206 -17413 -35934 56772
523E6772j23235J58685j97277J72285p5030p257K2522l3716J03787j76634J63151
$$ 56772 -66463 92222 -105055 67230 -7800 -15057 7465 -26251 77536 -99098 64053
534F4053q9211N2559o5524M6522L3531j02551J11781j05760J23818j21831N7953
$$ 64053 -25158 27401 -38123 8399 41930 -60621 51160 -54600 69218 -52613 5340
545E340J7186l8472L6450p6537J28395j02920Q152M5817j4804j8917r229M0871
$$ 5340 22526 -15946 20504 -56033 72362 -30558 -22406 23411 8607 -10310 -19539 21332
557B1332k636o2534O5399j1674k4146L1975o5817J20847j25160O5722j8238J6080
$$ 21332 18696 -43838 21561 9887 -14259 17716 -48101 72746 -52414 13308 -4930 11150
569A1150R174r9149J76032j56105Q5359o4331Q4310n1100n0289J29607j37951
$$ 11150 20324 -78825 97207 -58898 26461 -37870 46440 -4660 -54949 74658 -63293
580f3293J31802j54866J58860r7078J1908L9221q1021J57224k22686J98017j03351
$$ -63293 68509 -86357 72503 -24575 -12667 26554 -54467 102757 -119929 78088 -25263
591b5263L6398j9307k5089J24269j90498J53834p2079L5629l2843j874N9007p1343
$$ -25263 11135 -8172 -33261 91008 -99490 54344 -17735 17894 -14949 -16823 42184 -29159
603b9159L5754j7173L2331k7881q679J3696L8310p4241L6772J6526p815l0394
$$ -29159 6595 -10578 21753 -6128 -14807 -1111 37199 -37042 -270 16256 8441 -21953
615b1953J0980N9244q9832N5129k8058N1039p1667M2438J102j4858K7878q0034
$$ -21953 -10973 48271 -41561 13568 -14490 36549 -35118 7320 8422 -6436 21442 -58592
627e8592J34734j32255R1133p4136P2345j5554r7881J78052j72359J35302j26051
$$ -58592 76142 -56113 35020 -39116 33229 17675 -80206 97846 -74513 60789 -65262
638f5262J11600l6129p1887J36072j43465J41890j41806J04474k9573k6564M0036
$$ -65262 46338 10209 -61678 74394 -69071 72819 -68987 35487 5914 -20650 19386
649A9386n5358R7648j18492P7269j9549J1505l4467K0649L2072n8631L4981j2660
$$ 19386 -35972 61676 -56816 20453 904 12409 -22058 -1409 30663 -27968 7013 -5647
661e647K6997m3787K8497o007J0391k2332R323J0115m40j9738J995M7057p0806
$$ -5647 21350 -22437 6060 53 10444 -11888 -2565 7550 7110 -12628 -10633 36424 -34382
674c4382N3408m1322O1198p1425K9753L6797p6104Q5537r7715J12427r7445M9730
$$ -34382 19026 -22296 38902 -32523 -2770 34027 -42077 43460 -54255 58172 -39273 10457
686A0457k097l0876O8982j14257J31170j02698O2659m4744K9925J5690p5805J03434
$$ 10457 8360 -22516 46466 -67791 63379 -39319 23340 -21404 8521 24211 -51594 51840
698E1840r0840P5358p5315O5765k8200j6409M2569n6602P2568p9403O1731l3376
$$ 51840 -39000 36358 -38957 26808 -1392 -17801 24768 -31834 40734 -38669 23062 -10314
710a0314J9148j3636o659L7018m6723K8461j2287J9385l2778K9280j5182J1790
$$ -10314 8834 -4802 -11461 25557 -21166 7295 -4992 14393 -18385 10895 -4287 7503
722G503j8463J6408p05j6300K9082m4581O0216o1266M5025k6689J5624J69l1608
$$ 7503 -10960 5448 4743 -11557 17525 -27056 33160 -28106 16919 -9770 5854 6023 -25585
735b5585O4313p5917O6462n4828M8102l3783M771K8240n1929O5307p2381P0372
$$ -25585 38728 -37189 29273 -25555 22547 -11236 -6465 21775 -30154 35153 -37228 33144
747C3144n6263L5911j5826o757L5250o0378O8679o0433M8642m0692K8832o573
$$ 33144 -23119 12792 -3034 -9791 25459 -34919 33760 -26673 21969 -18723 10109 3536
759C536j8943L5820m1569M2254m1670L8932l2538K2970j0539m609J8216k5383
$$ 3536 -15407 20413 -21156 21098 -20572 18360 -14178 8792 -1747 -6356 11860 -13523
771a3523K7507l0544L6243l8211L0473j6343M126L080j0116K1549l4479M2362
$$ -13523 13984 -16560 19683 -18528 11945 -4398 -272 2808 -7308 14241 -20238 22124
783B2124m2094L5379k5200J3755j925j1393K6746m0881M7538m3415L2553k1543
$$ 22124 -19970 15409 -9791 3964 2039 -9354 17392 -23489 24049 -19366 13187 -8356
795h356J2099q50j4332K9425l8168L8353l3246K7721k2713J5557l478j2093K5661
$$ -8356 3743 2893 -11439 17986 -20182 18171 -15075 12646 -10067 5490 2012 -10081 15580
808A5580l2575L3315l1757K9851k5711J6029j082j3964K3475k6498K6526k7196
$$ 15580 -16995 16320 -15437 14414 -11297 4732 3650 -10314 13161 -13337 13189 -14007
820a4007K7518k3324J3175n81q621J2920j5918K0870k6682K8831k4074J3958m006
$$ -14007 13511 -9813 3362 2781 -5840 7080 -8838 12032 -14650 14181 -9893 4065 59
833E9k681P870j4886K3633k8982K7194j9349R999l440p79O274j4502K1909k3519
$$ 59 -2622 5248 -9638 13995 -14987 12207 -7142 2857 -583 -1362 4912 -9590 12319 -11200
847a1200J9111j3085R734q377M624L469j3016J8940j9591J7314j5323J4313j1055
$$ -11200 7911 -5174 4560 -3817 807 4276 -8740 10200 -9391 7923 -7400 6913 -4142
860d142K804Q729j7551J9456j6636J3793j2718J0160k820o815J3114j3304R716
$$ -4142 -1338 7391 -10160 9296 -7340 6453 -6265 3895 1075 -5740 7374 -5930 3786
873C786o635N824n661L620N24m251M465r16k266Q67M340p731N603j761K161o328
$$ 3786 -2849 2975 -2686 934 1458 -2793 1672 756 -1510 -643 3697 -4034 1569 -192 1969 -4359
889d359P383k084m562P416o863O591p675Q487q105N907q85o589J1907j1512R622
$$ -4359 3024 940 -3622 3794 -3069 3522 -4153 4334 -3771 2136 1251 -5338 6569 -4943 4679
904D679j1808J5145j0515l412J6035j8993J6707j6830J6648q743n632J8051k4107
$$ 4679 -7129 8016 -2499 -5911 10124 -8869 7838 -8992 7656 -1087 -6719 11332 -12775
917a2775K5845k3174J2838K323j3886J8829k3311K9422k7297J0448J0342j9396
$$ -12775 13070 -10104 2734 5057 -8829 10000 -13311 16111 -11186 -738 9604 -9792
929i792J8347k0537K7455k6205J1174N259j2297J5699k2958K8135k2894J2619
$$ -9792 8555 -11982 15473 -10732 442 5701 -6596 9103 -13855 14280 -8614 4005
941D005p238K046J3122l0754L3081k0610J2300j3668P341J5684l6177L4077j8499
$$ 4005 -3233 -1187 11935 -18819 14262 -6348 5952 -7716 -375 15309 -20868 13209 -5290
954e290R761o488o880K7379l4532K3878j1581M619R295l2521M3237k8985Q627
$$ -5290 4471 -2017 -8897 18482 -16050 7828 -3753 866 10161 -22360 20877 -8108 519
967E19j958k411K4196n0750N1610k6573N959j984p113L3204n3721M8583l2364
$$ 519 -1439 -3850 20346 -30404 21206 -5367 592 -1392 -8505 24699 -29022 19561 -12803
980a2803K6251k0240n042L7028m8085M2011m5664N7173m4268J221L5348m1991
$$ -12803 13448 -6792 -11834 25194 -22891 19120 -26544 30629 -13639 -12418 22930 -19061
992a9061M2161n9807P2884m9077K258K7151l4089M6089o4995O0037k4514p165
$$ -19061 23100 -36707 36177 -12900 -10642 16509 -17580 28509 -36486 23551 -963 -8128
1004h128J5018k2020M4529n5011K7518J1325k0181Q292j4614L6896l3443l571
$$ -8128 6890 -15130 29399 -25612 1906 13231 -6950 1342 -13272 23624 -9819 -13390
1016a3390L1098k4960J4839k7009L7026j5355j7405K6202k1510L6318o0839N3794
$$ -13390 17708 -7252 7587 -19422 17604 2249 -15156 11046 -10464 25854 -34985 18809
1028A8809j5504r953R723k2237O4972r4997P5079l2865J2817l278l3984Q6367
$$ 18809 3305 -6648 3075 -19162 45810 -49187 25892 -6973 5844 2566 -31418 54949
1040E4949j04215P8951n1355L7922q377m7217Q6764p9864N7279n4826N0647r615
$$ 54949 -49266 29685 -21670 16252 7875 -39342 47422 -32442 24837 -29989 20658 11043
1052A1043m5364O1109l8744K9135m4658M2473l846k9417K3888q116J7456l2006
$$ 11043 -34321 26788 -11956 17179 -27479 14994 11148 -18269 5619 -2497 14959 -17047
1064a7047J5843J4990j8851K155n023K6026k1424j7056M2361k9413J4842k9125
$$ -17047 -1204 13786 -5065 -2910 -7933 18093 -3331 -20387 21974 -7439 7403 -21722
1076b1722M0333q609m2953O3899n4586N4219o4572M6332O941n1941O4375p0844
$$ -21722 18611 10002 -32951 30948 -23638 30581 -33991 12341 19282 -32659 31716 -39128
1088c9128Q9851r0348M5965J1650l8297M4092o6969R8179r1995M4338l311o684
$$ -39128 50723 -39625 6340 17990 -20307 23785 -43184 54995 -37000 7338 4027 -2657
1100b657J6982n0873P8589o8191L9927k8776K5295L30l7525M8688l3353K7722
$$ -2657 14325 -36548 42041 -26150 13777 -14999 10296 10626 -26899 21789 -11564 16158
1112A6158l9329L3351L130l2136K4713o048R701k1072O713K3754l1349J1232M447
$$ 16158 -23171 10180 13310 -18826 5887 -161 9540 -11532 -4819 18935 -12414 -1182 3265
1125C265m802J3484l8624N1662l4250R428k95q772L8831p0760P0265m2382K2225
$$ 3265 -1537 11947 -26677 24985 -9265 163 -132 -8904 29927 -40833 29432 -12950 9275
1138I275j6823j430M0817p0928O9459n4213M7998m0422J2219K5076m6008N1416
$$ 9275 -7548 -8978 31839 -39089 30370 -23843 24155 -16267 -4048 21028 -24980 26436
1150B6436o0706P1258n9538K4394N703j7031K8844n3880P1043n7579K7071p943
$$ 26436 -34270 36988 -22550 1844 7547 -9484 19360 -34520 36523 -21056 6015 -1928
1162a928Q59J3643l5196M2375k9683J5534j0971N210Q318j5028M565Q254o752
$$ -1928 -1069 12574 -22622 19753 -9930 5604 -5367 -157 8161 -6867 -2302 5952 -800
1175h00p78k323J0194l234j7957L1414k7234J9676k0378J9200m250j6529K8522
$$ -800 -1578 -3901 6293 3059 -14898 16516 -10718 8958 -11420 7780 3530 -12999 15523
1188A5523l2903L9058m3475L5248j6886J773P860k2990M5183n8099N1065l4984
$$ 15523 -17380 21678 -21797 13451 -3435 -1662 6198 -16792 28391 -29708 21357 -13627
1200a3627K3631j3108p681L4437n1163N2171m6083L8866k5657M982J4242k5712
$$ -13627 10004 -3104 -10785 23652 -27511 24660 -21423 17443 -8214 -3232 11010 -14702
1212a4702L3157l9817L9704k8046J2463m091J501N155j6771K3147j9380J3407
$$ -14702 18455 -21362 18342 -9704 2759 -1332 169 5324 -11447 11700 -7680 5727
1224E727j2885J4814j2807P636l751J095L091q352J1719j4001J8868k4573K4120
$$ 5727 -7158 7656 -5151 2485 -1266 -171 2920 -5432 6287 -7714 11154 -13419 10701
1237A0701j6031P120j922l457J4379k7536L4507l2673K6333j9619J1176P13j3600
$$ 10701 -5330 1790 -132 -3589 10790 -16746 17761 -14912 11421 -8198 2978 3691 -9909
1250i909K4617l2798L6884l4588K5938j5273N925M066j7221L0327l6584L4127
$$ -9909 14708 -18090 18794 -15794 10144 -5129 796 4862 -12359 17968 -18616 15511
1262A5511k7291K0369j2653J984J0521k1224K7004k7471K4436j9649J4456r257
$$ 15511 -11780 8589 -4064 -2080 8441 -12783 14221 -13250 11186 -8463 5993 -3264
1274c264L037M730j2281J6498j7105J7002j8740K0465j7910J0269r64o589J1975
$$ -3264 -227 4503 -7778 8720 -8385 8617 -10123 10342 -7568 2701 1737 -4852 7123
1287G123j6744K1800k5189K4225j8200R186n75n796J0391j5038K0301k3658K2335
$$ 7123 -9621 12179 -13010 11215 -6985 2201 1626 -4170 6221 -8817 11484 -12174 10161
1300A0161j6746J0245n290M42O361j5108K2947k6102K3767j8291J2505o713q60
$$ 10161 -6585 3660 -1630 -1188 5173 -9935 13012 -13090 10677 -7614 4891 -1822 -2682
1313b682J0482j9369K3962k3055J8392j3483R847n773o48Q637j4691J6791j5895
$$ -2682 7800 -11569 12393 -10662 7730 -5753 4094 -1679 -2327 6310 -8381 8410 -7485
1326g485J5111j5516J5078j0894K421O697j2746J5271j6437J8130j9212J6291
$$ -7485 7626 -7890 7188 -3706 -1285 5412 -7334 7937 -8500 9630 -9582 6709
1338F709q374j235Q066j0713J1555j3509J6445j6979J2978o303O82J919l511P355
$$ 6709 -1665 -2900 5166 -5547 6008 -7501 8944 -8035 4943 -1360 -678 1241 -2270 5085
1352E085j3486J8338j8268J3604q013M249j314l518J0778j7518J9546j5851R749
$$ 5085 -8401 9937 -8331 5273 -2740 1509 195 -3323 7455 -10063 9483 -6368 3381
1365C381n699L876q76n124J2034j5297J3399r515P330p407O810k613m619J0642
$$ 3381 -2318 1558 682 -4442 7592 -7705 5694 -3821 3509 -3898 2912 299 -4320 6322
1379F322j2231J0601r113R752j0333O728J046q373J0742q445O005o540Q210o922
$$ 6322 -5909 4692 -4421 5331 -5002 1726 2772 -5601 5141 -3304 2701 -3839 4371 -2551
1393b551K076K709l666J224O01J337o132J0136j0050O442l564L834m201m1Q436
$$ -2551 -475 2234 -1432 -208 393 1730 -4402 5734 -4316 2126 -1438 2396 -1805 -1846 6590
1408F590j5047J5052j0111N673m452L438J076p967J3248j3843J0344n883L412
$$ 6590 -8457 6595 -3516 2157 -2295 1143 2219 -5748 7500 -6343 4001 -1882 1530
1421A530l482K300L146j0527J4233j1494O397m468N085k982m290J2549j5581J2117
$$ 1530 -1952 348 3494 -7033 7200 -4294 2103 -2365 2720 -262 -4552 7997 -7584 4533
1435D533n859J090J660m078P232j0742J1600o816k305R714j0357N748k449L006
$$ 4533 -1326 -236 1424 -2654 4578 -6164 5436 -1380 -3685 6029 -4328 1420 -1029 1977
1449A977k489l246J0782j3048Q121p86l927N282n461O414q326R215o275n65P226
$$ 1977 -512 -3758 7024 -6024 2097 1311 -2616 2666 -2795 3619 -4707 4508 -1767 -2332 4894
1464D894q988O369m969P844j0739P395J812j0048J2322j0601R732j0032P872r52
$$ 4894 -4094 2275 -2694 5150 -5589 1806 3618 -6430 5892 -4709 5023 -5009 2863 1911
1478A911q908J7268k0276J6598q678P84M930j0277J7120k2703K0740r632m255
$$ 1911 -6997 10271 -10005 6593 -2085 -1301 3629 -6648 10472 -12231 8509 -1123 -5378
1491e378J3168j5745J6595j8085J7027j0038j209J1918j8136J8736j5669J1846
$$ -5378 7790 -7955 8640 -9445 7582 -2456 -3665 8253 -9883 8853 -6816 5030
1503E030q425M202L230j2933J9564j9123J3482q261N304j174p143J6895k1719
$$ 5030 -3395 807 4037 -8896 10668 -8455 5027 -3234 2070 896 -6247 10648 -11071
1516a1071J8705j0852K672M037j0004J5555j8631J7095r917j537J2872j8933J8065
$$ -11071 7634 -3218 -546 3491 -6513 9042 -9589 7506 -2411 -3948 8924 -10009 8056
1529H056j3362Q148k057p145J8117k4649K1953j2208J785O243j3305K0125k4227
$$ 8056 -5306 2842 785 -6360 11757 -12892 9061 -3147 -1362 4881 -8424 11701 -12526
1542a2526K2936j6390O146N387j5477K1803k4083K4095k2402J6343l845j1520
$$ -12526 10410 -5980 166 5553 -9924 11879 -12204 11891 -10511 5832 1987 -9533
1554i533K2722k7088K7896k7319K2490j0444n903K0164k8409L0959k8477K0386
$$ -9533 13189 -13899 13997 -13322 9168 -1276 -7179 12985 -15424 15535 -12942 7444
1566G444q028m709J5048k3120K7347k3773J2392J75q007J1999j5503J7344j2827
$$ 7444 -584 -5293 9755 -13365 13982 -9791 2601 2776 -5231 6768 -8735 8609 -4218
1579d218K255P667j2144J3160j3213J0486l260n426J1700j5626J8823j9184J3046
$$ -4218 -1963 5704 -6440 6720 -6493 3993 733 -4693 7007 -8619 10204 -8980 4066
1592D066k152p566J3940k0415K7535k9490K1898q600l843J4840k6745L6479l7455
$$ 4066 1914 -5652 8288 -12127 15408 -14082 7816 -784 -4627 10213 -16532 19947 -17508
1605a7508K8932j6338K931J2941k9404L8976l7623K9435j9782P870Q343k4052
$$ -17508 11424 -4914 -1983 10958 -18446 20530 -17093 12342 -7440 430 8773 -15279
1617a5279L1194k9303K4328j8639R061M469j4939J7834j6970J6486j3851N664
$$ -15279 15915 -13388 10940 -7699 1362 5831 -9108 8726 -8244 8242 -5609 55
1629E5M196q861Q510q361R167n827k490R210j0167Q528p746M768L783j3902J8461
$$ 55 4251 -4610 3900 -4461 4706 -1121 -3611 5599 -4568 3960 -3786 982 4765 -9137 9324
1644I324j7660J6390j3733M639J0193k2541K7033k7095K6031k0584P035J0089
$$ 9324 -8336 8054 -5679 -1040 9153 -13388 13645 -13450 12581 -8003 -968 9121
1656I121k2648K9293l2993L3121k5280J0391L913j4085K3043l1665L4210k6786
$$ 9121 -13527 15766 -17227 15894 -9386 1005 4918 -9167 13876 -17789 16421 -10365
1668a0365J4402m225l460J3200k3485K7159k2842J6020r970K802O606j3828J5055
$$ -10365 4037 -188 -3648 9552 -13933 13226 -9616 6404 -3566 -764 5842 -7986 7069
1681G069j2894J1315q628J834N607p542L902q45J026M0m939Q611o060n87N855
$$ 7069 -5825 5490 -3138 -1304 4303 -3239 663 -182 844 884 -4055 4556 -1504 -2091 3764
1696C764q860J2354j5421J4039q271K023L879j1504K0072k4367K1287j4755R349
$$ 3764 -5096 7258 -8163 5876 -2395 -372 3507 -7997 12075 -12292 8995 -5760 3589
1709C589l402o916J8974k6196K6447k2710J7809j0417n82J1637j9346K3734k5206
$$ 3589 187 -6729 12245 -13951 12496 -10214 7595 -2822 -3404 8233 -11113 12621 -12585
1722a2585K2428j4442M478K958p950J3311j8590J9476j4350P595l514J290J979
$$ -12585 9843 -4599 -121 2837 -5113 8198 -10392 9084 -5266 2329 -1185 105 2084
1735B084o105Q298p872O761n987M809l520L440m089L136r5k213K119k281N495
$$ 2084 -4021 4277 -3595 3166 -2821 1988 -1532 1908 -2181 955 860 -1353 766 -1515 3980
1750C980j0083J2085j0510P890n710K881K077q176J3477j6875J7561j5117R787
$$ 3980 -6103 5982 -4528 3362 -2348 533 2610 -5566 7911 -8964 8597 -6520 3267
1763C267l492k245P904j4099J9147j9799J5554r628M725m04n020J1141j5512J6463
$$ 3267 -225 -2470 5434 -8665 10482 -9317 6237 -3391 1334 930 -4090 7051 -8461 8002
1777H002j4613J1419p635L697L30m746R569j3166J3727j1362Q134n884M037q28
$$ 8002 -6611 4808 -2827 870 1200 -3546 6023 -7143 6584 -4778 3356 -2528 1509 681
1791F81l691P332q477P895p446P776q117P405m807R73K502n065P083r464J2175
$$ 681 -3010 4322 -4155 3740 -3706 4070 -4047 3358 -1449 -476 2026 -3039 4044 -5420 6755
1806F755j3238J0892n858M16L714o678R432j2103J3340j1775P795l049n12K578
$$ 6755 -6483 4409 -1449 -1033 2681 -3997 5435 -6668 6672 -5103 2692 -357 -869 1709
1820A709m533P339j0311J1710j0618P582m769L027n69l598Q751j2602J3172j0927
$$ 1709 -2824 4515 -5796 5914 -4704 2878 -1891 1136 567 -3031 5720 -6882 6290 -4637
1834d637P778n017K272J437o176J0034j1059R209o472M962m715L588k85l624O154
$$ -4637 3141 -1876 396 1833 -4343 5691 -5368 3841 -2631 2331 -2384 1204 919 -2705 3449
1849C449o587O330p213Q965r348O510j305l667O351p401Q384r865J0397q002L137
$$ 3449 -3138 3192 -4021 4944 -4404 2106 801 -2866 3485 -3916 4468 -5397 5000 -3002 135
1864A35J720m168M447m606O248q709R236o852L459j197M14R07m494R213j2165
$$ 135 1855 -2313 2134 -2472 3776 -4933 4303 -2549 910 -287 127 1034 -3460 5753 -6412
1879f412J1222p351L523j104j069M414q634J1465j0485O213j828m3M1r24L757
$$ -6412 4810 -2541 982 -122 -1191 3223 -5411 6054 -4431 1782 -46 -89 -48 -972 2785
1894B785o525O797m311J889j914L463l936J664K143m863M714l049K795m538N879
$$ 2785 -3740 3057 -1254 635 -1279 2184 -1752 -88 2055 -2808 1906 -1143 1652 -2886 2993
1909B993m216O9K893k390N44o90L672o944P512n458L117k151J922M5m624J0091
$$ 2993 -1223 -1154 1739 -651 -107 -797 2875 -4069 3443 -2015 1102 -1049 873 918 -3706 6385
1925F385j3138J1299o363J943L83k820P413j2511J4274j0512L888J135l149M265
$$ 6385 -6753 4546 -1817 126 509 -2311 5102 -7409 6865 -3647 241 1376 -1773 2492
1939B492o494R180r802P200k298k262L821l084K797m750P119o078J051L807m614
$$ 2492 -4002 5178 -4624 2576 278 -1984 1837 -1247 1550 -3200 3919 -2159 -1108 2699 -1915
1954a915K351j208K649l660J510K941o165O063k994j124L991m796M891o175P777
$$ -1915 436 -772 1877 -1783 -273 2668 -3497 2566 -428 -1552 2439 -2357 2534 -3641 4136
1969D136n923r35Q795j2183J0453p597O160m360m57P526j3218J4451j1328O280
$$ 4136 -1787 -2722 6073 -6110 4343 -3254 2906 -1454 -1911 5615 -7603 6848 -4480 1800
1983A800j343k485N125q227J2157j3730R939k567l232M826n298Q462j2316J2118
$$ 1800 457 -2028 3097 -5130 7027 -6703 3236 669 -2563 2263 -3035 5427 -6889 5229
1997E229o668l91N458q290R702r990R078o815K487M597j1660J4256j1016N593
$$ 5229 -1439 -1830 3628 -4662 5040 -4950 4128 -2687 -200 4397 -7263 6993 -4023 1570
2011A570k349N5N041j2071J5367j1985N041J170n402Q715j0940J1140r563O010
$$ 1570 -779 -724 4317 -7754 7613 -4372 669 1839 -3563 5152 -5788 5352 -4211 1799
2025A799J78p574J2435j1993Q149n739M925j539n651J2209j3243R836o246L491
$$ 1799 1977 -5597 6838 -5155 2994 -2745 2180 641 -5010 7199 -6044 3792 -2454 1037
2039A037K14n314J0023j2646J3007j0440L977L891q879J0617j2170J4134j2670
$$ 1037 1251 -4063 5960 -6686 6321 -4119 -142 3749 -5130 5487 -6683 7451 -5219
2052e219M975N294j2189J4207j4131J3374j0149L593M428j1005J5313j6568J3444
$$ -5219 -244 5050 -7139 7068 -7063 6311 -3838 -245 4183 -6822 8491 -8077 5367
2065E367o964M96L720p641J2688j5870J3430o432j8L754o496R874j2309J1156
$$ 5367 -1597 -1101 2619 -5022 7666 -8204 5226 -1206 -1224 2530 -3966 5908 -6401 4755
2079D755o949K015L113q008J0659r995P468n252K161L711j0160J2771j0158N480
$$ 4755 -2194 -179 2934 -5074 5585 -4410 3058 -2194 -33 3678 -6482 6289 -3869 1611
2093A611j804j752O902j1761J3110j0677O262l92o427J1856j3625J2363j0291
$$ 1611 -193 -1945 4957 -6804 6306 -4371 1891 1499 -4928 6928 -6697 5666 -4625
2106d625P202j098p400J3735j4994J3245j1063P839k080n205J1129j4063J4733
$$ -4625 2577 1479 -5921 7814 -7180 6065 -4998 2841 761 -4444 6685 -7378 7355
2119G355j3104Q653k572l018P255j1116J4232j4178R650l096k001N366q529J1275
$$ 7355 -5749 2904 332 -2686 4569 -6547 7685 -6493 3157 61 -1940 3426 -5103 6172
2133F172j1209P558k652j782N586q251Q329n661K511k81k477O221q273O398k004
$$ 6172 -5037 2521 -131 -1913 3673 -4578 3751 -1910 601 320 -2157 4064 -4209 2189 185
2148A85j620L724n769P870q181N613j577k392O195r681J1067r502O554l429l21
$$ 185 -1435 2289 -3480 4390 -3791 1822 245 -2147 4048 -5633 5434 -4068 2486 -943 -1264
2163a264N849j1443J3667j2094R075n858J586M089r679J2891j3430J1942q360
$$ -1264 4585 -6858 6809 -5285 3790 -2068 -482 3607 -6072 6819 -6611 5331 -3029
2176c029K971K674o589R022j1052J1660r148M012P76l482N161o753P768o734L847
$$ -3029 -58 2616 -3973 5049 -6003 5657 -3491 521 1297 -2185 2976 -3777 3991 -2743 1104
2191A104r24j208K857l616K977j679P50l10p02K223k488J02K744l646L578l598
$$ 1104 180 -1028 1829 -1787 1190 -489 261 -49 -751 1472 -1016 -914 1830 -1816 1762 -1836
2207a836L546k464m72L896o349P940q129O398l438K56K603n611Q986j0853R647
$$ -1836 1710 -754 -1226 2670 -3679 4261 -3868 2530 -908 -652 1951 -3660 5326 -5527 4120
2222D120o420L150j66l097O763r697J0472r212O722l542n5L305n621P451q803
$$ 4120 -2300 850 684 -2413 4350 -5347 5125 -4087 2635 -907 -962 2343 -3278 4173 -4630
2237d630Q561o040K386L26j835L289m978O029n405L497j684Q26m20MJ89o23J383
$$ -4630 3931 -2109 277 603 -1232 2057 -2921 3108 -2297 1200 -484 342 -78 -74 115 -508 875
2254H75k004K079k149L155m353M382k642M10J049k077L528n268O183o015M727
$$ 875 -1129 950 -1199 1956 -2397 1985 -657 -247 802 -1275 2253 -3015 3168 -2847 1880
2269A880k678M73J487k985M485o283P519p158N203k673M53J694m305O940q313
$$ 1880 -798 -325 1162 -1823 2662 -3621 3898 -3260 1943 -730 -277 1417 -2888 4052 -4261
2284d261Q020o359L854j160j391L781n638O660o810N691l675J718l60o32J887
$$ -4261 3759 -2600 1254 94 -1297 2484 -3154 3506 -3304 2387 -1288 430 70 -562 1325
2299A325l416M337m526M199l782L646k992J516M80k526M031m938N239m920M397
$$ 1325 -2091 2246 -2280 1919 -1863 1783 -1209 307 787 -1739 2292 -2646 2593 -2327 2070
2314B070l307J472O93k631L639l993M362m780M852m128K447m00j506L133m471
$$ 2070 -1237 235 928 -1703 1936 -2057 2305 -2475 2377 -1751 696 296 -1210 1923 -2548
2329b548N641o412O118m535J864O62k247L650m796N487n636M582k749J170Q1j142
$$ -2548 3093 -3319 2799 -1736 128 790 -1457 2193 -2603 2884 -2752 1830 -919 251 332 -810
2345h10K018l331M759n334M914l750K403j125l84K466m604N724n443M267k932
$$ -810 1208 -2123 2636 -2698 2216 -1534 869 -256 -640 1826 -2778 2946 -2497 1770 -1162
2360a162J720p05o69K596l771L906l275K657k804L132k707J134Q57k435L375m106
$$ -1162 558 -147 -816 1780 -1991 1915 -1360 1297 -1507 1625 -1082 52 909 -1526 1849 -2257
2376b257N011n519M910k891L4K463l852M343m436M634m750L552j142r93J807j656
$$ -2257 2754 -2765 2145 -746 -712 1751 -2101 2242 -2194 2440 -2310 1242 100 -893 914 -742
2392g42K151l690M963m913L668k010M64O96k135L798n377O099m768K134J89j130
$$ -742 1409 -2281 2682 -2231 1437 -573 -109 587 -1548 2250 -3127 2972 -1796 338 527 -603
2408f03J681k621L800m166K739q56m4l00P68o18j35J111j713J858j757K088l219
$$ -603 1078 -1543 2257 -1909 830 -26 -70 -370 398 -220 -355 756 -957 901 -856 1232 -1987
2425a987L701k159n60K269k155J840k809M287m519K905q68l46J090j900L014m293
$$ -1987 1714 -445 -1005 1264 -891 949 -1860 2427 -2092 813 -55 -401 689 -1211 1803 -2490
2441b490N664n834L895p15j684K420l510N946p973O789k764p04K347l346M797
$$ -2490 3174 -2660 1235 520 -1164 1256 -2254 3692 -4281 2508 -256 -960 1387 -1959 2838
2456B838n834N291l593J311J196l398M170k814J372j708K262o89k319L244j150
$$ 2838 -2996 2295 -1298 13 1209 -2189 1981 -833 539 -1169 1093 404 -1915 1329 179
2471A79q41N93M90p7j446J932j038J57R36k766M112l328J474j103J610J05m679
$$ 179 -662 -69 421 344 -1102 830 -208 -51 885 -1881 2231 -1097 377 -726 884 989 -3690
2488c690P747o622L700k124J655P79n165Q235q367O891m894J467K961n869O372
$$ -3690 4057 -2565 1135 -989 666 1445 -3720 4515 -3852 3039 -1855 -388 2573 -3296 3076
2503C076o668P954p332K291L650n695M695m991O943o661K647J890l846M535n666
$$ 3076 -3592 4362 -2970 -679 2971 -2724 1971 -3020 3923 -2738 -91 1799 -2047 2488 -3178
2518c178N897l803J014M22j641M676p657O413j665j305J322k226N731q303O065
$$ -3178 2719 -1084 -70 352 -1289 3387 -4270 2143 478 -827 495 -1731 4000 -4303 1762
2533A762j155k038L420n510P905p291L843p95j219M546r048J0271o557K101m94
$$ 1762 607 -1431 1989 -3521 4384 -2907 936 141 -1078 3468 -5580 4691 -1866 235 -259
2548b59m70M700j0006J0711o714K893j049j715O175r044Q593o719N399k814k852
$$ -259 -729 3971 -6035 4676 -2038 855 -194 -1909 4266 -4778 3815 -2904 2495 -319 -3171
2563c171Q079q683O634o351O703l446l492Q606q665P034o902N993j370m421P365
$$ -3171 4908 -3775 2859 -3492 3211 -235 -3727 4879 -3786 3248 -3654 2339 969 -3452 3913
2578C913p897Q426q206M425J723n509N988o809R082q624K980L586o116O026p209
$$ 3913 -3984 4442 -3764 661 2384 -3125 2863 -3946 5136 -3488 -508 3078 -3038 2988 -4221
2593d221Q701o769J460L171m965O718r069Q485m024n49K343l758P456j0473Q350
$$ -4221 4480 -2289 -829 2342 -2623 4095 -4974 3511 -513 -1062 1281 -2477 4979 -5494 2856
2608B856k644j429K772m989Q936j0503P368k701m79L325p465J0563r337N544k959
$$ 2856 212 -1217 1555 -3434 5502 -5001 2367 -334 -813 2512 -4953 5610 -3727 1817 -1142
2623a142Q63L685r461J1524q575M877l099Q84M342r458J0362q095N977m125p0
$$ -1142 -279 3406 -6055 5469 -3106 1771 -1328 -444 3898 -5560 4802 -3293 2684 -1441 -1511
2638a511N632q539P972o992O828m605j215O497p404O110o094O307l319k115N694
$$ -1511 4121 -4418 3554 -3438 3390 -1215 -2430 4067 -3337 2773 -3321 2986 -333 -2448 3246
2653C246o019N742o134M697m27l667N048n171O284o511K988K299n198N201n441
$$ 3246 -2773 2969 -3165 1532 1105 -2562 2486 -2685 3599 -2912 76 2375 -2823 2378 -3063
2668c063O882o086J500L437n508O183p537P820n030M56K725m529O896r202Q645
$$ -3063 3819 -2267 -767 2670 -2838 3345 -4192 3628 -1402 -946 1779 -2750 4146 -5056 3589
2683C589m554M52J565l511P002r571Q380m520J476L12l023O419p833O406m402
$$ 3589 -965 -513 1052 -2459 4543 -5028 3352 -1168 308 620 -2403 4016 -3817 2589 -1813
2698a813K927o90l079N950n641L782k942K476k60l102M750l628K059j547P05J416
$$ -1813 1114 424 -2655 3295 -2346 1436 -1506 970 710 -2392 2358 -1270 789 -758 -53 1363
2714A363l349L504k447J570o60j488L956m584L340k098J683l19k788N384n696
$$ 1363 -1986 1518 -929 641 -19 -1507 2449 -2135 1205 -893 790 471 -2317 3067 -2629
2729b629M510l347K265j10l014N241n784N728n366L512k91k471L789m669N861
$$ -2629 1881 -1466 799 689 -2325 2916 -2868 2860 -2506 1006 715 -1756 2033 -2636 3225
2744C225o061M205j216r99K135l126M324m710L547j829N79M02j649K347k112J643
$$ 3225 -2836 1369 153 -846 1289 -1837 2487 -2223 1324 -505 74 476 -1173 1174 -938 705
2760G05j476J386n84n99Q99j41m44K38J68K0m36J57Q95j743K049k121K034j536
$$ 705 -771 615 31 -568 331 190 -254 -16 152 172 -264 -107 788 -955 1094 -1027 1007 -529
2778e29K89R90j965L011l893M002k967J334J19j285K540l887M342l783K763j424
$$ -529 -240 750 -1215 1796 -2097 1905 -1062 272 391 -894 1646 -2241 2101 -1682 1081 -343
2794c43K10R53k088K836l402L404k879J997q15j48P93j693K576l080K807j932
$$ -343 -133 820 -1268 1568 -1834 1570 -1309 688 -127 -275 518 -1175 1401 -1679 1128 -804
2810h04J305o69j14Q94j526J725j560J388j310J287j183J125p16q7P62j250J821
$$ -804 501 -168 -282 612 -914 811 -749 639 -671 616 -567 558 -158 -245 517 -733 1088
2827A088k453K964k803J848o67m38J380k164K708l013K698j888R17j71m67J152
$$ 1088 -1365 1599 -1204 644 -23 -461 919 -1245 1463 -1550 1148 -740 177 6 -461 691
2843F91j710K213k379K270k084J594q92J30Q47j860K600k881K768k314J475m29
$$ 691 -1019 1194 -1185 1085 -999 595 -297 -167 680 -1180 1420 -1461 1307 -1007 468 39
2859C9o54J619k081K172k078J606j203J047m98q8M06q70J396j776K062k199K046
$$ 39 -615 1004 -1077 1095 -983 623 -580 467 -31 -119 287 -583 813 -963 1099 -1100 946
2876I46j354M83K22j024J790k234K429k241J553q89M43n2n32J276j947K216k183
$$ 946 -408 75 297 -727 1063 -1171 1258 -983 570 -319 124 72 -460 816 -1131 1085 -1098
2893a098K056j801J216k07r42K092k801L035k947K318j437M58Q79k044K747k738
$$ -1098 958 -843 373 166 -776 1316 -1485 1550 -1397 921 -516 -58 821 -1223 1524 -1214
2909a214K211j769J274n96j71P97j108J178j271J472j531J329q50K23M32p83Q52
$$ -1214 997 -772 502 -94 -265 532 -576 602 -669 803 -728 601 -249 -26 406 -377 475
2926D75j050J255j343J001l61Mk40N08k50k85O27q00J297j935K363k241J503m83
$$ 475 -575 680 -663 338 -23 -19 -259 249 -1 -286 341 -459 838 -1097 1266 -975 528 45
2944D5p57K225l212L256k895K577j829J30J856l093L278l142L078k576J295K84
$$ 45 -712 1513 -1699 1557 -1338 1239 -590 -460 1396 -1697 1581 -1561 1517 -1059 236 520
2960E20j521K313k922L128k692J851r89K19R23k263K678j953J319j174P24M31
$$ 520 -1001 1312 -1610 1518 -1174 677 -312 -93 830 -1433 1245 -708 611 -563 161 592
2976E92j694J822j138O33k45l81J197j248N42r7l32J265k350K760j556j37P61
$$ 592 -1102 720 -418 215 -30 -411 786 -462 80 -17 -349 916 -1434 1326 -230 -367 394
2993C94j111K232l566L568k114N01N71j444K995m162L863k921K136r01j247L202
$$ 394 -717 1515 -2051 1517 -597 -96 475 -969 2026 -2136 1727 -1194 942 41 -1206 1996
3009A996l859L380l348L676k361m83K800l413L323l749L829k255k09J865k512
$$ 1996 -1863 1517 -1831 1845 -516 -999 1801 -1612 1711 -2038 1791 -464 -673 1192 -1320
3024a320L133l764K996q19p43R84j453K853l384J568Q02j425J026j572K773k456
$$ -1320 1813 -1951 1045 226 -517 467 -986 1867 -1517 51 853 -572 454 -1118 1655 -801
3040h01L67J275j624K039l075L221j434o32J223j428K995m719L888j126o08Q01
$$ -801 -434 841 -783 1256 -1819 1402 -32 -664 559 -869 2126 -2593 1295 169 -439 362
3056C62j666M074n505M084j708O19K47k337M625m994L425k456K227k09l085M776
$$ 362 -1304 2770 -2735 1349 -359 260 507 -1830 2795 -2199 1226 -1230 997 788 -2297 2479
3072B479l916K560k729K793j89l428M291k931K462k974J907R64k951K727k240
$$ 2479 -1437 1123 -1606 1187 998 -2430 1861 -1070 1392 -1582 325 1289 -1662 1065 -1175
3087a175L008k970L16K462k664J591k217L653k514q22L033k713K106l029L504
$$ -1175 1833 -1137 -821 1641 -1023 568 -1649 2004 -510 -1332 1701 -1012 1094 -1935 1569
3102A569j448j438K511k237L079m372L225lj770J391j994M334n271K827N01j498
$$ 1569 121 -1317 1194 -1043 2036 -2336 889 886 -884 507 -1487 2847 -2424 403 904 -594
3118e94J131k522M848m628J908%l03J385l873M962l164J095q63P13J693m690M660
$$ -594 537 -1985 2863 -1765 143 143 -160 1225 -2648 2314 -850 245 -618 95 1788 -2902 1758
3135A758k204Q69j365O21K496m481L487j871J707j610n72L292l601K351k165K794
$$ 1758 -446 423 -942 -321 2175 -2306 1181 -690 1017 -593 -1165 2127 -1474 877 -1288 1506
3151A506j557j676L565k757J688k400K947p33k315L132k305K265k999J967Q13
$$ 1506 -51 -1727 1838 -919 769 -1631 1316 583 -1732 1400 -905 1360 -1639 328 1141
3166A141k468K165j902K939l131P49J856k234J500k102L358k642p8J877j614J611
$$ 1141 -1327 838 -1064 1875 -1256 -507 1349 -885 615 -1487 1871 -771 -849 1028 -586 1025
3182A025k786L335j800k48Q23r73K468l958L296j097l80K87r63L100m211K912
$$ 1025 -1761 1574 -226 -474 349 -624 1844 -2114 1182 85 -295 -8 -971 2129 -2082 830
3198H30q68K96p5j454L230l386K281j485J185j43j995L094k317J372j475J439
$$ 830 -38 258 183 -1271 1959 -1427 854 -631 554 411 -1584 1510 -807 565 -910 529
3214E29M1j993K404j400J015j387J014N12j751J674j055J067r61k99J464j508
$$ 529 570 -1423 981 -419 596 -791 223 735 -1016 658 -397 670 -291 -590 874 -634
3230f34R90j049J389n93j179K324j920J208j293J247q1j467K098k065K094j985
$$ -634 356 -693 696 103 -1076 1248 -672 536 -757 490 409 -1058 1040 -1025 1069 -916
3246i16J165K24j123J301j721K484k538J378J25p53P99j398K378k435J520o05
$$ -916 249 473 -650 651 -1070 1414 -1124 254 379 -374 425 -973 1405 -1030 490 -115
3262a15K7N13j284J655j470J219j042O58K25j056J013m23K00l53M57L7o34M60
$$ -115 -88 425 -859 796 -674 545 -497 161 386 -670 343 -80 120 -233 224 261 -373 87
3280H7J34m83N22m53K81j56p1L77m24Q49j445J222l93q8O3j86P10j508J919j515
$$ 87 221 -262 260 -193 88 -68 -139 238 -186 663 -782 440 47 -41 22 -164 546 -962 957 -558
3300e58R27m03j06M87j032J610k029J933j298L92M88q88J012j352J722j485P91
$$ -558 369 -34 -140 347 -685 925 -1104 829 -469 -77 411 -477 535 -817 905 -580 211
3317B11p3l40L07l17N16q19J026p89M98l61K34l76K76L59q80R24o90N05n87O76
$$ 211 138 -202 105 -212 304 -515 511 -278 220 -141 93 -283 -7 352 -528 396 -294 211 -376 300
3337C00m59k8M51m74M60o03Q08j114J248q57K22L40m81N22r52J511j562J172o31
$$ 300 -159 -187 264 -210 250 -353 455 -659 589 -268 -46 294 -187 335 -617 894 -668 504 -127
3356a27j45N29o60R84j313J419j125O84j45j94J40k23P50j171J172r40O54m65
$$ -127 -272 257 -403 581 -732 687 -438 246 101 -93 47 -176 574 -597 575 -365 289 -176
3374a76K74Ln09J180j424J093o09K53j75J04K25o13P74o28K77j62M60p55P08l06
$$ -176 98 101 -408 772 -652 441 -168 85 -90 14 239 -374 400 -228 49 -113 347 -408 300 -6
3394fj11L89n21P13r99J236j303Q79n3n22O61p82J076j508J545j030L34J0j41
$$ -6 -117 272 -249 464 -535 701 -602 277 224 -298 363 -419 657 -851 694 -336 -2 8 -133
3413a33M49q19J272j601J477j025M79J13m87Q23j437J848j642Q56o4k24L63p42
$$ -133 316 -503 769 -832 645 -380 99 212 -275 548 -889 959 -683 173 109 -115 248 -494
3431d94J177j294R72n17J73J19m53M32j32Q6k78L25n1j38j98O34o08L05k01M63
$$ -494 683 -611 361 -156 17 136 -317 115 -17 69 -209 116 65 -73 -271 363 -245 60 -141 322
3451C22m43j35Q40j029J045j273J234p21Q7M60r58J603k519K597j585O21j10o81
$$ 322 -121 -256 584 -445 600 -673 561 -160 -73 387 -571 1032 -1487 1110 -475 146 36 -645
3469f45J916k742K680j952J269o22n47J850k305J895j802J933j181k97J398j464
$$ -645 1271 -1471 1209 -743 526 -96 -643 1207 -1098 797 -1005 928 -253 -550 848 -616
3485f16J263j569J758r28l72R93r87J001j221R76J32q97P21p64J260j356K72J192
$$ -616 647 -922 836 -92 -464 529 -458 543 -678 298 430 -467 254 -510 750 -606 -334 858
3503H58j644J335j311J603r53o25J846k115K134k547K337p18j020J804k045K827
$$ 858 -786 549 -762 841 -112 -737 1109 -1006 1128 -1419 918 200 -820 984 -1061 1766
3519A766l640K857p71q50J267j974L389l988K764r41J16O55k227L550l411K097
$$ 1766 -1874 983 212 -638 629 -1345 2044 -1944 820 -121 -5 650 -1577 1973 -1438 659
3535F59j003O06L37k327L588k779J462j178R02O67k587K898j866J085r40P6J854
$$ 659 -344 262 599 -1728 1860 -919 543 -635 267 934 -1653 1245 -621 464 -476 -400 1454
3552A454k910K165j195J109o70j094L084l268K070j544J590m45k132L781l265
$$ 1454 -1456 709 -486 623 -47 -1141 1943 -1325 745 -799 791 346 -1786 1995 -1270
3567a270K429k533J915M40k803L481l101L275l425J862J045k954K867k835L767
$$ -1270 1159 -1374 541 981 -1822 1659 -1442 1833 -1592 270 1315 -1639 1228 -1607 2160
3582B160l680J502J071k170K247k970L911l087P74Q52j238J943l532L982k135
$$ 2160 -1520 -18 1053 -1117 1130 -1840 2071 -1016 -242 610 -628 1315 -2217 1765 -370
3597c70j13P63r03K283l773L393j177n07P47j439L081l840K529n01l29Q54k556
$$ -370 -483 280 -623 1660 -2113 1280 103 -404 343 -1096 1985 -1855 674 173 -156 698 -1858
3614a858M169l621J412j40P4J118l418M481l193J221m73M4J671l785M000k655
$$ -1858 2311 -1310 102 -38 36 1154 -2264 2217 -976 245 -228 -184 1487 -2298 1702 -953
3630i53J818j337j88K511l853L176k240K384j915l82K901l442K582k329K552j431
$$ -953 865 -472 -660 1851 -2002 1174 -1066 1318 -597 -979 1922 -1520 1062 -1267 1285 -146
3646a46j034K838k920K610k799K336k97j977K543k180K495k939J866O22k265K094
$$ -146 -1180 1658 -1262 1348 -1451 885 588 -1389 1154 -1026 1469 -1470 396 1018 -1247 847
3662H47j817K551k824J096R72j763J855k325K893k194K54J044j208J727k856L231
$$ 847 -970 1581 -1243 -147 825 -938 917 -1408 1485 -709 -455 589 -619 1108 -1748 1483
3678A483j757k94J049j107K081l301L039j295j53O68j470K792l179K115p09N5
$$ 1483 -274 -568 481 -626 1455 -1846 1193 -102 -255 413 -1057 1735 -1444 671 -38 17
3694A7M73j873L072k852J397k24R6M03j917K972k437J284o44J94Q38k141K398
$$ 17 490 -1383 1689 -1163 234 10 106 509 -1408 1564 -873 411 -233 -39 799 -1342 1056
3711A056j678J191j157M51J132k066J819j231J105j096J45J325k012J700j359
$$ 1056 -622 569 -588 -137 995 -1071 748 -483 622 -474 -329 996 -1016 684 -675
3726f75J220o30n24J288j375J401j536J272j29j136J482j144J193j371R42J05
$$ -675 545 -85 -609 679 -696 705 -831 441 312 -824 658 -486 707 -664 278 383
3742C83j174J409j211J089j002M96L25q13J046j356J512j070J60N79o55P79j410
$$ 383 -791 618 -593 496 -506 -10 315 -498 548 -808 704 -366 -206 373 -282 497 -913
3759i13J881j355K66M21o84Q72j286J624j230M88P8o95J253j288R17m80K95l11
$$ -913 968 -387 -121 300 -384 488 -798 826 -404 84 162 -533 720 -568 349 -131 164 -147
3777a47j47R35j165O47j12L4j29j35N69o11L56j35m1M18n53L39j75Kj58R4N35
$$ -147 -294 641 -524 123 11 45 -84 -219 350 -261 95 -40 -81 337 -216 123 -52 -50 -208 -114 421
3798D21j042R16l10l4J65k26M34q65J013o19J84J45n03N53m80O30p65O78k57k42
$$ 421 -621 295 -15 -49 116 -110 324 -541 472 -147 37 182 -321 232 -248 382 -383 295 38 -204
3818b04O24n93L53n18P45o59J61J55k85K45k05M31m87L98k62j01L81k24k7M8K28
$$ -204 420 -173 180 -338 407 -252 -91 64 -221 24 -181 250 -237 161 -101 -202 179 -45 -72 -24 204
3839B04l32J58j3r7j57M91m17J79J65l03K57k42K87m17M54k20p4K95l53K89l55
$$ 204 -128 30 17 -80 -237 254 -163 16 181 -122 135 -107 180 -237 217 -3 -77 218 -135 154 -201
3860b01N13o17M36J24m58L59k30L08n42O88o09J71L44n69M08l69N30p14O75k77
$$ -201 312 -305 131 255 -203 156 -74 234 -308 380 -229 -58 286 -283 125 -244 286 -428 247 -30
3880c0j17L56k51J16j85L51m46L10q4r0P1J17j39r4L63m78K79q6K91l61J65J7
$$ -30 -147 209 -42 74 -111 240 -206 104 20 -70 1 118 -21 -115 248 -230 49 -37 254 -107 58 75
3902G5l11L91k80K55l02M44n62L66J35l34J99k38N02p73Q15n42Q8K17m42N03m17
$$ 75 -236 155 -125 130 -172 272 -290 76 211 -123 76 -162 340 -433 382 -160 -72 145 -297 206 -211
3923b11N81o98O68j98m13O73o11M19n72P16n42J45K10k80K44l35M21m60M14k11
$$ -211 370 -328 340 142 -271 402 -209 210 -362 354 -188 -43 167 -113 131 -204 217 -243 171 -40
3943d0p6L22l44J67o9J07k76K04Q0k22J3K88k87K96k80K8J69k47L87n21O72o67
$$ -40 -116 206 -138 29 -40 67 -209 -5 75 -147 -134 154 -133 163 -117 -89 80 -167 220 -301 371 -296
3965b96L60J03m13M72n62Q77j049P40k35q7M20p69J067j169J012o89L68J20p38
$$ -296 64 167 -246 226 -336 541 -508 232 -3 -90 330 -439 628 -541 471 -218 150 270 -468
3984d68J012q94P50r30Q67k27n62R06p58O75q06P61k26l07M42m68O26o93L19J05
$$ -468 544 -350 400 -530 337 110 -452 454 -304 371 -435 326 100 -207 235 -233 393 -300 19 124
4004A24p6Q6l12N58n66m6N81n16L43m42M73j87m09Q98q81P57q81O80P5o00P74
$$ 124 48 134 -178 380 -186 -232 349 -167 176 -266 207 20 -389 509 -372 385 -496 184 259 -341 433
4025D33j001J334j428Q75P4n77N42q73J598j626Q28k23P4L66j194J546j249Q54
$$ 433 -568 766 -662 213 287 -290 252 -621 977 -649 179 -44 30 396 -798 748 -501 353
4043C53p46O15K33j230J464r85O96q63O12L78j201R56n17O13p02N7Q26r27N75
$$ 353 -393 222 455 -775 689 -296 400 -463 149 527 -674 282 -235 378 -324 -267 559 -368 207
4062B07m06O93n92n24J281r78M79n28P09r3j068J387r72Q83j036O15N39j233J096
$$ 207 -199 494 -98 -622 659 -319 160 -368 341 248 -820 567 -405 478 -558 57 596 -637 459
4081D59j046J516j605O75O16j110Q15j089J898j918P09M17n24O82j607K180j607
$$ 459 -587 929 -676 -1 615 -495 320 -769 1129 -789 -80 337 -187 495 -1112 1068 -539
4098e39N18L4j07Q27j944J953q94O7j28J36R32j905J445l46P2k48k32J226j487
$$ -539 -21 13 -94 733 -1211 742 -152 -85 -213 -77 855 -1050 395 49 121 -127 -359 867 -620
4117f20O61k76N07k27q03J578j060K63m41P73N3j441J834j170O99p69M99O69j815
$$ -620 41 -235 272 45 -758 820 -240 23 -418 355 408 -1033 801 -369 330 -439 60 729 -1086
4136a086J776j198J227j268K01J366j810J286j213J762j410j80J400j437J117
$$ -1086 690 -508 719 -549 -348 1018 -792 494 -719 1043 -367 -547 853 -584 533
4151E33j321J630r65k66Q34p61J123j805J640n88l44M73n71J312j966J307K3l59
$$ 533 -788 842 -123 -389 445 -316 807 -998 642 54 -290 183 -388 924 -1042 265 288 -71
4169g1J12n09J389j690Q81Ok58M58j187J790j134J32J74j80O61j685J883q73J2
$$ -71 41 -468 921 -769 112 118 -140 318 -869 921 -213 -81 93 -87 574 -1111 772 -101 -89
4188h9J28j95Q46j706J579q08L96k52l82J360j616J099o22P14m79o12J462j325
$$ -89 39 -156 690 -1016 563 -245 151 -101 -483 877 -739 360 -262 452 -27 -639 823 -502
4206e02Q99q75R15m36o75J332j202R75j011Q34J16q83R39p64J006j303O33N67
$$ -502 397 -478 437 1 -674 658 -544 431 -580 254 370 -513 426 -338 668 -635 -2 565
4224E65j017Q03p88J109r83K53M91o66O14q69Q99n17j24N00n20O98j186J145l36
$$ 565 -452 351 -437 672 -311 -58 433 -233 381 -488 411 -106 -230 270 -250 448 -738 407 71
4243G1j87L59m57P04j082J016l55k69N05q39J081j076O80j92k4M30r32J213q82
$$ 71 -116 243 -214 490 -592 424 69 -200 305 -534 547 -529 151 -41 -65 365 -567 646 -236
4262b36J77Q0K1J86q16J108p87L33j15Q5L26p34O42m62L82l28j7N13p08N37m42
$$ -236 -59 21 42 228 -588 520 -267 66 -49 36 362 -372 270 -192 190 -138 -155 358 -350 187 -255
4283b55O05n32j1O57q82O61l90L56j77l5K32m36L71l19J39J68k80K34j50K57m05
$$ -255 350 -182 -193 464 -418 243 -147 209 32 -3 229 -207 164 -155 -16 152 -128 106 -44 213 -192
4304a92K26J25m59L93k75L01j46P8J51l62L57m14M22k62K0K30k86J88l19M61k55
$$ -192 34 159 -300 93 -182 119 -27 51 202 -160 197 -217 205 -57 -37 193 -93 95 -224 237 -18
4325a8q0L55m86M57l87M60m17J30K39m14M80m62K34j85J76l0k15N01m81Q9J34
$$ -18 -98 257 -229 228 -159 301 -116 14 253 -161 319 -143 91 -94 82 52 -163 338 -143 -54 80
4346H0j08NR2Lk01J60M4j19J5J23o5N3J8j43j09K97j35n8R8j42J85k21L15k51
$$ 80 -28 -23 69 72 -129 31 75 -44 -29 94 29 82 100 -43 -152 145 10 -48 50 -92 93 -128 187 -64
4370f4J36n6oN5j47J48k72L80k73J06L60n01L52l11K11k83J35k8J9J34k56K43
$$ -64 72 16 10 65 -82 66 -206 174 -99 7 367 -134 218 -93 118 -165 -30 -58 -39 95 -161 82
4392H2j50J94k05R5k1MP4q0M8m8Kl7J29m3J7o4P2j10o7J27M5r9q3L14l09J79j0
$$ 82 -68 126 -79 16 -5 -1 73 -7 41 -7 -5 -42 87 44 61 -3 69 -41 -108 19 64 -35 -118 196 -113 66 56
4419E6j71K48j70J92l72L77l00J53J72l60K79k05M14n79L49p3p5L25m32M70n84
$$ 56 -115 133 -37 155 -217 160 -140 13 185 -175 104 -101 313 -266 83 10 -65 260 -172 298 -286
4440b86N05n01K16K97n22N21n74N18k76K40r8k12N36m60J63j71J26mj88K85k92
$$ -286 219 -282 -66 231 -291 230 -344 174 -102 138 40 -172 364 -96 67 -104 22 18 -170 115 -177
4461a77L96k55M7J63k95R4p5J26m3k41O24o32L32r5J07K5m41Q22p83O26n90L17
$$ -177 219 -36 11 174 -121 -27 -102 24 -19 -260 364 -268 64 -31 76 101 -340 482 -301 325 -265 52
4483E2K02n96O05o25Q70q31L97J58o02P50q41R49r11N61J04m76O59r72J136r75
$$ 52 254 -342 263 -362 508 -323 74 232 -370 380 -461 488 -423 138 242 -234 425 -547 589 -386
4503c86N59j64j09N64r93J099q67L26j9j74N93r38Q33l83M6J69l56O43q68N99
$$ -386 173 9 -100 464 -529 570 -297 29 10 -164 429 -509 324 -59 -13 156 -200 443 -425 174
$$ [...]
8191E1
##END NTUPLES=NMR FID
##END=
